##TITLE=AC1768_ROS_9_9683739_JfU564xkGN
##JCAMPDX= 6.0         $$ Bruker NMR JCAMP-DX V2.0
##DATA TYPE= NMR SPECTRUM
##DATA CLASS= NTUPLES
##ORIGIN= BRUKER
##OWNER= Administrator
$$ 1.72 TOPSPIN		Version 2.1
$$ 2016-04-16 18:41:02.095 -0700  Administrator@X
$$ Compression mode = diff/dup
##.OBSERVE FREQUENCY= 400.02188249412
##.OBSERVE NUCLEUS= ^1H
##.ACQUISITION MODE= SIMULTANEOUS (DQD)
##.ACQUISITION SCHEME= undefined
##.AVERAGES= 8
##.DIGITISER RES= 22
##SPECTROMETER/DATA SYSTEM= spect
##.PULSE SEQUENCE= zg30
##.SOLVENT NAME= COFFEE_meoh
##.SHIFT REFERENCE= INTERNAL, COFFEE_meoh, 1, 14.98509
##AUDIT TRAIL= $$ (NUMBER, WHEN, WHO, WHERE, PROCESS, VERSION, WHAT)
$$ ##TITLE= Audit trail, TOPSPIN		Version 2.1
$$ ##JCAMPDX= 5.01
$$ ##ORIGIN= Bruker BioSpin GmbH
$$ ##OWNER= Administrator
$$ $$ E:\/data/COFFEE/nmr/AC1768_ROS_9_9683739_JfU564xkGN/10/pdata/1/auditp.txt
$$ ##AUDIT TRAIL=  $$ (NUMBER, WHEN, WHO, WHERE, PROCESS, VERSION, WHAT)
(   1,<2016-04-16 18:40:54.954 -0700>,<Administrator>,<X>,<go>,<TOPSPIN 2.1>,
      <created by zg
	started at 2016-04-16 18:39:48.689 -0700,
	POWCHK enabled, PULCHK disabled,
       configuration hash MD5:
       21 0F 79 D6 B3 7B B4 F6 88 20 88 DB 03 48 BD 9F
       data hash MD5: 64K
       AA 12 8F CE 7F 1F BA 7B FE 68 FF E8 80 95 87 3E>)
(   2,<2016-04-16 18:40:58.048 -0700>,<Administrator>,<X>,<proc1d>,<TOPSPIN 2.1>,
      <Start of raw data processing
       efp LB = 0 FT_mod = 6 PKNL = 1 PHC0 = 0 PHC1 = 0 SI = 32K 
       data hash MD5: 32K
       B5 A1 12 F7 E2 CC 0C 8B F5 11 B7 3C 49 80 5D EF>)
(   3,<2016-04-16 18:40:58.314 -0700>,<Administrator>,<X>,<proc1d>,<TOPSPIN 2.1>,
      <pk PHC0 = 86.04492 PHC1 = 0 
       data hash MD5: 32K
       73 9B 48 90 D7 83 5D 9C 96 01 1E 99 18 0F EB 84>)
(   4,<2016-04-16 18:40:58.439 -0700>,<Administrator>,<X>,<proc1d>,<TOPSPIN 2.1>,
      <abs ABSG = 1 
       data hash MD5: 32K
       76 04 D5 E8 C3 4F B3 B9 0B 8C 7D 4F E3 2F 63 74>)
(   5,<2016-04-16 18:40:58.486 -0700>,<Administrator>,<X>,<proc1d>,<TOPSPIN 2.1>,
      <abs ABSG = 2 
       data hash MD5: 32K
       CD 46 7C 97 FC FB 06 E4 1B 0F DF E0 3D 98 5C 3F>)
(   6,<2016-04-16 18:40:58.548 -0700>,<Administrator>,<X>,<proc1d>,<TOPSPIN 2.1>,
      <abs ABSG = 3 
       data hash MD5: 32K
       2D 2C D6 5D 2E 85 1D D2 74 74 39 1C FC 94 37 E8>)
(   7,<2016-04-16 18:40:58.611 -0700>,<Administrator>,<X>,<proc1d>,<TOPSPIN 2.1>,
      <abs ABSG = 4 
       data hash MD5: 32K
       6B BB 96 FC D8 9B 36 59 C1 AF 82 96 05 C9 6C DF>)
(   8,<2016-04-16 18:40:58.673 -0700>,<Administrator>,<X>,<proc1d>,<TOPSPIN 2.1>,
      <abs ABSG = 5 
       data hash MD5: 32K
       BF BF AB A2 FD CF AF 73 15 09 11 D7 0E 62 4E 95>)
$$ ##END=
$$ 
$$ $$ hash MD5
$$ $$ 36 84 2A E3 E9 73 81 32 FD 36 F6 E1 78 DD 48 7B
##$RELAX= 
##$RELAX= 
##$RELAX= 
##$RELAX= 
##$RELAX= 
##$RELAX= 
##$RELAX= 
$$ Bruker specific parameters
$$ --------------------------
##$DU= <E:\>
##$EXPNO= 10
##$NAME= <AC1768_ROS_9_9683739_JfU564xkGN>
##$PROCNO= 1
$$ [...]
150 150 150 150 150 150 150 150
##$TP07= 0
##$TPNAME0= <>
##$TPNAME1= <>
##$TPNAME2= <>
##$TPNAME3= <>
##$TPNAME4= <>
##$TPNAME5= <>
##$TPNAME6= <>
##$TPNAME7= <>
##$TPOAL= (0..7)
0.5 0.5 0.5 0.5 0.5 0.5 0.5 0.5
##$TPOFFS= (0..7)
0 0 0 0 0 0 0 0
##$TUNHIN= 0
##$TUNHOUT= 0
##$TUNXOUT= 0
##$USERA1= <user>
##$USERA2= <user>
##$USERA3= <user>
##$USERA4= <user>
##$USERA5= <user>
##$V9= 5
##$VALIST= <valist>
##$VCLIST= <CCCCCCCCCCCCCCC>
##$VD= 0
##$VDLIST= <DDDDDDDDDDDDDDD>
##$VPLIST= <PPPPPPPPPPPPPPP>
##$VTLIST= <TTTTTTTTTTTTTTT>
##$WBST= 2048
##$WBSW= 25
##$XGAIN= (0..3)
0 0 0 0
##$XL= 0
##$YL= 0
##$YMAX_a= 552784
##$YMIN_a= -491946
##$ZGOPTNS= <>
##$ZL1= 120
##$ZL2= 120
##$ZL3= 120
##$ZL4= 120
##$ABSF1= 14.98509
##$ABSF2= -5.573092
##$ABSG= 5
##$ABSL= 3
##$ALPHA= 0
##$AQORDER= 0
##$ASSFAC= 0
##$ASSFACI= 0
##$ASSFACX= 0
##$ASSWID= 0
##$AUNMP= <proc_prof1d_extract_pilot.lims>
##$AXLEFT= 0
##$AXNAME= <>
##$AXNUC= <1H>
##$AXRIGHT= 0
##$AXTYPE= 0
##$AXUNIT= <>
##$AZFE= 0.1
##$AZFW= 0.1
##$BCFW= 0
##$BC_mod= 0
##$BYTORDP= 0
##$COROFFS= 0
##$CY= 15
##$DATMOD= 1
##$DC= 0
##$DFILT= <>
##$DTYPP= 0
##$F1P= 0
##$F2P= 0
##$FCOR= 0.5
##$FTSIZE= 32768
##$FT_mod= 6
##$GAMMA= 0
##$GB= 0
##$INTBC= 1
##$INTSCL= 1
##$ISEN= 128
##$LB= 0
##$LEV0= 0
##$LPBIN= 0
##$MAXI= 10000
##$MC2= 0
##$MEAN= 0
##$ME_mod= 0
##$MI= 0
##$NCOEF= 0
##$NC_proc= -8
##$NLEV= 6
##$NOISF1= 0
##$NOISF2= 0
##$NSP= 0
##$NTH_PI= 0
##$NZP= 0
##$OFFSET= 14.98509
##$PC= 1
##$PHC0= 86.04492
##$PHC1= 0
##$PH_mod= 1
##$PKNL= yes
##$PPARMOD= 0
##$PPDIAG= 0
##$PPIPTYP= 0
##$PPMPNUM= 2147483647
##$PPRESOL= 1
##$PSCAL= 4
##$PSIGN= 0
##$PYNMP= <proc.py>
##$REVERSE= no
##$SF= 400.02
##$SI= 32768
##$SIGF1= 0
##$SIGF2= 0
##$SINO= 400
##$SIOLD= 32768
##$SPECTYP= <>
##$SREGLST= <1H.CDCl3>
##$SSB= 0
##$STSI= 32768
##$STSR= 0
##$SW_p= 8223.68421052631
##$SYMM= 0
##$S_DEV= 0
##$TDeff= 65536
##$TDoff= 0
##$TI= <>
##$TILT= no
##$TM1= 0
##$TM2= 0
##$TOPLEV= 0
##$USERP1= <user>
##$USERP2= <user>
##$USERP3= <user>
##$USERP4= <user>
##$USERP5= <user>
##$WDW= 1
##$XDIM= 32768
##$YMAX_p= 447831401
##$YMIN_p= -696450
##$CURPLOT= <Network HP LaserJet P1505>
##$CURPRIN= <$Network HP LaserJet P1505>
##$DFORMAT= <normdp>
##$LAYOUT= <+/1D_H.xwp>
##$LFORMAT= <normlp>
##$PFORMAT= <normpl>
##$SURQMSG= 1
$$ End of Bruker specific parameters
$$ ---------------------------------
##NTUPLES= NMR SPECTRUM
##VAR_NAME=  FREQUENCY,     SPECTRUM/REAL,   SPECTRUM/IMAG
##SYMBOL=    X,             R,               I
##VAR_TYPE=  INDEPENDENT,   DEPENDENT,       DEPENDENT
##VAR_FORM=  AFFN,          ASDF,            ASDF
##VAR_DIM=   32768,         32768,           32768
##UNITS=     HZ,            ARBITRARY UNITS, ARBITRARY UNITS
##FACTOR=    0.250966925370066, 1,           1
##FIRST=     8223.43324360094, -196096,      -86814
##LAST=      0,             -236873,         -14257
##MIN=       0,             -696450,         0
##MAX=       8223.43324360094, 447831401,    0
$$ Real data points
##PAGE= N=1
##DATA TABLE= (X++(R..R)), XYDATA
$$ [...]
19592G814M05659a91975p4376C29253A13560j9730b57490J09246B5037b24124
$$ 7814 413473 -191975 -266351 329253 113560 93830 -257490 -148244 25037 -224124
19581b13674M6906A99789D5236g3093q8591g6824c4316l7729m4106A72457b86371
$$ -213674 -166768 199789 45236 -73093 -161684 -76824 -34316 -72045 -116151 172457 -286371
19569c5067k42777F1916J18810a5754j90018f4190B081b05521D7227j1665P223
$$ -35067 -277844 61916 180726 -15754 -205772 -64190 2081 -205521 47227 35562 42785
19558D2785K79859B3256c08682a38582c6967k342P517A2192P5891a67279F8891
$$ 42785 322644 23256 -308682 -138582 -36967 -39309 -31792 12192 88083 -167279 68891
19546d9823k28668j58527a8526d471o1876k45385A17547K1690R9503d971A01486
$$ -49823 -278491 -437018 -18526 -4471 -66347 -311732 117547 139237 238740 -4971 101486
19534f7171p7289D2731K02046b996C3964P7210c411m1484j78570g0636j53087
$$ -67171 -144460 42731 244777 -2996 33964 111174 -3411 -44895 -223465 -70636 -223723
19523b23723r750c7264A66851B0907b64731B55217a22774c8340m7291j6865j77748
$$ -223723 -233473 -37264 166851 20907 -264731 255217 -122774 -38340 -85631 -102496 -280244
19512b80244C6195b31691N7671C07770a64573P9504j02903C6450b76317A05413
$$ -280244 36195 -231691 -174020 307770 -164573 -85069 -187972 36450 -276317 105413
19501g1179B384P617O5048C4905a53988H8564M3930a12041A76384b8773B59026
$$ -71179 2384 10001 75049 34905 -153988 88564 132494 -112041 176384 -28773 259026
19489H7252a61853D08830a4496B64581f9748E1369i3526J6724A02020a68811A32447
$$ 87252 -161853 408830 -14496 264581 -69748 51369 -93526 -76802 102020 -168811 132447
19477b32240A17869e5001j05980H8350b12090Q1926C8324a31235B04846d7017
$$ -232240 117869 -55001 -160981 88350 -212090 -130164 38324 -131235 204846 -47017
19466C7481d0257A84365a24770D7943a58965M569B01905j3078a05831p0194M5394
$$ 37481 -40257 184365 -124770 47943 -158965 -154396 201905 188827 -105831 -176025 -130631
19455a30631b3187j19543K136D5623d4153o5271j15572J01409j54248F7746L7745
$$ -130631 -23187 -142730 -140594 45623 -44153 -109424 -224996 -123587 -277835 67746 105491
19444A05491J32278d84765b33783h2975q4761j81552A72394A4919e65226A67292
$$ 105491 237769 -484765 -233783 -82975 -167736 -349288 172394 14919 -565226 167292
19433A47356B1171b06676j09902a02539H9988i5100C5406j5642M2035a2696A42828
$$ 147356 21171 -206676 -316578 -102539 89988 -95100 35406 19764 61799 -12696 142828
19421E8504b15967c6859l4795E6626c26860F1376i8658K6490B85252b40636O2110
$$ 58504 -215967 -36859 -71654 56626 -326860 61376 -98658 -72168 285252 -240636 -178526
19410a78526C0018a9053l99108b06035c6127e644j44003H6343i5825J9678A68152
$$ -178526 30018 -19053 -418161 -206035 -36127 -5644 -149647 86343 -95825 -76147 168152
19398H4358e6511j8640B60481C9195b79563C9341d6075k9162F6278c2363j21763
$$ 84358 -56511 -75151 260481 39195 -279563 39341 -46075 -75237 66278 -32363 -154126
19387a54126e6142l55530f778j97283q5216A96589b6605j7107H740i3397b7574
$$ -154126 -56142 -411672 -6778 -204061 -289277 196589 -26605 -43712 8740 -93397 -27574
19375C3036b4582k9870j0625l84676a67957A07736J21612d4007k62403L6561a17955
$$ 33036 -24582 -54452 -65077 -449753 -167957 107736 229348 -44007 -306410 -269849 -117955
19363a95454I0147c17621G3996C2443b64231H6220b20463E4568J06585e1069m6664
$$ -195454 90147 -317621 73996 32443 -264231 86220 -220463 54568 161153 -51069 -97733
19352i7733p0501B8701a64845d9900a9915B29357g4894b1053j42660D469J80402
$$ -97733 -168234 28701 -164845 -49900 -19915 229357 -74894 -21053 -163713 4469 184871
19341A84871D5378a8959B22853g6530a3977A41588i3084o4668n4262g1304k12140
$$ 184871 45378 -18959 222853 -76530 -13977 141588 -93084 -157752 -212014 -71304 -283444
19330b83444a37041b9574j17544K3999M2655I8411b9464n1023H3924a98042b3497
$$ -283444 -137041 -29574 -147118 -123119 -80464 98411 -29464 -80487 83924 -198042 -23497
19318a36254H0736a94170h7376j35695A5079K637f6234A53169c4122P434m5759
$$ -136254 80736 -194170 -87376 -223071 15079 17716 -66234 153169 -34122 -26688 -72447
19307g2447A16827a86549r197R6920b4197j34355Q816C67145a54989K4274C9599
$$ -72447 116827 -186549 -195746 -98826 -24197 -158552 -149736 367145 -154989 -130715 39599
19295e4274J5484G2284K95801j45112a89853A75201b16472H798J44858a09777
$$ -54274 -38790 72284 368085 222973 -189853 175201 -216472 8798 153656 -109777
19284G7751c7527j44006A25790b29468G327a32421M3052l35127c6099j63574j73219
$$ 77751 -37527 -181533 125790 -229468 7327 -132421 -89369 -424496 -36099 -199673 -372892
19273c72892a59028q0892d2144j48184A19927B8770a82321k7833A43246b24976
$$ -372892 -159028 -239920 -42144 -190328 119927 28770 -182321 -210154 143246 -224976
19262a5733C8785a01208q1952N091b3976H4762O775j1758Q5225b83658B54107
$$ -15733 38785 -101208 -183160 -178069 -23976 84762 91537 79779 165004 -283658 254107
19250A51943g5160o7160K4323A98069a05752l3801r2682k0326A91259d9153B91978
$$ 151943 -75160 -142320 -117997 198069 -105752 -139553 -232235 -252561 191259 -49153 291978
19238A44544c77022A34892a69482H961a84257j68178h114A55696b3828B4658J58854
$$ 144544 -377022 134892 -169482 8961 -184257 -352435 -8114 155696 -23828 24658 183512
19227A83512H2453R1676c7236A3800a16250I6907Q1505b69263g3860l00523f7649
$$ 183512 82453 174129 -37236 13800 -116250 96907 178412 -269263 -73860 -374383 -67649
19215F9249F63J18412f1064C2572J36380a06178m8693n630A09715Q1645b36565
$$ 69249 663 119075 -61064 32572 168952 -106178 -154871 -160501 109715 191360 -236565
19203B2658c24468J2425o1697c403j39887E5666h169k08309J5213K946H0272a54759
$$ 22658 -324468 -312043 -373740 -3403 -143290 55666 -8169 -216478 -201265 -198319 80272 -154759
19190f8529p4784b2293l34010c2190j24345c7144H6313b33995j1088a2173j03768
$$ -68529 -143313 -22293 -356303 -32190 -156535 -37144 86313 -233995 -245083 -12173 -115941
19179a15941j09039B4779K2635e2301F0728J73759n7997j1289i7890A08665d6248
$$ -115941 -224980 24779 47414 -52301 60728 234487 176490 165201 -97890 108665 -46248
19167A15466b317A52586a08334n5370B08860b55396i4720j36852A33804a60225
$$ 115466 -2317 152586 -108334 -163704 208860 -255396 -94720 -231572 133804 -160225
19156b1200k60936a1667j61372h4139j81101m0830G3987b3501A40587c23468b4240
$$ -21200 -282136 -11667 -173039 -84139 -265240 -306070 73987 -23501 140587 -323468 -24240
19144A02119b79653J18109q421j70090L1246P45N5116A07953a02107k7987G4976
$$ 102119 -279653 -161544 -169965 -340055 -308809 -308064 -252948 107953 -102107 -130094 74976
19132a4185j27213E6358f1804B16125b6133C1077O9324a18275L7772r2802N5428
$$ -14185 -141398 56358 -61804 216125 -26133 31077 100401 -118275 -80503 -173305 -117877
19121a17877H1445a67932A39628c27613D99969A65667R1702O2645d1891C3465
$$ -117877 81445 -167932 139628 -327613 499969 165667 257369 320014 -41891 33465
19110d08189A119a3534j61555A99297J67261a02231k60613d5551l7851l0999e4770
$$ -408189 1119 -13534 -175089 199297 366558 -102231 -362844 -45551 -83402 -114401 -54770
19098a49664L4403d7805B345K78199g5154H6280a06240C3263b58380P6405A29768
$$ -149664 -115261 -47805 2345 280544 -75154 86280 -106240 33263 -258380 -181975 129768
19086a10663J2313r1045L2152J5114G3796K4545i4564K1160F6283a38932B84107
$$ -110663 -98350 -189395 -157243 -142129 73796 98341 -94564 -73404 66283 -138932 284107
19074E2502A0638N2973j4507M7218a1810E3051b62401A36501d71785a51312j1011
$$ 52502 10638 63611 49104 96322 -11810 53051 -262401 136501 -471785 -151312 -162323
19063a62323r0680a11198l27128b10016B5758J5429h4613l0543C3053J08922a1317
$$ -162323 -253003 -111198 -438326 -210016 25758 41187 -84613 -115156 33053 141975 -11317
19051A5544a02065c2202A08119b06015R2637r2943H901a12635B53656h2253j22780
$$ 15544 -102065 -32202 108119 -206015 -113378 -206321 8901 -112635 253656 -82253 -205033
19040b05033A9761L6645a46604A15093a96468j29752a45608m9841k36860a33829
$$ -205033 19761 56406 -146604 115093 -196468 -326220 -145608 -195449 -432309 -133829
19029I0342K12111A7300a20149A57708D020K45386g9571A62011M1026a2181A69228
$$ 90342 302453 17300 -120149 157708 4020 249406 -79571 162011 203037 -12181 169228
19017A36326a40415h425n3613j55638H8363J59697D2162a56532k00567B30206
$$ 136326 -140415 -8425 -62038 -217676 88363 248060 42162 -156532 -357099 230206
19006h1344C763J2518P6555b08050A19884J40812b69721N2656D389b87359A87875
$$ -81344 3763 16281 92836 -208050 119884 260696 -269721 -217065 4389 -287359 187875
18994c3385B07452a23335k3522j12951c890j55802M1029G6610e5264j0832H8371
$$ -33385 207452 -123335 -146857 -259808 -3890 -159692 -118663 76610 -55264 -66096 88371
18982c08854G5166b34518c8406E9681a36440O7649A21954R5837L4471h0251l118
$$ -308854 75166 -234518 -38406 59681 -136440 -68791 121954 217791 252262 -80251 -83369
18971h3369E5299H929L2655c64A58331a56717J1666n5492k0159g9270B79994J2682
$$ -83369 55299 8929 41584 -364 158331 -156717 -145051 -200543 -220702 -79270 279994 292676
18959B92676k6429a00148B45239C4381N2851a01469c9714k19856p3192a37398
$$ 292676 266247 -100148 245239 34381 87232 -101469 -39714 -259570 -332762 -137398
18948a61560g5643N021g237k814k45813N1572B03198a24048A91565c02842A05542
$$ -161560 -75643 -70622 -7237 -10051 -255864 -204292 203198 -124048 191565 -302842 105542
18936f6212j14318q431M7465j31739M7083A4603b06449N1090E0298M0436a3602
$$ -66212 -180530 -188961 -141496 -273235 -226152 14603 -206449 -155359 50298 90734 -13602
18924h9929A77242b74428F1828a6773k39908G3661J4529h142A18092a69799j3648
$$ -89929 177242 -274428 61828 -16773 -256681 73661 88190 -8142 118092 -169799 -183447
18913a83447Q0674M0063k61775A00289a28675a1140C14733a13568c0034E8711
$$ -183447 -102773 -62710 -324485 100289 -128675 -11140 314733 -113568 -30034 58711
18902b46214A16166e8852m7409Q18C433a48471c9037K792A72655m9837a15559
$$ -246214 116166 -58852 -106261 -105443 3433 -148471 -39037 -36245 172655 122818 -115559
18890E6779B7135l524b18600b6505B17774d05334a27872D4900a18534D0331G609
$$ 56779 27135 23611 -218600 -26505 217774 -405334 -127872 44900 -118534 40331 7609
18878C6927M5334k2694a0878A53233E3600a46912N4480k1997i942j54083j6955
$$ 36927 82261 59567 -10878 153233 53600 -146912 -92432 -114429 -9942 -164025 -180980
18867a80980o068l97963K04938a68116I8366a95503o8554A89086a26474M3770
$$ -180980 -187048 -585011 -380073 -168116 98366 -195503 -264057 189086 -126474 -82704
18857h2704j15623r023a1851E5373i4549k49436a41006A26421N3589l5680J46550
$$ -82704 -198327 -207350 -11851 55373 -94549 -343985 -141006 126421 180010 144330 290880
18846B90880E613a72169B46926b9230d037E462K80690A7641b57510C3339a64017
$$ 290880 5613 -172169 246926 -29230 -4037 5462 286152 17641 -257510 33339 -164017
18834d10390a27123m26167a0417m7548B6328a18498a5380l24k60125H8818b09035
$$ -410390 -127123 -553290 -10417 -57965 26328 -118498 -15380 -15704 -275829 88818 -209035
18822B8464M3484b12244i8257k97341a11710c4619o6835A13837m2939O9251P7170
$$ 28464 71948 -212244 -98257 -395598 -111710 -34619 -101454 113837 70898 140149 217319
18811B17319q7629J1602K70393B02858l8394O7692h4843F0271k5525R0783c02166
$$ 217319 129690 141292 411685 202858 164464 232156 -84843 60271 34746 125529 -302166
18799a62581B9172a31986j04675i0686L6978j44539j57550b5533D609b13564R234
$$ -162581 29172 -131986 -236661 -90686 -53708 -198247 -355797 -25533 4609 -213564 -204330
18788b04330d3987l89102f3144B7087a45709f0765C0197J44078g6951a2335A65370
$$ -204330 -43987 -433089 -63144 27087 -145709 -60765 30197 174275 -76951 -12335 165370
18776A32949b02192O9109o2604I3514a29481a7604A17536K21889A2218O3906J49754
$$ 132949 -202192 -133083 -195687 93514 -129481 -17604 117536 339425 12218 76124 225878
18765B25878b51651N7314i1233d0957j4683l00679A14252m1877J42257a80209
$$ 225878 -251651 -194337 -91233 -40957 -55640 -356319 114252 72375 214632 -180209
18754a77152f6073A12477b13473A45876b93539p1599c5136l86019M3540f4766
$$ -177152 -66073 112477 -213473 145876 -293539 -365138 -35136 -421155 -377615 -64766
18743a03055j84051A84863b03736A76677f7896J5792n3616I1307e4262D452K2697
$$ -103055 -287106 184863 -203736 176677 -67896 -52104 -105720 91307 -54262 4452 27149
18732B7149a31249d1112G2155f5009G3965a23606K681b4541k9641P086C0705J37622
$$ 27149 -131249 -41112 72155 -65009 73965 -123606 -120925 -24541 -54182 -47096 30705 168327
18720A68327a42158f600D6183b09276i9511L4819D33618j99387h5415B1592N7757
$$ 168327 -142158 -6600 46183 -209276 -99511 -64692 433618 234231 -85415 21592 79349
18709G9349K84007b23582j13745a66518q3488k1788A42070b69294M0672b1066
$$ 79349 363356 -223582 -337327 -166518 -250006 -271794 142070 -269294 -228622 -21066
18698d4897j3166j13084E8907B1424P3368a57872O6763A65125E2636b80306A39647
$$ -44897 -58063 -171147 58907 21424 94792 -157872 -91109 165125 52636 -280306 139647
18686e8096A57686k6622m0435b75571A17671a86861J8922r8058A15369L9702p4814
$$ -58096 157686 131064 90629 -275571 117671 -186861 -167939 -265997 115369 155071 80257
18675H0257J57143a0122A01619P7413p4064Q0291e1822I2918g548E6043A5962
$$ 80257 237400 -10122 101619 179032 104968 185259 -51822 92918 -7548 56043 15962
18663a36684A9933a37357A66413b76024J21124n1766D3334b24652A33565B7922
$$ -136684 19933 -137357 166413 -276024 -154900 -206666 43334 -224652 133565 27922
18652C762i562B52163a4460k56867J29875a3814k8684j70119D7215J60757a67456
$$ 3762 -9562 252163 -14460 -271327 -141452 -13814 -42498 -212617 47215 207972 -167456
18640b05872A91434m5265A4101b48919D3648K3750a83640H680A211a17434m3178
$$ -205872 191434 146169 14101 -248919 43648 67398 -183640 8680 1211 -117434 -160612
18629a60612A08449a63044K9526O2424A38940H668b51871d5054k8217A32657b14909
$$ -160612 108449 -163044 -133518 -71094 138940 8668 -251871 -45054 -73271 132657 -214909
18617C061Q014a09294q7803j97846D9544a75073r5574c7687r5527D0537a3906
$$ 3061 11075 -109294 -197097 -394943 49544 -175073 -270647 -37687 -133214 40537 -13906
18605a40384J2998E1807f3665B48387a05299L0874b3098j028E3492J31442c6403
$$ -140384 -127386 51807 -63665 248387 -105299 -74425 -23098 -24126 53492 184934 -36403
18593b29836I2491d7694j47866c0710l75609a06732K3617C664c06327A55008b20472
$$ -229836 92491 -47694 -195560 -30710 -406319 -106732 -83115 3664 -306327 155008 -220472
18581A52277a55441m9368R9386M7716d225E4793R1082c9097l8014b8178k59495
$$ 152277 -155441 -204809 -105423 -57707 -4225 54793 145875 -39097 -77111 -28178 -287673
18570b87673D017a17973p9204A31648a5990O935j20038k3780j9255K3915k21572
$$ -287673 4017 -117973 -197177 131648 -15990 -9055 -129093 -152873 -172128 -148213 -369785
18559c69785J17648k8747I546L2272l086a80398L2033j0194A29771c6774m0024
$$ -369785 -252137 -280884 9546 41818 38732 -180398 -148365 -158559 129771 -36774 -76798
18548g6798B516N3918d7254l2621j90235h7089A06407d8179l04022J66191F0181
$$ -76798 2516 56434 -47254 -79875 -270110 -87089 106407 -48179 -352201 -186010 60181
18536b76815A56744D3737a55728k38958H0094d76486G8710A6220L0232f3699A2387
$$ -276815 156744 43737 -155728 -394686 80094 -476486 78710 16220 46452 -63699 12387
18524f2518j02617J0395E6541N9061c6442I8961f6528K8721A36059o4409b02434
$$ -62518 -165135 -154740 56541 115602 -36442 98961 -66528 -37807 136059 71650 -202434
18512i9327E1313j512d0030I8950J7483c2490B34754g1014J7032A0876c27656
$$ -99327 51313 49801 -40030 98950 116433 -32490 234754 -71014 -53982 10876 -327656
18500b72761C4983J13886l8925B557b28057q8582J16764R7574o5868A2243a39926
$$ -272761 34983 148869 109944 2557 -228057 -316639 -199875 -102301 -168169 12243 -139926
18488a25147j3853a0157n8749G626d2407f45A384e4833F9156b27941M776A39561
$$ -125147 -139000 -10157 -68906 7626 -42407 -645 1384 -54833 69156 -227941 -223165 139561
18475a20247j87772I376K61519j18437j9118C6373a27809d3779A86947a38230
$$ -120247 -308019 9376 270895 152458 133340 36373 -127809 -43779 186947 -138230
18464h7711j68565A62227J56487A12748O1779a61810L4447L5630C5367e23650
$$ -87711 -256276 162227 318714 112748 174527 -161810 -127363 -91733 35367 -523650
18453I0131b01602A11726c56920J31963C0082a86083Q4312I2849K9067a9623l56128
$$ 90131 -201602 111726 -356920 -224957 30082 -186083 -101771 92849 121916 -19623 -375751
18442c75751c3863l04895R4158H4281a72398G3362b33330d6485b0884B00525a409
$$ -375751 -33863 -338758 -244600 84281 -172398 73362 -233330 -46485 -20884 200525 -1409
18430b56208q5968a08614j14948B7641a81592O993A92456g8438C5747c2147G6407
$$ -256208 -342176 -108614 -223562 27641 -181592 -174599 192456 -78438 35747 -32147 76407
18418a59395L4526J921B44770m0833F1250J60345a48769L9027k1716q9331g9323
$$ -159395 -124869 -122948 244770 203937 61250 221595 -148769 -109742 -131458 -220789 -79323
18406A89564E8906i608I547a97449C2743K11093n0838n643b6847n0159J4268G4375
$$ 189564 58906 -9608 9547 -197449 32743 243836 192998 187355 -26847 -77006 -62738 74375
18393A22615a88370A4655K8128h4792C08367a15120j87214J30640C2323J12641
$$ 122615 -188370 14655 42783 -84792 308367 -115120 -302334 -171694 32323 144964
18383A44964j6932a13639j47872E37208h0083j91227F4849h4393A08620a53827
$$ 144964 128032 -113639 -261511 537208 -80083 -271310 64849 -84393 108620 -153827
18372b2818D562K1635f0226C2407M9117K8987K52953e1904F5308J29974d8939
$$ -22818 4562 26197 -60226 32407 81524 110511 363464 -51904 65308 195282 -48939
18360h4874j33356H6001A7104J87890a33040m6767j1445Q105B42601a5650B89032
$$ -84874 -218230 86001 17104 204994 -133040 -179807 -191252 -183147 242601 -15650 289032
18348b25542i1473n69302b55870C2510O4471a57433j18070g57p5287b6816k39961
$$ -225542 -91473 -660775 -255870 32510 96981 -157433 -275503 -757 -76044 -26816 -266777
18337b66777h5854j15117C06830f2812p8621L5327B42919a07123A14764P9521
$$ -266777 -85854 -200971 306830 -62812 -141433 -106106 242919 -107123 114764 194285
18327A94285a63705F5459J72443E0511c55003J24639A51020a8720A8888K2204
$$ 194285 -163705 65459 237902 50511 -355003 -230364 151020 -18720 18888 41092
18317D1092d37311R3539a30818j4929B3358b45012q4749g2268G9673a4655j62347
$$ 41092 -437311 -343772 -130818 -145747 23358 -245012 -329761 -72268 79673 -14655 -177002
18306a77002C35328a88862j15679A24142b35652A19858n9127J35332b1724B18871
$$ -177002 335328 -188862 -304541 124142 -235652 119858 60731 196063 -21724 218871
18295b59010d7035a3997G4102f2162E6043a40647A1802a3728l21999J59920A28959
$$ -259010 -47035 -13997 74102 -62162 56043 -140647 11802 -13728 -335727 -175807 128959
18283c1118k85867J40847c2356j99847e3704j30955g4352m0845A22802l3650J71938
$$ -31118 -316985 -176138 -32356 -232203 -53704 -184659 -74352 -115197 122802 89152 261090
18272B61090d5176l16544B43772h8132A07865L10034D213a4418j04975k22240
$$ 261090 -45176 -361720 243772 -88132 107865 417899 4213 -14418 -119393 -341633
18262c41633L6612J44932L0359k95663b0706C5682j6026M5446J17704d6081K1112
$$ -341633 -305021 -160089 -129730 -425393 -20706 35682 19656 65102 182806 -46081 -24969
18251b4969d288j41160L696f7819k7204H2631i8547C39788E5383i175B01743a56322
$$ -24969 -4288 -145448 -141752 -67819 -95023 82631 -98547 339788 55383 -9175 201743 -156322
18238b78030f3710m2107m0629a5168k96471a40245e1299E8087a30361C22110A24812
$$ -278030 -63710 -105817 -146446 -15168 -311639 -140245 -51299 58087 -130361 322110 124812
18226c29576G8974f3792A34387J37629b98740f3133a1440k80941b0954A48512
$$ -329576 78974 -63792 134387 272016 -298740 -63133 -11440 -292381 -20954 148512
18215B06602r7883D7946J32J01191a41391j09959N4119A48541b32267F640a77853
$$ 206602 108719 47946 48078 149269 -141391 -251350 -197231 148541 -232267 6640 -177853
18203e9828G6341k6655b1004L04A47492f4878m988L1505F9425j388b31940P8354
$$ -59828 76341 49686 -21004 -20700 147492 -64878 -69866 -38361 69425 68037 -231940 -153586
18191a53586l19087C1744a73482A85798q8846c78557C72541j77149o0934b92578
$$ -153586 -472673 31744 -173482 185798 96952 -378557 372541 195392 134458 -292578
18180E6140j7882a58106m1993C0983K62519H7174c00694a04604b8143o5305j90733
$$ 56140 38258 -158106 -200099 30983 293502 87174 -300694 -104604 -28143 -93448 -284181
18169b84181C52394a42352B02507c276m69473a52775n6505o0166P7073B1623g5199
$$ -284181 352394 -142352 202507 -3276 -472749 -152775 -209280 -269446 -192373 21623 -75199
18157a11501A2732h9136m09693f0611k06725d3581B33782a88524j0109q8158j54693
$$ -111501 12732 -89136 -498829 -60611 -267336 -43581 233782 -188524 -198633 -286791 -441484
18146d41484H766c09428a1928I7358a02920b6098F5085b41192a3401o7185G1984
$$ -441484 8766 -309428 -11928 97358 -102920 -26098 65085 -241192 -13401 -80586 71984
18134A5492e0814C3134a81472N2380A20331K2472L00934d95581K45109A87225
$$ 15492 -50814 33134 -181472 -129092 120331 142803 443737 -495581 -250472 187225
18123a05388K6184B37741b41717E1884a42569E7557L7520a28019H945J72224O5438
$$ -105388 -79204 237741 -241717 51884 -142569 57557 95077 -128019 8945 181169 246607
18112B46607d220A12276M4896b06778R7758k25931a14171H8332c07148i4537A0096
$$ 246607 -4220 112276 157172 -206778 -109020 -334951 -114171 88332 -307148 -94537 10096
18100a57442j88500a14334j60924A98150L1249o4195D5473a87991B63270a45954
$$ -157442 -345942 -114334 -275258 198150 229399 165204 45473 -187991 263270 -145954
18089a47514B1900J3463J1162R5310a34942k88227B94066I1385Q1415m1596E1277
$$ -147514 21900 35363 46525 141835 -134942 -423169 294066 91385 172800 131204 51277
18077A45583a37853D2551J31359a01297B85598r8449a60082d0736j07937M0056
$$ 145583 -137853 42551 173910 -101297 285598 187149 -160082 -40736 -148673 -108617
18067a08617C4532c70679p0378B10472M25368e9643A85848D471P330a6120n8221
$$ -108617 34532 -370679 -441057 210472 635840 -59643 185848 4471 11801 -16120 -74341
18056g4341n0909A40575e43j84261A72812B4624K20759d1659A03336L8176a10259
$$ -74341 -125250 140575 -543 -184804 172812 24624 245383 -41659 103336 141512 -110259
18044B28845a13723m3009A52800b81617A13083b08448M9640A75285a66549g1352
$$ 228845 -113723 -156732 152800 -281617 113083 -208448 -158808 175285 -166549 -71352
18033a87984E1553A9788l27e0342C8062h8625j62955F5410a70296A50308b44743
$$ -187984 51553 19788 19461 -50342 38062 -88625 -251580 65410 -170296 150308 -244743
18021c53088A09872d7180m8507r9962K6318D9346b02884D3201d7235k11803d4829
$$ -353088 109872 -47180 -95687 -195649 -169331 49346 -202884 43201 -47235 -259038 -44829
18009b1355B20896k7682a68007B66903o1864C3244K12907A10684e5606A55864
$$ -21355 220896 193214 -168007 266903 205039 33244 246151 110684 -55606 155864
17998b18401f1641j2422A31862d2277k47292a14129j47883D25877F2123c7826
$$ -218401 -61641 -74063 131862 -42277 -289569 -114129 -262012 425877 62123 -37826
17987a44374B18969G7285b8969C10614f7104G0864B0778e6802G513M7086J58652
$$ -144374 218969 77285 -28969 310614 -67104 70864 20778 -56802 7513 54599 213251
17976B13251g5033j91642F208a01395j43535R6290B37071A01433a4226k20107
$$ 213251 -75033 -266675 6208 -101395 -244930 -148640 237071 101433 -14226 -234333
17966b34333b3885A21349c48188A27951d93344d1869k52952l6091b8223j27253
$$ -234333 -23885 121349 -348188 127951 -493344 -41869 -294821 -330912 -28223 -155476
17956a55476g567A05143a32460j95162l2684g8013A74144e1568q4092D0194J1883
$$ -155476 -7567 105143 -132460 -327622 -360306 -78013 174144 -51568 -135660 40194 52077
17945E2077a06126k2731A1086P737P0482L5782j0386j7145a91752D72a62581d1631
$$ 52077 -106126 -128857 11086 18823 89305 125087 114701 97556 -191752 472 -162581 -41631
17932g7478m0550G0767f5465q5842B98526D4733b04766R3362A54138b10319Q8071
$$ -77478 -118028 70767 -65465 -151307 298526 44733 -204766 -111404 154138 -210319 -122248
17921a22248A38316g5899n4485D56385e6955o4816j61970G8191c79305h445A35214
$$ -122248 138316 -75899 -130384 456385 -56955 -121771 -283741 78191 -379305 -8445 135214
17909G6270N8568A2404M0987J46731a62239F5444r442k3336P5487d777p1769j63095
$$ 76270 134838 12404 53391 200122 -162239 65444 56002 32666 108153 -4777 -76546 -239641
17897b39641C0733b86451a37609J4015A0276a64701c2147J5139F1796d91415H5031
$$ -239641 30733 -286451 -137609 -123594 10276 -164701 -32147 -17008 61796 -491415 85031
17885A95058I4018a1642k61177F3671K27906b69469I3925j6935j429a35104B02161
$$ 195058 94018 -11642 -272819 63671 291577 -269469 93925 76990 75561 -135104 202161
17873A52193c22591A88523B397a64941p6730Q1642I7175c8969Q980H1197O5691
$$ 152193 -322591 188523 2397 -164941 -241671 -160029 97175 -38969 -29989 81197 146888
17862A46888a97155A87286P0749f1145j46688A89256b33352c7108I0090C7746
$$ 146888 -197155 187286 258035 -61145 -207833 189256 -233352 -37108 90090 37746
17851a02361n0434A69598e5D5100b90876g2720r569A30613a70785C7667N9335
$$ -102361 -152795 169598 -55 45100 -290876 -72720 -82289 130613 -170785 37667 97002
17840I7002i4788B00734p1437K0972C463P21Q2725J39359h1128B99851a03630
$$ 97002 -94788 200734 129297 150269 3463 4184 86909 226268 -81128 299851 -103630
17828F3848A4275J53609B5797J60055p7696a0258j42340a1185j0459I7171e1055
$$ 63848 14275 167884 25797 185852 108156 -10258 -152598 -11185 -21644 97171 -51055
17816c10669B31347a30140O0211A70870j3968a18236D64780D1892K00772f3275
$$ -310669 231347 -130140 -69929 170870 156902 -118236 464780 41892 242664 -63275
17805a99966M9470j1657l0920A38083l9230Q5644a27217N2157A54197j1532R1920
$$ -199966 -150496 -162153 -193073 138083 98853 184497 -127217 -75060 154197 142665 234585
17794B34585C0282J85208o4269h512A2306M3463d3149k66920B6360O7610c0026
$$ 234585 30282 215490 151221 -8512 12306 55769 -43149 -310069 26360 93970 -30026
17782B73585h9362A50193b37252B77932c8303H4141e1229c434l78649A02297a376
$$ 273585 -89362 150193 -237252 277932 -38303 84141 -51229 -3434 -382083 102297 -1376
17770C6785J07085a5460C9404J23577A9731h9842A12373a41920O3435I3920Q2152
$$ 36785 143870 -15460 39404 162981 19731 -89842 112373 -141920 -78485 93920 176072
17759A76072j7175b44034J12729I6165a74260F9676a22071H5133a46335A51300
$$ 176072 158897 -244034 -131305 96165 -174260 69676 -122071 85133 -146335 151300
17748A83612J9976E5571O2491K6372K7104K86459F1800a06346A94814n3734a07507
$$ 183612 203588 55571 118062 144434 171538 457997 61800 -106346 194814 141080 -107507
17736e6672j73881d3296a1920C2892J93277b15789C14016A7154a57675A36829
$$ -56672 -230553 -43296 -11920 32892 226169 -215789 314016 17154 -157675 136829
17725A07431c41590A38436b85572A83183a04492o6441d0094o1928d676k5102j1762
$$ 107431 -341590 138436 -285572 183183 -104492 -170933 -40094 -102022 -4676 -29778 -41540
17714d1540k61976H8609K7125a70108F6991g8975C04372A8080C431a7613k69520
$$ -41540 -303516 88609 115734 -170108 66991 -78975 304372 18080 3431 -17613 -287133
17703b87133c1492A50726j7156a36268A3044O1825O3247M4982b5833B0701M6379
$$ -287133 -31492 150726 133570 -136268 13044 74869 138116 183098 -25833 20701 67080
17692F7080Q6430J12945I8799L191d1649o1862l5039B8093a51648C1430b3961
$$ 67080 153510 266455 98799 101990 -41649 -103511 -138550 28093 -151648 31430 -23961
17680A10570J39720H3560m0254a45586D799a27820I885J2818m664c71232A31415
$$ 110570 250290 83560 43306 -145586 4799 -127820 9885 22703 18039 -371232 131415
17668b34729H3096A7P9485R7579B2256J90974a41272k61950e206o9014q1370B1344
$$ -234729 83096 17 79502 177081 22256 213230 -141272 -403222 -5206 -74220 -155590 21344
17655A3083K73844b44098j8915D0768c68534B3531c89157J68987e2114a3112e894
$$ 13083 286927 -244098 -263013 40768 -368534 23531 -389157 -220170 -52114 -13112 -5894
17643I0568P8455p1422b6246j64443d9071C683a41632C5467a4558E216b95175
$$ 90568 169023 97601 -26246 -190689 -49071 3683 -141632 35467 -14558 5216 -295175
17631A87508a63698F8142b47106a12383A53683A9205a50529G5360c43583G2091
$$ 187508 -163698 68142 -247106 -112383 153683 19205 -150529 75360 -343583 72091
17620E8264b07032B40644b63951M8175L8522f6762A88086d5771A18799i5883C36545
$$ 58264 -207032 240644 -263951 -215776 -177254 -66762 188086 -45771 118799 -95883 336545
17608B14015F2770J0387a5325n7850H5057A6719L8181J42078l1594b28841N5913
$$ 214015 62770 73157 -15325 -73175 85057 16719 54900 196978 165384 -228841 -172928
17597a72928G0025a40975A51929a88444h1910m0476C37469B635N5165b15134C1184
$$ -172928 70025 -140975 151929 -188444 -81910 -122386 337469 2635 57800 -215134 31184
17585g9987E9681J79423A2414a5281A77124a60469j31A81512B8823E818N5261
$$ -79987 59681 239104 12414 -15281 177124 -160469 -160600 181512 28823 5818 61079
17574F1079O159k377N6458d81402a87757B11753H8787m3283k1898Q5957P3383
$$ 61079 67238 64861 121319 -481402 -187757 211753 88787 45504 23606 109563 182946
17563A82946i0661B72059j27494a10582C56313a67992B61288a72139C69329p7061
$$ 182946 -90661 272059 144565 -110582 356313 -167992 261288 -172139 369329 292268
17553B92268H5007h742C18968d6686A97206b19238F1220a67416e336q7300H7070
$$ 292268 85007 -8742 318968 -46686 197206 -219238 61220 -167416 -5336 -92636 87070
17541E2879B0146e0868j03768A03708P5695M033c4593G8071a50921D4920J30654
$$ 52879 20146 -50868 -154636 103708 179403 183436 -34593 78071 -150921 44920 175574
17530A75574g5174L4447C9825J28031K9559f9617A40207M7960D3024K55560a09211
$$ 175574 -75174 -40727 39825 167856 197415 -69617 140207 188167 43024 298584 -109211
17518A06050a02072I6852m3161j3154Q6002d4149B50294H4711c2716A78421a53884
$$ 106050 -102072 96852 53691 40537 126539 -44149 250294 84711 -32716 178421 -153884
17506b27544c4623J0804D11041a53442D48025A78027d7460C4971g897o5348A25647
$$ -227544 -34623 -23819 411041 -153442 448025 178027 -47460 34971 -7897 -73245 125647
17494B28418j05847J3220a46333C4862c42063B68854I0992J30505a63397B36681
$$ 228418 122571 135791 -146333 34862 -342063 268854 90992 221497 -163397 236681
17483B65951A11930A0872J4555K85119A21192j5555b39561D40329b37693A67069
$$ 265951 111930 10872 25427 310546 121192 105637 -239561 440329 -237693 167069
17472c7850M159A60483A3737J06451J57769J48280D837b9947a4932A32805Q3377
$$ -37850 -33691 160483 13737 120188 277957 426237 4837 -29947 -14932 132805 216182
17461B16182P5051A40236E2121f2599D91130r3239j58107a65090B20605f2620
$$ 216182 291233 140236 52121 -62599 491130 397891 239784 -165090 220605 -62620
17450B59629m0509J90022r5899A52574R7816b3519C51928E0298J86653J8457J65132
$$ 259629 219120 409142 313243 152574 250390 -23519 351928 50298 236951 255408 420540
17439D20540j78598Q7858b4946B59726A2689L16800b5279B26423A01098A1655
$$ 420540 241942 329800 -24946 259726 12689 329489 -25279 226423 101098 11655
17428G9521f268E97779k26120j69067K47798j36836L1011A26766p289I313a05288
$$ 79521 -6268 597779 371659 202592 450390 313554 344565 126766 119477 9313 -105288
17416B53777P1363j25177j0123K6362I4921k5178J74982J1184q3130K14291A52230
$$ 253777 325140 199963 189840 216202 94921 69743 244725 255909 172779 387070 152230
17404A71975Q0881J73377J5619H5464l4566D087J03029K946m3652a4828j77577
$$ 171975 252856 426233 441852 85464 50898 4087 107116 110062 66410 -14828 -192405
17393a92405A30814O0027L14389A31645N7387l3902Q1919q3758N6759K01526a00558
$$ -192405 130814 190841 505230 131645 189032 155130 237049 153291 210050 411576 -100558
17381A60609N8293o6803K15479O7076p0204L1872F4985h9828D03208c1980I7713
$$ 160609 218902 152099 367578 434654 364450 396322 64985 -89828 403208 -31980 97713
17369B98867G4803Q7849M310K68475f2744j4212m2104k22372A51200a9345B5782
$$ 298867 74803 162652 166962 435437 -62744 -76956 -119060 -341432 151200 -19345 25782
17357A17309a2799A98082r2385l1339K23809b10410Q0863D41542A8172P9957a55522
$$ 117309 -12799 198082 105697 74358 298167 -210410 -129547 441542 18172 98129 -155522
17345c3093F159K28444a2796B9187J04843M3630D858h4259C26150H6149i7873
$$ -33093 6159 234603 -12796 29187 134030 177660 4858 -84259 326150 86149 -97873
17333H7626K34687B8205I145K18811K03861a05544I0922P5191k082E1814a48275
$$ 87626 322313 28205 9145 227956 431817 -105544 90922 166113 164031 51814 -148275
17321C81190j73507f8268J9102B71039J49718i4466J4250F13735B04595l3734
$$ 381190 207683 -68268 -49166 271039 420757 -94466 -80216 613735 204595 170861
17311A70861D3800J33724L4847b30575I7627L2525l9930A6881a8939B37545G7494
$$ 170861 43800 177524 212371 -230575 97627 130152 90222 16881 -18939 237545 77494
17299C23483q4328R9561b6786B58805n7178A6742g9347A01179A0017c592H1800
$$ 323483 239155 338716 -26786 258805 201627 16742 -79347 101179 10017 -3592 81800
17287B31373H2992D921K37492i0655a3378B93023F5937L36860I3478K48667B9504
$$ 231373 82992 4921 242413 -90655 -13378 293023 65937 402797 93478 342145 29504
17275d6907A02025a67451c0934j17651A40830b52691C12043b20589E9534P8197
$$ -46907 102025 -167451 -30934 -148585 140830 -252691 312043 -220589 59534 137731
17265A37731k7015a60837A30485L37365K1867j86279C9007J16267J74260q1887
$$ 137731 110716 -160837 130485 467850 489717 303438 39007 155274 329534 247647
17255B47647j14334K30138o0731e8595E5738d3009A58243a05604A42408J91311
$$ 247647 133313 363451 302720 -58595 55738 -43009 158243 -105604 142408 333719
17245C33719A28571j2799J22285r4581o6836L0994C3207L64839A18141c5600j16901
$$ 333719 128571 115772 238057 143476 76640 107634 33207 398046 118141 -35600 -152501
17234a52501B53280g0356A13132J39537A21249h4524C50227j40880p6305K94255
$$ -152501 253280 -70356 113132 252669 121249 -84524 350227 209347 133042 427297
17224D27297F6620J06824N7010L8993B5906N1701L21584J06784C2939J26192p2433
$$ 427297 66620 173444 230454 269447 25906 77607 399191 505975 32939 159131 86698
17213H6698L71360B1792L41444L7000j35206H7872K12685A33973J37500O3303
$$ 86698 458058 21792 363236 400236 265030 87872 300557 133973 271473 334776
17203C34776D0997J38939E3997K45198N6753J16047i739A14675a47188A43903
$$ 334776 40997 179936 53997 299195 355948 471995 -9739 114675 -147188 143903
17192A882K69338P60A34986N130K10820Q303j73372J22320m8040O9398G1880L24394
$$ 1882 271220 271980 134986 140116 350936 359239 185867 308187 260147 329545 71880 396274
17180C96274j42680m6312a27491F6808j9767O690N1697J53960J46721I7138K69673
$$ 396274 253594 207282 -127491 66808 47041 53731 105428 259388 406109 97138 366811
17169C66811n3964A51656J81000A11193j1569h6497C61486A63933J95256q5352
$$ 366811 312847 151656 332656 111193 99624 -86497 361486 163933 359189 273837
17159B73837E8199P9604J64194L9937A60086L23468B09087j1257K7973J64225
$$ 273837 58199 137803 301997 341934 160086 483554 209087 197830 225803 390028
17149C90028J41584A25388J95772K61905J8532j64656I117K41386Q33o0439e7514
$$ 390028 531612 125388 321160 583065 601597 436941 9117 250503 251336 190897 -57514
17137C05202F5188L07204a04597c1689A56536M07712A09759K63791f5030C23434
$$ 305202 65188 372392 -104597 -31689 156536 564248 109759 373550 -65030 323434
17126B89191q3144F1401K8486M51813AL04296K0600K73555B36213o3280K11960
$$ 289191 206047 61401 89887 541700 1 304297 324897 598452 236213 172933 384893
17115C84893q1750n2924J51020L597J45519H0457L20826O8369k8421k18354K51422
$$ 384893 303143 250219 401239 404836 550355 80457 401283 469652 441231 222877 474299
17104D74299A05104J13124J27212m3175j5374j17785K79830p6061j02281K96846
$$ 474299 105104 218228 345440 302265 286891 169106 448936 372875 270594 567440
17094E67440A15450N884J22461L43037B79288J36542j49543r9377m3146K73703
$$ 567440 115450 121334 243795 586832 279288 415830 266287 166910 123764 397467
17084C97467J55250m7675m4343I5818K21231K07485N0435B44752J50724M9226
$$ 397467 552717 505042 460699 95818 317049 524534 574969 244752 395476 444702
17074D44702f3943F46004l2780m8476B53100K8577L11016k71692j28383K62044
$$ 444702 -63943 646004 613224 564748 253100 281677 592693 321001 192618 454662
17064D54662I1913K70986N6965a10555A82537M62175B44241J07765K93677k54743
$$ 454662 91913 362899 419864 -110555 182537 644712 244241 352006 645683 390940
17054C90940j02967D849O41086p1604j80125K49493k89885R3779N3471j4884J26116
$$ 390940 287973 4849 645935 574331 394206 643699 353814 447593 501064 486180 612296
17043F12296K5686k43336M7780J83962n1293j39678j99364M23308r753B92544
$$ 612296 637982 394646 442426 626388 575095 435417 236053 659361 649608 292544
17032C73842P8487j66983K80879J10627O4308R6895m11939O30709n26205j09739
$$ 373842 452329 285346 566225 676852 741160 838055 426116 1056825 530620 420881
17022D20881K34406k38730j399m1118M01204Q410l33340J85064L773Q8954l46121
$$ 420881 655287 416557 415158 374040 775244 783654 450314 635378 639151 728105 381984
17011C81984n2818O92647C94296L11254j98310J35095K63057l02105j48303K8108
$$ 381984 329166 1021813 394296 705550 507240 642335 905392 603287 454984 483092
17001D83092J73433J37811k22261O473J16491r6968q3446p7581L00625Q1686j31987
$$ 483092 656525 794336 572075 578548 695039 598071 514625 437044 737669 819355 687368
16990F87368L07153j46066l33136K47783k04772K10980j71733J12212R7393l01061
$$ 687368 994521 848455 515319 763102 558330 769310 597577 709789 807182 506121
16980E06121J44832O6276k04000L14261k78993l0205P4121J35191o876n9693M1939
$$ 506121 650953 717229 513229 827490 548497 518292 592413 727604 720728 661035 702974
16969G02974L36447k83139p1376P8308J05642K4736k23347L04273J27062r8206
$$ 702974 1039421 756282 684906 763214 868856 893592 670245 974518 1101580 1003374
16959A003374j57856K59080n06073J7383J58025N5722P7226J15197j60777J8216
$$ 1003374 845518 1104598 598525 615908 773933 829655 906881 1022078 861301 879517
16949H79517j40147l9855J02469K99180l9722l86210M1997J30257L18522j03367
$$ 879517 739370 699515 801984 1101164 1061442 675232 717229 847486 1166008 1062641
16939A062641R3036j83183J5230J78073L3067q2312j85716P9538j83559L14894
$$ 1062641 1155677 972494 987724 1165797 1198864 1116552 930836 1010374 826815 1141709
16929A141709l0908k626J16113j63682Q426P8444J16797l05147M36449k74316
$$ 1141709 1110801 1108175 1224288 1060606 1069032 1147476 1264273 959126 1395575 1121259
16919A121259p8301K76511n3454l42056J93301K28561k33564K62571j50554k0263
$$ 1121259 1042958 1319469 1266015 923959 1117260 1345821 1112257 1374828 1224274 1204011
16909A204011K28347k05341o9525L09360P7026k63229P0838J63926q4168j79398
$$ 1204011 1432358 1227017 1157492 1466852 1543878 1280649 1351487 1515413 1431245 1251847
16899A251847L21948N1759k39369L13722m53261L17248l0113L84017k27614k06438
$$ 1251847 1573795 1625554 1386185 1699907 1246646 1563894 1533781 1917798 1690184 1483746
16889A483746L35182q4184j0539k4041J57577k26849J70818j73243J20043k17166
$$ 1483746 1818928 1734744 1724205 1700164 1857741 1630892 1801710 1628467 1748510 1531344
16879A531344N34899l23991J5359K87658q9884k2347k67471K42297O0701K55589
$$ 1531344 2066243 1742252 1757611 2045269 1955385 1933038 1665567 1907864 1968565 2224154
16869B224154o280o3287K09801l12102K02309O4721j66455L0713K20363p2880
$$ 2224154 2217874 2154587 2364388 2052286 2254595 2319316 2152861 2183574 2403937 2331057
16859B331057Q9004m9364J48814J70638o8432r4795J46949j20845M75841k35627
$$ 2331057 2420061 2370697 2519511 2690149 2621717 2526922 2673871 2553026 3028867 2793240
16849B793240P8294O794N0977J74576j70120M13416j39780l25654L81293J46463
$$ 2793240 2871534 2878328 2929305 3103881 2933761 3347177 3207397 2881743 3263036 3409499
16839C409499k94779J22473K98307O4658j20753J22593L70317m60314K41136k23167
$$ 3409499 3114720 3237193 3535500 3600158 3479405 3601998 3972315 3512001 3753137 3529970
16829C529970J74877L30773j22049O0999K86065K21415n7226o7968o4952M59417
$$ 3529970 3704847 4035620 3913571 3974570 4260635 4482050 4424824 4356856 4291904 4751321
16819D751321l3580J51629J3016J02544J85693j32076L0140p9961K31574J75577
$$ 4751321 4717741 4869370 4882386 4984930 5170623 5038547 5068687 4988726 5220300 5395877
16809E395877K51720j7202K79114k82372M35770J04832M22826n03697M25607Q50471
$$ 5395877 5647597 5630395 5909509 5627137 6062907 6167739 6590565 6086868 6512475 7362946
16799G362946j45540O0524K23939J19363n4860K49114K93497J15051M42605p7707
$$ 7362946 7217406 7277930 7501869 7621232 7566372 7815486 8108983 8224034 8666639 8588932
16789H588932L98482J69641L3535K66013K54642M78337K63952L73610K69544N35517
$$ 8588932 8987414 9157055 9190590 9456603 9711245 10189582 10453534 10827144 11096688 11632205
16779A1632205K70626M73781M12697j71255Q72104N35924K21679N84491L82661
$$ 11632205 11902831 12376612 12789309 12618054 13490158 14026082 14247761 14832252 15214913
16770A5214913O94123M30606K46850Q24479P58022O06363L39798J079632L58130
$$ 15214913 15909036 16339642 16586492 17410971 18168993 18775356 19115154 20194786 20552916
16761B0552916J123801R24214P91137J238650J018493Q94408J354174J222973
$$ 20552916 21676717 22600931 23392068 24630718 25649211 26543619 27897793 29120766
16753B9120766J409097J622484J262845J702848J647134K105248J980162K074917
$$ 29120766 30529863 32152347 33415192 35118040 36765174 38870422 40850584 42925501
16745D2925501K296451K547810K340036L060743K934893L614205L409729L605527
$$ 42925501 45221952 47769762 50109798 53170541 56105434 59719639 63129368 66734895
16737F6734895M291859M279383M947534M957499N030908O062023N798512O007353
$$ 66734895 71026754 75306137 80253671 85211170 90242078 96304101 102102613 108109966
16729A08109966P040543O814172P056799O946534O914266P049036O750829O416264
$$ 108109966 115150509 121964681 129021480 135968014 142882280 149931316 156682145 163098409
16721A63098409N511871M405918L766445K457631J299257q163j456541k667087
$$ 163098409 168610280 173016198 176782643 179240274 180539531 180531368 179074827 176407740
16713A76407740l774814m967512n602503o099828o845755p161849p300927p243671
$$ 176407740 172632926 167665414 162062911 155963083 149117328 141955479 134654552 127410881
16705A27410881o937381p064342o941954o421006n946240n871619n431067n036050
$$ 127410881 120473500 113409158 106467204 100046198 94099958 88228339 82797272 77761222
16697G7761222m637516m462773m134649l660920l464377l411377k654048k953041
$$ 77761222 73123706 68660933 64526284 60865364 57400987 53989610 51335562 48382521
16689D8382521k805747k024227k775669j864035k379331j394764j866956j656177
$$ 48382521 45576774 43552547 40776878 38912843 36533512 35138748 33271792 31615615
16681C1615615j332682j749899j075616j170607r31123j411969q77644j063793
$$ 31615615 30282933 28533034 27457418 26286811 25355688 23943719 23066075 22002282
16673B2002282r02987j213336m01452j088896p25264R5292q01123j213420k27525
$$ 22002282 21099295 19885959 19484507 18395611 17670347 17765639 16964516 15751096 15523571
16664A5523571m68759o34021n59938o53180k88081j38618r11765q0369o52012
$$ 15523571 15054812 14420791 13860853 13207673 12919592 12780974 11869209 11788840 11136828
16655A1136828m4785l00169l59230o17536j51976l56051j44787m47246j20383
$$ 11136828 11092043 10791874 10432644 9815108 9663132 9307081 9162294 8715048 8594665
16646H594665N0956l72826j21417n80690o4685l64728K6502k29986m19436L07302
$$ 8594665 8645621 8272795 8151378 7570688 7506003 7141275 7167777 6937791 6518355 6825657
16636F825657m13784K5362k47537j44250m39632L80021q57301J9603J21356l15963
$$ 6825657 6411873 6437235 6189698 6045448 5605816 5985837 5128536 5148139 5269495 4953532
16626D953532J93323k13457M581P8349n26920j16257J7267r6669k51354L10833
$$ 4953532 5146855 4933398 4937979 5016328 4489408 4373151 4390418 4293749 4042395 4353228
16616D353228k01355p181l59415O7551m2103k01791r3427J65564j11302q6988
$$ 4353228 4151873 4144692 3785277 3852828 3810725 3608934 3515507 3681071 3569769 3482781
16606C482781j48252K91532j05443n65521J45819J91873k14389N0039k84069q3760
$$ 3482781 3334529 3626061 3520618 2955097 3100916 3292789 3078400 3128439 2844370 2760610
16596B760610j16650J90804l38178K07004q5014J06496R8182k84215J09966j61450
$$ 2760610 2643960 2834764 2496586 2703590 2618576 2725072 2823254 2539039 2649005 2487555
16586B487555l8201R8133k71805L61082l81627l09704J12168J25438q6849p0181
$$ 2487555 2449354 2547487 2275682 2636764 2255137 1945433 2057601 2183039 2096190 2026009
16576B026009o1046Q5489l01850L84248l60323J52097l21097M33166q600m38582
$$ 2026009 1964963 2050452 1748602 2132850 1772527 1924624 1603527 2036693 2028093 1589511
16566A589511m4088j24623J35919L4674J38500k11627o3344J53708j11627J18814
$$ 1589511 1545423 1420800 1556719 1591393 1729893 1518266 1454922 1608630 1497003 1615817
16556A615817j13480k4090J16836m2988j65228J62564n483l66567J06862R8609
$$ 1615817 1502337 1478247 1595083 1552095 1386867 1549431 1543948 1177381 1284243 1382852
16546A382852L0915j75383l50178N76501l9221k44042j67688j68111L29876R1176
$$ 1382852 1413767 1238384 888206 1464707 1425486 1181444 1013756 845645 1175521 1266697
16536A266697m86702L98791j30456l2897k0263k8432J23880k09842m3523j5070
$$ 1266697 779995 1178786 1048330 1015433 995170 966738 1090618 880776 837253 822183
16526H22183N98112o01184L14033q3598k54495R6028l4971J78774k90908J14334
$$ 822183 1420295 819111 1133144 1049546 795051 891079 856108 1034882 743974 858308
16516H58308J62936O3884k19359k8355o8843J90180k7591q1566K3735J6840j9239
$$ 858308 1021244 1085128 865769 837414 768571 958751 931160 849594 873329 890169 870930
16505H70930j41199K05458k6090l08334P7583K05668K6310j70607m4084J80383
$$ 870930 729731 935189 909099 600765 678348 884016 910326 739719 695635 876018
16495H76018l27565L65804k66341J22314R4323M875m2475m9007J3647n6067K2337
$$ 876018 548453 914257 647916 770230 864553 869428 826953 777946 791593 735526 757863
16484G57863k02587K56614l92147M38322k72163q8914r3809K05037j14059K99287
$$ 757863 555276 811890 419743 858065 585902 496988 403179 608216 494157 793444
16474G93444k59041k41506J83529n7929K67450n7129k02859P0381O0243j81639
$$ 793444 534403 292897 476426 418497 685947 628818 425959 496340 556583 374944
16464C74944O87110n01086B29646K62351k06971K79979j78208J60849k6802m8022
$$ 374944 1062054 560968 229646 491997 285026 565005 386797 547646 520844 472822
16454D72822J25073q9427p5086j36845L18658j29422J2440j76695N3631J32090
$$ 472822 597895 508468 433382 296537 615195 485773 498213 321518 375149 507239
16444E07239k30702L25169k13694K13818j31382Q3996B59417O6979A53641J07505
$$ 507239 276537 601706 388012 601830 470448 554444 259417 326396 153641 261146
16434B61146J52194q1311J08010k18308o3723n353Q0262L95353j91147K18622
$$ 261146 413340 332029 440039 221731 158008 152655 232917 628270 437123 655745
16424F55745K9665k75996N4513N6686j89218o1678J84220j05584A39261M30916
$$ 655745 685410 409414 463927 520613 331395 269717 453937 348353 139261 570177
16414E70177O7389F0009L98420j08035M7452Q0876A85862J95024A04040j7886
$$ 570177 637566 60009 458429 350394 397846 478722 185862 380886 104040 86154
16404H6154J20034L94030A50836L66863k55253k4378J15390A54896B6538J93322
$$ 86154 206188 600218 150836 517699 262446 238068 353458 154896 26538 219860
16394B19860K83319J29621n9736B07551C6465K43179J92985C8440L41927K17864
$$ 219860 503179 632800 573064 207551 36465 279644 472629 38440 380367 598231
16384E98231B40297k7644K84644C9069J18535A6663R915J08065L33037K2202k16042
$$ 598231 240297 212653 497297 39069 157604 16663 26578 134643 467680 489882 273840
16373B73840J47428A58482L67523d643B92032A05477J32447L9957O6781A54337
$$ 273840 421268 158482 526005 -4643 292032 105477 237924 277881 344662 154337
16362C04084n8599j13706L6678R2187H3451k8778K13801D2605J04053a10061F26034
$$ 304084 245485 131779 168457 260644 83451 54673 268474 42605 146658 -110061 626034
16350I4097J25858c3119D15251j68315a52389A38333Q9377K35936a35998A94816
$$ 94097 219955 -33119 415251 246936 -152389 138333 227710 463646 -135998 194816
16339C44049A15415J20164N8206j3247F4361J49871C9547d8621I2367K01184D0728
$$ 344049 115415 235579 293785 280538 64361 214232 39547 -48621 92367 293551 40728
16327B03192J18081o6021I0599C9259N4063D5458N6488L1765J74917p8617c103
$$ 203192 321273 255252 90599 39259 93322 45458 101946 133711 308628 230011 -3103
16315H5853d5914D11465j17174r2510o1649n7826j1314N0579n8432R0188K4351
$$ 85853 -45914 411465 294291 201781 140132 82306 70992 121571 63139 153327 177678
16304A77678K50821I0075J49596F4452K7921C0741j0736K93955j1683F4167P2270
$$ 177678 428499 90075 239671 64452 92373 30741 20005 313960 302277 64167 136437
16293A36437J58835C7141a48135A2016L7444K12862F8993J76374J00010B6066
$$ 136437 295272 37141 -148135 12016 49460 262322 68993 245367 345377 26066
16282I999f9392m693A43098P5265c5481k13528A81032b9639A45732c37615d7527
$$ 9999 -69392 -74085 143098 218363 -35481 -249009 181032 -29639 145732 -337615 -47527
16270A73900g5481B03859E9078e3052B77605e7519k47469D31790B11102b9542
$$ 173900 -75481 203859 59078 -53052 277605 -57519 -304988 431790 211102 -29542
16259C45113b87733E1571f5145A74228O1611f9895E1783b60892J23893B46879
$$ 345113 -287733 51571 -65145 174228 235839 -69895 51783 -260892 -136999 246879
16248d0677J9483A15527Q5844K18222a38736A57254o3035j014l8f3181A30269
$$ -40677 -21194 115527 201371 419593 -138736 157254 94219 93205 93167 -63181 130269
16236B12512K04077b0479A92955O5064A19521N417O1958G1780K18440e0771A48376
$$ 212512 416589 -20479 192955 258019 119521 124938 186896 71780 290220 -50771 148376
16224i945A62489G4190b42908d7540q359i439E30260d8705q5640I0214O4806a5733
$$ -9945 162489 74190 -242908 -47540 -55899 -9439 530260 -48705 -134345 90214 155020 -15733
16211E1615J49834n1429f2834H7481B4815b74699J01323A12338O7610B9849d9494
$$ 51615 201449 150020 -62834 87481 24815 -274699 -173376 112338 179948 29849 -49494
16199a48604D13387C3794J13123g6444n7746A89455B0742K3715c98735e6571j33856
$$ -148604 413387 33794 146917 -76444 -134190 189455 20742 44457 -398735 -56571 -190427
16188a90427E8842b60132B56641j1227p1320a61357p6553F983b29049B16177a00919
$$ -190427 58842 -260132 256641 245414 174094 -161357 -237910 6983 -229049 216177 -100919
16176C5048e5210K2374f318A3550M0848a63041L4108K7605C28980a48645a5467
$$ 35048 -55210 -32836 -6318 13550 54398 -163041 -128933 -101328 328980 -148645 -15467
16164A09020j096a37001f4295L1148G4787A8362b56564B22931D6218b5290I2766
$$ 109020 107924 -137001 -64295 -33147 74787 18362 -256564 222931 46218 -25290 92766
16152I4300l6918h1221H6313b2445j37149A16758b66204A07656f5009D6714B430
$$ 94300 57382 -81221 86313 -22445 -159594 116758 -266204 107656 -65009 46714 2430
16140B00024i430A12674a02827c3430m8432C93382a15358D9414g9183J4694A87826
$$ 200024 -9430 112674 -102827 -33430 -81862 393382 -115358 49414 -79183 -64489 187826
16128a89872h9164M1139D1114C452J11473R9395g2339A28688A3855J22510e0323
$$ -189872 -89164 -48025 41114 3452 114925 214320 -72339 128688 13855 136365 -50323
16116G9811f3129B27609J31003a5406A50355B1860a03117B06515h2774p0097n8882
$$ 79811 -63129 227609 358612 -15406 150355 21860 -103117 206515 -82774 -152871 -211753
16105b11753C19489d65375C76722A10518a88163A68131E6328O1795E4888j1056
$$ -211753 319489 -465375 376722 110518 -188163 168131 56328 118123 54888 43832
16095D3832c83637J31570A48896k2366c6750r4083l6384A21622J13229F5897h5315
$$ 43832 -383637 -252067 148896 126530 -36750 -130833 -167217 121622 234851 65897 -85315
16083a04702A46134g3637k84064a71827A21915a28251l4821B4742L21582a01069
$$ -104702 146134 -73637 -357701 -171827 121915 -128251 -163072 24742 346324 -101069
16072i7020G6762j4498e2532A17929K3570a6964k39526Q3911A85177D3800J24096
$$ -97020 76762 62264 -52532 117929 141499 -16964 -256490 -172579 185177 43800 167896
16061A67896B6959R2925j0203h7606A11857A8282J7146e4104J7911j9620k46323
$$ 167896 26959 119884 109681 -87606 111857 18282 35428 -54104 -36193 -55813 -302136
16050c02136D7077c8052A00551l9373b81642a20933j47666C2362a04152c005j62165
$$ -302136 47077 -38052 100551 61178 -281642 -120933 -268599 32362 -104152 -3005 -165170
16039a65170k9239j32864D8725a20446A8075K0122K0627O1757J73422D2758J54705
$$ -165170 -194409 -327273 48725 -120446 18075 38197 58824 120581 294003 42758 197463
16028A97463b04432f976o28039a21358R061m8997k15877A17146n5185a14682j00344
$$ 197463 -204432 -6976 -635015 -121358 -112297 -161294 -377171 117146 61961 -114682 -215026
16017b15026B78310j30382J9514p2489g3580o8435K5854B28200f857j92144n4217
$$ -215026 278310 147928 167442 94953 -73580 -142015 -116161 228200 -6857 -199001 -253218
16006b53218a7376A42950a76662B03417m0101o9835J95968a35550K0071m1827
$$ -253218 -17376 142950 -176662 203417 163316 93481 289449 -135550 -115479 -157306
15996a57306A41720n7473b9969j50907M2692G9130O8481c0583k1159B7178K7052
$$ -157306 141720 84247 -29969 -180876 -138184 79130 147611 -30583 -51742 27178 54230
15985E4230c9901j52074C99074P7595K5743j80442F9945c9176E3823L86620G5880
$$ 54230 -39901 -191975 399074 476669 502412 321970 69945 -39176 53823 440443 75880
15973A00664J08612a13633r9466j80399a05295A34440Q5740D8224f8440h813o1827
$$ 100664 209276 -113633 -213099 -393498 -105295 134440 220180 48224 -68440 -8813 -70640
15962g0640A00414l7896a54949f0473a7883C75117b51604j7284f3477k73777J15281
$$ -70640 100414 62518 -154949 -60473 -17883 375117 -251604 -268888 -63477 -337254 -221973
15951b21973J8785F214J4305q667J03178J31162A22985b9610j42732m9854G7994
$$ -221973 -203188 6214 20519 11852 115030 246192 122985 -29610 -172342 -222196 77994
15939C9736b14945a00933q2527C61231e8927B7791a60551l3775B22312I994d5947
$$ 39736 -214945 -100933 -183460 361231 -58927 27791 -160551 -194326 222312 9994 -45947
15927B3075a29791L3709j52601A3279b53100F0062e0937A9585a44174K0564B18302
$$ 23075 -129791 -96082 -248683 13279 -253100 60062 -50937 19585 -144174 -123610 218302
15915A1395b07490N7017j3559n346C85435c75693g0757A31926l262b33877B96991
$$ 11395 -207490 -150473 -164032 -169378 385435 -375693 -70757 131926 128664 -233877 296991
15903I7889e0141k4447A42454b44343J11786A97620b18347G8184a21432K6671
$$ 97889 -50141 -74588 142454 -244343 -132557 197620 -218347 78184 -121432 -94761
15893i4761L8016A30908E6389A0323b1480B050J6056J29356R133B0840M9192b04410
$$ -94761 -56745 130908 56389 10323 -21480 2050 18106 147462 156595 20840 70032 -204410
15880B16112a62176A15557a24556B12583c50923C72161B3379J36252c5693G2855
$$ 216112 -162176 115557 -124556 212583 -350923 372161 23379 159631 -35693 72855
15869B7205b7784E7090Q1567D0851a74077b963k60042d2737o7468o8166e7802
$$ 27205 -27784 57090 138657 40851 -174077 -2963 -263005 -42737 -110205 -178371 -57802
15857c5016j19872M103j894k45856A53832M1469K24365a02572l2607j0741C2226
$$ -35016 -154888 -150785 -152679 -398535 153832 195301 419666 -102572 -135179 -145920 32226
15845c36658J37083r1980g680l08769j10171B82145D4553J98807A05914d6140
$$ -336658 -199575 -291555 -7680 -316449 -426620 282145 44553 243360 105914 -46140
15834E7025i2662l3433e4500A66297a96143q9294A50425i1764B32212b52977B30990
$$ 57025 -92662 -126095 -54500 166297 -196143 -285437 150425 -91764 232212 -252977 230990
15822B02476a40787f3860R516J2236o1955I6309g2205j31807d6413r1964q9448
$$ 202476 -140787 -63860 -54344 -42108 -104063 96309 -72205 -204012 -46413 -138377 -227825
15811b27825B1011a55369M1068j04697B37437K37o8113b98514d4799k4978j96166
$$ -227825 21011 -155369 -114301 -218998 237437 237674 169561 -298514 -44799 -69777 -265943
15800b65943J02527o0475H7312d19063J22497P4702g7030D2609J32438i7487o4344
$$ -265943 -163416 -223891 87312 -419063 -296566 -221864 -77030 42609 175047 -97487 -161831
15789a61831q8216P2612L3051A31951k4589c12064A0599Q0299P6448g9808G5832
$$ -161831 -250047 -177435 -144384 131951 107362 -312064 10599 90898 167346 -79808 75832
15777C12526H7206k0617a1509k29448A33003b31130A33500b28812a5949C34565
$$ 312526 87206 66589 -11509 -240957 133003 -231130 133500 -228812 -15949 334565
15766b39254f7393G9470b7394j30195B09017r4796K09047a7618C2260N9244C5918
$$ -239254 -67393 79470 -27394 -157589 209017 114221 323268 -17618 32260 91504 35918
15754a6186B34J23391j0493q421b90942A37092O5713C9649d6963k07789F7138
$$ -16186 234 123625 113132 104711 -290942 137092 202805 39649 -46963 -254752 67138
15742A2835a67999B11347a35284A12737b47520f6574G3013a76666c370j65353
$$ 12835 -167999 211347 -135284 112737 -247520 -66574 73013 -176666 -3370 -168723
15732a68723j19025m8266C25109A29457J42520h6241q2191C344i7234r789o7635
$$ -168723 -287748 -336014 325109 129457 271977 -86241 -168432 3344 -97234 -107023 -174658
15721a74658B91950A10662J09307c6890j0102j65383b1333j07747H5076K01691
$$ -174658 291950 110662 219969 -36890 -46992 -212375 -21333 -129080 85076 286767
15711B86767c93647J92604m7198j00908A01128D9237J58698c8248A23651j034
$$ 286767 -393647 -201043 -248241 -349149 101128 49237 207935 -38248 123651 122617
15701A22617I581h9223j18346A88795C1356L8753a89377A035J23636c8278D74065
$$ 122617 9581 -89223 -207569 188795 31356 70109 -189377 1035 124671 -38278 474065
15689a15981A19138N5120O5928b54464J15301A0047b13893A88751f4204j35328
$$ -115981 119138 174258 240186 -254464 -139163 10047 -213893 188751 -64204 -199532
15679a99532i1479A25745g831E4667j350e0374B72696j27527f8552C80286d9963
$$ -199532 -91479 125745 -7831 54667 53317 -50374 272696 145169 -68552 380286 -49963
15667d705k44671O9476J9662o5452J3051A27795M8275g849A03193a63895e0944
$$ -4705 -249376 -179900 -160238 -225690 -212639 127795 176070 -7849 103193 -163895 -50944
15655b59251h356D0801J1102k1656a51242d5238j60457f591j9884B44450J87628
$$ -259251 -8356 40801 51903 30247 -151242 -45238 -205695 -6591 -26475 244450 432078
15644D32078A47643d7790m5594L2053b6467m495r3092E5733J30857o4113d1101
$$ 432078 147643 -47790 -93384 -61331 -26467 -30962 -124054 55733 186590 122477 -41101
15632B17720m6961b36847B9135E552h9808A96822d41574J32879a15634I210J84379
$$ 217720 170759 -236847 29135 5552 -89808 196822 -441574 -308695 -115634 9210 193589
15621A93589a0571k3932k56279B98748n2944F4768J8806B981M7223h1161E0242
$$ 193589 -10571 -34503 -290782 298748 245804 64768 83574 2981 50204 -81161 50242
15609H2155d02309a46027I821a85925B52394a4038k28958M7504j52074f7062A82603
$$ 82155 -402309 -146027 9821 -185925 252394 -14038 -242996 -195492 -347566 -67062 182603
15597a20335j26470E1674M5321c9962k56306A7464R1439a12120A62500M3850E1999
$$ -120335 -246805 51674 96995 -39962 -296268 17464 108903 -112120 162500 206350 51999
15585f2230G9683R159a45468f1695G8451a1769j7460j40061B26778b6815A07655
$$ -62230 79683 88842 -145468 -61695 78451 -11769 -29229 -169290 226778 -26815 107655
15573b05045j30888D1475J73639c53429a20245a5330n4381n9429A1560b91547
$$ -205045 -335933 41475 215114 -353429 -120245 -15330 -69711 -129140 11560 -291547
15562A31885b71746k4010A31012B8415C495f1985c458p842C5650J16377D5821
$$ 131885 -271746 -295756 131012 28415 3495 -61985 -3458 -11300 35650 152027 45821
15550A86302m6298K28388b8316A74628l6746a0068B43660o1142B2874b46497a15179
$$ 186302 140004 368392 -28316 174628 137882 -10068 243660 182518 22874 -246497 -115179
15538d7050A35736K6066c4494j07559f8603q6865F7810f1458l9837B85234c00761
$$ -47050 135736 161802 -34494 -142053 -68603 -155468 67810 -61458 -101295 285234 -300761
15526a71274g3749a1901A35705b2603k21792c3703C8173J51164a4806A81579o3081
$$ -171274 -73749 -11901 135705 -22603 -244395 -33703 38173 189337 -14806 181579 118498
15515A18498m6378f2320r1060e9868A63464d9345I6798M3571d07749H5231c61657
$$ 118498 72120 -62320 -153380 -59868 163464 -49345 96798 140369 -407749 85231 -361657
15503C01509c95242F2251a1732k27686a17258M5121F8364J64693a24385A6168
$$ 301509 -395242 62251 -11732 -239418 -117258 -72137 68364 233057 -124385 16168
15492A33343a69012m412c9466D7577b8043A58986c34003a20613D0599J85646H2966
$$ 133343 -169012 -173424 -39466 47577 -28043 158986 -334003 -120613 40599 226245 82966
15480b65176B72813D7556J01472c27905f3471k71890a36280J7215a1459A78564
$$ -265176 272813 47556 149028 -327905 -63471 -335361 -136280 -119065 -11459 178564
15469d0585B06698a64187L0410e4321A58990L917i7710l2374k38520i86j92200
$$ -40585 206698 -164187 -133777 -54321 158990 162907 -97710 -130084 -368604 -986 -193186
15458a93186O8859C1587c081j71469F9957P4908d6561b832F5304b9614k65480
$$ -193186 -124327 31587 -3081 -174550 69957 144865 -46561 -2832 65304 -29614 -295094
15447b95094A8968J27181l49b52174K9356B14938E0341A7545a37062j55791J04982
$$ -295094 18968 146149 145800 -252174 -222818 214938 50341 17545 -137062 -292853 -187871
15436a87871B5656b73246A7993L81211e4193b671q2398M0750k2166j48616P0623
$$ -187871 25656 -273246 17993 399204 -54193 -2671 -85069 -44319 -66485 -215101 -144478
15425a44478K6259k80172A61167a15936I9276N6311a88080B9561P856R6661J66130
$$ -144478 -118219 -398391 161167 -115936 99276 155587 -188080 29561 37417 134078 300208
15414C00208A10057a07839A82319i1095n8024O184C9579Q4610c18528a14468A5478
$$ 300208 110057 -107839 182319 -91095 -149119 -142935 39579 124189 -318528 -114468 15478
15402B30331k7647c2405k11905P5389A14089b664B19959d1523r3619C44213b2150
$$ 230331 202684 -32405 -244310 -168921 114089 -2664 219959 -41523 -135142 344213 -22150
15390b51327b0139B14419f3431B26276a93596A67688Q8244j20411M055M3939q1404
$$ -251327 -20139 214419 -63431 226276 -193596 167688 255932 135521 139576 183515 102111
15379A02111a04442n0293j31258D1882q103d5704n1872B2657A882J49672B2298
$$ 102111 -104442 -154735 -285993 41882 33779 -45704 -97576 22657 1882 151554 22298
15367E0240K08693B1555a56429E6049b63450J14080B02751d6586A64569C8466
$$ 50240 258933 21555 -156429 56049 -263450 -149370 202751 -46586 164569 38466
15356h3775k3241h115m9795C2031J23385H570h2584K9885a8507k51494m170B07417
$$ -83775 -107016 -8115 -57910 32031 155416 8570 -82584 -52699 -18507 -270001 -274171 207417
15343g1875C70845b4294k06420A06112A4494K0716j7423J69507b6321B80127G096
$$ -71875 370845 -24294 -230714 106112 14494 35210 17787 187294 -26321 280127 7096
15331a06474C4354Q0170L7996g670j35563B64245a67079e7564j85658A0487L25640
$$ -106474 34354 114524 152520 -7670 -143233 264245 -167079 -57564 -243222 10487 336127
15320C36127g6550I8601i2787E8972M7981K9174J4541k7742i6655L811C6576r94
$$ 336127 -76550 98601 -92787 58972 106953 136127 150668 122926 -96655 -92844 36576 35582
15308C5582R3945J30798B0675G472B759K21507D2156M704a16510n2147C22354
$$ 35582 129527 260325 20675 7472 2759 224266 42156 46860 -116510 -168657 322354
15296G183c23885a13529A65399m9475l8190C7761L1325J67563H0781F536a39277
$$ 7183 -323885 -113529 165399 115924 77734 37761 69086 236649 80781 6536 -139277
15284A02285K93118a16628F5387P9510a38080N6462E8288f273A8985K01415a32283
$$ 102285 395403 -116628 65387 144897 -138080 -81618 58288 -6273 18985 220400 -132283
15272a74545b8597K055A69947k5252e0700j2257I1804L17039a41665E7053i7102
$$ -174545 -28597 -26542 169947 144695 -50700 -62957 91804 408843 -141665 57053 -97102
15260A99029F889g7151E2880N3708m2589R6453l8505c4544B26598H2627J71254
$$ 199029 6889 -77151 52880 106588 63999 160452 121947 -34544 226598 82627 253881
15249B53881K82758N29342J78545n15400J00570k55635G0817O4511k8986D9874
$$ 253881 536639 1065981 1244526 729126 829696 574061 70817 135328 106342 49874
15238G4363J95300J42922A8956r156J31284M6400Q9419g214A21131B7647N0658
$$ 74363 269663 412585 18956 9800 141084 187484 276903 -7214 121131 27647 78305
15227G8305h0758K0962B24491a50877B80721J1145j3634g4633F6911A1997K66206
$$ 78305 -80758 -59796 224491 -150877 280721 291866 278232 -74633 66911 11997 278203
15216B78203A12499c40133A1983c53A88895b70267o2378a62140A15176a37268
$$ 278203 112499 -340133 11983 -353 188895 -270267 -332645 -162140 115176 -137268
15205B07274b75524A07410M5272o4873M8555K968a71683D8650c31554A2058a1705
$$ 207274 -275524 107410 152682 87809 136364 139332 -171683 48650 -331554 12058 -11705
15193A57468i5527M592D17336c1845p9228c0324l1898B04865E3225N5656C1617
$$ 157468 -95527 -90935 417336 -31845 -111073 -30324 -62222 204865 53225 108881 31617
15181A34926b57025A99384C7920a32093E883k327g7059C2957g7020C4394K9732
$$ 134926 -257025 199384 37920 -132093 5883 3556 -77059 32957 -77020 34394 64126
15170F4126o196Q130J46319B5199J35111d0441C30482a83744n6804N8247A14892
$$ 64126 57930 66060 212379 25199 160310 -40441 330482 -183744 -240548 -182301 114892
15158A6132b0610B33013k5903p9296a39632H3298b7594F6241L7250a8821H3012
$$ 16132 -20610 233013 207110 127814 -139632 83298 -27594 66241 103491 -18821 83012
15146H5401J06158l071A10J19491L6560n139B7076L96762k08948B3178L34831
$$ 85401 191559 188488 110 119601 156161 151022 27076 423838 214890 23178 358009
15135C58009j49024j7206C3903M3246a24337B27700H453K13754O167c4604F4957
$$ 358009 208985 191779 33903 77149 -124337 227700 8453 222207 228374 -34604 64957
15123B20478j4750a60740C12788M371A01522O6235f3867k2838l2249B49599a53464
$$ 220478 205728 -160740 312788 317159 101522 167757 -63867 -86705 -118954 249599 -153464
15111a33171M442H0970b39091B21119a44497f2346A59357J13799d7701D7762J82844
$$ -133171 -128729 80970 -239091 221119 -144497 -62346 159357 273156 -47701 47762 230606
15100B30606b81635l306B22362K20859C5967G751K05925H7544a7123k19853K3498
$$ 230606 -281635 -284941 222362 443221 35967 7751 213676 87544 -17123 -236976 -213478
15089b13478A74535m0684K34279h9596L8522A83774d7259A38301M4569d4564A16529
$$ -213478 174535 133851 368130 -89596 -51074 183774 -47259 138301 182870 -44564 116529
15077B11731p5552B3603K94509H1251R4789O6909a20106B5513P2987a33096D0250
$$ 211731 136179 23603 318112 81251 176040 242949 -120106 25513 98500 -133096 40250
15065B6004K60408A31863G548O2331L11615C2884j1602b5021A08163k8074J89114
$$ 26004 286412 131863 7548 69879 381494 32884 21282 -25021 108163 80089 269203
15054B69203F2058J19290K3955l1855J2881L6775e2104D86797A4571L09344j19839
$$ 269203 62058 181348 205303 173448 186329 223104 -52104 486797 14571 323915 204076
15043B04076A4381J2176J34459J98599H2231K71066p4036Q0825b7847q41G2626
$$ 204076 14381 26557 161016 359615 82231 353297 279261 360086 -27847 -28688 72626
15031B81962c6780B1816K35832K6437a92463B36783R7672A57335F2862C552L44744
$$ 281962 -36780 21816 257648 284085 -192463 236783 334455 157335 62862 3552 348296
15020C48296a1128C5416a3186E25252k43253j37887K06742A47438a39179E18827
$$ 348296 -11128 35416 -13186 525252 281999 144112 350854 147438 -139179 518827
15009B37836a75382A92144j7278C6750Q1453D0748N5613N0695k7197e3457C05744
$$ 237836 -175382 192144 174866 36750 118203 40748 96361 147056 119859 -53457 305744
14997A75350k507J21073j42850f6750C19552n0520j10755p032K98708I2711j3345
$$ 175350 172843 293916 151066 -66750 319552 269032 158277 151245 449953 92711 79366
14986G9366i1756A17941J59615a44594B40141J55725A49443J6502O2850m4458
$$ 79366 -91756 117941 277556 -144594 240141 395866 149443 165945 228795 184337
14976A84337J92740p5614l2207P8052o1887D6737L66189j30463R5576G5610M4426
$$ 184337 377077 301463 269256 347308 285421 46737 412926 282463 378039 75610 120036
14965A20036J42054D2210R2335N3826K95155B31226c7973B14340A8063a61459
$$ 120036 262090 42210 134545 188371 483526 231226 -37973 214340 18063 -161459
14954D20473A83524h5053B19639R6321L4199r3282L80439A48529J8968P6664q2115
$$ 420473 183524 -85053 219639 315960 350159 256877 637316 148529 167497 244161 162046
14943A62046K09296p8827a12807I1728b4399D72546E7802j1986J34269a32588
$$ 162046 371342 292515 -112807 91728 -24399 472546 57802 45816 180085 -132588
14932B46951o3175j3298L8281m5773o4015J77074H8399J57854m2274D6692L09963
$$ 246951 183776 170478 208759 162986 98971 276045 88399 246253 203979 46692 356655
14921C56655j46084M05050k92408j53047j5493n5699j0660k9938J37214J98405
$$ 356655 210571 615621 323213 170166 154673 98974 88314 58376 195590 393995
14911C93995k5898j63907L10487a16035C30920r4944M71747l50677j64088r1682
$$ 393995 368097 204190 514677 -116035 330920 235976 707723 357046 192958 101276
14901A01276J16896K9314a41758B30173J4132q1699M8726J81222r4475l7165J19862
$$ 101276 218172 247486 -141758 230173 244305 162606 211332 392554 298079 260914 380776
14890C80776j10155r8990J80840J17066B31534K20313l9012B01326J41463p2869
$$ 380776 270621 171631 352471 469537 231534 451847 412835 201326 342789 269920
14880B69920a78281C06659A7425L28727G2414l0020K46421A31651l2433J8583
$$ 269920 -178281 306659 17425 346152 72414 42394 288815 131651 99218 117801
14870A17801J15922A10187L4529R3691J98575B09620K41365A71211J25618K08773
$$ 117801 233723 110187 144716 238407 436982 209620 450985 171211 296829 505602
14860E05602l8607K03254k62929J88230n3935A30466k6514J72977K24121A33361
$$ 505602 466995 670249 407320 595550 541615 130466 103952 276929 501050 133361
14849B67292l152M9280I3164Q2648K68136j08420j51254R0155k7149L03692B35323
$$ 267292 264140 313420 93164 175812 443948 335528 184274 274429 247280 550972 235323
14837F02253B82309N8881A6182K95151P3310o6067A49051L68065A66134J23699
$$ 602253 282309 341190 16182 311333 384643 318576 149051 517116 166134 289833
14827B89833J41881j56618R089D5899J74808L39408A38130J88269R2297k0052
$$ 289833 431714 275096 284185 45899 220707 560115 138130 326399 418696 398644
14817C98644j21145j14382J98835Q1031M4147n8352A39116O47043l11374q9587
$$ 398644 277499 163117 361952 442983 487130 428778 139116 786159 474785 385198
14807C85198O9068k00185J832L19542r5079p3818Q7510j60152P8920A39070J97808
$$ 385198 454266 254081 255913 575455 480376 406558 494068 333916 412836 139070 336878
14796C36878j15572M52526m3315m0074n7154k52249M64699C27502o8963n561N6538
$$ 336878 221306 673832 630517 590443 533289 281040 745739 327502 258539 252978 309516
14785C09516m5753A25282P39633D16171J0449k8356J09172r2121J14595m9044
$$ 309516 263763 125282 864915 416171 426620 398264 507436 415315 529910 480866
14775D80866J18993j0930B91644J47234J88180B89783J47704J32709j12261K89769
$$ 480866 599859 588929 291644 438878 627058 289783 437487 570196 457935 747704
14765G47704k97531L42144k45371j93432N0642K04575B08240J98476J01509k16093
$$ 747704 450173 792317 546946 353514 404156 608731 208240 406716 508225 292132
14755B92132M60154k27769o3140m2259Q9346Q6620l5718B33503K26630j7637M42034
$$ 292132 752286 524517 461377 419118 508464 595084 559366 233503 460133 442496 884530
14744H84530l08698K24794p3507k55740J84974j03366j2645n593l1043l8203O1063
$$ 884530 575832 800626 727119 471379 656353 552987 540342 534749 503706 465503 526566
14733E26566k11555J93244L11591n719l41250O6384r8835K12078P7520j95259
$$ 526566 315011 508255 819846 814127 472877 539261 440426 652504 730024 534765
14723E34765K01044l2014J96392C03885J28839j40488J73437J6797M59648j39896
$$ 534765 735809 703795 900187 303885 432724 292236 465673 482470 942118 802222
14713H02222k88139r6686K32796j64014K68485k83588J66882l9586J69840j52792
$$ 802222 514083 417397 650193 486179 754664 471076 637958 598372 768212 615420
14703F15420J25534Q4236J9053C39344P5352N13808m34261K06879P4934k409k64849
$$ 615420 740954 825190 844243 339344 414696 928504 494243 701122 776056 773647 508798
14692E08798J90568p8764K83599m35936L99512C99121N17555k81522O2874J15012
$$ 508798 699366 620602 904201 468265 867777 399121 916676 635154 698028 813040
14682H13040k42457L03864j60668r5107M36672k27844l3568l01880J27162L95654
$$ 813040 570583 874447 713779 618672 1055344 827500 793932 492052 619214 1014868
14672A014868J05696k81899K00221q8270k09713K24702j18633o1236K847J06541
$$ 1014868 1120564 838665 1038886 950616 740903 965605 846972 785736 788583 895124
14662H95124L07607r8433m30319j14509Q48018l20454k50270R2857o6150J53297
$$ 895124 1202731 1104298 673979 559470 1407488 1087034 836764 929621 863471 1016768
14652A016768j80410o3011J89614N8836p9883K46254l65864m836R9683N6142m1355
$$ 1016768 836358 773347 962961 1021797 941914 1188168 822304 817468 917151 973293 931938
14641I31938J29594j1079k0214j59612M16294m67611O01259m21733K71273J67878
$$ 931938 1061532 1050453 1030239 870627 1286921 819310 1420569 998836 1270109 1437987
14631A437987m18382P3383q3840R0187j36611J61976q3343n1138K58751R940j70166
$$ 1437987 1019605 1092988 1009148 1099335 962724 1124700 1041357 990219 1248970 1258910 1088744
14620A088744J85273n7426j66898J97624N1459q8368j72327Q65L52013O7719l58259
$$ 1088744 1274017 1216591 1049693 1247317 1298776 1210408 1038081 1038946 1390959 1458678 1100419
14609A100419R7647P8304l20745m7936N14140j81550L4847Q0640J99112l36854
$$ 1100419 1198066 1276370 955625 907689 1421829 1240279 1275126 1355766 1554878 1218024
14599A218024K38776M3017j61250M5732j52086Q159L48364k63377J47970j2523
$$ 1218024 1456800 1499817 1338567 1384299 1232213 1240372 1588736 1325359 1473329 1460806
14589A460806L891K26645j83482p4871J04962k09469J03748L07140p4267o198
$$ 1460806 1464697 1691342 1507860 1432989 1537951 1328482 1432230 1739370 1665103 1658905
14579A658905j11447K1926j60548J04440K17542q2055r6363K29339j76426J23169
$$ 1658905 1547458 1569384 1408836 1513276 1730818 1648763 1552400 1781739 1605313 1728482
14569A728482J63629j67123L14441k79884K85692k27755L46544j26973J61833
$$ 1728482 1892111 1724988 2039429 1759545 2045237 1817482 2164026 2037053 2198886
14560B198886J8471P9363K14477N21657n55348L33297R5695L59742J63173Q14374
$$ 2198886 2217357 2296720 2511197 3032854 2477506 2810803 2906498 3266240 3429413 4243787
14550D243787J132489K625111M800410Q521795J5874049l50212A7158137G647963
$$ 4243787 5376276 8001387 12801797 21323592 37197641 36847429 17158137 7647963
14541C033651r57074j28202l49410o3597k6339M17642j25928L8177k66186J69749
$$ 3033651 2076577 1948375 1598965 1535368 1509029 1926671 1800743 1838920 1572734 1742483
14531A742483J30988o583j54646P9833o9234K93518J54670q2219j03558M4266
$$ 1742483 1873471 1866888 1712242 1792075 1722841 2016359 2171029 2088810 1985252 2029518
14521B029518K07780k11107r951j20187M31500p5582M2319j59740K24182m0757
$$ 2029518 2237298 2026191 2016240 1896053 2327553 2251971 2294290 2134550 2358732 2317975
14511B317975j19119K08789L74622m64995J75054j29796q3501M10181m03735N9364
$$ 2317975 2198856 2407645 2782267 2317272 2492326 2362530 2279029 2689210 2285475 2344839
14501B344839j68031M02432M1504p8205K76372j26837j2641L48767J50288o91595
$$ 2344839 2176808 2579240 2620744 2542539 2818911 2692074 2679433 3028200 3178488 2486893
14491B486893M89829K3702j88005j4073M59236k51930m145q2051K71661j32231
$$ 2486893 2976722 3000424 2812419 2798346 3257582 3005652 3001507 2919456 3191117 3058886
14481C058886O0079j36945K56269k49036O60427m40311K12014j80799K71720p1729
$$ 3058886 3118965 2982020 3238289 2989253 3649680 3209369 3421383 3240584 3512304 3440575
14471C440575N7435J94246J9660r7820j07199L51627j62852J31534j30898r6000
$$ 3440575 3498010 3692256 3711916 3614096 3506897 3858524 3695672 3827206 3696308 3600308
14461C600308K67330K36654k90720L8304L88675j29084K1722o9506M35851M0348
$$ 3600308 3867638 4104292 3813572 3851876 4240551 4111467 4133189 4063683 4499534 4539882
14451D539882O4133q669J71113o2692j22015J13639j37886K12770L22056R571
$$ 4539882 4604015 4595346 4766459 4703767 4581752 4695391 4557505 4770275 5092331 5101902
14441E101902k48948K36494J25440m51133M87851J97305J5895m3849K76506K00100
$$ 5101902 4852954 5089448 5214888 4763755 5251606 5448911 5464806 5420957 5697463 5897563
14431E897563j73914r2013k47690N76906r0803N04222k31965Q9844K87776j78730
$$ 5897563 5723649 5631636 5383946 5960852 5870049 6374271 6142306 6232150 6519926 6341196
14421F341196Q5032j39629O65795l51781L50197L92181k15968j49885J23096N52618
$$ 6341196 6426228 6286599 6952394 6600613 6950810 7342991 7127023 6977138 7100234 7652852
14411G652852k26159M9904K35642O3679L81204j76563J92539L82920j60209K21879
$$ 7652852 7426693 7476597 7712239 7775918 8157122 7980559 8173098 8556018 8395809 8617688
14401H617688K17333J72263m3160k02694N93021L0275k33362O93103J1330L21498
$$ 8617688 8835021 9007284 8964124 8761430 9354451 9384726 9151364 9844467 9855797 10177295
14391A0177295L6651J81815M77354j40153J96474K61788J11931L57043M08667
$$ 10177295 10213946 10395761 10873115 10732962 10929436 11191224 11303155 11660198 12068865
14382A2068865M3706L1299L87143K46850J96997K53881K73211L73420J67657J6919
$$ 12068865 12112571 12143870 12531013 12777863 12974860 13228741 13501952 13875372 14043029 14059948
14372A4059948L86766K58925N62486L59579J69768J63941N18795J61271M10740
$$ 14059948 14446714 14705639 15268125 15627704 15797472 15961413 16480208 16641479 17052219
14363A7052219L00194N70582N39830J17697M43899M69579N06833L86574N05825
$$ 17052219 17352413 17922995 18462825 18580522 19024421 19494000 20000833 20387407 20893232
14354B0893232M39506P04360K67222O71837K41301R95616L72067M17297J103924
$$ 20893232 21332738 22037098 22304320 22976157 23217458 24213074 24585141 25002438 26106362
14345B6106362N37462P43683O45437R61734Q62473O92774R08830M38847J300513
$$ 26106362 26643824 27387507 28032944 28994678 29857151 30549925 31458755 31897602 33198115
14336C3198115J137836J092307J081052J024301R73568J071115J322623J880129
$$ 33198115 34335951 35428258 36509310 37533611 38507179 39578294 40900917 42781046
14328D2781046R82906J426864J488886J526465J728906K033028J747319K010092
$$ 42781046 43763952 45190816 46679702 48206167 49935073 51968101 53715420 55725512
14320E5725512J486666K818716K162103K304845K784804K395035L106654K881855
$$ 55725512 57212178 60030894 62192997 64497842 67282646 69677681 72784335 75666190
14312G5666190L113673L655179L098600L850471M182463M120113M667775M696461
$$ 75666190 78779863 82435042 85533642 89384113 93566576 97686689 102354464 107050925
14304A07050925N486009N335432N606338O299746O536951P509320P361819Q514055
$$ 107050925 112536934 117872366 123478704 129778450 136315401 143824721 151186540 159700595
14296A59700595P929401R352221R924190R961232J1246260J2079416J2072535
$$ 159700595 167629996 176982217 186906407 196867639 208113899 220193315 232265850
14289B32265850J3069885J3342239J4375602J4468871J5263617J5583418J5741760
$$ 232265850 245335735 258677974 273053576 287522447 302786064 318369482 334111242
14282C34111242J5839506J5937060J5197509J4837307J3838322J2414573J1226035
$$ 334111242 349950748 365887808 381085317 395922624 409760946 422175519 433401554
14275D33401554R052695N377152j317023k823959k243645j236123k361658o946980
$$ 433401554 442454249 447831401 446514378 443690419 441446774 440210651 437848993 430902013
14267D30902013o834936q380850j1954398j4031493j5356944j5755314j6632736
$$ 430902013 424067077 415686227 403731829 389700336 374343392 358588078 341955342
14260C41955342j6459288j6756163j5989065j5283577j5207027j3407849j2934749
$$ 341955342 325496054 308739891 292750826 277467249 262260222 248852373 235917624
14253B35917624j2817355j1985465j1657113j0448160j0199503r017685q845820
$$ 235917624 223100269 211114804 199457691 189009531 178810028 169792343 160946523
14246A60946523q162172p571775p031264o970932o553004n599279n592651n260620
$$ 160946523 152784351 145212576 138181312 131210380 124657376 119058097 113465446 108204826
14238A08204826m687209m552319m217965m226295m049821l539138l051759l158174
$$ 108204826 103517617 98965298 94747333 90521038 86471217 82932079 79880320 76722146
14230G6722146l478240k832826k549699k971616k453467k131080k147489k200842
$$ 76722146 73243906 70411080 67861381 64889765 62436298 60305218 58157729 55956887
14222E5956887k224820j698978j509147j933014j710773j399061j402546j953280
$$ 55956887 53732067 52033089 50523942 48590928 46880155 45481094 44078548 42125268
14214D2125268r02406j263827j085392j121926j091387j045875o56271j117085
$$ 42125268 41222862 39959035 38873643 37751717 36660330 35614455 34958184 33841099
14206C3841099r15810j368876o42077r79666n90456o88635m31479j080485p32550
$$ 33841099 32925289 31556413 30914336 29934670 29344214 28655579 28224100 27143615 26411065
14197B6411065j008969k87649r88700o92687j2444q12478m51640m55720p19381
$$ 26411065 25402096 25114447 24125747 23433060 23420616 22608138 22156498 21700778 20981397
14188B0981397n24993m02878m69146m45567l59811m23326l67648n19668m45341
$$ 20981397 20456404 20053526 19584380 19138813 18779002 18355676 17988028 17468360 17023019
14179A7023019L5960j82723o55365n09140j58679k13011n31387l45301j60000
$$ 17023019 17058979 16876256 16220891 15711751 15553072 15340061 14808674 14463373 14303373
14170A4303373n7687o51150j17076j81520m81031J6832m58110j68008r2575j98924
$$ 14303373 14245686 13594536 13477460 13295940 12814909 12831741 12373631 12205623 12113048 11914124
14160A1914124k07345k32899j01467k65042j50951k5913n04455m04364J74410
$$ 11914124 11706779 11473880 11372413 11107371 10956420 10930507 10426052 10021688 10196098
14151A0196098j75495k99701n6109J14031m98964k2191j54628J57807k87367r5357
$$ 10196098 10020603 9720902 9664793 9778824 9279860 9257669 9103041 9260848 8973481 8878124
14141H878124l63040J5516n5495k80162j38407J32496l75598k52183L33261l83565
$$ 8878124 8515084 8530600 8475105 8194943 8056536 8189032 7813434 7561251 7894512 7510947
14131G510947p5032j91515j47370j8086o2724j55471k61262K03227l53516J96051
$$ 7510947 7435915 7244400 7097030 7078944 7016220 6860749 6599487 6802714 6449198 6645249
14121F645249q9140j96303K04558n29132K6977q0827J25961l01663n6447q5817
$$ 6645249 6556109 6359806 6564364 6035232 6062209 5981382 6107343 5805680 5749233 5663416
14111E663416N8058J43335k15345j65404n47915L18931J70905j12117m50602K24074
$$ 5663416 5721474 5864809 5649464 5484060 4936145 5255076 5425981 5313864 4863262 5087336
14101E087336N2774j80526j12494K28421p44732M92920j29424k15093l572M5380
$$ 5087336 5140110 4959584 4847090 5075511 4330779 4823699 4694275 4479182 4475610 4520990
14091D520990j67687q1208J17706j45226j34113M04302o99074L21362k38370K21978
$$ 4520990 4353303 4272095 4389801 4244575 4110462 4514764 3815690 4137052 3898682 4120660
14081D120660K421k91381L3368j59366o837J96842j07771j18922N8860M4085l0651
$$ 4120660 4123081 3831700 3865068 3705702 3698865 3895707 3787936 3669014 3727874 3771959 3741308
14070C741308j61355q7384l687k6595p7012N2985j86045J99163k64930Q6965K31516
$$ 3741308 3579953 3492569 3488882 3462287 3385275 3438260 3252215 3451378 3186448 3273413 3504929
14059C504929l3765k54438L06078m29651K30553J21672l97275K34289j04505k75388
$$ 3504929 3471164 3216726 3522804 3093153 3323706 3445378 3048103 3282392 3177887 2902499
14049B902499j88848J28649k28224M78177m59031N8243j12472J25425j27811j53931
$$ 2902499 2713651 2842300 2614076 3092253 2633222 2691465 2578993 2704418 2576607 2422676
14039B422676J6570J57580J57569j09048j8090j64897M9338O6271O1427j22898
$$ 2422676 2439246 2596826 2754395 2645347 2627257 2462360 2511698 2577969 2639396 2516498
14029B516498O5145j50698k44520K39288J28652j31864j06539j79418O6763K34716
$$ 2516498 2581643 2430945 2186425 2425713 2554365 2422501 2315962 2136544 2203307 2438023
14019B438023o87277M26848j08314j0219j2922N1112l25656M72787k16507K8275
$$ 2438023 1750746 2177594 2069280 2059061 2046139 2097251 1771595 2244382 2027875 2056150
14009B056150N0685l78101M09498P1953k88414k40747L2439r123r0967P2218j37253
$$ 2056150 2106835 1728734 2138232 2210185 1921771 1681024 1713463 1704340 1613373 1685591 1548338
13998A548338K47953J2431j7094j91622J37535k56260M75257K73120K41084J989322
$$ 1548338 1796291 1808722 1791628 1600006 1737541 1481281 1956538 2229658 2470742 4460064
13988D460064L516100P525222J5658264P438982j8563745r458504m039276j913797
$$ 4460064 7976164 15501386 31159650 38598632 20034887 10576383 6537107 4623310
13980D623310p99828m52220n55948j81036j86812l17556j12094j80796N25147
$$ 4623310 3823482 3371262 2815314 2634278 2447466 2129910 2017816 1837020 2362167
13971B362167l15234j62730L2089p7982K79295k89657n6548j70069M85392m60630
$$ 2362167 2046933 1884203 1916292 1838310 2117605 1827948 1771400 1601331 2086723 1626093
13961A626093L92296m22975J4574L29231j69134k42679K43004J19256n10189J91231
$$ 1626093 2018389 1595414 1609988 1939219 1770085 1527406 1770410 1889666 1379477 1570708
13951A570708j79336M3150K52068J0371n3591j41669k26258K36802j27569J41582
$$ 1570708 1391372 1434522 1686590 1696961 1643370 1501701 1275443 1512245 1384676 1526258
13941A526258J48164j7736J2929m2200j34186J10217j51346k28159R5055K23697
$$ 1526258 1674422 1656686 1669615 1627415 1493229 1603446 1452100 1223941 1318996 1542693
13931A542693R3054j81410M174j50265K20749p4449P2916n02051L47278q602k49589
$$ 1542693 1635747 1454337 1458511 1308246 1528995 1454546 1527462 1025411 1372689 1364087 1114498
13920A114498L84815k86361J77091R2002j43759J2623q1964J48696m027o6625
$$ 1114498 1499313 1212952 1390043 1482045 1338286 1350909 1268945 1417641 1413614 1346989
13910A346989p7046P6526l42342J30934j44277K8854O35312m45459o7641l7293
$$ 1346989 1269943 1346469 1004127 1135061 990784 1019638 1654950 1209491 1141850 1104557
13900A104557o9783o4793K52675L4191q0342J20643K6798k09689j37696J28383
$$ 1104557 1034774 969981 1222656 1256847 1176505 1297148 1323946 1114257 976561 1104944
13890A104944O08j42630j69918K55414J93944l35119j32320J97000N6288m02129
$$ 1104944 1105552 962922 793004 1048418 1242362 907243 774923 971923 1028211 626082
13880F26082K39653P1801J27791L8777l45999L67594l7463j04238n8774O5786
$$ 626082 865735 937536 1065327 1104104 758105 1125699 1088236 983998 925224 991010
13870I91010J13350l77873K96568L8990K3342j33978O2132m9405Q6618l69133
$$ 991010 1104360 726487 1023055 1062045 1085387 951409 1013541 964136 1050754 681621
13860F81621K60942J07017j21061j57137r3777K41037k53517J81291O3775R179
$$ 681621 942563 1049580 928519 771382 677605 918642 665125 846416 910191 919370
13850I19370k63002J77484N2291R3178J29929j20919j53507O2164j5520j39326
$$ 919370 656368 833852 886143 979321 1109250 988331 834824 896988 881468 742142
13840G42142K20216j64831j09021L50826D00745N75019k16084q3336k405K96224
$$ 742142 962358 797527 688506 1039332 400745 975764 759680 676344 673939 970163
13830I70163j39039o2572L5390j56650K69064D21821K55034L76039l88001J7225
$$ 970163 831124 768552 803942 647292 916356 421821 676855 1052894 664893 682118
13820F82118K2733J0095Q3616l09828J61037N4471N6863j35055J23296j433j83494
$$ 682118 704851 714946 798562 488734 649771 704242 761105 626050 749346 747913 564419
13809E64419L42067k11133k99439L76826l68881K09866K68122l00723R2451P4424
$$ 564419 906486 695353 395914 772740 403859 613725 881847 581124 673575 747999
13799G47999j5948B91965M19335j73007J04420N3317k74402j58949L49029k1209
$$ 747999 732051 291965 711300 538293 642713 696030 421628 262679 611708 590499
13789E90499J1395J6944K28429C25510J68292K86210J103n957n9089J38724l55794
$$ 590499 601894 618838 847267 325510 493802 780012 781115 775158 716069 854793 498999
13778D98999J31208l3543K36085k94759O9066M3175P865j82184J05719j81489
$$ 498999 630207 596664 832749 537990 607056 650231 658096 475912 581631 400142
13768D00142M7481j21500K82584r2952Q5716m9268K6313J33330B34834K60051
$$ 400142 447623 326123 608707 515755 601471 552203 578516 711846 234834 494885
13758D94885j7078J13191J32360B68386K22001J13126j04168n039k33201K48988
$$ 494885 477807 590998 723358 268386 490387 603513 499345 494306 261105 510093
13748E10093J92821l30727K45598l9241J59467k06598B44178J64303R4500j26818
$$ 510093 702914 372187 617785 578544 738011 531413 244178 408481 502981 376163
13738C76163L98119l13531A60883K44185r3853O9840J53652k35741J6775L47741
$$ 376163 774282 460751 160883 405068 311215 381055 534707 298966 315741 663482
13728F63482k34712L6859l1939J04555k57106J24313P3577R1853B41103O00671
$$ 663482 428770 465629 433690 538245 281139 405452 479029 570882 241103 841774
13718H41774B11919K58388H176P87684j46804p3249B19049K81529q2794K9055
$$ 841774 211919 470307 8176 795860 649056 575807 219049 500578 417784 446839
13708D46839j52531J95620l9818B14280R9925J70681j74895J83444j1438L11052
$$ 446839 294308 489928 450110 214280 314205 484886 309991 493435 481997 793049
13698G93049l81120K65965J697l02687K40306k10267j59205J68352j7086o1717
$$ 793049 411929 677894 679591 376904 617210 406943 247738 416090 399004 337287
13688C37287K6941k1275J41127B23961K16305J19458k79656K00156L2462q8771
$$ 337287 364228 342953 484080 223961 440266 559724 280068 480224 512686 423915
13678D23915m4494l8141k2044J70479P2230k10179J1238k3639K2065J12347j32477
$$ 423915 379421 341280 319236 489715 561945 351766 363004 339365 361430 473777 341300
13667C41300m3083j41762J87012J92585i0880B47566R4384N1149J64078A04820
$$ 341300 298217 156455 343467 536052 -90880 247566 341950 393099 557177 104820
13656B67128m1170r3755K02433J20952J34732B43277J43305Q9025j07886A53131
$$ 267128 225958 132203 334636 455588 590320 243277 386582 475607 367721 153131
13645D53013J6347o3290A15755L82939A50850M32268j25360Q1507A16278O6711
$$ 453013 469360 406070 115755 498694 150850 583118 457758 539265 116278 182989
13635A82989L91306k34590o7416L43351j30557m9802o2229R6233j25753p7338
$$ 182989 574295 339705 272289 615640 485083 435281 373052 469285 343532 266194
13625B66194L78411j79144B01276a10805A40252d7061B55496L33994A19697K24675
$$ 266194 644605 465461 201276 -110805 140252 -47061 255496 589490 119697 344372
13615C44372P8510r6986K43916k45489K13944q3646j9087m4136j82197J51219
$$ 344372 422882 325896 569812 324323 538267 454621 435534 391398 209201 360420
13605C60420J4623J95201m6036J40503k75954A51316N95337q4591B76349K35453
$$ 360420 375043 570244 524208 664711 388757 151316 746653 662062 276349 511802
13595E11802k04140l3532J1607J54550q5128L53814C43043O9741O0024e5494D52303
$$ 511802 307662 274130 285737 440287 355159 708973 343043 412784 472808 -55494 452303
13583B61309o3599K00471L8033j22909A34241o1910J47962J57526r9414J358q4103
$$ 261309 197710 398181 436214 313305 134241 72331 220293 377819 278405 279763 195660
13572A95660O3191o5333J36819A12847J90651J77855d097B47164q2852j4096K51009
$$ 195660 258851 193518 330337 112847 303498 481353 -4097 247164 164312 150216 401225
13561D01225j37668n1086L7786L5012k255L14898j77808m9198p3888r9810l7030
$$ 401225 263557 212471 250257 285269 283014 597912 420104 370906 297018 197208 160178
13550A60178K72381I0956o811K37343A15971K06909k9258p946p2177O4827J18435
$$ 160178 432559 90956 84145 321488 115971 322880 293622 285676 213499 278326 396761
13539C96761A82168N9977K43974N9884j17104j27956K60572D4526O8638L76483
$$ 396761 182168 242145 486119 546003 428899 300943 561515 44526 113164 489647
13529D89647k12692q7905L2910D5608d1316j13342B09894Q6326L28m4416J8224
$$ 489647 276955 189050 221960 45608 -41316 -154658 209894 296220 296548 252132 270356
13518B70356D4443K25871H9979a72418E01140G7113g2178D20192j43426a38546
$$ 270356 44443 270314 89979 -172418 501140 77113 -72178 420192 276766 -138546
13507B8813L28407A62979p2904J37340k0651I5929e7425A67740M9721q1754f479
$$ 28813 357220 162979 90075 227415 206764 95929 -57425 167740 217461 135707 -6479
13495A89433M6507l8690i1015B1194J87716n5595J37624A21337L1970o1815Q699
$$ 189433 235940 197250 -91015 21194 208910 153315 290939 121337 153307 91492 100191
13484A00191J02544J80815j84064E6702K34111m1267K3976O0389D2572M1200M3612
$$ 100191 202735 383550 199486 56702 290813 249546 273522 333911 42572 83772 127384
13473A27384l4045J59574K47654A61725J26418F0617e7990A83317n3320P0727
$$ 127384 93339 252913 500567 161725 288143 60617 -57990 183317 129997 200724
13463B00724J71554A83731O1704I3388Q7639n9417G305l367N10159I0399K81536
$$ 200724 372278 183731 245435 93388 181027 121610 7305 3938 514097 90399 371935
13452C71935p8711e7870A24304Q3467r980O0248I0032J81204p7176J45590G6497
$$ 371935 293224 -57870 124304 207771 197791 258039 90032 271236 194060 339650 76497
13440B67896K32553A93031J39495f7368I3276a7994g473A36729b39566B79124
$$ 267896 500449 193031 332526 -67368 93276 -17994 -7473 136729 -239566 279124
13429A86393P4388R1084j9037C1295a26039F3822r962f7316a8528D63371A69828
$$ 186393 260781 351865 332828 31295 -126039 63822 53860 -67316 -18528 463371 169828
13417B2142J54820l6164C4457i0549A11039K21027a22674a7307B58829K4347K8074
$$ 22142 176962 140798 34457 -90549 111039 332066 -122674 -17307 258829 283176 311250
13406C11250a14120E35551G2013R0601K04937l8698K3717n1262g1069j52313F9699
$$ 311250 -114120 535551 72013 162614 367551 328853 352570 301308 -71069 -223382 69699
13394F8661b80811I2093k1039J72520j10184Q7989B6223K33357B5667a342A30689
$$ 68661 -280811 92093 71054 243574 133390 221379 26223 259580 25667 -1342 130689
13382B67286a11508F1643M39564A06031L62766a84020a7369C50534J65155I2990
$$ 267286 -111508 61643 501207 106031 468797 -184020 -17369 350534 515689 92990
13371F053a7545C46716A13446J30991A19194d385A55435L4017J04886j00985K79931
$$ 6053 -17545 346716 113446 244437 119194 -4385 155435 189452 294338 193353 473284
13360D73284I0708b7127A50109a78028B88552o6493m1915R675n2310R0227J42788
$$ 473284 90708 -27127 150109 -178028 288552 222059 180144 189819 137509 227736 370524
13349C70524A56471J10758g161A93404E6711B6321J80837J28740j50890J45607
$$ 370524 156471 267229 -7161 193404 56711 26321 207158 335898 185008 330615
13339C30615j5112J64544G5767O9920J44746A21285a15567b7856B00885K29315
$$ 330615 315503 480047 75767 145687 290433 121285 -115567 -27856 200885 430200
13329D30200j87300a44367D21536j39814j01762L5723h5395F55884B49220q1395
$$ 430200 242900 -144367 421536 281722 179960 215683 -85395 655884 249220 167825
13319A67825k807J44047p8075p1642l7651Q1475Q2042e5678A02822a04268a9341
$$ 167825 165018 309065 230990 159348 121697 203172 285214 -55678 102822 -104268 -19341
13307A92970r4501J68662E1042K0420J64652B7164J44211p8777Q1355G3581J16072
$$ 192970 98469 267131 51042 71462 236114 27164 171375 92598 173953 73581 189653
13296A89653l7568h468F6615M3884a14640q0927C64787G6128j8989b25299a2490
$$ 189653 152085 -8468 66615 110499 -114640 -195567 364787 76128 57139 -225299 -12490
13284B00190p0218E6K05687f5510j77043B0703J31221J01110c5614B00229N0771
$$ 200190 129972 56 205743 -65510 -242553 20703 151924 253034 -35614 200229 251000
13273B51000a5866C7155J12650B3447k011K6726K21207b095k75379E7753J03765
$$ 251000 -15866 37155 149805 23447 21436 48162 269369 -2095 -277474 57753 161518
13262A61518J8010M2632G2249M60678A66469j1300M3223R0838j0224j37643a85533
$$ 161518 179528 222160 72249 532927 166469 155169 198392 289230 279006 141363 -185533
13250c2988j38740A90095J39075a2167D40017B10383q8512A9219b65262N9689
$$ -32988 -171728 190095 329170 -12167 440017 210383 121871 19219 -265262 -205573
13240b05573A08643g7200G6575K53449A43772L5939G8710L69339A29241a220q4553
$$ -205573 108643 -77200 76575 330024 143772 179711 78710 448049 129241 -1220 -85773
13229h5773C16182a21595L3786j02498A47264l9547K11847j47259l4909B0733
$$ -85773 316182 -121595 -87809 -190307 147264 107717 319564 172305 137396 20733
13218A24372C9401j6614a06120E9411f705o2321B0692N5047g5498l1878e2763
$$ 124372 39401 22787 -106120 59411 -6705 -69026 20692 75739 -75498 -107376 -52763
13206A75241J52699p5105j2198A01836l2661b2528j07864c1178C17034a01057
$$ 175241 327940 252835 240637 101836 69175 -22528 -130392 -31178 317034 -101057
13195E48720k20406a68853k7443D8792b2669o3398K9788n7784M6827F07364B68509
$$ 548720 328314 -168853 -196296 48792 -22669 -86067 -56279 -114063 -67236 607364 268509
13183i7464A87311K22091a87737L5113d3792B68487n2362l5481o9767b2725A42885
$$ -97464 187311 409402 -187737 -152624 -43792 268487 216125 180644 110877 -22725 142885
13171A26957k6888R7614F8170i2543M4530j5459A199d4469a7995B99023F2374
$$ 126957 100069 197683 68170 -92543 -48013 -63472 1199 -44469 -17995 299023 62374
13159a03278n5077A44391L7687J19487o4313A05498C7046J07599b21446a07395
$$ -103278 -158355 144391 182078 301565 237252 105498 37046 144645 -221446 -107395
13148A81354a33813p0974I0712j5895p280b55402B35048b9219B0597J37187e930
$$ 181354 -133813 -204787 90712 74817 67537 -255402 235048 -29219 20597 157784 -5930
13136A76474A5622K1496f5997A20354E7466L59392A3543D601K76981J7966b5595
$$ 176474 15622 37118 -65997 120354 57466 416858 13543 4601 281582 299548 -25595
13124g2089j84717A16904M7977Q8740b42583E1224J4352a46163A23956a36769
$$ -72089 -256806 116904 164881 253621 -242583 51224 65576 -146163 123956 -136769
13113A23310j2376l3435J50406G0193L7380J75692a219j16310H8066k6119L1995
$$ 123310 110934 77499 227905 70193 107573 283265 -1219 -117529 88066 61947 93942
13102I3942j2334A9120K43356a82321a3175H4191a14744F5915N8405R8058A7989
$$ 93942 81608 19120 262476 -182321 -13175 84191 -114744 65915 124320 222378 17989
13090a63723A55848D8211a3618k47862k07953b27790P2512C2840J47076a9299
$$ -163723 155848 48211 -13618 -261480 -469433 -227790 -155278 32840 179916 -19299
13079a02831p1705A31437J59538d17F98862A7453a2153B92795b20983C2160a546
$$ -102831 -174536 131437 290975 -417 698862 17453 -12153 292795 -220983 32160 -1546
13067H8708K33225a51289d3483B50622q3372a33237B54563g9278m4863B21475
$$ 88708 321933 -151289 -43483 250622 167250 -133237 254563 -79278 -124141 221475
13056a00884A78117q5772J09965a62990E8172B4144J08893D5123e1974a70B1111
$$ -100884 178117 92345 202310 -162990 58172 24144 133037 45123 -51974 -170 21111
13044H6781P2868c413A30341f0282B7536N0796l9034J20443A973J70279M0644
$$ 86781 159649 -3413 130341 -60282 27536 78332 39298 159741 1973 172252 212896
13033B12896K9155A5375G204P9280b33030A47747j3517a72655B70804a8069q3099
$$ 212896 242051 15375 7204 86484 -233030 147747 134230 -172655 270804 -18069 -101168
13022a01168A2936d942n3114B33482N324b37599H4471a0922B65443b5909I4341
$$ -101168 12936 -4942 -58056 233482 238806 -237599 84471 -10922 265443 -25909 94341
13010B72J75407C5120a51604N4489A25498l7738a24343N7099B44059A6060i660
$$ 272 175679 35120 -151604 -97115 125498 87760 -124343 -67244 244059 16060 -9660
12998b4377b089p3302D65583j33122p5747c056l4477A54873g6162q7919a4387
$$ -24377 -2089 -75391 465583 332461 256714 -3056 -37533 154873 -76162 -164081 -14387
12986b29006A29106N2215C5807P6831A5084L27449G6983j6446K34915I0728O9806
$$ -229006 129106 181321 35807 112638 15084 342533 76983 60537 295452 90728 160534
12975A60534b2663R60j49305c1267j76486e5094K2209H4223d6372J8638E8568
$$ 160534 -22663 -21703 -171008 -31267 -207753 -55094 -32885 84223 -46372 -27734 58568
12963A84315b63902D21884A27691b41056A22736n3189B8002E289O8956J28530
$$ 184315 -263902 421884 127691 -241056 122736 69547 28002 5289 74245 202775
12953B02775a38153B15767F9730J08898b23227A21778a7667k5229B72050H8891
$$ 202775 -138153 215767 69730 178628 -223227 121778 -17667 -42896 272050 88891
12942A48571h0266l864A38454k5423g6217A13129B8538J38452h7227J3628C3788
$$ 148571 -80266 -84130 138454 113031 -76217 113129 28538 166990 -87227 -73599 33788
12930E8856R7665a12075A16136B9401K94637l8245m4691A5902f7454j58199R1491
$$ 58856 156521 -112075 116136 29401 324038 285793 241102 15902 -67454 -225653 -134162
12919a34162B58397P2202E1768K19870B9189N3965J35172a75437D0719J04404
$$ -134162 258397 330599 51768 271638 29189 83154 218326 -175437 40719 145123
12909A45123G187f1158D3914J53342D9542M9300c11503a6960E9387c44812B2274
$$ 145123 7187 -61158 43914 197256 49542 98842 -311503 -16960 59387 -344812 22274
12897F4444K194K55043A17720b97633C87338F3349M938a5429M909k01403d4019
$$ 64444 66638 321681 117720 -297633 387338 63349 68287 -15429 -10520 -211923 -44019
12885A08726a02867q8558B9759J11269j8001a2491k13194B5821L2909h1603j11768
$$ 108726 -102867 -191425 29759 141028 123027 -12491 -225685 25821 58730 -81603 -193371
12874a93371O7826j14434C27246a47676A87561a22098H1125i9142G1710f9217
$$ -193371 -125545 -239979 327246 -147676 187561 -122098 81125 -99142 71710 -69217
12863a6854A36991J71060a78744M7714F1663K36453g6868A50276K99645a32600
$$ -16854 136991 308051 -178744 -131030 61663 298116 -76868 150276 449921 -132600
12852a36924A2773J92890i0124B3429e4146A56866b7313n3701j94986H7402B7289
$$ -136924 12773 205663 -90124 23429 -54146 156866 -27313 -81014 -276000 87402 27289
12840A43600J62829a10094H7289c15770C11061H1745g8117a1300A80434b44489
$$ 143600 306429 -110094 87289 -315770 311061 81745 -78117 -11300 180434 -244489
12829a2848B87112b14742h6061l6562H9322b9776j57209J7879I3494b42341B09669
$$ -12848 287112 -214742 -86061 -122623 89322 -29776 -186985 -169106 93494 -242341 209669
12817a99959e7506A87491d8281b1490j77104j64384C05861I9817d5825q4632A29455
$$ -199959 -57506 187491 -48281 -21490 -198594 -362978 305861 99817 -45825 -130457 129455
12805f7843j52040e0500A63528J12357A8606O2253J83184E6975I135i8793B33807
$$ -67843 -219883 -50500 163528 275885 18606 80859 264043 56975 9135 -98793 233807
12793b30991a3676A07881b1677D6947J48576b5899n7904k06083E8298g324D1745
$$ -230991 -13676 107881 -21677 46947 195523 -25899 -83803 -289886 58298 -7324 41745
12781b18286M9526B88905a28208b8663D9287a19431A29784i3911j94434A27050
$$ -218286 -168760 288905 -128208 -28663 49287 -119431 129784 -93911 -288345 127050
12770B33585p6562l4822b29429j0637g8439i607j03812B5642J57682n3246J15253
$$ 233585 157023 122201 -229429 -240066 -78439 -9607 -113419 25642 183324 130078 245331
12759B45331C0803J00906C9751a58930A10851b7353A78661p4006J83523b31999
$$ 245331 30803 131709 39751 -158930 110851 -27353 178661 104655 288178 -231999
12748d7242k47427c2528j72694c132k378o7341A69529C7125K65502A32552j5472
$$ -47242 -294669 -32528 -205222 -3132 -5510 -72851 169529 37125 302627 132552 117080
12737A17080h7673J423A74157a23090O0879C3955J6881b60756A34971K3302f0294
$$ 117080 -87673 -86250 174157 -123090 -62211 33955 50836 -260756 134971 158273 -60294
12725B9947B823K10792R3613b24858d8093c215k1279q9104a4796C2552L7960C2358
$$ 29947 2823 213615 307228 -224858 -48093 -3215 -24494 -113598 -14796 32552 70512 32358
12712B18209j2209R875k1948h6980B67227C7162K61914A44154e7313F4245J23107
$$ 218209 206000 215875 193927 -86980 267227 37162 299076 144154 -57313 64245 187352
12701A87352Q3043d8916A87349n2333R6253A06715a98449A65797a37076B48012
$$ 187352 270395 -48916 187349 135016 231269 106715 -198449 165797 -137076 248012
12690C24056A56282E3104n179a31716A92455H4839h7552F4861L7844m1843a00307
$$ 324056 156282 53104 47925 -131716 192455 84839 -87552 64861 102705 60862 -100307
12678a5723C88972j68441D6447B1870Q9382a42902A95463a95040A45508b55727
$$ -15723 388972 220531 46447 21870 111252 -142902 195463 -195040 145508 -255727
12667A05691k4128A5370O4972K51507A62232f5627B7138K60885Q3851r4789j07765
$$ 105691 81563 15370 80342 331849 162232 -65627 27138 288023 371874 277085 169320
12656A69320C2094b2158p2480j9066A74173a43858A23929N2716i0594A79487g0118
$$ 169320 32094 -22158 -94638 -113704 174173 -143858 123929 176645 -90594 179487 -70118
12644C5500L26934b5601G9678b58854f2247F4597b8056n6644C50423G7305B3811
$$ 35500 362434 -25601 79678 -258854 -62247 64597 -28056 -84700 350423 77305 23811
12632H2281R6536q7765b7178B8731J15034M8457P4958k7084m147J0595k9766B5103
$$ 82281 178817 91052 -27178 28731 143765 192222 267180 240096 235949 246544 216778 25103
12619H9459L8848C4880a10886j9698A81498b75579c951A03389d2200F8320c20146
$$ 89459 128307 34880 -110886 -130584 181498 -275579 -3951 103389 -42200 68320 -320146
12607b26742B89643b88669B27184P7889j32611P3931A13407N9291A3469E578K41640
$$ -226742 289643 -288669 227184 305073 172462 246393 113407 172698 13469 5578 247218
12596B47218a27518B8247J58253P907H6431Q0192b19943g9460C63K70840a21613
$$ 247218 -127518 28247 186500 194407 86431 166623 -219943 -79460 363 271203 -121613
12584b5572E3891L1722a36462A809J74758F6122Q426d04627a12031G4044c8648
$$ -25572 53891 85613 -136462 1809 176567 66122 74548 -404627 -112031 74044 -38648
12572A68628m4946l8274B9896f3011A60150l342p3200c05848f1065r8242A38837
$$ 168628 123682 85408 29896 -63011 160150 156808 83608 -305848 -61065 -159307 138837
12560F82523A82230a26067A12815J23385k705g1645j08954f8009A48419L81209
$$ 682523 182230 -126067 112815 236200 233495 -71645 -180599 -68009 148419 529628
12550E29628C0875J32797a07555q9396a7426B1108i5222A17567J08593a73293
$$ 529628 30875 163672 -107555 -196951 -17426 21108 -95222 117567 226160 -173293
12539A07248D1532K9997l408j6072J54282E1347a3360m941A86700k9363i1727
$$ 107248 41532 71529 68121 52049 206331 51347 -13360 -18301 186700 157337 -91727
12527C72781a4880A98347b38851A4883g5056j3080L3233A31200C5324a23201E2749
$$ 372781 -14880 198347 -238851 14883 -75056 -88136 -54903 131200 35324 -123201 52749
12515F768K11310n6921n5130J01169e1492D0529j5194J27363a56069A08295b2497
$$ 6768 218078 161157 106027 207196 -51492 40529 25335 152698 -156069 108295 -22497
12503a94512g9676c163B62625A1121c3446A55677a38909k04590e8674A10310b0755
$$ -194512 -79676 -3163 262625 11121 -33446 155677 -138909 -343499 -58674 110310 -20755
12491A84124I022J14650a24666k05708a31721e4448Q634H0318c20748A2010b7319
$$ 184124 9022 123672 -124666 -330374 -131721 -54448 -45814 80318 -320748 12010 -27319
12479A87959F539O0249K75453D5993Q902J3076Q7313a12525A63874a82866h8750
$$ 187959 6539 66788 342241 45993 54895 67971 155284 -112525 163874 -182866 -88750
12467a80193n5682A76865K7072E8633O6103d9876G7176a71874P2146a5546j62342
$$ -180193 -235875 176865 203937 58633 124736 -49876 77176 -171874 -99728 -15546 -177888
12456a77888c5789j62303A04037d6281C6833b2437n4814o692G2508a57986B4981
$$ -177888 -35789 -198092 104037 -46281 36833 -22437 -77251 -83943 72508 -157986 24981
12444a93659d791G6699b70094r146n533A05544L9345k6024e3714A35569g188l14583
$$ -193659 -4791 76699 -270094 -279240 -284773 105544 144889 118865 -53714 135569 -7188 -321771
12432c21771B09289d0486j45988f4557p401k76108A47851c12637h8794D5444j3733
$$ -321771 209289 -40486 -186474 -64557 -71958 -348066 147851 -312637 -88794 45444 31711
12421C1711P0053d4792J2508C32618D7762N659Q8132o6538A1439K6962a09858
$$ 31711 101764 -44792 -32284 332618 47762 53421 141553 75015 11439 38401 -109858
12409g6877q0518C3660J31878a51871e344j088j45110A69816J03509i2598m901
$$ -76877 -157395 33660 165538 -151871 -5344 -6432 -151542 169816 273325 -92598 -97499
12398i7499j5718B18120I6710c7205j33373l9516i5271A84032a10088c4233k52233
$$ -97499 -113217 218120 96710 -37205 -170578 -210094 -95271 184032 -110088 -34233 -286466
12387b86466I0932c88814J90664g3755m9904F3966P4324o4641h5513j18052E3222
$$ -286466 90932 -388814 -198150 -73755 -123659 63966 138290 73649 -85513 -203565 53222
12375c6028k78932A5068a05238j35857A59385b17641a05320A94144L6996b13619
$$ -36028 -314960 15068 -105238 -241095 159385 -217641 -105320 194144 231140 -213619
12364I9291J71165a14100A32664K10998a65020a0805D9449L01067C1033a46640
$$ 99291 270456 -114100 132664 343662 -165020 -10805 49449 350516 31033 -146640
12353b58366A0368a31476G7134N5503o4816a55392E0481J96224r9078E6050d4527
$$ -258366 10368 -131476 77134 132637 67821 -155392 50481 246705 147627 56050 -44527
12341a60365N6784F8078l878K29752b3348l0361D0618g5603D53J95133c03141
$$ -160365 -103581 68078 64200 293952 -23348 -53709 40618 -75603 453 195586 -303141
12329C95165e1297H8537b3982r1180B59160A1752M9384k3493J66599a07491C30386
$$ 395165 -51297 88537 -23982 -115162 259160 11752 61136 37643 204242 -107491 330386
12317g2237A94587n7112Q6678d6346F7625a49916n6188C22067g9439K6529G6336
$$ -72237 194587 137475 224153 -46346 67625 -149916 -206104 322067 -79439 -52910 76336
12305A22826c19973a45071O3489L7045B59817a66027P1308C4801g619B04852F8971
$$ 122826 -319973 -145071 -81582 -44537 259817 -166027 -94719 34801 -7619 204852 68971
12293a73756h2558A7194J52812K95884a15681F8225P4411a10076A22074E9229
$$ -173756 -82558 17194 170006 465890 -115681 68225 142636 -110076 122074 59229
12282c11958C16850a2046m04747b4395B30612h6262B77643P7206A54631h5360
$$ -311958 316850 -12046 -416793 -24395 230612 -86262 277643 354849 154631 -85360
12271C40664a81732C86323I8798f669C08192b54586A54316a25996A19186c7031
$$ 340664 -181732 386323 98798 -6669 308192 -254586 154316 -125996 119186 -37031
12260A9112K15538g653j65417C05752i2706A7855J75627c9609E624N2593b28385
$$ 19112 234650 -7653 -173070 305752 -92706 17855 193482 -39609 5624 58217 -228385
12248G5147N9403D5297A6607a10345D10220e3301M966C54374j69152e47110c3470
$$ 75147 134550 45297 16607 -110345 410220 -53301 -48335 354374 185222 -547110 -33470
12236c9671q677I1996k3882B5078M0173J18471J38340E225J46539b35316B77926
$$ -39671 -48348 91996 68114 25078 65251 183722 322062 5225 151764 -235316 277926
12224B36066G7038K21337a00985j26676A39223J20068r7206M1036n6459E4542
$$ 236066 77038 298375 -100985 -227661 139223 259291 162085 203121 146662 54542
12213a99554A12042J80806H7938a31235A90822q8553l8208N4658b1098A39615
$$ -199554 112042 292848 87938 -131235 190822 102269 64061 118719 -21098 139615
12202a14306o2625H1435L8220n2125j5296a593C18708l6636j26365J51030A21497
$$ -114306 -176931 81435 119655 67530 52234 -1593 318708 282072 155707 306737 121497
12190D3856J24448C746J85056a17984C24150r8568r1767J27925H6832R7215R8856
$$ 43856 168304 3746 188802 -117984 324150 225582 133815 261740 86832 184047 282903
12179B82903g66C5096h9582B4905J91061M40662A59710m4975m2167O8198J47599
$$ 282903 -766 35096 -89582 24905 215966 656628 159710 114735 72568 140766 288365
12168B88365j1308a00232H2268M2177b758j4167C1971b13724B71057c9904l58486
$$ 288365 277057 -100232 82268 124445 -2758 -16925 31971 -213724 271057 -39904 -398390
12157c98390J09771C64685g0664A42590a04990l48558a12981p8284c0074I2694
$$ -398390 -288619 364685 -70664 142590 -104990 -453548 -112981 -191265 -30074 92694
12146A30747k814g0388a5680D18258I3710J51651H9752D0862P8350b24040o8148
$$ 130747 127933 -70388 -15680 418258 93710 245361 89752 40862 119212 -224040 -292188
12135b92188h1337p8983A7218J37124J08535a77085L7039K2577I2311L18859I5084
$$ -292188 -81337 -160320 17218 154342 262877 -177085 -140046 -117469 92311 411170 95084
12123e6549B6646a09302o136B04365A00507L1593k1267G657R3312J55584l7447
$$ -56549 26646 -109302 -115438 204365 100507 132100 110833 7657 100969 256553 219106
12112B19106C6482e7382F2936A4944K68482r5613b2138r4205b8059k95409a18598
$$ 219106 36482 -57382 62936 14944 283426 187813 -22138 -116343 -28059 -323468 -118598
12100B16008K21938B12230d56875i9581j61404o2520f1258l5683B25496B4538
$$ 216008 437946 212230 -456875 -99581 -260985 -323505 -61258 -96941 225496 24538
12089H9394I384M4863k6076h8903B03996a12334I5795J04115a07749k7161a4699
$$ 89394 9384 54247 28171 -88903 203996 -112334 95795 199910 -107749 -134910 -14699
12077I3911L37379N43865Q22654F23608G8142c6220A9502a45492N1921B87469
$$ 93911 431290 975155 1797809 623608 78142 -36220 19502 -145492 -93571 287469
12066A68013a29588a5073k16785A25665M000a88728d7714A03152b753l4330A35164
$$ 168013 -129588 -15073 -231858 125665 129665 -188728 -47714 103152 -2753 -37083 135164
12054B43964A6072J25108a99992K3090H2670c16176N5982B57352a09205E204J68178
$$ 243964 16072 141180 -199992 -176902 82670 -316176 -260194 257352 -109205 5204 173382
12043A73382j1264o8342G753a15616l6916A29864J24211a13066c0096j54432c4616
$$ 173382 162118 93776 7753 -115616 -152532 129864 254075 -113066 -30096 -184528 -34616
12031a25235a6614A75260a28562I7374a91648c3743m9035A10776a00621B43917
$$ -125235 -16614 175260 -128562 97374 -191648 -33743 -82778 110776 -100621 243917
12020d25078H8236c27798a32669j94663I1437R2253p623p9040a35545C38835G3428
$$ -425078 88236 -327798 -132669 -327332 91437 183690 176067 97027 -135545 338835 73428
12008A4354a06141j66646a33117A79330e589A33316E5841G898a32860d698B35906
$$ 14354 -106141 -272787 -133117 179330 -5589 133316 55841 7898 -132860 -4698 235906
11996a88534E2030a56734m8093K3715B45535m0294h103k6464j23604F7924B1466
$$ -188534 52030 -156734 -204827 -181112 245535 205241 -8103 -34567 -158171 67924 21466
11984a8071j5698j03488d3911A56367a49307r6592H962f9787j2761A05966a04605
$$ -18071 -33769 -137257 -43911 156367 -149307 -245899 8962 -69787 -82548 105966 -104605
11972b7018j85989G9494M0722c2799k16303A14724b24042J00886c1615E8302h2089
$$ -27018 -213007 79494 120216 -32799 -249102 114724 -224042 -123156 -31615 58302 -82089
11960g1316c2422j00080A74901h5443B67473b58195A92721B0966a48611A99090
$$ -71316 -32422 -132502 174901 -85443 267473 -258195 192721 20966 -148611 199090
11949A05657d559B0914M08633a38884K4211j01209e2214j62274A14791c72352
$$ 105657 -4559 20914 429547 -138884 -114673 -215882 -52214 -214488 114791 -372352
11938B58386a41674q368A05147f5225f023j87689d7135K0689Q254B72439r5618
$$ 258386 -141674 -150042 105147 -65225 -6023 -193712 -47135 -26446 -18192 272439 176821
11927A76821c2608j68721Q7989H9950K71595b61849b3149A06708b3860j15664
$$ 176821 -32608 -201329 -113340 89950 361545 -261849 -23149 106708 -23860 -139524
11917a39524j44347P2223P2712I1565a02641r7061D7984a89882A88056p766a5091
$$ -139524 -283871 -211648 -138936 91565 -102641 -199702 47984 -189882 188056 180290 -15091
11905i883n8953A01976A8482b3439A29349D4081P9800b5320A85300o6207A9717
$$ -9883 -68836 101976 18482 -23439 129349 44081 123881 -25320 185300 119093 19717
11893B50872a76907B4862J04622d36854a02794B0213a94059B00481B9449N9184
$$ 250872 -176907 24862 129484 -436854 -102794 20213 -194059 200481 29449 88633
11883H8633a61651c4848H9853e368l2255k86090A17609m6774h4290A19433E0073
$$ 88633 -161651 -34848 89853 -5368 -37623 -323713 117609 70835 -84290 119433 50073
11871A04089E046N3803f7666l660a2317j33226A54412g4599k13012I304b85228
$$ 104089 5046 58849 -67666 -71326 -12317 -145543 154412 -74599 -287611 9304 -285228
11859a9955A67907G148b66677L7025A0925e0783j7680b9907G1621K88471H6031
$$ -19955 167907 7148 -266677 -229652 10925 -50783 -68463 -29907 71621 360092 86031
11847B04578H1129c24238A8971a26686I4687C9386L0784C360b2533B1547c17620
$$ 204578 81129 -324238 18971 -126686 94687 39386 70170 3360 -22533 21547 -317620
11835a07010B7903N9720b4139k2004k64007g9658I7898c7q6227D63248a44199
$$ -107010 27903 87623 -24139 -46143 -310150 -79658 97898 -37 -86264 463248 -144199
11823h1181G4869a28698L2892l3127I2811b93700A08975J19830A10940b09299
$$ -81181 74869 -128698 -95806 -128933 92811 -293700 108975 228805 110940 -209299
11812D9906a01141j12272A0074a70254M4174C3793b92301A41922Q6343H2065b7576
$$ 49906 -101141 -213413 10074 -170254 -126080 33793 -292301 141922 228265 82065 -27576
11800i2054C0898M0075b11785Q5430j03461C18420a41460D7397a9897r8924I9403
$$ -92054 30898 70973 -211785 -126355 -229816 318420 -141460 47397 -19897 -118821 99403
11788B21836p4367g419q933j48830A29569n9806K99683a54722A06832J66426a32244
$$ 221836 147469 -7419 -16352 -165182 129569 69763 369446 -154722 106832 273258 -132244
11776B13999k6928a49953L8214B79086b56266B0590L55512b87587A2444K09853
$$ 213999 187071 -149953 -111739 279086 -256266 20590 376102 -287587 12444 222297
11766B22297n294f8423p7222B2910g243F3622O770b42541j28375h247k99308I9784
$$ 222297 217003 -68423 -145645 22910 -7243 63622 70392 -242541 -370916 -8247 -307555 99784
11753h7860b5699o6855B42627A1313N7361Q1255a2535A18449c39299f75A5479
$$ -87860 -25699 -92554 242627 11313 68674 149929 -12535 118449 -339299 -675 15479
11741a4153A46379n6729A8511a2001A17944O3092l9479n5732l5637g9251H6022
$$ -14153 146379 89650 18511 -12001 117944 181036 141557 85825 50188 -79251 86022
11729C68445a02527j54334F2412J5178f5741D5173J72284e1253q471B83879o4238
$$ 368445 -102527 -256861 62412 77590 -65741 45173 217457 -51253 -59724 283879 219641
11718B19641R721b89210h6996B19206a0160B7765K71914g8675B40824E0402J80300
$$ 219641 229362 -289210 -86996 219206 -10160 27765 299679 -78675 240824 50402 230702
11707B30702C6590K30556j25395J8031G610b73384i5707o8364K4312j37778B64169
$$ 230702 36590 267146 141751 159782 7610 -273384 -95707 -164071 -139759 -277537 264169
11695A45718R0760k3514m1716J73932i5399c4122A33122m2196a90924L5316B11649
$$ 145718 236478 212964 171248 345180 -95399 -34122 133122 90926 -190924 -155608 211649
11683a6073B24426A8863b30113B22291c4255m36542G40K26605a40751f6511j38949
$$ -16073 224426 18863 -230113 222291 -34255 -470797 740 227345 -140751 -66511 -205460
11672b05460A44404e4559A35996a27073C29761h8093j07810O2978q0719a02609
$$ -205460 144404 -54559 135996 -127073 329761 -88093 -195903 -132925 -213644 -102609
11661B8212g3334I4830a2546E5972J70568j11177A2108J89741I4106a72344B8725
$$ 28212 -73334 94830 -12546 55972 226540 115363 12108 201849 94106 -172344 28725
11649A37832k9613b4018r7918L9917j38909B150a7665H3555O9153b35020A20789
$$ 137832 108219 -24018 -121936 -82019 -220928 2150 -17665 83555 152708 -235020 120789
11637E647Q883J5644a29190A40693f4819j71842B90023D0329b8445A22285j3086
$$ 5647 14530 30174 -129190 140693 -64819 -236661 290023 40329 -28445 122285 109199
11626A09199k3666k6000c33548B51623j06514J1139l4667f2740b2755k40300P3903
$$ 109199 85533 59533 -333548 251623 145109 156248 121581 -62740 -22755 -263055 -189152
11615a89152P8104G0769b00785B5429l890N6019a80709k16313a0181A67161B2477
$$ -189152 -111048 70769 -200785 25429 21539 77558 -180709 -397022 -10181 167161 22477
11603A77124H4315J4916b42110B51612a15312B4567d9486C80846q6773A6750N8569
$$ 177124 84315 99231 -242110 251612 -115312 24567 -49486 380846 294073 16750 75319
11592G5319e2916F6189b29193A71250K4750J74796m0688J19518c5531B11101q2503
$$ 75319 -52916 66189 -229193 171250 196000 370796 330108 449626 -35531 211101 128598
11581A28598l8557a17126K1065A32779a12530B07848E9940J5987J32731J55988
$$ 128598 90041 -117126 -96061 132779 -112530 207848 59940 75927 208658 364646
11571C64646j68083p5945m6695J1606Q4943o6305J17659E9319a10792C03380j10413
$$ 364646 196563 120618 73923 85529 170472 104167 221826 59319 -110792 303380 192967
11560A92967L3628B4126J6298o295J43834k7103A5419K13429P8441b03375a00150
$$ 192967 226595 24126 40424 34129 177963 150860 15419 228848 307289 -203375 -100150
11548A02936a19964J9262H8646l0343e4842k22223A06333j9804K25529C0391N4852
$$ 102936 -119964 -100702 88646 58303 -54842 -277065 106333 86529 312058 30391 85243
11537H5243J35814o0578F9906N33346j67454A46410A8698J87933b25742A18558
$$ 85243 221057 160479 69906 603252 435798 146410 18698 206631 -225742 118558
11526B02259p8840E338L40490j62768n7778J94158E1723i8739F7389P5097a38644
$$ 202259 123419 5338 345828 183060 125282 319440 51723 -98739 67389 142486 -138644
11514A08656a04053A62812n5884g2802I4972L15926j72745I6729J18150E3458
$$ 108656 -104053 162812 106928 -72802 94972 410898 238153 96729 214879 53458
11503I6630J43156K9714K3458j40941J7868c788A10981J20149a88375B53045a74331
$$ 96630 239786 269500 292958 152017 169885 -3788 110981 231130 -188375 253045 -174331
11491A33596K48848B6383J12127j5979m0481h7144A59552J35304A09164N9392
$$ 133596 382444 26383 138510 122531 82050 -87144 159552 294856 109164 168556
11481A68556F105a65447A64080h4239D50738a99117d1703B33185j04742O0545
$$ 168556 6105 -165447 164080 -84239 450738 -199117 -41703 233185 128443 188988
11471A88988G7324O3158m3854J78024Q4974A71562K55316B1090a44312m0712E4280
$$ 188988 77324 140482 96628 274652 359626 171562 426878 21090 -144312 -185024 54280
11459A56062g1781B3214i6765L2320a6954H3731d69432E4362J89546j09786K41308
$$ 156062 -71781 23214 -96765 -64445 -16954 83731 -469432 54362 243908 134122 375430
11448C75430a44106A73573N6386b23756A64606J3146J39403A1294L91514j17841
$$ 375430 -144106 173573 229959 -223756 164606 177752 317155 11294 402808 284967
11438B84967a450C4455J20720g5792A14751b28075c6429C9463a10752K4891C57172
$$ 284967 -1450 34455 155175 -75792 114751 -228075 -36429 39463 -110752 -85861 357172
11426a7879A44573E4499j6430L74507r8762d7716B3328K51552b11161A55676M2393
$$ -17879 144573 54499 38069 412576 313814 -47716 23328 274880 -211161 155676 198069
11415A98069i7559m5000A58091a86102C25347o0862b76450f1612i914G0486a72778
$$ 198069 -97559 -142559 158091 -186102 325347 264485 -276450 -61612 -9914 70486 -172778
11403a09936B88047l0909H6914m3110a46330A04601e9582b5163j69220a669B05653
$$ -109936 288047 257138 86914 43804 -146330 104601 -59582 -25163 -194383 -1669 205653
11391E8099a73285C44335j49283G4186N1236d045C44646j61538a63290N1746j9273
$$ 58099 -173285 344335 195052 74186 125422 -4045 344646 183108 -163290 -111544 -130817
11380a30817g107k63138J2400I2532J20257b8578r7921q8272C3367M4580G640
$$ -130817 -7107 -270245 -257845 92532 212789 -28578 -126499 -214771 33367 77947 7640
11368G7566B9603L7818n754j0636e9676o1742C3699K60287a65746A43708a7960
$$ 77566 29603 67421 61667 51031 -59676 -121418 33699 293986 -165746 143708 -17960
11356a97673e8800n0341j21052d3929C61421a95833A8055a77328A22001J24113
$$ -197673 -58800 -109141 -230193 -43929 361421 -195833 18055 -177328 122001 246114
11346B46114b01100g4643A24194a95624f3334j25757a6404j41669o013A47076
$$ 246114 -201100 -74643 124194 -195624 -63334 -189091 -16404 -158073 -164086 147076
11335I6967a69890D6564b37950p2841J10760B44157l3946b20352o1767R6504B36000
$$ 96967 -169890 46564 -237950 -310791 -200031 244157 210211 -220352 -282119 -185615 236000
11323B28914h7063K5353C1879M5121a77621c4467A48701a74006B5028d833H2621
$$ 228914 -87063 -61710 31879 77000 -177621 -34467 148701 -174006 25028 -4833 82621
11311C7895O358d6842C6560f7073D3465a69252q5977h755B65336g5207k8232A107
$$ 37895 44253 -46842 36560 -67073 43465 -169252 -255229 -8755 265336 -75207 -103439 1107
11298a09766G6378L5213C9917a4059r1348o4801j03280D1204a42148D9704a5584
$$ -109766 76378 111591 39917 -14059 -105407 -170208 -273488 41204 -142148 49704 -15584
11286A8834b67131a00329k26516a30855D8179h7022K4733A19961a65575c0292
$$ 18834 -267131 -100329 -326845 -130855 48179 -87022 -62289 119961 -165575 -30292
11275A29519A3519O0349O2425c34934J15496m6109J14602A25843b34349B36919
$$ 129519 13519 73868 136293 -334934 -219438 -265547 -150945 125843 -234349 236919
11264b33129A16296F424A55h2185j70222H3684L6425i32D9415b42468e0029r5909
$$ -233129 116296 6424 155 -82185 -252407 83684 120109 -932 49415 -242468 -50029 -145938
11252a45938A50539G4203A0375a90008j62408J44453A18602g0011j04306r3843
$$ -145938 150539 74203 10375 -190008 -352416 -207963 118602 -70011 -174317 -268160
11242b68160c7094n5978k7980g130A01384L1362D9235P5499a8199N362o981l83175
$$ -268160 -37094 -93072 -121052 -7130 101384 132746 49235 124734 -18199 -12837 -19818 -402993
11230d02993i9262A6291b68856B1605b22029G043J5616a39445j03729d5590G8665
$$ -402993 -99262 16291 -268856 21605 -222029 7043 22659 -139445 -243174 -45590 78665
11218g1345r0421L5568M6570A5368a05105N1178A6352P3659K9160k99a42640j12181
$$ -71345 -161766 -126198 -79628 15368 -105105 -53927 16352 90011 119171 118872 -142640 -254821
11206b54821d9575B32148J3341E8458a31972h08j93187J5353D76609A62337p0946
$$ -254821 -49575 232148 245489 58458 -131972 -808 -193995 -178642 476609 162337 91391
11195I1391c6797j50287P0841j99594B8438J87843h4551a2110A98766b05057i6781
$$ 91391 -36797 -187084 -116243 -315837 28438 216281 -84551 -12110 198766 -205057 -96781
11183b36227J14085e4489B0323b23926F7943K53110f1369G3510a0202G4404e0449
$$ -236227 -122142 -54489 20323 -223926 67943 321053 -61369 73510 -10202 74404 -50449
11171b61070e1578n9987k17786C17698a09598k10554e3053K5553B84166j11923
$$ -261070 -51578 -111565 -329351 317698 -109598 -320152 -53053 -27500 284166 172243
11161A72243q2509R3168L5230a08255A33631n491a56279G4009J3684b06207J767
$$ 172243 89734 182902 218132 -108255 133631 128140 -156279 74009 87693 -206207 -204440
11150b04440F056K73813b37058d1597J1974E5532b2303l1067o1765j14729A13694
$$ -204440 6056 279869 -237058 -41597 -29623 55532 -22303 -53370 -115135 -229864 113694
11138a46550A15554M2315g4216C1599L0961A606J52151a24257A3162L12753H6980
$$ -146550 115554 157869 -74216 31599 62560 1606 153757 -124257 13162 325915 86980
11126B02239d606j52382e4969k41042a37468B65273a1907C2522o944a24961j06889
$$ 202239 -4606 -156988 -54969 -296011 -137468 265273 -11907 32522 25578 -124961 -231850
11115b31850E30174E3271L09630a73649O9803q030B85096n6502j07779J4351J42434
$$ -231850 530174 53271 362901 -173649 -103846 -111876 285096 228594 120815 135166 277600
11104B77600c4008C84636c4499E4931O0373l8858P4551a70895B37750p4306E0332
$$ 277600 -34008 384636 -34499 54931 115304 76446 150997 -170895 237750 163444 50332
11092D90890a52106F1394b21670A25571f1932H3360a14677B51355Q1327H0893
$$ 490890 -152106 61394 -221670 125571 -61932 83360 -114677 251355 332682 80893
11081A59213J57981r4009l5469K34632e1768A59522l6971g790C29020f786C97396
$$ 159213 317194 223185 187716 422348 -51768 159522 122551 -7790 329020 -6786 397396
11069C41194n8243M47222A02531K33953n8580J40399j47327J74732q6833J06384
$$ 341194 282951 730173 102531 336484 277904 418303 270976 445708 358875 465259
11059D65259p109j38491K34419o4591Q4987K37576j80255j92646J08053A38225
$$ 465259 458150 319659 554078 489487 574474 812050 631795 439149 547202 138225
11048G41943k0931j57630j49340K76405M3568N968l23081P9083Q5310j4024K09774
$$ 741943 721012 563382 414042 690447 734015 739983 416902 495985 581295 567271 777045
11037G77045k30568J30156k4309j9091R2841C45501J28456R9525k03608L30731
$$ 777045 546477 676633 652324 633233 726074 345501 473957 573482 369874 700605
11027G00605J90793L4963k35660A81949O73864j42371C54389J38117J3135P3033
$$ 700605 891398 926361 690701 181949 855813 713442 354389 492506 505641 578674
11017E78674L22741l62834O0797j34526L22193l12694J11264j70949J57701A98568
$$ 578674 901415 538581 599378 464852 787045 474351 585615 414666 572367 198568
11006E75406B65753J28643L26898m910j35293m7231B09198J80532N6895J73310
$$ 575406 265753 394396 721294 716384 581091 533860 209198 389730 446625 619935
10996F19935L32285j28437P8896J54851l33581J99757C83292L75943p1363K88762
$$ 619935 952220 823783 902679 1057530 723949 923706 383292 759235 687872 976634
10986I76634l2591K1609k36664K73377m6080K73025n6209J57255N485K48333J36856
$$ 976634 944043 965652 728988 1002365 956285 1229310 1173101 1330356 1335841 1584174 1721030
10975A721030L79726J61014n0161L86730K70838m31044m702j38820j36974k25879
$$ 1721030 2100756 2261770 2211609 2598339 2869177 2438133 2433431 2294611 2157637 1931758
10965A931758l39284K17706m47847L8428J91509l62611O78584k94201M50096l53473
$$ 1931758 1592474 1810180 1362333 1400761 1592270 1229659 1908243 1614042 2064138 1710665
10955A710665J62070l10652k80526J40824n99649j72969M7908J79525l20778k54272
$$ 1710665 1872735 1562083 1281557 1422381 822732 649763 697671 877196 556418 302146
10945C02146K9738K2115Q5962J04169F3891P5875J10540G4979e7637B62951B0672
$$ 302146 331884 353999 439961 544130 63891 139766 250306 74979 -57637 262951 20672
10933c00957A87636F5863L57780D1952f6687B4679O105O0549B0744d04026b3082
$$ -300957 187636 65863 423643 41952 -66687 24679 30784 91333 20744 -404026 -23082
10921A77480D290J15933d1309r004C56709C6998j0322J38719B5975c1883n114
$$ 177480 4290 120223 -41309 -50313 356709 36998 26676 165395 25975 -31883 -36997
10910c6997j73123a01850j08880E2533a32409C0721g5873G7798d40848E8037c1998
$$ -36997 -210120 -101850 -210730 52533 -132409 30721 -75873 77798 -440848 58037 -31998
10898A73175l2614K4498h3542n5484F8029R0708b2430j72460i0502n2939j69426
$$ 173175 140561 165059 -83542 -139026 68029 158737 -22430 -194890 -90502 -143441 -312867
10887c12867C31393j09340g3653r7959D12731g1581k67003J29401m5010E4552
$$ -312867 331393 222053 -73653 -171612 412731 -71581 -338584 -209183 -254193 54552
10876h5390j39450c4689A67722J3765a26597a2600o6079A13792A7657L1582b92376
$$ -85390 -224840 -34689 167722 181487 -126597 -12600 -78679 113792 17657 49239 -292376
10864c22410J21362D9680a04095d6829E3128a91427F4965H934b00985a8857A02607
$$ -322410 -201048 49680 -104095 -46829 53128 -191427 64965 8934 -200985 -18857 102607
10852D2729a10148b8577D2876G899f7332j03459A03134c56363M1875A49889c8348
$$ 42729 -110148 -28577 42876 7899 -67332 -170791 103134 -356363 -314488 149889 -38348
10840a65810B39533d4310j78165O7381N8542G4970a14212k04213A20228fA38351
$$ -165810 239533 -44310 -222475 -155094 -96552 74970 -114212 -318425 120228 -6 138351
10828i3363C06844F1647a65092d3670h099B86531a37011B83223b46598A85418
$$ -93363 306844 61647 -165092 -43670 -8099 286531 -137011 283223 -246598 185418
10817b15727N3008j60471a26545k87064E3307b74647B26417j02726D214J24271
$$ -215727 -162719 -323190 -126545 -413609 53307 -274647 226417 123691 4214 128485
10807A28485d3979B823a15306j51463A39823e4729A822M11964A23576a7030l58096
$$ 128485 -43979 2823 -115306 -266769 139823 -54729 1822 413786 123576 -17030 -375126
10796c75126i5951r2177g0202j70421B05157e3187D6908r756b49164A87156l1508
$$ -375126 -95951 -188128 -70202 -240623 205157 -53187 46908 37152 -249164 187156 155648
10785A55648g6685r159D949b00990A13992l4653a85507L4927A71981f9308j04322
$$ 155648 -76685 -85844 4949 -200990 113992 79339 -185507 -150580 171981 -69308 -173630
10774a73630A572J03142n0270O1102h5581l1566K0572p302j9552o5012A29751
$$ -173630 1572 104714 54444 115546 -85581 -117147 -96575 -103877 -123429 -188441 129751
10762D8451K45406b14844F3554J24198b04291c9789j92041K7984j33362a42131
$$ 48451 293857 -214844 63554 187752 -204291 -39789 -231830 -203846 -337208 -142131
10751a26071A18017b07112C52322h9408c1458r8854d5266e873j87292q5525a16922
$$ -126071 118017 -207112 352322 -89408 -31458 -130312 -45266 -5873 -193165 -278690 -116922
10739c41882J3744f0232K3934B29474q1483c43463B31606e6505m1838j96137B0542
$$ -341882 -328138 -60232 -36298 229474 147991 -343463 231606 -56505 -98343 -294480 20542
10727I913a17742j99192A734g3327l33960i7421B4882L5812a74992k72497a85433
$$ 9913 -117742 -316934 1734 -73327 -407287 -97421 24882 60694 -174992 -447489 -185433
10715b53150c7701k10680B01312Q8960d6154A64671a29947A26836a29180G1037
$$ -253150 -37701 -248381 201312 290272 -46154 164671 -129947 126836 -129180 71037
10704a71871O7127A29727a3874G6969c45619B7323J3794K35789c8431p0699J4948
$$ -171871 -104744 129727 -13874 76969 -345619 27323 41117 276906 -38431 -109130 -94182
10693i4182l96604A5961J9392A5493a5837D2563a7301G1267c90442a68671A02641
$$ -94182 -490786 15961 35353 15493 -15837 42563 -17301 71267 -390442 -168671 102641
10681H116d7670B82712b9056o8165A69686B5156a96982B51782I6317c28275G1257
$$ 8116 -47670 282712 -29056 -97221 169686 25156 -196982 251782 96317 -328275 71257
10669b64164a13763j71376a35034j56364P3446f5266k8460j75492h9639j17032
$$ -264164 -113763 -285139 -135034 -291398 -217952 -65266 -93726 -269218 -89639 -206671
10659b06671M5836B43498e3295k32506B34594a11576q5856r1160A81473f3026
$$ -206671 -160835 243498 -53295 -285801 234594 -111576 -197432 -288592 181473 -63026
10648a78377q146j64203a02471c233D76353E933f4329o2446m3765J2354A41547
$$ -178377 -186523 -350726 -102471 -3233 476353 5933 -64329 -126775 -170540 -158186 141547
10636a98668C65247d177k21482C25960F9632c7540o0244d0982A21300J01367b3922
$$ -198668 365247 -4177 -225659 325960 69632 -37540 -97784 -40982 121300 222667 -23922
10624a44342E6253C409e1944F0198d9576A06305d41198a02047j16980P0455C15925
$$ -144342 56253 3409 -51944 60198 -49576 106305 -441198 -102047 -219027 -148572 315925
10612A58862h8244I7892a14081j61893e4403C65365f8021f454l08999J1819I946
$$ 158862 -88244 97892 -114081 -275974 -54403 365365 -68021 -6454 -315453 -303634 9946
10600a46952I6342a50933j31861A40077k560b13228Q8482I6597O706a60514D5028
$$ -146952 96342 -150933 -282794 140077 137517 -213228 -124746 96597 103303 -160514 45028
10588B908g6427A34a79714Q8865b692A74543g4478m5763l281A27716g4723A19847
$$ 2908 -76427 134 -179714 -90849 -2692 174543 -74478 -120241 -123522 127716 -74723 119847
10575A68157F1984J02928F5485a81903A65031A286J86760N09l4648a9603B22377
$$ 168157 61984 164912 65485 -181903 165031 1286 188046 188555 153907 -19603 222377
10563b1130m8321D1712b08125B05472b9939i076F5626B1429f764k68148B01877
$$ -21130 -69451 41712 -208125 205472 -29939 -9076 65626 21429 -6764 -274912 201877
10551b60945a22320l97812a3412B541b7380D3771h2926k22056N1674b453j9138
$$ -260945 -122320 -520132 -13412 2541 -27380 43771 -82926 -304982 -253308 -2453 -21591
10540b1591A03921a90634E0701a8827A52555j3264h0369B81048a79666n5681G6117
$$ -21591 103921 -190634 50701 -18827 152555 139291 -80369 281048 -179666 -235347 76117
10528a29804j28230B35047a63596C59953d60334B77829e1396j21753a9625k0041
$$ -129804 -258034 235047 -163596 359953 -460334 277829 -51396 -173149 -19625 -39666
10518c9666B98232A39163d35796B96151i1751j0499M0346m8685A47418f6842o7443
$$ -39666 298232 139163 -435796 296151 -91751 -102250 -61904 -110589 147418 -66842 -134285
10507a34285p0970h7990F5496J54219c2598C1440N0708A0447g6328H0237J51347
$$ -134285 -205255 -87990 65496 219715 -32598 31440 82148 10447 -76328 80237 231584
10496B31584l4926K06852f7883J3686F4005i4165a001A48199a78439B2128N23381
$$ 231584 196658 403510 -67883 -54197 64005 -94165 -1001 148199 -178439 22128 545509
10485E45509A35132d5611E45259n7903o3202L04379C11346q8660c278E8036J53376
$$ 545509 135132 -45611 545259 487356 424154 728533 311346 222686 -3278 58036 211412
10474B11412C4981i6380n2779A87932a65410B42007I3246O8961M7253a52180H0011
$$ 211412 34981 -96380 -149159 187932 -165410 242007 93246 162207 209460 -152180 80011
10462b68575A34650a44774c9356C08876f6628A79361a44792F470J80254G8391
$$ -268575 134650 -144774 -39356 308876 -66628 179361 -144792 6470 186724 78391
10451b69120E7049c28273C9188K0573b49709d6390g284A54643a24010p0419o1532
$$ -269120 57049 -328273 39188 59761 -249709 -46390 -7284 154643 -124010 -194429 -255961
10440b55961A03954b4871A25394a66493c7693B53438l1056E9372b80731A95494
$$ -255961 103954 -24871 125394 -166493 -37693 253438 222382 59372 -280731 195494
10429A28713L1798d6448k744f515j15385q0866h2154n7761E5721a19670q3523
$$ 128713 160511 -46448 -49192 -6515 -121900 -202766 -82154 -139915 55721 -119670 -203193
10418b03193D098Q2775c30627K6712G9298a50177A87181c5384k81896A30615l7605
$$ -203193 4098 86873 -330627 -303915 79298 -150177 187181 -35384 -317280 130615 93010
10407I3010p282b55202B27336a79062J8358L2267q8734b1563j303B5765H753P9395
$$ 93010 85728 -255202 227336 -179062 -160704 -128437 -217171 -21563 -22866 25765 8753 88148
10395H8148a1028d694E2632e9521b6150A41131a67286b2467J0816j61823e6381
$$ 88148 -11028 -4694 52632 -59521 -26150 141131 -167286 -22467 -11651 -173474 -56381
10383f0604p9443A66484e7950E33197b63995C84180L0093b8582E7125P5250l3516
$$ -60604 -140047 166484 -57950 533197 -263995 384180 414273 -28582 57125 132375 98859
10372I8859L3269J13228c95844D63103B12720R4197K80827k31434J08411j47054
$$ 98859 132128 245356 -395844 463103 212720 306917 587744 356310 464721 317667
10362C17667O8973I9504J00213A2768K56342n8944d8731B17625K35375j11060
$$ 317667 386640 99504 199717 12768 269110 210166 -48731 217625 453000 341940
10352C41940l8935N7566L70086k08549B02146L6495h9172E77331m2106O2405k62646
$$ 341940 303005 360571 730657 522108 202146 238641 -89172 577331 535225 597630 334984
10341C34984o5632E8580K63676a62529A60584a38919I5517L11546A38427C4825
$$ 334984 269352 58580 322256 -162529 160584 -138919 95517 407063 138427 34825
10330g007k94769D01691j42828D0434H988Q6169K7857M35695A86060j3181J74519
$$ -7007 -301776 401691 258863 40434 8988 95157 123014 558709 186060 172879 347398
10319C47398A19766C5693J42884Q7983P0727b71523B17357c6342D9315a35861
$$ 347398 119766 35693 178577 266560 337287 -271523 217357 -36342 49315 -135861
10308b79534C10180B0930a77147j48754B1920N9202K4098J2332J6335d6305A79232
$$ -279534 310180 20930 -177147 -325901 21920 81122 105220 117552 133887 -46305 179232
10296I6516J20415J6846h1664B52642a68666H095h9967C75753b59254a4739l284
$$ 96516 216931 233777 -81664 252642 -168666 8095 -89967 375753 -259254 -14739 -18023
10285a8023a549o9276a4191j9233j8539A3550d08166R6945K8566h9368p4798A18607
$$ -18023 -1549 -70825 -14191 -33424 -51963 13550 -408166 -311221 -282655 -89368 -164166 118607
10272a30952E7151h4164F9452K09340g720q5790b44j4291j9310B40486l3849k030
$$ -130952 57151 -84164 69452 278792 -7720 -93510 -244 -14535 -33845 240486 206637 204607
10260B04607K26947a11658B28668L22764B10878L6735b4686B7098a06142I2035
$$ 204607 431554 -111658 228668 551432 210878 247613 -24686 27098 -106142 92035
10249c57938C98771a52279H4176D1327J29378b99256F8478c17544A6405a90252
$$ -357938 398771 -152279 84176 41327 170705 -299256 68478 -317544 16405 -190252
10238A62517e5694k18318d3778k43157a12231j75198a03250l175j88059A4844
$$ 162517 -55694 -274012 -43778 -286935 -112231 -287429 -103250 -106425 -294484 14844
10227c26886f2373j1443C01282A01824a81327H892a9081A63635J46671B1083g7128
$$ -326886 -62373 -73816 301282 101824 -181327 8892 -19081 163635 310306 21083 -77128
10215B75399c4980m3100c5310q2251K3094A85771a75782e8938E9177B7223M6902
$$ 275399 -34980 -78080 -35310 -117561 -94467 185771 -175782 -58938 59177 27223 74125
10204G4125b62199P4162B40481N714d1752j2786A02724b68971B13576a10652J9815
$$ 74125 -262199 -188037 240481 246195 -41752 -54538 102724 -268971 213576 -110652 -90837
10193i0837G7929a3212k13241J6647c1843r4221A49340A1554K68743a65638F8588
$$ -90837 77929 -13212 -226453 -209806 -31843 -126064 149340 11554 280297 -165638 68588
10181e3055j37889A27222b96402B9966a35306r0034P7845k8252A90051b08415
$$ -53055 -190944 127222 -296402 29966 -135306 -225340 -147495 -175747 190051 -208415
10170A29106D8129a7505C3571M1038J03052n5942j0351a68416l91966b34352A90247
$$ 129106 48129 -17505 33571 74609 177661 121719 111368 -168416 -560382 -234352 190247
10158f7431J4683l37185R9727J02945f8139F4973a564A41984K9885a13648A39964
$$ -67431 -52748 -389933 -290206 -187261 -68139 64973 -1564 141984 171869 -113648 139964
10146h8405n1503j22682C26499A57828b07324C4415g6393H8470J6140j059b57338
$$ -88405 -139908 -262590 326499 157828 -207324 34415 -76393 88470 104610 103551 -257338
10134f5062m61708K57749m7507D104b11692g3345n4405A01666a30835O0390A20968
$$ -65062 -526770 -269021 -316528 4104 -211692 -73345 -127750 101666 -130835 -70445 120968
10122b30483a7530E4578g8313j02254A4391K4216a91174D3055d1125k70871J49238
$$ -230483 -17530 54578 -78313 -180567 14391 38607 -191174 43055 -41125 -311996 -162758
10111a62758k7648p0778d6499o7246k46538A87570j9210B0941J313a04912b6286
$$ -162758 -190406 -261184 -46499 -113745 -360283 187570 168360 20941 22254 -104912 -26286
10099E3896K3610A9069K674e8537k5655F2442h1839A52784b20973O6424B55329
$$ 53896 77506 19069 21743 -58537 -84192 62442 -81839 152784 -220973 -154549 255329
10087h3624K131B30956c2757n2780A22753b209j94882P2847A49052b15056m9947
$$ -83624 -81493 230956 -32757 -85537 122753 -2209 -197091 -124244 149052 -215056 -265003
10076b65003a27396j2413a0906l09055J13581Q4974e3105j16183F3829i905B2212
$$ -265003 -127396 -139809 -10906 -319961 -206380 -121406 -53105 -169288 63829 -9905 22212
10064A44742a7449l8636E7874J1679b5820J0062l7682D3004b23592B1485c00715
$$ 144742 -17449 -56085 57874 69553 -25820 -15758 -53440 43004 -223592 21485 -300715
10052B13946l7588q8074B9601g4924j05656L4985F0112a87475F7490b7112E9239
$$ 213946 176358 88284 29601 -74924 -180580 -145595 60112 -187475 67490 -27112 59239
10040b91055g3983E7270P3929i377B85244a77682G0551a23913C173M6488b59951
$$ -291055 -73983 57270 131199 -9377 285244 -177682 70551 -123913 3173 49661 -259951
10028i2104G720c61965g8696j27996B43597k5846a99416A2640J09247b90487h3945
$$ -92104 7720 -361965 -78696 -206692 243597 217751 -199416 12640 121887 -290487 -83945
10016d13964a88326O0974a1831B89332L5732a14948N7430A43661J479a75531o6424
$$ -413964 -188326 -127352 -11831 289332 325064 -114948 -57518 143661 145140 -175531 -241955
10005b41955A08490l3339a48597j41468K6244a07528M9006j23824B32603a18397
$$ -241955 108490 75151 -148597 -290065 -263821 -107528 -58522 -182346 232603 -118397
9994a92407A93578a98122i6827j37930A8982J37010b18812L4705O4413A73775
$$ -192407 193578 -198122 -96827 -234757 18982 155992 -218812 -184107 -119694 173775
9983b24691C0651O1544k8886e99557C6547c63239o6950i0690A41280a14721k43915
$$ -224691 30651 92195 63309 -599557 36547 -363239 -430189 -90690 141280 -114721 -358636
9972c58636G8939b09142A97232a64440j1570o5402A71784c78573B11217i1054
$$ -358636 78939 -209142 197232 -164440 -176010 -241412 171784 -378573 211217 -91054
9961a89997B69873c31993e8802q8242A24225m6332a0239m5716j97124J7503i3532
$$ -189997 269873 -331993 -58802 -147044 124225 77893 -10239 -55955 -253079 -235576 -93532
9949G2588q24O3599A9373f1496p5372f1085j97218A51827C3032b19550a2811j20859
$$ 72588 71764 135363 19373 -61496 -136868 -61085 -258303 151827 33032 -219550 -12811 -133670
9937a33670F572a51465c3893j21597e6548A02602h5955A28913I555b01762H2003
$$ -133670 6572 -151465 -33893 -155490 -56548 102602 -85955 128913 9555 -201762 82003
9925b23678B71998a37794L1B167J8094a56334B57070b61014A58988N4806b34318
$$ -223678 271998 -137794 -137763 2167 20261 -156334 257070 -261014 158988 213794 -234318
9913A17858a93605r5019A2474N7859a13752B3156a45538o0576K3511L4805c9735
$$ 117858 -193605 -288624 12474 70333 -113752 23156 -145538 -206114 -182603 -147798 -39735
9901B3094c48741B50352A20933h8176m7113K7434r3995h1581k99681R5490F8794
$$ 23094 -348741 250352 120933 -88176 -135289 -107855 -201850 -81581 -381262 -285772 68794
9889G3354M7392E2604a98165A29317a37476k45177B0125O6980B8217c1790A44399
$$ 73354 120746 52604 -198165 129317 -137476 -382653 20125 87105 28217 -31790 144399
9877G7046O2238B0441J7630a27811l21549I9087a70450N3937A70084b44692h1189
$$ 77046 139284 20441 38071 -127811 -449360 99087 -170450 -116513 170084 -244692 -81189
9865B365J41882h3720a5655A48815D6069O341J15493b769k92308L6713o0563O4956
$$ 2365 144247 -83720 -15655 148815 46069 52410 167903 -2769 -295077 -258364 -318927 -253971
9853b53971A9369J70392a05199G6692C3581K9351a44104A60625a04943A41860
$$ -253971 19369 189761 -105199 76692 33581 62932 -144104 160625 -104943 141860
9842a15752b2762H7699a51126H6022a68067A12305a12503B35445a73613C7010
$$ -115752 -22762 87699 -151126 86022 -168067 112305 -112503 235445 -173613 37010
9831d6742k61914C06882b49855G1035d13089G8887a30206k05178J56738A61460
$$ -46742 -308656 306882 -249855 71035 -413089 78887 -130206 -335384 -178646 161460
9820c74293e4722A61164B793a33658A10551b46409M6563H0890c33026R432I1410
$$ -374293 -54722 161164 2793 -133658 110551 -246409 -199846 80890 -333026 -323594 91410
9808I0469g3100o6595A65646o8416q501J57769j5478a11586N2714C7010J33932
$$ 90469 -73100 -139695 165646 97230 88729 246498 231020 -111586 -58872 37010 170942
9797A70942a54621k8656f3934k4278D3157h6589A25429A3519R410e0936K1251
$$ 170942 -154621 -183277 -63934 -88212 43157 -86589 125429 13519 22929 -50936 -29685
9786b9685j69603H7524i2024p2451A12141R650a62013j97812d7278K3313k54835
$$ -29685 -199288 87524 -92024 -164475 112141 121791 -162013 -359825 -47278 -23965 -278800
9775b78800k22348a6956D67196j49845l4684c9972p950j63754E1635c44807d8466
$$ -278800 -501148 -16956 467196 317351 282667 -39972 -47922 -211676 51635 -344807 -48466
9763A17572J96009I7137a94043h2925r6676n5798a07566J0166E6517d124A51311
$$ 117572 313581 97137 -194043 -82925 -179601 -235399 -107566 -97400 56517 -4124 151311
9751c91500c6350G5946b73856N1513F5700c17273a03178j08277c3130l81A8141
$$ -391500 -36350 75946 -273856 -222343 65700 -317273 -103178 -211455 -33130 -33511 18141
9739a1933j25416d6197h256k16480Q3432N1037b580k25992d8077p3053j44A25960
$$ -11933 -137349 -46197 -8256 -224736 -141304 -90267 -2580 -228572 -48077 -121130 -121274 125960
9726d1968o3453j12585J03129r9462N3508A70096j8527a33675R344j69622A65514
$$ -41968 -105421 -218006 -114877 -214339 -160831 170096 151569 -133675 -124331 -293953 165514
9714h6750f778A64400J55407D620a77350g8321E5636N7890f4877B6744a8344g668
$$ -86750 -6778 164400 319807 4620 -177350 -78321 55636 113526 -64877 26744 -18344 -7668
9701A33129N1575a22649L9303A12856J01100a11967m7919H8150J02960a20979
$$ 133129 184704 -122649 -83346 112856 213956 -111967 -159886 88150 191110 -120979
9690c30395A3986K9269K8848j5031f996A22023c79920A0072b4929H5162b38349
$$ -330395 13986 43255 72103 57072 -6996 122023 -379920 10072 -24929 85162 -238349
9678a7556l48979D1202a82588B11066n9925b41632A73793g3595k73448A6405c07216
$$ -17556 -366535 41202 -182588 211066 151141 -241632 173793 -73595 -347043 16405 -307216
9666a00815C8905q46a63344g3632A76129C563O2300b12218C7336J7650a41377
$$ -100815 38905 38059 -163344 -73632 176129 3563 65863 -212218 37336 54986 -141377
9654A0426J43105a08108l07122f8788k57262A30148b44344A49268b2328A8273
$$ 10426 153531 -108108 -415230 -68788 -326050 130148 -244344 149268 -22328 18273
9643H3962l9214i7793H5734b78864A17087f1378K5262j23733L7454C27963a45107
$$ 83962 44748 -97793 85734 -278864 117087 -61378 -36116 -159849 -122395 327963 -145107
9631D3037b6646C0825J14509c77352A63645h629l40858A73335b55391q2931A7819
$$ 43037 -26646 30825 145334 -377352 163645 -8629 -349487 173335 -255391 -338322 17819
9619c507F324a60054b5285a1487A32424F4789c03079h4252k96080d0485m8802
$$ -3507 6324 -160054 -25285 -11487 132424 64789 -303079 -84252 -380332 -40485 -89287
9608h9287F3253c18246b5377L179n8255G1615C0456e7840J72j02736K076l4712
$$ -89287 63253 -318246 -25377 -22198 -80453 71615 30456 -57840 -57668 -160404 -158328 -193040
9596a93040b6131q7175p6491i4371B98392q1205d06335i4699F921a52641A78955
$$ -193040 -26131 -113306 -189797 -94371 298392 217187 -406335 -94699 6921 -152641 178955
9584I0644i9478c3743H5523h9176d3560k14086A41197a16988B41937b18588B30558
$$ 90644 -99478 -33743 85523 -89176 -43560 -257646 141197 -116988 241937 -218588 230558
9572b7908l8116m520j07060P2038E4447b26365A58842f9645j02939c628A31327
$$ -27908 -66024 -70544 -177604 -105566 54447 -226365 158842 -69645 -172584 -3628 131327
9560b618B16488r0789a41252D14420k02031j5086d387p4473A14486f2381l0554
$$ -2618 216488 125699 -141252 414420 212389 197303 -4387 -78860 114486 -62381 -92935
9549i2935p465d2889k06586h9335c349r354F6348d1014l52703A7687a531l69599
$$ -92935 -100400 -42889 -249475 -89335 -3349 -12703 66348 -41014 -393717 17687 -1531 -371130
9537c71130B85789c7535j00131b8787j47557n4776F5686K3622b22040A5681c58837
$$ -371130 285789 -37535 -137666 -28787 -176344 -231120 65686 89308 -222040 15681 -358837
9525c20905A60220F4350a6637j70999j38313f009A71367e01675a43549A65059
$$ -320905 160220 64350 -16637 -187636 -325949 -6009 171367 -501675 -143549 165059
9514b83844A02174a31824G2412a99180f6115J1570k15091C6846c12146D20631
$$ -283844 102174 -131824 72412 -199180 -66115 -54545 -269636 36846 -312146 420631
9503B53979a28878o050A28336o0904b58932D9448b94651B38641a79381g2470P769
$$ 253979 -128878 -134928 128336 67432 -258932 49448 -294651 238641 -179381 -72470 -64701
9492f4701A12978J58424D2727b33447J16608j43194a03838a8632m9260A92227
$$ -64701 112978 271402 42727 -233447 -116839 -260033 -103838 -18632 -67892 192227
9481a36558j2611a7682p530m1394A59672c66799A3725l276h297D5893K54303b60970
$$ -136558 -149169 -17682 -25212 -66606 159672 -366799 13725 10449 -8297 45893 300196 -260970
9468B0216L07893b27283D3503b84828c0830j76312C09163b03654Q2470C9149c49772
$$ 20216 328109 -227283 43503 -284828 -30830 -207142 309163 -203654 -121184 39149 -349772
9456c5249k90455g4059b3408r2029P559B93558b88375H7196O0249m2057C5521
$$ -35249 -325704 -74059 -23408 -115437 -107878 293558 -288375 87196 147445 105388 35521
9444b31974E9116a09917n5751A74195h2034B98033a6124H6156e2615p0180j3946
$$ -231974 59116 -109917 -165668 174195 -82034 298033 -16124 86156 -52615 -122795 -136741
9433a36741m6608G4811b64318c7161k00398L7820F6270f4394r5759l9584B66936
$$ -136741 -183349 74811 -264318 -37161 -237559 -199739 66270 -64394 -160153 -199737 266936
9421b93430a0280j31113C56881I4279b8385j4935j62871g3432H7151d2371l5458
$$ -293430 -10280 -141393 356881 94279 -28385 -43320 -206191 -73432 87151 -42371 -77829
9410g7829o370C5661c00183B56825F0070a4989j14777L3737o9316f670n5168j3768
$$ -77829 -84199 35661 -300183 256825 60070 -14989 -129766 -96029 -165345 -6670 -61838 -75606
9398g5606n9443O0892A18552e2877k32429A22481b9544E2169L8929J49283b25047
$$ -75606 -135049 -74157 118552 -52877 -285306 122481 -29544 52169 91098 240381 -225047
9386i8485A85002a50569J4800A97440O4714j29216N9574m8785a19349K1709b4546
$$ -98485 185002 -150569 -135769 197440 262154 132938 192512 143727 -119349 -97640 -24546
9374b67954B0746d9415B45870H4415a99070L4149B82981D0578L9670b12242R1341
$$ -267954 20746 -49415 245870 84415 -199070 -164921 282981 40578 80248 -212242 -120901
9363a20901M76A85961g1967H1165b8002E7832a6487I8631J14260b12095A98396
$$ -120901 -120425 185961 -71967 81165 -28002 57832 -16487 98631 212891 -212095 198396
9351G0938b23137P446L6095A18818a59501A93539F305b47188j02305a56373n4589
$$ 70938 -223137 -215691 -179596 118818 -159501 193539 6305 -247188 -349493 -156373 -210962
9340b10962k2409A32071k6513L8565a22644j23497G0961c11575k5947R6162f3967
$$ -210962 -233371 132071 105558 144123 -122644 -246141 70961 -311575 -337522 -241360 -63967
9328A74019B4782b9404m22594a36698f5038l46175J63519A16735D6562J36352
$$ 174019 24782 -29404 -451998 -136698 -65038 -411213 -247694 116735 46562 182914
9318A82914C321a63014k08318l0871g9991j00228j00011K5459j10331Q4008n6855
$$ 182914 3321 -163014 -371332 -402203 -79991 -180219 -280230 -254771 -365102 -281094 -337949
9307c37949B285b52899J18723D3981N3636a77343C25104D0556K8068a28890A2083
$$ -337949 2285 -252899 -134176 43981 97617 -177343 325104 40556 68624 -128890 12083
9295f6168k14484E2622K33874j42719K4903G7391b42548J15662b8572p7020k19821
$$ -66168 -280652 52622 286496 143777 168680 77391 -242548 -126886 -28572 -105592 -325413
9284c25413A29320K32797b42596C9706d23535g7012L6790I6409c36302D4039r757
$$ -325413 129320 362117 -242596 39706 -423535 -77012 -40222 96409 -336302 44039 34282
9273C4282N1852c45893P7642A5141b6397E06535b17813K4504c6992B01256C5219
$$ 34282 86134 -345893 -268251 15141 -26397 506535 -217813 -193309 -36992 201256 35219
9261B45526d8155j0759A02189f8605m6979C7508a05301n5669g0207a0114l0236
$$ 245526 -48155 -58914 102189 -68605 -115584 37508 -105301 -160970 -70207 -10114 -40350
9250d0350J3383q9807o5122G8494b69998A95365a41618p416K2776l0394r5825
$$ -40350 -26967 -116774 -181896 78494 -269998 195365 -141618 -149034 -126258 -156652 -252477
9239b52477A06044e3869B2861g8204l6880H6669b32843F6079a67391n6879G5383
$$ -252477 106044 -53869 22861 -78204 -115084 86669 -232843 66079 -167391 -224270 75383
9227a06655B01391b56610B2282a18223j29758M5539A43136M3232a09756i424B05118
$$ -106655 201391 -256610 22282 -118223 -247981 -202442 143136 186368 -109756 -9424 205118
9215C5860a77057A64223d5548A38171b1261l9610P054D1017a06428C03658e7557
$$ 35860 -177057 164223 -45548 138171 -21261 -60871 -53817 41017 -106428 303658 -57557
9203c90862h5844E5795J19904l6153c27068i491j9913k62537J11363K0325A80334
$$ -390862 -85844 55795 175699 139546 -327068 -9491 -29404 -291941 -180578 -160253 180334
9191B99322b9769k59088N0561B9344b31406A20340b8102j98420b065B35007A3139
$$ 299322 -29769 -288857 -238296 29344 -231406 120340 -28102 -226522 -2065 235007 13139
9179b51482C0111a28887j9807K5534l1716A94862A8631a06087J7214j982A4128
$$ -251482 30111 -128887 -148694 -123160 -154876 194862 18631 -106087 -88873 -90855 14128
9167D4550b96380D1101a95190d3598A18554g3013j99251I1066a72163A1215b12929
$$ 44550 -296380 41101 -195190 -43598 118554 -73013 -272264 91066 -172163 11215 -212929
9155A11069f6559b1936j45686k0544j5078A2788i3611K2729D9267d3084r3164
$$ 111069 -66559 -21936 -167622 -188166 -203244 12788 -93611 -70882 49267 -43084 -136248
9144a36248M5090K6083J5451j0924j49806L5592A00107f6535C46385a74712j80589
$$ -136248 -91158 -65075 -49624 -60548 -210354 -174762 100107 -66535 346385 -174712 -355301
9133c55301a09433j79372r615e5285j15927b7289B11302a58347d9031J5187H6614
$$ -355301 -109433 -288805 -298420 -55285 -171212 -27289 211302 -158347 -49031 -33844 86614
9121F3913a83422k170H7396A8444g9885j31571C9081b49616a20393G2956M9148
$$ 63913 -183422 -185592 87396 18444 -79885 -211456 39081 -249616 -120393 72956 122104
9110A22104n0675b3129B14637K5286a94179M9567l6958o7012b8570a2394n5957
$$ 122104 71429 -23129 214637 239923 -194179 -144612 -181570 -248582 -28570 -12394 -68351
9099f8351H9569e4647j15188l8482m3725A16912L386l9567j0783J37799f8188
$$ -68351 89569 -54647 -169835 -208317 -252042 116912 120298 80731 69948 207747 -68188
9087b44607f1270p3706I3977L5308J8790a25727A33542e1907j20768H4093h1431
$$ -244607 -61270 -134976 93977 129285 148075 -125727 133542 -51907 -172675 84093 -81431
9075a95636J7743B79689c96528a3042A36744c4507l86561J29962g4579k75723
$$ -195636 -177893 279689 -396528 -13042 136744 -34507 -421068 -291106 -74579 -350302
9065c50302F5554a90508M2355r2764G5072a69052a5993k6140k96061J55155J9004
$$ -350302 65554 -190508 -148153 -240917 75072 -169052 -15993 -42133 -338194 -183039 -164035
9054a64035r0801A05204a45070P0850B03888r8783c50254a8964B54759a86839
$$ -164035 -254836 105204 -145070 -74220 203888 105105 -350254 -18964 254759 -186839
9043c265k31656C14447D6350K12825h8106B0373I069a48443m33376B43998a16799
$$ -3265 -234921 314447 46350 259175 -88106 20373 9069 -148443 -581819 243998 -116799
9031A39235e0037A80987h6641E6517c16643A15428m4217a18659d9159A29437a2939
$$ 139235 -50037 180987 -86641 56517 -316643 115428 71211 -118659 -49159 129437 -12939
9019E9051a38579K3312L2326k85642G1599e1016o5988j16891a08990L9530L682
$$ 59051 -138579 -115267 -82941 -368583 71599 -51016 -117004 -233895 -108990 -69460 -65778
9008f5778k7448G1390L5251a35581j11796i5264j14963A15821a29642P692B50035
$$ -65778 -93226 71390 106641 -135581 -247377 -95264 -210227 115821 -129642 -121950 250035
8996f8238A99060A8836d72681i1923A8670a92636C1932c64004E3147b27913j0917
$$ -68238 199060 18836 -472681 -91923 18670 -192636 31932 -364004 53147 -227913 -238830
8985b38830C47677a31377B07400E8072R4864C6882a65363j09692B6698K93744
$$ -238830 347677 -131377 207400 58072 152936 36882 -165363 -275055 26698 320442
8975C20442b03115a5439B2701f01632a86109c3561J5569A9022b07154P9504A56333
$$ 320442 -203115 -15439 22701 -601632 -186109 -33561 -17992 19022 -207154 -127650 156333
8963d208k26866B171a00482n9546A20567b66573J3687Q7456m0842o5099d1319
$$ -4208 -231074 2171 -100482 -160028 120567 -266573 -252886 -165430 -206272 -271371 -41319
8951a18032d7482C61488I529d08505J61706D7080a07946A93538e2153D4505b73224
$$ -118032 -47482 361488 9529 -408505 -246799 47080 -107946 193538 -52153 44505 -273224
8939b89643E1844a57266d2640B48948L81995C12595b2766F6661P5279N2476O1047
$$ -289643 51844 -157266 -42640 248948 630943 312595 -22766 66661 141940 194416 255463
8928B55463j3621j14102M13210O50616J348885L214148Q570605j725807C735960
$$ 255463 241842 127740 540950 1191566 2540451 5754599 14325204 12599397 3735960
8918A660286D89686A68262J80334F7488M2521M6589a38464O0051B28936K04583
$$ 1660286 489686 168262 348596 67488 110009 156598 -138464 -78413 228936 433519
8908D33519m3106A86141a40527E0815h5989n0084b2535j51113A07439c13156J48032
$$ 433519 390413 186141 -140527 50815 -85989 -136073 -22535 -173648 107439 -313156 -165124
8897a65124A49949a82787i525m9614C0153Q0121c06076a22087G4727A1035J74327
$$ -165124 149949 -182787 -9525 -59139 30153 110274 -306076 -122087 74727 11035 185362
8886A85362a58354p7417A5475a56256g6156r0285d8945a3928k8672E7356c87201
$$ 185362 -158354 -235771 15475 -156256 -76156 -166441 -48945 -13928 -42600 57356 -387201
8874B21326a38489j0199j65712J44447P8036B17087D0481h8907E7930d0194k01905
$$ 221326 -138489 -148688 -314400 -169953 -91917 217087 40481 -88907 57930 -40194 -242099
8863b42099j04555B1291A527a02024q9953a3788m3060B52211A02845e1196j59050
$$ -242099 -346654 21291 1527 -102024 -191977 -13788 -56848 252211 102845 -51196 -210246
8852b10246h5712F2355e7346B29409g6746L5610A1332O6453a37523B11903a57550
$$ -210246 -85712 62355 -57346 229409 -76746 -41136 11332 77785 -137523 211903 -157550
8840b54074c6191A75817c7448A17112g5729H6871a07232j01773a173l8563j60580
$$ -254074 -36191 175817 -37448 117112 -75729 86871 -107232 -209005 -1173 -39736 -200316
$$ [...]
##END NTUPLES=NMR SPECTRUM
##END=
