##TITLE=AC1769_ROS_13_9683968_4SsqNQdCp8
##JCAMPDX= 6.0         $$ Bruker NMR JCAMP-DX V2.0
##DATA TYPE= NMR SPECTRUM
##DATA CLASS= NTUPLES
##ORIGIN= BRUKER
##OWNER= Administrator
$$ 1.72 TOPSPIN		Version 2.1
$$ 2016-04-16 20:17:33.126 -0700  Administrator@X
$$ Compression mode = diff/dup
##.OBSERVE FREQUENCY= 400.02188249412
##.OBSERVE NUCLEUS= ^1H
##.ACQUISITION MODE= SIMULTANEOUS (DQD)
##.ACQUISITION SCHEME= undefined
##.AVERAGES= 8
##.DIGITISER RES= 22
##SPECTROMETER/DATA SYSTEM= spect
##.PULSE SEQUENCE= zg30
##.SOLVENT NAME= COFFEE_meoh
##.SHIFT REFERENCE= INTERNAL, COFFEE_meoh, 1, 14.98509
##AUDIT TRAIL= $$ (NUMBER, WHEN, WHO, WHERE, PROCESS, VERSION, WHAT)
$$ ##TITLE= Audit trail, TOPSPIN		Version 2.1
$$ ##JCAMPDX= 5.01
$$ ##ORIGIN= Bruker BioSpin GmbH
$$ ##OWNER= Administrator
$$ $$ E:\/data/COFFEE/nmr/AC1769_ROS_13_9683968_4SsqNQdCp8/10/pdata/1/auditp.txt
$$ ##AUDIT TRAIL=  $$ (NUMBER, WHEN, WHO, WHERE, PROCESS, VERSION, WHAT)
(   1,<2016-04-16 20:17:26.064 -0700>,<Administrator>,<X>,<go>,<TOPSPIN 2.1>,
      <created by zg
	started at 2016-04-16 20:16:20.314 -0700,
	POWCHK enabled, PULCHK disabled,
       configuration hash MD5:
       21 0F 79 D6 B3 7B B4 F6 88 20 88 DB 03 48 BD 9F
       data hash MD5: 64K
       60 81 7B 50 C4 B6 57 F6 84 58 47 05 A4 D7 E8 7A>)
(   2,<2016-04-16 20:17:29.142 -0700>,<Administrator>,<X>,<proc1d>,<TOPSPIN 2.1>,
      <Start of raw data processing
       efp LB = 0 FT_mod = 6 PKNL = 1 PHC0 = 0 PHC1 = 0 SI = 32K 
       data hash MD5: 32K
       95 D2 76 4D 88 19 4D 68 6D 75 DD 20 FD 7E E3 F5>)
(   3,<2016-04-16 20:17:29.423 -0700>,<Administrator>,<X>,<proc1d>,<TOPSPIN 2.1>,
      <pk PHC0 = 92.87292 PHC1 = 0 
       data hash MD5: 32K
       D9 58 22 9F DB B7 A4 2D 5A C5 34 02 B4 C5 51 1A>)
(   4,<2016-04-16 20:17:29.533 -0700>,<Administrator>,<X>,<proc1d>,<TOPSPIN 2.1>,
      <abs ABSG = 1 
       data hash MD5: 32K
       BE FF 1B B6 94 02 40 60 5A 59 36 8E 6B 3C E0 7A>)
(   5,<2016-04-16 20:17:29.595 -0700>,<Administrator>,<X>,<proc1d>,<TOPSPIN 2.1>,
      <abs ABSG = 2 
       data hash MD5: 32K
       43 EA 58 49 50 DC 7D E3 A5 37 DB CB 3F 5D 22 78>)
(   6,<2016-04-16 20:17:29.642 -0700>,<Administrator>,<X>,<proc1d>,<TOPSPIN 2.1>,
      <abs ABSG = 3 
       data hash MD5: 32K
       26 55 94 85 DB 38 3C 7E 4B 1E DF 2D BC E2 4A B9>)
(   7,<2016-04-16 20:17:29.720 -0700>,<Administrator>,<X>,<proc1d>,<TOPSPIN 2.1>,
      <abs ABSG = 4 
       data hash MD5: 32K
       0C E9 E6 73 2D 3D 6D 24 10 7C 50 CC F2 19 62 A6>)
(   8,<2016-04-16 20:17:29.783 -0700>,<Administrator>,<X>,<proc1d>,<TOPSPIN 2.1>,
      <abs ABSG = 5 
       data hash MD5: 32K
       54 16 A3 57 3A 2D A4 7D 52 F0 93 CC 63 20 F7 98>)
$$ ##END=
$$ 
$$ $$ hash MD5
$$ $$ 0F 39 B1 55 89 47 11 1D 8D A1 62 96 B3 F9 A0 E0
##$RELAX= 
##$RELAX= 
##$RELAX= 
##$RELAX= 
##$RELAX= 
##$RELAX= 
##$RELAX= 
$$ Bruker specific parameters
$$ --------------------------
##$DU= <E:\>
##$EXPNO= 10
##$NAME= <AC1769_ROS_13_9683968_4SsqNQdCp8>
##$PROCNO= 1
$$ [...]
150 150 150 150 150 150 150 150
##$TP07= 0
##$TPNAME0= <>
##$TPNAME1= <>
##$TPNAME2= <>
##$TPNAME3= <>
##$TPNAME4= <>
##$TPNAME5= <>
##$TPNAME6= <>
##$TPNAME7= <>
##$TPOAL= (0..7)
0.5 0.5 0.5 0.5 0.5 0.5 0.5 0.5
##$TPOFFS= (0..7)
0 0 0 0 0 0 0 0
##$TUNHIN= 0
##$TUNHOUT= 0
##$TUNXOUT= 0
##$USERA1= <user>
##$USERA2= <user>
##$USERA3= <user>
##$USERA4= <user>
##$USERA5= <user>
##$V9= 5
##$VALIST= <valist>
##$VCLIST= <CCCCCCCCCCCCCCC>
##$VD= 0
##$VDLIST= <DDDDDDDDDDDDDDD>
##$VPLIST= <PPPPPPPPPPPPPPP>
##$VTLIST= <TTTTTTTTTTTTTTT>
##$WBST= 2048
##$WBSW= 25
##$XGAIN= (0..3)
0 0 0 0
##$XL= 0
##$YL= 0
##$YMAX_a= 560892
##$YMIN_a= -478566
##$ZGOPTNS= <>
##$ZL1= 120
##$ZL2= 120
##$ZL3= 120
##$ZL4= 120
##$ABSF1= 14.98509
##$ABSF2= -5.573092
##$ABSG= 5
##$ABSL= 3
##$ALPHA= 0
##$AQORDER= 0
##$ASSFAC= 0
##$ASSFACI= 0
##$ASSFACX= 0
##$ASSWID= 0
##$AUNMP= <proc_prof1d_extract_pilot.lims>
##$AXLEFT= 0
##$AXNAME= <>
##$AXNUC= <1H>
##$AXRIGHT= 0
##$AXTYPE= 0
##$AXUNIT= <>
##$AZFE= 0.1
##$AZFW= 0.1
##$BCFW= 0
##$BC_mod= 0
##$BYTORDP= 0
##$COROFFS= 0
##$CY= 15
##$DATMOD= 1
##$DC= 0
##$DFILT= <>
##$DTYPP= 0
##$F1P= 0
##$F2P= 0
##$FCOR= 0.5
##$FTSIZE= 32768
##$FT_mod= 6
##$GAMMA= 0
##$GB= 0
##$INTBC= 1
##$INTSCL= 1
##$ISEN= 128
##$LB= 0
##$LEV0= 0
##$LPBIN= 0
##$MAXI= 10000
##$MC2= 0
##$MEAN= 0
##$ME_mod= 0
##$MI= 0
##$NCOEF= 0
##$NC_proc= -8
##$NLEV= 6
##$NOISF1= 0
##$NOISF2= 0
##$NSP= 0
##$NTH_PI= 0
##$NZP= 0
##$OFFSET= 14.98509
##$PC= 1
##$PHC0= 92.87292
##$PHC1= 0
##$PH_mod= 1
##$PKNL= yes
##$PPARMOD= 0
##$PPDIAG= 0
##$PPIPTYP= 0
##$PPMPNUM= 2147483647
##$PPRESOL= 1
##$PSCAL= 4
##$PSIGN= 0
##$PYNMP= <proc.py>
##$REVERSE= no
##$SF= 400.02
##$SI= 32768
##$SIGF1= 0
##$SIGF2= 0
##$SINO= 400
##$SIOLD= 32768
##$SPECTYP= <>
##$SREGLST= <1H.CDCl3>
##$SSB= 0
##$STSI= 32768
##$STSR= 0
##$SW_p= 8223.68421052631
##$SYMM= 0
##$S_DEV= 0
##$TDeff= 65536
##$TDoff= 0
##$TI= <>
##$TILT= no
##$TM1= 0
##$TM2= 0
##$TOPLEV= 0
##$USERP1= <user>
##$USERP2= <user>
##$USERP3= <user>
##$USERP4= <user>
##$USERP5= <user>
##$WDW= 1
##$XDIM= 32768
##$YMAX_p= 438600832
##$YMIN_p= -658278
##$CURPLOT= <Network HP LaserJet P1505>
##$CURPRIN= <$Network HP LaserJet P1505>
##$DFORMAT= <normdp>
##$LAYOUT= <+/1D_H.xwp>
##$LFORMAT= <normlp>
##$PFORMAT= <normpl>
##$SURQMSG= 1
$$ End of Bruker specific parameters
$$ ---------------------------------
##NTUPLES= NMR SPECTRUM
##VAR_NAME=  FREQUENCY,     SPECTRUM/REAL,   SPECTRUM/IMAG
##SYMBOL=    X,             R,               I
##VAR_TYPE=  INDEPENDENT,   DEPENDENT,       DEPENDENT
##VAR_FORM=  AFFN,          ASDF,            ASDF
##VAR_DIM=   32768,         32768,           32768
##UNITS=     HZ,            ARBITRARY UNITS, ARBITRARY UNITS
##FACTOR=    0.250966925370066, 1,           1
##FIRST=     8223.43324360094, 166900,       -120016
##LAST=      0,             261201,          -198345
##MIN=       0,             -658278,         0
##MAX=       8223.43324360094, 438600832,    0
$$ Real data points
##PAGE= N=1
##DATA TABLE= (X++(R..R)), XYDATA
$$ [...]
23853 -219883 187608 -68051 156628 -86949 -193182 -71970 181393 -166778 -54494 -132617
23843 -132617 119696 21648 -126706 -110624 226262 -173516 -26984 -172323 -227960 -210883
23833 -210883 -48511 74137 112001 -62861 45109 105612 -10405 23392 14205 6901 39444 92783
23821 92783 -249815 202355 -355705 209590 -222536 -202475 -340986 -103257 49165 15280
23810 -91558 -325582 -92287 74905 6507 -136396 79896 103952 145143 -138259 117675 -249097
23798 266541 248863 192752 173013 236417 -92316 -101249 -134645 -57370 141046 87007 -226031
23786 -2159 71363 74052 -181030 107894 54149 26902 298227 159172 -113818 7537 172851
23775 172851 107006 184639 -206039 165687 -22398 37893 310359 -85459 98404 -8489 -246623
23764 -246623 -227730 -41249 -25654 21316 165341 194991 22014 305710 -249811 -159415 -160383
23753 -160383 100311 -43737 -348736 108009 -208117 133177 179685 -263617 118473 114716
23743 114716 -45478 73816 107062 -79407 247678 121586 -83066 210266 109826 -129358
23732 173908 -11062 118288 380169 -200262 -33906 92017 39786 7732 -82955 79732 -179536
23720 56231 -22364 187255 -19424 -80757 -77999 -62131 175329 97640 -58070 81060 48750
23709 48750 72835 3986 31187 120062 -75948 -32557 -175446 -139276 -187005 81015 -386920
23697 -311401 -62315 -35035 27459 23641 -263179 -167723 173265 18198 -7200 267867 138361
23686 138361 100678 -109345 -184460 35895 -54835 120147 106348 -28805 123777 286031 55132
23674 -95141 32405 -138244 -127707 26471 265840 241673 -297276 -350518 -187359 27320 -73677
23662 22084 -206316 81501 -404579 43795 145591 -31573 57399 248352 -26458 -9847 13347
23650 -343628 -49460 -60629 238147 51690 92894 -175379 -334738 85155 16649 163191 -176330
23638 -152121 22408 -186722 -141410 -177322 -45050 -214106 -66748 -91945 -55795 42449 121583
23627 121583 14906 -68751 -177705 -114828 -198268 87312 110967 116041 -66851 94526 -117786
23615 -110250 -280652 -50613 -191186 55250 -314895 -110764 -65549 154317 230878 -154387
23604 -144931 205809 16155 -42118 116555 -99439 -175211 -136271 -190437 -309196 -200407 72530
23592 107684 139064 25158 158383 61459 -96214 -33477 -160830 55308 -57230 177969 17238
23580 503730 43589 140982 310188 -25338 120755 99036 88605 11189 53809 -263220 -128226
23568 20867 10562 156168 -248919 384050 293515 -98994 -66318 -75862 -208365 -46213 -133591
23557 -133591 541 174445 131885 64106 -44899 19782 347649 -178260 -115659 -25758 166281
23545 -54710 197117 227804 -74722 148437 23289 -154681 -52284 127137 26515 -268189 13761
23533 -343291 5408 -4195 -15281 -371234 232586 -12351 -201750 58278 98395 418730 -277215
23521 -9119 81511 -180341 174233 -19692 42065 -106513 24277 -80772 21518 -78097 -617687
23510 -617687 55085 128306 197047 -28212 97943 -47670 96217 -91901 133005 273506 45753
23498 57494 434972 -98116 -132138 -44693 26882 221548 340273 43877 -221888 98348 -335017
23486 61214 143885 -11256 220292 -222831 -516013 -24925 71431 59589 125509 -21718 237773
23474 78994 -254089 41859 94377 -419386 -8496 12442 -42841 138504 84506 -54805 122324
23462 -90910 68500 154086 -39646 123954 144983 -159867 -251874 97876 -47498 -13000 -298352
23451 -298352 258791 66281 -268746 88613 -2946 401938 -20134 -264038 139989 -81966 -40772
23439 251345 221753 208896 34152 239953 501502 95374 -108254 -85718 22876 -40201 -134925
23428 -134925 -198346 405634 -85163 -117475 -342233 195059 -267431 -141397 -73146 187907
23417 -245196 154351 -83487 -115974 40783 157856 73006 -66941 -334891 -475535 -376357 47706
23405 259717 -158838 330333 -211012 105414 51593 -87772 78689 -151905 110438 -340430
23394 68667 58166 22853 -37478 -107938 -181473 -56026 -242189 291897 171371 156542 116522
23383 116522 -5925 113948 -13700 156391 -68664 -169266 165112 -184361 40419 -75292 -382225
23372 -382225 -133466 -209330 165000 -92848 -147135 187500 227761 376248 -196434 -366851
23362 -366851 184699 241796 -101026 -137827 141481 104713 32896 -28522 -224695 26497 114590
23351 114590 9843 -143049 40766 -89953 -45282 197742 219586 87221 136705 125577 -29484
23339 -223560 253219 140135 118754 80098 1332 -366230 213748 -148099 -341878 275080
23328 85809 -212176 -218361 -158530 -149058 140891 -121978 53513 190720 -54806 -185935 -313918
23317 -313918 277487 -111902 -164122 -44451 -134967 -150173 87515 -99353 62066 -102714 -163004
23306 -163004 199185 147581 -129656 -376231 100241 242522 -100543 137809 -65577 75481
23295 -87635 33270 -27778 25446 110082 -38455 141157 -141964 -115251 -125539 115152 169663
23284 169663 -75336 68793 233756 -195698 985 56838 -71993 110849 -222078 -519230 -186996
23272 140846 181072 -65680 100510 -36052 -135332 -78695 -176639 517554 -366188 -236295 -45425
23260 -102260 152712 172146 -227002 -2293 35289 95177 7115 -381795 -97718 -30704 24642
23248 -92225 -388720 -195614 57244 -39530 297885 196288 -255041 -54667 -49682 58578 51455
23237 51455 374769 36266 580440 -60078 -183611 -143767 200813 -27571 -153818 269120
23226 -115745 58366 -105159 -93329 207634 -235401 -5860 199059 193739 42141 265366 -159831
23214 -283750 -125078 -84445 -337041 -63768 -83078 39150 238716 -294214 69273 302966
23204 302966 -74689 -658278 -108157 63377 136085 116664 -12528 82670 -231843 -370879 17881
23192 -66890 235563 154399 -166599 -44172 -85811 189920 -332257 -270560 -111266 76414 -60357
23180 -51366 313337 -49780 175286 -20758 89507 -68247 55741 13195 -69809 -179243 -73944
23168 201952 -138991 -136990 -97282 232237 30964 -312579 -149542 -33279 72296 237338 -63057
23156 156753 -243865 -57022 45777 228982 -17771 65720 126010 -201113 -288151 292197 121659
23144 -222257 142972 178019 204179 106341 -155577 74697 3609 -51571 -136659 62935 26790
23132 -130177 -138396 80394 39827 497378 -240136 -245849 97204 -121802 -71542 69505 -20178
23120 16196 -41108 115821 -149359 26758 25944 -188851 -78094 -21889 314197 -210954 -186441
23109 -186441 -395659 -4520 -141702 -183575 309511 355230 -181005 112368 66243 126786 194341
23098 194341 -15503 -242964 -14504 257558 -132590 -32082 -236000 82897 194433 -96574
23087 -144722 -109766 -39664 -53491 120198 -139913 32522 319538 105673 -339707 -58071
23076 -28822 465189 -81945 -162754 72745 203951 25916 -12089 -85064 314415 153054 138112
23065 138112 -18217 519 -3498 -474901 -175832 -208287 97884 -392552 -105751 -247576 -389932
23054 -389932 -5878 -23728 257570 14411 -84230 -212790 -105005 -68561 9245 709 49455 -160835
23041 -300053 -342610 -137014 80328 -5290 -78682 -273410 -184439 155019 189756 113612 -73138
23029 -324267 171613 209655 -72748 -64281 75640 343810 213747 104210 135887 144645 44529
23017 -87023 139411 10522 -126392 54891 -358198 -334198 -285120 124909 161163 -88156 -174725
23006 -174725 153794 204564 63270 -123653 -123436 6387 -122005 139013 180268 -78247 82933
22994 -145657 -64169 -103962 99909 -87264 -83285 -218507 42658 -84115 182998 29545 54461
22983 54461 -164861 132611 -11438 -157960 212334 344295 25714 -7858 -6612 -305480 76808
22971 -212871 -67426 -10344 -39396 -174451 193507 37712 -496191 52229 -105720 59324 -3847
22959 -57296 -93666 9260 -131607 -287737 -210856 -125221 -138312 276111 -179592 39655 135707
22948 135707 180427 -9175 302394 398403 137023 -363384 -301528 -295489 200670 218978 -104921
22936 266654 26014 -7066 -82985 123385 207654 -150319 -136070 -12037 -98425 -41011 -22849
22925 -22849 64858 31051 -162603 -229091 -101062 78108 9113 124958 -182091 -99840 -129170
22914 -129170 -72968 -54587 107632 197897 28798 34325 -14955 -74074 -423846 -193626 12163
22902 283053 -100656 144219 362225 -184193 -84090 19871 143593 -152665 -31501 -420784
22892 -420784 -131682 324604 266726 -44524 -10765 -115396 -33563 152172 -75199 27582 -226977
22880 201935 -257654 -98253 -715 -222122 22021 5497 -119590 177589 -471679 58650 92737
22869 92737 152462 167843 107382 -98561 241428 157529 -3473 -317296 -187284 -74588 -277864
22858 -277864 20146 62082 -158127 -103595 282317 -198403 329757 -7817 69820 -25998 130363
22846 -89618 9028 -9049 73071 -309696 120117 -848 -37571 -216175 -35541 -56679 157270 226400
22834 226400 -361857 322619 -196513 -78533 -323374 -11285 -208633 -23085 -110900 -2001 -8499
22823 -8499 -234978 -562641 -90263 -276874 -240806 -184334 -261141 -133486 -46810 -11988 106509
22811 -136840 -7597 130310 -82864 -37202 138350 -221862 -436355 339757 24713 125747
22801 125747 28284 71355 -10504 -10080 82723 -237506 22578 142671 -51732 -29075 -19380 -99427
22789 -99427 -105996 -146136 -191623 33263 -79341 -76708 -82985 -118444 -86696 173858 28261 -265718
22776 154351 -89725 218523 197520 -15435 -94964 -173057 -281496 211004 -177001 -137175 -252258
22765 -252258 3921 91597 -231124 149054 -119199 109785 36474 176252 -68527 -177432
22755 -177432 -20204 -142363 -15331 131570 475536 -39890 43238 -2396 -190856 13964 179348
22744 179348 -26838 133313 401 136825 252939 -115520 179005 -22890 34279 -31592 99773
22732 -1073 -74023 121732 -248688 -302432 25184 -23243 112265 -64515 9612 -48685 378065
22720 33386 -309004 -426339 22680 150888 -153555 66974 274525 85710 -198076 28945
22709 44422 43879 46458 -147670 136804 -383423 -305884 -157449 91519 109760 98653 80401
22698 80401 68093 -5001 -275535 46239 120912 60295 73185 30227 77565 143434 -139614
22686 -161825 15655 -113885 147336 193842 -24588 31145 -84364 -125284 250937 20091 -100122
22674 81053 -182885 163211 66537 -322365 152772 -61229 -239266 -16664 14086 -138178
22663 -54319 -193330 12462 99344 -207999 -145000 -379038 81025 3348 224751 -73108 214641
22651 -265084 -24132 289477 -23757 -6606 -229056 178190 66407 166290 21484 -227315 88576
22639 51891 -53095 654 -124720 107135 -87528 -226375 -83929 146795 -143677 -144539 -165198
22628 -165198 -49736 90117 -30034 -42129 9809 -212007 -137967 258904 87852 211473 -77784
22616 -59633 151286 162269 90868 50518 -75451 -42845 75297 186375 80758 -210430 206234
22604 -85714 -8242 -180399 -99867 -115421 -25824 30451 165624 -46712 -55065 -450884 -76646
22592 183784 -200510 26547 26054 103285 -162007 -16667 -251479 -322594 152455 -113031 299316
22580 186317 -79733 -49140 161190 -149235 48635 41407 246481 69871 347548 -30404 14993
22568 31187 227303 -91301 -171278 -50263 -177363 -65876 -293238 -36350 -61299 -69349 -225386
22557 -225386 -91051 -288489 -226871 -199924 -130541 10901 -1815 -113864 241959 -61675 -72301
22546 -72301 11296 -69589 -100589 79572 241778 119875 -251752 -34522 -252427 -133049 25235
22534 71350 -35515 -233235 -321926 62407 170383 -33969 56918 -115649 -41070 237162 -211504
22522 90207 57821 34865 -147202 26242 37053 -20222 -178937 173769 -61563 -190214 121960
22510 77981 -71274 -250973 2116 -368176 -90770 75815 56726 144109 -234744 112394 -215328
22498 125295 -33629 -323257 -4568 -35278 88804 56795 144373 -71848 -45527 243079 45423
22486 -19839 -191241 178081 51904 -123032 131223 -28194 -33991 -77220 -207135 -196575 113777
22474 92909 175964 194704 -146510 123581 -230504 -426600 1593 -169089 83293 65460 -4756
22462 -63112 -50093 150914 174788 103112 -120259 -3095 148630 38296 173661 -70417 129359
22450 -170907 -382870 58041 -59320 173165 -215791 -85541 -88887 156735 -135721 -294672
22440 -294672 -80465 343727 137063 1445 159069 -2897 157634 13451 228979 -78857 7347
22428 -13660 -213691 54915 -95836 224347 -349205 29143 -83028 -107000 68338 -12207 -148113
22417 -148113 97350 -28079 -294754 -143843 -142645 -207909 -300606 -34078 294461 -110422 13475
22405 -9466 -155797 15432 -95098 186773 -234225 -188575 -87549 165066 -157689 190256 -255124
22393 -195920 46334 331840 -291617 62236 -79966 210867 -62612 4886 30335 -41047 -149671
22382 -149671 -84310 -176560 -99605 142562 124710 -140817 -142558 -106134 -16231 95657 176342
22371 176342 -125402 -38720 -321728 -161358 -252938 28326 -270934 -6324 25445 94997 -210535
22359 -121853 28581 -365511 -24609 98117 133126 -191842 80812 -76041 24948 171404 137878
22348 137878 67978 251746 -250740 -268004 -67730 105765 -229997 48279 39048 -111029 -237583
22337 -237583 -57427 48684 -219700 14341 -247665 157807 -27583 14380 -31731 -78923 287379
22325 223331 270259 186112 -58966 -537899 -215552 -24961 -13808 -49780 -13871 -424877 -165180
22313 92238 -71422 -113829 149007 297520 140209 6293 -32717 -125119 -248080 249553 74955
22301 -162253 -161444 -391064 100817 167097 258149 -142915 163112 86541 58869 -233379 -58812
22289 -125755 25071 148561 107377 151222 58371 -46544 -11288 236581 113469 -33493 -235655
22278 -235655 -5861 -25794 -140100 -190795 -216021 383047 175729 40964 -80306 -310659 -112472
22266 -65269 -24272 -127888 -176693 -103519 -328214 52369 -34944 67515 -110902 -13998 -147832
22255 -147832 -85932 -277730 234512 256618 -127069 -315208 -103143 -195710 27780 -88321
22244 -22949 -102991 -171292 -365621 -47785 65993 64080 -316424 -55382 -157139 17751 116659
22233 116659 114414 -220545 -133328 11030 -184095 154428 -226414 9167 -18167 -69767 2581
22221 -26874 -19952 130791 182855 54119 -226539 -138496 -115973 6835 186287 -3936 113204
22209 45422 66694 -209387 -79530 -48997 -281519 61958 71258 -273655 36702 -22082 -86557
22198 -86557 163726 -47363 -14938 -228506 209283 -223886 97276 -292183 173781 -160287
22187 -31584 176590 -173735 -78760 -260765 91708 35399 -116457 -270070 -264312 44125 -40695
22175 23683 -176284 -66091 -89178 -76382 -2002 35351 187270 57491 -217812 319539 104103
22163 79920 -36448 1517 29917 -214772 -118869 -174033 -91319 -99101 -50277 20550 100505 -7885
22150 197055 6960 -164707 9696 -66311 232445 -275199 -100532 -264161 22798 -208380 144894
22138 -143061 -59593 -30727 -15449 -20146 -93154 -7646 -130641 -50890 -202479 185758 217985
22127 217985 183491 -216434 -148532 -26440 -31453 -354223 -306954 -152796 -276036 -306813 -54481
22115 -49899 -282472 -6837 102256 -162162 -66502 -286844 183497 270153 249782 -133955 -168481
22104 -168481 124743 113506 -157896 -109965 -116576 -259035 31647 18536 -169014 29375 309968
22093 309968 -15938 -209557 -186294 -236107 -44173 -54967 -118190 74946 280275 -195479 50796
22081 60793 -61647 -13085 -155367 -38930 26340 396098 -2365 18128 -112566 32839 254469
22070 254469 207425 315954 330169 -199640 227509 -280962 47444 51116 -224105 -59941 -220303
22059 -220303 -199360 75197 97310 -83378 5385 -69046 -60433 -33713 -100218 -207522 -120609 -242705
22047 -242705 -332242 74105 -88177 22745 150297 -115158 66993 -13362 153509 -195894 4190
22035 -36283 -259595 25836 160984 -282375 -8519 -139224 262130 -112290 -15917 -179779
22025 -179779 -53537 -66888 -10748 -177243 -185784 75626 66117 128876 -546155 340331 118601
22013 -71876 37933 177650 -47624 130185 66297 204007 -75667 -109192 -45180 -41213 224903
22001 108816 2218 -208832 -992 138658 161125 -87923 -72685 -45579 -121637 -75820 -18935 -79269
21989 -79269 115359 -84930 -67271 84742 -79183 5183 -111102 -150962 -45905 -168188 -16600
21977 -218086 -310770 -33416 -141434 34196 -74111 -171691 -246112 205589 244302 -94942 -63997
21966 -63997 155923 184025 108886 56554 -307330 -192874 61007 317201 -327774 -402412 -332508
21955 -332508 -384627 -146665 163721 -47714 -304094 11089 206992 149986 177082 -27559 -186849
21944 -186849 -16431 154777 3562 73068 81490 97898 -121162 138287 124545 -153075 -59631
21932 -184780 -117696 -6896 112270 -175664 210468 -329985 -99930 -112790 -39015 221546 -220527
21920 -326267 258826 -83068 -295411 -18751 -74794 -142363 -239849 -114694 -227690 -258279 -40356
21908 110278 -144872 -29547 -229234 -528 -202199 -321496 -1177 -102130 -419629 -68114 285918
21896 -159307 -176861 211378 -29841 -45888 -146811 23045 -189164 18820 -31759 -204906 -228032
21885 -228032 -24732 -27970 -325521 169707 12257 -206145 379941 -484594 86938 177878 -352844
21873 123354 67758 -45269 -32513 58897 -786 -151104 140490 -159687 -147762 141977 -200716
21861 -207021 -275653 37701 67258 -313194 12852 -268472 -71052 152587 -169915 -69278 46022
21849 214034 209123 -97583 -32635 65746 -97527 83251 204012 146798 372669 89467 -275261
21837 -95765 9885 105517 -154734 -17226 175582 -148639 -90343 116761 -337514 -935 -106834
21826 -106834 134950 -75831 -133935 37885 -81475 -60596 29333 -138791 -65825 74023 84720
21815 84720 326244 -8636 -9872 -214638 106109 -98340 -101342 -148689 -27281 150471 82957
21804 82957 -10473 63326 16194 -45020 -25843 -29198 82475 234019 -266922 26549 72134
21793 72134 226208 88999 -79452 -51780 135765 27297 -204795 -76065 -172272 197647 -3247
21781 -139021 84571 -196546 -68278 -162068 230153 27501 71037 1157 208459 -106718 -94032
21770 -94032 -123029 -205179 -97485 -40127 86728 126212 -106746 136018 117732 -92730 -176054
21759 -176054 -16641 -340240 -12320 32740 -82455 -134497 -247616 -88386 -248669 -45593 -43305
21748 -43305 15636 -259236 -185374 -94873 50813 -20168 104550 -2286 74063 54675 -76353
21736 -74466 286349 -245541 229110 -61316 -108103 -18684 94774 341202 248963 102495 206354
21725 206354 -468600 -318332 -34298 47525 -397878 146314 74440 -147071 48227 248517
21715 248517 161067 -48293 -227277 -83346 -26628 -49760 11385 -53839 -85948 180172 57698
21703 -107936 -146090 124924 206405 -238076 2934 -36990 -234849 28151 -26081 248967 -94746
21691 105745 64480 21621 -310785 -35650 -107511 -251523 -307113 -13254 90861 -187240 15309
21679 -313593 289193 -328422 -128318 -155986 -6316 -119619 129871 32766 205908 223516
21669 223516 62009 -117526 -140727 -29731 -252606 137848 -255078 -100509 -319209 -79074
21658 -46345 -185800 105756 134612 78105 117558 171941 -212179 16085 40873 -189683 -88502
21646 24816 -117009 29562 -41532 -181858 -128509 49844 -115983 49675 -113026 236817 -350943
21634 -38161 167055 179976 -237254 -85011 -120308 64655 -44541 -70979 17380 226564 19382
21622 -170016 -165272 81828 -48925 -213817 306229 72237 233231 -71342 -72534 -155040 123707
21610 105261 -196721 -208178 -13623 19423 -100043 103534 -220555 -181631 46686 -245275
21599 -156085 62626 -174100 58328 -65622 54432 -86435 90243 -6786 473465 101928 109768
21588 109768 -432357 189116 -127302 314908 -321921 117040 -84000 -345131 -137562 -165244
21578 -165244 151374 57093 -55993 40757 7270 133437 -29232 -173559 1024 -26541 -49103
21567 -49103 -54890 -189351 -29942 30936 163102 -44289 52977 -224459 26280 118194 17051
21555 -280531 84948 -119617 108033 -212394 136065 -88622 67633 -125996 41644 -57398
21544 -135163 -188868 -105513 54076 -250013 -312688 -106704 4621 50736 147434 -47933 327801
21532 -130494 6867 126649 47947 44389 -78456 -177338 -10007 141505 314001 -101841 215113
21520 -167244 -252551 102692 -205813 -481681 -47524 -74175 -151406 -94900 86801 2141 268198
21509 268198 66597 -21276 -291062 -157543 -551875 168125 152470 27217 72072 -80546 -284385
21498 -284385 -186516 -124942 -119182 152549 -298715 34393 50738 103572 -60642 209559 114455
21487 114455 58835 -192901 172743 -254254 124861 -149201 -258215 -126142 216300 399272
21477 399272 34331 -78995 -140564 -48046 87689 -6929 -93845 45497 38110 102974 -108647 -131673
21465 -131673 308371 182335 110182 48389 51511 -166750 211353 185401 -231714 -83542 159325
21453 -39214 127605 -99438 -120083 63130 -363540 -17642 -77925 -182613 -335380 37500 370912
21442 370912 -118231 -267294 59523 403151 202550 155628 219015 438007 297001 237807
21432 237807 -34781 -44431 45843 206629 -405584 105006 -56283 166581 -180040 -40650 -33295
21421 -33295 -214382 154358 13184 -62334 377351 213805 -27916 278801 80441 324810
21411 324810 -216732 -28969 402967 15352 98512 38753 -226251 192397 86948 -370208
21400 124203 -403226 115493 98807 -259248 -136274 -154936 205081 -1585 -199142 -35520
21389 109569 -73437 34031 323793 -262666 18434 209736 142728 -84795 -141677 -369910 -27385
21377 -87596 -4321 -177867 231552 -92215 6570 -37751 -370392 165735 212065 37946 -70959
21365 -234587 -27907 -222070 143199 -85077 148924 39849 185638 -86261 50589 -67457 -216744
21354 -216744 162318 -176009 138966 -243760 292967 40809 188831 29672 -115526 -55433
21343 14436 -120087 -72533 -149906 -163819 -84328 140592 -30180 -179450 -58768 -74006 -25393
21331 -100463 -44497 -167086 -127810 108545 -238501 -248978 55965 -26651 124373 181378 -82977
21319 216138 -46894 64062 215065 -13923 -209352 -203153 -188372 -3899 -173249 6060 -66868
21307 -394332 -133818 -154783 146020 128041 -275957 359198 -128813 40020 -78017 -224397
21297 -224397 271517 79976 -361122 -223401 -298209 4138 -150923 244574 55902 17097 36307
21286 36307 260177 202792 -267887 -286159 -209524 -132704 78303 186719 -262076 -34876 158845
21274 -204660 54090 -411053 -147980 -257131 148404 198617 -256048 102095 -220123 -226340
21264 -226340 -242154 -6962 -184017 151349 -134558 -354868 -39439 -76780 -205221 259734
21253 -111178 -91427 98869 112800 -63476 139422 407228 197244 38550 15607 -6246 -88445
21242 -88445 -74413 -34167 63773 -100524 70089 152895 -297946 -70636 -113108 -141201 70763
21230 174102 -130189 99000 26681 -17263 -168676 88435 -301929 -81643 55373 -220104 -33803
21218 19641 -73059 -124315 -128287 -155488 -291622 179413 -158483 113970 -106598 -403062 -460415
21207 -460415 -446821 5536 -420490 -254646 52467 -99154 -70445 138739 104054 -100953 -174741
21196 -174741 -240716 -109979 8082 -195287 51587 -286278 -253044 202579 -139604 20703 -108569
21184 -85092 -177987 -122375 199105 -8043 218623 131894 -85071 -51814 286544 318468 50369
21172 -77416 -32537 -112416 120913 -36954 22732 -203271 49363 200947 -97003 41782 17747
21160 -192347 2199 -98427 7251 -152455 32084 45328 -98106 46466 -172997 -16877 87531
21148 -26074 -189441 -163556 93408 -82168 163602 -187232 -204531 -176176 -148677 -176892 -175489
21137 -175489 -361052 65434 -328055 -10165 71404 -30956 -53250 -87998 -225272 -20363 151770
21125 -135659 17873 -66554 -225799 34821 24585 -242724 27670 -359755 -207712 32970 -190834
21113 164662 -174948 -295483 193670 74734 268538 256646 -93154 -200681 -772 -64188 -239785
21102 -239785 -139934 -110078 -74552 387581 -271387 138804 -227421 81169 -29212 267705
21091 113855 -132988 170744 -259578 19921 -175969 -213581 -292693 85651 -135777 -59821
21080 -91861 68022 -109923 48432 65830 183399 -82176 -424916 86275 -80943 196012 -186157
21068 -142111 150425 69705 148236 -72239 179767 -129797 33740 -5288 -341317 -82639 -364864
21057 -364864 -59584 -260924 -86451 -81029 -36117 -239168 235852 33411 197071 228896 -21019
21045 -340299 -211650 -208841 -22829 -91372 48703 -96590 -113070 -193607 -228727 -54277 -169782
21034 -169782 109937 3551 -190128 249485 -311912 -30420 -276613 -77030 -258625 -44287
21023 92723 -90329 -21874 -131226 -59716 97700 279362 131429 59043 54562 -320257 159123
21011 -423047 6529 -166074 -282532 143659 -418808 -50804 140913 106630 -238144 -132348
21001 -132348 18700 -48447 -146154 161099 68315 3173 -275300 -188487 -123771 -59882 -272321
20990 -272321 101851 -199949 -222789 241356 103406 -74925 -189343 -202829 -103182 -46750
20979 -97768 74112 36735 94319 124132 -277429 268586 -112408 -95678 -83762 -38668 8036
20967 131995 64317 -119823 -54057 -93456 453651 -174517 -245577 -10304 314508 226141 -12191
20955 -11955 -220796 8059 -282106 -192972 -78420 -396653 -181790 145751 -2641 -90767 -26051
20943 -152250 -85130 383146 109067 -18022 22893 -111165 106264 -143994 -40477 -61077
20933 -61077 65228 -24036 -4602 273326 -112313 136132 -52992 107608 -30601 -23633 -122897
20922 -122897 -201885 -228021 162141 32916 155558 -143310 124926 14577 146198 -118882
20911 -512705 99439 31918 -115877 -92096 -276727 -14149 43085 78796 239341 -106835 -177761
20900 -177761 21773 7396 -78396 40923 -215040 205026 -219663 242185 40591 -234640 152215
20888 -110566 -197762 93220 -53418 -208673 212131 268266 4947 309905 178347 1561 -90272
20876 -47825 -191061 -148377 -188157 65800 -13472 -312101 304246 -78190 -49989 -141168 -130631
20865 -130631 -80692 129695 352882 122125 -28017 110536 -26982 -348945 -123891 88544
20854 -83161 104557 85484 -113237 37574 -285394 115518 -10607 -6588 -307778 197988 -439893
20842 -179199 -62999 -74741 217473 36067 279419 -457276 28170 -16497 -91436 -114031 -18909
20830 129350 -166306 -32735 252996 -65229 248079 -53233 73059 325332 -59625 -142803 -88302
20819 -88302 -42985 -125139 -295542 236041 -149424 141527 37800 -157234 -29597 255632
20808 -263760 -310628 -188035 1869 136299 -126053 -196504 18549 -454398 -107436 -179063 39156
20796 -323119 -450458 -8032 28040 246411 26573 207391 271768 88856 79999 67347 79877
20785 79877 14826 -50047 -191143 -142051 -272877 50987 -272621 -147596 14762 4020 -182152
20773 -142361 157471 -32153 -380835 -37215 120623 306440 -111318 -46607 -179177 34055
20762 -48723 -374597 11725 -18127 -242092 43749 -301099 -71143 78275 154274 -273122 16915
20750 100784 208424 -113775 108063 -150649 194345 -125381 -237954 -188487 -343273 -121803
20739 39128 -166528 -207077 -184404 243706 -139472 58126 60184 2101 -84050 133051 -56147
20727 -441579 -151929 242104 21324 -376441 -144158 82236 -326265 63524 -120272 -191325
20717 -191325 -160574 149454 -75936 -104923 21079 -88556 134576 -122301 -71049 94585 297201
20706 297201 -6175 -190641 -169698 58207 -167572 -7222 210469 -204794 -305648 -64089 -215870
20695 -215870 -48725 -217947 -57602 59314 72850 109179 154095 -241392 -34730 -77057 120304
20683 123764 159565 -244921 -188416 -182095 93752 -95700 -133806 97607 25494 -8347 -188701
20672 -188701 8260 -389129 -70255 -53101 -339353 231482 -49763 70360 -155606 -123631 -338011
20661 -338011 -107600 67741 -231057 -147538 -83742 -247697 98761 3700 150443 76263 -266479
20649 108032 -160870 -119985 -1800 -12769 66941 -209277 256073 13859 -21682 -188787 -73633
20637 239884 45716 98159 -73261 7515 -81625 -182827 136846 -9575 186361 11785 -23414
20625 -196640 69820 -128553 -117543 123754 135217 -193051 -233767 -33119 -186045 -230699 60405
20613 -241159 -80566 -90683 -259872 -236516 160740 78678 -36800 309575 88649 -124514 -83693
20602 -83693 -202203 -192315 -14732 -352082 198108 22481 75311 230471 -134424 -86158 -93673
20591 -93673 -326510 -228849 63219 -11397 3836 25009 105786 181283 202349 -208968 38752
20579 -96898 145121 171831 -6814 254921 195042 178930 -243120 111912 30642 -174086 -153186
20568 -153186 24047 -78631 -124144 43786 -128795 -128897 -147332 25413 129024 13881 28502
20557 28502 -359460 -261140 -296071 -243760 -72205 -124389 -161023 -49156 103960 -356527 -160961
20545 -99638 323867 216712 31180 168497 97956 -187791 63757 164221 -60069 39695 -167509
20533 327995 -298774 18620 -374131 18625 -39588 -130818 -224604 -14906 -112021 -109839 -146303
20522 -146303 -75766 176938 115021 -81304 -62024 113825 -89422 -308181 29235 129088 -242103
20510 99072 -64948 -189032 143794 -459369 215268 -18348 -135698 -156947 -6844 140935 65267
20498 -124255 7089 -18169 157145 -151323 -233366 -85034 -24325 275212 -91195 2206 69383
20487 69383 152969 242008 -233731 -91844 83047 223897 197823 191577 11283 -46981 -90967
20476 -90967 -156623 -305611 61350 312310 -115442 -403472 -129323 -248804 101598 7008
20465 -308407 247373 -32911 -411496 -416162 122062 -58266 56827 271203 233772 -225826 128335
20453 212170 -113605 155326 -211659 -66199 1694 194342 2526 -64917 186403 -16796 -126901
20442 -126901 15493 124012 -7744 -115829 -201692 -34161 160359 -425486 -198195 -43079 -184713
20431 -184713 -336663 -154822 -49396 127620 -150323 155177 -263608 -5752 62780 -73992
20420 85711 -334694 -122590 -182653 65543 -130224 118055 90333 27419 161908 20738 227799
20409 227799 139778 -94204 -203450 295513 -310620 -55601 241651 -222526 -2189 -136719
20399 -136719 -197168 -124713 -152089 -57645 -37054 -136517 844 -8651 30529 4012 -13326 -102442
20387 -102442 -221165 -540558 53859 180207 48461 -77658 -34382 -73681 -94843 87960 113707
20376 113707 -26980 -279747 -5193 -204143 -219942 -118116 158843 -126335 -52901 -50139 108290
20364 290304 117520 6828 -218816 -168673 80151 -110730 -71019 -60430 200042 -140838 22381
20352 -93621 301072 137482 -12005 -158505 54806 -22182 201115 162040 -212123 38899 -216041
20340 -198517 41921 -77430 68846 -388145 -435783 89672 92136 -27208 39228 -228612 -94589
20328 -493682 126705 147739 -299717 412420 -12890 -166841 89959 -95482 155921 -187772
20317 -1795 -261158 58562 -200843 -434504 -19233 88615 -368563 106628 40745 -219052 -169142
20306 -169142 -305724 140221 133632 63662 -74436 164364 -78356 -82234 -82015 -300194 -115931
20294 -200156 294406 -196227 -223779 116775 259491 -182676 -73823 -55172 -95936 -129403
20284 -129403 -49627 305140 406591 -349675 -336442 16498 -59189 -156380 -66228 -173776 -16819
20272 -45985 198686 146795 -163580 242721 78718 -40205 -150532 249959 122974 -24984
20261 -81180 79925 -120947 -47560 38799 -112658 -111901 -10647 -111883 148975 -195695 -115173
20250 -115173 -398908 -40158 -12396 -282214 -261660 19864 -431770 144235 -79969 -384849
20240 -384849 102503 -142775 -259029 -257295 -43754 -253998 -118885 -355626 -232117 -87396
20229 -86875 143418 -225468 -274217 -7467 228841 -216491 -199897 54797 -242405 16588 -173045
20217 -66010 -95564 -21113 -34036 -195555 -11827 -144774 52066 6394 -249416 -99775 -16770
20205 27815 -301912 33170 53147 80563 -211625 -34186 44098 -392251 50107 -20840 80534
20193 -148658 -289607 -20652 4149 -390184 -25072 -37658 -276844 42469 -201039 -71613 -88252
20182 -88252 99150 404535 -214418 16476 337984 -152541 93663 -31996 78714 -144688 -346080
20171 -346080 -302075 -63296 -60689 -94066 -91894 -85487 17651 -291253 237212 -65354 -292335
20160 -292335 55239 -57173 30378 -108686 272762 40417 -110929 210060 -336677 -129774
20149 84204 108889 -195179 -75383 258111 24358 -214709 22677 16192 -169530 -31033 130396
20137 -261745 42784 -108293 103054 -50636 66299 -314919 397084 -271801 -30766 41382
20126 218591 184780 -186268 43637 -140209 -224259 154201 -108267 94800 32649 -66085 195866
20114 -509681 -173273 -149843 188642 -177107 -154458 -48114 -160135 -28417 55921 142903 1980
20102 212253 -107450 -78602 -196708 -61161 37337 -14333 -39519 -112191 443567 -122313 6418
20090 85077 -86337 -199928 203434 334245 -20461 95031 286866 278178 231749 16749 280093
20079 280093 -52447 -151617 20613 -266832 -32557 -11913 -82814 -207622 -12651 30887 -223245
20067 -309642 -617850 -338353 298303 30233 -168428 238934 12850 145933 -188090 -22623
20056 -171271 -277712 11068 -421608 2585 -11181 -223666 167301 60674 44914 63886 -246333
20044 21846 61311 427051 -299534 125471 -31695 8876 -280619 -75903 -88216 -334997 203670
20032 208277 -128679 -177444 298368 -10719 -64504 -29983 30600 -82799 -22134 -179602 225711
20020 -229494 300350 -58774 119366 -168614 -273398 -3011 -90090 36914 91767 -7612 -277474
20009 -277474 -142525 -49794 -62834 -53067 10693 141355 -46525 -55662 33545 152566 125763
19998 125763 29430 -65277 -113553 -83673 208645 -185087 -159142 295241 -23787 -55653 9481
19986 286225 83645 -61309 121000 27861 -220897 -143632 -7196 109437 -22513 119268 -17122
19974 -231232 167411 92366 -8503 -223651 -181512 -126767 -431106 19230 12629 -128996 -327520
19963 -327520 -293228 -288347 42460 166127 -10243 11789 -277944 192819 123627 36065 116110
19952 116110 7935 -211083 -235045 117237 -53550 -85816 -163372 -130546 168060 -12877 -264160
19941 -264160 -431132 -10591 173741 13345 -43233 37572 -85103 -72651 208242 68118 -117439
19929 289107 124806 -145865 119437 83372 29057 173398 -48368 -90454 -272060 21143
19918 -60561 117475 -339880 60228 -382834 -22770 -28623 -399691 -52852 243886 284486 -2311
19906 70441 -164236 86656 -270206 -137136 -209018 -177139 -58390 -375004 -159104 -6241 -4848
19895 -4848 92673 72968 -178751 -193898 -68001 -100856 -378903 199946 63531 -250505 403362
19883 139692 -65227 -92270 21570 -49792 223150 -3506 58988 -337326 -173566 -236168 6902
19871 -28957 -62177 -420287 196117 -163542 -9239 925 327993 -178358 148424 -301893 -56249
19859 111128 122870 -287404 -201099 -208578 -109300 -311854 -128743 -33702 -146401 -169090 -101977
19848 -101977 -85440 -174738 43007 -116668 61224 -244302 -87859 77437 54381 -143256 -194985
19837 -194985 55452 61923 149879 -59695 -44381 -202455 -166909 220907 476691 -151066 154574
19825 -17831 51073 3974 -42977 -338535 74531 -27229 -320099 86444 -105128 -110750 -55775
19814 -55775 -330043 -130074 -75898 136507 -92964 369420 -4075 -154174 84781 -25055 -97531
19803 -97531 122632 -100645 72418 -64269 91971 162497 -31048 72368 188405 142574 -271405
19791 57160 14344 242268 -89923 -58655 74987 -106729 241990 -62099 103603 -40564 -222680
19780 -222680 14294 244521 210173 119297 -254083 -518545 -32143 254422 -473510 -148412
19769 -60999 78096 -165037 -122641 -169214 -147869 55110 64097 9563 28961 -6863 -255396 4856
19756 340069 -16061 -188358 49763 24294 -162750 44696 -160901 34231 -187486 -8509 -15849
19745 -15849 -191918 93130 -222814 54538 -164852 -355798 167838 125848 162260 94832 -41133
19733 155795 -138761 -289879 -85669 -187507 -56268 203587 -125743 58499 125205 -177787
19722 -46629 137255 146970 -96689 -78780 -109508 198231 -146032 28345 -301095 -95828 -441335
19711 -441335 -306789 49660 114766 -182918 91090 -164041 202006 105564 243851 -240449
19700 128729 177669 -102618 7585 74713 71262 -151064 -85620 151666 -62717 160982 -142752
19688 -111518 -302940 -277310 31320 -145290 -165525 10274 -193612 -82660 -224172 -145528 -28263
19676 -54699 5046 -67940 -80355 -126579 161005 -268178 308944 96252 -154693 210134 98374
19664 -415162 105449 -130107 128838 -165150 141049 -76690 -72107 114128 159036 327104
19654 327104 190274 133055 -144647 -223495 106972 -283085 -9687 -83852 260489 -65448 2909
19642 -80868 15528 -239510 64034 -116770 -274651 37241 -96179 -2024 -61467 -98777 265597
19630 -255516 237208 -62642 -136736 38071 -79786 -5100 63327 -267491 81310 72029 -190324
19618 -276621 -92105 235429 47324 -374180 -10149 -169404 296782 328064 -11733 217706
19607 35586 -82990 -197213 -200459 -10980 -52830 -46611 -241236 112962 -241912 -267624 -327697
19596 -327697 -141621 45544 -199425 -119204 133639 133692 183009 -149395 -121955 -217973 -382568
19585 -382568 161053 97696 -157939 -101414 -242377 -133624 -116686 89370 -42157 -87182 125484
19573 -19847 211156 -19621 40899 137992 -301850 -152842 -16253 69370 -161143 -1936 -257442
19562 -257442 -94657 -40199 -111803 -337724 -1640 73816 234294 204655 39498 -429194 -221839
19551 -221839 6609 107608 69341 179456 98803 401044 -425729 -321574 -99601 -223598
19541 -223598 -190715 133487 -18269 -190592 33303 -414747 30520 -231042 209970 34012
19530 -36398 -139843 65740 -122727 103952 -61829 -20233 -35445 103384 1303 99288 -29459
19518 156821 -9896 172375 -78555 84940 103255 222962 -72806 -302197 -130811 160685 38048
19506 39920 106159 -195127 -187728 -216764 111659 -151453 -41448 -137207 -142658 -9549 -121325
19495 -121325 -143990 59207 -52632 15438 -168676 -312158 -89272 -219060 -239676 -72686 54956
19483 187140 109562 -170822 -54 59257 -173570 -23940 154213 49645 -118268 130968 -201241
19471 28911 -195893 -20131 -262056 66125 -77128 107379 -7477 -263852 89100 -127378 72417
19459 -30686 248400 191259 162169 -84378 -29037 176716 -56969 -145549 20139 -232619 6089
19447 -165235 50521 -466728 24133 -123583 86215 149 -264684 157093 146501 161536 -315116
19435 -214045 -307829 -45721 180445 -48704 -3828 23735 85352 19288 -294092 314061 -57077
19423 -154225 -68746 82119 -36957 216622 -205863 380 217354 -150459 161718 -248803 -120832
19411 -285727 -118211 6858 -264547 110722 -185743 -16390 50610 -6266 -89412 -332830 -223746
19400 -223746 -456160 -178057 253880 -46111 -105602 132018 -107687 -409257 260274 81156
19389 -119542 -162118 -103552 -578775 17320 162540 55688 323242 -33602 -33895 -219374 -109875
19378 -109875 263426 -278004 117186 -401726 -65554 -32618 -284726 -232713 34376 -63847
19367 200439 -141881 216625 403365 37337 -155435 -178965 3106 -32806 -94746 -64120 337212
19355 -92911 -94088 -426819 249243 -131661 -82795 -160619 -165962 185580 -190233 -105001 -26796
19343 -300589 -190618 -265922 156355 -73793 -268019 -89635 -68777 240090 -277179 159968
19332 -59194 80989 9034 -180901 3178 7377 21108 -174488 -189436 -145982 -162523 -74295 -195613
19320 -195613 8950 -55267 -148623 93233 63092 -60992 103167 -284921 77005 -70028 -114637
19309 -114637 -54275 -40399 -132971 9354 173039 92163 -8684 38121 -191879 -208148 -246519
19298 -246519 -104100 -154609 -275740 55526 -253996 -36439 -190408 -325073 -144815 250412
19287 150563 45290 -196754 145565 -70083 32463 -120484 -121210 -343822 53935 141613 -268460
19275 98515 -119063 29225 55451 -149696 -192416 -211166 93173 -254006 110774 -211212 -162702
19264 -162702 50614 124108 -69322 62174 -100834 186155 159140 -117552 10635 82408 82420
19253 82420 -52627 143953 -384915 -135090 92726 104822 -197980 30395 -171085 -12444 -42713
19242 -42713 -89925 -156278 -100212 -87128 -78567 247335 -382158 45182 -218795 -13599 -78942
19231 -78942 193503 172952 -265467 -206433 -44526 -18304 -101914 -175150 -306219 186926 -195528
19219 -39126 -383162 6730 -27836 -269790 -76820 143031 -179617 -89502 184585 32112 -181973
19207 157474 -186202 163837 269089 189764 -216990 50631 15584 -164698 -71096 -343687
19197 -343687 -10002 -66135 60032 -81751 40318 50973 -158810 -233529 101462 107556 -136291
19185 -213317 99463 -78442 -211283 -21992 -223205 101980 -351939 -131574 37187 140108
19175 140108 153503 -44816 3849 36813 -117418 333967 50097 92602 126483 -29255 48291
19163 120852 -175252 119371 -253145 294497 215798 69254 329635 -42398 122686 -418676
19152 123508 -12794 29705 -123656 10478 571 -17072 -199329 169540 -100816 -10005 -578220
19141 -578220 -370822 -95235 81782 -506002 -182334 -428986 188947 -107152 6671 72218
19131 72218 -25750 51802 -33588 -166206 -9742 69468 75086 -167427 410525 -136384 213412
19119 -10328 -320893 -201175 -369278 -30335 -51584 -139140 24560 -137636 -56940 183758 46204
19107 -107585 -168091 -233858 -189861 -60881 -317161 -36492 -54043 -139828 -95990 18695 33084
19096 33084 428 9049 81075 -95035 -114322 -198311 158845 102150 164524 198285 -291701 -119271
19083 43929 -43655 101946 -71109 -255675 -344448 -26795 174425 -189758 273426 -254261
19072 266319 -223151 -244992 113959 -39845 9277 -188983 -78723 -65046 -145386 46114 35956
19061 35956 -369059 -10557 -148042 -157528 -235961 -163122 -397426 -269517 112411 -147966 86143
19049 -47703 -215779 -27563 -84086 -3920 53376 -79110 -81323 12232 124115 -4150 -75995 -95856
19037 -95856 82881 17113 -294264 -217013 -126002 -189550 107658 68675 101753 87883 139264
19026 139264 -244117 394621 37241 -283168 228863 -143320 125915 -278555 284336 109100
19015 -55873 49518 -241914 -316493 276871 209 -273008 -176372 17400 -311355 -43225 -50104
19004 -50104 159338 46990 11690 -12532 -39273 -12349 -88010 -404848 -247436 80966 56874
18993 56874 -66240 271497 -335017 10929 -442323 14952 -191618 -343138 -76017 150472
18982 -89392 149230 -283506 -147907 -172860 -348365 -273042 19505 -308826 -80717 -58633 -182315
18971 -182315 -102563 -6493 -149248 49589 169960 54644 131757 231638 103188 178520 -203056
18959 100956 -157326 108971 51779 41342 191674 7177 169393 -376915 -390266 363916
18948 144069 -19501 -14423 -166696 -295011 -325179 85549 -39426 -261171 248564 -113030 -315624
18937 -315624 -91883 -33888 149556 210639 -100788 153848 -213926 76149 49908 68527 -254379
18925 2948 74626 7115 -21207 178247 -40740 158622 304848 -214026 -347061 116465 95003
18914 95003 -27727 191219 -176730 -107843 60985 189695 60334 -78471 -124631 -152734 -101626
18903 -101626 103508 -86253 -75789 -190845 73508 110862 -127189 158755 -62161 -68096 207114
18891 -65751 -160981 41539 124273 -361127 154342 90226 -361360 -113209 143033 37503 -51719
18879 -54691 215771 -308033 -44594 15101 -39764 -215820 -5645 -19788 -446471 -228568 24569
18867 318959 -50535 22318 67787 -14568 14340 -299924 -112930 -171995 -54143 76909 235449
18856 235449 -271299 244806 -247382 132835 -113142 225791 -141191 -111304 170828 -201034
18845 45586 28385 175193 -221921 -457958 -63641 240716 -281263 99393 -177632 121801
18834 401538 -331533 85129 -284259 -277047 -47716 -152255 -69344 147929 44547 -36983 448
18822 -61827 -357754 -156618 238975 -245509 75548 73525 274626 198157 113921 384440 -112683
18810 6142 330106 -61430 224969 249379 -66924 216410 -5012 260076 -277210 -10520 -143704
18799 -143704 -72456 -29696 -59699 -53573 75277 -323676 -30633 -115522 -263939 6373 1851 166815
18787 166815 62162 -65451 -21178 -73390 248260 170693 -72823 -54645 -265404 -119586 -217335
18776 -217335 43883 -85157 -376431 -372511 -213584 -77745 -205284 108753 -187461 -85175 27840
18764 105613 -252723 186483 -240786 -165081 -2198 89443 -298655 -69022 -184131 -22352 -204265
18753 -204265 446516 87356 133495 62511 -197607 73871 228056 183873 88936 -63616 -271776
18742 -271776 -127147 -135257 -210791 -211228 58895 -155913 394812 -287961 -188172 -31501 -16435
18731 -16435 -132705 435438 -42830 -82309 -185038 -22874 -285644 316847 -287334 -268550
18721 -268550 -213909 94581 203738 -286141 -10072 33436 148314 29701 -263993 -252105 26616
18709 -379028 -100825 -145577 -110166 -306424 -134097 -397035 -118088 -22456 -265655 -102355
18698 123408 95622 71116 -26778 170650 -21680 31451 238811 -284893 -313748 82879 -200111
18686 -117688 -58783 -214636 -200091 162162 -220578 45546 -224432 -286620 249012 -137415
18675 68616 -111310 -188893 -217588 -122626 -154529 215788 277864 64417 216801 17156 -140675
18663 -9918 -39276 -56869 8266 -172479 114523 -285146 14640 -32405 125810 224150 -149419
18651 94815 -181655 -229468 -285808 -185768 18856 -12958 -61820 -171952 102821 -373123 232368
18639 119198 264128 27606 -122288 65158 -45771 -182150 -16077 -5737 -169804 -176256 280078
18627 -89071 -128657 159659 -106830 11764 214923 63403 135951 10702 111621 -80425 23407
18615 -288689 115433 -45686 -157621 -114608 129201 208244 -123628 28509 -269822 -62725
18604 -56729 44308 -63545 151367 -20650 161483 -237933 -108826 72708 -28819 -45122 83578
18592 176650 180152 -454701 -105145 -163708 -256883 -180652 74314 79945 5678 -192881 273499
18580 -115539 -139362 -142957 89489 43920 -24915 54696 67708 -83204 91975 28060 -309125
18568 -27118 -1834 -293474 -99201 -138227 -217627 -79476 -76415 320612 -185374 338597 176309
18557 176309 2612 -45836 -132384 -188632 -245256 -339785 101446 -179651 358566 153336 -206855
18545 -184688 -69594 11451 -10101 223060 412675 -212092 11376 441602 -61503 -197511
18535 -197511 -316232 -273531 -179837 -188978 76979 -127094 -184226 -353307 105188 -146436 -170933
18524 -170933 -140935 -18553 -60372 2589 51692 -89535 -248121 123068 3124 -127899 23704
18512 112413 -226636 -202286 -105204 -253987 5041 -67764 56038 -241726 -31317 -14221 194652
18500 -263440 159246 -152259 -8686 -404352 14678 14337 384424 136401 -224286 30494 -106884
18488 6741 46963 -106825 -201414 -24094 -410567 -127298 70871 113692 -6007 123784 114897
18477 114897 -126971 24633 -125661 70106 -189246 5160 -175453 3959 -120334 158203 -218978
18465 46712 -288968 -196714 90275 158715 -280497 214113 213864 96386 -89278 -249393 -178861
18454 -178861 -188181 -244762 -89071 10175 -115050 -520767 -384491 -213662 44817 122147 162797
18443 162797 -90501 -77984 -207081 31961 188635 76315 5609 -48505 116821 150009 -254952
18431 -40079 52345 189815 299628 164414 -262875 71645 -65983 -69101 -16185 90815 -78383
18419 245021 -93807 -161014 -160450 203951 -358485 -68664 -102026 129710 -66459 -194750 126927
18407 79878 165973 27466 41133 -157704 -21700 -167217 87824 -868 -104005 -128398 -76474
18396 -76474 -175589 -124561 105210 -99481 -27790 10573 158673 50866 -217155 227638 -23688
18384 -83405 -248200 149608 -194416 153104 -31436 -24314 -160624 44301 -59285 -95994 -70515
18373 -70515 7460 15105 -22055 302460 132393 410597 -165398 216965 276726 43187 -171821
18361 -27897 -43037 67173 -11640 -129509 60099 18675 -98240 -358207 21900 -234384 135376
18349 124328 -124216 -98396 -54774 -203526 134612 -111305 -37982 -217315 -153809 160415
18338 47225 -65301 -48061 -119348 129032 -82954 -29223 -118758 -27077 -114720 -251937 131407
18326 -203831 21025 -67159 64190 70822 60124 -81280 65473 -244813 -20510 193141 22101
18314 141712 64076 -193527 -291567 144290 -69964 -79721 140612 -182877 -133772 -246343 91058
18302 -92555 -1574 -227306 -174084 -1093 -29106 -81529 -29925 -4618 -59535 -153953 -1632 -125447
18290 -125447 -4455 -134150 58885 104036 -163829 45917 21987 42147 78920 -109148 19616
18278 20369 -117926 -76511 -118543 -21989 -141236 -157620 87544 112476 -89809 -189656 -97904
18267 -97904 47354 -75565 -14639 350793 -50847 21675 -92919 259888 -125143 -181826 -245196
18256 -245196 -188312 -209261 74512 436263 55631 -156817 -125638 163571 -116954 -62631 -44488
18245 -44488 75020 -267813 -291329 134901 26839 297668 -273143 -248395 -135726 -133564 -203801
18234 -203801 -28952 -49422 -141321 92866 55552 55739 -35210 18875 35680 64216 -106816 52632
18221 468783 -138424 6640 -3196 138846 -322761 -38971 253676 -11569 -68027 89364 116657
18210 116657 771 -135904 46680 15349 8498 193419 -117273 -560594 -281400 -36188 -191245
18199 -191245 -108251 171630 7541 -162436 33496 180329 -420307 120412 -108184 -136803
18189 -136803 -13235 17332 -29781 -394991 317110 -72745 -66230 -311898 190322 59943 -67673
18177 58368 4490 -154602 265278 212061 -188169 -194841 15665 -218168 14779 90837 85276
18166 85276 23224 -257949 -189716 -74293 -60731 -48724 215564 -116032 -21017 142818 -167607
18154 -318110 -148124 -172309 223693 -258218 -138088 -121407 -20833 -177256 -258905 227866
18143 267013 24816 216238 -1973 -100961 11382 -34786 57671 137849 -243047 -136356 -225625
18132 -225625 97971 -326777 -137747 -23863 -191853 -310832 -62499 33566 33484 -111262 72499
18120 -186925 -109290 28732 -296715 -67383 -246750 187297 1518 327872 -96926 -63321 225925
18108 83850 64837 -74129 -28465 157667 -274156 118028 -251328 260562 -139597 -112877
18098 -112877 -92220 229765 -139657 -27992 -227731 -28257 -98496 167641 76671 287383
18088 287383 -165922 -118248 -158777 42343 109929 -211772 -160156 -78876 229048 -95144 46363
18076 267674 -58523 224657 -247433 -207989 -209240 -32864 -262635 7012 -162416 -150478 108286
18064 129203 144423 -24360 -29401 6127 -128988 -262871 81297 11530 -115659 38161 132891
18053 132891 -108372 -222052 -138924 112814 -174547 170015 27026 -272976 273487 -63212
18042 104546 -202764 52499 -304827 -316238 -270990 -101010 179558 -67425 -397690 22223
18031 -44198 -328565 86950 -187090 -68132 -386244 66463 56472 120665 -28531 -278989 293103
18019 75918 136834 139970 122124 -75676 135910 236927 141378 -94146 -242520 -311244 91002
18007 117670 46666 -122113 -18283 -318664 -4 -28783 -224675 -61768 151828 -141640 12571
17995 361899 -181481 -89301 83877 -137085 -155944 125211 -235596 270297 -112875 -426557
17985 -426557 164987 -5054 -111140 354438 177499 298064 4444 -260207 -102070 -96521 -98163
17974 -98163 -90115 78387 -175976 -125069 174637 30175 -314297 91898 -199171 -63928 -499164
17963 -499164 -183071 88604 -19976 -116727 247993 104495 -21725 97946 -107253 -296082
17953 -296082 104260 120 -19777 212992 72382 -35881 54294 189595 -184607 31875 94258
17942 94258 6157 -46417 -91192 -21411 -292401 131661 120227 -60948 -18342 -139187 -229773
17931 -229773 -196813 62953 -62669 369177 26187 7922 -85890 147643 211138 -234423 -21740
17919 34699 324681 128083 -27522 89956 82541 -423207 125930 -47247 -56284 301524 11792
17907 -128896 -257749 -120366 -336846 -95060 81337 51893 -152613 -12077 -9926 78518 150227
17896 150227 130659 -42610 61977 -263235 -251319 -98818 247088 -53918 -118697 108340 -182959
17884 57399 -253025 -225648 -1974 64532 -242713 -137517 46745 4431 52652 -98846 -388744
17873 -388744 -112295 -199247 -53498 -136739 312961 146201 126337 -112448 -124455 14516 24867
17862 24867 -68644 -211382 -271748 -357882 -106997 92375 -85050 98361 -142567 -171968 20315
17850 73384 116088 238407 142035 -223159 3153 29216 -211260 -84435 -140364 -245180 6476
17838 125795 -287821 -4413 64004 -114978 -120403 -140752 83971 168762 -209784 -107991 53076
17826 -210863 71845 167918 -241022 -85489 -41568 59544 -1915 -219122 139663 17883 333789
17815 333789 157957 121422 -193494 -171903 -9331 -321155 -111671 322855 131270 -49155
17804 191070 70328 83157 45660 -29858 59343 -142118 -29066 41531 -179516 2011 -21561
17792 220245 321933 -11643 -199133 -122376 -123193 -140348 220198 -26119 62803 116357 117528
17781 117528 -79692 -212680 -178980 -28962 -101417 10634 -401401 -85709 -14047 -96482 320250
17769 -102279 -64028 227659 -117558 -33005 126614 -19555 -282920 -212228 170418 -828 -236655
17758 -236655 190923 -275328 -19378 163491 -333437 -7896 52710 186099 -161907 214053
17747 1446 171791 -194212 40673 -236251 262847 98761 115908 11148 -22225 -11748 228672
17735 -164162 101796 -131516 234948 359236 -2290 -43021 157842 85844 -241835 413399
17724 -44326 -43842 -110768 -288902 11525 -206358 172293 148474 -70454 61570 51354 -30606
17712 -197080 -148148 -282441 31498 -234587 -335221 -129711 -128223 -156229 111449 -414252
17701 -115713 -35017 -326290 283357 -59087 225276 100668 191610 -99325 293439 327 -40527
17689 39655 -232921 83961 -89380 4463 112190 57121 -42433 -138848 98779 84479 408536
17678 408536 -95780 69877 49697 -44522 -40552 -46206 274409 -273334 125505 4891 -400641
17666 -94785 -215226 316042 183265 -6506 235953 -18759 33250 48152 -74679 146919 -70754
17654 176726 14683 273189 175216 -94882 243878 -239941 55684 -58479 -243856 373568
17643 98863 346354 -119937 -22588 -276850 -103233 -6110 55722 169175 32639 -199435 -158316
17632 -158316 244328 -113736 171381 -89255 -64214 121430 108836 -350906 211066 -45275
17621 -88992 -191838 131926 86873 178700 -135818 -102933 123595 133797 -446805 -78854 -135035
17610 -135035 90910 291325 35960 -194913 -7070 28689 250147 89467 -145112 20002 -64814
17598 -83279 316598 114939 -221225 70498 190986 -192309 49312 -22370 -141600 176477
17587 242019 157250 317158 128630 85972 -176125 -94287 -61255 -266406 85564 230668
17577 230668 186216 -94201 -18578 73827 48590 92471 160797 -78982 -81563 -115713 -29900 -16790
17565 -16790 86659 -25257 178742 544348 -151902 -459283 -257508 -146672 17822 7492 -2280
17553 26161 -107744 118034 149285 55202 9640 -222601 237186 201555 61969 -26449 -45108
17542 -45108 442467 -112125 300862 185957 -100422 323652 -124989 -22344 -140878 121358
17531 556 451587 -83304 216080 88742 248124 156960 9717 308051 31103 358805 -87517
17519 38065 244448 25807 38261 -43817 273445 -222074 104094 -166764 46841 169344
17509 169344 422377 157598 178181 176907 78834 56312 -274087 -200396 99054 445654 80718
17497 -118143 36984 -274860 212016 130509 760090 -125249 273771 66669 86944 105270
17487 105270 2603 189485 137257 103431 289831 -37937 125143 -279636 191911 13721 83766
17476 83766 160778 243117 267464 -288912 -80127 43414 41562 83416 169718 -11082 193993
17464 -63861 269244 481763 -239923 41154 -40229 -182753 135797 -94240 265186 170332
17454 170332 109261 168327 544940 216938 407037 175403 352995 169846 98140 3708
17443 91028 310573 274020 198958 -50586 84387 64661 31366 169277 267901 -88251 339603
17431 -17437 82820 -35864 139358 274257 27111 75553 197067 74652 213018 164554 282257
17420 282257 65411 406495 225281 156387 284698 211203 195492 480563 472246 255922 53387
17408 238702 151134 -28738 -234086 119781 -84897 -266626 300440 225732 -6085 -44180 52418
17396 113017 352608 67095 173402 136650 298338 351265 37928 68453 436009 -171769
17385 103851 368566 177766 134606 -148539 -6271 -56254 71158 -138992 122358 -88429 -176294
17374 -176294 64334 96371 -138590 103602 489175 53873 -122697 -198295 -55622 -101520 -101869
17363 -101869 234880 120895 76975 293826 183931 158886 292871 104780 210463 -234019
17352 75577 1129 356159 82466 269511 -15330 361465 379349 137702 384879 37866 -332206
17340 210146 245829 28801 -129845 -277442 35256 -66633 -17058 -156887 -5880 169519 479238
17329 479238 241196 129185 191682 25073 159852 -17997 -29741 158454 269267 -270014
17318 14006 82873 224447 26842 186312 -120794 100210 44251 81035 124174 475493 16223
17306 100958 -68166 130989 -19757 -175248 167168 45480 532769 158184 71815 228652
17296 228652 53236 260986 435019 86852 -108703 212010 -45747 79051 -161178 335152
17285 -24079 131174 -232252 -202793 149397 415407 168255 -22506 193610 -27527 496500
17274 327437 -102098 206961 192268 25857 31020 214214 27091 -53263 193653 -88515 145347
17262 96764 117020 71670 113079 446188 109739 -18316 192511 -33783 187974 142254 34931
17250 61481 253272 1482 -36136 73300 349898 197288 136719 192118 378794 241557 618294
17239 618294 217673 342660 -143952 327301 -127562 91316 155498 47745 66318 24366
17228 330334 316976 413266 418593 231240 108421 398025 132319 184229 274717 -47577 154760
17216 191368 -36943 343604 183212 201388 236716 417693 413475 109452 272717 380346
17206 380346 8348 157152 -125776 41739 486720 315103 316783 208029 105328 303941
17196 303941 176708 383857 310834 134040 188748 199620 20594 385790 180565 519447
17186 519447 86172 64559 336014 247454 316987 161027 19395 -62207 152836 7278 412037
17175 412037 -135610 149282 194045 97238 350539 461373 67272 262945 149614 398186
17165 398186 137057 -92651 303883 423138 334340 332846 218043 156233 387342 197076
17155 197076 157543 82981 65409 206530 429435 263693 550764 399197 368822 36963
17144 135638 412614 542069 277885 209081 270241 -86595 232535 206231 281207 36903 384495
17133 384495 83083 257211 193794 522719 400828 304689 234918 387918 435810 247547
17123 247547 325267 310062 -48115 235008 180372 450906 440960 283552 8697 332410 213756
17112 213756 45789 237251 272271 -66638 176077 420094 548301 201946 237925 398139
17102 398139 166654 -94062 227099 304584 194621 276742 409115 280964 580937 175739
17091 287090 351759 326020 391777 593680 512899 182544 460719 474308 220430 357514
17081 357514 328601 398611 316061 275796 246598 245517 539337 542406 547793 385282 742573
17070 742573 707449 452315 315249 392667 426189 165653 301688 427153 219134 165978
17060 165978 177718 505573 319037 378842 316718 277411 421614 459022 574915 706126
17050 706126 147426 518934 303598 56429 378765 569586 480334 511597 488147 603793
17040 603793 289004 600479 649826 532577 517373 458049 455974 320925 508718 571842 305484
17029 305484 143200 587821 263639 320646 561931 618891 788884 430748 378385 282378
17019 282378 697640 211116 550288 807202 652774 610027 215902 323591 758078 360862
17008 378971 351546 176613 293932 488799 558121 632507 469063 723115 404426 541650
16998 541650 760386 361459 410269 630080 666113 428503 666440 589369 607258 668252
16988 668252 634923 793624 659517 602002 527708 366053 549500 626440 800904 895869
16978 895869 390262 489632 782142 465269 695592 646247 919337 980598 547151 658918
16968 658918 279722 1039149 474029 653611 1213740 759609 845219 743511 773829 1095379
16958 1095379 591630 575372 997657 1024504 641214 714563 1049099 970698 988799 780272
16948 780272 730053 815369 940707 831608 1210194 844814 916692 812180 1184336 1217483
16938 1217483 1011229 907305 1211725 634026 758339 915154 1178886 1195767 1351835 1076771
16928 1076771 1082659 1110788 1215863 846679 1042230 963852 1313844 1291209 952463 1185834
16918 1185834 1418049 1351806 1450723 1166275 1278474 1155676 1290413 1327187 1400209 1195927
16908 1195927 1506783 1307811 1577665 1488643 1303202 1454211 1266640 1704540 1435235 1516101
16898 1516101 1234576 1605132 1547610 1509397 1955913 1610623 1504119 1512584 1694555 1711841
16888 1711841 1656858 1304809 1611637 1573328 1798678 1730667 1792580 1654825 1768914 1691264
16878 1691264 1801981 1918972 2011791 1680864 1829299 1689844 2278867 2074962 1953401 2363998
16868 2363998 1991231 1946930 2310239 2212793 2241995 2378073 2090674 2330377 2116776 2630916
16858 2630916 2498894 2348972 2480356 2382021 2345743 2805412 2712735 2713686 2867001 2499960
16848 2499960 2913744 2665977 2730241 2884823 2937320 2946961 3010207 3133128 3236834 3256813
16838 3256813 3111091 3069036 3241062 3440242 3427289 3894029 3793754 3421797 3368834 3650414
16828 3650414 3680251 3734025 3771825 3932467 3878909 4024157 3972071 4039615 4250111 3645952
16818 3645952 4531852 4611493 4664196 4715819 4772383 5006125 5119901 5374124 5655476 5738257
16808 5738257 5439503 5881560 5608533 5863568 5919878 5833238 6366193 6187412 6391540 6820598
16798 6820598 6723788 6994535 7432148 7422066 7581747 7761354 7671960 8220895 8353791 8465143
16788 8465143 8804339 9134579 9168405 9280021 9701719 9701480 10392230 10488259 10602646 11182904
16778 11182904 11638583 11913089 12457015 12368386 13344763 13640348 13982529 14466877 15029608
16769 15029608 15716994 15965628 16684205 17403747 17702271 18487814 19207999 19916970 20567508
16760 20567508 21660860 22536751 23415360 24232494 25613642 26687444 27893148 28876288 30256245
16751 30256245 31942821 33482079 34836418 36676480 38493551 40472345 43094233 45195434
16743 45195434 47843493 50445670 53459100 56341125 59913688 63112210 67194256 71063224
16735 71063224 75805762 80414883 85428783 90811264 96502438 102581180 109171165 115448064
16727 115448064 122283706 129332893 136299918 143169886 149931146 156298980 162398756 166887717
16719 166887717 171181856 174471561 176131769 176780370 175784551 174314297 171105032 166656926
16711 166656926 161693205 155992239 149433373 142800600 135695974 128334634 121492862 114454368
16703 114454368 107854848 101196175 95210903 89420640 84095241 78837342 73918610 69857185
16695 69857185 65601884 61561123 58128490 54639744 51853488 48527452 46154893 43741046
16687 43741046 41399362 39164835 37192433 35147504 33757542 31691731 30372907 29113919
16679 29113919 28083165 26413635 25275042 24207977 23178081 21904257 21403736 20388564
16671 20388564 19432248 18950528 18226759 17309306 16789503 15908041 15712435 14827031 14228547
16662 14228547 13784815 13358978 12874762 12108405 12174778 11643742 11273009 10897010 10553331
16653 10553331 10590172 10047933 9560947 9654514 8992844 8933304 8541763 8470244 8081551 7940645
16643 7940645 7699147 7201198 7259115 7114819 7056498 7110016 6514919 6360062 6208824 6032921
16633 6032921 5725419 5661955 5785497 5428072 5495112 5285921 5148655 5161924 5158863 4738811
16623 4738811 4622614 4419494 4581882 4544750 4617868 4019893 4138204 3957219 4276335 4101130
16613 4101130 3805843 3965731 3632569 3328986 3744019 3373037 3511295 3269341 3267818 3118177
16603 3118177 3248613 3012744 3232677 2645362 2800007 2881431 2892142 3003391 2617296 2434274
16593 2434274 2785121 2355129 2557317 2602043 2333779 2601268 2438733 2317152 2353314 2065955
16583 2065955 2313590 2121755 2465189 2033960 1978608 2164854 2166040 1999298 2364908 1807640
16573 1807640 2251802 2188868 1819170 1795959 1756342 1754851 1631963 1803629 1555391 1783486
16563 1783486 1743771 1723372 1222019 1379718 1833370 1848610 1582226 1547247 1594771 1188662
16553 1188662 1261486 1565791 1494595 1214589 1235342 1658627 1429242 1177589 1124340 1217140
16543 1217140 1127299 1436565 1405947 1226897 1421924 1421934 781844 1003036 1135978 1542878
16533 1542878 846889 1184023 1063121 1090225 1158475 1117463 1195957 1353795 1141041 1010109
16523 1010109 1077570 1071618 1078417 914884 764174 791169 675851 783314 839382 996180 1019577
16512 1019577 761907 878577 1068869 1008566 783630 791314 494897 791598 906031 788426
16502 788426 877885 860284 725110 951749 735712 476191 934253 748664 627657 633463
16492 633463 547211 874691 608523 752531 658133 269562 646254 427373 517208 422331
16482 422331 521534 735364 894817 696667 583843 386277 492263 549337 453368 724849
16472 724849 599585 399728 316179 601523 585399 263549 553595 758477 224450 586286
16462 586286 436932 520857 414259 494067 559711 516276 564590 398970 266878 366081 458743
16451 458743 423591 103195 536776 749339 79369 526411 175865 756975 260974 549263
16441 549263 849934 413343 588205 441663 69743 110445 316368 538424 266847 702787
16431 702787 464055 588526 354729 370356 390988 310162 308127 455796 613320 230206
16420 517402 269978 249856 542389 190205 81322 391459 356656 439753 589789 233764
16409 407302 176778 504539 258175 322876 485281 296349 566333 246574 373332 205586
16399 205586 122786 610495 262667 -1750 -51037 324894 330504 73431 102805 517921 176352
16387 336063 375438 429160 395336 -25867 374113 87004 433088 468256 176184 229482 207937
16376 207937 420087 357614 -380 524888 283093 159861 163344 -175446 490329 293021 395955
16365 395955 411414 313531 -17196 597860 256885 318275 -49611 307451 298883 247893 -57120
16353 292063 93707 -98692 -132009 289206 138873 -67209 177242 76111 14816 193776 198474
16342 198474 243499 35264 56994 159930 341207 217578 -131351 205638 210130 236765 81295
16330 228432 323254 249014 300101 467491 170057 320652 353382 520517 -89456 12491 67141
16319 67141 264849 323515 176866 169781 362545 59562 -22186 215255 27901 -14727 135033
16307 161389 -40035 153165 393323 168777 90596 317190 190263 84432 -9693 406514
16296 403057 295308 86073 243248 185226 169813 359208 35568 207246 212902 478138 5715
16284 -99624 206648 70700 226503 240410 -81793 177314 229991 187069 -118672 192412 141890
16273 141890 -384966 -21190 536968 -21037 46282 329118 106646 298967 348267 248934
16263 248934 146717 164581 305730 261669 293706 135340 141948 145783 210143 81841 73153
16252 73153 285973 135595 80934 173677 350264 294241 655581 93853 239825 144731 91226
16241 91226 37893 14954 -37036 71744 152122 -179487 187758 189595 75150 11462 -142853
16229 144243 -39067 162017 230950 67975 -226122 -114077 -193476 234747 146449 -24173 -37470
16218 -37470 -57899 270079 115174 -25528 172720 310547 60230 -228772 104895 -435010
16207 -56146 -84613 -261640 -112753 -78879 -54056 -3232 52387 107118 102673 -144280 4749 4447
16195 4447 -168992 126550 170438 322851 -71467 -77022 108697 -118681 85292 -3796 -180925
16184 -180925 252182 -215663 263972 -141608 50754 174228 -102349 -58846 -91795 3146
16173 92339 13980 -12856 55042 -145377 32128 69345 95501 104224 -37445 -85781 184808
16161 139184 -122741 -57122 -194558 97688 72054 77834 223345 -42560 -130119 -179806 -64543
16149 -133048 163332 -65636 75486 -100608 17354 -147982 283508 -49127 -63639 61866 21896
16137 333805 -85821 91932 106700 -66725 -1163 98390 215524 50795 -93102 -206514 155091
16125 -159889 109239 70544 81659 206212 218615 -308575 96613 -1873 -34624 -75566 90353
16113 140919 116206 179219 222562 155622 -171070 104237 113337 -64344 94530 -68999 -251114
16102 -251114 189642 240019 15797 63918 -112464 7660 299184 263438 49380 39469 180472
16091 180472 161985 -54640 152743 130765 -172289 -83475 157966 -431053 -126572 -159491
16081 -159491 -186870 -54394 -106344 53674 13825 134765 26773 66860 -177133 -85720 -315849
16070 -315849 172775 137164 -101323 -280984 -177321 214585 -345137 -164828 119155 -68512
16059 141843 -111966 -45880 11900 -77369 -93821 -109169 -46388 3600 -131045 140095 -121246
16047 -342393 -110430 230035 -179267 -102488 159472 43688 -141747 -57564 -209099 -146670
16037 -146670 -278699 38409 99067 87528 -164186 -49607 -43597 -178907 106490 -27022 -152173
16026 -152173 138415 342 -197805 141526 -364222 134592 60150 -180233 -220762 -24295 158102
16014 210951 -19015 219819 313701 178810 162943 31944 -971 235370 29053 -34811 181788
16002 -84951 -44057 -364566 245836 28722 -118549 99608 -115436 228537 -179378 -42514
15991 -28552 -37563 -44588 370219 -236164 187399 111725 -297669 -213898 276219 329670 439946
15980 439946 111170 -45198 9990 134833 -270377 228703 -219708 -249323 101544 -2559 161561
15968 51126 151443 -67887 -33873 321856 -257517 124873 -98665 114208 38680 -198071
15957 25803 8910 -41827 -69526 -177962 148148 200179 -253282 245937 -344110 43138 154888
15946 154888 -178291 50622 -25757 136711 240916 -365952 -221004 -72524 -194349 109591
15935 -147069 -134000 105581 -29955 72546 -48132 -70524 283062 145465 141715 -17582 69119
15923 125307 1011 -106425 -175195 -296827 -215312 -172363 -303437 3674 101386 -192784 39533
15911 -168128 -104662 -113491 -212603 -308498 -189212 221008 -173325 230215 221102 102106 -144203
15899 82051 -16427 -18075 48498 -75989 -105237 209648 -68142 -295715 157602 71802 -305474
15887 -125497 -262756 277564 208711 34122 22995 -127796 -25560 171797 -25627 -289973
15877 -289973 7673 -216658 -365571 -29943 154285 -54914 -1261 117977 -107040 37176 -205694
15865 -43605 198349 30775 -172778 -51159 -299492 -46272 227023 20829 133398 265060
15855 265060 65797 40062 -65304 -85531 -260482 -88380 21350 -164292 112908 40255 37038
15844 37038 8289 -17822 -362055 -43834 -167495 48740 -243988 90265 -151117 -68017 -121377
15833 -121377 -20133 134230 340558 -230838 -247529 102381 91716 -434773 8279 -101683
15822 60212 69302 -72873 -345393 -13635 -54624 -46610 279001 -219594 -4929 63303 113332 -208141
15809 -170117 -197 -397085 84620 -302222 -155354 126323 -20308 73987 107337 83303 -123494
15797 -79287 245716 -75987 196844 -151052 -77605 -13520 -127960 -17711 -263705 61666 -182260
15785 -78853 138659 -179347 277885 -183204 -65411 -73204 173692 -89923 -86604 -59281 121140
15773 204967 42085 -206959 -14551 70882 175161 -79060 138835 -187953 -293527 203389
15762 -194243 88206 -25816 306684 57015 -169890 133493 -219816 -247340 155755 132412
15752 132412 71943 -51065 -392569 -55435 148992 -40790 -131555 -2178 -21775 -41538 14172
15740 -70585 33193 -90563 -27944 -271759 -117017 -248648 -218536 -247105 -156118 -143320 -137441
15729 -137441 120919 190076 -203122 65288 -248805 -78911 -31575 37863 213418 115879 -241789
15717 -62017 -223940 -92496 132985 -142122 -86233 -63543 -180771 217386 80275 -93259 47727
15705 245357 58928 279102 -124741 31828 92517 -274324 204629 5244 -256619 48012 264567
15694 264567 371 38347 6113 -15784 129944 208038 -213437 -21989 47520 -42486 285612
15682 32294 -74741 -164368 7267 174530 -144219 52217 -330497 -188377 162227 -49012 505532
15670 -37217 245151 179060 217366 75165 -39564 -37936 69927 213886 146997 102295 -238231
15658 163614 64438 55273 -49060 -12158 -35373 -134789 -216317 -128504 -79962 -171374 -33973 101097
15645 4498 -218871 -41209 -246608 -153896 -89217 -57070 -291565 -4998 -157792 -171917 -4683
15633 227799 95479 232624 -103243 -206075 116968 89960 -422723 133260 -79811 -32992
15622 106175 -142881 -79295 79228 -350826 131903 414631 142110 123755 -201607 132774
15611 -163575 -98739 249280 -96242 -134175 172949 -175316 59600 -177589 -66821 35661 -185375
15599 19510 -249939 9768 -250137 57247 -2972 123357 51539 47328 93964 -205794 -32099
15587 135315 -193451 -148057 -29413 19851 -73967 -9946 65432 -31528 146455 101606 159543
15576 159543 218281 -22485 -39880 -224994 -100855 -92784 -188934 -90620 6438 234209 -217183
15564 171381 -24914 362056 215566 -484117 -149703 161134 138079 -283824 113971 -257855
15553 -51421 -1288 47014 -51021 -94150 170878 -128932 119972 26062 -2339 16391 -4378 -58216
15541 -58216 -120606 -101180 252340 46353 116623 -84929 149998 97740 4298 -484988 226613
15529 -103518 11194 173542 -23478 977 193198 -42365 -36332 462556 259728 156675 219415
15518 219415 471999 133781 31286 -149731 -146716 -217718 303097 -158152 64016 189994
15508 189994 -40884 12694 221394 -336616 -129081 -199358 -108668 -59213 72997 503665 7673
15496 -133373 20586 322938 -80134 119348 215069 121665 -117276 -266574 98707 -118659
15485 -151448 -99380 63785 212459 423289 -169585 111900 388966 -184344 127829 -82168
15474 50208 -94100 60258 89216 -56366 -180626 108320 32774 -298417 -145077 -69675 -51188
15463 -51188 126962 -111962 336699 71870 -279874 96386 404968 -318798 -117721 143687
15452 41362 220758 167018 -53697 -105405 249292 61977 -305288 63341 49569 -68989 -298238
15441 -298238 -132365 203223 -28979 21557 -78974 51175 129475 7348 -47048 165134 148275
15430 148275 60095 -219546 93122 -99908 204910 -202862 35195 -119730 -212926 -280539 -205382
15419 -205382 -96282 -205697 221799 -134425 -129512 11509 -234982 -84831 -150393 -54685 -265681
15408 -265681 160351 -224757 122895 7232 201838 -60380 -87972 -305807 96231 -7739 67166
15396 -16723 197805 96093 47163 -194248 129757 243079 119965 -118788 -133183 239082
15385 -260082 -48724 -197336 424986 -202134 -116423 182867 46982 -88320 117082 -90637
15374 -30304 66855 104627 385354 61920 -73884 -142917 -85670 80190 -95191 84246 -332807
15362 65361 107274 -24904 150590 -42627 153595 -57853 317731 -33136 -135846 -119583 -142010
15351 -142010 316512 -208217 -42990 -41543 133035 -158723 291689 -165238 -17507 -171220
15341 -171220 239786 -111466 175022 92273 -136233 195091 -47054 -265652 -54993 66693
15330 -165707 -99004 -47271 395462 -107114 91410 252988 7116 -147982 105007 -151319
15319 438682 -115066 39999 -99603 57940 -58407 127034 -205901 -266988 4695 -295007 -106870
15307 147387 267440 -285924 -140883 -121799 -87741 1139 96840 -254338 -158222 98683 3392
15295 131924 -183534 360049 275028 -175320 126379 105403 -44644 81840 -61493 51172 -184787
15283 80772 188884 123453 -167145 33119 -9695 3952 -307505 -129691 199004 404011 19863
15271 227357 -60823 -63368 -147100 -289878 20906 171559 135384 -205347 184775 -315909 118382
15259 291531 -5196 -61589 -85941 213839 143843 173721 134251 -275991 110818 -18111 207992
15247 833956 1080476 869936 968116 813958 490041 391040 -17482 -130130 119886 85920
15237 85920 77031 -101214 145045 -264983 -90442 25620 81086 125785 40135 161564 81566
15226 81566 -157960 345846 129479 97338 38795 6200 397985 -292388 120521 -202421
15215 -25805 120100 46625 -86344 -119362 190169 -221529 188150 -187299 -161441 182549
15204 -98748 -135367 124455 -130725 124383 204190 -30985 309597 283790 -49551 -195726 69319
15192 203096 76998 -141646 -26950 1969 113692 -19586 388559 -71410 26927 77113 -183012
15180 -97694 96354 12672 136512 9316 -72858 -39658 226331 33273 -69305 56891 272109
15169 272109 -124937 -27038 -188823 82580 -167539 133016 5753 72682 22469 537728 47235
15157 186111 130496 189386 49050 103490 435938 -218601 218650 113857 39861 -228064
15146 -96276 -144308 111965 -38520 -37582 199416 195124 129410 -45310 198781 286335 397313
15135 397313 176498 -49357 306353 51580 -570 -173338 183673 87647 208320 27012 65243
15124 65243 33439 247788 -21539 158220 252161 164725 158366 298223 -48177 201088 324296
15113 324296 283265 45007 249510 330421 197885 201290 125666 108169 38162 -167263 36745
15101 74149 62972 56856 162183 162024 40901 -247673 176332 34857 -72519 107750 337946
15090 337946 67131 325636 101073 -49863 46371 -7042 99217 -27765 363306 -109548 -3632
15078 -175199 -50293 23024 125585 219044 15088 223427 85087 198959 309826 131915
15067 277618 -33374 90471 69037 150723 135083 267662 148925 -101815 -21460 163903 353928
15056 353928 124800 173204 374078 -227357 -103294 42866 84633 24770 243404 -59674
15045 320018 -65691 137854 174322 354892 47882 329985 39224 17118 114637 40204 238276
15034 238276 106349 121009 -44989 50201 203026 -178833 558560 201667 3029 9887 -213119
15022 127220 10152 383462 372364 -126229 -67144 68346 157814 150374 -1641 151572 175860
15011 175860 120640 188728 234101 161760 -41861 266937 118078 -230386 226448 -88539 214121
14999 90324 76416 -15751 -385891 -214681 225520 -319432 25946 113892 501413 -106217
14988 55396 58785 271624 186302 603945 203246 274347 50236 250078 635925 221764 277338
14977 277338 207402 -55902 91066 -87700 73821 375626 36539 328270 316592 297970 319005
14966 319005 200985 138202 350020 83622 53556 134710 263446 -127254 481550 30120
14955 234344 407462 -61424 47005 446626 286426 -35144 280752 91384 382306 149853
14944 246276 287362 68363 -161992 93266 176965 -14914 -119263 313126 159200 579042
14934 579042 253378 -80836 316323 106951 173121 102921 390270 97419 -94217 241845
14923 134817 190527 345804 131532 342295 431566 171226 383072 165911 251984 326398
14913 326398 381605 -16536 75089 395947 352331 207321 148153 417540 -47297 317211 249792
14902 249792 386284 473916 191255 -19379 226876 107842 124745 289695 240057 242828 165730
14891 165730 411628 89488 220813 84719 137951 273336 123722 249754 287346 562778
14881 562778 254344 149109 43048 389050 168373 155580 576510 108421 313514 68609
14870 378095 277299 444569 253458 210714 394474 313981 407154 446849 244501 74773
14859 44912 472509 411720 529278 318713 299173 251924 414183 461219 125142 508182
14849 508182 465232 209935 236130 385340 335835 -62535 416162 65724 249174 353037
14839 353037 223773 285834 538124 330567 98146 472928 369753 194221 420139 230089
14829 230089 405867 224592 429155 789121 278072 479444 442206 453916 404665 -57491
14818 330361 23159 564239 475098 178501 237913 213262 512485 498687 421285 302792 475982
14807 475982 232387 749596 420067 608415 262819 158580 503568 427578 453104 551470
14797 551470 292987 478710 451499 393858 532794 737923 255965 527541 380588 506439
14787 506439 327026 632853 342500 478538 550140 292967 528618 220993 760648 463421
14777 463421 272032 380741 571906 537481 547372 524564 501780 495426 402173 466155 237524
14766 237524 598280 296266 638711 687881 685700 530396 612625 755239 423916 584581
14756 584581 659829 138293 668721 172481 431256 561067 160500 624402 316547 628792
14746 628792 444178 353957 768973 719276 466918 571506 367130 659552 866435 768674
14736 768674 679060 734700 569527 625502 965877 628356 752220 912989 308653 542604
14726 542604 637247 455726 691292 862597 670787 506785 766894 855719 419382 519372
14716 519372 717692 630899 573586 706783 292505 629994 720024 593017 455204 550769
14706 550769 425219 656272 615968 824618 880503 504369 895380 780158 475697 869009
14696 869009 564688 410658 535699 344793 411698 769368 818404 719625 780833 776970 627644
14685 627644 425337 805468 1007329 688205 509161 639021 904776 904172 1211424 742177
14675 742177 990202 663855 1028750 707238 582411 973525 725196 932009 1079163 677893
14665 677893 939087 434667 958563 597849 914437 820613 830069 995608 885146 795303
14655 795303 560094 790793 821497 765127 913159 882545 899102 842248 706432 1063368
14645 1063368 952386 810379 868797 665440 857819 1088765 1217288 838898 1045380 1022378
14635 1022378 931583 904782 990332 1324681 994503 1298411 1115495 1045241 1238880 1221236
14625 1221236 1291713 938837 927269 1154363 1283728 1114535 1259241 1146264 1162670 1190897
14615 1190897 1330548 1148137 1130226 1368791 952317 1318244 1501286 1392032 1577964 1226596
14605 1226596 1258178 1402498 1166234 1353008 1262362 1063623 1227922 1443237 1411726 1052822
14595 1052822 1612202 1314681 1171813 1205995 1316261 1180121 1413566 1266394 1659967 1453257
14585 1453257 1276145 1495242 1672231 1552299 1492865 1731905 1536858 1618919 1546497 1590288
14575 1590288 1585004 1712533 1416664 1893851 1730566 2017514 1960772 1935517 1636623 1852903
14565 1852903 1854626 1872103 1979220 2164359 2122154 2158317 2343463 2406943 2552164 2667179
14555 2667179 2607670 2849002 2746547 3192394 4173802 4744683 6623662 10047755 18964765
14546 18964765 33387908 35669271 21825960 9719142 4226159 2759015 2042186 1990340
14538 1990340 1953129 1791339 1625294 2038942 1362065 1885956 1365449 1623976 1922965 1684273
14528 1684273 1667223 2080086 1875699 1865050 1865921 1946162 1583593 2163568 2029447 2156960
14518 2156960 1635408 1963204 2064028 2164144 1688014 1906714 2376290 1961856 2391304
14509 2391304 2614355 2198228 2065046 2631389 2620684 2277206 2140578 2340066 2485416 2566416
14499 2566416 2560195 2954892 2457620 2623240 2557121 2616538 2433396 2600936 2757624 3203488
14489 3203488 2900286 2853151 3018040 2925674 2914565 2928284 3043667 3067705 3191043 2886820
14479 2886820 3203156 3220126 3404486 3356159 3203869 3431442 3512981 3318487 3389217 3195122
14469 3195122 3515960 3453047 3582974 3831217 3496728 3737191 3601170 3640327 4105419 4051497
14459 4051497 3936420 4121316 4079266 4082204 4239992 4215159 4507582 4439996 4361278 4351507 4577426
14448 4577426 4224032 4773967 4531651 4931322 4550807 4741710 4633806 4849189 4729954
14439 4729954 4945764 4991841 4712831 5119673 5004477 5176985 4974376 5454910 5587617 5419871
14429 5419871 5635713 5438804 5774536 5947498 6113751 5963397 6030544 6172074 6430272 6563696
14419 6563696 6621397 6487305 6522331 6506466 6607025 7126782 6953019 7287777 7195609 7271974
14409 7271974 7294046 7494563 7485909 7579661 8167568 8422348 7818866 7897171 8360920 8388288
14399 8388288 8805203 8415939 8653727 8954956 9262045 9361420 9694807 9651713 10076041 10098894
14389 10098894 10112350 10032180 10416020 10963598 10663389 10835436 11134927 11230642 11614727 11639052
14379 11639052 11797406 12164298 12611063 12688316 12670883 13128114 13571005 13882916 14063213 14391709
14369 14391709 14741896 14936870 14910020 15344683 15693528 16345192 16246729 16975032 17200678 17805427
14359 17805427 18115822 18595699 18967965 19261244 19651638 20054222 20227683 21118047 21790020
14350 21790020 22181794 22695293 23076814 23883247 24747145 25316799 25953237 26441064 26874316
14341 26874316 27882949 28605256 29315249 30281054 31069625 31960680 33260993 33825784 35182672
14332 35182672 35995250 36811850 38080501 39447622 40696722 41896505 43281352 44756009
14324 44756009 46224892 47624621 49467326 51406601 53178322 55208357 57236882 59423857
14316 59423857 61758365 64097728 66668356 69123414 72248242 75238466 78213386 81631381
14308 81631381 85103609 89137436 93046159 97158885 101907816 106462162 111710561 117113529
14300 117113529 123186485 129709651 136150654 143263536 150930047 158925410 167688620 176708143
14292 176708143 186640284 197105641 208030816 219717227 232212584 245010513 258815695
14285 258815695 272869314 287909663 303136727 318778314 334366241 350256961 365520019
14278 365520019 380640618 395060028 408236834 420668146 430101399 436098578 438600832
14271 438600832 438170599 437151209 434179991 432139063 430239139 424346206 415339841 404188294
14263 404188294 391508343 377441437 362173266 346066311 329864432 313319381 297283667
14256 297283667 281886201 267237415 253355690 239690814 226706168 214509943 203012314
14249 203012314 192106859 181790028 172294717 163568695 155020936 147395335 139916282 132812485
14241 132812485 126226523 120436879 114518330 109274318 104820184 99895962 95069604 90924572
14233 90924572 87140179 83623964 80485609 77024376 74258029 70752405 67940979 65429794
14225 65429794 62948443 60746374 58152958 56072085 54283926 52655506 50628528 48427631
14217 48427631 47148466 45339070 44102157 42689304 41628811 40383921 38585916 37725782
14209 37725782 36616593 35585277 34913744 33429343 32679784 31734684 30847757 29839788 28924185
14200 28924185 28469139 27863034 26720945 25946822 25471520 24860826 24329153 23523645 23107902
14191 23107902 22490470 21772115 21496031 20564837 20662492 20071498 19644278 19117605 18501274
14182 18501274 18163872 17726076 17289663 17017599 16721322 16376749 15742597 15347159 15234855
14173 15234855 14848714 14623370 14488425 14154566 13980294 13722829 13441906 13412358 13117523
14164 13117523 12901583 12682809 12126555 12187951 11675034 11293403 11568892 11107584 11113589 10825994
14154 10825994 10388561 10203501 9931249 10305037 9913161 9783952 9640219 9309216 9261912
14145 9261912 9175740 8823160 8665672 8635779 8642551 8403520 8190876 8197994 8197077 7963860 7660232
14134 7660232 7850158 7609869 7415193 7292015 7171879 7081905 6979903 6898296 6892458 6676704
14124 6676704 6538238 6598375 6668677 6420417 6271838 6021128 6050797 6083583 5920713 5885817
14114 5885817 5749401 6037916 5704041 5407845 5478120 5604300 5141785 5166038 4959709 4980601
14104 4980601 5045667 5207797 5017093 4888163 5354551 4958897 4688924 4741663 4786161 4517333
14094 4517333 4491651 4799009 4540201 4412342 4289357 4055078 4320420 4389173 4149647 4175901
14084 4175901 3964037 3980692 3952511 4098129 4294615 4126369 4087278 3658563 3888786 3780132
14074 3780132 3475387 3670368 3430291 3660894 3433806 3853807 3352621 3682544 3559370
14065 3559370 3032973 3364768 3615806 3140300 3361654 3073065 3312331 3557490 3615196 3499015
14055 3499015 3259113 3071439 3181632 2920160 2989288 2884855 2651185 2772206 2628908 2574561
14045 2574561 2862902 2850136 2466352 3008925 2747237 2729184 2659250 2685825 2675065 2479061
14035 2479061 2474473 2559484 2943286 2291190 2572136 2731762 2782174 2513487 2333295 2510506
14025 2510506 2779549 2029868 2303556 2149710 1985853 2033942 2045176 2128715 2171128 1750385
14015 1750385 1986735 1769720 1889505 1953163 2099372 1751262 2083519 1703696 1774368 1916455
14005 1916455 1945580 1633991 1464491 1764738 1950987 1519259 1802249 1669769 1656925 1635572
13995 1635572 2108569 1566712 2229999 1387074 1592312 2260219 3102833 5733183 13303539
13986 13303539 28764637 35649768 25578209 12830527 7361443 4986305 3804334 3333623
13978 3333623 2924558 2700898 2917230 2438307 2238945 1893557 2372593 2034868 1937704 1767891
13968 1767891 1790990 1855740 1895005 1561363 1944971 1866398 1641104 1687926 1794541 1778607
13958 1778607 1675856 1921044 1972992 1700944 1636083 1618271 1714191 1701413 1335811 1559226
13948 1559226 1502720 1761339 1681611 1828300 1535929 1257722 1381115 1305556 1569819 1567770
13938 1567770 1225393 1502908 1415247 1343263 945898 1485605 1421890 1184834 1221210 1334610
13928 1334610 1291303 1586942 1108992 1307596 847545 1092428 1385661 1126975 1287376 1412788
13918 1412788 1169432 970432 1110841 1281490 1098898 897705 977585 913287 1075638 1273781
13908 1273781 1255347 1198645 1226787 1273424 1144855 1045615 934819 806273 1110730 1181617
13898 1181617 947929 1241899 1004496 1310767 1163127 1234945 1024557 1251003 1075510 812471
13888 812471 1012639 1129861 973293 900126 884169 921184 940369 946750 824740 1139754 759614
13877 759614 1065633 1034711 1277655 712531 684033 1069065 1090174 1432907 1237612 853435
13867 853435 847108 724521 925834 873638 873211 984249 887537 1045738 1079403 1267791 1036137
13856 1036137 791756 856538 680141 785002 864647 740891 646072 1052699 886493 906665
13846 906665 1026525 764834 697136 548215 724808 635318 835636 808353 450480 834365
13836 834365 916419 689568 718394 660874 1160964 462703 726631 824026 843796 717915
13826 717915 732926 897731 648442 454417 697229 770338 943706 441290 759494 567367
13816 567367 639063 657332 690343 544742 683905 609553 858699 514772 489218 380726
13806 380726 706095 570899 657416 808225 668913 662292 568020 608894 504318 687842
13796 687842 669013 387511 100398 398660 369581 635720 945766 729856 746014 410801
13786 410801 705631 360797 434951 598962 631029 612755 695796 369459 506096 468965
13776 468965 536027 442592 614557 404121 349545 240979 461360 403935 782007 624120
13766 624120 438624 619268 620171 245427 705858 390394 605248 632151 446815 552005
13756 552005 482869 581476 437889 709684 712265 329258 496852 780614 813053 516081
13746 516081 575382 739720 641002 736428 480905 333882 738444 399963 477288 -8511 297243
13734 511992 231593 645245 434193 588293 508994 449270 132874 290758 541558 530617
13724 530617 346467 550068 457999 485949 266212 522003 519258 550167 106605 318870
13714 318870 624008 772682 612859 147134 409155 732752 320741 222306 333625 799786
13704 799786 154679 465539 489831 241038 575734 54498 648278 86423 357858 381467
13694 381467 348172 180927 407185 500085 313007 237119 445195 435294 518746 676241 209792
13682 575216 300708 723935 674446 337322 429576 538890 713053 308133 292499 -9675
13671 238115 340378 285698 268263 250365 375747 67744 263848 394019 261201 61048
13660 254790 281027 599595 350745 485506 363419 135174 -82377 464784 501724 477009
13650 477009 482668 358616 91275 252159 304585 407217 153374 103164 264215 492976
13640 492976 137610 379986 158600 16112 528871 98425 262401 685865 440699 474526
13630 474526 237624 272228 116319 583007 409083 58927 157846 276816 570478 382689
13620 382689 47559 283184 173755 341366 446342 -140416 275946 274494 153340 383373
13610 383373 350470 53963 174941 268887 331229 112312 670617 291799 196436 368207
13600 368207 215737 471516 55514 106889 692111 333243 246551 375558 179660 155895
13590 155895 205228 432537 341523 452196 68589 146801 -124109 551751 339794 282701
13580 282701 272887 296711 -88553 320880 205016 349270 191055 567277 70471 89346 140554
13569 140554 483234 206375 299850 -70918 620263 517170 272110 351056 122481 415695
13559 415695 85194 351910 356965 3976 143830 387100 232368 -10967 70783 81038 22813
13547 450734 -314523 -28508 452468 60917 83191 86219 46872 208789 -31473 271938 15827
13535 54883 186674 324374 -25136 92707 -286176 28850 330999 31141 311201 353264 214671
13524 214671 666360 157931 357584 221263 150239 -7892 551547 172764 242897 284874
13514 284874 -110719 292071 276189 -26281 158988 125377 563705 81706 332809 288923
13504 288923 155462 -10702 297085 257700 256984 185949 173488 410001 19056 304717 343436
13493 343436 -22509 173471 525701 49427 11700 279243 -18254 56841 19074 186744 99492
13482 99492 204128 161905 15421 70189 328529 -69331 -20213 215363 315665 59809 240004
13471 240004 257178 1219 111063 342033 318475 -50385 299671 -115584 188411 298674
13461 298674 160298 159975 215704 125984 82674 46026 435898 224181 92444 354730 293626
13450 293626 261301 244581 111009 213455 317663 133498 69179 212206 320038 152299
13439 355220 27784 414685 305538 -58857 102752 148311 87796 209538 106271 179228
13429 179228 436772 194663 128207 143309 289140 194133 116495 362152 94759 154157 -30543
13417 204151 82261 337732 -69327 106864 216848 217528 56336 245576 235817 268502 158122
13406 158122 213425 -299453 346724 128727 22580 -179421 96610 131624 80622 228856
13396 228856 305109 66683 73070 252058 242116 176138 174711 167532 133076 215783 227812 151246
13384 151246 91828 467886 182995 305279 281650 321348 5761 327666 313789 460549 154802
13372 309593 -9719 197573 23412 217786 89315 -91905 49956 78959 132832 373104 319377
13361 319377 262474 313818 146173 290620 178408 77346 -110956 118435 345163 3792
13350 2970 -203771 -112735 194411 -432 262902 -90393 269029 157489 275993 234431 131130
13339 131130 273563 61515 111027 97924 47312 223256 214780 349617 404500 39824 -219742
13327 -160155 -152230 119298 -308308 505704 43937 209825 264266 340932 498746 290615
13317 290615 491327 43403 439273 239562 224037 -27744 151842 -215091 336152 406057
13307 406057 220773 69146 19936 248872 75531 53928 363361 253455 153724 192862 -37093
13295 413663 67270 -119186 486417 -108505 349462 20908 25080 222149 418116 115983
13284 52155 -301464 125646 303099 139774 -240273 1879 239909 365188 -3845 -33729 204515
13272 62974 167490 150830 325033 -3898 22402 -11310 177827 72589 353564 4839 193706
13261 193706 210554 2412 138568 31764 317480 71654 165764 55317 -154466 598494 -90053
13249 186802 628980 285056 -158297 124220 105395 -149865 -289632 84062 122392 -13072
13238 246496 273341 -258952 77118 21583 107879 528429 182213 72436 148493 340674 84422
13226 26522 120583 242530 -16726 112447 37725 286879 281528 3979 -36495 397715 -183981
13214 -133089 234189 386622 249777 41897 59773 -94847 271663 -125136 140118 -149825
13203 -216850 13677 26384 51968 -114151 -52455 -84158 39674 90128 133564 107575 158419
13192 158419 -16492 -38179 -120151 -175004 -174567 187114 216483 19560 129649 -105786 3182
13180 87848 204984 -137530 -20320 214059 2612 -66686 47192 249 -20723 183058 206840
13169 206840 166280 139361 99098 98223 148032 -31474 102517 -227044 -70728 6228 143363
13158 143363 215709 190713 50599 66219 -155746 34750 7992 -13850 27120 129174 -2161
13146 -126339 -210203 13958 -29134 -87166 275433 30729 245574 -276663 51057 -133999 -10301
13134 -13784 296491 82584 126325 -69289 13778 -34579 133554 -182823 168995 16994 -68901
13122 -293133 60707 100444 41642 80898 -17433 145123 213032 -132462 215314 -220804 68199
13110 -208410 -145719 29730 95031 49294 39454 -42205 195001 -79153 41396 -112599 -72374
13099 -72374 373189 13315 -8589 -183205 -56911 -145882 282493 -53565 113521 -301519 168844
13087 120121 233351 298851 83468 103836 201104 8667 44061 169778 53103 200831 -20173
13075 174145 -144434 58057 -199819 130932 -6838 -160968 -116284 -120261 197073 -196550 48404
13063 50652 1367 228943 241826 -31154 -36897 -148719 61704 -64799 403792 -377970 -18527
13051 -43206 83129 278918 -29219 42726 153205 -136072 208398 231126 275949 -71721 220351
13039 -137397 -211100 135622 86957 217378 270650 73909 -297728 -219788 -143259 340435 306417
13028 306417 74236 -52505 -46616 71615 70310 255994 528339 5697 118038 -50975 31651
13016 -81166 296798 182797 57154 92398 74601 -200170 236208 -192948 -27494 192500
13005 56616 -77655 -77007 149558 291843 48353 100238 6801 73454 109498 -92015 426037 148843
12992 -12795 343065 -220638 -24786 -35991 -85944 248309 95004 37099 360120 213652 -302554
12980 -3639 294638 -264610 176968 225511 157071 -76295 61628 -223401 203831 -43853 -253871
12969 -253871 162180 8969 99040 264290 -29775 32013 -43416 177506 -9430 172336 92117
12958 92117 -53501 -40564 48371 -64533 205628 24837 24074 296252 -91453 163366 82297
12947 82297 220413 -342551 -176052 22129 -140436 97425 202560 12592 105760 36465 43738
12936 43738 -179619 97621 30316 89774 203272 136054 105997 -125848 -65466 -61975 86433
12924 -493309 -387799 262670 -86331 -126694 -82576 38399 10718 -157649 -126752 81487 -194843
12912 -152206 307050 190532 202865 -231690 -299913 -40012 243603 334285 -38656 -134456 -36924
12900 -40053 25721 -89240 -50305 -105769 4137 54970 75113 26225 -61041 27929 227648 146347
12888 146347 383451 -195667 197812 -131419 -107909 129804 320188 205179 55030 348113
12878 348113 -260205 201796 126387 252262 103024 -14429 224966 119072 235425 -345992
12867 -256267 132667 -1388 13262 -60590 274313 137991 -85868 82123 -265118 66641 -55868
12855 -127343 19901 286541 -282050 -74496 -121293 -302407 -58795 150812 139438 217256 -126889
12843 129782 195533 74319 107412 228028 168457 13615 -180543 -253784 36683 350404 70576
12831 95768 118918 103740 81979 80182 -99766 -62256 -25977 43168 121818 41642 65958 120802
12819 120802 -244235 112749 -50674 -207350 183769 -170751 54287 171679 147356 25829
12808 108418 81745 91919 -122218 -221498 -249080 90430 39046 81096 -35340 -68146 -285985
12797 -285985 -283259 -69320 153315 -62155 -114376 163057 -125295 100156 30656 -342190 168564
12785 -282306 -266818 -264474 147135 -135162 -32020 212787 79591 130307 51679 -263875 -109750
12773 192617 263404 -153858 201683 39040 -29706 -239297 240532 112330 -190071 10418
12762 -68701 352926 -73657 141101 26650 138970 95999 -224168 -187422 -230114 211205 409424
12751 409424 -54053 328611 -329154 -158424 -7565 -224245 124598 -246104 180851 62026
12740 101941 -254670 -27143 371774 164684 424719 81242 -53565 1269 178705 -129638
12729 -54386 92082 47139 -173363 -313405 301908 -237729 225349 89537 -106161 -32332
12718 -105636 208962 163099 -172476 154168 -335223 -283272 50665 213277 276864 38011
12707 104487 262284 262528 372647 424322 101122 -115661 250853 67006 -57394 344254 239193
12696 239193 248215 451987 -194899 159369 31177 -9478 1063 140225 -81744 -249509 34586
12684 -91366 -149472 -11582 -121458 80216 -186220 -831 -20782 -52537 33537 37025 106101 324496
12672 324496 -144871 13174 -162810 -259451 51079 193844 -91870 86067 -24035 158328 442762
12661 442762 25717 70972 475 130624 202506 80733 72514 82215 -34281 39692 272467 -154598
12648 244888 210988 229653 93142 271327 154163 -7372 -23490 -70546 -42 322820 32758 -102919
12635 186669 -98108 148734 -41899 111870 242829 142009 311176 114774 40065 191725
12625 191725 149411 221444 357943 -91997 -4231 358758 185929 -12236 -135977 -49889 7527
12613 146547 300906 137378 32765 68558 -194217 -126879 -157274 -39132 321312 -120672
12602 -282864 -216560 111774 156926 72455 -130984 141454 79195 146667 -83909 225827 17108
12590 -164099 -108049 -206750 27868 172777 -178204 -46280 -206018 61090 314696 327913 214995
12579 214995 240523 122049 279930 115644 14440 -279564 -155024 -413061 212073 299905
12569 299905 -54063 -143920 164301 -274725 51415 -111757 -57128 285470 81937 -415188
12558 -13071 82833 -28256 358635 288927 -72814 43068 146111 -94244 -499634 67153 -42644
12546 -104003 111856 42505 232386 34414 -45025 -31643 79696 -145068 -17291 109095 -187959
12534 -264693 159208 186074 182136 160801 1478 3130 254103 243617 58518 73913 -156730
12522 52025 -32413 -12090 -101780 122457 -73598 1289 -20335 215470 39580 105260 -164441
12510 253936 -20033 -2541 71823 84184 -193438 201948 -381664 -24260 87661 -82527 9954
12498 -148267 -12553 386809 185909 -97692 -58781 253069 152585 -76574 185743 171363
12488 171363 -117700 77890 -199534 -378175 -118361 -116112 82753 13040 61784 3780 -156789
12476 -92625 55000 41446 40443 -77873 -7281 -108489 -34491 346763 -121694 -351263 -193712
12465 -193712 -19470 -152158 341464 323927 -15334 -230415 -183573 -133299 -322410 -37484 -107398
12454 -107398 7247 -49568 -30488 -337143 -52772 -79439 -253211 -256367 197386 70432 -100331
12442 -188484 -74157 -422246 -189851 39335 -135308 25330 195898 25682 -56330 -136587 -33990
12430 -56063 204027 -5879 127694 -169432 -75232 249300 156316 139124 -206942 -38130 12611
12418 -228451 13336 155546 -14656 -44057 17118 -95255 -268017 207211 -21023 -85329 -78209
12407 -78209 -14522 -22121 -106824 -45492 117773 405372 -33987 -138327 -189555 -1349 221427
12395 -226868 -35338 -363439 -21961 -26217 -352025 -168349 -31556 122920 25136 -293086 -253347
12384 -253347 85105 -48710 -163119 -67236 -139978 -41720 -147164 -91844 -223262 47910 133564
12373 133564 74010 72043 -216911 -99778 -38463 120789 51420 -23171 23505 112306 -146540
12361 -104201 98438 11087 104339 -2777 89640 89663 29755 3965 -123816 242299 85829 195927
12349 195927 -161696 81244 20201 135797 68301 168892 4868 79666 243635 47355 171983
12338 171983 -149087 247077 -128115 -125311 42562 283688 -144001 372660 -133009 117764
12327 -363490 -68814 -49032 -260132 -23881 112816 53150 220359 -13892 2439 -204279 72782
12315 -20989 120993 -148224 -60478 252103 199122 -274618 -84960 117307 341774 -238169
12304 13731 37965 435738 99426 -100719 -171123 232874 -214240 -169069 -30735 218658 143467
12293 143467 -116996 83483 -32459 131238 125148 -8774 4653 -11713 127144 5039 250793
12282 250793 -116285 381481 70525 95710 117905 181747 168110 -52096 103828 370344 51006
12270 267187 212527 -10385 195044 148005 44368 234406 156325 -131852 111588 325651
12260 325651 -53647 -11612 82483 122451 97553 -153509 329901 -157298 321838 54081 117699
12249 117699 228016 43404 -102674 -132536 224687 -11966 38401 301510 -89238 -139462 229960
12237 -29977 98378 -30017 7740 -164850 63782 92814 354857 163744 205505 260536 -54978
12225 -282906 123987 152907 484437 -47656 537214 29107 249707 329847 55986 -40139 -50877
12214 -50877 122386 177376 -200109 104956 -76383 148749 87952 323170 91476 125829 470435
12203 470435 86803 207875 -61170 329437 -171159 -295992 16360 94508 -8724 136470 91574
12192 91574 363997 379727 473536 -81576 126730 -90004 169540 138784 192775 48941 276915
12181 276915 -66568 -79554 154688 103932 -82392 153767 6363 188527 230630 1134 133289
12170 133289 -108505 119619 109525 -194713 144570 144669 -121323 -122082 47470 -131783 65808
12158 -310347 152420 211559 -105499 111362 -212825 -185408 -170952 -148934 -53516 148269
12147 -137387 43296 215123 -49250 14935 33159 27212 141841 155954 -152160 84244 12895
12135 25025 -87303 -41811 -8310 -59027 -121054 -106989 197520 -220684 467352 126787 -62111
12123 92209 243304 51865 -206870 77062 63257 -224459 -277216 148738 -267404 168229
12112 -26389 -63228 76870 104534 -158620 22752 146437 -382771 11107 224365 -111146 -323996
12101 -323996 -199202 80279 -166512 121211 -7567 -14572 -169276 -42112 -137516 90625 -168477
12089 -10460 3731 -61532 277333 -76023 67325 -33792 -223327 -325928 320107 164546 129893
12078 129893 -132197 141035 -138122 100007 102218 785649 1378693 895559 436580 26315
12067 220225 57023 89310 363135 285013 -173004 158212 244647 394951 -52053 251184
12056 106719 -8890 -38489 48657 -46244 124085 -325091 21513 39755 -106745 -37910 -65686
12045 -65686 -36007 -244770 59363 -303785 -42845 -146842 -109500 -127476 -190020 64792 -161143
12033 -122730 110560 75915 -257040 167068 272327 24063 90712 132086 123380 -16021 -71769
12022 -71769 73426 263397 128368 -35236 -123721 -262867 -185261 -340781 162579 46611 170672
12011 170672 40047 -171598 -163631 9317 -45509 -226342 -168543 301650 185455 50084 -29939
11999 25992 246482 237436 169814 -50863 193987 146606 -14925 -53444 -184301 -152292 221945
11987 126229 -25619 -337793 85923 -65612 -2103 -246913 29564 123551 -197051 -7955 6562
11975 15380 -305104 -2222 -5361 -86046 -82955 -231033 123838 -137535 6254 42103 171910
11964 171910 -69649 -71174 177526 184008 -11351 268789 -105020 180971 -285765 232164 -170210
11952 -49837 164994 115917 -4832 450882 -83194 -4104 -141288 3473 -100937 87836 -31710
11940 196795 -512332 253893 105720 140046 -169227 172439 -146714 -384943 157632 368145
11930 368145 140395 59516 23067 -8914 54260 -241813 126887 -129868 -260266 -185253 -39295
11918 -511 138422 76058 232444 -236186 -66356 -203654 129740 41426 -122052 -7042 -242054
11907 -242054 -414589 -88043 -111889 -199368 43471 -40337 5099 69587 -71087 -117 -143123 146526
11894 -59118 -127008 -236909 -47194 -365869 -308523 -63537 -68539 -60895 6403 18775 177678 22198
11881 -61483 -98473 -130221 -162312 36192 -109281 68301 -296245 -6347 -300175 -277451 -115992
11869 -164811 -32101 109575 -89981 25036 -123992 49839 -300196 -303534 -179556 -155385 125779
11857 209906 -105693 -46862 -158696 -43836 -9369 -551023 25645 104888 -119420 -84536 19165
11845 -110391 -110696 140748 39917 -125064 132490 -193308 226184 -162676 308114 -301660
11834 142644 75522 239269 136450 -60933 67957 -47505 136498 -158692 -96022 -383625
11824 -383625 80672 -18495 -486752 75180 -216056 -138497 -267034 -244878 -40098 20799 158861
11813 158861 -197458 -9422 -284724 127803 -92096 76551 -135118 -69620 155137 -107032
11802 257244 90094 21616 132753 -27506 131803 -9559 -146792 248452 341139 201883 -75248
11790 -136313 24780 52550 -43601 -94958 258492 195122 63400 -226218 176891 -116346 92475
11778 260189 -64283 78154 -255540 -189862 -197078 18390 63251 -4938 -149697 -55228 97448
11766 -10821 -160385 104875 32724 25046 198990 140408 92232 152206 257487 -178881 -267265
11755 -267265 210682 -184384 127448 52183 -85409 -95777 -33746 -14225 -140639 96190 -49157
11743 134647 -68327 -327561 -244218 -62984 -25724 78487 158654 -373482 95926 100906 50933
11732 50933 -181553 179196 -77931 90160 237800 -151023 103589 -59460 -170793 -50248
11721 -138900 159115 70445 -234242 -75533 77715 190138 22867 -45987 23223 348701 208456
11710 208456 -69545 126056 76736 9827 95332 191318 -239196 -55103 -109783 -142895 -263279
11699 -263279 400833 9307 -92813 -161752 202388 -9828 -45075 -166168 -158382 130099 -137609
11687 178343 254485 -184724 232108 216999 315206 323841 172703 -93401 155069 19262 -113692
11675 28676 238400 -235391 -25503 -266571 292979 177884 135277 115888 -84325 60764 -75695
11663 59213 -20562 43452 131315 -137644 212694 85420 213270 415572 -1982 171117 44646
11651 66795 47759 221024 52360 280650 386862 -432005 294736 -364946 25625 -3845 -29121
11640 -29121 81967 272906 -90287 33054 71848 -346353 -113814 -147223 589901 -145668 190088
11628 -170964 219269 166354 -16084 75695 -411484 -37190 19992 19443 166341 158253 356706
11617 356706 -44214 -80736 -139602 33665 -318814 -43294 -203129 -132471 -110234 53251 -78964
11605 -120284 290869 332746 250618 -47204 -61393 412285 124730 84976 39517 307056 309876
11594 309876 11030 -222728 -112749 -180229 -173230 200011 87126 75193 -119828 213729 -153644
11582 52153 -256329 -288015 -35058 326029 -65104 -323756 20009 -185415 159584 -43006 -268927
11571 -268927 441951 26453 278168 -69006 21085 374234 154348 -181871 131140 264799
11561 264799 102498 71424 362070 80572 139021 -280713 62830 -118049 -64498 -127637 27457
11549 188695 -46981 286938 354060 324598 42541 377478 42519 -44815 82781 -275791 -182531
11538 -182531 -100975 -134905 43394 45208 255987 -368029 55029 267748 90625 -387952 264495
11526 25282 301772 94180 485050 49780 91902 -33582 139238 -137627 -5077 206083 18577
11514 23185 118748 239909 -51472 -191275 -65921 -102772 90588 30289 83882 -71925 60757
11502 235253 28354 97150 -44876 359167 203004 207834 217387 358199 -21757 16817 -286545
11490 -136065 -158032 208179 57079 371943 63902 -48101 310979 346775 123331 357363
11480 357363 298525 -161276 235773 -93020 185895 568123 429972 280134 292366 224850
11470 224850 -152672 268956 -18350 -17718 297233 -18809 262656 132926 58267 -13680 11059
11458 -78449 -20495 23460 -199962 3274 58721 128617 361095 344402 -85985 -172612 -85371
11446 304446 5324 248918 32207 151005 -43532 432907 252378 -138558 -103020 214526
11435 -310287 115681 119006 -115318 -51490 -21586 -198495 306975 191492 -26357 -185570
11425 -185570 -194823 126268 80927 321487 -582714 -17337 -177384 -33036 -45532 -156382 77839
11413 -22108 -62038 164675 -123942 173770 -131749 105527 8642 -63225 -140074 -234660 -36430
11401 -198923 403958 35261 9633 159030 389682 -84347 -43604 216790 107503 439113
11391 439113 -287924 29236 -129668 182586 167361 -18242 -145676 -189959 -70061 -146693 -6555
11379 11870 -14242 -24268 -297165 134037 76606 311075 259544 -212191 -56792 -150078 67219
11367 -97506 27849 -42759 104455 190259 -75592 -191248 -219353 -41398 -291236 -57555 111142
11355 150763 189398 69038 173249 -125573 380410 -224970 -127628 -70979 257201 180008
11345 180008 -115319 182544 36115 -1053 -60508 -46920 313644 -119216 -68109 -187081 -254634
11334 -254634 12368 -273309 15787 -58886 34008 -127661 -89998 108082 119927 -459663 -66816
11322 -170265 6211 -63533 347085 -41079 38658 -10237 103401 -155718 -412210 12295 121868
11311 121868 -31980 55843 13818 -48884 180973 60992 -174651 -117138 -115182 -49501 -27577
11300 -27577 222438 280566 13171 220816 337928 105666 -87471 197721 150026 -423825
11289 -1292 38198 178120 -104593 -196473 -78399 -140220 158990 -23232 -117931 -34796 -108108
11278 -108108 1943 -100396 -88646 -136056 -88663 26435 15230 -76340 -131681 44933 -163279
11266 -51897 161943 16374 -152230 -131890 252452 -333148 -1858 -15557 -207805 -45766 186989
11254 -211675 -92786 -74544 -168580 27 32871 81281 -57321 32861 -17268 -27612 -126433 178114
11241 -277313 -80725 36137 -142695 225944 -177992 142017 14767 337162 -415274 38472
11230 191154 -50479 81648 -389374 -1798 65050 -375075 115414 66889 -128553 -59452 -477753
11219 -477753 -204979 -216145 -141900 3942 -267474 -244173 -89911 -215048 26272 -311367 22410
11207 -366656 17262 42226 -20148 -9969 103685 222077 170611 50798 141025 -60707 -1813
11195 -189877 -185492 75448 -9401 228447 -101858 -4202 -15451 -56903 -10223 45143 53014 -32317
11182 -217114 -217952 45146 -78353 19189 -22468 -25479 7670 -209400 45079 -129922 -182432 213706
11169 3681 70426 -86536 -17266 30639 15117 9084 241452 56649 74288 -19654 84997 -82229
11156 -234158 -181294 -270847 5048 115810 84410 -143785 -216681 268221 -966 -135285 191275
11144 71248 -56483 -198477 219246 61591 -156835 -50208 13026 94962 -320630 -88379 -68771
11133 -68771 193676 -143349 208476 137110 -141458 -151201 293090 51170 292623 39424 -271223
11121 -60794 335097 111960 107298 -43650 -146387 234255 -42923 63893 325760 93826 31704
11109 69904 317127 3464 -131590 -165097 247788 93009 133724 124933 94977 -68639 50953
11097 117614 186644 249048 193055 85377 201189 49444 282682 533269 203350 561366
11087 561366 80268 146011 137585 346546 246776 84963 206490 11045 127657 165315 98464
11076 98464 286033 312619 284447 193145 99897 145075 335075 330908 491112 416182 -34528
11064 478049 637466 577676 312662 386026 464054 770409 720526 537752 494679 756382
11054 756382 599354 617192 500646 598240 650549 636632 762547 814477 768934 832578 669540
11043 669540 489150 598865 557387 524633 554643 818308 980108 965059 911060 678597
11033 678597 590351 594669 646606 747501 673973 798591 554355 436655 808052 779027 482763
11022 482763 722916 550412 937291 645664 254384 546592 573594 543559 838758 673307
11012 673307 658257 296836 546849 604894 326522 521422 472516 363203 577398 339609
11002 339609 378429 521694 584240 519104 532525 662690 529991 756633 549050 665863
10992 665863 345380 552208 762202 659643 882725 637941 537782 634441 1010439 1054494
10982 1054494 1090654 1084910 1285605 984295 1756042 1661633 1777207 2279744 2048245 2032433
10972 2032433 2166297 2436177 2766164 2365313 2142554 2264492 2034192 1836639 1725389
10963 1725389 1728862 1560589 1788096 1962204 1744288 1774099 2247181 2078939 1791505 1727166
10953 1727166 1397200 1207418 1270039 1074838 936340 644571 447216 393687 369637 431686
10943 431686 117697 208814 -4051 77312 66534 210659 383912 346091 420542 167102 284669
10932 284669 160710 204991 13145 -171535 40118 -147032 50377 288507 239568 -223763
10921 -59895 -103139 17848 141899 -272 -202215 109921 160101 -230475 225657 176765 -105929
10909 -118789 16465 180060 -95325 -316884 59268 -112218 94841 -227648 -110818 -66415
10899 -66415 -225712 -67510 96889 256880 108721 -180155 -196193 113530 196276 133669 239074
10888 239074 214042 70005 214703 -145204 -52579 -159974 -328651 -48079 -369483 -256623
10878 -256623 -80457 -135641 -40269 123979 192489 -100811 264180 174549 -264613 -234304 -50379
10866 44673 -118119 134723 254270 41937 6562 -73671 -198081 60306 -94469 329341 -233287
10854 -245336 -315990 74971 62102 24543 -269504 235429 58037 -465812 -35501 -163311 -306838
10843 -306838 23746 9836 -53070 -86540 49420 82013 249840 106500 38595 25570 -79983
10831 -289821 -245504 -33691 74310 -37175 20022 -96999 -398061 83821 30098 153078 -65326
10819 120717 199128 -136247 -108215 -92461 73859 46306 223408 277481 -203878 97715 21966
10807 -130897 26303 130055 87936 -263270 27439 -44307 -255012 -169717 93430 258195 258507
10796 258507 -69194 41826 -74608 -177032 50933 -122068 57318 184455 146758 -572 -107849
10785 -107849 -335665 106746 132072 116335 -3751 155559 -236109 -234417 -115163 -161023 -110155
10774 -110155 90953 -165822 -160128 -216592 -87363 27386 -1158 -103666 -136682 -147221 -372355
10763 -372355 103707 128465 -264850 99691 -118717 -242218 -307420 -130334 -332196 106908
10752 -366520 -773 141339 313758 72057 115627 206386 23081 64113 -123715 237343 -317296
10740 -143717 33702 197093 -177053 23325 -122625 196102 227649 18830 85621 36391 18597
10729 18597 -114092 -96430 181260 233682 -247060 242208 77009 -80585 145811 -184777
10718 -208101 310099 124904 66303 -163702 16153 156747 -74241 59879 -108439 80436
10707 253206 237640 -51243 -105719 -71638 -17859 -62288 -234160 -213457 -202686 1963 -198202
10695 -72409 21679 1161 -503917 -84690 -23018 -35359 -110134 -118154 -144031 -51893 115960 -85462
10682 -136521 -132563 -329861 276427 175257 -244082 146067 109798 -207459 -75229 -195116
10672 -195116 -214761 11650 -72388 25892 -1270 132025 -104066 122214 -55710 -88630 -52022
10661 -52022 102039 75952 160801 -160793 -182179 -17906 -438381 42475 12689 -57569 -79255
10650 -79255 13547 -28087 -171485 -180408 254625 207748 -140310 -293396 -301943 76933 77776 -19332
10637 77109 63079 -247060 66277 -89981 270776 3220 -308105 -485446 -214884 -88683 -91529
10626 -91529 -4003 -235816 -298676 138621 156539 -61677 -279444 -3127 -123968 54141 224472
10615 224472 41261 -189576 53248 -175772 -217493 49546 -173246 -132338 -16130 -105914 232510
10603 133660 -194634 -287970 224016 -255844 122726 -415025 -180934 -65708 198038 101142
10593 101142 -78702 -123834 146220 33703 185659 408032 123057 -110105 35439 -248713
10582 155772 -150129 32746 100923 51478 108090 -174542 -2798 -202067 75246 -179978 -191470
10571 -191470 -180430 305380 319615 -189704 -71594 -316650 -104133 63641 343486 212097
10561 212097 13214 -345978 24960 -99528 296398 -174037 37201 -239977 -104235 -108218 -129142
10550 -129142 136812 -171045 -47392 38185 -70323 -125213 -232763 167502 -74906 -9441 -219218
10539 -219218 -555801 -203858 -1517 -38680 68717 -231333 410240 5801 32986 -26468 -169009
10528 -169009 11330 -284168 -117880 -146985 10875 412 -68786 97080 -244758 214451 53419
10516 -202974 159262 14363 209665 -410115 -232404 -285689 49188 -209456 -244255 9624 249350
10505 249350 -122006 -210253 -96200 89378 -143351 35808 88607 -225850 233963 -133222
10494 -30167 233178 -43493 -182673 -21383 33889 25002 18267 -185030 -271635 -100584 62148
10482 519987 547007 767829 612423 490253 526362 117288 298401 170911 -12890 -29640
10472 -29640 51502 194284 -98003 95367 -165655 -117865 151895 116295 -58358 -66792 78877
10460 -152424 -54395 -247999 43757 140261 15528 28428 -18347 -268660 -23610 -324271 346697
10448 51397 -118546 -35529 198687 172816 -95586 -67246 -384982 211674 -201167 118369
10437 -248597 -323169 8320 13289 -87636 -143645 -103637 144506 41016 -162022 43615 67378
10426 67378 95410 -298813 77935 -59053 -125883 -309139 161666 92443 26434 -278363 -12905
10414 186078 240004 67656 290829 -154153 -102411 -32311 99826 -198907 -145781 -321333 102902
10402 -187306 196085 144189 -95520 -81965 -92482 -172585 -125488 258415 97172 -250868 109349
10390 -90295 443737 -106170 321409 60601 -155100 37221 -31124 46903 -70050 221072 311406
10379 311406 23621 116875 22648 391242 331243 387130 190939 118284 242627 284863 159423
10368 159423 382284 220283 187794 325401 9197 13500 385460 652814 343256 175741
10358 175741 180394 104115 -100742 357090 187353 468218 396380 465656 399488 343445 595292
10347 595292 309256 34676 309110 589479 781403 250088 40965 -168749 99348 393607
10337 393607 301993 -45352 498349 259995 230200 5 -84151 -208620 146862 158426 123733
10326 123733 145623 418784 -93376 116778 168920 487777 154434 300634 414895 192348
10315 145297 162447 110364 265934 -38622 -117395 -325632 -313019 66111 -2504 -224737 56792
10303 -285924 -319618 291081 -140149 -135863 184181 141539 185261 -33279 272238 -130493 -81926
10292 -81926 -110046 20030 -57269 -319299 -104481 -267213 -164271 -92372 40984 24393 -116393
10280 -69093 104956 -303011 125629 -263041 189137 -201648 91061 -219791 170606 -333953
10269 -17481 23781 -379153 231273 -83386 288005 -38769 108591 38479 284706 302675 61983
10257 301172 -134396 83390 485106 -72884 30315 -133510 30691 -99386 -291850 107400
10246 13307 270108 156195 8600 -237911 -225884 -38662 -216156 -177454 -261236 -72179 -289028
10235 -289028 45734 -268058 188930 37023 117892 -29515 -137413 -46383 -89283 -157450 119703
10223 31267 -233178 188718 69238 -7619 -42510 -12340 84180 -15348 -208066 -164801 -662 -65140
10211 -65140 -384861 -209221 307728 -237745 -176660 -174176 -78808 -143363 65938 64508 -87011
10199 -157290 -315654 -161344 106146 192939 18307 154292 -140518 -6285 92835 -28872 -312324
10188 -312324 -199059 202059 -17463 -41179 -17670 -221428 67508 -198990 -84694 1075 -72751
10176 397987 -124377 -196026 58400 155100 90323 -124895 117036 -108599 -24707 -123940 -282580
10165 -282580 190676 -219017 -121767 -110516 -163860 74497 -345424 -216819 -180978 -110015 -126440
10154 -126440 -127875 -194910 53419 -119134 179583 51007 -66948 -86356 -27895 -133648 -531
10142 -126820 -54340 -333873 74334 109812 -6705 -6742 -124078 -66831 52471 8380 -198951 -338967
10130 -338967 -162203 -293072 1056 -299971 -34832 283014 -223151 64145 -180686 193951
10119 -28141 121506 -93872 -650473 37580 -61375 14407 -142894 -161289 -240975 -419787 33331
10107 182754 -13995 -202269 -230717 -211451 -63547 98971 208132 10058 265814 -74963 -123588
10096 -123588 -83177 4602 -120478 150685 195853 -122426 26145 -284530 -17953 -51910 322264
10084 -160024 43289 -193229 -257397 -47111 64678 91505 -260430 -110149 -163336 148998 78165
10073 78165 21146 -181722 104167 158184 60526 170845 -407136 311018 257599 18953 252487
10062 252487 -32825 -117130 157313 -76562 -251349 -57912 190531 339520 -28190 22325 85785
10051 85785 53764 -229025 -51336 299 -32986 102588 -350200 29159 -249332 -48644 -255994
10040 -255994 -198654 -21616 -171876 -17415 237021 27542 321623 -231692 12172 -96190 176446
10028 -309056 132582 -52190 -38570 -104213 -337139 -86723 -117191 92391 165736 -113713 -92149
10017 -92149 -67614 136164 213548 -16479 -54520 -25835 -418046 -22899 309935 42483 -42449
10005 -225877 101420 -141583 -134131 -109181 -127536 101133 72141 57362 -349188 135657 -122013
9993 -330896 -11006 5328 -187304 -43538 -347793 -131131 -7414 -178047 272919 184264 -399657
9981 -127456 9519 -150791 -327560 -38538 -181521 -158690 -58759 -4893 12173 -111914 -192069
9970 -192069 164511 -280691 -47700 -326691 -100677 -431048 -225478 -73328 26423 -168936
9959 113227 -71193 106506 -28298 -137882 -69914 -177826 279616 148926 -238263 219281
9948 -161922 123032 -279586 226444 44293 316197 59809 -147087 101515 -343998 133383
9937 -34248 -112118 -308191 -209683 -167205 -110308 -402640 -174577 212383 -468080 -61324 209043
9925 104117 -83328 164245 -14951 -310384 -452099 147078 -197441 -227032 -197755 11838 -253405
9913 9165 9981 -451020 101582 523768 150711 -329132 -72980 -195771 149440 236569 206663
9902 206663 -122750 -87753 -423501 129557 -272271 -90440 -116069 321919 -311473 -195158
9892 -195158 -161200 228264 -211639 -252901 -255577 66978 -365210 168389 -91618 82406 60482
9881 60482 157098 -149519 -57579 39466 -105123 209582 37845 -31851 -83561 292876 -58069
9869 102021 -67587 231777 -42744 -58362 -13574 -129343 -84130 -37305 -209885 -77332 -21896
9857 -211671 371083 -254758 -38982 261490 -92250 -153239 -166239 134010 -97662 -209802 80568
9845 -29565 91111 -537189 -133951 48595 -208003 -95495 -151475 -71302 -353262 -118496 -110433
9834 -110433 14078 217203 260374 25737 -61231 53742 -48384 26213 -171902 -186346 144674
9822 -179499 -107739 -188639 26609 -47717 -405945 -511970 97238 -36837 30021 -131857 -34506
9810 -160260 -71233 99838 -92927 -119496 107749 -374682 329535 -259626 -356533 -139001 -28896
9798 -29675 -491161 -84646 -185063 313042 -80895 -162452 -311978 3178 -231219 70590 102896
9787 102896 67059 -65776 -139090 -89802 -297900 -78216 -239149 -37631 2572 -196482 -273 86960
9774 251315 100499 78196 34900 205226 -235484 -386661 -70689 -250724 191187 -169106
9763 -137126 -139573 -42923 145221 -189300 -119829 -234525 -329020 88412 -50215 -347261 -310622
9752 -310622 -72470 -278061 -2076 -132279 71118 -58552 -24826 -286832 24968 -9565 72747
9740 -92768 -29451 42290 271154 -82181 -356026 193123 124505 168068 -60862 77808 -86806
9728 -165254 -74868 4708 350679 -305682 -138278 -4519 -448554 70539 37903 -53936 303649
9716 -127884 -21967 20158 -93053 -624810 -263024 60819 172057 -113003 -161441 -396820 -103982
9704 -23948 46664 -43765 -270959 486 -387686 -328481 79156 52858 -88548 71763 -47601 1412
9691 -148482 -127044 -242993 83086 -252717 -87859 -169726 67452 -425943 173932 -67183 209845
9679 265671 289530 195170 387072 134697 18763 184522 73815 -5622 60184 -280536 268003
9667 43740 148857 99266 -182542 300144 -173016 30311 -117596 212319 -55779 -349332
9657 -349332 -207269 67161 211231 -144335 -71261 -99370 -22156 -191343 46684 -74078 5323
9645 -39055 7083 -423004 246513 168185 -48001 70 -17531 -56898 -48776 -36146 128501 63998
9632 111139 -291505 -70088 214191 36236 -219760 -101860 -324222 122305 73698 350394
9622 350394 -30156 44742 23011 223324 -11202 -32569 -476662 -139275 -116717 -58854 27047
9610 64319 25163 -187211 -177528 -120971 -80848 -53200 -148003 124589 -241356 -97451 -245954
9599 -245954 151742 -250449 -17078 82026 -340878 -221743 -297083 188308 -51659 -290597
9589 -290597 10314 -268363 -129155 -146309 -93798 -224994 63685 -359852 -186323 12497 -193438
9577 -111582 38719 -115943 -85108 -166111 60257 -289906 -221420 -213907 -224885 -110796 -139786
9566 -139786 297969 -192196 -16791 237498 137738 -69127 139280 87200 44504 83556 159800
9555 159800 7590 -131890 461008 186544 12378 298657 -130479 -166226 318678 -84098 -159171
9544 -159171 -60418 25284 -361099 -145534 -321498 -9304 87446 -87096 -161339 -39309 141032
9532 -17743 -131289 -99314 -140304 -94559 -88391 -174791 -202096 62390 -265291 -166492 -330088
9521 -330088 -366052 -158639 -262353 -202494 -86463 150223 19807 119178 112885 109019 -185298
9509 -113912 127217 -4301 -68885 -91708 146808 14542 -306946 -46082 44565 -135065 -151193
9498 -151193 -106575 189562 67644 -47740 -57311 -26358 55476 -186429 -139426 -295675 147531
9486 -227580 94475 -74550 -28848 -177122 10983 -303064 -77505 -265148 93910 -153352 -224490
9475 -224490 -164544 -57565 -9376 54766 -183064 -68192 71724 18356 -243815 62990 -57847
9463 -333185 101002 241779 26953 64886 -33173 210509 -95746 54889 5510 -40321 -188046
9452 -188046 -314108 -112793 -160023 -167207 30817 -81997 282115 -103935 -373953 -28273 -152412
9441 -152412 -66709 -235930 -264505 72074 342491 32230 -81857 165926 -162543 234544 -94732
9429 -23599 -10657 130184 -126250 -22124 247416 -91995 -58045 -219388 -332539 -52985 102651
9417 -227794 -81582 -35445 -142753 -325382 -105055 155163 -91793 -398902 -57204 -1083 -60765
9406 -60765 -166159 -155263 -143 186385 20903 -8506 -135943 -72017 9276 221261 51472 46595
9394 46595 34734 56766 -122404 -39477 147153 169976 63991 36730 -75265 159754 -67663
9382 83672 -20262 42229 643 -98543 -196728 -62772 -88654 -53458 -151215 285557 -20939 -159404
9370 -159404 -248760 38067 322944 -84378 -43225 198095 -84367 -224375 -178989 -402954 -145786
9358 7289 145933 85735 -187424 -93796 -284405 -261868 102889 -62091 -167271 -53545 253377
9346 -70168 -60490 -85080 -265344 129939 -146982 -115635 -195134 88180 -100262 125473 -171364
9334 -296017 -93086 -113533 -69111 8756 -101315 202651 267118 71096 191707 -141201 -82338
9323 -82338 -92626 -94736 132340 -413574 -21097 -438224 -99988 99038 -247177 5682 59785
9312 59785 -50320 -336038 19620 -35971 -19476 -63417 -68131 669 51823 -285088 -116999 21381
9299 -66801 -2319 36092 -80531 149083 193393 380175 69377 24906 -183644 238638 -58174
9287 199395 -196046 109864 -36507 474061 -139756 143547 -109166 -330755 95895 -335384
9276 -205858 -173176 -70387 70023 -79188 189533 -105498 -26225 -75519 -86313 -213880 145745
9264 54708 -334236 315356 -184306 -35008 150574 -128700 -175881 156829 -12037 126554
9253 -219851 99591 -121479 -104078 -207081 82777 -33999 122263 108552 -155961 -97770 13340
9241 -268248 -268628 -322756 39051 -334499 -59728 -115512 73321 -161024 11322 -370248 15091
9229 -40529 147745 -199799 -297962 -207343 122895 190669 33955 -371984 -216057 34174 33843
9218 33843 125314 165667 41846 -123365 -924 30013 -175114 169341 -277508 -422693 -20853
9206 -23995 97599 -275804 -69725 -69956 17120 56791 -58708 -31662 181922 -154181 -68366 -14510
9193 -55271 11334 22581 158882 -159258 203204 264548 -56078 243045 -127788 298271 -98523
9181 68901 -12941 169254 -199326 -148999 -177699 -151020 95287 -344454 -435606 80506 -202705
9169 19797 250306 -89456 191743 -137518 -1422 -62419 185302 -128951 -171860 -100496 -296886
9158 -296886 -101010 -34580 3714 -331207 279008 -334821 -9426 87968 -77601 -319496 -261005
9147 -261005 -269815 -109656 -48055 313842 31353 -21748 165279 339684 60383 217639 -165717
9135 -257581 -98437 -161865 -214426 -55650 -74031 190590 145745 -216978 -164298 80507 -319322
9123 27530 -42391 -264197 -89557 31684 -15017 132837 -38879 129405 157597 -348921 -191664
9112 -191664 -51862 -58025 104959 -48013 -273298 354472 -66150 -96180 -96159 -389260 -70674 -34500
9099 -264684 130550 68784 49010 216691 -19146 -233089 20797 48352 -51543 -289898 5500
9087 39814 16180 -382558 139554 -165465 -246344 -118405 -7023 209232 -149341 432342 45152
9075 -26503 -78112 -46407 -69356 167490 -296515 -137895 -902 -251832 -79522 -101397 -38320
9063 -48111 80278 -318485 -35068 -9192 146367 173560 170395 192281 50537 -152236 -36952 -117249
9051 -117249 -106236 -486538 -400805 269278 -89862 198553 64100 -162253 229531 146869 -436642
9039 228456 -31864 -108567 -257682 107723 -278618 -17438 -24332 -196754 -247652 -204353 -125528
9028 -125528 -142337 -62114 -107725 -150888 34152 -135528 105300 -344038 -124501 115346 77948
9017 77948 2288 -405864 -61990 317927 -3709 391636 -45951 10682 -161598 189696 -336655
9005 145264 194806 139777 100639 -333730 328157 -263767 -85262 -560403 -64422 -100241 134859
8993 -453573 33830 -50235 -394719 22971 -50747 -144453 -359882 69346 -185547 95339 -68539
8981 54301 -215326 -463370 120608 -395984 18847 -67607 -158965 10924 110851 -196837 -47510
8969 203692 -329845 -140641 26841 -83028 153646 56580 -233094 -78443 -171456 -387332 237807
8957 -157915 123508 200262 162078 -170176 225356 10540 -185316 52787 299577 -257127
8946 205899 102255 64544 -154778 -2350 -54796 76248 -125395 25396 121161 78748 326961
8935 326961 642707 428470 -2220 -96962 -299416 73346 13161 82835 382198 121482 975153
8924 975153 1491587 4861636 13437581 13375465 4867331 1668297 708599 513890 359036
8915 359036 -160712 -6304 -26644 -91825 -22408 265781 105259 124454 230427 -4444 166570
8903 -220786 -127131 77967 146294 -291512 -8388 55479 -95364 -254868 -10724 -223795 -381704
8892 -381704 -184273 -292602 229633 -284802 -88808 -279860 -47612 221949 107720 -152115
8881 -65307 -265082 -42965 -128804 -432837 179114 -83937 202605 -102561 -36428 -10663 -127706
8870 -127706 52379 139303 -239076 -208867 -89094 31869 -27243 -125682 54173 -181519 20344
8858 -180237 -48070 -120450 344193 -306968 -61205 -85465 -141807 299067 91746 257181 -311073
8846 -234322 -254678 -137653 149496 -57279 -161378 3102 20805 199491 40961 36274 -146235
8834 -182373 -263089 138058 -28812 -288266 237639 303128 -144391 1998 -333412 -6695 11196
8822 119173 57457 -94447 -4545 171409 -230980 -293890 -226765 343107 -43270 134214 153603
8811 153603 -238187 96314 -217108 31813 -50115 -185074 175838 119145 11241 -149660 -71753
8799 355161 -370000 -31074 -213339 38412 69918 294181 -54874 -64958 50498 242529 -134123
8787 -13152 -3527 18885 -177094 216051 9486 -23821 47289 -334279 152880 -117153 88154
8775 63067 -491869 -34673 62545 -227278 -139406 -142952 -394324 3574 -155180 -39632 126262
8763 8557 221021 180928 89272 21285 97383 -91958 -84047 -162101 -69410 -117159 150811 -84198
8750 42334 75934 -97571 -39388 -174169 -107750 -370853 70400 79860 -60300 3567 -106763 373704
8737 20703 42021 -58054 -255140 -296489 -82773 118397 -95494 64059 86173 -265370 -172578
8726 -172578 -106588 -93626 205065 -118221 -130116 6834 -81231 207220 -63148 -341857 162705
8714 -119779 136175 -294270 -67171 -77690 -108171 303042 16338 -121063 190065 -17988 -148093
8703 -148093 -177203 -172508 108841 -118429 -212060 -291611 137213 -271875 13240 -43120 -286294
8692 -286294 7280 -117957 -309673 -55957 -202790 64851 -17015 326040 55711 -226262 -56392
8680 20832 -80099 -219403 -87542 27863 98690 -150755 -75158 -186447 270491 -87999 -145929
8669 -145929 249792 -160412 -72278 -187312 -109519 -119796 28374 45208 -44050 252701 19932
8657 184970 -391770 -234809 -86367 -48406 -139298 44245 205453 -176339 129005 214502 74315
8645 1081 -91827 20506 213912 80990 -46621 -56555 240496 6105 -187982 28282 228690 204521
8633 204521 -220890 -353666 168475 43075 -156941 -251947 69088 322847 92029 -196798
8622 -116641 9242 -652783 81479 100931 129949 -75265 66042 56464 53022 20244 -128371 -334205
8610 -334205 -187864 -13281 -54777 53842 -287393 137810 -223962 86106 139833 118288 -136570
8598 -442560 268195 -255234 19959 -177865 -107916 99758 -178438 -237650 5536 -122684 61677
8586 8210 -55626 -28193 141655 -85932 196532 -155209 -112422 -108751 -235432 -173524 -56814
8574 -13272 -251019 264581 -129103 170747 -184599 123075 87642 127646 -34123 25412 40528
8563 40528 -56974 -17545 181230 -80823 -3292 25826 36100 -137261 80264 -98523 137514
8551 -63749 -184364 36096 -85573 -32643 -94674 -170610 174384 -43057 -346387 200017 314231
8540 314231 -101447 -240854 25175 -184176 -72273 267960 -95638 -171824 -79927 8949 -154498
8528 -246508 -186278 -201083 -104380 -143542 157339 -236100 29571 -73875 -161141 -331220 -276181
8517 -276181 79287 -524189 563 -249591 -125628 13518 -138743 -71783 -132822 -471679 -65927
8505 -126153 -100914 -115631 -112790 -252313 313223 15072 -125915 13619 107920 -146451 -223622
8494 -223622 -234999 28710 141386 81820 -77239 -13433 37803 -261272 345717 -208282 -176331
8483 -176331 138468 -86627 -98580 -270496 -208405 98277 7560 51872 27977 -476741 108569
8471 -198417 20372 -270836 71359 -197916 -42486 -132579 142730 -327390 33299 -207679 80290
8459 118144 -30078 -187624 149082 -705 -233683 -10289 -107715 222955 -92470 -108844 -64155
8448 -64155 60559 -183063 103277 -150397 -210374 91075 126106 184841 3782 -85461 139935
8436 -54724 123509 -115622 301991 -57524 150280 -355035 -73259 -74781 -15462 110604 49248
8424 169961 51073 137121 -345870 -69916 -52398 353098 -277847 -5780 -3859 113218 171944
8413 171944 -180848 -129381 141791 23991 -13549 8288 -158251 -130417 249215 4304 150455
8402 150455 -39678 -304981 157336 -96497 56006 -221516 58057 234976 -55909 -117378 -158202
8391 -158202 293986 -40323 -139499 34968 249647 -238427 133634 -22564 313605 -176756
8380 56149 -16868 39223 -2320 36052 -87468 130127 -184084 -203147 92823 -360054 48350
8368 126145 -27748 -180435 -24394 -7760 78987 -65974 -106179 -263795 -51198 308188 -39665
8356 -11385 24910 36370 -153047 33634 -283531 -48000 -346490 -127108 -209858 -100767 -53425
8345 -53425 -316375 -56543 182417 211338 -381236 233721 -71133 -329029 266161 135686
8335 135686 -23111 -168911 -164411 -36355 -146015 26388 -145725 -467 289924 215859 -46984
8323 -213438 96510 188963 -148331 79823 -132758 -208948 -61362 -340140 -5967 150888 45260
8311 -20575 276196 -53637 -330504 -187338 -155832 4828 -63101 230439 35044 107504 1297
8299 44991 -39456 -249057 42774 -98730 461712 153258 208795 124691 127571 -87309 95120
8287 183293 212596 -211267 22698 236954 14470 -173866 -130533 -227836 -400839 -143681 -30680
8275 -38933 91556 -61770 -47658 277392 -179777 54247 -131843 -63867 -113598 48722 6994
8263 -177037 -13283 -4759 -209386 -174799 -138505 -137734 -85630 29618 123764 175119 409 -330292
8250 -19293 -252277 43331 -266882 -114716 -128688 -184516 -174371 59576 -6432 10657 78974
8239 78974 223049 56545 -120777 -198383 -125045 -16430 173643 -70473 203611 -158129 27791
8227 92302 -10243 -68988 -233474 -314171 160242 23167 43247 151816 112751 210143 -211827
8215 -246013 47049 -53637 82149 33947 -14929 73262 -35010 -177901 -97044 -222205 19138
8203 91468 -326879 234313 23002 -43709 91006 -72208 -157283 -86178 -23228 -1788 -63313 -79241
8191 -79241 30383 24702 -69367 346901 29260 -28773 -108832 120439 -17077 -55974 -283137
8180 -283137 241350 48208 -76667 -35459 -67633 298282 175793 30951 -24997 16622 -16656
8168 77945 68616 -263229 5450 -256599 -451720 -134077 -136554 -212281 51102 83421 175800 -349146
8155 -233178 83102 -368169 -293080 -231542 -2520 271090 -312178 -103154 128009 -228420 -282250
8144 -282250 60128 247652 212611 116328 -67412 317936 -314748 16561 -115180 229164 129287
8133 129287 178034 50743 -231904 172087 49692 -1134 103281 -12247 -371122 -139959 -47182
8121 -207012 -258815 36206 -216746 71441 28174 -291766 -280944 -287363 -398890 -116404 98334
8109 -197584 -64722 -117406 86581 37810 -17296 114271 -84183 75970 356515 82691 265908
8098 265908 -29490 145964 -203950 41578 -61262 -247852 157025 -173297 180059 112532
8088 112532 8251 32685 -80459 -175749 -95575 -80237 -97180 288360 223390 -224056 113986
8076 -197528 -239806 -79960 -153844 -78849 -113327 17597 -215020 152308 87587 -78189 -82190
8065 -82190 -226417 81067 34987 115392 -116185 -17297 -318127 86326 -356782 -49956 -355529
8054 -355529 -301879 -184057 107488 95085 -56146 18043 -267748 -226316 -19071 33462 66158
8043 66158 -54757 205605 -224227 13986 -56932 178873 -210109 -18621 -129153 45348 -95361
8031 310758 -13838 -124710 -2312 217785 -310375 -188123 -2477 30263 -13404 -47336 -39989
8020 -39989 12321 -133414 196411 17845 17594 175893 -116090 -7933 70025 53331 -144856
8008 192341 144966 -369193 137446 92379 362001 -169324 -192806 -340566 -14165 -212307
7998 -212307 102705 -151119 40714 -178446 -132515 14596 -10995 10649 22599 -193357 16760
7986 -43822 108045 72479 -191392 125099 128414 128646 12237 -163569 20481 -251020 -109039
7974 966 -216246 -255208 -310171 97133 -128878 -189335 210715 -135426 42867 145772 -20464
7962 45277 -269781 -328003 -180592 -190987 -96877 -304173 -190197 -285538 295658 7669 8031
7951 8031 149440 143814 93721 99023 100485 75250 -174249 172995 -12478 -131425 122827 223000
7939 223000 -253657 74964 -56803 86321 -3044 31225 -63115 44399 71225 222293 -51184
7927 -168713 177906 49005 81063 25012 112419 -256456 132818 235592 -114126 -251402
7917 -251402 317137 230749 389345 55586 216279 38899 16608 124477 -65460 -65672 -5675
7905 -1175 69723 52758 12443 -55771 -172222 115194 80935 -97800 299408 -309733 60827
7893 -31464 -426761 267327 -13216 -181140 -81741 85222 208399 -116252 33214 238060 -27379
7881 -67148 204277 -69005 -117559 -98957 -195307 -189259 -284875 142072 -18326 16838 -142915
7869 -306251 244707 -290430 -322508 -49274 163732 -42657 -169079 -18623 248064 294476 50669
7857 -43853 259576 26541 105342 3930 -83165 -137771 37264 -22228 44570 -195580 -165963 -25675
7844 -85672 122900 180969 16961 191661 -139509 24193 -63835 -288657 -51194 -2109 -33174
7833 -33174 15237 122465 157306 52184 137670 -446628 -188728 83515 -21053 -5818 171990
7821 -88055 -32430 -100716 -187672 138355 118199 213203 267808 -97342 -238320 -44158 -277683
7810 -277683 -50555 105827 -99575 26778 430569 39441 -46519 155785 208553 104174 -223460
7798 -10114 -240620 -28619 -99958 79251 -216694 -226383 3148 -207768 -211735 -166752 231797 -19643
7785 136224 90693 65856 67244 436426 -196870 182097 45148 -21727 -146997 -235477 -30926
7773 176036 75059 166527 -176042 63514 -59790 61140 -14358 -32532 2398 -89313 -76828 93472
7760 -52436 -199212 -249944 -123720 -89170 -24313 112181 254631 -120278 -259098 162069
7749 88318 -265750 -40505 -83371 164553 157805 233274 166811 370393 -117414 -179700 209973
7737 -457063 23272 -28820 -4327 -269043 176679 1802 -16495 -201929 -340465 -20910 5216
7725 -88572 275405 37802 117752 219218 -322205 102130 -171346 184823 83681 -227403
7714 -4464 329447 -117640 -211227 -318591 152741 -305683 108058 103904 -62628 -96886 -214063
7703 -214063 83036 221397 -205653 -119305 10256 72206 -65592 642 366285 -120232 56935
7691 -85913 -111623 186989 -152206 -182119 -134982 11098 119288 -39102 188566 62274 -170068
7679 68150 -181310 -58623 -18949 -19420 -231234 -65260 -11833 -286859 -73547 157431 61253
7667 -78177 17934 -219030 -96280 43444 -446638 166277 29607 -12045 128505 -135566 -17872
7655 166816 -83169 -149710 -82896 153618 55134 -111535 151431 -77622 80271 -106773 -33956
7643 -20679 65636 102230 305841 -263340 -141307 17354 -174287 -165987 23036 -161509 -155872
7632 -155872 84977 28190 158959 35235 -17887 -115486 221176 -72863 41400 -351491 81807
7620 -164721 -192061 -23937 180305 -125740 -212714 174107 -154038 -70317 373412 8910 -185583
7608 -323072 110085 203996 115445 285661 -81815 -136921 99898 290357 183888 -138513 388586
7596 -115157 114825 284150 -4301 147987 -84008 -709 54958 78035 -165585 -162784 -14388 -2214
7583 -16834 83788 -61011 181792 -113146 159515 -235875 -245700 -84201 -2738 228225 -336854
7571 -77668 -100956 -91414 91816 17505 -117602 -180192 -133351 -145833 -112637 -327047 -92460 189455
7558 -11317 -213242 -18553 -163591 -115492 -86272 73794 454482 -370454 133561 112226 -168014
7546 -141735 -110606 -48671 90628 102883 322386 -44118 68858 147955 28824 -262705 79662
7534 121503 215779 -143595 -348026 -11032 -8281 -488890 -156649 -139602 218 -45838 -2720 -65218
7522 -65218 -68985 -390581 -40054 -86121 64944 -276559 -19088 74777 -496618 -18681 -81653
7511 -81653 -36048 89600 81985 -3811 -120736 -50913 -89891 10489 -416740 -139405 -217493 -13182
7498 -116718 -74232 -129571 174739 71162 11129 123816 194770 -202611 52338 11207 256886
7487 256886 -131829 -175104 78279 103220 32049 -263870 35184 218621 188507 -200349 85178
7475 52429 19888 -177069 -862 -34392 -370796 -121076 96632 -98448 -147678 57759 -234525
7463 77444 -204976 -307556 60089 70273 -167095 -93561 13791 -87988 94908 14039 299411
7452 299411 37041 -28774 -88423 267723 -63930 -84357 65332 144408 131427 168667 129557
7441 129557 -21779 91150 60173 -178158 -178674 -13486 358366 144073 -10992 158823 -16120
7429 145533 -50608 111794 203302 203795 -170376 209541 57131 -176295 -193735 155225 -89799
7417 121392 168395 -137881 113733 -91038 78650 -133438 138104 -252003 -160131 159132
7406 -239533 -106494 75298 157067 204290 -117613 231548 100707 123648 346625 -95408 -34311
7394 81765 -179549 115867 -27790 171699 184088 296734 -264641 -182739 -137040 53979 349444
7383 349444 416788 206242 -147574 16876 -175070 62845 17997 134728 -67295 -248586 -48108
7371 82782 19174 -81951 -242036 -112058 -76728 -32152 26097 -5574 -419315 -20241 -51747
7360 -51747 -173384 44694 -148697 -151448 29003 141559 -150449 3456 -113186 228348 213404
7349 213404 -3954 36636 -289354 -170826 -99050 -104832 -57228 -162802 91860 -97017 -178047
7338 -178047 -154337 -220681 3070 107988 58462 -268131 88895 39898 14538 -128593 -153348
7327 -153348 -78588 221956 167732 -50571 -230131 42665 143342 -45648 -258063 -67994 3948
7315 232891 18151 -42626 -363259 38673 -50021 -417493 -268903 192700 -248776 173 91846
7304 91846 56103 -131825 -190123 217635 139732 -120725 -128181 -285645 -53963 -495572 -85342
7292 -24663 247488 -118640 60885 -21385 -205781 -66058 488645 48967 -252599 57807 -176709
7280 77206 -117708 -25629 -230794 -318701 -146048 46837 -168665 -300125 109023 10031 193751
7269 193751 -479901 89538 -28829 -290241 21379 -9325 228794 -102146 125526 -37911 22377
7257 -381065 -96705 78202 -78116 -172436 -163687 6545 -43381 37922 -5860 134378 102931 -129854
7244 -117968 -101611 8741 1091 37286 110147 151687 -224872 19373 -90721 -104119 196650 -214399
7231 -149929 -88307 -17795 -122718 -28334 75613 36964 164199 -32009 -45765 -92137 -306756
7220 -306756 -138624 -46382 86484 -206461 -74096 209681 -66537 -224765 62249 69728 -205549
7208 100847 -31591 26319 -247818 -69097 426281 371641 -73081 168221 -209744 -72129 -77654
7197 -77654 105455 -89450 56707 134521 -177691 -227967 159184 -85871 251606 -122904 11802
7185 -463717 -189106 -25225 158112 -21002 6258 -331068 221692 -20770 -329253 -331934 57383
7173 175089 -24392 133219 -6778 250400 210878 32172 96230 68405 -197096 127485 -129213
7161 192374 15854 104271 34908 135533 -52014 59616 188211 -203105 83224 33301 -62221
7149 -55393 54907 -92840 -272816 -152014 93956 -46248 168929 -32992 297454 -20903 -21820
7138 -21820 -125605 286810 29401 49140 37392 -3599 -158930 -175131 -189617 141902 60108
7126 -50256 -100828 307024 171475 -211335 -171798 -3764 -285207 58335 41611 -195695 68597
7114 131590 431435 281120 197094 40228 -143805 -38989 -206154 -53026 -25511 192286 23084
7102 -225205 61432 44485 239523 -128941 67341 -147395 -15869 16936 144950 56886 149933
7091 149933 363377 -36402 -230983 -292856 98770 35647 -192538 -134496 1806 -247469 120905
7079 -52123 129582 965 -89913 -356221 -200618 -6448 -92205 -114470 111239 -128920 -233348
7068 -233348 31454 66705 -202639 34055 -226840 136808 -430882 50688 55244 226335 -322478
7056 -81950 -86821 -423950 -96325 46368 12216 47843 -112247 -15673 93217 -264917 -122832
7044 -32941 27423 -62830 -97743 43160 19127 -338670 46047 139769 244036 -185802 83945
7032 -87901 58856 -83982 -284403 -302325 65186 32130 -115855 -144663 -61471 -332232 258923
7020 164535 -49738 74060 24300 -162852 -137800 -155710 84791 233225 275428 29449 79226
7009 79226 -305551 -91727 -70214 -27756 -89739 237788 -122166 -239547 129406 -64560 -68985
6998 -68985 -228831 91378 75121 332798 -440201 -124247 -242395 -35840 229975 -274112
6987 144109 -17326 -129223 -65264 42832 234240 105533 -536331 -10748 -194261 58342 -34229
6975 -136648 -82288 -178911 -66125 -40559 135270 -171171 234576 -81673 288385 149746 243289
6964 243289 299317 -242571 -80336 318233 161676 224557 -194052 -110606 -54926 64824 -313236
6952 -202388 -31469 167165 -37691 -180491 -17993 -52957 255973 -358387 -437828 -106191 -257904
6941 -257904 118187 137109 203227 -78334 -190055 -206254 192941 133862 -187710 -127941 -71499
6930 -71499 -120265 35494 7416 -95170 -178710 -49409 -77057 -19405 -109334 -208800 -271447 240113
6917 -119331 -118700 155011 95587 121874 -82438 -128667 268978 -7195 286575 -224948 -230613 -36914
6904 345913 -219331 -208406 -262930 3813 69041 -39054 82697 -152527 51153 -101990 -239363
6893 -239363 -62447 -23221 51322 -142348 -65854 229543 -475183 62891 -139841 45228 -223132
6881 -132848 -128902 103716 198235 132374 -394514 -34793 275117 -281079 97842 55217 -286241
6869 13918 63151 -76779 234481 244145 -44899 -215613 -107022 -262087 51518 -47723 270509
6857 148 -42284 -144436 233884 -61320 -276997 12993 68670 39061 -179763 325447 317521
6846 317521 43764 131153 -349900 -108840 101695 4138 -104576 -77393 -6498 -89257 103434
6834 105008 226715 -12271 165963 64037 138779 11180 -301179 -108460 -189381 113018 41324
6822 46365 28468 -131978 88917 -7696 -37351 -84625 -37178 354316 -130 143220 -190807 166828
6809 -28594 92050 -86908 -100954 10983 -113934 -5121 -218242 290954 -51934 -13719 -146543
6798 -146543 -47809 -81952 -157758 -98778 -78054 -404811 -324001 70463 -291999 122829 251506
6787 251506 -159321 34350 -61510 7526 137946 13684 -278789 -295329 384017 -58274 -51797
6776 -51797 65101 112166 109314 -73163 356202 -84391 -9564 -49420 -144638 52598 -394765 107642
6763 337459 94279 133300 -69240 -189893 99845 125213 -76016 14811 268010 -78806 121137
6751 25903 -86772 -121864 -77221 -103345 -100049 -77916 24986 122499 -247355 -267885 -22430 -164509
6739 -164509 -267913 -27010 -14432 -173236 19888 62613 -126363 135706 -80963 -71556 147223
6727 -45969 -233056 -153555 -112619 -100776 -189294 -385117 413110 26871 31850 194118 23178
6715 48101 62346 110263 88873 -359352 -140337 -110566 48090 -297315 41276 -117364 139188
6703 -165662 151224 62261 -100140 280265 -93318 -6673 -295787 27683 205676 51699 -45666
6691 -284589 -21547 -72741 -133334 173995 259920 76230 -174593 -190790 193426 93505 -245402
6679 -139894 340659 -196737 128580 -158167 -277865 -155735 -194527 -132067 110080 113777
6669 113777 -257134 -45153 -37627 10022 -202899 93059 -311295 41590 92320 -96544 240311
6657 2970 290603 229732 11392 155131 3032 -141692 33197 -82927 235482 -146094 210100
6645 -3392 -110555 160251 -84693 -237732 132840 27794 158207 66964 358905 32894 -371300
6633 -8001 243441 242843 218194 -184052 95420 27065 -114359 -165793 14656 -207547 207600
6621 40344 46170 -24555 -106863 -70422 -77539 -115044 -61206 -130948 -11510 180599 137273 -165091
6608 115456 201781 54209 -269447 -255964 -42392 56870 -49220 26183 -46150 57234 -114962
6596 -48892 -36182 -131586 114229 -25383 46790 340802 75360 271710 -144161 -312565 -145094
6584 -42850 -54486 -60135 -41113 -161463 -53227 -181258 -275797 19662 111747 77131 77268 -2624
6571 -168066 -111611 65468 -93476 -320322 -160664 9020 52505 -166267 5754 -91377 79231
6559 -129206 -61748 152785 218943 -244339 -155785 -352873 17542 -87532 -137150 -103995 143480
6547 48371 194534 114590 -163666 -30675 -141660 -228356 110635 30792 -332020 -157675 -46411
6535 -251808 4940 -190534 113297 -69824 -171359 -54817 114165 -134797 -4203 -158410 262102
6523 -43496 -243978 341256 -231784 -110743 267001 2526 -247088 -67928 26228 55740 -82494
6511 -326631 -91319 36327 -20061 -17125 300302 -25002 192931 -303667 -283488 82468 220603
6500 220603 -383061 -213738 -78308 301890 -148687 -208888 -175460 -202072 -17289 167865 -192751
6488 92840 114377 -41979 -95761 -180083 -50345 -189873 92646 -106693 -2174 -256393 107276
6476 -61554 134740 -177027 -1988 -20673 -82053 -99415 -233031 83302 155328 105338 162308
6465 162308 220480 55129 -28657 449906 31283 8691 -134662 161259 130440 142935 69735
6453 -41384 -34921 -216474 -27351 331200 63865 222680 228346 160460 174377 237035 40644 67106
6441 67106 195546 -2110 -124619 -159132 19840 -24219 160256 19296 -245124 -440621 -185278
6429 178517 -188610 -73811 52388 -108616 -290785 51517 26823 -73380 -39510 -59045 88120
6417 -94680 -287407 273869 28281 162214 -52488 270022 22690 -9938 -151202 65752 -281178
6405 -114408 91475 99331 -198779 -131343 -151470 -65581 -14363 44518 91197 78569 -233580
6393 -19788 145648 -82069 200755 90535 115152 2377 9600 130121 -194406 -19825 146734
6381 139268 -143387 -5986 263753 122407 -373529 177154 -87189 5253 342230 -178561 -253780
6370 -253780 26578 190732 -27881 -111147 74442 120366 13705 -204601 -94538 -69905 126323
6358 -152965 -68919 -312916 -35182 -176775 -186617 -266940 47758 -85266 138627 107035 -77825
6346 -427084 57918 24807 47041 -38325 131237 31619 -198643 238187 50932 -229316 -118681
6335 -118681 -248405 131743 -30201 65700 -311256 -47264 -374867 -94590 -79875 -224772 -226490
6324 -226490 -344118 -96879 3402 -66805 55090 -30379 -333870 -59680 -46452 -441229 -273008
6313 -273008 -151362 -137739 95092 476501 31842 -50974 178718 -337226 -415963 -127151 108209
6301 -36311 -289140 450117 -181422 -257310 -218950 -6419 -83321 -70912 -51998 33930 -83614
6289 -46062 -234315 13719 -11171 135597 145717 60863 50732 82538 -262072 -36498 -19773
6278 -19773 -11456 165420 24094 219077 220051 18697 99883 -287510 -26117 -217482 -127533 -182651
6266 -182651 117730 -210328 395020 -312721 21284 212365 18105 -207530 -130746 196775
6255 9400 105163 -148539 38509 -175470 26620 111760 48236 208913 32618 415429 226298
6244 226298 -196441 -177882 -315355 115450 -146786 20135 -170091 -157291 36121 -1621 209057
6232 -301063 -91164 70720 110020 126034 -294497 190518 -243341 -156472 -177735 134302 -178208
6220 -19187 386897 -48553 -484550 48186 1093 158910 212194 -258898 121273 -34998 16142
6208 155125 -169423 -179943 27160 -16442 -72233 128116 -177904 180821 -432518 242549
6197 -289377 54897 24835 180239 -228848 73554 33518 125956 89805 -190240 24201 -162514
6185 147069 84343 -102604 -31856 -226145 44023 -118185 -168940 20068 -57888 -34341 289298
6173 107911 -183169 -157928 87227 49407 148147 85960 -20491 -241209 4986 -31655 -35813 34470
6160 65272 -29743 -234803 -25603 -67789 -223977 76661 133741 -433296 258003 -38672 4239
6148 -139005 -8129 363466 99785 108409 22880 -278309 9472 393888 -59696 12347 24562 -111022
6135 292328 97055 -332394 -2456 -184949 -214492 161294 -21324 -196589 128596 366935 -88393
6123 -164244 104362 -131921 96930 108519 -53918 -134142 -107600 231121 74363 260182 106795
6111 48563 -1705 -57394 105034 -101911 -336508 -112747 50818 224402 -64049 -288793 65480
6099 129042 76957 -136298 144406 53089 34933 -371696 -84620 -52795 -291130 40687 212781
6088 212781 131970 155131 158440 167308 -115686 -245050 -138107 -10699 129536 -8473 76191
6076 58446 -399524 -236354 216041 135352 -39446 -48054 32340 -194644 -173705 -67294 -18974
6064 -33989 75188 72121 -426808 9597 -29608 231713 232279 -337421 84937 184004 -190963 277524
6051 373644 -58986 -473112 -53355 138277 -97469 -229604 -7183 34188 162380 -117656 -268935
6040 -268935 86229 -142235 161430 83064 -26818 -87386 -46660 -55168 -369553 -251415 17826
6028 -203345 -259544 -363534 198767 199031 -238221 26250 97312 27880 201821 44634 -171915
6016 59035 -89673 408817 457051 -86011 -308598 -162697 -212456 -127244 -26656 -68349 68886
6004 -97421 380632 -51807 -128034 246947 30464 -373669 -132209 -12102 10463 162907 128192
5993 128192 66014 63291 96711 -263573 72418 362292 234974 -86258 330051 116800 -112075
5981 -44495 143988 114857 -237982 -76531 -128792 -173775 -193785 -88456 365471 -23797 -24089 -158871
5969 -158871 269695 -64540 54155 70081 -1557 -324108 10395 -121594 -72610 -129257 153578
5957 -262476 -8809 148753 -174670 -90610 -64398 -24709 285192 -186067 -43892 -136240 151208
5945 -128666 117148 198654 63881 -82498 -145640 -61418 38313 -102793 -73525 -86846 -14500
5933 174569 66159 103303 -199570 15524 110996 91131 9486 127228 -236352 101548 77063
5922 77063 161503 206166 43216 -265785 6832 191211 327980 -173646 19125 -134859 85102
5910 -341348 -73713 71388 134648 60859 102070 51533 -314634 -133021 53248 292201 -96068
5898 -8529 88702 244947 257305 215967 49228 -449958 -43269 -45650 -31531 255806 148341
5887 148341 78694 154519 45597 47222 164118 -105871 163821 47993 -161183 -32491 -76869
5876 -76869 -136697 348345 -284525 -210027 -68384 -188594 70171 82082 10449 -37390 -46467
5865 -46467 154334 2360 -37414 47683 -26110 33963 192305 96240 229025 -418022 175871
5853 26183 -119112 60317 -30010 91577 8459 -58216 54505 -54756 172459 -10000 -35701 169347
5840 -19291 -15451 27339 53301 6431 9676 -133489 25878 -92765 -119908 1746 -216660 -113968
5828 -113968 46233 76550 152460 -116905 -33431 118796 -47830 226431 112420 -123505 -463195
5817 -463195 -345105 -25225 -9214 -304409 -107714 27792 96022 -143811 204972 -69324 -58882
5806 -58882 -91176 25533 -4233 -53220 -117280 161315 -404939 -165338 -34328 142405 -163403
5794 -112645 7619 127470 -254088 -170533 32 339903 -19483 -79329 73456 -181716 58925 -111064
5781 149952 -76352 -200897 348688 -15990 140780 -133706 -145630 72967 -135356 58908 229031
5770 229031 -69288 345223 82577 -138531 157685 -98141 -91689 -98097 -29542 -1759 208569
5758 151733 249830 234289 79835 142666 110110 -197787 -21507 -217425 104778 6561 -112163
5746 -375524 16047 208346 273617 44826 -66255 52941 134663 -59548 64487 -87616 -38994
5734 -36917 157239 -138959 102369 -48122 -52218 -119030 -36527 146480 134580 103532 -343629
5722 180434 205588 -10608 -12947 -43139 5799 -99458 171155 -42653 -95543 -327467 88690 54836
5710 54836 69180 -109823 -33616 -466994 134167 -94249 -265340 -104832 -343243 -72352 220334
5698 27289 -142303 181965 37303 58905 179311 -174489 234592 -50431 1007 -364932 -130426
5686 -56724 66600 -28494 130475 276511 -198431 -61758 -35081 -113269 123654 66068 21251
5674 -37466 1703 285490 -197237 -123730 -100924 -239864 -28235 101543 352553 -60984 -73434
5663 -73434 138482 -168094 -92107 121125 -307324 281541 109716 155674 -40594 65227 328833
5652 328833 -78155 -23141 -104016 120727 -147925 -18887 -40463 -224773 33357 -43757 -19244
5640 239594 -182176 181300 8135 -60590 -20397 -208957 73651 -170206 31112 59483 360486
5629 360486 -103042 -264763 -252983 91107 -163510 96959 -59596 -86512 -81555 -271525 77768
5617 -33583 17997 -292759 -98885 70684 121777 210281 -310778 146026 259245 -73082 -152852
5606 -152852 207884 262943 -225994 -106529 56769 166834 -73420 -187583 -199725 68828 80255
5595 80255 -181290 -68229 80106 -10769 -61496 -146664 24740 -145691 -134420 -95329 83516
5583 148678 -110908 53696 -61330 -131154 -154103 90083 208182 110703 -45037 253219 200902
5572 200902 338737 -141051 335892 -29860 80547 161046 102020 36855 -30618 3683 36545
5561 36545 -110648 -388187 -124592 74285 -84659 -98371 27447 -132148 -355459 81312 280369
5550 280369 -108231 -115287 -325180 -49498 -189727 74275 -53868 138517 -2345 22881 87311
5539 87311 36799 113085 216752 -102032 -3049 212687 160711 36843 524349 -59958 -49688
5528 -49688 -252083 3857 56622 256403 -15278 -50476 322440 244051 238282 -45038 -54581 -80571
5516 -80571 42302 -23523 212471 -11805 -108255 48428 182458 -257010 279718 -114990 -118274
5505 -118274 53608 -27547 102284 -23485 -376645 -17002 108806 91175 6338 178806 -59082
5493 -334775 -187542 69059 -185950 -215836 -124567 125282 -89468 321569 3363 130422 -223688
5481 104862 -73229 -124816 -88452 7511 -299904 14768 -127330 -147999 5065 264019 95157
5469 -74559 -224666 -358938 -66152 -202710 -39619 239564 -156039 -109375 -46842 84975 -142749
5457 185809 -73736 66959 111846 78791 103857 102359 193089 103383 -58107 -74866 84001 -29783
5444 -18731 218176 -90896 40309 -102929 277140 178937 -67928 -88490 -217945 166490 21422
5432 224000 -9712 -14622 -51516 81766 -228299 -144522 -168406 -67477 259736 -25846 302579
5420 297675 29771 177089 -37063 110797 319008 -16055 -41153 188749 -333154 279871
5409 86733 171105 120599 -194664 152830 -29587 13810 8651 -68747 -207427 153441 -180438
5397 -86279 134562 -108562 -80308 232961 -86563 -170849 -216092 141775 34933 63900 67952
5386 67952 71093 271295 100471 -66313 148463 181245 -51512 -95901 191309 -364746 -143241
5374 120693 328890 -360257 62193 89755 -2490 72342 -199836 86123 -23025 209444 8708
5362 -156022 -421037 -90406 67617 271855 108266 128037 -90269 289859 8125 -141650 216483
5350 155336 -131183 -2837 -36681 -15826 -79942 49444 23429 38642 -133668 165241 206231
5339 206231 -46829 -67444 -208972 -227131 -119039 51025 -67528 78176 -124969 -141555 3769
5327 66696 -202433 154868 -49155 -86096 178224 147544 59618 -50378 27124 35555 107680
5316 107680 174234 -3393 223314 -26691 268248 102602 -140938 165334 208555 -74251 -185094
5305 -185094 -112959 -281932 177626 100462 -30916 -30789 -64042 148514 -92645 -189581 36911
5293 127142 -205532 -259205 -67587 122961 -394527 -67858 64154 15319 300581 252323 -113543
5281 4345 174397 -163247 224654 330940 -280212 37841 -199696 -68287 149761 380615
5271 380615 -76766 146065 266589 -171296 -104393 76828 -197792 37855 -71585 -81054 146552
5259 -198679 -96875 -126471 34712 106055 204180 9407 132929 -55412 401173 -90579 -131651
5248 -131651 -373116 394874 -148702 221555 -216716 -243337 33377 -17033 -117568 126112
5237 -332354 328225 -37899 23155 -6812 -89740 -182789 112383 -22611 71478 323951 100522
5225 -90923 -245565 -212099 284129 183001 268520 -112914 40125 687 -415310 25459 -74186
5213 168580 -163444 -190301 -18387 23233 334845 -39905 -253637 157175 -316141 401971
5202 -140696 -246890 278637 -173543 -194878 -316805 -19215 -88611 245370 -120025 101742
5191 58883 -139973 -69435 -146481 24428 51414 -25427 -296421 436231 3877 30660 47305
5180 47305 -183116 -31884 -258986 276472 -160382 -177437 57515 36630 156322 -13729 -99439
5169 -99439 153749 -10829 -147812 320119 -84484 -205400 194513 -60313 -156801 -191944 -187876
5158 -187876 309504 -114591 7862 141986 -5293 124370 326826 -121367 -118341 -61032 -62789
5147 -62789 75191 -220830 243919 58598 -243473 -199552 -178043 -145875 54072 -165237 -302391
5136 -302391 67663 -81821 156699 -6995 -23318 107022 172078 -97809 -413977 -91020 109691
5124 375 16181 75430 -37393 -215800 -128572 25392 -152563 -14421 18677 53015 -26244 5277
5111 313412 131733 117869 -38698 39268 -181826 92894 123695 74598 -137375 365417 -268329
5099 62740 370782 48611 -206808 71585 -147629 90707 193939 8963 369879 52525 -243160
5087 -241105 225950 95961 -173321 -223138 -149030 278468 134460 229282 -164103 -509799
5077 -509799 89570 -199748 -79572 -124346 242063 1837 -22748 308948 312767 56980 41536
5066 41536 107421 -37355 -4365 169429 -45321 -80178 230400 -100099 -132679 118826 9277
5054 144744 82307 192977 11055 98551 -233063 -397229 56704 -180491 237333 -150375
5043 4676 122609 58371 127824 441058 -63979 -70649 -18485 -67971 16002 -136106 19114 69798
5031 69798 -325502 129635 141646 -247971 -2666 373588 -369765 -68774 33235 -71569 -27637
5019 133525 102848 27764 21531 -136027 -148828 36291 210398 114356 43906 -158840 74545
5007 59214 -80047 -14346 52181 -384487 -112280 -46653 258084 31525 -2212 -87408 77928
4995 -103748 241948 385135 -4758 139992 84724 -72826 -12764 212087 129561 -255079 -109107
4983 107524 98235 201839 83007 -11224 -186253 -38121 64378 -98704 24595 -350383 145483
4971 -119636 197305 -345496 28269 -128465 -147709 154568 -87944 33551 163319 142210 126602
4960 126602 -34439 -124555 -130751 -105442 219 -217760 -296796 -109891 156656 -10700 108307
4948 32409 -156420 211607 20341 -57261 -349357 89483 26320 -126109 111827 37693 329775
4937 329775 -50480 450344 65585 -150954 73982 -66619 -28201 75776 171618 89180 288022
4926 288022 -274916 40454 -116214 75858 -226046 -221586 370686 39655 -120977 -212905 -102626
4914 358698 -42648 186627 22068 310548 -122215 -182445 40324 -27657 267969 -139398 361939
4902 106884 78493 99349 46306 -160974 48024 -284024 -52497 -167364 -329195 -36185 -124806
4891 -124806 199877 -191486 308177 84666 135874 -478844 56266 -36072 -268109 -274811 205165
4879 5185 -159019 -152800 -121190 -62519 114480 154832 -52092 273344 355494 -192209 -76640
4867 138647 105746 -123811 -13607 144695 72860 -124886 -27233 237396 275100 45651 84677
4856 84677 169919 60761 275671 -40301 -166179 -105588 -182764 -24566 11509 16349 180206
4845 180206 -66975 28568 -172318 -141638 49837 -192758 -54168 43795 -356759 249174 -40966
4833 403231 -115206 399345 155184 -165334 -66009 -45853 16129 58364 109063 133380 211628
4822 211628 115795 -115256 -65942 -80365 -288929 32329 -35963 -151885 67954 51776 30578
4811 30578 131792 -147416 -304350 48190 13429 -74522 43388 -171411 -67237 -221801 62804
4799 -209552 -26720 -19770 -42715 -34101 -179261 1382 -47531 -36487 239761 74372 -92427 232112
4786 -51396 157227 7332 294140 165504 -241769 180857 29915 222606 310105 110129 18458
4774 -117535 -10313 -396356 154700 137068 52669 -11684 -351500 191655 -316713 119285
4763 359662 139803 221402 164774 47149 -27431 -47016 160959 -89466 91536 -207974 -74621
4751 -491598 -153470 -37434 87453 154902 1055 101524 267417 -77237 -83044 -382324 66050
4739 -63052 -78852 36723 -82836 -125004 -180316 -155625 102255 214837 -160404 16947 -255500
4727 3255 -255525 62779 -65550 349 -68933 89120 -34472 -90621 79274 225503 94099 -177455
4714 -115137 -18105 115618 -145900 -135042 -63277 38002 42663 -219882 -177191 -34183 -58640
4703 -58640 96922 463617 -129860 21002 259993 19975 -63547 -9425 35698 -98497 -280507
4692 -280507 -193678 134636 -61721 175644 273176 124331 -250455 -129655 -47836 -117331 218038
4680 -72222 99693 -78541 144693 200401 -281656 -100728 1126 197914 206079 -57558 455871
4668 -58494 88084 -107093 -92757 16855 153570 -20732 63491 65784 -215472 -277032 -112711
4656 146375 38325 -109467 -111993 -114047 140691 -81839 301840 143208 109686 14094 -94766
4644 -203965 -37600 13600 -342710 35337 -257257 -46081 35156 -259927 13870 447180 164770
4632 -47386 267703 -218313 12597 33649 -137428 141195 46887 -29264 91468 -299504 -294950
4621 -294950 120235 -73304 37141 -183135 -178201 318608 -282834 120226 -28520 96833 -79232
4609 212951 -52282 166396 15107 -147063 57118 97638 -133752 190521 -70649 25582 -8162
4597 -179682 181084 -160354 -21282 -36394 -258396 436518 74134 71887 -203093 -152446 -17664
4585 -31565 331219 -70993 88353 -183785 66146 387456 11677 67335 90518 -28700 213966
4573 -181918 -301057 -378383 51873 -237520 -51860 -187797 328769 108642 -27618 -154943
4563 -154943 121010 -245540 62219 232842 -290142 149774 128547 -53640 -85543 127535
4552 18931 -53890 116984 57245 37629 -190206 106409 157182 89614 20133 207523 331892
4541 331892 429458 209208 46134 -195510 6638 94754 149368 168023 -29879 253071 -225248
4529 293173 -46930 -138659 -48841 -236588 -39267 -145455 211700 -182616 42260 91134 175545
4518 175545 215861 272723 247720 32022 -24365 240374 257384 -436236 -72315 331884 185773
4507 185773 205845 -66474 276641 -7284 -215208 338538 170936 -303884 -139196 -222421 177558
4495 270578 112705 84260 -122883 144504 71737 -410 98513 -195272 340835 -72911 -32307
4483 -69312 -158899 -18465 153029 56786 342978 22732 108316 -103876 -234005 -332832 -17580
4471 9081 -212994 -318255 -1252 -426433 44021 -94601 -177143 104696 180901 -189838 -546262
4460 -546262 -132889 136089 -180494 -258602 -2204 -143177 -17493 -6502 -34605 -56110 -59849
$$ [...]
##END NTUPLES=NMR SPECTRUM
##END=
