##TITLE=AC1769_ROS_13_9683968_4SsqNQdCp8
##JCAMPDX= 6.0         $$ Bruker NMR JCAMP-DX V2.0
##DATA TYPE= NMR SPECTRUM
##DATA CLASS= NTUPLES
##ORIGIN= BRUKER
##OWNER= Administrator
$$ 1.72 TOPSPIN		Version 2.1
$$ 2016-04-16 20:30:36.486 -0700  Administrator@X
$$ Compression mode = diff/dup
##.OBSERVE FREQUENCY= 400.02188249412
##.OBSERVE NUCLEUS= ^1H
##.ACQUISITION MODE= SIMULTANEOUS (DQD)
##.ACQUISITION SCHEME= undefined
##.AVERAGES= 64
##.DIGITISER RES= 22
##SPECTROMETER/DATA SYSTEM= spect
##.PULSE SEQUENCE= noesygpps1d.comp
##.SOLVENT NAME= COFFEE_meoh
##.SHIFT REFERENCE= INTERNAL, COFFEE_meoh, 1, 14.96096
##AUDIT TRAIL= $$ (NUMBER, WHEN, WHO, WHERE, PROCESS, VERSION, WHAT)
$$ ##TITLE= Audit trail, TOPSPIN		Version 2.1
$$ ##JCAMPDX= 5.01
$$ ##ORIGIN= Bruker BioSpin GmbH
$$ ##OWNER= Administrator
$$ $$ E:\/data/COFFEE/nmr/AC1769_ROS_13_9683968_4SsqNQdCp8/12/pdata/1/auditp.txt
$$ ##AUDIT TRAIL=  $$ (NUMBER, WHEN, WHO, WHERE, PROCESS, VERSION, WHAT)
(   1,<2016-04-16 20:30:31.283 -0700>,<Administrator>,<X>,<go>,<TOPSPIN 2.1>,
      <created by zg
	started at 2016-04-16 20:19:01.626 -0700,
	POWCHK enabled, PULCHK disabled,
       configuration hash MD5:
       21 0F 79 D6 B3 7B B4 F6 88 20 88 DB 03 48 BD 9F
       data hash MD5: 64K
       6D EF B3 B8 52 48 8F F9 83 CE F8 46 7A E0 5B 9A>)
(   2,<2016-04-16 20:30:34.439 -0700>,<Administrator>,<X>,<proc1d>,<TOPSPIN 2.1>,
      <Start of raw data processing
       efp LB = 0.3 FT_mod = 6 PKNL = 1 PHC0 = 0 PHC1 = 0 SI = 128K 
       data hash MD5: 128K
       0F D1 42 F9 5C 30 E1 4C 68 6E 77 1B 30 95 65 D9>)
(   3,<2016-04-16 20:30:35.283 -0700>,<Administrator>,<X>,<proc1d>,<TOPSPIN 2.1>,
      <pk PHC0 = -84.66064 PHC1 = 0 
       data hash MD5: 128K
       EA 6E 47 51 C8 67 A0 23 06 0F 5F 3A B3 61 D1 BB>)
(   4,<2016-04-16 20:30:35.673 -0700>,<Administrator>,<X>,<proc1d>,<TOPSPIN 2.1>,
      <abs ABSG = 1 
       data hash MD5: 128K
       70 5D C6 8F F0 F3 78 55 44 5B 8E DE 81 BC 36 AE>)
(   5,<2016-04-16 20:30:35.783 -0700>,<Administrator>,<X>,<proc1d>,<TOPSPIN 2.1>,
      <abs ABSG = 2 
       data hash MD5: 128K
       A6 29 7F 5F 88 03 D8 8D 50 2B 21 42 CC 4F A0 C0>)
(   6,<2016-04-16 20:30:35.861 -0700>,<Administrator>,<X>,<proc1d>,<TOPSPIN 2.1>,
      <abs ABSG = 3 
       data hash MD5: 128K
       CD FE 7B 04 21 D3 18 D4 FD 1E 27 27 59 8B EB B1>)
(   7,<2016-04-16 20:30:35.954 -0700>,<Administrator>,<X>,<proc1d>,<TOPSPIN 2.1>,
      <abs ABSG = 4 
       data hash MD5: 128K
       FB 4D C0 CB 29 27 C1 A4 59 6A F2 C1 47 DB FB 25>)
(   8,<2016-04-16 20:30:36.048 -0700>,<Administrator>,<X>,<proc1d>,<TOPSPIN 2.1>,
      <abs ABSG = 5 
       data hash MD5: 128K
       7E CE 1D F4 22 9A 3C 31 EE EC 76 BC 36 9C C9 67>)
$$ ##END=
$$ 
$$ $$ hash MD5
$$ $$ 08 9E 21 6E 63 C9 F3 AC 35 A8 0A D4 D9 81 A2 96
##$RELAX= 
##$RELAX= 
##$RELAX= 
##$RELAX= 
##$RELAX= 
##$RELAX= 
##$RELAX= 
##$RELAX= 
$$ Bruker specific parameters
$$ --------------------------
##$DU= <E:\>
##$EXPNO= 12
$$ [...]
##$TP07= 0
##$TPNAME0= <>
##$TPNAME1= <>
##$TPNAME2= <>
##$TPNAME3= <>
##$TPNAME4= <>
##$TPNAME5= <>
##$TPNAME6= <>
##$TPNAME7= <>
##$TPOAL= (0..7)
0.5 0.5 0.5 0.5 0.5 0.5 0.5 0.5
##$TPOFFS= (0..7)
0 0 0 0 0 0 0 0
##$TUNHIN= 0
##$TUNHOUT= 0
##$TUNXOUT= 0
##$USERA1= <user>
##$USERA2= <user>
##$USERA3= <user>
##$USERA4= <user>
##$USERA5= <user>
##$V9= 5
##$VALIST= <valist>
##$VCLIST= <CCCCCCCCCCCCCCC>
##$VD= 0
##$VDLIST= <DDDDDDDDDDDDDDD>
##$VPLIST= <PPPPPPPPPPPPPPP>
##$VTLIST= <TTTTTTTTTTTTTTT>
##$WBST= 2048
##$WBSW= 25
##$XGAIN= (0..3)
0 0 0 0
##$XL= 0
##$YL= 0
##$YMAX_a= 6122018
##$YMIN_a= -11532869
##$ZGOPTNS= <>
##$ZL1= 120
##$ZL2= 120
##$ZL3= 120
##$ZL4= 120
##$ABSF1= 14.96096
##$ABSF2= -5.597221
##$ABSG= 5
##$ABSL= 3
##$ALPHA= 0
##$AQORDER= 0
##$ASSFAC= 0
##$ASSFACI= 0
##$ASSFACX= 0
##$ASSWID= 0
##$AUNMP= <proc_prof1d_extract.lims>
##$AXLEFT= 0
##$AXNAME= <>
##$AXNUC= <1H>
##$AXRIGHT= 0
##$AXTYPE= 0
##$AXUNIT= <>
##$AZFE= 0.1
##$AZFW= 0.1
##$BCFW= 0
##$BC_mod= 0
##$BYTORDP= 0
##$COROFFS= 0
##$CY= 15
##$DATMOD= 1
##$DC= 0
##$DFILT= <>
##$DTYPP= 0
##$F1P= 0
##$F2P= 0
##$FCOR= 0.5
##$FTSIZE= 131072
##$FT_mod= 6
##$GAMMA= 0
##$GB= 0
##$INTBC= 1
##$INTSCL= 1
##$ISEN= 128
##$LB= 0.3
##$LEV0= 0
##$LPBIN= 0
##$MAXI= 10000
##$MC2= 0
##$MEAN= 0
##$ME_mod= 0
##$MI= 0
##$NCOEF= 0
##$NC_proc= -2
##$NLEV= 6
##$NOISF1= 0
##$NOISF2= 0
##$NSP= 0
##$NTH_PI= 0
##$NZP= 0
##$OFFSET= 14.96096
##$PC= 1
##$PHC0= -84.66064
##$PHC1= 0
##$PH_mod= 1
##$PKNL= yes
##$PPARMOD= 0
##$PPDIAG= 0
##$PPIPTYP= 0
##$PPMPNUM= 2147483647
##$PPRESOL= 1
##$PSCAL= 4
##$PSIGN= 0
##$PYNMP= <proc.py>
##$REVERSE= no
##$SF= 400.020009651439
##$SI= 131072
##$SIGF1= 0
##$SIGF2= 0
##$SINO= 400
##$SIOLD= 131072
##$SPECTYP= <>
##$SREGLST= <1H.CDCl3>
##$SSB= 0
##$STSI= 131072
##$STSR= 0
##$SW_p= 8223.68421052631
##$SYMM= 0
##$S_DEV= 0
##$TDeff= 65536
##$TDoff= 0
##$TI= <>
##$TILT= no
##$TM1= 0
##$TM2= 0
##$TOPLEV= 0
##$USERP1= <user>
##$USERP2= <user>
##$USERP3= <user>
##$USERP4= <user>
##$USERP5= <user>
##$WDW= 1
##$XDIM= 131072
##$YMAX_p= 380795496
##$YMIN_p= -11422
##$CURPLOT= <Network HP LaserJet P1505>
##$CURPRIN= <$Network HP LaserJet P1505>
##$DFORMAT= <normdp>
##$LAYOUT= <+/1D_H.xwp>
##$LFORMAT= <normlp>
##$PFORMAT= <normpl>
##$SURQMSG= 1
$$ End of Bruker specific parameters
$$ ---------------------------------
##NTUPLES= NMR SPECTRUM
##VAR_NAME=  FREQUENCY,     SPECTRUM/REAL,   SPECTRUM/IMAG
##SYMBOL=    X,             R,               I
##VAR_TYPE=  INDEPENDENT,   DEPENDENT,       DEPENDENT
##VAR_FORM=  AFFN,          ASDF,            ASDF
##VAR_DIM=   131072,        131072,          131072
##UNITS=     HZ,            ARBITRARY UNITS, ARBITRARY UNITS
##FACTOR=    0.0627417313425164, 1,          1
##FIRST=     8223.62146879497, 3533,         -58455
##LAST=      0,             5063,            -58139
##MIN=       0,             -11422,          0
##MAX=       8223.62146879497, 380795496,    0
$$ Real data points
##PAGE= N=1
##DATA TABLE= (X++(R..R)), XYDATA
$$ [...]
67906 86491 84698 82111 79958 79024 78814 78194 76741 75079 73951 73480 73454 73835 74671 75829 77104 78384
67890 78384 79531 80305 80619 80677 80623 80323 79783 79510 80002 80987 81605 81385 80644 79882 79202 78576 78286 78715 79814
67871 79814 81119 82291 83384 84531 85619 86391 86736 86711 86411 85951 85522 85264 85088 84759 84194 83531 82867 82061
67853 82061 80911 79469 78111 77291 77171 77345 76982 75464 73024 70643 69163 68627 68527 68524 68753 69533 70908
67836 70908 72430 73352 73244 72550 72240 72767 73591 74004 74041 74206 74601 74970 75402 76304 77619 78730 79423 80343
67818 80343 82158 84662 87046 88675 89248 88644 87108 85408 84308 83881 83608 83004 81878 80203 78133 76071
67802 76071 74299 72601 70642 68669 67358 66910 66794 66576 66576 67280 68379 68851 68080 66559 65328 64944 65164
67785 65164 65519 65836 66094 66048 65400 64315 63409 63074 63124 63316 63924 65286 66928 67717 67121 65943 65481 66152
67767 66152 67226 67796 67661 67253 67079 67447 68431 69822 71136 71947 72273 72507 72990 73804 74933 76294 77526
67750 77526 78052 77677 76960 76730 77242 77977 78211 77618 76459 75359 74801 74608 74086 72933 71774 71351 71364 70729
67732 70729 69041 67137 65975 65563 65382 65361 65859 66917 68044 68666 68476 67457 65884 64216 62672 61060
67716 61060 59293 57805 57045 56764 56333 55721 55568 56279 57556 58976 60522 62228 63684 64264 63672 62095
67700 62095 60007 58057 56859 56574 56803 57160 57777 58954 60461 61623 62124 62339 62672 62949 62781 62294 62065
67683 62065 62381 62967 63567 64358 65497 66553 66902 66596 66394 66825 67593 68064 68033 67759 67523 67498 67892 68891 70419
67664 70419 72130 73665 74820 75554 76016 76537 77424 78691 79983 80796 80859 80436 80182 80475 80912 80784 80065 79456
67646 79456 79282 78866 77431 75241 73367 72552 72782 73681 74692 75011 74143 72641 71632 71444 71301 70598 69794
67629 69794 69625 70039 70561 71256 72635 74724 76881 78561 79711 80373 80485 80281 80451 81504 83189 84826
67613 84826 86026 86798 87098 86674 85486 84017 82956 82628 82837 83179 83353 83185 82532 81353 79871 78513 77588
67596 77588 77050 76648 76282 76053 75948 75676 74998 74098 73326 72635 71619 70246 69128 68727 68612 67961 66675 65440
67578 65440 64722 64234 63590 62945 62656 62648 62491 61977 61385 61278 62125 63824 65525 66291 66115 65914 66297 66864 67087
67559 67087 67282 68078 69308 70249 70738 71222 71753 71752 70970 69947 69198 68585 67843 67207 67025 67086 66774 65765 64336
67540 64336 63133 62788 63483 64709 65600 65682 65146 64413 63742 63304 63242 63480 63804 64200 64718 64944 64186 62448 60675
67521 60675 59633 59067 58425 57912 58138 59024 59730 59571 58523 57003 55745 55636 56908 58527 59056 58225 57008
67504 57008 56114 55255 54176 53510 53915 54958 55667 55879 56255 57079 57884 58400 59090 60354 61702 62263 61853 61098
67486 61098 60607 60513 60794 61562 62813 64138 64976 65116 64789 64337 63855 63110 61822 60106 58613 57953 57905 57510
67468 57510 56233 54754 54250 54990 56057 56467 56156 55742 55688 55992 56430 56787 56875 56584 56012 55504 55500 56264 57657
67449 57657 59146 60168 60561 60571 60440 60091 59316 58227 57383 57396 58346 59641 60548 60898 61098 61466 61824 61930
67431 61930 61988 62412 63211 63963 64311 64192 63664 62878 62104 61492 60846 59970 59064 58333 57430 55939 54365 53894 54981
67412 54981 56846 58595 60132 61623 62796 63378 63632 63832 63603 62518 61064 60225 60212 60260 59695 58647 57639
67395 57639 56978 56689 56673 56763 56838 56905 56958 56933 56991 57582 58850 60152 60638 60185 59352 58545 57768 57151 57073 57617 58361
67374 58361 58908 59316 59817 60441 61050 61468 61477 60998 60344 59986 59950 59752 59146 58603 58826 59935 61386 62603 63488
67355 63488 64286 65040 65275 64423 62628 60876 60071 60111 60145 59565 58407 56993 55709 55121 55667 57011 58145
67338 58145 58373 57939 57513 57443 57684 58101 58545 58902 59292 60022 61180 62508 63831 65302 66995 68548 69487
67321 69487 69717 69441 68830 68025 67232 66491 65517 64077 62424 61063 60245 59964 60281 61209 62325 62976 63002 62916
67303 62916 63198 63699 63974 64017 64341 65377 67062 69034 70995 72709 73813 73952 73203 72162 71424 71034 70656
67286 70656 70173 69920 70255 71093 71946 72292 71887 70862 69642 68689 68221 68184 68429 68838 69292 69704 70094 70522 70941
67267 70941 71256 71521 71892 72342 72636 72636 72466 72303 72191 72104 72008 71742 71051 69909 68671 67766 67355 67426 68025 69170
67247 69170 70622 71980 73042 73872 74499 74712 74292 73352 72316 71534 71035 70708 70598 70769 70928 70541 69499
67230 69499 68406 67902 67904 67866 67642 67626 68053 68594 68826 68743 68609 68556 68531 68480 68440 68517 68808 69180 69219 68682 67970 67753
67208 67753 68077 68302 68072 67850 68196 68915 69388 69449 69494 69874 70607 71560 72541 73229 73366 73072 72731 72588 72633 72839
67188 72839 73260 73904 74664 75399 75976 76325 76589 77040 77683 78091 77834 77013 76140 75654 75657 75935 76004 75413 74325 73612
67168 73612 73962 75043 75979 76467 76868 77275 77248 76707 76387 76915 77924 78633 79005 79691 80872 81859 82001 81568
67150 81568 81402 81956 83033 84239 85339 86113 86228 85497 84189 82935 82317 82523 83262 83996 84424 84801 85628
67133 85628 86939 88119 88636 88729 89083 89994 91203 92446 93681 94755 95327 95334 95128 94952 94654 94148 93810 94043
67115 94043 94721 95503 96460 97997 100133 102279 103760 104356 104326 104118 104115 104499 105276 106372 107578 108386 108178 106821
67097 106821 104963 103530 103030 103400 104259 105099 105439 105157 104603 104232 104246 104731 105829 107494 109277 110724 111823
67080 111823 112772 113497 113850 114108 114818 116152 117796 119460 121142 122908 124736 126587 128321 129609 130267 130657
67064 130657 131389 132617 133906 134751 134945 134559 133920 133521 133561 133695 133734 134354 136415 139559 142238 143372 143385 143372
67046 143372 143843 144656 145556 146320 146791 147303 148708 151458 154878 157819 159850 161439 163153 165136 167239 169175
67030 169175 170509 170911 170625 170500 171389 173485 176199 178655 180421 181822 183463 185498 187631 189753 192169
67015 192169 195049 198071 200888 203634 206610 209689 212388 214441 216025 217495 219093 220903 222928 225264
67001 225264 228166 231729 235529 238946 241880 244726 247584 250080 252226 254742 258010 261308 263780 265701
66987 265701 267989 270827 273708 276649 280306 284695 288854 292203 295448 299506 304111 308214 311489 314733
66973 314733 318764 323466 328044 331934 335286 338737 342903 348049 354065 360544 366860 372425 377144 381594
66959 381594 386551 392369 398943 406110 413763 421658 429512 437385 445617 454245 462764 470679 478085 485532
66945 485532 493456 501878 510552 519285 528156 537541 547842 559176 571293 583725 595949 607608 618813
66932 618813 630163 642178 654817 667767 681066 695017 709610 724526 739749 755582 771955
66921 771955 788341 804635 821555 839660 858451 876987 895106 913491 932767 953094 974491
66910 974491 996859 1019684 1042312 1064773 1087853 1112170 1137584 1163742 1190759 1218925 1247996
66899 1247996 1277232 1306191 1335146 1364678 1395065 1426205 1457906 1490055 1522475 1554869 1587082
66888 1587082 1619358 1652105 1685360 1718657 1751583 1784280 1817139 1850111 1882581 1913972 1944210
66877 1944210 1973577 2002333 2030582 2058207 2084740 2109520 2132276 2153445 2173589 2192503 2209203
66866 2209203 2222865 2233504 2241572 2247236 2250398 2251270 2250453 2248339 2244694 2238972 2230803 2220103 2207020
66853 2207020 2191989 2175547 2157767 2138076 2116014 2092010 2066954 2041137 2014138 1985787 1956602
66842 1956602 1927031 1896776 1865283 1832578 1799177 1765443 1731466 1697443 1663756 1630681 1598336
66831 1598336 1566736 1535591 1504224 1472206 1440024 1408685 1378568 1349083 1319538 1289899 1260547
66820 1260547 1231768 1203773 1176867 1151204 1126466 1102041 1077472 1052599 1027509 1002539 978187
66809 978187 954768 932252 910596 890033 870758 852390 834063 815126 795705 776572 758596
66798 758596 742159 726902 712013 696886 681580 666628 652558 639656 627916 616957 606049
66787 606049 594555 582423 570142 558224 546903 536244 526257 516795 507587 498503 489651 481125 472796
66774 472796 464527 456450 448787 441371 433580 424977 415999 407802 401178 395675 389964 383167 375659 368465
66760 368465 362168 356649 351645 347049 342618 337875 332600 327158 322037 317219 312320 307228 302236 297529
66746 297529 292909 288221 283772 280025 276961 274026 270769 267294 264041 261242 258779 256421 254060 251710
66732 251710 249400 247013 244162 240405 235803 231169 227483 224998 223169 221397 219515 217510 215237 212675
66718 212675 210064 207429 204354 200705 197306 195243 194522 194010 192775 190937 189066 187312 185479 183555 181735
66703 181735 180092 178498 176742 174627 172198 170011 168709 168105 167081 164831 161897 159484 158000 156806
66689 156806 155234 153274 151236 149338 147730 146518 145551 144544 143484 142597 141824 140739 139149 137402 135934
66674 135934 134819 133952 133332 132900 132401 131642 130625 129224 127119 124409 121977 120672 120284 119799 118688 117480
66658 117480 116963 117220 117668 117815 117693 117621 117668 117453 116566 115156 113869 113072 112431 111515 110543 110078 110122 110089 109660
66639 109660 109131 108747 108269 107508 106767 106374 106141 105752 105354 105189 104854 103592 101424 99393 98444 98435 98510 98161 97587
66620 97587 97185 97064 97097 97184 97299 97322 97042 96483 96111 96401 97086 97187 96061 94167 92450 91213 90157 89335
66602 89335 89312 90146 90917 90690 89522 88129 86970 86194 86043 86628 87433 87713 87418 87170 87325 87559 87456 86978
66584 86978 86181 84981 83481 82106 81128 80374 79705 79410 79773 80442 80684 80144 79106 78109 77564 77627 78069 78360
66566 78360 78142 77659 77449 77661 77950 78024 77945 77784 77303 76263 74921 73943 73750 74079 74272 73921 73147 72311 71670
66547 71670 71433 71901 73182 74755 75703 75619 75088 75045 75761 76658 76981 76396 75051 73401 72070 71644 72320 73727
66529 73727 75083 75614 74963 73374 71518 70053 69228 68782 68183 67117 65881 65197 65395 65873 65742 64949 64377
66512 64377 64655 65345 65622 65330 64908 64567 64125 63608 63488 64140 65354 66473 66863 66252 64875 63304 61993
66495 61993 61028 60372 60174 60561 61297 61963 62353 62394 61904 60847 59729 59210 59284 59309 58950 58635 58921 59796 60825
66476 60825 61701 62453 63291 64373 65536 66280 66293 65994 66206 67222 68532 69465 69730 69263 68080 66503 65121
66459 65121 64248 63700 63289 63187 63600 64440 65494 66550 67211 67043 66215 65525 65441 65564 65388 65110 65142 65279 65068
66440 65068 64705 64831 65529 66194 66484 66750 67366 68136 68608 68633 68436 68404 68926 70091 71433 72196 72014 71158 70068
66421 70068 68916 67708 66559 65622 64877 64180 63538 63180 63289 63633 63600 62786 61556 60773 60877 61446 61773 61608
66403 61608 61142 60600 60160 59982 59938 59516 58443 57258 56812 57255 57947 58300 58218 57751 56886 55843 55159 55252 56118
66384 56118 57467 58847 59681 59670 59307 59512 60571 61833 62592 62800 62644 61984 60741 59518 59224 60150 61808
66367 61808 63618 65294 66611 67317 67478 67563 67840 67872 66969 65151 63397 62755 63351 64441 65323 65889 66230 66127
66349 66127 65296 64016 63137 63382 64815 66942 69033 70301 70147 68517 66008 63477 61540 60385 59911 59944
66333 59944 60371 61129 62091 63055 63884 64556 65040 65276 65384 65598 65811 65481 64390 63237 62976 63617 64190 63975
66315 63975 63278 62852 62950 63183 63022 62227 60994 59734 58641 57570 56576 56303 57295 59022 60266 60523 60342
66298 60342 60184 59816 59256 59430 61108 63737 66050 67481 68244 68410 67798 66664 65605 64719 63573 62119
66282 62119 60919 60234 59608 58715 58082 58424 59630 60880 61628 62026 62481 63149 63952 64810 65654 66287 66390 65842
66264 65842 65021 64604 64941 65730 66482 67100 67723 68185 68129 67714 67673 68416 69374 69565 68620 67054 65642 64788 64373
66245 64373 63982 63353 62747 62787 63740 65089 66056 66438 66658 67046 67399 67342 66849 66259 65928 65967 66163 66123 65672 65215
66225 65215 65419 66355 67247 67363 66973 66954 67578 68203 68267 68094 68406 69376 70492 71184 71285 71007 70765 70875 71238
66206 71238 71423 71218 70878 70598 70106 69180 68306 68205 68867 69679 70499 71871 73996 76159 77567 78208 78499 78554
66188 78554 78330 78141 78397 78918 79032 78364 77198 76062 75198 74491 73724 72917 72477 72854 73924 74996 75614 76058
66170 76058 76726 77335 77221 76294 75188 74467 74146 74038 74161 74602 75277 75983 76521 76730 76583 76277 76086 76093 76212
66151 76212 76365 76407 76023 75112 74266 74378 75630 77195 78208 78701 79294 80198 80956 81124 80782 80235 79544 78682
66133 78682 78007 78104 78976 79745 79547 78621 78087 78617 79743 80656 81209 81839 82772 83754 84403 84516 84102 83398 82769
66114 82769 82359 81952 81388 80876 80673 80690 80771 81082 81765 82445 82587 82237 81900 81813 81903 82332 83339 84484 84861 84367
66094 84367 84121 85153 87175 89062 90166 90667 90953 91206 91485 91766 91892 91738 91388 91042 90800 90689 90710 90721
66076 90721 90485 89999 89602 89590 89874 90206 90510 90843 91192 91502 91751 91832 91571 91033 90650 90853 91674 92782 93716
66057 93716 94003 93389 92179 91146 90883 91379 92260 93140 93654 93600 93330 93616 94772 96204 97136 97403 97191 96469
66039 96469 95291 94351 94495 95704 97164 98347 99415 100481 101111 100920 100266 100015 100802 102622 104913 106841
66023 106841 107728 107478 106575 105671 105209 105302 105763 106183 106222 105877 105456 105353 105892 107153 108814 110397 111936 114026
66005 114026 116858 119622 121512 123028 125456 129060 132696 135463 137871 140903 144663 148621 152648 157039
65991 157039 161786 166543 171201 175806 179889 182524 183264 182676 181786 181220 180865 180064 178142 175109 171866 169350
65975 169350 167378 164743 160692 155933 151830 148865 146332 143482 140505 138224 137052 136490 135586 133788 131391
65960 131391 129219 127822 127004 126175 125181 124574 124934 126054 127036 127202 126715 126264 126374 127129 128385 130020 131977
65943 131977 134117 136065 137301 137658 137749 138486 140011 141464 142173 142718 144272 147113 150385 153266 155637 157554
65927 157554 158860 159717 160872 162811 165102 167118 169009 171354 174205 177232 180688 185342 191245 197255
65913 197255 202183 205980 209487 213399 217815 222514 227207 231568 235335 238428 240892 242839 244444 245826
65899 245826 246805 246993 246272 245015 243620 242080 240257 238309 236418 234161 230681 225683 219965 214702 210335
65884 210335 206385 202221 197705 193042 188239 183006 177206 171249 165879 161528 157934 154437 150624 146669
65870 146669 143100 140339 138504 137571 137520 138171 138968 139159 138345 136750 134842 132855 130834 129028 127902 127667
65854 127667 128041 128550 128868 128792 128135 126939 125741 125342 126232 128237 130674 132789 134154 134865 135434 136435 138132
65837 138132 140353 142602 144369 145458 146067 146459 146628 146520 146535 147443 149559 152286 154743 156783 159200 163071
65821 163071 169024 176795 185167 192586 198336 203074 207804 212438 215856 217385 217570 217269 216530 214814 211938
65806 211938 208341 204573 200929 197491 194169 190730 187019 183155 179368 175806 172700 170440 169014 167542
65792 167542 164930 161144 157377 154766 153391 152797 152983 154291 156561 159085 161495 164114 167240 170638 174175
65777 174175 178416 183960 190389 196659 202534 208812 215862 222705 228121 232058 235142 237109 236699 233196
65763 233196 227373 220619 213660 206392 198495 189981 181544 174581 170450 169331 170123 171641 173596 176232
65749 176232 179638 183892 189437 196741 205785 216329 228330 241552 255029 267638 279116 289871
65737 289871 299802 307990 313648 316765 317592 316038 311870 305115 296000 284830 272177 258891 245658
65724 245658 232721 220193 208361 197527 187776 179096 171466 164700 158445 152483 146830 141445 136211
65711 136211 131360 127546 125115 123568 122026 120115 118141 116614 115893 116066 116790 117363 117354 117155 117600 118946
65695 118946 120495 121240 120702 119166 117416 116390 116768 118533 120891 122851 124068 125081 126582 128536 130240
65680 130240 131339 132479 134617 137834 141292 144401 147643 152073 158317 166315 175737 186336 197966 210528
65666 210528 223842 237521 251095 264393 277634 290964 304084 316459 327733 337737 346290 353227
65654 353227 358480 361960 363565 363602 363025 362877 363523 364653 365928 367322 368877 370503 372081 373442 374150 373520
65638 373520 371012 366492 360086 351937 342115 330553 317039 301471 284302 266642 249822 234793
65626 234793 221812 210481 200065 189966 180065 170699 162348 155367 149894 145815 142752 140159 137576
65613 137576 134879 132361 130532 129639 129310 128793 127594 125822 123901 122195 120931 120198 119789 119289 118560 117947
65597 117947 117803 118008 118242 118487 118912 119459 120025 120903 122491 124502 126027 126579 126690 127219 128463 130188 132252
65580 132252 134859 138336 142945 148836 155930 163857 172211 181008 190852 202592 216595 232141 247619
65567 247619 261613 273904 285205 295960 305693 313593 319304 322901 324369 323491 320103 314176 305755
65554 305755 295167 283237 271011 259113 247547 236115 224779 213581 202506 191702 181771 173556
65542 173556 167510 163323 160205 157520 155104 153109 151692 150879 150601 150724 151096 151624 152270 152958 153543 153966
65526 153966 154351 154773 155015 154653 153443 151481 148989 146081 142827 139475 136459 134135 132475 131135 129885
65511 129885 128943 128749 129382 130346 130996 130991 130311 129093 127661 126511 125994 126038 126338 126659 126787 126436 125598 124852 124906
65492 124906 125830 127117 128501 130330 133053 136719 141098 145935 150926 155746 160309 164744 168929 172333
65478 172333 174560 175794 176463 176660 176205 175097 173547 171604 169038 165668 161617 157229 152872 148825 145194
65463 145194 141865 138628 135364 132129 129069 126283 123784 121549 119665 118343 117716 117664 117970 118595 119649
65448 119649 121108 122765 124440 126015 127244 127864 128019 128262 128917 129659 130034 130191 130803 132312 134586 137247
65432 137247 140024 142693 144978 146767 148316 150016 151920 153623 154631 154677 153618 151258 147618 143408 139795
65417 139795 137466 136075 134878 133638 132630 131989 131530 131196 131153 131379 131571 131630 131879 132672 134059 135908 138009
65400 138009 139942 141297 142268 143657 146026 149150 152510 155886 159205 162219 164800 167158 169314 170665
65386 170665 170657 169650 168483 167353 165768 163572 161329 159568 158245 157194 156577 156539 156773 156819 156585 156325 156281
65369 156281 156598 157410 158735 160318 161798 163058 164399 166366 169350 173199 177222 180796 184100 188129 193844
65354 193844 201344 209830 218260 226027 233206 240251 247413 254358 260404 265012 267940 269056 268329 266090
65340 266090 263007 259576 255786 251370 246200 240293 233633 226297 218697 211395 204636 198177 191690 185225
65326 185225 179201 174002 169679 165978 162596 159425 156659 154686 153731 153487 153183 152212 150702 149307 148415
65311 148415 147780 146998 146091 145384 144967 144540 143813 142828 141862 141154 140762 140623 140710 141133 142015 143317 144926 146952
65293 146952 149701 153166 156745 159726 161940 163708 165257 166501 167323 167686 167446 166459 165044 164018 163937 164410
65277 164410 164391 163177 161062 159010 157778 157279 156797 155770 154310 152872 151607 150293 148868 147687 147092
65262 147092 146957 146859 146561 146144 145753 145457 145377 145683 146361 147075 147421 147340 147117 146943 146597 145704 144209 142362 140299
65243 140299 137902 135229 132807 131281 130830 131070 131399 131345 130758 129882 129187 128931 129027 129388 130199 131555 133060
65226 133060 134140 134666 134948 135195 135354 135422 135474 135352 134751 133729 132810 132413 132444 132566 132536 132193 131414 130328 129351
65207 129351 128861 129009 129881 131464 133288 134501 134618 133998 133341 132955 132733 132577 132456 132261 131933 131680 131786 132250
65189 132250 132853 133416 133810 133881 133734 133886 134743 135994 136967 137558 138339 139663 141127 142167 142815 143495 144304 144807
65171 144807 144507 143361 141931 141176 141881 143954 146326 147855 148403 148866 150196 152606 155728 159222 162981
65156 162981 166979 171206 175711 180515 185463 190345 195129 199937 204858 209992 215717 222656 231288 241741
65142 241741 254008 268042 283402 299119 314304 328901 343521 358512 373399 387349 400008
65131 400008 411725 422961 433568 442718 449637 454317 457318 458779 457961 453990 446856 437470 426901
65118 426901 415812 404366 392240 378792 363712 347547 331312 315567 300246 285312 271035
65107 271035 257575 244826 232926 222415 213554 205843 198618 191779 185636 180353 175907 172309 169373
65094 169373 166518 163293 159996 157300 155352 153794 152630 152432 153444 154977 156110 156696 157333 158474 159919
65079 159919 161140 161780 161792 161319 160603 159897 159315 158746 158006 157099 156235 155601 155202 154965 154830 154669 154316 153887 153894
65060 153894 154691 155897 156793 157295 158084 159552 161110 161846 161630 161168 161167 161742 162491 162866 162575 161919 161577 161756
65042 161756 161732 160611 158439 156159 154531 153492 152552 151353 149749 147776 145743 144051 142771 141589 140225
65027 140225 138631 136761 134584 132443 130935 130127 129330 128015 126584 125760 125509 125245 125019 125775 128182 131638
65011 131638 134768 136639 137271 137306 137517 138446 140128 142127 144095 146211 148867 152030 155258 158293 161191
64996 161191 163798 165558 166145 166010 165973 166441 167262 168142 168847 169221 169433 170124 171877 174517 177319 179846 182131
64979 182131 184034 185089 185243 185114 185096 184677 183211 180990 178930 177308 175483 172939 170033 167506 165623
64964 165623 164069 162471 160802 159339 158286 157433 156229 154351 152101 150033 148263 146398 144202 142020
64950 142020 140486 139942 140223 140850 141380 141683 141881 141981 141736 141075 140449 140434 141028 141695 142030 142011 141640 140938 140439
64931 140439 141082 143170 145765 147544 148020 147617 146850 145980 145292 145094 145328 145599 145787 146258 147298 148602 149615
64914 149615 150168 150558 151120 151924 152861 153780 154541 155164 156001 157576 160092 163129 166008 168489 171045 174394
64898 174394 178821 183976 189289 194457 199513 204520 209357 213861 218104 222394 226913 231370 235083 237507
64884 237507 238724 239390 240131 240964 241419 241208 240556 239738 238500 236339 233345 230312 227794 225441 222593 219224
64868 219224 215886 212949 210498 208836 208418 209068 209836 209898 209212 207993 206038 203003 199058 194807 190669 186659
64852 186659 182619 178392 173911 169428 165487 162417 160025 157980 156260 154908 153719 152583 151847 151783 151962
64837 151962 151726 151100 150620 150427 150273 150329 151097 152373 153204 153212 153170 153785 154657 155097 155361 156275 157965 159768 161239
64818 161239 162542 163950 165635 167990 171438 175799 180432 185237 190944 198090 206232 214648 223401 233016
64804 233016 243207 252656 260268 266188 271200 275466 278261 278776 276728 272287 265966 258725 251661 245204
64790 245204 238868 232094 225109 218669 213276 209014 205865 203662 201896 200141 198586 197676 197320 197071 197037
64775 197037 197912 199946 202576 205288 208181 211406 214808 218606 223723 230773 239188 247964 256783 265651
64761 265651 273871 280384 285066 288836 292391 295565 298061 300081 301897 303351 304168 304396 304213 303583 302379
64746 302379 300660 298606 296355 293974 291375 288172 283892 278522 272622 266754 260978 255004 248669 242169
64732 242169 236019 230853 227006 224131 221449 218523 215644 213345 211788 210792 210167 209760 209361 208908 208742 209361
64716 209361 210941 213265 216076 219301 222893 226706 230555 234238 237368 239346 239699 238510 236470 234404
64702 234404 232664 230900 228452 225003 220906 216842 213179 209714 206104 202404 199044 196278 193912 191690
64688 191690 189737 188373 187582 187024 186528 186263 186357 186715 187385 188776 191247 194728 198956 203845 209365 215356
64672 215356 221856 229376 238408 248708 259476 270092 280243 289423 296932 302487 306309 308408 308225
64659 308225 305251 299693 292331 284019 275479 267186 259177 251211 243417 236505 231151 227423 225042 223862
64645 223862 223729 224223 225029 226427 228952 232609 236898 241652 247435 254925 264174 274632 285730 297323
64631 297323 309679 323058 337211 351216 363887 374326 382041 386701 388017 385883 380464 372120 361358
64618 361358 348832 335232 321173 307271 294162 282282 271719 262473 254735 248628 243819 239712
64606 239712 235987 232579 229246 225699 222286 220006 219499 220391 221908 223742 225917 228183 230175 232041 234329
64591 234329 237141 239896 242050 243622 244888 245971 247067 248659 251032 253712 255882 257400 259022 261474
64577 261474 264609 267706 270314 272461 274081 274732 274131 272762 271567 271008 270663 269855 268370 266289 263377
64562 263377 259122 253552 247571 242150 237307 232167 226014 219039 212072 205922 201042 197569 195370 194070
64548 194070 193230 192536 191807 190969 190161 189815 190354 191729 193393 194842 196062 197280 198359 198720 198002 196638
64532 196638 195552 195278 195533 195646 195230 194346 193263 192321 191873 191970 192093 191562 190399 189485 189560 190307 190792 190659
64514 190659 190441 190677 191255 191884 192768 194379 196758 199497 202354 205470 208969 212798 217091 222296 228606
64499 228606 235545 242465 249296 256438 264047 271798 279361 286656 293487 299297 303539 305999 306543 304802
64485 304802 300525 294144 286657 279017 271867 265706 260844 257065 253725 250433 247440 245191 243654 242265
64471 242265 240383 237662 234117 230073 226004 222277 219061 216500 214800 213984 213740 213768 214283 215900 218918
64456 218918 222824 226552 229207 230536 230811 230367 229308 227711 225995 224879 224846 225777 227198 228791 230527
64441 230527 232427 234428 236471 238609 240959 243682 247023 251290 256778 263755 272451 282969 295224 309026
64427 309026 324244 340917 359396 380544 405657 435975 472159 514267 562156 615774 675157
64416 675157 740210 810338 884111 959391 1034052 1106567 1175741 1240048 1297582 1346650 1386098
64405 1386098 1414971 1432245 1437208 1429994 1411614 1383448 1346659 1301872 1249340 1189580 1123897 1054149
64393 1054149 982054 908997 836502 766406 700266 638867 582596 532015 487727 449811 417786
64382 417786 391030 368852 350239 334075 319877 308001 298852 292094 286806 282198 277888 273578 268924
64369 268924 263832 258637 253772 249390 245420 241848 238691 235780 232845 229866 227077 224535 221967 219242
64355 219242 216763 215151 214697 215416 217396 220687 224891 229361 233931 239025 244916 251240 257430 263262 268643
64340 268643 273188 276371 277900 277600 275206 270742 265019 259259 254132 249557 245444 242149 239988 238659
64326 238659 237543 236393 235460 235037 235124 235526 236063 236599 236983 237042 236645 235814 234746 233684 232740 231889 231099 230370
64308 230370 229631 228722 227520 226024 224240 222057 219304 215973 212355 208881 205744 202670 199239 195526 192327
64293 192327 190491 190086 190368 190603 190678 190955 191779 193265 195288 197532 199777 202310 205870 210904 216962 223055
64277 223055 228511 233393 238260 243859 250866 259440 268900 278119 286353 293467 299430 303992 307112 309254
64263 309254 310858 311685 311127 309223 307009 305769 306033 307340 308742 309442 309093 307670 305145 301393 296407
64248 296407 290493 284064 277289 270047 262190 253736 244957 236492 229272 223958 220336 217557 215081 213165
64234 213165 212319 212623 213723 215172 216496 217188 217098 216721 216695 217006 217010 216270 215039 213819 212754 211633 210346
64217 210346 209134 208484 208722 209595 210297 210195 209555 209182 209193 208585 206424 203194 200423 199041 198626 198393 198370 199166
64199 199166 200904 202968 204830 206633 208757 211232 213961 217289 221852 227827 234811 242578 251585 262390
64185 262390 274810 287969 301063 313731 325812 337077 347181 355505 361046 362883 360932 355908
64173 355908 348464 338754 327100 314622 302632 291517 280677 269626 258751 248877 240442 233317
64161 233317 227216 221928 217275 213175 209839 207604 206405 205590 204542 203457 203218 204374 206496 208675 210463
64146 210463 212105 214041 216512 219601 223278 227272 231124 234432 236983 238644 239390 239448 239196 238847 238371 237669
64130 237669 236578 234814 232331 229758 228019 227314 226952 226407 226113 226841 228709 231336 234642 238904 244164
64115 244164 250145 256815 264471 273111 282155 290998 299628 308569 318329 328909 339617 349280 356865 362014
64101 362014 365038 366561 367365 368329 370090 372725 376024 379973 384684 389978 395424 400703 405406 408555 408994
64086 408994 406494 401957 396295 389616 381795 373247 364555 355665 346098 335880 325750 316426 308053 300433
64072 300433 293509 287465 282491 278466 274946 271639 268891 267378 267084 267002 266218 265013 264383 264664 265255 265614
64056 265614 265919 266602 267822 269655 272303 275706 279306 282624 285906 289794 294471 299525 304680 310333 317227
64041 317227 325742 335567 345980 356346 366411 376146 385401 393781 400887 406491 410360 412110 411486 408814
64027 408814 404999 400974 397227 393844 390818 388246 386320 385219 384996 385446 386136 386588 386438 385395 383201
64012 383201 379767 375336 370321 364941 359163 353038 346900 341048 335452 330062 325294 321825 319755 318329
63998 318329 316682 314585 312328 310167 308340 307344 307668 309186 311250 313455 315940 318859 322042 325398 329228
63983 329228 333796 338932 344403 350390 357128 364294 371328 378274 385788 394251 403408 413032 423431 434952
63969 434952 447355 460027 472664 485465 498845 513214 528910 546084 564712 584840 606714
63958 606714 630511 656214 683999 714537 748616 786661 829060 876865 931785 995516 1069517
63947 1069517 1155406 1255035 1369911 1500959 1649109 1815669 2001662 2206946 2430356 2670523
63937 2670523 2926012 3194577 3472694 3756048 4040248 4320743 4592116 4847866 5081162
63928 5081162 5285949 5457367 5591399 5684625 5734647 5740687 5703415 5624166 5504587 5347174
63918 5347174 5155874 4935949 4693305 4434051 4164317 3889972 3616182 3347182 3086403
63909 3086403 2836710 2600556 2379953 2176273 1990077 1821266 1669487 1534284 1414900
63900 1414900 1310258 1219335 1141295 1074918 1018143 968620 924724 885672 850722 818785 788995
63889 788995 761239 735765 712492 690974 670788 651665 633445 616316 601020 588344 578287
63878 578287 570036 562923 557133 553321 551840 552639 555638 560773 567735 576162 586212 598503 613252 629788
63864 629788 647254 665488 684770 704936 725330 745648 766125 786605 805992 823078 837611
63853 837611 850027 860403 868234 873154 875193 874255 869959 862292 852001 839873 825851 809245 789650
63840 789650 767379 743126 717634 691632 665670 639857 614047 588386 563411 539405 516014
63829 516014 492832 470195 448980 429648 411893 395344 380167 366691 354739 343724 333300
63818 333300 323591 314826 307071 300297 294382 289041 284051 279594 276071 273452 271185 268863 266623 264682
63804 264682 262837 260773 258603 256652 254867 252852 250452 247921 245465 242988 240363 237693 235192 232977
63790 232977 231076 229435 227855 226063 223895 221351 218513 215624 213219 211904 211795 212241 212243 211186 209195
63775 209195 206896 204845 203231 202091 201609 201897 202524 202730 202347 202103 202655 203626 204088 203798 203389 203415 203753 204026
63757 204026 204102 204048 204036 204435 205527 206919 207690 207391 206584 206127 206272 206809 207721 209157 210871 212209 212827 213117
63739 213117 213782 215087 216761 218586 220861 224006 227754 231095 233235 234371 235271 236401 237897 240076 243315
63724 243315 247445 251815 256053 260225 264243 267796 270970 274267 277780 280975 283559 285886 288101 289592
63710 289592 289764 288775 286925 284013 280018 275888 272754 270638 268726 266650 264712 263177 262189 262283 263948
63695 263948 266673 269248 271165 272984 275231 277789 280564 283805 287345 290322 292223 293610 295225 296874
63681 296874 297828 297978 297925 298076 298168 297723 296617 295226 294246 294300 295487 297316 299164 300745 302108 303372 304574
63664 304574 305614 306278 306446 306243 305717 304507 302241 299249 296293 293506 290221 286126 281943 278472 275460
63649 275460 272078 268159 264328 261122 258613 256820 255839 255552 255665 256165 257286 258945 260642 262069 263495
63634 263495 265414 268075 271487 275589 280219 285102 290016 294909 299833 304919 310367 316315 322703 329448
63620 329448 336697 344686 353375 362499 372017 382275 393724 406770 421918 439625 459762 481536
63608 481536 504296 528249 554086 581969 611103 640203 668067 693726 716337 735175 749686
63597 749686 759564 764902 766258 764433 760085 753612 745431 736208 726607 716773 706106 693627 678625
63584 678625 661053 641462 620611 599145 577539 556238 535735 516455 498607 482261 467631
63573 467631 455145 445098 437234 430882 425656 421909 420360 421237 423909 427363 430934 434622 438877 444210
63559 444210 450825 458414 466294 473961 481563 489724 498931 509258 520716 533631 548595 566284 587445
63546 587445 612718 642080 674600 709090 744795 780957 815822 846748 871489 888951 898692 900598
63534 900598 895609 886165 875058 863948 853347 843531 834568 825652 815448 803291 789376 773590
63522 773590 754935 732485 706370 677533 647114 616423 586800 558880 532323 506844 483151
63511 483151 462328 444528 428879 414544 401356 389524 379231 370541 363320 357182 351759 346900
63499 346900 342367 337663 332607 327902 324544 322723 321747 320951 320120 319127 317834 316577 316108 316807 318289 319975
63483 319975 321549 322732 323223 323275 323904 326035 329643 334008 338524 342834 346453 348835 349849 349917 349617 349295
63467 349295 348924 348088 346210 343019 338786 334028 329135 324424 320275 316881 314084 311778 310341 310297 311586
63452 311586 313575 315778 318193 320893 323718 326581 329776 333726 338573 344241 350735 358172 366571 375796
63438 375796 385704 396234 407405 419433 432893 448599 467082 488143 510927 534387 557565 579419
63426 579419 598734 614602 627118 637348 646505 655355 664520 675061 688300 705038 725225 748462
63414 748462 774536 803255 833890 865041 895154 923063 947929 968714 983943 992293 993554 988952
63402 988952 980430 969623 957457 944412 930820 916839 902266 886459 868441 847247 822414 794272
63390 794272 763801 732242 700763 670236 641131 613632 587972 564528 543503 524705 507853
63379 507853 492961 480214 469645 461231 455199 451824 450937 451996 454688 459076 465079 472234 480208 489234
63365 489234 499749 511815 525119 539379 554609 571221 590009 611763 636553 663590 691988
63354 691988 721532 752511 785040 818768 852877 885864 915501 939634 957231 968502 974063 974393
63342 974393 970080 962103 951576 939322 925833 911448 896467 881102 865256 848287 829203 807355
63330 807355 782903 756429 728354 699202 670211 642990 618387 596166 576019 558424 544217
63319 544217 533679 526336 521371 517910 515100 512114 507982 501444 491493 478364 463570 448650 434181
63306 434181 420270 407384 396056 386143 377130 369063 362538 357802 354497 352321 351269 351030 350732 349646
63292 349646 347768 345475 342892 339837 336138 331843 327365 323460 320695 318769 316740 314144 311544 309775
63278 309775 309021 308917 309152 309514 309600 308987 307733 306440 305847 306419 308074 310092 311571 312302 312948 314111 315575
63261 315575 316936 318588 321315 325042 328794 332027 335273 339155 343454 347604 351587 355875 360847 366762
63247 366762 373972 382542 391897 401432 411389 422549 435171 448932 463966 481168 501116 523332
63235 523332 547085 572435 599844 629151 659615 690848 722991 755920 788956 821554 853810
63224 853810 885963 917851 949175 980084 1011158 1042978 1075885 1109856 1144283 1178053 1210175
63213 1210175 1240197 1267687 1291575 1310494 1323710 1331148 1332326 1325840 1310420 1286334 1255398 1219582
63201 1219582 1179909 1136735 1090746 1043346 996106 950225 906634 866323 830098 798093 769915
63190 769915 745407 724912 708662 696369 687677 682644 681294 682927 686357 690724 695773 701553 708427
63177 708427 717188 728391 741357 754383 766195 776825 786972 797056 807101 816983 826260 834078
63165 834078 839716 843045 844161 842786 838433 830972 820649 807626 791890 773620 753353 731757 709383
63152 709383 686624 663787 641219 619452 599102 580545 563897 549301 536954 526673 517762 509598
63140 509598 502148 495637 490011 485046 480802 477570 475459 474351 474094 474428 474872 475087 475325 476185 477950 480425
63124 480425 483321 486497 489954 493936 498971 505362 512588 519550 525506 530536 535157 539779 544542 549372
63110 549372 554112 558694 563035 566689 568983 569884 570411 571605 573314 574581 575063 575234 575275 574673 573206 571486
63094 571486 570056 568624 566729 564709 563448 563476 564731 566789 568899 570191 570426 570364 570923 572278 574237 577121
63078 577121 581506 587164 593058 598607 604462 611747 620875 631273 642087 652946 664173 676319 689486
63065 689486 703304 717789 733997 753385 776485 802594 830814 861078 894084 930660 971495
63054 971495 1017155 1067863 1123232 1182467 1244978 1310740 1379981 1452559 1527728 1604546 1682419
63043 1682419 1761120 1840335 1919469 1998029 2075957 2153382 2230202 2306209 2381535 2456567 2531251
63032 2531251 2604697 2675545 2742472 2804073 2858271 2902139 2932563 2947201 2944922 2925439 2888760
63021 2888760 2835135 2765499 2681769 2586631 2483078 2374079 2262399 2150509 2040659 1935035
63011 1935035 1835665 1744082 1661234 1587770 1524213 1470641 1426364 1390195 1361104 1338628 1322776
63000 1322776 1313552 1310359 1311839 1316585 1324103 1334763 1348599 1364584 1381362 1398264 1415216 1432025
62988 1432025 1448447 1464683 1481046 1497030 1511308 1522675 1530541 1534526 1534295 1529888 1521409 1508064
62976 1508064 1488258 1461236 1428188 1391158 1351280 1308667 1263682 1217537 1171667 1127131 1084719
62965 1084719 1045090 1008507 974673 943019 913148 885066 859169 835906 815170 796134 777924
62954 777924 760356 743716 727992 712677 697329 681879 666372 650857 635589 620913 606792
62943 606792 592845 579064 566153 554787 544816 535522 526505 518020 510546 504301 499128 494636 490486
62930 490486 486690 483568 481314 479735 478514 477503 476556 475312 473484 471228 468947 466820 464781 462818
62916 462818 460934 458948 456783 454885 453813 453365 452578 450787 448222 445385 442391 439243 436310 434017 432360
62901 432360 431120 430265 429697 428908 427545 426098 425383 425354 425116 424238 423319 422966 422843 422262 421293 420689 420842 421323
62883 421323 421462 421071 420521 420314 420626 421202 421731 422339 423531 425501 427679 429174 429552 429030 428055 426933 425799
62866 425799 424756 424020 423923 424586 425539 425971 425539 424660 423806 422906 421846 421191 421743 423445 425337 426666 427516
62849 427516 428276 429056 429935 431249 433216 435488 437433 438709 439345 439497 439383 439280 439303 439278 439039 438689 438414 438230
62831 438230 438173 438521 439556 441197 443140 445206 447294 449191 450835 452651 455192 458411 461733 464912 468398
62816 468398 472699 477757 483156 488628 494059 499269 504141 508871 513799 519037 524463 530021 535849 542222
62802 542222 549512 558077 567945 578737 590142 602421 616211 631894 649324 668098 687839 708430
62790 708430 730409 755113 783958 817480 855481 898098 946100 999960 1059404 1124522 1196761
62779 1196761 1277962 1368547 1467378 1573334 1686181 1805754 1930968 2059994 2190741 2320608
62769 2320608 2446178 2563744 2670046 2762148 2836917 2891329 2923493 2933083 2920672 2886915 2832563
62758 2832563 2759144 2669384 2566783 2454633 2335498 2211637 2085697 1960552 1838453 1720755
62748 1720755 1608551 1503095 1405252 1314961 1231672 1155091 1085096 1021263 963052 910353 863307
62737 863307 821603 784434 751106 721232 694324 669765 647346 627411 610285 595806 583471
62726 583471 572710 563035 554280 546761 540786 536044 531969 528659 526782 526445 526908 527724 529410 532494 536645
62711 536645 541420 547344 555448 566079 578901 593802 610962 630212 651222 674391 700712 730572
62699 730572 763404 798753 836976 878507 923040 969955 1019054 1070277 1122909 1175597 1227113
62688 1227113 1276650 1323306 1365568 1401496 1429383 1448252 1457798 1457937 1448520 1429569 1401672 1365908
62676 1365908 1323485 1275679 1224001 1169993 1114820 1059414 1004996 952911 903790 857348 813315
62665 813315 772095 734175 699399 667331 637981 611558 587775 566047 546348 529235 514940
62654 514940 502990 492812 484226 477082 470878 465038 459300 453585 447749 441771 435970 430731 426129 422032
62640 422032 418522 415949 414556 414192 414386 414697 415061 415833 417382 419560 421694 423204 424094 424767 425493 426159
62624 426159 426418 426003 425017 424041 423803 424625 426297 428521 431267 434622 438594 443288 448933 455445 462275 469210
62608 469210 477032 486768 498365 510817 523680 537695 553626 571280 590280 611292 635668 664088
62596 664088 696280 732020 771756 816133 865441 919649 978372 1040554 1104603 1169089 1232915
62585 1232915 1294589 1351831 1402322 1444513 1477294 1499320 1509317 1506906 1492587 1467013 1430999 1386284
62573 1386284 1335515 1280980 1223718 1164236 1103743 1044175 987114 933132 882231 834585 790615
62562 790615 750461 713629 679380 647559 618909 594335 573837 556432 541058 527256 514926
62551 514926 503902 494060 485456 477950 470951 463961 457283 451736 447717 444885 442666 440642 438532 436253
62537 436253 434109 432495 431389 430550 430160 430682 431919 432878 432921 432510 432406 432699 433236 434529 437407 441994 447814
62520 447814 454913 464069 475718 489392 504570 521563 541089 563353 587962 614562 643088 673403
62508 673403 704969 736984 768717 799744 829843 858561 884884 907547 925726 939251 948092 951988
62496 951988 950876 945511 937338 927760 917625 907379 897536 889028 883157 881133 883547 890405 901694
62483 901694 917720 938725 964414 994143 1027507 1064400 1104400 1146265 1188061 1227657 1263074
62472 1263074 1292603 1314865 1328948 1334499 1331544 1320088 1299924 1270985 1233911 1190106 1141178 1088433
62460 1088433 1032944 975953 919091 864271 813178 766529 723839 684321 648135 616389 589797
62449 589797 567884 549807 535377 524638 516884 510869 505907 502116 499624 498219 497893 498996 501535
62436 501535 504811 508087 511233 514409 517449 519889 521361 521682 520756 518674 515690 511846 506843 500553 493449
62421 493449 486198 478972 471503 463747 456104 448974 442422 436364 430777 425549 420309 414783 409374 405121
62407 405121 402754 401776 400797 398860 396205 393550 391051 388458 386000 384377 383786 383612 383329 383169 383559 384468
62391 384468 385760 387777 390937 394999 399222 403121 406604 409556 411892 414044 416817 420620 425201 430246
62377 430246 435872 442323 449464 456807 463950 470899 478078 486054 495070 504806 514703 524480 534329 544760
62363 544760 556528 570541 587462 607373 630075 655705 684815 717890 755038 796157 841004
62352 841004 889038 939393 991043 1042708 1092690 1139140 1180578 1215927 1244171 1264507 1276880
62341 1276880 1281902 1280084 1271538 1256525 1235757 1209920 1179542 1145659 1110060 1074301 1038838 1003671
62329 1003671 969465 937293 907455 879314 852402 827059 803786 782500 762726 744148 726636
62318 726636 709928 693546 676973 659868 642276 624674 607577 591027 574704 558643 543558
62307 543558 530299 519200 510130 502900 497297 492835 488864 485039 481495 478488 476036 473998 472353 471263
62293 471263 470896 471334 472610 474585 476714 478180 478640 478809 479969 482664 486115 489128 491399 493598 496281
62278 496281 499168 501609 503471 505294 507708 510905 514632 518534 522446 526435 530684 535405 540852 547376
62264 547376 555418 565532 578348 594319 613377 635043 659091 686019 716680 751627 791035 835041
62252 835041 883619 936021 990732 1046104 1100779 1153424 1202442 1246231 1283509 1313229 1334457
62241 1334457 1346601 1349696 1344323 1331440 1312243 1287730 1258146 1223267 1183635 1141160 1098052 1055411
62229 1055411 1013369 972365 933554 898004 866133 838032 813647 792312 772724 753941 736086
62218 736086 719721 704799 690679 676982 663868 651394 639086 626389 613399 600920 589795
62207 589795 580239 571841 564182 557311 551560 547004 543367 540362 537837 535596 533528 532132 532487 535287
62193 535287 540081 545843 552120 559199 567280 576016 585005 594226 603753 613317 622532 631399 640279 649405
62179 649405 658590 667441 675692 683267 690100 696041 701017 705292 709514 714426 720607 728559 738956 752630
62165 752630 770239 792076 818151 848235 881710 917604 954990 993247 1031663 1068733 1102173
62154 1102173 1129948 1151321 1166778 1176913 1181625 1180515 1173797 1162390 1147030 1127643 1103801 1075643
62142 1075643 1044126 1010588 976439 943125 911879 883251 857193 833819 813834 797895 785637
62131 785637 775737 767062 759477 753443 749091 746057 744069 743264 743714 745034 746794 749178 752832 758065 764526
62116 764526 771714 779425 787534 795666 803313 810001 815104 817894 818199 816768 814532 811627 807694 802962
62102 802962 798322 794209 790084 785346 780202 775258 770757 766809 764021 763156 764171 766215 768659 771624
62088 771624 775330 779483 783652 787924 792623 797494 801690 804718 807059 809646 812989 817125 822220 828691
62074 828691 836586 845314 854373 864116 875341 888196 901919 915728 929567 943819 958751 974630
62062 974630 992111 1011962 1034302 1058367 1083073 1107547 1131029 1152526 1170918 1185426 1195773
62051 1195773 1201743 1202680 1197706 1186567 1170108 1149678 1126066 1099178 1068692 1034830 998449 960607
62039 960607 922139 883499 844953 806974 770467 736396 705246 677053 651931 630115 611404
62028 611404 594988 580183 567043 556001 547146 540178 534743 530342 526082 521059 515125 508952 503284
62015 503284 498333 493839 489396 484709 479941 475894 473508 472999 473722 474994 476745 479244 482535 486458 490991
62000 490991 496161 501664 506930 511610 515748 519354 522072 523543 523978 524054 524065 523394 521030 516543 510362 503197
61984 503197 495496 487536 479631 471956 464311 456332 447901 439238 430742 422947 416468 411624 408051 404896
61970 404896 401438 397515 393465 389931 387530 386378 385906 385451 385082 385564 387401 390139 392740 394468 395375
61955 395375 396130 397514 399871 402829 405617 407809 409750 412240 415880 420789 426778 433665 441402 449992
61941 449992 459349 469283 479724 490889 503100 516364 530292 544476 558872 573698 588979 604259
61929 604259 618801 632041 643814 654112 662763 669491 674257 677260 678566 677911 675101 670394 664367
61916 664367 657570 650550 643994 638587 634752 632763 632964 635602 640539 647363 655709 665266 675688 686803
61902 686803 698753 711425 723845 734557 742621 747829 750049 748946 744509 737327 728104 717271 705305
61889 705305 692989 681057 669839 659419 649770 640562 631282 621874 612878 604623 596687 588506 580074
61876 580074 571610 562926 553818 544776 536543 529048 521626 514433 508881 506182 505926 506601 507230 508054 509805
61861 509805 512866 517251 522954 529954 538025 546857 556457 567335 580181 595412 613018 632739 654225
61848 654225 677096 701020 725768 751111 776629 801679 825504 847321 866378 882136 894364
61837 894364 902902 907402 907550 903547 896135 886161 874413 861964 850256 840596 833727 829993 829610 832521
61823 832521 838236 846142 855825 866752 877668 886699 892274 893891 891877 886425 876988 862746 843692
61810 843692 821025 796352 770751 744863 719564 695886 674242 654271 635632 618512 603195
61799 603195 589579 577293 565840 554476 542602 530709 520392 512872 507792 503891 500436 497437
61787 497437 494826 492169 489123 485672 481993 478491 475745 473921 472405 470507 468296 466223 464204 461824
61773 461824 459228 457021 455295 453599 451961 451104 451415 452376 453349 454272 455373 456814 458920 462094 466104
61758 466104 470072 473603 477354 481927 486752 490705 493445 495489 497264 498704 499571 499547 498194 495464 492181
61743 492181 489406 487293 485008 481806 477699 473131 468592 464625 461646 459481 457489 455385 453572 452479
61729 452479 451980 451779 451972 452808 454105 455366 456424 457639 459462 462042 465193 468462 471222 473069 474195
61714 474195 475166 476228 477118 477617 478012 478719 479676 480405 480563 480142 479162 477491 475069 472093 468895 465761 462945
61697 462945 460612 458671 456766 454507 451661 448156 444128 439965 436035 432290 428379 424226 420155 416296
61683 416296 412262 407769 403282 399653 397186 395360 393400 390895 388035 385469 383756 382711 381516 379761
61669 379761 378034 377058 376627 376040 375337 375247 375909 376534 376619 376676 377323 378286 378954 379514 380830 383325 386510 389623
61651 389623 392322 394712 396991 399163 400994 402271 403139 404079 405396 406894 408147 408998 409685 410579 411849
61636 411849 413293 414497 415290 415934 416554 416553 415119 412365 409390 406992 404897 402551 400069 397879 395924 393836
61620 393836 391649 389719 388159 386840 385737 384784 383623 382090 380703 379951 379222 377235 373539 368856 363883
61605 363883 358609 353129 348219 344484 341442 338159 334494 331141 328640 326820 325094 322883 319871 316280
61591 316280 312834 310115 307974 305923 303954 302519 301691 300849 299387 297455 295779 294926 294826 294748 293690 291156
61575 291156 287810 285127 284037 284080 284133 283792 283589 283959 284578 284945 285157 285649 286447 287121 287455 287742 288326 289148
61557 289148 289887 290315 290391 290250 290267 290942 292450 294324 295791 296434 296471 296459 296856 297839 299366 301304 303523 305895
61539 305895 308238 310334 312047 313389 314495 315549 316744 318162 319673 321063 322250 323277 324079 324443 324221
61524 324221 323385 321821 319354 316178 312962 310236 307849 305398 303076 301713 301881 303236 304814 305795 305930
61509 305930 305526 305172 305302 305867 306478 306878 307092 307074 306513 305268 303874 303229 303698 304737 305570 306086 306820 308084
61491 308084 309424 310181 310373 310728 311771 313195 314262 314630 314587 314645 315162 316293 318041 320214 322491 324606
61475 324606 326455 328049 329427 330613 331611 332474 333405 334641 336166 337637 338680 339132 338908 337907 336315
61460 336315 334795 333924 333528 332959 332109 331675 332249 333555 334929 336234 337853 339916 341996 343599 344660 345437
61444 345437 346115 346644 346857 346751 346722 347455 349375 352167 355061 357649 360264 363418 367045 370478 373082 374718
61428 374718 375681 376372 377060 377823 378626 379465 380333 381034 381214 380888 380851 382133 384900 388150 390734 392435 393778
61411 393778 395003 395679 395324 393978 392043 389834 387510 385248 383261 381624 380192 378705 376980 375079 373231
61396 373231 371518 369700 367539 365206 363120 361405 359892 358701 358377 359160 360431 361318 361658 361977 362627 363422
61380 363422 364188 365255 367142 369973 373372 376830 379992 382744 385204 387578 389872 391797 393102 393982 394927
61365 394927 396091 397056 397428 397518 398080 399396 400987 402385 403800 405709 408110 410680 413562 417420 422626
61350 422626 428868 435784 443482 452070 461000 469295 476379 482418 487956 493403 498696 503248 506398 508124
61336 508124 509131 510043 510779 511087 511362 512353 514073 515570 515934 515104 513501 511283 508343 504873 501588 499248
61320 499248 498076 497664 497493 497520 498195 499828 502119 504485 506781 509463 513079 517889 523969 531345 539857
61305 539857 549097 558678 568531 578800 589449 600004 609615 617331 622433 624638 624081 621140 616278 609932
61291 609932 602455 594097 585039 575345 565063 554593 544910 537005 530897 525528 519948 514374 509830 507031
61277 507031 505996 506534 508514 511682 515609 519917 524283 528366 532164 536304 541409 547109 552261 556307
61263 556307 559926 564171 569482 575849 583321 591823 600792 609545 617853 625755 633008 639161 644111 648130
61249 648130 651396 653835 655406 656221 656321 655642 654166 651876 648539 643896 638166 632087 626335 621136 616484
61234 616484 612429 608953 605834 602976 600711 599488 599291 599700 600569 602310 605338 609469 614132 619023 624230
61219 624230 629733 635118 639904 643908 647171 649790 652062 654577 657788 661465 664811 667147 668305 668444
61205 668444 667871 667122 666852 667287 667956 668361 668921 670976 675618 682721 691304 700834 711824 725040 740395
61190 740395 756830 773118 788394 801995 813315 822039 828216 831927 833131 832076 829556 826490 823372
61177 823372 820255 816912 812746 806970 799381 790721 781810 772615 762709 752418 742698 733893 725339 716334
61163 716334 706833 696978 686601 675616 664383 653327 642556 632208 622752 614551 607512 601578 597220
61150 597220 594931 594465 595084 596438 598707 601883 605322 608043 609206 608289 605109 599793 592674 584242 575229
61135 575229 566525 558799 552298 547166 543718 542190 542381 543859 546353 549703 553652 558164 563855 571639
61121 571639 581855 594096 607910 623238 640030 657922 676635 696375 717417 739390 761461
61110 761461 783273 805229 827588 849609 870053 888492 905640 922307 938378 952968 965115
61099 965115 973966 978723 979102 975737 969498 960341 947441 930632 911124 890446 869193 847245 824743
61086 824743 802253 780099 758156 736398 715273 695427 677220 660552 645012 630262 616365
61075 616365 603642 592131 581451 571445 562695 556030 551600 548765 546784 545272 544107 543339 543291 544310
61061 544310 546215 548270 549960 551626 554111 557869 562634 567922 573671 580322 588396 598040 608973 620838
61047 620838 633582 647501 662874 679578 697235 715773 735618 757029 779468 802103 824974
61036 824974 848993 874528 900626 926245 951718 978195 1005914 1034010 1062028 1090647 1120632
61025 1120632 1151904 1184027 1216880 1250313 1283802 1317130 1351125 1387238 1426645 1470149 1518616
61014 1518616 1573019 1634243 1703140 1780704 1868234 1967901 2083520 2220445 2384714 2583158
61004 2583158 2824880 3122241 3490401 3946698 4510200 5199615 6029970 7011766 8152238
60995 8152238 9450651 10882993 12386806 13864099 15205568 16319450 17148426 17675534
60987 17675534 17928667 17981376 17936185 17886649 17877139 17886382 17842342 17653245 17235838 16535354 15540367
60976 15540367 14290452 12868649 11378171 9915910 8556303 7347199 6310868 5446888
60968 5446888 4738802 4163705 3699237 3325214 3023331 2778243 2578531 2415431 2281046
60959 2281046 2168592 2073485 1992752 1923408 1862337 1807636 1759047 1716723 1680105 1648128 1619944
60948 1619944 1595010 1572600 1551456 1530004 1506997 1482002 1455202 1426756 1396525 1364432 1330730
60937 1330730 1295854 1260299 1224705 1189700 1155454 1121731 1088500 1056115 1024739 994069 963932
60926 963932 934778 907208 881339 856933 833896 812249 791901 772761 754908 738372 722940
60915 722940 708457 695033 682770 671545 661383 652690 645761 640297 635780 632095 629357 627334 625539
60902 625539 623862 622695 622326 622367 621858 619928 616552 612656 609194 606040 602238 597487 592757 589009 585847
60887 585847 582104 577450 572622 568177 563777 558828 553247 547285 540978 534119 526666 519041 511969 505919
60873 505919 500618 495343 489803 484468 479787 475431 470774 465920 461685 458602 456381 454426 452491 450752
60859 450752 449615 449549 450824 453138 455595 457193 457429 456571 455416 454653 454334 454081 453782 453741 454042 454205 453783
60842 453783 452871 451665 449899 447267 444042 440694 437183 433326 429639 426935 425036 422751 419402 415734
60828 415734 412975 411555 411125 411275 411764 412322 412765 413230 414014 415220 416635 417810 418194 417462 415861 413994
60812 413994 412191 410363 408526 407007 405923 404868 403498 402059 400943 399957 398510 396413 394052 391796
60798 391796 389599 387283 384864 382467 380091 377647 375087 372461 369898 367571 365560 363674 361539 358947
60784 358947 356112 353484 351301 349411 347525 345575 343723 342111 340737 339594 338753 338220 337862 337615 337679 338295
60768 338295 339398 340660 341899 343314 345287 348023 351396 355037 358561 361753 364553 366924 368861 370556
60754 370556 372353 374396 376515 378592 380803 383235 385465 386867 387298 387185 386960 386686 386246 385572 384640 383405
60738 383405 381759 379389 375780 370704 364705 358792 353604 349111 345044 341253 337598 333952 330479 327616
60724 327616 325604 324294 323480 323030 322571 321515 319738 317914 316814 316470 316322 315879 314905 313250 311086 309215
60708 309215 308599 309445 311083 312753 314149 315233 316025 316811 318152 320292 322771 324900 326473 327776 329107
60693 329107 330627 332526 334904 337447 339651 341514 343699 346829 350811 355054 359081 362723 366006 369212
60679 369212 372881 377287 381997 386290 390041 393733 397584 401071 403541 404894 405480 405666 405691 405636 405259 404177
60663 404177 402399 400313 397918 394519 389688 384146 379136 375106 371647 368576 366408 365612 365932 366678 367371
60648 367371 367969 368707 369808 371152 372280 372996 373751 374979 376115 375907 373807 370591 367401 364658 362152
60633 362152 359732 357581 356051 355450 355708 356097 355672 354254 352743 352180 352786 354117 355770 357517 358956 359529
60617 359529 359018 357862 356936 356973 358044 359553 360942 362335 364236 366657 369013 370897 372418 373630 374270
60602 374270 374410 374734 375572 376102 375214 372946 370437 368589 367411 366663 366496 367180 368568 370051 370967 371067 370704
60585 370704 370491 370622 370706 370440 370102 370051 370056 369654 368969 368575 368613 368694 368767 369535 371784 375691 380941 387123 393871
60566 393871 400910 408210 415832 423618 431366 439299 447825 456588 464171 469079 470813 469876 467194 463774
60552 463774 460416 457245 453740 449640 445648 442845 441638 441712 442856 445287 449143 454218 460298 467383 475431
60537 475431 484275 494007 505071 517650 531178 544726 557708 569849 580632 589210 595015 598145
60525 598145 598953 597489 593585 587446 579916 572060 564558 557529 550865 544625 539062 534372 530527 527478
60511 527478 525358 524279 523954 523850 523889 524703 526898 530339 534608 540025 547659 558259 571755 588022 607509
60496 607509 630610 656827 685157 715085 746612 779339 812120 843770 873730 901953 928373
60485 928373 952438 972840 987798 996113 997977 994316 985359 970472 949461 923279 893134 859641
60473 859641 823416 785895 748752 712770 677989 644730 613779 585683 560550 538558 519982
60462 519982 504642 491926 481421 472893 465571 458222 450297 442402 435293 428983 423291 418554 415046
60449 415046 412105 408720 404895 401652 399646 398426 397229 395887 394700 393847 393290 392954 392681 392150 391082
60434 391082 389516 387800 386381 385577 385432 385754 386385 387294 388252 388652 388072 386907 385995 385632 385509 385631 386593
60417 386593 388629 391024 392968 394559 396423 398729 401160 403592 406089 408352 409826 410422 410513 410237 409482
60402 409482 408745 409216 411495 414671 417222 418591 419395 420303 421291 422054 422629 423399 424713 426693 429232 431996
60386 431996 434554 436636 438308 439848 441520 443461 445670 447934 449838 451070 451820 452756 454377 456427 458104
60371 458104 458897 459053 459188 459643 460404 461423 462704 464048 465001 465265 465097 465197 466195 468261 471120 474342 477557
60354 477557 480518 483169 485786 488960 493201 498531 504622 511278 518472 525899 532833 538592 542894 545633
60340 545633 546675 546138 544433 541634 537138 530533 522650 515147 509040 504117 499738 495636 491808 488252
60326 488252 485088 482552 480578 478722 476713 474733 472985 471348 469727 468445 467980 468560 470240 473011 476515
60311 476515 479965 482794 485279 488209 492155 497424 504450 513692 525053 537816 551286 565111 578811
60298 578811 591293 601171 607547 610351 609953 606631 600507 591868 581329 569571 557177 544876 533733
60285 533733 524709 518015 513141 509504 506791 504754 503151 501975 501265 500487 498614 495189 490956 487021 483594
60270 483594 479970 475565 470618 465998 462645 461022 460701 460557 459652 457907 455755 453382 450712 448001 445927
60255 445927 445027 445283 446271 447472 448460 449116 449679 450412 451249 451976 452637 453459 454445 455345 455996 456438 456736 456904
60237 456904 456975 456882 456407 455504 454539 453909 453589 453460 453842 455163 457166 459094 460738 462704 465442 468606 471717
60220 471717 474887 478434 482190 485757 489294 493506 498840 505047 511571 518154 525055 532832 541845 551798
60206 551798 561791 570984 579192 586777 594104 601285 608357 615364 622160 628314 633403 637392 640619 643365
60192 643365 645500 646639 646596 645507 643474 640311 635840 630251 623891 616808 608886 600418 592121 584436 577146
60177 577146 569916 562924 556641 551176 546216 541573 537433 533961 530947 528041 525242 522872 521038 519300
60163 519300 517140 514709 512834 512092 512064 511788 510879 509916 509671 510244 511089 511630 511693 511501 511506 512197 513837 516305
60145 516305 519250 522295 525061 527239 529003 531366 535638 542144 549654 556566 562624 568976 576412 584221
60131 584221 591321 597975 605350 613495 620855 626225 630211 634021 637531 639584 639892 639587 639907 641156 643088
60116 643088 645527 648367 651613 655663 660878 666598 671209 673631 674247 673992 673105 671260 668381 664668 660139
60101 660139 654831 649222 643769 638173 631813 624873 618380 612994 608371 603893 599488 595473 592049 589315
60087 589315 587412 586255 585391 584508 583934 584253 585517 587160 588657 589912 591029 592042 592996 593984 594865 595109
60071 595109 594155 591817 588172 583182 576709 568897 560296 551551 543130 535384 528600 522798 517639 512780
60057 512780 508345 504865 502702 501546 500561 499080 497233 495876 495785 497036 499275 502414 506584 511459 516200
60042 516200 520419 524757 530056 536310 542864 549321 555598 561256 565568 568384 570279 571604 571893 570564
60028 570564 567761 564139 560108 555656 550759 545563 540167 534381 527779 520099 511767 503895 497400 492109
60014 492109 487107 481927 476870 472078 466999 461202 455187 449807 445255 441169 437484 434526 432382 430799
60000 430799 429690 429198 429194 429239 429202 429468 430367 431766 433466 435621 438434 441672 444856 447924 451360 455639 460671
59983 460671 465889 470698 474772 477983 480291 481790 482731 483267 483184 482073 479817 476697 472982 468733 464205
59968 464205 460182 457548 456578 456898 457999 459488 460940 462009 462870 464163 466276 468923 471603 474203 476767
59953 476767 478892 479872 479592 478863 478587 478811 478900 478552 478210 478391 478960 479327 479166 478607 477832 476844 475742 474871
59935 474871 474435 474095 473205 471553 469708 468604 468817 470289 472640 475634 479252 483480 488250 493585 499588
59920 499588 506211 513214 520572 528693 537964 548050 557880 566352 573016 578180 582496 586355 589512 591384
59906 591384 591846 591574 591392 591458 591325 590612 589251 587247 584651 581769 578947 576168 573226 570281 567819 566059
59890 566059 564901 564472 565192 567184 570104 573679 577868 582371 586674 590834 595538 600902 605913 609665 612640
59875 612640 616004 619986 623770 626863 629736 632942 636198 638623 639548 638915 637136 634766 632172 629405 626303
59860 626303 622586 617908 612111 605593 599188 593510 588681 584733 581805 579713 577913 576325 575717 576702 578817
59845 578817 581325 584488 589070 594601 599168 601301 601436 601117 601274 601718 601977 602053 602269 602651 602688 601814 600036
59828 600036 597766 595030 591327 586657 582170 579115 577356 575646 573333 571058 569641 568983 568475 567959 567791
59813 567791 568134 568514 568113 566457 563911 561412 559503 557743 555366 552382 549558 547335 545270 542674 539374
59798 539374 535710 532187 529288 527272 525868 524411 522442 519989 517332 514781 512743 511516 510843 510002 508524
59783 508524 506594 504638 502853 501283 500023 499098 498405 497936 497883 498329 499032 499639 500069 500712 502363 505743 510729
59766 510729 516210 521098 525370 529609 533782 537253 539980 542765 546044 549337 552369 555909 560779 566644
59752 566644 572604 578557 585139 592533 600145 607421 614315 620889 627043 632765 638191 643203 647237 649632
59738 649632 650097 648929 646966 645142 643793 642470 640636 638321 635833 633090 629758 625944 622280 619317
59724 619317 617183 615807 614989 614270 613162 611669 610223 608996 607621 605698 603304 600842 598655 596952 595845
59709 595845 595242 594853 594476 594216 594327 594956 596098 597684 599601 601742 604122 606839 609867 613003 616225 619998
59693 619998 624993 631301 637990 643665 647608 650277 652504 654371 655195 654639 653349 652222 651391 650333 648725
59678 648725 646693 644297 641302 637594 633424 629026 624288 619028 613403 607771 602307 596997 592005 587808
59664 587808 584833 582982 581601 579998 578040 576228 575179 575182 576362 578981 583213 588631 594314 599664 604823
59649 604823 610051 615015 619062 622063 624474 626427 627160 625682 621881 616617 610758 604398 597181 589210
59635 589210 581313 574366 568563 563526 559048 555451 553062 551581 550200 548285 545652 542236 537933 532991
59621 532991 528195 524265 521182 518426 515725 513157 510613 507719 504377 500897 497416 493662 489648 486139
59607 486139 484025 483485 484194 486025 488989 492587 495821 497999 499185 499732 499751 499220 498395 497820 497838 498180 498221
59590 498221 497807 497648 498484 499929 500789 500657 500466 501034 501845 502049 501987 502579 503525 503374 501453 498606 495796 493006
59572 493006 489942 486860 484013 481026 477486 473728 470493 468179 466813 466273 466068 465402 463973 462363 461227
59557 461227 460561 460226 460651 462338 464979 467652 469664 470752 470919 470683 471151 473088 476098 479324 482734 487037
59541 487037 492588 499211 507072 516889 529066 543257 558902 575538 592351 607918 620681 629390
59529 629390 633207 632051 627128 620541 613987 608136 603381 600544 600218 601709 603269 603506 602287 600276 597869
59514 597869 594735 590272 584324 577357 569966 562344 554343 545961 537555 529619 522446 516044 510297 505194
59500 505194 500922 497670 495317 493482 491880 490466 489178 487913 486914 486858 488159 490389 492747 494970 497456
59485 497456 500551 504068 507515 510572 513316 516186 519653 523843 528545 533646 539327 545698 552570 559710
59471 559710 566947 573755 579210 582811 585014 586531 587479 587758 587781 588035 588220 587694 586693 586282 587057 588794
59455 588794 591476 595781 602083 609694 617597 625447 633411 641464 649239 656322 662304 666763 669433 670241
59441 670241 669075 665814 660643 654041 646367 637885 629206 621150 613956 607179 600658 595073 591133 588691
59427 588691 587094 586040 585609 585774 586483 588120 591438 597014 605016 615381 627942 642505 659017 677490
59413 677490 697548 718330 739129 759810 780160 798936 814044 823700 827200 824732 816971 805072
59401 805072 790880 776890 765777 759617 759150 763664 771434 780053 786486 787662 781867 769624 752904
59388 752904 733493 712486 691075 671044 654038 640636 630463 623004 618020 615314 614536 615397 617823
59375 617823 621658 626258 630723 634656 638494 642939 648203 654009 660116 666464 672883 679063 684892 690486
59361 690486 695853 700871 705655 710478 715209 719358 723072 727609 734285 743137 753068 763156 773376 784178
59347 784178 795870 808453 821642 834964 848107 861165 874159 886357 896598 904429 910496 915489
59335 915489 919057 920131 918069 913046 905462 895492 883368 869776 855766 842298 829898 818542 807803
59322 807803 797317 787215 777965 769712 762062 754698 747915 742158 737206 732251 726871 721516 716919 713330
59308 713330 710445 707764 704878 701729 698850 697095 696916 698138 700566 704373 709567 715452 721006 725486
59294 725486 728174 727905 723610 715331 704142 691120 676917 662315 648452 636211 625867 617532 611441
59281 611441 607490 604921 603000 601870 602453 605527 611085 618509 627300 637548 649607 663223 677252
59268 677252 690566 703017 715122 726923 737645 746381 752658 756334 757525 756727 754516 750983 745881
59255 745881 739274 731518 722693 712768 702433 692940 684796 677355 670087 663530 658559 655389 653862 654046
59241 654046 655855 658549 661389 664470 668273 672725 677364 682090 687015 691723 695455 698029 699926 701486
59227 701486 702512 702664 701721 699518 696162 692329 688848 685903 683034 679925 676720 673544 670206 666527 662619
59212 662619 658710 655004 651798 649472 648185 647686 647474 647017 645911 644012 641378 638094 634327 630632 627792
59197 627792 626106 625064 624050 623099 622662 622952 623894 625350 626953 628083 628630 629529 631855 635576 639767 643939
59181 643939 648411 653477 658950 664614 670456 676316 681933 687459 693339 699544 705537 711186 717152 724085
59167 724085 731897 740052 748121 755800 762858 769280 775064 779758 782636 783481 782685 780370 776057 769466 761074
59152 761074 751516 741038 729910 718751 707819 696528 684352 671854 660063 649151 638535 628156
59140 628156 618754 610698 603289 595607 587646 580210 573951 568730 563845 558745 553628 549442 547135 546865
59126 546865 547986 549799 552147 555341 559730 565426 572236 579692 587275 594808 602678 611519 621526 632118
59112 632118 642412 652070 661496 671067 680412 688737 695750 701832 707296 711896 715247 717291 718084 717506
59098 717506 715581 712863 710054 707349 704525 701552 698693 695988 693073 689701 686210 683316 681529 680738
59084 680738 680252 679223 677232 674457 671167 667255 662499 657109 651546 645865 639775 633417 627464 622193
59070 622193 616998 611311 605543 600555 596489 592766 589080 585662 582567 579397 575951 572572 569593 566894
59056 566894 564239 561617 559003 556306 553844 552294 551682 551012 549524 547879 547296 547830 548356 548131 547467 546833
59040 546833 546246 545814 545949 546597 546930 546347 545289 544653 544924 546277 548899 552616 556682 560679 565321 571736
59024 571736 580154 589944 600656 612334 624893 637936 651234 664724 677807 689174 697633 702845
59012 702845 705205 705293 703560 700189 695196 688841 681988 675760 670845 667341 665187 664383 664830 666330 668827
58997 668827 672387 676904 682056 687451 692585 696804 699738 701669 703023 703587 702824 700946 699016 697747 696733
58982 696733 695163 692847 690272 688083 686873 687121 688903 691857 695706 700600 706659 713518 720741 728500
58968 728500 737375 747598 758819 770596 782690 794794 806314 816600 825275 832253 837555 841163
58956 841163 842926 842555 839820 834805 827857 819221 808812 796454 782288 766791 750480 733775 717243
58943 717243 701733 688022 676413 666798 659010 652812 647655 642925 638553 635050 632734 631214 629843
58930 629843 628397 626993 625614 624071 622311 620475 618730 617231 616103 615171 613972 612294 610545 609277
58916 609277 608517 607929 607419 607164 607152 607188 607322 607866 608993 610750 613455 617671 623615 630936 639230 648609 659594
58899 659594 672534 687063 702081 716450 729861 742869 755955 768872 781185 793048 805047
58888 805047 817532 830625 844617 859758 875733 891794 907327 921845 934668 945183 953300 959101
58876 959101 962200 962039 958684 952638 944023 932760 919564 905970 893151 881352 870557 860932 852396
58863 852396 844425 836636 829023 821503 813828 806116 798731 791442 783373 774191 764645 755572 747002 738610
58849 738610 730413 722466 714501 706435 698817 692161 686102 679696 672356 664127 655301 646096 636566 626626
58835 626626 616347 606297 597195 589144 581650 574493 568059 562680 558238 554633 551989 550145 548617 547413
58821 547413 547222 548367 550191 551997 553989 556803 560617 565237 570498 576049 581270 585932 590435 594863
58807 594863 598415 600457 601514 602471 603288 603329 602537 601277 599289 595853 591037 585987 581784 578557 575774
58792 575774 572915 569795 566650 563958 561963 560452 559173 558240 557861 558076 559046 561148 564375 568159 572319
58777 572319 577634 584703 592650 599758 605096 608725 610560 610069 607161 602542 596939 590569 583540 576197
58763 576197 568864 561630 554611 548171 542793 538870 536520 535438 535106 535273 535951 536819 537216 537052 537137 538019
58747 538019 539062 539382 539312 540151 542700 546713 551484 556267 560466 564304 569102 576008 584531 593099 600910
58732 600910 608319 615488 621716 626439 630094 633680 637903 642902 648231 653013 656639 659464 662449 666136
58718 666136 670364 674827 679314 683601 687789 692618 698699 705469 711569 716205 719434 721234 721207 719229 715498
58703 715498 709763 701392 690456 677994 664908 651177 636418 620563 603847 586803 570487 555980
58691 555980 543338 531606 520117 509191 499377 490759 483323 477315 472729 468890 464979 460690 456224
58678 456224 452027 448643 446351 444800 443500 442696 443148 444907 447068 448916 450666 452868 455842 460005 465954
58663 465954 473699 482323 490808 498718 505750 511310 515030 517150 517877 516798 513441 508102 501737 495266
58649 495266 489261 483919 479046 474398 470175 466793 464060 461197 457842 454433 451414 448804 446852 446277
58635 446277 447264 448978 450748 453042 456453 460211 462706 463345 463113 463304 464336 465823 467227 468251 468929
58620 468929 469486 470071 470797 472118 474790 479063 484145 488837 492676 496213 500309 505425 511424 517720 523579
58605 523579 528488 532397 535681 538865 542184 545282 547526 548798 549660 550456 550684 549826 548405 547421 547028 546677
58589 546677 546450 547238 549447 552595 556425 561472 568134 576017 584618 593811 603252 612248 620730 629482 638802
58574 638802 647757 655529 662708 670459 679062 688141 697810 708710 721254 735618 752175 771287 792881
58561 792881 816730 842685 870147 897809 924509 949813 973077 992630 1006777 1015247 1018849 1018174
58549 1018174 1013585 1006138 997370 988222 978968 969998 961721 953669 944579 933456 919889 903476 883940
58536 883940 861945 838900 815567 791580 766713 742041 719328 699629 682912 668774 657058
58525 657058 647745 640565 634972 630568 627399 625635 624973 624608 623807 622187 619517 615809 611744 608347 605893
58510 605893 603680 601256 599236 598304 597960 597056 595265 593307 591878 591010 590352 589492 588087 586220 584565 583738
58494 583738 583619 583721 583993 584702 585762 586846 588172 590571 594711 600638 608084 616783 626524 637335 649651
58479 649651 663989 680408 698483 717637 737153 756004 773085 787637 799222 807403 811714 811854
58467 811854 807812 800043 789737 778602 768012 758509 750238 743498 738603 735701 735077 737285 742565 750452
58453 750452 760314 771835 784535 797249 808629 817858 824396 827419 826190 820788 812017 800766 787816
58440 787816 773939 759676 745260 731218 718703 708758 701534 696672 694097 693943 696055 700122 706031
58427 706031 713558 722019 730782 739907 749806 760472 771446 782188 791980 799781 804720 806577 805475
58414 805475 801495 794945 786531 776886 766360 755550 745295 735698 725950 715812 706487 699250 693920
58401 693920 689584 686126 683993 682989 682443 682268 682826 683964 685133 686319 688023 690520 693835 698047 702811
58386 702811 706962 709495 710686 711481 712169 712479 712586 713024 713929 715192 716990 719383 721846 724165 727282 732236
58370 732236 738704 745670 753010 761269 770318 779494 788788 798720 809320 820407 832447 845813 859517
58357 859517 872074 883383 894398 905160 914612 922188 928092 932046 933386 932555 931131 930214 930049 931178
58343 931178 934363 939152 944089 948788 954468 962082 971239 981434 993065 1006618 1021875 1038360 1055683
58330 1055683 1073182 1090176 1106787 1123450 1139429 1152918 1162924 1170010 1174997 1178034 1179261 1179299 1178658
58317 1178658 1177484 1176156 1175337 1175309 1176066 1178014 1181655 1186642 1192219 1198557 1206614 1216696 1228212 1240719
58303 1240719 1254103 1267899 1281614 1295597 1310420 1325596 1340159 1354246 1368752 1383693 1398415
58292 1398415 1413144 1428762 1445242 1461906 1479023 1497477 1517085 1537012 1557642 1580123 1604275
58281 1604275 1628975 1654457 1681992 1711241 1740331 1768887 1798701 1830947 1864849 1899625 1935572
58270 1935572 1972680 2010273 2048642 2089093 2131827 2175700 2220524 2267583 2317429 2369170 2422381
58259 2422381 2477665 2534924 2593122 2652052 2712242 2773027 2833099 2893074 2954915 3018654 3082555
58248 3082555 3146848 3214294 3286544 3362957 3443612 3530286 3623641 3722540 3827054 3939054 4059071
58237 4059071 4185785 4319386 4462058 4614318 4774556 4943218 5123643 5317614 5523958
58228 5523958 5742800 5977157 6228827 6496877 6781850 7087483 7416747 7770400 8150980
58219 8150980 8563829 9012627 9498729 10026541 10604601 11239833 11936459 12702620 13552330
58210 13552330 14499186 15554978 16737260 18072026 19587362 21313302 23292206 25582528
58202 25582528 28250912 31372097 35043635 39395084 44584954 50809441 58330970 67494853
58194 67494853 78711300 92418953 109041850 128929293 152296225 179199075 209489899
58187 209489899 242609554 277231152 311050918 341042253 364120995 377836830 380795496
58180 380795496 372826032 354990531 329387553 298691682 265585693 232351730 200715664
58173 200715664 171832856 146314321 124308074 105650772 90023011 77042836 66310616
58166 66310616 57444749 50108128 44012149 38912209 34610677 30956756 27832908 25141953
58158 25141953 22806824 20770954 18988692 17417538 16022104 14778236 13667034 12668779
58150 12668779 11766530 10950244 10212255 9542394 8931397 8375028 7870624 7412674 6995157
58141 6995157 6614966 6269622 5954436 5664661 5397611 5150209 4917511 4696167 4486459
58132 4486459 4288737 4100916 3921709 3753067 3596709 3451002 3313661 3184730 3064476
58123 3064476 2950983 2842415 2739398 2642917 2552058 2465853 2385006 2309770 2238422 2169787 2104927
58112 2104927 2044415 1986373 1929260 1874196 1822378 1772555 1723327 1675693 1630888 1587725 1544538
58101 1544538 1501995 1461651 1423334 1386198 1350750 1317613 1285784 1254316 1224338 1197362 1172904
58090 1172904 1149860 1128804 1110744 1094740 1078936 1062983 1047587 1032622 1017592 1002966 989252
58079 989252 975560 960827 945557 930695 915677 899352 882092 865344 849647 834533 819748
58068 819748 805279 790865 776620 763405 751536 740067 728405 717519 708357 700252 692198 684491
58056 684491 677656 670851 662934 654195 645536 636835 627590 618341 609920 602074 594244 586951 580980 575966
58042 575966 571103 566522 562613 558794 554394 550004 546506 543425 539622 534950 529883 524199 517436 510027
58028 510027 502677 495170 487037 478676 470603 462361 453551 445137 438260 432433 426392 420132 414630 410135
58014 410135 406206 402830 400070 397132 393297 389318 386460 384675 383065 381560 380570 379589 377771 375494 373788
57999 373788 372633 371409 370552 370978 372183 372718 372432 372477 373169 373626 373533 373500 373471 372514 370574 368866 368073 367506
57981 367506 366472 365142 363614 361397 358394 355348 352760 350275 347591 345123 343367 342304 341742 341635 341846
57966 341846 342232 343009 344444 346249 347941 349574 351351 352802 353206 352607 351457 349573 346597 343192 340496
57951 340496 338464 336040 333010 330410 328911 328113 327708 328123 329541 331308 332837 334341 336365 339319 343605
57936 343605 349420 356297 363658 371837 381632 392758 403782 413754 422858 431242 438245 443215 446162 447244
57922 447244 446416 443980 440646 436664 431513 424847 417092 408925 400807 393207 386591 380969 376044 371901
57908 371901 368920 366961 365357 363701 361941 359805 357042 354186 352063 350499 348539 346037 343852 342320
57894 342320 340734 338730 337010 336185 335920 335717 335647 335788 335886 336001 336585 337441 337637 337061 336987 338360 340351 341459
57876 341459 341281 340346 338863 336609 333674 330472 327227 324030 321192 319068 317780 317437 318246 320065 322299
57861 322299 324589 327185 330347 333893 337705 342174 347697 354143 361123 368320 375255 381337 386511 391327
57847 391327 395963 399709 401823 402439 402169 401241 399447 396528 392258 386557 379898 373238 367249 361936 357097
57832 357097 352623 348216 343478 338575 334197 330630 327535 324843 323015 322029 320994 319387 318011 318098 319983
57817 319983 323092 326557 329360 330606 330378 329702 329062 327504 323881 318360 312039 305663 299489 293815 288695
57802 288695 283541 277900 272339 267820 264440 261586 259103 257526 257307 258472 260898 264289 267999 271531
57788 271531 275090 279171 283781 288581 293496 298596 303591 308158 312608 317602 323275 329226 335270 341542
57774 341542 347917 353890 359150 363830 368168 372182 375577 377672 377617 375126 370879 365914 360830 355724 350433
57759 350433 344390 336897 328289 320436 315133 312152 309664 306520 303305 301153 300462 301056 302881 305984 310074
57744 310074 314411 318088 320498 321822 323012 324933 327525 330066 332079 333614 334884 336146 337830 340210
57730 340210 342896 345119 346601 347706 348740 349563 349955 349941 349630 349089 348413 347581 346232 343978 341025 338067
57714 338067 335450 332822 329719 326180 322536 318911 315137 311011 306440 301426 296084 290657 285465 280751
57700 280751 276544 272690 269179 266413 264934 264803 265513 266484 267363 267776 267309 265983 264282 262402 259971 256952
57684 256952 254329 253246 253701 254750 255829 257340 260113 264990 272907 284731 300744 320744 344834
57671 344834 373937 409506 452926 504985 565382 632394 702816 771921 833475 880675 908130
57660 908130 913377 896680 860120 807511 744514 677469 611595 550417 496415 451162 414687 385612
57648 385612 362333 343710 328702 316225 305770 297607 292003 288564 286549 285369 284565 283738 282799 281932
57634 281932 281190 280491 280131 280647 281898 282814 282525 281296 279941 278719 277349 275719 273970 272002 269544 266701
57618 266701 263898 261216 258319 255198 252477 250649 249359 247938 246399 245389 245172 245241 245132 245095 245520 246122
57602 246122 246270 245957 245758 245847 245674 244696 242818 239970 235977 231159 226382 222012 217456 212273 207138 202974
57586 202974 199638 196324 192956 190229 188350 186620 184390 181753 179189 177117 175790 175055 174148 172353 169930
57571 169930 167809 166285 164676 162360 159500 156502 153441 150325 147392 144767 142341 140335 139457 140047 141375
57556 141375 142320 142611 142990 144195 146070 147732 148532 148791 149462 150962 152592 153365 153172 152686 152404 152399 152891 154252
57538 154252 156222 157790 158249 157983 157969 158885 160842 163496 166151 168098 169108 169348 168834 167513 165904 164985
57522 164985 165107 165617 165909 166290 167332 168905 170466 171985 173966 176672 179761 182574 184535 185479 185870 186452
57506 186452 187383 188036 187900 187274 186639 185803 184294 182345 180738 179640 178293 176029 173110 170312 167974 165775
57490 165775 163249 160281 157138 154202 151760 149971 148858 148168 147301 145681 143297 140723 138522 136782 135284
57475 135284 133921 132816 132208 132221 132546 132272 130437 126984 122945 119467 116840 114668 112722 111331 110990 111881
57459 111881 113656 115539 116755 117079 116916 116696 116341 115539 114438 113734 113942 114737 115213 114877 114267 114422 115726
57442 115726 117566 119247 120860 122886 125262 127360 128763 129477 129476 128749 127876 127821 128791 129893 130265 130037 129790
57425 129790 129622 129303 128989 129129 129816 130755 131726 132661 133307 133239 132261 130582 128630 126891 125744 125219 125010 124953
57407 124953 125311 126304 127493 127997 127323 125824 124310 123375 123009 122744 122171 121379 120847 120946 121685 122917 124506
57390 124506 126269 127946 129291 130058 130050 129579 129711 131449 134555 137660 139700 140752 141387 141891 142349 142810 142956
57373 142956 142190 140490 138609 136973 135089 132693 130800 130637 131896 133056 133369 133589 134619 136284 137827
57358 137827 139027 140374 142275 144482 146324 147467 148298 149399 150744 151804 152443 153149 154160 154973 155079
57343 155079 154626 153926 152873 151438 150185 149522 148891 147557 145878 144865 144634 144201 142814 140730 138641 137089
57327 137089 136471 136891 137766 138163 137751 136995 136487 136568 137442 138961 140313 140662 140156 139677 139602 139613 139715 140433 141759
57308 141759 142852 143274 143690 144800 146247 147212 147585 147901 148497 149338 150385 151595 152696 153367 153569 153509 153473
57291 153473 153835 154879 156403 157851 159025 160237 161572 162522 162759 162821 163582 165350 167829 170627 173342 175476
57275 175476 176782 177541 178175 178816 179608 181034 183413 186254 188630 190128 191033 191756 192533 193601 195179 197193
57259 197193 199328 201355 203160 204553 205370 205700 205764 205650 205462 205585 206382 207691 208940 209834 210630 211771 213486
57242 213486 215702 218106 220343 222441 224923 228196 231982 235719 239343 243140 246855 249703 251501 253182
57228 253182 255690 258787 261508 263569 265756 268937 273207 278062 283007 287752 292179 296477 301202 306849
57214 306849 313311 319958 326355 332751 339698 347255 354772 361585 367777 374079 381059 388607 396292 403987
57200 403987 411926 420274 428975 438026 447525 457270 466637 475240 483509 492268 501807 511809 522171 533405
57186 533405 546056 560090 575060 590501 605917 620769 634916 648846 663083 677572 692012
57175 692012 706559 721641 737206 752742 768061 783558 799525 815740 831995 848603 866090
57164 866090 884649 904150 924403 945145 966040 987111 1009015 1032564 1058005 1085047 1113443
57153 1113443 1143167 1173944 1205049 1235863 1266489 1297491 1329077 1360792 1392099 1422988 1453742
57142 1453742 1484356 1514576 1544570 1575150 1607145 1640828 1676145 1713177 1752013 1792354 1833602
57131 1833602 1875257 1916980 1958417 1999296 2039580 2079199 2117739 2154772 2190398 2225044 2258849
57120 2258849 2291814 2324606 2358595 2394852 2433510 2474297 2517237 2562616 2610810 2662697 2719991
57109 2719991 2784703 2858444 2942702 3039786 3153214 3287428 3447746 3640849 3874865 4158525
57099 4158525 4500139 4907503 5388735 5953076 6610954 7373565 8252493 9259193 10403372
57090 10403372 11689968 13115969 14669113 16329193 18070563 19864193 21679814 23490862
57082 23490862 25283099 27062392 28853505 30685347 32566752 34462412 36277849 37859618
57074 37859618 39016001 39558842 39354747 38362834 36641127 34323208 31582621 28601371
57066 28601371 25547931 22563237 19753305 17187960 14904050 12911244 11199368 9746058
57058 9746058 8522839 7498903 6643560 5928052 5326290 4814785 4373069 3984788 3638016
57049 3638016 3324385 3038493 2777903 2542220 2330852 2141844 1973065 1823553 1692694
57040 1692694 1578626 1478527 1390323 1313313 1247178 1191125 1144015 1104713 1072297 1046485 1027851
57029 1027851 1017154 1014350 1018644 1029223 1045160 1064365 1083174 1097331 1103250 1098443 1081409 1051685
57017 1051685 1010131 959038 901870 842628 785003 731705 684286 643297 608503 579163 554440
57006 554440 533678 516395 502212 490796 481623 473757 466171 458420 450702 443158 435513 427569 419623
56993 419623 412101 405207 399229 394708 391799 389864 388270 387364 388104 390851 395097 400159 405486 410141 412614
56978 412614 411484 406205 397204 385435 371834 357084 341921 327570 315387 305845 298328 292286 288166
56965 288166 286703 287804 290955 296389 304863 316254 329331 343225 358258 374741 391445 405788
56953 405788 415317 418732 415888 407500 394864 379401 362195 343999 325725 308723 294408 283527
56941 283527 275911 271074 268988 270058 274427 281702 291511 303994 319480 337922 358824 381389 404292
56928 404292 425477 442478 453003 455294 448537 433455 412222 387335 360672 333783 308425 285915
56916 285915 266087 247754 230391 214876 202405 193161 186210 180332 174823 169724 165419 161885 158517
56903 158517 154942 151752 149925 149600 149992 150510 151451 153438 156642 160693 165070 169475 174182 180056 187962
56888 187962 198120 210285 224267 239734 255514 269721 280705 287597 290024 288034 282491 274863
56876 274863 266200 256709 246654 237230 230084 226118 225090 226305 229508 235276 244700 258602 276941
56863 276941 299020 324186 352136 382584 414815 447436 478211 504193 522477 531152 529635 518542
56851 518542 499669 475792 449710 423279 397728 374746 356495 344381 338465 338362 344142 356062
56839 356062 374039 397984 428366 465924 510844 562231 617935 674360 726589 769252 797766
56828 797766 809263 802999 780288 743960 697711 645750 592551 542089 496965 458384 426921 402910
56816 402910 386195 376230 372737 375922 385870 402163 424334 452246 485621 523370 563408 602634
56804 602634 636877 661473 672718 669084 651299 621807 584210 542522 500151 459412 421904 388844
56792 388844 360828 337784 319666 306943 300078 298798 302242 309565 320100 333231 348580 366107
56780 366107 385498 405370 423278 436515 442886 441140 431202 414133 391726 366026 339010 312275
56768 312275 286827 263292 242318 224410 209346 196295 184780 175085 167459 161430 156291 151902
56756 151902 148443 145680 142988 139998 136810 133657 130706 128078 125741 123494 121328 119617 118616 117952
56742 117952 117024 115842 115037 115020 115475 115802 115760 115530 115313 115077 114727 114438 114614 115408 116420 117105 117371 117526 117734
56723 117734 117943 118274 118947 119798 120356 120615 121206 122547 124323 126086 127859 129739 131341 132141 132128 131763 131569
56706 131569 132033 133497 135627 137371 137948 137705 137544 137761 137948 137845 137652 137567 137492 137294 136944 136421 135728 135002
56688 135002 134360 133724 133051 132640 132942 134134 136042 138309 140451 142019 143024 143964 145139 146168 146509 146173
56672 146173 145555 144836 144098 143804 144548 146246 148082 149386 150237 151098 152127 153037 153470 153422 153245 153215 153176 152866
56654 152866 152562 152951 154170 155462 156168 156671 157814 159613 161118 161553 161164 160833 161152 161935 162534 162571 162352
56637 162352 162387 162622 162476 161687 160627 159637 158584 157305 156010 154885 153845 152986 152717 153023 153168 152640 151788
56620 151788 150941 149588 147282 144815 143413 143088 142741 141761 140504 139292 137999 136796 136378 137057 138269 139212
56604 139212 139475 138985 137940 136959 136712 137269 138204 139274 140360 140908 140341 139202 138959 140265 142109 143158
56588 143158 143294 143342 143857 144811 146063 147452 148552 148909 148582 148148 148111 148504 149036 149498 149971 150680 151674 152782
56570 152782 153939 155375 157291 159522 161831 164346 167371 170927 174812 179051 183935 189658 196247 203668
56556 203668 211637 219393 226040 230970 233722 233789 231245 227326 223652 220741 217858 214307 210271 206347 202917
56541 202917 200156 198073 196292 194266 191915 189717 188073 186977 186308 185945 185505 184499 182963 181532 180741
56526 180741 180562 180682 180845 180920 181013 181483 182417 183238 183368 183160 183440 184170 184361 183436 181860 180237 178608 176977
56508 176977 175737 175102 174751 174474 174595 175281 175981 176093 175774 175618 175872 176390 176995 177490 177621 177417 177279 177440
56490 177440 177637 177601 177474 177419 177201 176557 175661 174900 174400 174097 174011 174174 174509 175040 175945 177205 178432 179193 179313
56471 179313 178837 178094 177800 178550 180032 181295 181958 182567 183528 184382 184596 184477 184717 185412 186063 186278 186053 185656
56453 185656 185562 186205 187453 188625 189285 189679 190193 190893 191802 193010 194169 194530 193985 193391 193280 192925 191518
56436 191518 189676 188734 188865 188996 188530 188154 188674 189885 190970 191526 191802 192210 192888 193625 194083 194131 193907 193537
56418 193537 193006 192471 192398 193065 194134 195014 195510 195848 196272 196909 197826 198868 199612 199812 199741 199835 200178 200598 200974
56399 200974 201144 200833 200112 199650 200006 200876 201544 201897 202409 203271 204182 205051 206191 207557 208421 208255 207645 207799
56381 207799 209215 211190 212717 213541 214127 214831 215437 215605 215392 215137 215060 215286 216036 217407 219073 220570 221838
56364 221838 223067 224095 224479 224158 223580 223212 223361 224396 226437 228778 230387 231165 231982 233219 234137 234143 233880
56347 233880 234328 235383 236028 235553 234012 231895 229977 229178 229907 231603 233380 234998 236907 239621 243377
56332 243377 248092 253249 258084 262194 265704 268678 270909 272578 274436 276798 279015 280564 282050 284300
56318 284300 286956 288939 290005 290854 291773 292181 291674 290763 290215 290166 290138 289699 288941 288511 289164 291140 294077 297636
56300 297636 301875 306832 312100 317158 321779 325836 329129 331810 334524 337615 340603 342950 344933 347138
56286 347138 349556 351893 354525 358329 363663 370103 377038 383951 390381 396362 402769 410515 419386 428302
56272 428302 436728 445168 454228 463797 473423 483094 493411 505115 518438 532856 547676 563030 579914
56259 579914 599110 620544 644090 670484 700854 735730 775131 819298 868718 923690 984474
56248 984474 1051743 1126395 1208988 1299635 1398013 1503070 1613177 1727094 1844286 1963722
56238 1963722 2082891 2198639 2308362 2409618 2499257 2574077 2632112 2672421 2693991 2695976 2678823
56227 2678823 2644114 2593336 2527730 2449267 2360823 2265294 2165209 2062979 1960519 1858651
56217 1858651 1757774 1659113 1564486 1474906 1390389 1311138 1237846 1170638 1108685 1051232 998264
56206 998264 949839 905447 864372 826221 790872 758301 728574 701683 677483 656063 637829
56195 637829 622653 609276 596323 583704 572354 562780 554581 547139 540071 533260 527134 522513 519442
56182 519442 516649 513076 509322 506477 504202 501508 498901 497948 498793 499919 500602 501814 504185 506817 508929
56167 508929 511214 514608 518867 523334 528209 534086 540920 548220 555723 563304 570838 578715 587909 598990
56153 598990 611604 625292 640200 656597 674369 693551 714880 739329 767594 800403 838902
56142 838902 884378 937872 1000284 1072398 1154620 1246887 1348675 1458561 1573796 1690846 1806349
56131 1806349 1917238 2020529 2114026 2197266 2271095 2336528 2394658 2446982 2494289 2535200 2566932
56120 2566932 2587551 2596513 2593303 2577183 2548520 2508968 2459792 2400901 2331681 2251679 2160449 2058085
56108 2058085 1946447 1829050 1709641 1591840 1479873 1377891 1288055 1210337 1144305 1089714
56098 1089714 1045266 1008564 977951 953100 933406 917352 904108 894260 888111 884471 881874 879875
56086 879875 878558 877918 878341 880575 884590 889448 894623 900295 906172 911551 916926 923837 932441 940923 948104
56071 948104 955077 963327 972796 982884 993900 1006253 1019336 1032438 1045855 1060141 1075090 1090197
56059 1090197 1105263 1119972 1133877 1147309 1161166 1175411 1188996 1201591 1213887 1225919 1236911
56048 1236911 1247390 1259517 1274367 1290575 1306599 1322643 1339472 1357103 1375732 1396264 1418831
56037 1418831 1442414 1466863 1493492 1522676 1552785 1582756 1613818 1647253 1682255 1717485 1753086
56026 1753086 1789675 1826852 1864115 1901903 1940547 1979669 2019540 2061369 2105388 2150609 2197343
56015 2197343 2247664 2302271 2359325 2417675 2478661 2543224 2609980 2678013 2748997 2824490 2903536
56004 2903536 2985029 3070079 3160051 3254637 3353952 3460038 3574123 3694825 3821110 3954444
55994 3954444 4096005 4244785 4400802 4567101 4745918 4935860 5135661 5347750 5575350
55985 5575350 5819197 6079987 6360758 6663766 6988453 7335754 7710927 8118944 8561068
55976 8561068 9039537 9561511 10134567 10762918 11452460 12215084 13063559 14007510 15060174
55967 15060174 16244721 17589188 19121567 20877210 22907001 25273540 28047625 31318169
55959 31318169 35202436 39844082 45416742 52148564 60343882 70372877 82638448 97538629
55951 97538629 115415619 136494463 160848214 188369394 218623000 250526007 282065996
55944 282065996 310400847 332427185 345528221 348143066 340033100 322286614 297068039
55937 297068039 267120072 235181607 203564817 173980910 147514666 124654467 105393032
55930 105393032 89409909 76256968 65467767 56603116 49281565 43197687 38111153
55923 38111153 33825100 30181256 27062082 24378636 22054416 20025021 18244368 16678662
55915 16678662 15295670 14066152 12970486 11994740 11122398 10336579 9627182 8988642 8412566
55906 8412566 7888482 7409650 6972395 6571526 6201572 5860528 5547417 5257946 4987269
55897 4987269 4735082 4503208 4289793 4090510 3903988 3731445 3571993 3422724 3282763
55888 3282763 3153280 3033980 2922978 2819607 2724224 2635896 2553039 2475487 2403216 2334042
55878 2334042 2265343 2197033 2130276 2064474 1998332 1932753 1869738 1809326 1750360 1693377 1639939
55867 1639939 1589801 1541403 1494521 1450022 1407790 1367392 1329951 1296759 1266637 1237105 1207503
55856 1207503 1178602 1150016 1120696 1091492 1064476 1039953 1016511 993687 972080 951137 929444
55845 929444 907344 886814 868472 850791 832592 814366 796895 780299 764773 750600 737197
55834 737197 723529 709615 696298 683741 671595 660400 651108 643196 634932 625704 616652 608807 601918
55821 601918 595268 588357 580630 571678 561936 552319 543235 534726 527133 520563 514112 506871 499402 493089
55807 493089 488426 485182 483756 484870 488121 492304 497067 502930 509816 516906 523827 530632 536693 540992
55793 540992 543487 544838 544767 542100 536560 529251 521197 512675 504186 496785 490929 485949 481067 476195 471432
55778 471432 466542 461161 455110 448500 442075 437240 435169 436094 439976 447238 457858 470230 481931 491243
55764 491243 496919 497180 490614 478077 462354 445698 428684 411392 394448 378644 364487 352324
55752 352324 342140 333175 324486 315847 307521 299477 291683 284684 278851 273423 267386 260979 255110 249716
55738 249716 244078 238507 234150 231150 228530 225999 224345 223791 223363 222348 221057 219752 218030 215749 213410
55723 213410 211189 208654 205864 203666 202394 201341 200022 199021 199024 199849 200982 202239 203465 204385 205220 206704
55707 206704 209020 211413 213172 214263 214652 213911 211935 209326 206620 203782 200753 197713 194457 190360 185471
55692 185471 180958 177959 176574 176286 176614 176968 176686 175857 175521 176527 178654 181207 183849 186460 188808 190868
55676 190868 192961 195120 196741 197242 196631 195183 193115 190897 189310 188772 188981 189455 189939 190199 190044 189777
55660 189777 190018 190849 191775 192721 194296 196751 199479 201945 204375 207053 209669 211863 213736 215240 215721
55645 215721 214724 212744 210528 208059 204818 200712 196137 191462 186875 182498 178207 173656 168819 164180
55631 164180 160138 156605 153485 151031 149374 148169 147096 146273 145829 145524 145217 145166 145468 145642 145252 144508 143760
55614 143760 142822 141258 139040 136544 134227 132564 131810 131455 130464 128521 126491 125220 124480 123694 123056 123128
55598 123128 123806 124522 125155 125838 126077 125025 122686 120110 118229 117079 116241 115448 114613 113742 113075 112954 113390
55581 113390 114020 114599 115288 116317 117615 118961 120402 122402 125509 129810 134755 139643 144277 148974 153950
55566 153950 158939 163417 166937 169175 170039 169820 168920 167254 164303 159958 154948 150196 146082 142567 139644
55551 139644 137308 135324 133406 131500 129723 128170 126965 126188 125613 124775 123545 122360 121685 121500 121528 121683
55535 121683 122049 122630 123318 123960 124382 124576 124811 125241 125414 124694 123200 121737 120694 119645 118255 116862 115787
55518 115787 114755 113488 112260 111314 110249 108622 106704 105032 103615 102196 100952 100300 100238 100440 100727 100979
55502 100979 100875 100327 99836 99834 99958 99578 98769 98056 97449 96525 95354 94590 94592 95133 95967 97060 98199 99022 99568
55483 99568 100258 101194 101975 102302 102308 102152 101749 101048 100152 99062 97702 96341 95558 95563 95856 95779 95186 94428 93868 93520
55463 93520 93024 91959 90362 88919 88400 88846 89545 89797 89519 89095 88902 89038 89367 89770 90380 91431 92731
55446 92731 93602 93624 93185 92899 92637 91694 89898 87987 86761 86318 86370 86897 88063 89663 91069 91795 91936 91977
55428 91977 92272 92799 93379 93922 94339 94387 93856 92870 91738 90563 89359 88492 88507 89351 90270 90764 91191 92037 93048
55409 93048 93595 93616 93632 94017 94716 95538 96241 96444 95968 95244 94969 95320 95853 96117 96003 95541 94752 93785 92957 92589
55389 92589 92926 94009 95440 96522 96912 96962 97136 97387 97395 97018 96110 94347 91876 89727 88788 88589 87962 86743
55371 86743 85927 86063 86486 86416 86015 85923 86360 87084 87718 87868 87356 86625 86380 86580 86333 85098 83462 82325 81871
55352 81871 81841 82255 83274 84645 85873 86725 87143 86919 86046 85184 85206 86249 87599 88494 88685 88335 87758 87272
55334 87272 86929 86428 85598 84884 84924 85660 86293 86295 86023 86078 86350 86109 85018 83737 83428 84694 87022 89206 90313
55315 90313 90338 90004 89976 90296 90573 90598 90599 90810 90966 90502 89322 88129 87772 88337 89064 89189 88716 88333 88664 89635
55295 89635 90518 90641 90111 89730 90084 90863 91213 90653 89434 88118 87120 86652 86707 86962 86947 86503 85971 85814 86203
55276 86203 87053 88224 89509 90583 91242 91679 92306 93255 94135 94376 93785 92711 91704 91016 90477 89822 89079
55259 89079 88587 88622 89018 89217 88809 88075 87832 88551 89727 90412 90375 90334 90924 91816 92173 91732 91015 90566 90372 90060
55239 90060 89378 88395 87398 86675 86317 86218 86257 86375 86450 86314 86033 85968 86369 87055 87688 88154 88482 88664 88842 89393
55219 89393 90402 91279 91421 91091 91100 91649 92113 92057 91869 92094 92676 93225 93670 94190 94695 94860 94635 94364 94304 94289
55199 94289 94022 93603 93521 94084 94994 95690 96036 96419 97111 97828 98103 97848 97365 97060 97340 98471 100126 101323
55181 101323 101296 100341 99372 98715 97869 96505 95183 94774 95461 96554 97236 97336 97400 97941 98666 98697 97707 96486
55163 96486 96075 96705 97940 99497 101248 102675 103085 102485 101623 101081 100875 100931 101290 101632 101241 99824 97978
55146 97978 96626 96276 96858 97842 98399 97991 97000 96374 96550 97109 97451 97265 96340 94741 93253 92834 93367 93780
55128 93780 93685 93876 94740 95302 94743 93913 94164 95270 95770 95070 94008 93416 93254 93226 93279 93298 93139 93162 93950 95316
55108 95316 96332 96578 96668 97280 98380 99658 100989 102032 102101 101097 100058 100080 100999 101745 101739 101327 101006 100931 101177
55089 101177 101827 102578 102828 102538 102629 104035 106459 108521 109193 108778 108290 108169 107985 107308 106380 105676 105143 104365
55071 104365 103417 103034 103712 104999 106015 106440 106591 106594 106011 104535 102689 101453 101287 101836 102552 103219 103826 104322
55053 104322 104719 105138 105477 105296 104412 103412 103066 103277 103114 102061 100793 100420 101272 102700 103875 104482 104716
55036 104716 104906 105183 105327 104933 103845 102408 101217 100638 100619 100915 101404 102145 103133 104064 104514 104460 104440 105001 106044
55017 106044 106975 107410 107429 107199 106729 106059 105291 104369 103195 102134 101945 102906 104357 105419 105930 106344 106949 107614
54999 107614 108142 108519 108817 109118 109512 110020 110588 111300 112376 113772 114967 115450 115286 114920 114521 113899 112989 112079
54981 112079 111472 111188 111109 111252 111791 112835 114207 115430 116069 116148 116121 116362 116852 117367 117732 117717 117055 115864 114795
54962 114795 114363 114268 113798 112802 111847 111390 111246 111004 110658 110587 111085 112054 113066 113654 113644 113228 112648 111879 110820
54943 110820 109770 109432 110277 111968 113544 114135 113556 112377 111530 111683 112784 114154 115116 115614 116134 117017 118058
54926 118058 119047 120527 123519 128265 133687 138509 142669 147149 152656 159068 166042 173397 180708 187174
54912 187174 192247 195952 198286 198837 197335 194158 189869 184620 178454 171854 165481 159614 154276 149617
54898 149617 145684 142060 138331 134810 132227 130719 129606 128278 126893 126045 126004 126438 126834 127125 127845 129422
54882 129422 131391 132802 133534 134648 137088 140637 144687 149449 155522 162561 169346 175098 179925 183913
54868 183913 186632 187791 187641 186401 183831 179753 174574 168951 163240 157547 152114 147382 143733 141153
54854 141153 139013 136381 132895 129218 126251 124024 121897 119671 117762 116182 114188 111366 108451 106586
54840 106586 106146 106697 107742 109011 110226 111113 111618 111855 111835 111479 110801 109926 108932 107822 106631 105549 104892
54823 104892 104869 105293 105715 105977 106391 107079 107456 106901 105733 104870 104584 104305 103753 103524 104194 105503 106848 108084
54805 108084 109273 110100 110181 109823 109897 110928 112627 114357 115773 116947 118067 119103 119807 120013 119843 119469 118829
54788 118829 117856 116893 116440 116455 116364 115913 115618 116132 117480 119169 120785 122262 123781 125569 127658 129792 131821
54771 131821 134098 137048 140344 143136 145284 147786 151645 156855 162900 169631 177044 184494 190932 195822
54757 195822 199267 201252 201290 198965 194489 188629 182254 175989 170098 164596 159430 154523 149750 145139 141078
54742 141078 138002 135813 134024 132514 131660 131561 131676 131584 131553 131889 132239 132126 131863 132247 133522 135236 137077
54725 137077 139234 141973 145317 149254 153830 158960 164447 170205 176192 182071 187163 190779 192528 192458 191053
54710 191053 188851 185812 181331 175208 168328 161964 156610 151942 147736 144149 141125 138180 135000 131854
54696 131854 129199 127181 125704 124689 124093 123839 123851 124063 124359 124634 124928 125331 125785 126072 125950 125203 123696
54679 123696 121604 119477 117885 117081 117074 117710 118479 118569 117639 116353 115725 116001 116553 116783 116668 116449 116237 116026
54661 116026 115795 115526 115294 115271 115391 115244 114611 113916 113746 114133 114756 115595 116718 117631 117650 117031 116960 118168 120194
54642 120194 122225 123975 125318 125721 124723 122693 120570 118953 117765 116729 115845 115469 116010 117453 119135
54627 119135 120273 120730 120944 121107 120953 120480 120290 120816 121704 122377 122768 122972 122671 121557 120095 119092 118608
54610 118608 117994 117046 116404 116601 117309 117843 118000 117973 117822 117476 117036 116654 116171 115298 114182 113467 113666 114693
54592 114693 116081 117423 118437 118881 118714 118286 118038 118016 117926 117628 117301 117072 116903 116927 117493 118495 119093 118608
54574 118608 117469 116725 116721 116867 116732 116683 117152 117862 118185 117966 117532 117160 116885 116705 116627 116577 116544 116718 117257 118037
54554 118037 118862 119792 120904 121858 122106 121599 120965 120827 121197 121694 122149 122789 123878 125381 127005 128461 129639
54537 129639 130582 131338 131927 132432 133010 133733 134433 134815 134669 133946 132647 130841 128884 127507 127419 128667 130472
54520 130472 131846 132408 132501 132560 132580 132309 131740 131163 130800 130634 130594 130658 130705 130480 129828 128860 127777 126691 125679
54501 125679 124865 124313 123888 123431 123039 123058 123712 124821 125922 126685 127157 127583 128066 128534 128989 129601 130443 131264
54483 131264 131688 131607 131296 131211 131671 132582 133381 133521 133247 133619 135407 138075 140245 141120 141002 140488 139730 138773
54465 138773 138070 138194 139132 140310 141261 142004 142724 143344 143565 143296 142893 142817 143077 143158 142653 141812 141249 141263 141730
54446 141730 142509 143498 144274 144246 143350 142197 141277 140419 139341 138341 137899 137872 137596 136798 135887 135330 135118 134966
54428 134966 134676 134143 133331 132523 132401 133487 135458 137224 137840 137315 136508 136222 136505 136826 136844 136836 137350 138580
54410 138580 140200 141735 142964 143953 144788 145363 145481 145121 144553 144120 143979 144100 144415 144893 145500 146214 147040 147905
54392 147905 148630 149127 149534 149989 150385 150599 150848 151547 152768 154146 155372 156472 157455 157942 157409 155751 153535
54375 153535 151651 150689 150520 150578 150614 150947 151804 152761 153311 153731 154710 156173 157209 157374 157368 158100 159715 161928
54357 161928 164642 167607 169991 171099 171388 172086 173798 175982 177722 178567 178591 178094 177348 176395 175084 173424
54341 173424 171687 169939 167814 165139 162498 160661 159661 158955 158217 157394 156188 154315 152278 151061 150846
54326 150846 150719 149934 148806 148071 147974 148360 149068 149693 149509 148256 146688 145755 145494 145291 144988 145044 145659 146443
54308 146443 147061 147665 148422 149104 149408 149381 149174 148593 147334 145591 144131 143612 143996 144719 145319 145753 146129 146368
54290 146368 146282 145970 145855 146227 146859 147248 147215 147075 147170 147411 147444 147197 147076 147502 148405 149332 150005 150548 151108 151471
54270 151471 151264 150479 149585 149119 149290 149996 151020 152075 152758 152707 151935 150959 150447 150666 151345 152124 152976 154055
54252 154055 155279 156430 157616 159181 161031 162456 162871 162405 161451 160075 158347 156889 156322 156246 155556 153916
54236 153916 152270 151598 151795 152152 152381 152549 152406 151516 150030 148708 148044 147795 147535 147365 147782 149010 150662
54219 150662 152093 153008 153736 154864 156592 158499 159985 160788 160978 160566 159417 157592 155590 154022 152996
54204 152996 151948 150262 148158 146749 146934 148277 149366 149331 148659 148336 148634 149151 149689 150477 151549 152509 153031
54187 153031 153218 153241 153017 152484 151911 151642 151691 151844 152000 152153 152218 152187 152381 153182 154490 155747 156608 157286 158039
54168 158039 158659 158799 158604 158555 158707 158566 157908 157215 156900 156514 155347 153651 152512 152384 152533 152289 152122 152772
54150 152772 153865 154346 154078 153990 154500 154777 154023 152629 151433 150453 149193 147817 147125 147465 148430 149600 150853
54133 150853 151858 152090 151620 151201 151215 151165 150697 150488 151383 153029 154199 154330 153957 153563 152896 151846 151314 152462
54115 152462 155219 158167 160024 160875 161721 163135 164750 166010 166961 167994 169076 169759 169943 170126 170628 170999
54099 170999 170656 169855 169519 170095 171040 171532 171322 170743 170218 169945 169897 169916 169869 169809 169915 170338 171214 172760 175100
54080 175100 178010 181042 183948 186786 189687 192804 196403 200563 204687 207728 209133 209272 208785 207918 206733
54065 206733 205519 204531 203566 202267 200738 199513 198967 199018 199298 199343 198750 197499 196094 195161 194969 195581 197274
54048 197274 200343 204447 208541 211688 213818 215657 218045 221344 225411 230048 235452 242079 250082 259068
54034 259068 268503 278063 287460 296344 304749 313277 322305 331158 338648 344408 349179 353750 358112 361784
54020 361784 364486 366265 367355 368094 368665 368750 367784 365732 363220 360661 357650 353556 348385 342554 336055
54005 336055 328385 319361 309591 299982 291032 282773 275199 268541 263069 258796 255385 252344 249266 245972
53991 245972 242625 239727 237786 236711 235629 233607 230581 227366 224717 222652 220832 219273 218372 218280 218571
53976 218571 218572 217965 216960 215945 215081 214336 213804 213719 214066 214405 214330 213950 213631 213451 213240 213047 213117 213427 213714 214063
53956 214063 215000 216753 218818 220607 222214 224177 226686 229384 231831 233871 235660 237642 240449 244500
53942 244500 249600 255088 260387 265344 270141 275143 280809 287535 295440 304311 313748 323302 332679 342000
53928 342000 351848 362740 374470 386054 396415 405014 411830 417035 420910 423986 426886 429935 433139
53915 433139 436739 441535 448312 456959 466438 475673 484199 491958 498823 504598 509129 512155 513291 512496
53901 512496 510315 507299 503379 498256 492264 486330 481014 475941 470249 463297 454950 445503 435393 424755
53887 424755 413317 401050 388770 377651 368148 359807 352095 344860 337974 331148 324308 317725 311590
53874 311590 305879 300739 296444 292730 288685 283564 277369 270514 263527 257281 252709 249773 247193 243740
53860 243740 239481 235350 231954 229307 227316 225913 224941 224287 223885 223305 221848 219532 217463 216648 216846 217167
53844 217167 217304 217404 217216 216349 215201 214609 214540 214013 212474 210524 209086 208462 208448 208845 209621 210892 212740
53827 212740 214793 216168 216332 215839 215652 215929 216123 216098 216321 217014 217935 219060 220633 222487 224202 226073 228974
53810 228974 233020 237346 241619 246741 253486 261314 269213 276894 284389 291257 297190 302887 309318 316365
53796 316365 323064 328945 334288 339184 343281 346520 349404 352321 355076 357239 358558 359001 358728 358054 357095
53781 357095 355523 352966 349536 345596 341183 336099 330395 324282 317685 310450 302974 296023 289859 284061
53767 284061 278280 272641 267284 262066 256974 252373 248512 245129 241825 238570 235565 232862 230365 227996
53753 227996 225606 222987 220221 217825 216245 215277 214280 212885 211246 209641 208129 206724 205676 205336 205762
53738 205762 206628 207580 208476 209212 209470 209042 208346 208261 209213 210647 211646 211869 211611 211170 210618 210145 210218 211184 212911
53719 212911 214905 216632 217798 218535 219332 220590 222212 223816 225239 226526 227526 227935 227874 227993 228812 230200
53703 230200 231735 233311 235186 237660 240890 244798 248929 252617 255547 258050 260677 263627 266758 269894
53689 269894 272829 275256 277017 278300 279270 279601 278782 276844 274424 272143 270234 268755 267694 266778 265620
53674 265620 264284 263332 263066 263081 262886 262632 262757 263112 262991 262038 260678 259550 258917 258760 259066 259728 260398 260752
53656 260752 260817 260804 260722 260394 259805 259199 258787 258586 258584 258902 259640 260687 261812 262950 264275 265955 267847 269540
53638 269540 270757 271662 272646 273758 274536 274514 273858 273365 273842 275572 278263 281331 284210 286591 288548 290430
53622 290430 292584 295138 297933 300578 302676 304198 305638 307583 310107 312787 315416 318439 322442 327332
53608 327332 332334 336807 340839 344984 349654 354882 360445 365945 370842 374706 377539 379664 381182 381760
53594 381760 381082 379379 377251 375104 373077 371455 370687 370739 370779 369891 368038 366071 364803 364285 363916 363042 361389
53577 361389 359120 356617 354215 352155 350709 350092 350181 350530 350839 351238 351876 352469 352492 351737 350450 349113 348322
53560 348322 348570 349637 350424 349981 348679 347819 348099 349109 350333 351832 353667 355397 356711 357954 359477
53545 359477 360967 362090 363377 365635 368662 371390 373385 375450 378508 382434 386379 389810 392845 395831
53531 395831 399085 403064 408424 415596 424294 433627 442906 452263 462323 473310 484783 496321 508118
53518 508118 520639 534010 548003 562372 576904 591421 606070 621462 638165 656217 675381
53507 675381 695532 716400 737309 757788 778247 799300 820555 840884 860009 878975 898688
53496 898688 918661 937756 955668 973070 990545 1007875 1024409 1039778 1054302 1068825 1084051
53485 1084051 1099890 1115586 1130558 1144961 1159317 1173879 1188517 1202947 1216895 1230132 1242476
53474 1242476 1253594 1262808 1269517 1273836 1276465 1277755 1277344 1274915 1270766 1265276 1258276 1249452 1239019 1227475
53460 1227475 1215045 1201913 1188706 1176023 1163558 1150374 1136068 1121074 1105810 1090167 1073998
53449 1073998 1057516 1040853 1023781 1006222 988730 972110 956846 943120 931097 920792 911855
53438 911855 903862 896792 891011 886894 884637 884252 885435 887508 889781 892041 894531 897523 901104 905407
53424 905407 910785 917582 925778 934988 944841 955380 967052 980318 995304 1011761 1029245 1047253
53412 1047253 1065431 1083955 1103625 1125252 1148840 1173604 1198872 1224772 1251968 1281080 1312523
53401 1312523 1346538 1382903 1420748 1459155 1498072 1538393 1580957 1625612 1671360 1717349 1763554
53390 1763554 1810472 1858229 1906129 1953174 1998899 2043538 2087376 2130247 2171709 2211373 2248792
53379 2248792 2283331 2314547 2342578 2367807 2390145 2409049 2424269 2436132 2444819 2449637 2449347 2443205
53367 2443205 2431497 2415018 2394130 2368405 2337278 2301048 2261121 2219106 2175706 2130715 2084021
53356 2084021 2036392 1989190 1943548 1899900 1858092 1817770 1778765 1741239 1705458 1671428 1638867
53345 1638867 1607464 1576971 1547067 1517425 1488062 1459366 1431675 1405098 1379896 1356717 1336109
53334 1336109 1318000 1301859 1287269 1274059 1262167 1251685 1242869 1235651 1229194 1222341 1214553 1206080
53322 1206080 1197190 1187633 1177014 1165362 1153121 1140794 1128781 1117406 1106913 1097490 1089312 1082433
53310 1082433 1076667 1071834 1068169 1066192 1065987 1066844 1067859 1068779 1070117 1072615 1076849 1083132 1091462 1101485
53296 1101485 1112836 1125652 1140558 1157936 1177235 1197193 1216844 1236261 1256254 1277356 1299183
53285 1299183 1320763 1341327 1360665 1378781 1395449 1410209 1422719 1432974 1441020 1446483 1448615 1447121
53273 1447121 1442807 1436953 1429927 1420859 1408959 1394626 1378791 1361620 1342661 1322049 1300632 1278752
53261 1278752 1255830 1231530 1206603 1181966 1157581 1132928 1108161 1083903 1060041 1035646 1010324
53250 1010324 985057 961289 939534 919158 899251 879367 859579 840208 821616 804013 787294
53239 787294 771115 755326 740284 726515 714007 702106 690379 679299 669692 661652 654565 648139
53227 648139 642679 638138 633564 628026 621591 614753 607235 598068 586836 574173 561014 547797 534609
53214 534609 521615 509050 496996 485398 474213 463445 453121 443245 433794 424776 416342 408613
53202 408613 401293 393697 385428 376873 368759 361342 354313 347296 340123 332677 324897 316975 309290 302161
53188 302161 295827 290533 286356 283022 280172 277630 275163 272261 268699 265124 262515 261011 259831 258429
53174 258429 257130 256447 256250 255950 255221 254302 253704 253716 253989 253658 252148 249857 247692 245951 244117 241809 239378
53157 239378 237397 236016 235101 234601 234455 234422 234325 234266 234393 234660 234969 235290 235445 235049 233908 232353 231033 230422
53139 230422 230561 231066 231391 231314 231153 231321 231799 232403 233287 234573 235643 235641 234826 234532 235467 236816 237548 237816 238418
53120 238418 239490 240506 241169 241527 241516 241127 240851 241276 242288 243253 243863 244282 244563 244514 244091 243402 242358 240742
53102 240742 238641 236373 234053 231656 229423 227710 226495 225504 224773 224583 224854 225084 224934 224454 223705 222605
53086 222605 221260 220076 219483 219738 220906 222694 224429 225675 226744 228152 229711 230736 231048 231050 230810 229890
53070 229890 228319 227004 226681 227019 227197 226958 226587 226239 225831 225406 225074 224628 223605 221818 219647 217776 216715
53053 216715 216466 216576 216596 216536 216747 217362 218099 218662 219053 219361 219499 219380 219164 219135 219363 219593 219429 218699 217736 217253
53033 217253 217653 218505 218912 218369 217096 215678 214746 214840 216014 217541 218511 218870 219347 220270 221054 221219 221343 222480
53015 222480 224914 227913 230484 232018 232427 232090 231589 231238 230950 230699 230797 231443 232259 232627 232355 231741 231169 230889
52997 230889 230996 231296 231354 230962 230402 230054 229967 230066 230467 231236 232125 232945 233935 235287 236551 237094 236991 236958 237398
52978 237398 238094 238868 240005 241848 244355 247145 249660 251288 251765 251583 251561 251921 252124 251701 250833 249951 249197
52961 249197 248541 248073 247886 247856 247740 247310 246361 244932 243594 243011 243008 242584 241213 239638 238877 238842 238609 237790 236847
52942 236847 236113 235304 234234 233346 233079 233161 232996 232496 232095 232067 232227 232296 232264 232344 232725 233402 234119 234514 234441 234068
52922 234068 233575 232971 232404 232448 233634 235658 237470 238327 238442 238446 238568 238660 238730 238942 239177 239036 238430 237777 237475
52903 237475 237416 237193 236557 235491 234045 232303 230458 228725 227227 226132 225725 226093 226771 227052 226760 226560 227337
52886 227337 229347 231994 234244 235208 234598 232956 231391 230797 231186 231955 232746 233747 235073 236261 236775 236826
52870 236826 237179 238157 239342 240426 241865 244226 247200 249780 251442 252685 254314 256531 258862 260725 261809
52855 261809 262105 261828 261239 260387 259062 257065 254450 251394 247937 244024 239782 235567 231736 228476 225878
52840 225878 224011 222831 222131 221706 221511 221487 221316 220581 219262 217857 216862 216305 215991 215980 216452 217232 217893 218343
52822 218343 218822 219215 218913 217684 216233 215428 215332 215452 215631 216096 216725 216944 216442 215541 214807 214636 215211 216436
52804 216436 217897 219253 220584 221937 222694 222059 220182 218077 216322 214596 212756 211477 211306 211757 212010
52789 212010 212023 212261 212784 213260 213634 214011 214148 213762 213272 213527 214782 216488 218028 219087 219393 218837 217989 217765
52771 217765 218290 218643 218026 216711 215557 215012 214940 214958 214535 213149 210877 208692 207697 208047 208946 209647 210123 210757
52753 210757 211698 212719 213522 214057 214556 215297 216293 217234 217818 218122 218568 219535 221113 223197 225615 228049 230020
52736 230020 231198 231769 232267 232998 233799 234458 235071 235745 236228 236260 236150 236458 237064 237140 236316 235357 235209 235733 235881
52717 235881 234959 233213 231277 229551 228184 227253 226708 226302 225721 224772 223546 222454 221934 221983 222201 222449 223109
52700 223109 224346 225510 225856 225666 226007 227357 229100 230429 231148 231416 231356 231228 231490 232255 233031 233352 233326 233227
52682 233227 232890 231994 230762 229902 229837 230331 230854 231050 230785 230004 228703 227083 225668 225124 225702 226847 227636
52665 227636 227728 227702 228322 229708 231345 232690 233577 234192 234905 235938 237031 237591 237411 237086 237433 238619 240134
52648 240134 241471 242507 243201 243333 242749 241654 240440 239305 238197 237124 236383 236344 237044 238092 239036 239730
52632 239730 240270 240767 241424 242692 244958 247953 250817 252956 254673 256746 259480 262316 264234 264468 263056
52617 263056 260835 258739 256960 255002 252647 250488 249203 248601 247881 246705 245558 245014 245119 245628 246446 247530
52601 247530 248570 249116 249066 248845 249026 249788 250742 251272 251069 250328 249470 248772 248353 248370 249027 250254 251501 251971
52583 251971 251252 249815 248845 249332 251152 253144 254248 254471 254604 255103 255587 255461 254691 253729 252858 252002 251207
52566 251207 250905 251382 252142 252212 251180 249607 248288 247411 246719 246203 246093 246259 246138 245415 244392 243473 242660 241833
52548 241833 241223 241192 241636 241966 241750 241215 241018 241557 242492 242998 242609 241747 241163 240923 240390 239373 238772 239600 241673
52529 241673 243788 245121 245874 246564 247281 247942 248784 250141 251852 253300 254078 254356 254547 254894 255580 256969 259358
52512 259358 262400 265206 267236 268946 271226 274351 277784 280920 283549 285567 286678 286601 285306 282872 279425
52497 279425 275417 271616 268583 266309 264510 262962 261388 259484 257397 255837 255288 255383 255447 255334 255260 255063
52481 255063 254358 253306 252608 252642 253097 253575 254042 254624 255362 256381 257900 259881 261889 263470 264497 265170 265942
52464 265942 267424 269985 273370 276960 280422 283762 286795 288984 289899 289487 287863 285287 282343 279576 276813
52449 276813 273405 269292 265210 261571 257831 253524 249359 246577 245506 245441 245734 246265 246944 247495 247945 248735
52433 248735 250023 251299 252020 252315 252688 253211 253413 253033 252496 252426 252824 253087 252892 252759 253443 254940 256502 257568
52415 257568 258257 258860 259376 259830 260585 261928 263664 265609 268286 272587 278751 286137 294034 302226 310600
52400 310600 318535 324977 329066 330597 329968 327721 324086 319033 312803 306263 300445 295769 291933 288517
52386 288517 285472 283004 281293 280431 280446 281250 282620 284283 285991 287598 289215 291218 293927 297336 301314
52371 301314 305927 311257 316962 322375 327141 331454 335541 339164 341758 342958 342906 342203 341589 341425 341429 341034
52355 341034 340055 338847 337893 337483 337719 338450 339250 339911 340997 343386 347053 350886 354019 356853 360317 364604
52339 364604 369210 373816 378543 383624 389523 397064 406621 417305 427922 438760 451428 466618 483113
52326 483113 499621 516631 535482 556254 577766 599465 622138 646524 672116 697712 722504
52315 722504 746250 768930 790763 812253 833821 855526 877363 899483 921759 943443 963752
52304 963752 982667 1000685 1017836 1033444 1047025 1058961 1069994 1080252 1089110 1095918 1100508 1102887
52292 1102887 1102763 1099727 1093887 1085989 1076704 1066030 1053710 1040158 1026565 1014007 1002735 992484
52280 992484 983117 974720 967361 961213 956901 955300 956818 960981 966794 973507 981158 990527 1002470 1017075
52266 1017075 1033462 1050519 1067712 1085093 1102737 1120526 1138363 1156159 1173612 1190339 1206238
52255 1206238 1221336 1235238 1247226 1257087 1265384 1272626 1278541 1282559 1284542 1284466 1281640 1274978 1264151
52242 1264151 1249971 1233401 1214655 1193574 1170588 1146867 1123534 1100927 1078643 1056170 1033444
52231 1033444 1010925 989244 968806 949682 931781 915044 899601 885788 873919 863857 854929
52220 854929 846449 838270 830697 824036 818549 814711 812945 812983 813915 815132 816827 819250 821893 823983 825620
52205 825620 827804 831195 835312 839097 841951 844015 845756 847539 849450 851343 853167 855363 858708 863545
52191 863545 869272 874859 879795 884413 889298 894536 899475 903167 905076 905416 904643 902670 898891 893110 885992
52176 885992 878222 869637 859798 849198 839197 830697 823589 817631 813139 810360 808827 807969 807996 809543
52162 809543 812618 816547 820856 825599 830740 835817 840455 844755 848912 852742 855811 857855 858929 859417
52148 859417 860044 861553 864063 866933 869549 872124 875440 879956 885491 891748 898695 906203 913687 920549
52134 920549 927033 934312 943553 955051 968430 983548 1000851 1020836 1043486 1068461 1095636 1125160
52122 1125160 1157095 1191204 1227097 1264297 1302161 1340018 1377403 1413960 1449022 1481618 1511098
52111 1511098 1537588 1561484 1582537 1599747 1612337 1620717 1626271 1630141 1632392 1632456 1630258 1626525 1621936
52098 1621936 1616301 1608885 1599394 1588272 1576058 1562794 1548122 1531618 1512843 1491428 1467493 1441980
52086 1441980 1416266 1391352 1367503 1344711 1323345 1304191 1287887 1274529 1263902 1255949 1250745 1248186
52074 1248186 1248025 1250305 1255393 1263400 1273943 1286633 1301430 1318200 1336342 1355381 1375591 1397326
52062 1397326 1419934 1442048 1462946 1482892 1502025 1519732 1535440 1549342 1561891 1573079 1582670
52051 1582670 1590603 1596604 1599781 1599223 1594784 1586846 1575582 1561011 1543531 1523787 1501997 1477894 1451340
52038 1451340 1422665 1392554 1361924 1331764 1302645 1274508 1247272 1221457 1197693 1175843 1155249
52027 1155249 1135721 1117555 1100568 1083967 1067368 1051218 1035827 1020721 1005489 990733 977483
52016 977483 965930 955325 944994 934883 925212 916067 907445 899217 890946 882043 872300 862054 851693
52003 851693 841162 830113 818428 806388 794384 782601 771098 760039 749633 739850 730429 721336
51991 721336 712987 705794 699590 693821 688153 682448 676186 668490 659042 648551 637911 627226 616088
51978 616088 604578 593345 582696 572124 561005 549468 538369 528607 520676 514676 510478 507931
51966 507931 507050 508014 510855 515174 520318 525829 531651 537902 544526 551111 556903 561017 562887 562653 560976
51951 560976 558283 554303 548594 541482 534205 528068 523689 521179 520773 522941 527932 535483 545024 556005
51937 556005 568026 580823 594178 607787 621188 633866 645312 654834 661393 664011 662484 657537
51925 657537 650134 640747 629478 616793 603836 591818 581144 571433 562530 555317 551166 550524 552346
51912 552346 555107 558004 560842 563044 563440 561184 556403 549754 541731 532763 523717 515810 509973 506474
51898 506474 505057 505119 505705 505583 503649 499334 492729 484361 474800 464332 452967 440865 428715 417594
51884 417594 408365 401229 395868 391901 389156 387688 387780 389882 394222 400366 407344 414439 421700 429511 437794
51869 437794 445909 453185 459140 463251 465029 464528 462389 459214 455283 451110 447664 445498 444119 442878
51855 442878 442212 443157 445698 448499 450574 452420 454982 458061 460387 461000 459874 457203 452709 446061 437764
51840 437764 429259 421921 415960 410455 404610 398839 394375 391830 390470 389012 386913 384755 383591 384049
51826 384049 385868 388099 389794 390590 390620 389984 388620 386635 384426 382291 380202 378079 376044 374264 372809
51811 372809 371788 371348 371371 371458 371421 371513 372008 372798 373606 374274 374603 374325 373550 372931 372944 373263 373267 372884 372418 371779 370523
51790 370523 368604 366495 364507 362581 360861 359844 359711 359985 360199 360547 361494 363004 364520 365599 366216 366549
51774 366549 366755 366996 367483 368454 370181 372949 376909 382025 388243 395652 404327 414019 424129 434034 443278
51759 443278 451373 457539 460880 460933 457944 452525 445211 436485 427116 417995 409529 401470 393579 386206 379959
51744 379959 374958 370762 366972 363618 360969 359296 358872 359970 362687 366895 372355 378713 385347 391469
51730 391469 396540 400498 403525 405718 407128 407946 408445 408718 408628 408117 407457 407010 406677 405775 403662 400417 396681
51713 396681 392897 389056 385272 382106 379994 378545 376830 374375 371617 369475 368593 368938 369956 371191 372825
51698 372825 375297 378291 380579 381307 381060 381062 381634 382156 382409 382972 384078 384958 384804 383776 382527 381219 379566
51681 379566 377522 375325 373040 370596 368198 366257 364952 364187 363926 364245 365155 366680 369006 372182 375774
51666 375774 379224 382534 386172 390266 394332 397901 401004 403808 406125 407613 408231 408169 407510 406361 405329
51651 405329 405553 408013 412828 419245 426195 432764 438190 441656 442387 440082 435165 428475 420706 412238 403425
51636 403425 394805 386956 380260 374881 370847 368070 366375 365586 365496 365756 366029 366386 367363 369284 371645 373490
51620 373490 374407 374775 374982 374845 374120 373182 372676 372613 372308 371282 369770 368215 366648 364834 362727 360481 358228
51603 358228 356145 354589 353819 353655 353748 354182 355542 358372 362804 368746 376089 384529 393298 401258 407351
51588 407351 411021 412318 411606 409082 404657 398428 391162 384065 378025 373327 370122 368856 369986 373469
51574 373469 378867 385926 394779 405508 417746 430978 445185 460918 478647 498203 519000 540639
51562 540639 563020 586004 609375 633290 658419 685391 714240 744476 775357 805741 833890
51551 833890 857852 876086 887541 891329 886825 874206 854676 829904 801236 769332 734518 697619
51539 697619 660497 625515 594189 566561 542032 520415 501793 485815 471872 459872 450058 442042
51527 442042 434766 427685 421382 416611 413243 410538 408079 406033 404764 404559 405544 407552 410136 412849 415349
51512 415349 417189 417846 417123 415226 412348 408554 404181 399849 395787 391593 386991 382409 378416 374988 371803
51497 371803 368910 366686 365392 365194 366260 368260 370061 370538 369610 368064 366588 365509 365143 365607 366309 366333
51481 366333 365471 364288 363135 361718 359779 357539 355187 352496 349305 345932 342758 339796 337029 334822
51467 334822 333488 332631 331366 329248 326796 325109 325014 326380 328092 328824 328112 326695 325768 325947 326982 328282
51451 328282 329565 331075 333269 336339 340074 344210 348800 354077 360089 366705 373867 381548 389502 397326
51437 397326 404740 411438 416716 419768 420568 420068 419216 418060 416102 413263 410111 407250 404821 402505 399737
51422 399737 395991 391246 386290 382305 379947 378867 378201 377513 377115 377536 378849 380681 382735 384992 387338
51407 387338 389339 390699 391686 392764 393909 394731 395165 395576 396068 396199 395659 394864 394558 395040 396129 397713 400003
51390 400003 403295 407773 413606 421092 430633 442627 457308 474616 494342 516597 542164 572183
51378 572183 607322 647126 690246 735356 781823 829308 876609 921169 959991 990939 1012950
51367 1012950 1025272 1027029 1017734 997856 968801 932536 891260 846967 801037 754441 708406 664588
51355 664588 624349 588091 555542 526543 501345 480268 463255 449678 438487 428676 419723 411598
51343 411598 404399 398087 392495 387329 382284 377458 373495 370856 369020 367000 364669 362841 361862 360893 359056
51328 359056 356655 354667 353535 353051 352930 352786 351934 350024 347701 345952 345011 344571 344794 346162 348437 350731
51312 350731 352761 355157 358266 361524 364404 367198 370284 373233 375234 375964 375462 373604 370366 366363 362488
51297 362488 359079 355957 353082 350590 348241 345476 342167 338812 335825 333089 330510 328564 327853 328316 329320
51282 329320 330492 332090 334486 337654 341376 345666 350625 355932 360810 364531 366803 367665 367322 366239 365166
51267 365166 364812 365532 367346 370013 373004 375725 378079 380543 383301 385516 385960 384384 381780 379161 376523
51252 376523 373305 369553 366166 363972 362770 361490 359354 356779 354961 354524 354824 354749 353911 352731 351582
51237 351582 350369 348914 347269 345538 343741 342001 340536 339380 338395 337588 337079 336747 336333 335976 336172 337006
51221 337006 337885 338356 338762 339731 341318 343073 344691 346237 347898 349891 352464 355647 359043 362148 364833
51206 364833 367339 369937 372716 375506 377840 379241 379780 380115 380749 381507 381979 382100 381867 380833 378539 375336
51190 375336 372277 370141 368911 368136 367370 366280 364780 363161 361826 360878 360161 359598 359130 358519 357676 357091
51174 357091 357430 358649 359996 360968 361780 362746 363685 364152 363972 363363 362820 362921 363876 365159 365956 366110 366260 367040
51156 367040 368560 370711 373372 376068 378011 378881 379197 379578 380040 380300 380272 379837 378647 376695 374703 373323
51140 373323 372236 370610 368178 365297 362229 359149 356717 355742 356147 356946 357468 357991 358945 360128 361130 362082
51124 362082 363536 365823 368812 372124 375336 378179 380744 383363 386198 389154 392235 395602 399142 402360
51110 402360 404975 407316 409860 412613 415163 417090 418101 418080 417391 416862 417133 418127 419463 421073 423007 424863
51094 424863 426008 426311 426200 425979 425564 424924 424290 423790 423321 422938 422970 423503 424085 424243 424033 423848 423880 424058 424283
51075 424283 424448 424326 423709 422646 421409 420331 419788 420087 421182 422693 424473 426995 430864 436136 442502
51060 442502 450020 459133 469915 481800 494283 507487 521617 536049 549430 560770 570279 579148
51048 579148 588669 599560 611764 624569 636817 647290 655249 660700 663966 664905 662752 656930 647918
51035 647918 637125 625984 615357 605559 596509 587719 578598 568978 559201 549578 540030 530426 521035
51022 521035 512474 505407 500516 498433 499410 503063 508643 515417 522739 530078 537279 544570 552038 559379
51008 559379 566444 573663 581425 589371 596957 604558 613134 622778 632403 641162 649416 657821 666106 673414
50994 673414 679507 684943 690242 695442 700377 704880 708722 711815 714495 717252 720265 723656 728183 735146
50980 735146 745370 758622 774133 791339 809920 829593 850318 872546 896872 923482 952283
50969 952283 983624 1018585 1058370 1103599 1154365 1210839 1273423 1342217 1416593 1495613 1578737
50958 1578737 1665753 1755920 1847498 1938290 2026398 2110301 2188486 2259332 2321258 2372757 2412427
50947 2412427 2439366 2453587 2455888 2447394 2429407 2403540 2371572 2335014 2294911 2251983 2206795 2159904
50935 2159904 2112185 2064943 2019364 1975831 1934039 1893698 1854773 1817094 1780252 1743961 1708115
50924 1708115 1672257 1635424 1596778 1556093 1513529 1469337 1424126 1379033 1335200 1293152 1252892
50913 1252892 1214397 1177789 1143283 1111314 1082465 1056946 1034192 1013273 993604 975121 958026
50902 958026 942643 929253 917632 906887 896131 885271 874846 865247 856530 848848 842570 837817
50890 837817 834307 831788 830365 830269 831483 833621 836064 838292 840331 842795 846287 850852 856312 862814 870528
50875 870528 878941 887208 895328 904333 915036 927184 940296 954751 971424 990459 1011125 1032903
50863 1032903 1056304 1082488 1112387 1146254 1183856 1224981 1269929 1319578 1374962 1436922 1506252
50852 1506252 1583985 1671165 1768383 1875900 1994330 2124894 2268637 2425493 2594309 2773752
50842 2773752 2962891 3160726 3365306 3573510 3781534 3985293 4180309 4361583 4523871
50833 4523871 4662117 4771764 4849243 4892732 4902518 4880415 4828918 4751103 4651035 4533761 4404781
50822 4404781 4269664 4133843 4002074 3877793 3763209 3659866 3568564 3488564 3417408 3351853
50812 3351853 3288800 3225469 3159400 3088782 3012442 2929381 2838894 2741511 2639181 2533846 2426258
50801 2426258 2316831 2207202 2100015 1997223 1899533 1807661 1723223 1647848 1581889 1524561
50791 1524561 1475063 1433212 1399092 1372495 1352698 1338543 1328716 1322141 1318248 1316902 1317994 1320972
50779 1320972 1324753 1328201 1330713 1332180 1332356 1330638 1326701 1320992 1314197 1306425 1297363 1286991 1275584 1263042
50765 1263042 1248814 1232678 1215230 1197448 1180051 1163286 1146918 1130353 1113222 1095984 1079645
50754 1079645 1064827 1051625 1040405 1032058 1027034 1024735 1024406 1026246 1031023 1038913 1049430 1062503 1078956
50741 1078956 1099771 1125328 1155644 1191002 1232023 1279182 1332494 1391664 1456470 1526972 1603377
50730 1603377 1685817 1774315 1868791 1968811 2073270 2180596 2289390 2398670 2507388 2614017
50720 2614017 2716759 2813801 2902987 2981418 3045738 3092831 3120194 3126070 3109783 3072042 3014751
50709 3014751 2940698 2853693 2758681 2660955 2564905 2473651 2389659 2315062 2251036 2197274 2152416
50698 2152416 2114902 2083261 2055801 2030384 2004614 1976258 1943611 1905633 1861788 1811965 1756785
50687 1756785 1697852 1637272 1576720 1517176 1459593 1405407 1356094 1312523 1275090 1244286 1220614
50676 1220614 1203911 1193173 1187366 1186348 1190850 1201535 1218169 1239676 1264857 1292900 1323169 1354707
50664 1354707 1386246 1416710 1445511 1472300 1496697 1518418 1537501 1554218 1568932 1582186 1594703
50653 1594703 1606955 1618753 1629547 1639176 1648118 1657083 1666634 1677260 1689437 1703438 1719246 1736946
50641 1736946 1757093 1780568 1808016 1839483 1874442 1912118 1951882 1993439 2036501 2080308 2123719
50630 2123719 2165873 2206385 2244712 2279745 2310559 2337309 2360620 2379966 2393150 2397554 2391477 2374254
50618 2374254 2346067 2308400 2264406 2218059 2172885 2131682 2096908 2070349 2052236 2041370 2036392
50607 2036392 2036559 2041134 2048577 2056659 2063039 2065545 2062324 2052156 2034388 2008336 1973174 1928861 1876911
50594 1876911 1819725 1759351 1697276 1635102 1574550 1516559 1460939 1407310 1356157 1308706 1265909
50583 1265909 1227717 1193244 1161492 1131986 1104800 1080049 1057511 1036856 1018103 1001568 987441
50572 987441 975739 966663 960629 957787 957726 959785 963531 968911 976163 985638 997449 1011197 1026294 1042637
50558 1042637 1060715 1080944 1103204 1127179 1152764 1179811 1207827 1236416 1265815 1296401 1327577
50547 1327577 1357758 1385805 1412175 1438298 1464952 1491699 1517945 1544164 1571750 1601862 1634808
50536 1634808 1670638 1709917 1753558 1802096 1855496 1913609 1976406 2043778 2115560 2192025 2274021
50525 2274021 2362327 2457041 2557768 2663971 2774705 2888205 3002312 3115324 3225978 3332466
50515 3332466 3431900 3521031 3597262 3658749 3703848 3730952 3738983 3727749 3697709 3649618 3584675
50504 3584675 3504995 3413641 3314040 3209519 3103580 3000346 2904189 2818669 2746051 2687868 2645495
50493 2645495 2619756 2610303 2615867 2634980 2665834 2705397 2749239 2792487 2830572 2858963 2872923 2868418
50481 2868418 2843370 2797753 2732721 2650208 2553360 2446585 2334468 2220553 2107253 1996623
50471 1996623 1890750 1791297 1698978 1613748 1535497 1464405 1400718 1344376 1294935 1251715 1213874
50460 1213874 1180517 1151020 1125305 1103600 1085833 1071430 1059796 1050757 1044247 1039718 1036295 1033612
50448 1033612 1032179 1032716 1035376 1039912 1046386 1055244 1066624 1079960 1094455 1109680 1125374 1140820 1154825
50435 1154825 1166459 1175636 1182945 1189153 1195035 1201427 1209050 1218077 1228013 1238117 1247992 1257795 1267961
50422 1267961 1278781 1290206 1302010 1314152 1327017 1341371 1358029 1377537 1400093 1425794 1454872
50411 1454872 1487628 1524216 1564713 1609403 1658628 1712089 1768490 1826260 1884489 1942766 2000165
50400 2000165 2054993 2105684 2151439 2191658 2225255 2251025 2268308 2276598 2274655 2260765 2234158 2195781
50388 2195781 2147555 2091289 2028529 1961017 1890948 1820898 1753694 1692083 1638139 1592936 1556881
50377 1556881 1530234 1513196 1505627 1506843 1515597 1530092 1548079 1567153 1585050 1599751 1609480 1612689
50365 1612689 1608032 1594440 1571490 1539803 1500965 1456937 1409574 1360471 1310867 1261485 1212759
50354 1212759 1165356 1120175 1077723 1037774 999987 964682 932706 904709 880806 860858 844811
50343 844811 832812 825140 821887 822581 826307 832339 840349 849742 859177 867187 873019 876426 876941 874026
50329 874026 867860 859412 849715 839614 830134 822320 816461 812122 809217 808496 810563 814918 820415 826237
50315 826237 832000 837305 841851 845757 849214 851899 853255 853371 853163 853609 855102 857538 860728 864663 869551
50300 869551 875560 882365 889172 895552 902117 909957 919506 930390 942367 955806 971107 988129 1006555
50287 1006555 1026444 1048017 1071024 1094521 1117006 1136407 1150133 1155716 1151735 1138238 1116510 1088792
50275 1088792 1058115 1027784 1000381 977012 957538 941450 928429 918251 910547 904899 900941 898139
50263 898139 895617 892644 889346 886620 885162 884842 885160 886032 887859 891107 896200 903675 913972 927047
50249 927047 942491 960102 980026 1002311 1026582 1052271 1078941 1106228 1133583 1160184 1185141
50238 1185141 1207974 1229064 1249455 1269837 1289742 1307962 1323575 1336133 1344950 1348847 1346773 1338263
50226 1338263 1323154 1301434 1273699 1241397 1206359 1170401 1135478 1103440 1075035 1049586 1026199
50215 1026199 1004943 986169 969054 951761 933049 912998 892116 870555 848548 826915 806562
50204 806562 787786 770450 754622 740677 728871 719059 710726 703230 696216 689900 684677 680398 676279
50191 676279 671672 666596 661354 656027 650598 645216 639941 634487 628581 622391 616257 610285 604621 599839
50177 599839 596456 594098 591737 588874 585955 583568 581754 580287 579123 578222 577376 576595 576339 576958 578229
50162 578229 579846 582038 585150 588860 592536 596356 601346 608039 615741 623462 631093 639199 648032 657322
50148 657322 666820 676439 685892 694686 702592 709749 716287 722196 727636 732994 738666 745211 753757 765717
50134 765717 781849 802087 826562 856163 891572 932175 976584 1023958 1074091 1126347 1179337
50123 1179337 1231821 1283310 1333609 1382406 1429644 1475782 1521192 1565454 1607379 1645294 1676949
50112 1676949 1699642 1711120 1710479 1698031 1674608 1641314 1599674 1551464 1498321 1441816 1383814 1326344
50100 1326344 1271025 1218795 1170154 1125390 1084629 1047890 1015092 985822 959288 934846 912472
50089 912472 892389 874347 857824 842916 830425 820847 813763 808499 804945 803267 803099 803487 803581 803067
50075 803067 802037 800741 799423 798098 796440 794042 790830 787155 783524 780275 777339 774170 770080 764848
50061 764848 758999 753314 748156 743352 738560 733552 728270 722922 718025 714110 711351 709603 708799 709127 710752
50046 710752 713488 716817 720237 723726 727901 733519 740584 748074 754879 760953 767282 774741 783271 792199
50032 792199 801028 809700 818297 826706 834571 841496 847422 852839 858488 864695 871019 876662 881279 885447
50018 885447 890270 896406 903397 910160 916282 922668 930724 941151 953802 968458 985148 1003693 1023561
50005 1023561 1044418 1066373 1089339 1112586 1135346 1157680 1180346 1203906 1228257 1252812 1276689
49994 1276689 1298642 1317110 1330481 1337239 1335979 1325618 1305781 1276979 1240475 1198001 1151482 1102769
49982 1102769 1053536 1005399 959904 918107 880126 845283 812852 782720 755392 731405 710743
49971 710743 692848 677220 663856 652861 643743 635510 627563 620116 613630 608232 603930 600865 598875
49958 598875 597239 595481 594216 594560 596822 600419 605102 611442 619876 629861 640403 650976 661509 671730
49944 671730 680959 688422 693588 696419 697533 697898 698082 697927 697120 695758 694002 691308 686458 678470 667336
49929 667336 653913 639284 624274 609411 595250 582542 571880 563188 555873 549689 545181 543000
49917 543000 542960 544095 545623 547508 550135 553700 557995 562528 566698 570051 572619 575036 578235 582933 589365
49902 589365 597377 606664 616844 627465 638234 649332 661223 673879 686277 696983 705185 710950
49890 710950 714576 716090 715385 712424 707150 699512 689773 678522 666301 653538 640896 629167 618493
49877 618493 608146 597466 586736 576810 568173 560795 554585 549498 545398 542298 540582 540447 541321 542424
49863 542424 543867 546575 551011 556560 562388 568407 575140 582981 591901 601644 611950 622685 633833
49850 633833 645244 656378 666603 675742 684024 691379 697183 700879 702514 702384 700446 696447 690490 683026
49836 683026 674276 664028 652339 640273 629624 621637 616082 611785 608032 605141 603570 602955 602446 601753
49822 601753 601306 601559 602684 604986 608984 614748 621602 628846 636509 645005 654154 662944 670361 676284 681459
49807 681459 686566 691447 695380 698051 699919 701435 702252 701619 699325 695780 691266 685634 678735 670687 661672
49792 661672 651881 641605 630951 619515 607031 594346 583024 573809 566210 559830 555213 552797 551823
49779 551823 551089 550281 549774 549478 548845 547895 547483 548397 550733 554188 558532 563723 569936 577403 585840 594191
49763 594191 601444 607691 613904 620653 627493 633566 638284 641319 642471 641829 639759 636479 631857 625712
49749 625712 618177 609690 600777 591835 583046 574554 566859 560722 556352 552997 549795 546860 544942 544139
49735 544139 543669 543026 542725 543624 546020 549651 554093 558843 563323 567158 570326 573013 575708 579434 585253
49720 585253 593232 602363 611897 622260 634197 647428 660693 672846 683304 691615 697257 699953 699802
49707 699802 697041 692050 685540 678306 670701 662758 654890 648062 643047 639825 637885 636767 635997 634825
49693 634825 632536 629080 625082 621119 617233 613322 609841 607820 608092 610593 614522 619162 624506 631115
49679 631115 639494 649659 661279 674095 688114 703461 720153 737957 756195 773512 788081 798491
49667 798491 804553 807040 806712 803996 799640 795068 791611 789725 789459 791237 795327 800507 804110 803799 798897
49652 798897 789845 777124 761349 743927 726724 710934 696720 683996 673093 664457 658081 653518
49640 653518 650338 648401 647755 648392 650081 652393 654921 657396 659480 660552 659959 657671 654481 651325 648460
49625 648460 645405 641612 636899 631261 624735 617750 611361 606516 603044 599786 596019 592388 590094 589421
49611 589421 589513 589513 589359 589371 589572 589826 590394 591834 594293 597202 599831 601982 603946 605847 607279 607806 607671
49594 607671 607730 608581 609946 611079 611688 612286 613662 616095 619056 621661 623537 625229 627507 630232 632275
49579 632275 632782 632229 631911 632649 634377 636669 639209 641905 645116 649642 655916 663254 670512 677521 685233
49564 685233 694360 704534 715023 725482 735531 744186 750438 754133 755777 755713 753964 750699 746365 741384
49550 741384 736107 730949 726252 722080 718484 715882 714850 715502 717326 719641 722032 724366 726583 728548
49536 728548 730091 731296 732723 735075 738610 743134 748675 755761 764820 775694 788072 802104 818196
49523 818196 836417 856426 877752 899752 921479 941881 960069 975249 986799 994768 999929 1002990
49511 1002990 1004223 1004403 1005565 1009844 1017579 1027220 1036935 1045527 1051870 1054535 1052431 1045250 1032977 1015665
49497 1015665 994122 970263 946219 923286 901972 882577 865252 849737 835587 822664 811247
49486 811247 801792 794700 790042 787220 785136 782933 780518 778267 776480 775254 774543 774083 773518 772890 772804 773796
49470 773796 775702 777892 779961 781939 784033 786474 789494 793111 796960 800592 803910 807110 810303 813400
49456 813400 816264 818700 820348 820943 820613 819603 817675 814215 809166 803559 798722 795010 791581 787487 782811
49441 782811 778609 775881 774744 774550 774617 774801 775522 777449 781092 786622 794082 803728 815923 830555 846868
49426 846868 864269 883268 905135 930532 958873 989293 1021913 1057554 1096068 1135110 1170661
49415 1170661 1198719 1216698 1223677 1220008 1207148 1187819 1165712 1144388 1126225 1112426 1103700 1100474
49403 1100474 1102455 1108499 1117226 1127642 1139150 1151382 1164283 1178068 1192697 1207508 1221595 1234471
49391 1234471 1246116 1256460 1265090 1271479 1275313 1276523 1275087 1270878 1263766 1253960 1242202 1229373 1215848
49378 1215848 1201483 1186403 1171581 1158385 1147573 1138954 1131942 1126244 1121994 1119405 1118402 1118558 1119363
49365 1119363 1120494 1121774 1122942 1123630 1123524 1122327 1119618 1115055 1108811 1101558 1093857 1085810 1077381 1068721
49351 1068721 1059943 1050972 1042007 1033869 1027429 1022779 1019357 1016813 1015278 1014757 1014674 1014257 1013121 1011303 1008931
49336 1008931 1006028 1002554 998510 994050 989521 985295 981517 978109 975051 972566 971047 970828 971986 974188
49322 974188 976757 979101 981296 984175 988699 995137 1002869 1011033 1019390 1028509 1039086 1051223 1064511
49309 1064511 1078692 1093885 1110137 1127054 1144053 1160616 1176001 1188941 1198092 1202797 1203160 1199440
49297 1199440 1191783 1180650 1167207 1152984 1139213 1126521 1115211 1105644 1098339 1093632 1091209 1090034
49285 1090034 1088910 1087214 1085036 1082632 1079762 1075673 1069808 1062587 1055384 1049556 1045478 1042681 1040830 1040236
49271 1040236 1041369 1044227 1048375 1053301 1058457 1063273 1067482 1071248 1074575 1076736 1076702 1074139 1069708 1064445
49257 1064445 1059166 1054431 1050708 1048498 1048413 1051012 1056334 1063756 1072621 1082803 1094079 1105085 1113517 1117521
49243 1117521 1116514 1110716 1100603 1087054 1071384 1054732 1037762 1021245 1006449 994457 985456 979131
49231 979131 975446 974490 975778 978346 981598 985667 990937 997559 1005393 1014027 1022809 1031210 1039236 1047263
49217 1047263 1055491 1063893 1072540 1081523 1090442 1098524 1105494 1112012 1118892 1126219 1133568 1140877 1148668 1157494
49203 1157494 1167566 1178938 1191589 1205135 1218808 1232079 1245153 1258528 1272139 1285260 1297362
49192 1297362 1308691 1319774 1330574 1340491 1349104 1356513 1362899 1368222 1372605 1376674 1381179 1386463 1392698
49179 1392698 1400490 1410712 1423690 1439092 1456896 1478014 1503587 1533941 1568674 1607492 1650308
49168 1650308 1696433 1744125 1791043 1834667 1872258 1901228 1920375 1930628 1934117 1932680 1927746 1921385
49156 1921385 1916384 1914679 1916058 1918818 1921476 1923600 1925397 1927167 1929260 1932165 1936344 1942022 1949099 1957229
49142 1957229 1966103 1975849 1987090 2000362 2015472 2031557 2047687 2063352 2078474 2093286 2108162 2123369
49130 2123369 2138891 2154555 2170181 2185489 2200067 2213790 2227118 2240591 2254088 2267047 2279462
49119 2279462 2292164 2305943 2320845 2336668 2353836 2373400 2396482 2424128 2457625 2498475 2547975
49108 2547975 2607175 2677439 2760775 2858974 2971829 3095916 3225486 3355129 3481923 3604854
49098 3604854 3722097 3829018 3918700 3984067 4019694 4022852 3994100 3937083 3857140 3759609 3649189
49087 3649189 3530308 3407255 3283824 3163279 3048894 2944127 2851888 2773674 2709437 2658074
49077 2658074 2617920 2587117 2563837 2546244 2532335 2520141 2508390 2496843 2485752 2475046 2464219
49066 2464219 2452938 2441373 2429786 2418007 2405625 2392666 2379845 2367927 2356956 2346327 2335560
49055 2335560 2324707 2313970 2303293 2292625 2282325 2272865 2264289 2256383 2249350 2243754 2239689 2236564 2234070
49042 2234070 2232905 2233974 2237211 2241805 2247420 2254355 2262355 2270022 2275958 2280066 2283150 2285511 2286603 2286059
49028 2286059 2284426 2282587 2280880 2279118 2277164 2275109 2272903 2270168 2266523 2262071 2257567 2254045 2252110 2251524
49014 2251524 2251574 2251896 2252748 2254446 2256881 2259839 2263516 2268262 2273974 2280121 2286321 2292517 2298590 2304306 2309759
48999 2309759 2315380 2321231 2326671 2330919 2333694 2335082 2335135 2333951 2331830 2328995 2325331 2320752 2315605 2310378
48985 2310378 2305215 2300130 2295428 2291388 2287699 2283827 2279882 2276454 2273543 2270374 2266515 2262470 2258782 2255130
48971 2255130 2250809 2245607 2239632 2232686 2224540 2215647 2206880 2198634 2190826 2183731 2178099 2174241 2171692 2170116
48957 2170116 2169995 2171971 2175935 2181309 2187949 2196211 2206222 2217639 2230247 2244319 2260134 2277401 2295427
48944 2295427 2313820 2332834 2353007 2374477 2396666 2418678 2440105 2461464 2483773 2507734 2533453
48933 2533453 2560874 2590250 2621989 2656171 2692383 2730092 2769144 2809843 2852553 2897216 2943356
48922 2943356 2990549 3038751 3087993 3137877 3187727 3237341 3287310 3338369 3390548 3443127 3495271
48911 3495271 3546347 3595703 3642619 3686743 3728445 3768480 3807287 3844700 3880258 3913658 3944882
48900 3944882 3974050 4001225 4026377 4049568 4071115 4091491 4110884 4128936 4144972 4158438 4169019
48889 4169019 4176432 4180373 4180713 4177535 4170928 4161018 4148304 4133610 4117349 4099035 4077996 4054407 4029070
48876 4029070 4002105 3972604 3939960 3904950 3868802 3831491 3791727 3748636 3702750 3655217 3606721
48865 3606721 3557586 3508350 3459571 3411358 3363722 3317341 3273458 3232919 3195698 3161471 3130233
48854 3130233 3102072 3076632 3053219 3031463 3011646 2994287 2979532 2967094 2956745 2948670 2943217 2940367
48842 2940367 2939650 2940573 2943008 2947166 2953443 2962320 2974081 2988404 3004408 3021328 3038998 3057535 3076773
48829 3076773 3096355 3116219 3136625 3157663 3179074 3200555 3221975 3243267 3264406 3285547 3306894
48818 3306894 3328347 3349480 3369976 3389959 3409858 3430118 3450987 3472309 3493468 3513801 3533204
48807 3533204 3552159 3571233 3590737 3610889 3631865 3653625 3676086 3699563 3724608 3751139 3778158
48796 3778158 3804699 3830693 3856464 3881690 3905390 3926861 3946094 3963265 3978302 3991125 4001920
48785 4001920 4011005 4018594 4024772 4029324 4031452 4029894 4023567 4012049 3995389 3973788 3947704 3918029 3885748
48772 3885748 3851332 3814738 3776005 3735544 3693681 3650221 3604826 3557721 3509659 3461233 3412665
48761 3412665 3364415 3317480 3272631 3229626 3187721 3146959 3108401 3072992 3040591 3010297 2981308
48750 2981308 2953225 2925907 2899514 2874620 2851893 2831628 2813721 2798077 2784876 2774459 2767059
48739 2767059 2762616 2760699 2760632 2761711 2763363 2765210 2767125 2769148 2771136 2772626 2773346 2773862 2775289 2778334 2782924
48724 2782924 2788724 2795432 2802435 2808829 2814209 2818883 2822912 2825547 2826216 2825548 2824611 2823441 2821245 2817913 2814363
48709 2814363 2811331 2808731 2806501 2805189 2805142 2805747 2806135 2806282 2806853 2808225 2810259 2812872 2816221 2820232 2824388
48694 2824388 2828282 2832120 2836482 2841618 2847257 2853101 2859234 2865809 2872461 2878457 2883517 2888129 2892846 2897647
48680 2897647 2902359 2907295 2912901 2918985 2924898 2930430 2935835 2940888 2944627 2946344 2946351 2945489 2944305 2942960 2941392
$$ [...]
##END NTUPLES=NMR SPECTRUM
##END=
