##TITLE=AC1770_SANT_16_9683695_JZeJOlkGhm
##JCAMPDX= 6.0         $$ Bruker NMR JCAMP-DX V2.0
##DATA TYPE= NMR SPECTRUM
##DATA CLASS= NTUPLES
##ORIGIN= BRUKER
##OWNER= Administrator
$$ 1.72 TOPSPIN		Version 2.1
$$ 2016-04-16 20:49:42.517 -0700  Administrator@X
$$ Compression mode = diff/dup
##.OBSERVE FREQUENCY= 400.02188249412
##.OBSERVE NUCLEUS= ^1H
##.ACQUISITION MODE= SIMULTANEOUS (DQD)
##.ACQUISITION SCHEME= undefined
##.AVERAGES= 8
##.DIGITISER RES= 22
##SPECTROMETER/DATA SYSTEM= spect
##.PULSE SEQUENCE= zg30
##.SOLVENT NAME= COFFEE_meoh
##.SHIFT REFERENCE= INTERNAL, COFFEE_meoh, 1, 14.98509
##AUDIT TRAIL= $$ (NUMBER, WHEN, WHO, WHERE, PROCESS, VERSION, WHAT)
$$ ##TITLE= Audit trail, TOPSPIN		Version 2.1
$$ ##JCAMPDX= 5.01
$$ ##ORIGIN= Bruker BioSpin GmbH
$$ ##OWNER= Administrator
$$ $$ E:\/data/COFFEE/nmr/AC1770_SANT_16_9683695_JZeJOlkGhm/10/pdata/1/auditp.txt
$$ ##AUDIT TRAIL=  $$ (NUMBER, WHEN, WHO, WHERE, PROCESS, VERSION, WHAT)
(   1,<2016-04-16 20:49:35.329 -0700>,<Administrator>,<X>,<go>,<TOPSPIN 2.1>,
      <created by zg
	started at 2016-04-16 20:48:29.501 -0700,
	POWCHK enabled, PULCHK disabled,
       configuration hash MD5:
       21 0F 79 D6 B3 7B B4 F6 88 20 88 DB 03 48 BD 9F
       data hash MD5: 64K
       02 E7 C1 F4 7B E7 24 12 36 B6 F6 20 66 D6 7F 6B>)
(   2,<2016-04-16 20:49:38.423 -0700>,<Administrator>,<X>,<proc1d>,<TOPSPIN 2.1>,
      <Start of raw data processing
       efp LB = 0 FT_mod = 6 PKNL = 1 PHC0 = 0 PHC1 = 0 SI = 32K 
       data hash MD5: 32K
       84 0C EC 59 3E 18 70 A8 14 83 FA 4F B2 D3 78 F1>)
(   3,<2016-04-16 20:49:38.704 -0700>,<Administrator>,<X>,<proc1d>,<TOPSPIN 2.1>,
      <pk PHC0 = 92.02698 PHC1 = 0 
       data hash MD5: 32K
       74 2F 28 B6 B4 06 0A 76 0B BA 64 A3 6C BF 6C 5E>)
(   4,<2016-04-16 20:49:38.814 -0700>,<Administrator>,<X>,<proc1d>,<TOPSPIN 2.1>,
      <abs ABSG = 1 
       data hash MD5: 32K
       6F 94 49 40 C2 23 2F E9 C9 31 F0 69 5B 60 CF BD>)
(   5,<2016-04-16 20:49:38.876 -0700>,<Administrator>,<X>,<proc1d>,<TOPSPIN 2.1>,
      <abs ABSG = 2 
       data hash MD5: 32K
       99 F6 82 82 AA 7E D4 FF 13 FC 49 A3 9E EE 22 BA>)
(   6,<2016-04-16 20:49:38.939 -0700>,<Administrator>,<X>,<proc1d>,<TOPSPIN 2.1>,
      <abs ABSG = 3 
       data hash MD5: 32K
       41 FB 21 54 79 42 D6 3A 09 2F F5 F9 86 C4 F2 C7>)
(   7,<2016-04-16 20:49:39.001 -0700>,<Administrator>,<X>,<proc1d>,<TOPSPIN 2.1>,
      <abs ABSG = 4 
       data hash MD5: 32K
       33 27 35 EB CA 7E F5 7A 19 11 AF 89 A3 15 BF 8B>)
(   8,<2016-04-16 20:49:39.064 -0700>,<Administrator>,<X>,<proc1d>,<TOPSPIN 2.1>,
      <abs ABSG = 5 
       data hash MD5: 32K
       30 07 6B 49 67 BC DC B7 1B 88 E7 B2 E5 72 8A E5>)
$$ ##END=
$$ 
$$ $$ hash MD5
$$ $$ 4B 06 9B 3E CA 93 A9 B8 25 1E 2C 62 3A BB 59 5F
##$RELAX= 
##$RELAX= 
##$RELAX= 
##$RELAX= 
##$RELAX= 
##$RELAX= 
##$RELAX= 
$$ Bruker specific parameters
$$ --------------------------
##$DU= <E:\>
##$EXPNO= 10
##$NAME= <AC1770_SANT_16_9683695_JZeJOlkGhm>
##$PROCNO= 1
$$ [...]
150 150 150 150 150 150 150 150
##$TP07= 0
##$TPNAME0= <>
##$TPNAME1= <>
##$TPNAME2= <>
##$TPNAME3= <>
##$TPNAME4= <>
##$TPNAME5= <>
##$TPNAME6= <>
##$TPNAME7= <>
##$TPOAL= (0..7)
0.5 0.5 0.5 0.5 0.5 0.5 0.5 0.5
##$TPOFFS= (0..7)
0 0 0 0 0 0 0 0
##$TUNHIN= 0
##$TUNHOUT= 0
##$TUNXOUT= 0
##$USERA1= <user>
##$USERA2= <user>
##$USERA3= <user>
##$USERA4= <user>
##$USERA5= <user>
##$V9= 5
##$VALIST= <valist>
##$VCLIST= <CCCCCCCCCCCCCCC>
##$VD= 0
##$VDLIST= <DDDDDDDDDDDDDDD>
##$VPLIST= <PPPPPPPPPPPPPPP>
##$VTLIST= <TTTTTTTTTTTTTTT>
##$WBST= 2048
##$WBSW= 25
##$XGAIN= (0..3)
0 0 0 0
##$XL= 0
##$YL= 0
##$YMAX_a= 560042
##$YMIN_a= -479907
##$ZGOPTNS= <>
##$ZL1= 120
##$ZL2= 120
##$ZL3= 120
##$ZL4= 120
##$ABSF1= 14.98509
##$ABSF2= -5.573092
##$ABSG= 5
##$ABSL= 3
##$ALPHA= 0
##$AQORDER= 0
##$ASSFAC= 0
##$ASSFACI= 0
##$ASSFACX= 0
##$ASSWID= 0
##$AUNMP= <proc_prof1d_extract_pilot.lims>
##$AXLEFT= 0
##$AXNAME= <>
##$AXNUC= <1H>
##$AXRIGHT= 0
##$AXTYPE= 0
##$AXUNIT= <>
##$AZFE= 0.1
##$AZFW= 0.1
##$BCFW= 0
##$BC_mod= 0
##$BYTORDP= 0
##$COROFFS= 0
##$CY= 15
##$DATMOD= 1
##$DC= 0
##$DFILT= <>
##$DTYPP= 0
##$F1P= 0
##$F2P= 0
##$FCOR= 0.5
##$FTSIZE= 32768
##$FT_mod= 6
##$GAMMA= 0
##$GB= 0
##$INTBC= 1
##$INTSCL= 1
##$ISEN= 128
##$LB= 0
##$LEV0= 0
##$LPBIN= 0
##$MAXI= 10000
##$MC2= 0
##$MEAN= 0
##$ME_mod= 0
##$MI= 0
##$NCOEF= 0
##$NC_proc= -8
##$NLEV= 6
##$NOISF1= 0
##$NOISF2= 0
##$NSP= 0
##$NTH_PI= 0
##$NZP= 0
##$OFFSET= 14.98509
##$PC= 1
##$PHC0= 92.02698
##$PHC1= 0
##$PH_mod= 1
##$PKNL= yes
##$PPARMOD= 0
##$PPDIAG= 0
##$PPIPTYP= 0
##$PPMPNUM= 2147483647
##$PPRESOL= 1
##$PSCAL= 4
##$PSIGN= 0
##$PYNMP= <proc.py>
##$REVERSE= no
##$SF= 400.02
##$SI= 32768
##$SIGF1= 0
##$SIGF2= 0
##$SINO= 400
##$SIOLD= 32768
##$SPECTYP= <>
##$SREGLST= <1H.CDCl3>
##$SSB= 0
##$STSI= 32768
##$STSR= 0
##$SW_p= 8223.68421052631
##$SYMM= 0
##$S_DEV= 0
##$TDeff= 65536
##$TDoff= 0
##$TI= <>
##$TILT= no
##$TM1= 0
##$TM2= 0
##$TOPLEV= 0
##$USERP1= <user>
##$USERP2= <user>
##$USERP3= <user>
##$USERP4= <user>
##$USERP5= <user>
##$WDW= 1
##$XDIM= 32768
##$YMAX_p= 438234324
##$YMIN_p= -672535
##$CURPLOT= <Network HP LaserJet P1505>
##$CURPRIN= <$Network HP LaserJet P1505>
##$DFORMAT= <normdp>
##$LAYOUT= <+/1D_H.xwp>
##$LFORMAT= <normlp>
##$PFORMAT= <normpl>
##$SURQMSG= 1
$$ End of Bruker specific parameters
$$ ---------------------------------
##NTUPLES= NMR SPECTRUM
##VAR_NAME=  FREQUENCY,     SPECTRUM/REAL,   SPECTRUM/IMAG
##SYMBOL=    X,             R,               I
##VAR_TYPE=  INDEPENDENT,   DEPENDENT,       DEPENDENT
##VAR_FORM=  AFFN,          ASDF,            ASDF
##VAR_DIM=   32768,         32768,           32768
##UNITS=     HZ,            ARBITRARY UNITS, ARBITRARY UNITS
##FACTOR=    0.250966925370066, 1,           1
##FIRST=     8223.43324360094, 44049,        -179057
##LAST=      0,             89400,           -36988
##MIN=       0,             -672535,         0
##MAX=       8223.43324360094, 438234324,    0
$$ Real data points
##PAGE= N=1
##DATA TABLE= (X++(R..R)), XYDATA
$$ [...]
19564b00649j31321J53134k5505h4556C3647c9969p9661A02915R988h3334k75400
19553c58734F9752c06232e589A66019i6813c3372a2924n3590q2241G1003A2344
19541g4594g184I2352a96716e905D8620K83752a56709m2910g5804E52555d9149
19529b49480A46702b38366d9565F208K4217a64947J922p1969R5856f0019q8778
19518a48797A90896b35182g6000p7144A1108J24349a85549E7765b1338B37298
19507e4829o4788M3320E3685e7363G064J18867f2911b2542m205D46858I7695e8954
19494g9012E337J51071b46407I2358b27826A39308c80425J35429B9868A382e2674
19482b53425B50653a27747m5180k07422c8188m9094p9019N4664K5096G5258J19633
$$ y = [-200649, -331970, -178836, -204341, -84556, 33647, -39969, -119630, 102915, 112903, -83334, -358734, 69752, -306232, -5589, 166019, -96813, -33372, -12924, -66514, -148755, 71003, 12344, -74594, -7184, 92352, -196716, -5905, 48620, 332372, -156709, -199619, -75804, 552555, -49149, -249480, 146702, -238366, -49565, 6208, 30425, -164947, -163025, -234994, -139138, -60019, -148797, 190896, -235182, -76000, -153144, 11108, 135457, -185549, 57765, -21338, 237298, -54829, -119617, -76297, 53685, -57363, 7064, 125931, -62911, -22542, -26747, 446858, 97695, -58954, -79012, 5337, 156408, -246407, 92358, -227826, 139308, -380425, -244996, 29868, 1382, -52674, -253425, 250653, -127747, -172927, -380349, -38188, -87282, -166301, -111637, -86541, 75258, 194891]
19471A94891K27682e62236A7327a84654A45126n3119P1186c06973f3384A384J29811
19460A31195J2163n7929b92270B7M4632J27619G7275j3507J84464H5523a24818
19448b71437F1526P7087b1691k31311f2278D0502M3703R1795G2706a80921N2963
19437a27958A4702c1700O103A11054a46440d2193E5790a20372A08820a79564G0138
19425b11301A77624p9825b5230k54165i9953l8694C3776b17898j03672i5037a6989
19413d2758j7045B4241c73984A0328a98766C88753g937l2307A25635e5177a020
19401c2120j69063B6175b12256A88677E0259K99696l9418c8253K939A10255f0742
19389c35161a20486l9571K1714o8573h6516d2827k87257g0965B36993a15437A21572
$$ y = [194891, 422573, -562236, 17327, -184654, 145126, 92007, 163193, -306973, -63384, 1384, 131195, 143358, 85429, -292270, 27, 44659, 172278, 77275, 63768, 248232, 85523, -124818, -271437, 61526, 138613, -21691, -253002, -62278, 40502, 84205, 176000, 72706, -180921, -127958, 14702, -31700, -25597, 111054, -146440, -42193, 55790, -120372, 108820, -179564, 70138, -211301, 177624, 97799, -25230, -279395, -99953, -138647, 33776, -217898, -321570, -95037, -16989, -42758, -59803, 24241, -373984, 10328, -198766, 388753, -7937, -40244, 125635, -55177, -1020, -32120, -201183, 26175, -212256, 188677, 50259, 349955, 310537, -38253, -35314, 110255, -60742, -335161, -120486, -160057, -138343, -206916, -86516, -42827, -330084, -70965, 236993, -115437, 121572]
19377a55380J2417O8661j28054K3994r332e0628C1797J47777b86648E8152b16225
19365C93110p2126e18241E8932b18842Q9930A63868b61225A81117d443j76590
19355a81033L9367N8458A65721J47582f8707k71608b8314j24379D01147b03768
19344g812A13769L12438B0592J75486a43045N1636b8042j16637d4712j05119P1662
19333g8169j25866A04156J8765a1801A9927a13600k72356R9268A66569a30931
19322c54989a59757B07117c8624k9832b3916k51689G7651a88332K5409k46918
19312d09841A74335D7354f0773B98807d0289J5764A87320c12834a55409A09254
19301a75029N1435H1442J16213E6985K84341g430j0391j05656c2157q5490l9406
$$ y = [-155380, -142963, -74302, -202356, -178362, -187694, -50628, 31797, 179574, -286648, 58152, -216225, 393110, 320984, -518241, 58932, -218842, -128912, 163868, -261225, 181117, -4443, -181033, -141666, -83208, 165721, 313303, -68707, -340315, -28314, -152693, 401147, -203768, -7812, 113769, 426207, 20592, 196078, -143045, -91409, -28042, -144679, -44712, -149831, -78169, -204035, 104156, 122921, -11801, 19927, -113600, -385956, -286688, 166569, -130931, -354989, -159757, 207117, -38624, -68456, -23916, -275605, 77651, -188332, -162923, -409841, 174335, 47354, -60773, 298807, -40289, -24525, 187320, -312834, -155409, 109254, -175029, -123594, 81442, 197655, 56985, 341326, -7430, -17821, -123477, -32157, -117647, -157053]
19290a57053c4678m5687j90849E14399E5507J6786B1366b86062k3120g3328J6055
19279e7273A86780i2358j888A2321c19419a0556j37088J9306I6741b12683a0237
19267c47180h793j83573C6580a55761j5096P5299r2783F7309J22420D1598c2450
19255a46031K4608k1614M8101F2184e9445B3386O017b51792A32894f8539q6969
19244a55508k9826j99993a65634K5713M6286j58697j9205a15705A9526K09839
19234B29365B8666a2342j29953A98165E6010b21878m0453h5333q0476P7418C1383
19222a08758K5463K0301m6878j2225E4347Q8633E28N656c69776J66626F64b61316
19209B57254c61937A64161p1134b3003C06753f4126D1934c11756A52376a03788
$$ y = [-157053, -34678, -80365, -271214, 514399, 55507, 72293, 21366, -286062, -309182, -73328, -57273, 186780, -92358, -94246, 12321, -319419, -10556, -147644, -128338, 96741, -212683, -10237, -347180, -8793, -192366, 36580, -155761, -170857, -95558, -188341, 67309, 189729, 41598, -32450, -146031, -121423, -143037, -94936, 62184, -59445, 23386, 29403, -251792, 132894, -68539, -155508, -185334, -385327, -165634, -139921, -93635, -252332, -271537, -115705, 19526, 229365, 28666, -12342, -142295, 198165, 56010, -221878, -262331, -85333, -165809, -88391, 31383, -108758, -83295, -62994, -109872, -122097, 54347, 142980, 528, 6184, -369776, -203150, 664, -261316, 257254, -361937, 164161, 93027, -23003, 306753, -64126, 41934, -311756, 152376, -103788]
19198i63E7787L03083b34618A17838E251a87754C02892a59261a8220A8243J38747
19187A56990d62915a09615A33989c19j15469c9385j79591K8237G0204a11716o2982
19176a74698G2568n917K36190e9439C53335A01059b669m7733r7156C0729a08667
19164c57570a25751C1348P7634b17553a1171B1476a91285J3056j28609C3322A2226
19152c1692B0102b84299C19009a29262d0689j42023g1357j40607N1444j44354
19142c04874O1729Q1868e5685q2340o4855i9309A06139J675h6884k9993I780e7869
19129b79509I3805f8665k83114n096C7454g3836j49515j48897i0538j1459j8770
19118a20767j37179J20988a0017j79395D1579f7287K4553A63661c05826a14009
$$ y = [-963, 57787, 360870, -234618, 117838, 5251, -187754, 302892, -159261, -18220, 18243, 156990, -462915, -109615, 133989, -319, -115788, -39385, -218976, -190739, 70204, -111716, -174698, 72568, 66651, 302841, -59439, 353335, 101059, -2669, -50402, -147558, 30729, -108667, -357570, -125751, 31348, 108982, -217553, -11171, 21476, -191285, -178229, -306838, 33322, 12226, -31692, 20102, -284299, 319009, -129262, -40689, -182712, -71357, -211964, -160520, -304874, -243145, -161277, -55685, -138025, -202880, -99309, 106139, 107814, -86884, -116877, 9780, -57869, -279509, 93805, -68665, -351779, -356875, 37454, -73836, -223351, -372248, -90538, -101997, -120767, -257946, -136958, -10017, -189412, 41579, -67287, -42734, 163661, -305826, -114009]
19107b58892i4235j51615F9099h9998k88996H0831b70404A00514b22920C90792
19096a74056m0383M5906B00762K37748j66885h9679j10301Q6419j96729O1997
19086b48293A86644q7256a907E2569a67505K0978a1013l34062J48212B05217b18272
19074h0371A45396B1553N2245j9543d7987k07641G3774d3680b479j66649M3067
19063a26061e3566m5491q9715E3793K4608b50959n4335c6342j16089a7180j80479
19052a97659A33797d0301A08943E0173e6055l5779b8919B56266b39196E283P5904
19041H1187e1655k31830M861A20780d3190C74853a50888q2543B36964J36461a55688
19029a86729D8639g6510D8844K17752A13031g8085q7274B29782e3250A55056n2069
$$ y = [-258892, -94235, -245850, 69099, -89998, -378994, 80831, -270404, 100514, -222920, 390792, -174056, -214439, -168533, 200762, 438510, 271625, -89679, -199980, -113561, -310290, -248293, 186644, 99388, -1907, 52569, -167505, -146527, -11013, -345075, -196863, 205217, -218272, -80371, 145396, 21553, 73798, 54255, -47987, -255628, 73774, -43680, -2479, -169128, -126061, -53566, -99057, -188772, 53793, 78401, -250959, -305294, -36342, -152431, -17180, -197659, 133797, -40301, 108943, 50173, -56055, -91834, -28919, 256266, -239196, 5283, 81187, -51655, -283485, -278624, 120780, -43190, 374853, -150888, -233431, 236964, 373425, -155688, -186729, 48639, -76510, 48844, 266596, 113031, -78085, -165359, 229782, -53250, 155056, 102987]
19018A02987d2892o5173k9010M2577E5648b58777J02258A47306Q5188D7569d15083
19006A185J34724c00452A62869a35406p955B6700a25555H4594b00584D3180J1902
18995E5082L6928b12624A20515L2293a32671d77D45404D2911b03547b954j79131
18984a82085L7976L2405B53371f8912c2744A28402Q9465a50409r1614A19013b23757
18972D8952b2871m22814A1594c6180A47364c38170c9381r8231B43007c1428J4190
18961a7238k12628E7096b67619a0686n8516A83866d23355J73011G81a23852e9545
18949a65712A57025i9626k8163A38735b54361e0713C1239b05608A40132d49121
18938B5016b06548A49297F4737a08692A67559b59082A06316C2723b44538C6775
$$ y = [102987, -42892, -108065, -137075, -94498, 55648, -258777, -156519, 147306, 232494, 47569, -415083, 1185, 135909, -300452, 162869, -135406, -143361, 26700, -125555, 84594, -200584, 43180, 55082, 92010, -212624, 120515, 152808, -132671, -477, 445404, 42911, -203547, -2954, -182085, -144109, -111704, 253371, -68912, -32744, 128402, 217867, -150409, -242023, 119013, -223757, 48952, -22871, -445685, 11594, -36180, 147364, -338170, -39381, -137612, 243007, -31428, -17238, -229866, 57096, -267619, -10686, -69202, 183866, -423355, -250344, 781, -123852, -59545, -165712, 157025, -99626, -127789, 138735, -254361, -50713, 31239, -205608, 140132, -449121, 25016, -206548, 149297, 64737, -108692, 167559, -259082, 106316, 32723, -244538, 36775]
18927h2592I1211B2181b76384j85865a59790B76173c1319q8486o7943e0152A77903
18915A1538R2432P539b08149f8752j70653b49A16870b12286A68306C4544Q237
18904D2781J09794a47100G3334J6299R7555g990B09580G3434C2442P8440a03129
18892A94028B8676a02186B05615A2410e5240j82796E522a23304d2734j1171n8601
18881a12506o0670m2504d473j20636q3570R0497k3773e2102J4549j61570c8310
18869A90112c07887g9076C18514b26860f2370A18873l8154c99890a68105q1036
18859b49141J10330P658n1446C01179N5975f4652A71774H2774R1216j3441a02789
18847A51071D7783a66387j76196F7599J25290b04803A83859a10434e0355j9570
$$ y = [-82592, 91211, 22181, -276384, -462249, -159790, 276173, -31319, -119805, -187748, -50152, 177903, 11538, 103970, 111509, -208149, -68752, -239405, -249, 116870, -212286, 168306, 34544, 42781, 152575, -147100, 73334, 89633, 187188, -7990, 209580, 73434, 32442, 110882, -103129, 194028, 28676, -102186, 205615, 12410, -55240, -238036, 5522, -123304, -42734, -53905, -112506, -173176, -215680, -4473, -125109, -208679, -118182, -141955, -52102, -37553, -199123, -38310, 190112, -307887, -79076, 318514, -226860, -62370, 118873, 80719, -399890, -168105, -249141, -138811, -131153, -182599, 301179, 357154, -64652, 171774, 82774, 173990, 160549, -102789, 151071, 47783, -166387, -342583, 67599, 192889, -204803, 183859, -110434, -50355, -69925]
18837f9925j17088o3074B9140A1407a50605b1642n9253p969q178A80810b15052
18825b99444M1795Q6263A12681R9263F9915e5400j07082a370j44525l603c6694
18813C41871a07368A94488O8413g1589j33900P1589F4885k0080a54973A64776
18802h987A26988A5568a50578f2900j20285C38056h0160k37182D6154a13014E4191
18790H0265a13929A15250E1e1237a713k01183C01767b88524O0074p8519l7436
18779c44405a31629A31783j4553a66780A03987b6272G7234J63370a40975A67243
18768A84753I433f4324k16089j64463h4140c2906c238k6064F031M6706K23189
18757B75926K09005A42108c44546C12625b1061A53500L8833d33071A3595b5359
$$ y = [-69925, -187013, -250087, 29140, 11407, -150605, -21642, -80895, -88864, -97042, 180810, -215052, -299444, -257649, -171386, 112681, 211944, 69915, -55400, -162482, -1370, -145895, -149498, -36694, 341871, -107368, 194488, 262901, -71589, -205489, -133900, 64885, 44805, -154973, 164776, -8987, 126988, 15568, -150578, -62900, -183185, 338056, -80160, -317342, 46154, -113014, 54191, 80265, -113929, 115250, 51, -51237, -1713, -202896, 301767, -288524, -228450, -306969, -344405, -131629, 131783, 117230, -166780, 103987, -26272, 77234, 240604, -140975, 167243, 184753, 9433, -64324, -280413, -444876, -84140, -32906, -3238, -29302, 6031, 52737, 275926, 484931, 142108, -344546, 312625, -21061, 153500, 192333, -433071, 13595, -25359]
18746a5534p5745k534D6555R2257o1744A3820J2810b13306d9834B768b58487g3725
18733c06179D81136I3020a68820A48189b81108c1790B627d60742D1167Q2024f3809
18721A18048i6041c9146k19035A1055a83086A53165a40832n9910a2875l47722
18711c60597a25259j34210J01205A24928a2129l11743F6166b06576d2474q1701
18701a24175C8511A257J45271A5819M2027Q664b88121F5867a68268K0532l2824
18690a80560r6756l1822I0451O5293c50065A06040K6191i9977j68888i04j96975
18679a97879j44347M7936A89719b54827b6485l3532F7142J85552a62440q089A59526
18667a01714j95204B41432p0388L4774b01828c9248k07119A51276d4049j01893
$$ y = [-15534, -91279, -93813, 46555, 138812, 77068, 13820, 26630, -213306, -49834, 2768, -258487, -73725, -306179, 481136, 93020, -168820, 148189, -281108, -31790, 2627, -460742, 41167, 123191, -63809, 118048, -96041, -39146, -258181, 11055, -183086, 153165, -140832, -200742, -12875, -360597, -125259, -259469, -158264, 124928, -12129, -323872, 66166, -206576, -42474, -124175, 38511, 1257, 146528, 15819, 57846, 66510, -288121, 65867, -168268, -147736, -180560, -277316, -309138, 90451, 155744, -350065, 106040, 132231, -99977, -268865, -904, -197879, -342226, -294290, 189719, -254827, -26485, -60017, 67142, 252694, -162440, -170529, 159526, -101714, -296918, 241432, 171044, 205818, -201828, -39248, -246367, 151276, -44049, -145942]
18657a45942j44204B5637O9691c05073J17481e8277B06146d9884a1253n7716l3879
18646a02848R858A3084Q9023b56998B85802A17713a54502l0895N4160d5697r353
18635e5050p657q9733j28878A11270J72374D8381a08266b5491j07826a0008n12118
18624e22126e4082B50967L0439g7502g561D2084b98710a04485D36941A98P7191
18613G7389g9913A19709a93779R5268B32197c06340a35766J3968N348A38632a25018
18601a287n48622D4372b07940B4376P502d4177A817a7934r0902m0896C5054K15047
18589B50101a17485k39146i0165n8730q2459j15458a27666E4778A6488O0684M8055
18578A25227m0127b27192E1344J09605D0831j05d5875j80040j6442A31026a110
$$ y = [-145942, -290146, 25637, 95328, -305073, -187592, -58277, 206146, -49884, -11253, -68969, -102848, -92990, 13084, 102107, -256998, 285802, 117713, -154502, -185397, -131237, -45697, -55050, -62707, -152440, -281318, 111270, 283644, 48381, -108266, -25491, -133317, -10008, -522126, -54082, 250967, 281406, -77502, -7561, 42084, -298710, -104485, 436941, 198, 77389, -79913, 119709, -193779, -98511, 232197, -306340, -135766, -121798, -116450, 138632, -125018, -1287, -549909, 44372, -207940, 24376, 31878, -44177, 1817, -17934, -108836, -149732, 35054, 250101, -117485, -356631, -90165, -148895, -231354, -346812, -127666, 54778, 16488, 77172, 125227, 85100, -227192, 51344, 160949, 40831, 40726, -45875, -225915, -242357, 131026, -1110]
18566b37456a13032J6227A49154L9026g2720j95350b495A36501f9623j35583g7317
18554c8085r7098M6295I3020b70898C0704a64717j0101P4202l61508I0042a08812
18542B22902a18399j31099A39547c22190a43509q6774M458l34719D6570Q2030
18532A28600J632C1339b65615A43703N3038c36978h3101E74736i1057L5173j3748
18521f9632m3295l09785a22133b6176l01693A54143m8945a23077j11233h6037
18510A73261h0335b2786M379k7751G1071j7999K50377A20036D4190M048a41961
18498a07695J4126A17768g2095a9916k6739j46687f6078G6616c4408G8468J32942
18487B11410a09167n7844d1851j96703g1806A07081O6522a49543f7244o4981K2219
$$ y = [-237456, -113032, -96805, 149154, 188180, -72720, -268070, -2495, 136501, -69623, -205206, -77317, -38085, -135183, -88888, 93020, -270898, 30704, -164717, -174818, -100616, -462124, 90042, -108812, 222902, -118399, -249498, 139547, -322190, -143509, -230283, -225825, -560544, 46570, 128600, 130232, 31339, -265615, 143703, 196741, -336978, -83101, 574736, -91057, -55884, -69632, -112927, -422712, -122133, -26176, -327869, 154143, 105198, -123077, -234310, -86037, 173261, -80335, -22786, -18407, -46158, 71071, 53072, 303449, 120036, 44190, 48238, -141961, -107695, -93569, 117768, -72095, -19916, -46655, -193342, -66078, 76616, -34408, 78468, 211410, -109167, -167011, -41851, -238554, -71806, 107081, 173603, -149543, -67244, -132225, -110006]
18476a10006A31113b58822A80333a80722g5090C0879a43951A60593O2290e07010
18465g4145j05259n1622e6138j98684g5738b6688A09389a58833B4872e8664r9005
18454a57669b4327j8735C86254c64186A03265C356b98310c5097L594E1102h6550
18442g1982k74803e1788l7533d4330I7536M0475a8385m77891H1313a08380j502
18431a09882j31483A46676A1989a66216I4294c1201j36770q050A11990a34539
18420d1114m47259d5865j99949a21146H6361c01182C01883d67689D475J28114
18410A32589K7869a30529A9326K89811b25287A98263J81103A9309N2015b67035
18399a79309H9734i6155k90548B13521I8318l0385A8455E364h8036d587j79822
$$ y = [-110006, 131113, -258822, 180333, -180722, -75090, 30879, -143951, 160593, 222883, -507010, -74145, -179404, -231026, -56138, -254822, -75738, -26688, 109389, -158833, 24872, -58664, -157669, -24327, -43062, 386254, -364186, 103265, 3356, -298310, -35097, -31503, 51102, -86550, -71982, -346785, -51788, -89321, -44330, 97536, 138011, -18385, -496276, 81313, -108380, -109882, -241365, 146676, 11989, -166216, 94294, -31201, -167971, -176021, 111990, -134539, -41114, -488373, -45865, -245814, -121146, 86361, -301182, 301883, -467689, 4475, 132589, 160458, -130529, 19326, 309137, -225287, 198263, 379366, 19309, 71324, -267035, -179309, 89734, -96155, -386703, 213521, 98318, 67933, 18455, 5364, -88036, -4587, -184409]
18388a84409F1220d28532A3963k591L3083b8477e40A15468a0360A40826f4892
18376a70439E3644a50649A71320b86006a9884A09719a11181A24319c94953B15145
18365A22710j1949A1441c49784G5095A2467b55962c3784k3142k0127p0114C3338
18353a09128m0776F0086c5733l09453D3519b14642C31152G1557B460P1352f8466
18341B1965b6640j68113B50434r7095d2326A9267h3432I464N3508P7308f0489
18329B6099O1738c12318I114b37595k7823l070a10890k15599A93079d6630A1708
18317E0916b26857N5900f491A26280J26879c36091a8320B3802g9169A5625b98307
18305D9744L3009b27284B842a40586A55876a95512i6750A93969b59642n8995c4279
$$ y = [-184409, 61220, -428532, 13963, 11372, 44455, -28477, -540, 115468, -10360, 140826, -64892, -170439, 53644, -150649, 171320, -286006, -19884, 109719, -111181, 124319, -394953, 215145, 122710, 110761, 11441, -349784, 75095, 12467, -255962, -33784, -56926, -77053, -147167, 33338, -109128, -149904, 60086, -35733, -345186, 43519, -214642, 331152, 71557, 2460, 73812, -68466, 21965, -26640, -194753, 250434, 153339, -42326, 19267, -83432, 9464, 62972, 140280, -60489, 26099, 87837, -312318, 9114, -237595, -265418, -268488, -110890, -326489, 193079, -46630, 11708, 50916, -226857, -170957, -6491, 126280, 253159, -336091, -18320, 23802, -79169, 15625, -298307, 49744, 82753, -227284, 2842, -140586, 155876, -195512, -96750, 193969, -259642, -318637, -34279]
18293b25909D9755b30332F0841c60121E52d1005o3173B04813I4378a77766F3324
18281e6243q2715B11010b7771j94567g056H4648b29960l0642N2419Q9159k11882
18270c30906c5391H2100f9140j56284c3653B76513o1443c386a605A69918A0787
18258h1317E3857j4261A092b63496a14206n7537c8110E8090R2985o9312i4841
18246B24873a12326L2971a8623k2630O697k01829E9261A9113c74647A66010C5580
18234C55208C3805L28864i8712B28286g7382o3837d7291C479J22925n9271l3446
18223C3687J05836D2975J39335b11155J0102K3836H90M9942Q5314a52609B8190
18211B9271g1911D9599e13882K02209F5523b19065c67A09059l8050a41457A64909
$$ y = [-225909, 49755, -230332, 60841, -360121, 552, -41005, -104178, 204813, 94378, -177766, 63324, -56243, -138958, 211010, -27771, -222338, -7056, 84648, -229960, -260602, -208183, -119024, -330906, -35391, 82100, -69140, -225424, -33653, 276513, 215070, -3386, -1605, 169918, 10787, -81317, 53857, 39596, 1092, -263496, -114206, -171743, -38110, 58090, 151075, 81763, -94841, 224873, -112326, -79355, -18623, -41253, -34556, -236385, 59261, 19113, -374647, 166010, 35580, 355208, 33805, 362669, -98712, 228286, -77382, -141219, -47291, 3479, 126404, 67133, 33687, 139523, 42975, 182310, -211155, -201053, -177217, 890, 50832, 136146, -152609, 28190, 29271, -71911, 49599, -513882, -311673, 65523, -219065, -367, 109059, 71009, -141457, 164909]
18199I2993a96387c8718n5389A30399a53104D814J29495f6889C5734b36521B38817
18187E0637J33344K582c9351A47425n7490B395a03041E03593b26229G6130e21872
18175D8628c18069b4590k91786J11008f7387E6472b40231A57023j3098a20003
18164D8250a47213C3986a95874A8134a44868L7211j20784J03373A86528a54930
18153H9111A9334K21612j02783b42748L6545J9962a5088r7487o6351A4653a11310
18141A27626L3347o7379J34096M9914c5222A00830O2256g2834L0946A85277O7763
18130B53040d1987A43238b66506b3875B27534Q1129E0573L23328d8428B362a41130
18118f5460l7831J2421M4652k33772h3668A54669E2221b58216K8656f266j23908
$$ y = [92993, -196387, -38718, -94107, 130399, -153104, 4814, 134309, -66889, 35734, -236521, 238817, 50637, 183981, 186563, -39351, 147425, 89935, 2395, -103041, 503593, -226229, 76130, -521872, 48628, -318069, -24590, -316376, -205368, -67387, 56472, -240231, 157023, 143925, -120003, 48250, -147213, 33986, -195874, 18134, -144868, -107657, -228441, -125068, 186528, -154930, 89111, 19334, 240946, 138163, -242748, -206203, -186241, -15088, -112575, -178926, 14653, -111310, 127626, 160973, 93594, 227690, 277604, -35222, 100830, 163086, -72834, -41888, 185277, 253040, -41987, 143238, -266506, -23875, 227534, 308663, 50573, 373901, -48428, 2362, -141130, -65460, -103291, -90870, -46218, -279990, -83668, 154669, 52221, -258216, -229560, -6266, -130174]
18107a30174d8142j17072E6529e3250A30714R552b9273A02892l0252h0640k20804
18096c01444A95493n2302G0047J17508a57720J3206O362A2794f3042B35419i0873
18084a22599j01210A95112j348a10439a9414A17161j1793b83504D1085e9400A8318
18072c43442J30791d53k06003R7763A31879c50889a61897D0779a49351B30898
18061E6636a71908O5644J7443j24255C4748Q4190a06007A8019b36030h1497H8916
18049A01067A2407J63764e6226p351B17448a34842H3326e0000m4901H9653Q7966
18038A77619J45100c331C9589a84123e1883l06279A61707d7712j39552e6433J8018
18027c8415A06403D5058j1661d8910k34497B33697b16836d5186j62490P5691B09666
$$ y = [-130174, -48142, -165214, 56529, -53250, 130714, 140266, -29273, 102892, 72640, -80640, -301444, 195493, 143191, 70047, 187555, -157720, -144514, -138152, 12794, -63042, 235419, -90873, -122599, -223809, 195112, 193764, -110439, -19414, 117161, 105368, -283504, 41085, -59400, 18318, -343442, -212651, -453, -206456, -108693, 131879, -350889, -161897, 40779, -149351, 230898, 56636, -171908, -106264, -88821, -213076, 34748, 118938, -106007, 18019, -236030, -81497, 88916, 101067, 12407, 176171, -56226, -63577, 217448, -134842, 83326, -50000, -94901, 89653, 177619, 322719, -3331, 39589, -184123, -51883, -358162, 161707, -47712, -187264, -56433, -38415, 106403, 45058, 33397, -48910, -283407, 233697, -216836, -45186, -207676, -131985, 209666]
18015b40165G6102f3237l749N363A14043J25505K94878G3438c5777B391a29395
18003C83511A50241b28350D7122M16058B9796a80156j51360J55404Q4905M5130
17993d6077G8036k7629K2872g6117m7636b6935K525k57688E4693e1441q7360k41722
17981c80523A47108D4873J01938a12772d0115A70410J06301i8537C02715B8267
17970f2519k20629a29442B87215A33021f8755k05951f6972A34260g9968j40613
17960b20581e9346o1717c9984A45517a27930E5937L63343j04079H7473c96089
17949a09078I2229a55240d6333r5359m0757f4855l168l00172F1233a20008B49651
17937a73624B74655a06316M4270j85400A69934O9469g3670l7057q7990G4049a10405
$$ y = [-240165, 76102, -63237, -66986, -61623, 114043, 239548, 534426, 73438, -35777, 2391, -129395, 383511, 150241, -228350, 47122, 463180, 29796, -180156, -331516, -176112, -91207, -46077, 78036, 50407, 73279, -76117, -123753, -26935, -24410, -282098, 54693, -51441, -138801, -380523, 147108, 44873, 146811, -112772, -40115, 170410, 276711, -98537, 302715, 28267, -62519, -283148, -129442, 287215, 133021, -68755, -274706, -66972, 134260, -79968, -220581, -59346, -121063, -39984, 145517, -127930, 55937, 419280, 315201, 87473, -396089, -109078, 92229, -155240, -46333, -141692, -182449, -64855, -68023, -368195, 61233, -120008, 249651, -173624, 274655, -106316, -62046, -247446, 169934, 239403, -73670, -110727, -198717, 74049, -110405]
17925i0211n0636e4491p2040g03j68257j65238d8178j76670B22125a24255H49
17913a31069D8560a43158j47350e8025E0676a14363A61880A6996c62291A25271
17902a86736O4470d5965A4215M0380a42234A19855k3208L848b76263B5665c31
17890c37225A23340Q885a9580l4335A56485l2857Q7579c42376g6562B73256m9777
17879B23479a24880A86062a95996q6102h2072A54387e7212D4047e2551r6699g29
17867A08700c3235F8797F414K35388a01432C07533c099I1785f8807B73170G8627
17855B7825a4469A44267F0440h284l16904a55915o1698C6110J92106A2974K76424
17844B89398C5674J76064G9208a08937A64966E4994a67487g5021A21651J43966
$$ y = [-90211, -140847, -54491, -126531, -703, -168960, -334198, -48178, -224848, 222125, -124255, 849, -131069, 48560, -143158, -290508, -58025, 50676, -114363, 161880, 16996, -362291, 125271, -186736, -122266, -45965, 14215, 54595, -142234, 119855, 96647, 100495, -276263, 25665, -331, -337225, 123340, 132225, -19580, -53915, 156485, 123628, 211207, -342376, -76562, 273256, 223479, -124880, 186062, -195996, -282098, -82072, 154387, -57212, 44047, -52551, -149250, -729, 108700, -33235, 68797, 6414, 241802, -101432, 307533, -3099, 91785, -68807, 273170, 78627, 27825, -14469, 144267, 60440, -8284, -325188, -155915, -217613, 36110, 228216, 12974, 289398, 35674, 211738, 79208, -108937, 164966, 54994, -167487, -75021, 121651, 265617]
17834B65617A21858B3437K93180A03281h6083A1088g7203B01661o0557R3509n4930
17823A79683i4897G1388b35859Q094A90153G1790l5027b15964A16455i0701n8110
17812a48811O1763m0430H9992c89955l6900A44470a07561A7966b6802C32736a54665
17800A27785b22361B79899j05790C6647K21293b40879A04835a08465A84563O6342
17790B50905A21414a57445b6124k19208E0174i8028c3336D7532A5343b40255b514
17778A40252D7390J16865a5567l2342A02625j996f4722A4515J0235a34850l8858
17767a73708K8395p1529A10946P723a04764A000K17746a36159M1659B15733G6906
17755B81671d5874j43877A02091c04088a35337I7113a6170A34045R058a54287
$$ y = [265617, 121858, 23437, 316617, 103281, -86083, 11088, -77203, 201661, 141104, 234613, 179683, -94897, 71388, -235859, -227765, 190153, 71790, 36763, -215964, 116455, -90701, -148811, -87048, -127478, 89992, -389955, -426855, 144470, -107561, 17966, -26802, 332736, -154665, 127785, -222361, 279899, 174109, 36647, 257940, -240879, 104835, -108465, 184563, 250905, 121414, -157445, -26124, -245332, 50174, -98028, -33336, 47532, 15343, -240255, -2514, 140252, 47390, 164255, -15567, -47909, 102625, 100629, -64722, 14515, 24750, -134850, -173708, -145313, -216842, 110946, 118669, -104764, 1000, 218746, -136159, -94500, 215733, 76906, 281671, -45874, -189751, 102091, -304088, -135337, 97113, -16170, 134045, 143103, -154287]
17744A41457C5180R9600e671o9248j01920e8210k9465b1138A98257F6555O0015
17733A26570L916b56603B02831L01559b0083n0071F9284h9359B0630i7872c1574
17721B89246m3713f3905j43770c4644k5543G7180j1253c11498g8350A58744b78932
17709a32264A94830c02221A77675a61802C30611a4086N426A9656b82985M2577
17699b40408C50845I109h3704D4500i3411C9285a0012A41158K27951H1547b9094
17687a7906D641J06931b54796g9788I4154c9086A25137a74442b0523o4728k17283
17676c02534A63898a69026q059a5521E5425O4665b06774a00670a2209B00294J4559
17665B14853A00229c7155C0367L01027D2895b54198c2159A62624A3046R5998a0836
$$ y = [141457, 35180, 134780, -5671, -74919, -176839, -58210, -87675, -21138, 198257, 66555, 126570, 130486, -256603, 202831, 504390, -20083, -70154, 69284, -89359, 20630, -97872, -31574, 289246, 245533, -63905, -207675, -34644, -60187, 77180, 65927, -311498, -78350, 158744, -278932, -132264, 194830, -302221, 177675, -161802, 330611, -14086, -8660, 19656, -282985, -240408, 350845, 9109, -83704, 44500, -93411, 39285, -10012, 141158, 369109, 81547, -29094, -17906, 4641, 111572, -254796, -79788, 94154, -39086, 125137, -174442, -20523, -85251, -302534, 163898, -169026, -177085, -15521, 55425, 120090, -206774, -100670, -12209, 200294, 214853, 100229, -37155, 30367, 331394, 42895, -254198, -32159, 162624, 13046, 109044, -10836]
17653A59683R7302A06184N6626e0552j33153H4121J02782b34754i0457A8934K93711
17642C12645e1723F2225h3233A9049J03908b12772g5518k29060a04289g115l13931
17631c21046J33760E5041a08110D4021d2822C18526F3863A7223O2223N6318O8935
17620B04699a47300D7715J55530c2200j71216A31404a49997f1355E9044a08108
17609A89747q3198l3874J99094G3389O4993c34959J22530c5027k64834H8312b1916
17597B03573J39976a11706B60156g9917A38025a18672J0230A26800Q0783H6600
17586C78092G214P7419a36033k6658d2034e563l11067a11935A20520d0335G2202
17574a21182k18679A70435n8408C841f3840A44288O6490a58097f7215G9314R2860
$$ y = [159683, 256985, 106184, 162810, -50552, -183705, 84121, 186903, -234754, -90457, 18934, 312645, -51723, 62225, -83233, 19049, 122957, -212772, -75518, -304578, -104289, -7115, -321046, -187286, 55041, -108110, 44021, -42822, 318526, 63863, 17223, 79446, 135764, 204699, -147300, 47715, 203245, -32200, -203416, 131404, -149997, -61355, 59044, -108108, 189747, 106549, 72675, 271769, 73389, 138382, -334959, -212429, -35027, -299861, 88312, -21916, 203573, 343549, -111706, 260156, -79917, 138025, -118672, -108442, 126800, 207583, 86600, 378092, 7214, 84633, -136033, -162691, -42034, -5563, -316630, -111935, 120520, -40335, 72202, -121182, -339861, 170435, 112027, 3841, -63840, 144288, 210778, -158097, -67215, 79314, 172174]
17563A72174O0889H604J41881E1334a0279r4511j49396f53A85194I2540K35661
17552C28201A7879R3202D645K0038K48064A2483J15502f4833G5043C2836J50949
17541A83785D6590a54656A14919M247F060J69035b90483F597P2020a46360I8457
17529B6050b1472B30217c3606k3025I3632B1448a00752C0317J49709N2235A03974
17517D07270j34252F5355j9310J23573J62258P012F2540K20578j36244p3261Q9028
17506A62641K43726A56067G5683R600C8680J73364h2114A80657B9399K90221I6352
17494c2246j58511B968J08096K80248F1877P2481K72995d6466k68897A82684a1025
17482d0491A05234J20251a34189A51017K609N0261l1486o7150B0279J66776d5174
$$ y = [172174, 233063, 8604, 150485, 51334, -10279, -104790, -254186, -653, 185194, 92540, 328201, 17879, 111081, 4645, 24683, 272747, 12483, 127985, -64833, 75043, 32836, 183785, 46590, -154656, 114919, 119166, 6060, 175095, -290483, 6597, 78617, -146360, 98457, 26050, -21472, 230217, -33606, -56631, 93632, 21448, -100752, 30317, 180026, 232261, 103974, 407270, 273018, 65355, 46045, 169618, 331876, 338888, 62540, 283118, 146874, 73613, 162641, 406367, 156067, 75683, 85283, 38680, 212044, -82114, 180657, 29399, 319620, 96352, -32246, -190757, 2968, 111064, 391312, 61877, 134358, 407353, -46466, -315363, 182684, -11025, -40491, 105234, 225485, -134189, 151017, 153626, 203887, 172401, 105251, 20279, 187055, -45174]
17470A66590l9157a05414B19441I0677K10182c0213C518b70640A19777k9615m4773
17459D5389K3317K0437K09243F9634J7444a32225C12087J20000A38207a77625
17448C47457j69474F187J19724P8871H5677A0788K36534A06591K56284B395a53603
17436C57278e3882A70295a20190B28226r9308n3047K65909a13777B70556M5636
17426C16192r9000J17887g9583D54796j97031F7083K58630R6027A28956a727C60386
17414A34644P1763K06018j67965a4767D19250j98760n7511G4994k9547K37463
17404B82910j29583G6017b53995A54317j7591J02890D1362K61335j36394F8410
17393A19916C156K06509M7480B9721R2422J59516a01053A25074a66494C75834
$$ y = [166590, 127433, -105414, 219441, 90677, 300859, -30213, 3518, -270640, 119777, 90162, 45389, 68706, 89143, 298386, 69634, 87078, -132225, 312087, 432087, 138207, -177625, 347457, 177983, 6187, 125911, 204782, 85677, 10788, 247322, 106591, 362875, 2395, -153603, 357278, -53882, 170295, -120190, 228226, 128918, 75871, 341780, -113777, 270556, 316192, 217192, 335079, -79583, 454796, 257765, 67083, 325713, 421740, 128956, -1727, 360386, 134644, 206407, 412425, 244460, -14767, 419250, 220490, 162979, 74994, 45447, 282910, 153327, 76017, -253995, 154317, 136726, 239616, 41362, 302697, 166303, 68410, 119916, 3156, 209665, 257145, 29721, 122143, 281659, -101053, 125074, -166494, 375834]
17382D7568e43013I0346L7483Q3249A2168N01234A68996G8562N8236J61059f695
17370h5525A86221A9159d1899A54188B3033M16315A73545Q6147A24192M9375b36903
17358A29078K23382Q907A41471K23457i5279B54320p7249a02670A30788e9416
17347A90622h4085A0698M9578i4901G0542J78392l9855E5588J07539H999a62936
17335F6338M6474B7135K46231B1407L63205j54074a67596C58521A77686n1465
17325A26221e1451F4903J52946a61403a6966C6117K13817j16396J32569J30035
17315C96142C0747M2710K8584K28496p2905q8492m2505a0080E3741K52647G4474
17303B45134G5993P9301C7375L11221r8703h540G782J51717F0441L54877j91952
$$ y = [47568, -543013, 90346, 127829, 211078, 12168, 513402, 168996, 78562, 136798, 297857, -6695, -85525, 186221, 19159, -41899, 154188, 23033, 439348, 173545, 259692, 124192, 173567, -236903, 129078, 352460, 361367, 141471, 364928, -95279, 254320, 177071, -102670, 130788, -59416, 190622, -84085, 10698, 60276, -94901, 70542, 248934, 209079, 55588, 163127, 8999, -162936, 66338, 112812, 27135, 273366, 21407, 384612, 230538, -167596, 358521, 177686, 126221, -51451, 64903, 217849, -161403, -16966, 36117, 249934, 133538, 266107, 396142, 30747, 73457, 102041, 330537, 257632, 169140, 126635, -10080, 53741, 306388, 74474, 245134, 75993, 155294, 37375, 348596, 249893, -8540, 7782, 159499, 60441, 415318, 223366]
17292B23366G2911Q3291J2980K5884J54536A35307O7782b37109B04575a04769
17281E3522i5239A39378o6067a29965C10420j06054I3090a94799D7115o877a62420
17269A04625f616G1755c6511E0567L69923p5010j54801l0156K17297G904J90315
17258A98219Q0571A28598J08162L8796M5992j39150K96636j88400p8454l2985
17248A79195D7732Q2715Q981e017F4020K91390B5353J27903G022J80883K8106
17237B16011p2888n9550P2059J64646A35554j9101K37439j20866j08399M4746
17227A69373K13403J08808k22596q7258M0630O0817D7522J35563P9342N8064r8773
17216B21718r9205P5682l1069q3315L59222A30002q557M28348A06333J15258J14045
$$ y = [223366, 72911, 156202, 169182, 195066, 349602, 135307, 203089, -237109, 204575, -104769, 53522, -95239, 139378, 73311, -129965, 310420, 204366, 93090, -194799, 47115, 40238, -162420, 104625, -6616, 71755, -36511, 50567, 420490, 345480, 190679, 160523, 377820, 7904, 198219, 278790, 128598, 236760, 275556, 321548, 182398, 479034, 290634, 212180, 179195, 47732, 130447, 139428, -5017, 64020, 355410, 25353, 153256, 7022, 187905, 216011, 143123, 83573, 155632, 320278, 135554, 116453, 353892, 233026, 124627, 169373, 382776, 491584, 268988, 181730, 222360, 283177, 47522, 183085, 262427, 320491, 221718, 122513, 198195, 167126, 83811, 443033, 130002, 121445, 549793, 106333, 221591, 335636]
17205C35636N3216a38736B81729G6458L5649f3740A46024b9995a4805B87767A35691
17193A47048C8096K54406a09741A3003K57598K48410A20616P427N80014C01608
17182i2752B77740a7417j29808D74962g9826B24430J79932q7650Q3930o0126j00870
17171B39646A17102K61316A36590J3309Q4786M8787A20941J15100K56588j41527
17161C51102F47M50455A25287n449a04158C49361j46894K47875j75800b0498B33149
17149a66951B45830H9835J59256J70026j44852j31352M75477B35204K44260B13373
17138A4342M24055K4344j13288K8458a7683C94119N4579A44222J55368j03329
17128A96261E2642J00763J90151A58330J25728Q2604j73499J25733n3790A18368
$$ y = [335636, 388852, -138736, 281729, 76458, 112107, -63740, 146024, -29995, -14805, 287767, 135691, 147048, 38096, 292502, -109741, 13003, 270601, 519011, 120616, 128043, 708057, 301608, -92752, 277740, -17417, -147225, 474962, -79826, 224430, 404362, 316712, 400642, 340516, 239646, 117102, 378418, 136590, 149899, 234685, 283472, 120941, 236041, 492629, 351102, 647, 451102, 125287, 119838, -104158, 349361, 202467, 450342, 274542, -20498, 233149, -166951, 245830, 89835, 249091, 419117, 274265, 142913, 618390, 235204, 479464, 213373, 14342, 438397, 462741, 349453, 377911, -17683, 394119, 448698, 144222, 299590, 196261, 52642, 153405, 343556, 158330, 284058, 366662, 193163, 318896, 265106, 118368]
17117B78531A39236L3999J26390j49510L11267K0182B27991N28067j45817k71122
17107C39119L74354k51477k25223J97622j57552K93837B06320K14954P8439o1548
17097D38165B17549J09907J16621A19057M32857F4312L62542j75186j0153J27625
17087C69140J88814B68262K16428A10284K91583J19821k2865a43892B96955L60066
17077F57021B84731j34491K37508j44180K20250J63039j35247j95728M80927B82096
17066E08220k09045A41863J80615j52218K15940j16034K8278Q6586Q4234N2749
17056E22013j59470J56729o3819J02861j50032K81491j55939R4825C00123J83727
17046D83850k33354K5889L87776j89089o7427r638M9886K08835k75003J02255
$$ y = [278531, 139236, 173235, 299625, 150115, 461382, 481564, 227991, 756058, 610241, 339119, 713473, 461996, 236773, 434395, 276843, 570680, 206320, 421274, 499713, 438165, 217549, 327456, 444077, 119057, 551914, 64312, 426854, 251668, 241515, 369140, 557954, 268262, 484690, 110284, 401867, 521688, 498823, -143892, 296955, 657021, 284731, 150240, 387748, 243568, 463818, 626857, 491610, 295882, 776809, 282096, 508220, 299175, 141863, 322478, 170260, 386200, 270166, 298444, 385030, 469264, 522013, 362543, 519272, 455453, 558314, 408282, 689773, 533834, 628659, 300123, 483850, 250496, 276385, 664161, 475072, 407645, 398007, 447893, 656728, 381725, 483980]
17036D83980J96049P2807k58022J62100l05211K41007j22370k3901j37911P7591
17026C86119j17400L75237J86129j66303B39217L19154j85881J63017p7114m639
17016D53754K25564L7444k18076j45781R9732K74810k8972k21509M11859k60080
17006F28745k41675N7460l995N13337k65234C14192M74411j58620J66169j58179
16996F37973j75600L58983J39973j16068l84957K08095K28961k39270k24905M5592
16986D78777K79114j05817k96053P6759K15679J75390J29248l60356K12960K7172
16976H32873l024q9017K70580j77527o4543k88845K67602K8152C67620P76807
16966A144427k3569k34229j30602J50817j19518p9869K75096m77195K43252L05469
$$ y = [483980, 680029, 752836, 494814, 656914, 351703, 592710, 470340, 446439, 308528, 386119, 268719, 643956, 830085, 663782, 239217, 558371, 372490, 535507, 458393, 453754, 679318, 716762, 498686, 352905, 452637, 727447, 698475, 476966, 888825, 628745, 387070, 444530, 440535, 953872, 688638, 314192, 788603, 629983, 796152, 637973, 462373, 821356, 961329, 845261, 460304, 668399, 897360, 658090, 433185, 478777, 757891, 652074, 356021, 432780, 648459, 823849, 953097, 592741, 805701, 832873, 829849, 740832, 1011412, 833885, 769342, 480497, 748099, 776251, 367620, 1144427, 1120858, 886629, 756027, 906844, 787326, 707457, 982553, 505358, 748610, 1054079]
16956A054079j16487r6828N4920N9538r0480J32058K39766k26272o0422J11570
16946A061442k02452n5088N1358L9131P4126R3543j50227J96048k37511j485j03048
16935G65837L23758L29633l74370J64365K93038m12078J24584P533k40660K18789
16925A200429n0020j80322j17712N28904k04329N8688p9934L9622J83676m44246
16915I34756L88153L51077k24843j24685M7715j52581M7099M9384L4526j32822
16905A217779K79304k98549N50336l06936N7112K0918l78405L47511j53770L34367
16895A669667l1782L1953o0632N3943J11133r7582M9495L86161m09704R2563l2724
16884A762491J45017r9377J62833j16355k14482K21763q1702O30280l13407l17992
$$ y = [1054079, 937592, 840764, 895684, 955222, 864742, 996800, 1236566, 1010294, 949872, 1061442, 858990, 803902, 855260, 894391, 968517, 1062060, 911833, 1107881, 870370, 868885, 765837, 1089595, 1419228, 1044858, 1209223, 1502261, 1090183, 1214767, 1222300, 981640, 1200429, 1150409, 970087, 852375, 1381279, 1176950, 1235638, 1155704, 1195326, 1379002, 934756, 1322909, 1673986, 1449143, 1324458, 1372173, 1219592, 1266691, 1316075, 1350601, 1217779, 1497083, 1198534, 1748870, 1441934, 1499046, 1519964, 1141559, 1489070, 1335300, 1669667, 1637885, 1669838, 1609206, 1663149, 1774282, 1676700, 1726195, 2112356, 1702652, 1795215, 1762491, 1907508, 1808131, 1970964, 1854609, 1640127, 1861890, 1780188, 2410468, 2097061, 1779069]
16874A779069K50808P698q9113L1402m5152p3216P01130m33399K31695j28438
16864B232484M571J568J22997j05238J8371l25147L92908J37666p3990M40421
16854B846611k82919J33609K80857m01427p5142q561N69832k45044K38048J01605
16844C157469j37974K23813J0375N4289l50426J74664L27971j07856N5345J52756
16834C560426j26709q9006l8401L43294O4923K76412k42319M04324j36422j49498
16824C867024J39281K25461J92717k0845J39523j520K37651P0064J14056j04797
16814D858615J09453O2418L0685M39559j91357K80062L80936j28322j25963L62660
16804F078746m7507M48482n0908J85830j951K62377K47931j44166N45744m0901
$$ y = [1779069, 2029877, 2037575, 1948462, 1979864, 1934712, 1861496, 2562626, 2129227, 2360922, 2232484, 2237055, 2238623, 2361620, 2256382, 2274753, 1949606, 2342514, 2480180, 2406190, 2846611, 2563692, 2697301, 2978158, 2576731, 2501589, 2493028, 3062860, 2817816, 3055864, 3157469, 3019495, 3243308, 3253683, 3307972, 2957546, 3132210, 3460181, 3352325, 3407670, 3560426, 3433717, 3344711, 3306310, 3649604, 3714527, 3990939, 3748620, 4152944, 4016522, 3867024, 4006305, 4231766, 4424483, 4403638, 4543161, 4541641, 4779292, 4849356, 4963412, 4858615, 4968068, 5030486, 5061171, 5500730, 5309373, 5589435, 5970371, 5842049, 5716086, 6078746, 6031239, 6479721, 6428813, 6614643, 6612692, 6875069, 7123000, 6978834, 7524578, 7483677]
16794G483677K99607Q3321K32352K92388L72060K10040k5692L94808K7689L76842
16784I747092J0730L75923O32040j01802M66342M05228M12658K14257M18755P01777
16774A3283000m1516J10069P30172L25189J019843J55360L82111O92968M68805
16765A7126001R05847M30618Q28938Q57707P36777R25600M44879Q84931J591815
16756B4733113O66496R31102J254453J337065J095464J507386J851535J490843
16748C4867457J740884J671582J753063K374146J797748L210411K389923L001389
16740E2806603K356630L268602L254254L838274L700238L850325M689088M998186
16732H2762200N039959M998838N950906N661036O045830O649357O364431O570697
$$ y = [7483677, 7783284, 7866605, 8098957, 8391345, 8763405, 8973445, 8947753, 9342561, 9370250, 9747092, 9757822, 10133745, 10765785, 10663983, 11130325, 11535553, 11948211, 12162468, 12581223, 13283000, 13241484, 13351553, 14081725, 14406914, 15426757, 15582117, 15964228, 16657196, 17126001, 18031848, 18462466, 19291404, 20149111, 20885888, 21811488, 22256367, 23141298, 24733113, 25399609, 26330711, 27585164, 28922229, 30017693, 31525079, 33376614, 34867457, 36608341, 38279923, 40032986, 42407132, 44204880, 47415291, 49805214, 52806603, 55163233, 58431835, 61686089, 65524363, 69224601, 73074926, 77764014, 82762200, 87802159, 92800997, 98751903, 104412939, 110458769, 117108126, 123472557, 130043254]
16724A30043254O597110O690174O085969N628790N200494M695361L703094K110808
16716A70755054J532618K23914q73428j847618l294335m142579m950944n423538
16708A51979144o343124o268020o870459o689321o887275o467450o448340n776924
16700A00228231o053622o047419m862923m807509m528973m683433m209831l720051
16692F1314470l470886l000749k995035l098810k529694k541723k300790k098579
16684C9278204j972411j839954j596808j871691j638308j395945r88339j747304
16676B6227444j074970o59220j118462j078669n83550j203808r44776p14739o16124
16667A8233126q52056n22960p39143m23689n60499n69784l56796o00150m50746
$$ y = [130043254, 136640364, 143330538, 149416507, 155045297, 160245791, 164941152, 168644246, 170755054, 172287672, 172511586, 171638158, 169790540, 166496205, 162353626, 157402682, 151979144, 145636020, 139368000, 132497541, 125808220, 118920945, 112453495, 106005155, 100228231, 94174609, 88127190, 83264267, 78456758, 73927785, 69244352, 65034521, 61314470, 57843584, 54842835, 51847800, 48748990, 46219296, 43677573, 41376783, 39278204, 37305793, 35465839, 33869031, 31997340, 30359032, 28963087, 27974748, 26227444, 25152474, 24493254, 23374792, 22296123, 21712573, 20508765, 19563989, 18849250, 18233126, 17381070, 16858110, 16118967, 15695278, 15134779, 14564995, 14208199, 13608049, 13157303]
16658A3157303o26011j71405m62405n23514j71343k54650k80061n72616o28768
16649I466530j39529M6300l43982l09756j38227r8617k74233n51904r3500k06361
16639G356721L2317m37120J65172o80517K47952l43382k23599k32544K08115m85254
16629E607861m89788M81116l96563M43595m47865r6976m67719M51924j89815p1366
16619D824404m44783r4489l89068K98589J96720k03220j27720j42153k60647p9009
16609C578624M73641m35640J55799p09994R0810k3091k0852r2735J91383j92616
16599C015329Q4636k02481O7178O5457l38014M39264l14369m40310J27567L74851
16589B879108j45877k01858J4995j23017k65739k4534J89763r8802j11108j23883
$$ y = [13157303, 12531292, 12359887, 11897482, 11373968, 11202625, 10947975, 10667914, 10095298, 9466530, 9327001, 9373301, 9029319, 8719563, 8581336, 8482719, 8208486, 7656582, 7563082, 7356721, 7389038, 6951918, 7117090, 6436573, 6684525, 6341143, 6117544, 5885000, 6093115, 5607861, 5118073, 5599189, 5202626, 5646221, 5198356, 5101380, 4633661, 5085585, 4895770, 4824404, 4379621, 4285132, 3896064, 4194653, 4391373, 4188153, 4060433, 3918280, 3657633, 3578624, 4052265, 3616625, 3772424, 3062430, 3153240, 3130149, 3109297, 3016562, 3207945, 3015329, 3099965, 2897484, 2964662, 3030119, 2692105, 3131369, 2817000, 2376690, 2504257, 2879108, 2733231, 2531373, 2546368, 2423351, 2157612, 2133078, 2322841, 2224039, 2112931, 1989048]
16579A989048K50179O1995l29617L76869k93617R1256k55943J74763n8827j58853
16569A847253K78277l58386J72479l7442R5165j3717j77785j32202O9716j00901
16559A642457j43042n4150l0864K91240l15701j09280P6048q7533K61200j33644
16549A396731j20996J09355j75986J1215J25829J40492j07123j37325j84689O96867
16539A754370n64499Q1213j53356j90835J51561q2429N175R1095p8923J43617
16529A156989P8635l39812L70961o02668R7126J37857O3145j01478L24902k74034
16519I11623Q63P3048L35966p2754n73479L89259k65745N6706j62529Q4502k96958
16508D80502M11976O8079N5781k97965J03015j29021M7553M0532P6758J64548
$$ y = [1989048, 2239227, 2301222, 1971605, 2348474, 2054857, 2146113, 1890170, 2064933, 2006106, 1847253, 2125530, 1767144, 1939623, 1902181, 1997346, 1983629, 1805844, 1673642, 1743358, 1642457, 1499415, 1445265, 1414401, 1705641, 1389940, 1280660, 1356708, 1269175, 1530375, 1396731, 1275735, 1385090, 1209104, 1220319, 1346148, 1486640, 1379517, 1242192, 1057503, 1754370, 1189871, 1271084, 1117728, 926893, 1078454, 996025, 1001200, 1092295, 1013372, 1156989, 1235624, 895812, 1266773, 664105, 761231, 899088, 962233, 860755, 1185657, 911623, 912486, 985534, 1321500, 1248746, 675267, 1064526, 798781, 855487, 692958, 777460, 480502, 892478, 960557, 1016338, 718373, 821388, 692367, 739920, 780452, 857210, 1021758]
16498A021758l27660K52562r8289j3207J7895J30678l33827J68696k35453j46984
16488D36169R0840L07814k391j18583C16264K18304K26535j46167P0555j86420
16478D99071J41319j04119J97209k23057L23297l82610K3948P3356J46437O3680
16468G58531j19677C06721K05128l6914n6444K93549k73960j14735L70351j39032
16458E54664j63873L38282C23757K58183J2447k08200P2157j30450J44246I8722
16447E77145j20578P6765B46385K06214J31927B90398J27401J63089o5258J56799
16437F72429l31706J2142p2350j15910p3919K83889j02260J02605L64322j81479
16427E57763j89687R9973k5048l4972k1588a5350C54872L0419J00487F9949M07330
$$ y = [1021758, 694098, 946660, 848371, 835164, 853059, 983737, 649910, 818606, 583153, 436169, 527009, 834823, 832432, 713849, 316264, 534568, 761103, 614936, 685491, 499071, 640390, 536271, 733480, 510423, 833720, 451110, 475058, 548414, 694851, 758531, 638854, 306721, 511849, 474935, 418491, 712040, 438080, 323345, 693696, 554664, 390791, 729073, 323757, 581940, 594387, 386187, 458344, 327894, 472140, 98722, 577145, 456567, 533332, 246385, 452599, 584526, 290398, 417799, 580888, 515630, 672429, 340723, 352865, 280515, 164605, 90686, 374575, 272315, 374920, 739242, 557763, 368076, 468049, 443001, 408029, 386441, -15350, 354872, 385291, 485778, 69949, 477279]
16416D77279j04744A38504K03381K06761m2046j41371O4359A71663J62732E5577
16405C21541E0587L33979n3577H4328K86034j76611G0635O1322N8348J61421K71514
16394F23240B62212o9582J35011A57124L14339j35605j52819p918M30769k86675
16384C19215L7328j17481I3103K54861i0390A00663J02363O2782p0536K59105
16374D54377B00307j7445p3725J41224A11327a40536e4336B62856m10R2571P444
16363C62461r0027O6656E7351M16969A04366K74700r0207a67144C7601N8018n520
16352I0099J16028L38756B7530L70507A57789a47649B83700d3915C47401I2709
16341B27800J87090j59817j08603m4955L07072j69999f4910A95329R1756a29763
$$ y = [477279, 372535, 138504, 341885, 548646, 506600, 365229, 429588, 171663, 334395, 55577, 321541, 50587, 384566, 330989, 84328, 370362, 193751, 70635, 131957, 190305, 351726, 623240, 262212, 192630, 327641, 157124, 471463, 335858, 183039, 175121, 605890, 319215, 356543, 239062, 93103, 347964, -90390, 100663, 203026, 265808, 195272, 454377, 200307, 182862, 109137, 250361, 111327, -140536, -54336, 262856, 262446, 355017, 362461, 272434, 339090, 57351, 474320, 104366, 379066, 288859, -167144, 37601, 95619, 90099, 206127, 544883, 27530, 398037, 157789, -147649, 283700, -43915, 347401, 92709, 227800, 414890, 255073, 146470, 101515, 408587, 238588, -64910, 195329, 287085, -129763]
16330E7121A9492L50207l459H5018p793d7060D89413A6655J65331R713K11918
16319D03617H6405d0556C13593a15489A36092J87063b4758k4198B17355o7963
16309A49392M2685a54328B27669N8906g3638B13790J31068A44732l890O1764O655
16298B09261j9803b7419A65329E8817j8350L21142l3730p3219C8554d8114H9693
16286C09132E6734a40673e1214j67615A20394J6233L86229b69837D6552b64369
16275B04681B9047L21234G3268J11388b1863E89128B17742p1581O1713B9654O3702
16264I3356b7167A45659D3657K81537b829A70717m908i033A62675b05568H6637
16252B06798l9707g9283C10040C9076a34413D021J62344E1394B131K18793I2364
$$ y = [57121, 19492, 369699, 366240, 85018, 77225, -47060, 489413, 16655, 181986, 191699, 403617, 86405, -40556, 313593, -115489, 136092, 323155, -24758, -48956, 217355, 149392, 192077, -154328, 227669, 286575, -73638, 213790, 344858, 144732, 140842, 202606, 209261, 189458, -27419, 165329, 58817, 40467, 361609, 327879, 254660, 38554, -48114, 89693, 309132, 56734, -140673, -51214, -218829, 120394, 136627, 522856, -269837, 46552, -264369, 204681, 29047, 350281, 73268, 184656, -21863, 589128, 217742, 146161, 207874, 29654, 93356, -27167, 145659, 43657, 325194, -2829, 170717, 165809, -9033, 162675, -205568, 86637, 206798, 167091, -79283, 310040, 39076, -134413, 4021, 166365, 51394, 2131, 220924, 92364]
16240a7895m5797A35817N4621b71482A61103J05393j15802C8822J18789k9941
16230A27670d5670A46686k6945n1027a17546A77619m1377a03635k15370n5118
16220c74123D514L3788D493a33256B02220o6739I982a80866a3075A71105J49053
16209C20158c12593a24537A31425b76453a25451B7497J23847b05576b2212A04752
16198D11133B2298a60323A18874J30506E6852N9241K8313n4548J01600a20439
16187a4392A67232d27954A04945k8639P0892F5927M1995N3037a23717B50380b00824
16175b46864A20257J38518B4109a43110d2132j04891l4101R0144C03346b73760
16164B88976G2705L2212K30648G7752J82233A3391F058L28723d6941D0401K04330
$$ y = [-17895, -63692, 135817, 190438, -271482, 161103, 266496, 150694, 38822, 157611, 127670, -45670, 146686, 119741, 68714, -117546, 177619, 136242, -103635, -319005, -374123, 4514, 38302, 4493, -133256, 202220, 135481, 9982, -180866, -13075, 171105, 320158, -312593, -124537, 131425, -276453, -125451, 27497, 151344, -205576, -22212, 104752, 411133, 22298, -160323, 118874, 249380, 56852, 116093, 144406, 89858, 191458, -120439, -14392, 167232, -427954, 104945, 76306, 147198, 65927, 107922, 160959, -123717, 250380, -200824, -246864, 120257, 258775, 24109, -143110, -42132, -147023, -181124, -90980, 303346, -273760, 288976, 72705, 104917, 335565, 77752, 259985, 13391, 6058, 334781, -46941, 40401, 244731]
16153B44731a77629K4381B69896A11829g117j09146A16394d059j83606P4696a3549
16141C0142J96742H2910J27465G0027h1846C90774C7276a56465b9933a3355A86997
16129b20698j47136J59893e4784j98512D1568d741D3205q865b11765o7165d4984
16117A10586a65741C1146A0108b5359k51820F8924I395L25633d0301k44025A2964
16105A16538f098C5443a31267A06054J53701J09830a7507A04026b02266E1798
16094a24887A89786j0542M4931H8940q882J7196a89602C19208e7286F3049g8283
16082a24259J2721d340I2786P3520k0669a91734A1648c55840H444R4613a30414
16070b40180a02682A97589b00142e3667A80446a50362A161b17228i2840J8978
$$ y = [244731, -177629, -153248, 269896, 111829, -7117, -116263, 116394, -4059, -187665, -112969, -13549, 30142, 226884, 82910, 210375, 70027, -81846, 390774, 37276, -156465, -29933, -13355, 186997, -220698, -367834, -207941, -54784, -253296, 41568, -4741, 43205, 34340, -211765, -278930, -44984, 110586, -165741, 31146, 10108, -25359, -277179, 68924, 9395, 335028, -40301, -284326, 12964, 116538, -6098, 35443, -131267, 106054, 259755, 369585, -17507, 104026, -202266, 51798, -124887, 189786, 179244, 224175, 88940, 80058, 97254, -189602, 319208, -57286, 63049, -78283, -124259, -111538, -4340, 92786, 166306, 145637, -191734, 11648, -355840, 8444, 103057, -130414, -240180, -102682, 197589, -200142, -53667, 180446, -150362, 1161, -217228, -92840, -73862]
16060g3862G7220i0160b26j65488P8040l28227E3113O0110a19836L8011B16804
16048B51896a30139L4577l0029C7085b7046l0830b3456m8859M688H7314i3204
16036d08526b2420q3848o4045a7758j91285A36467E2427K199B6216b30313d948
16024B0076b40282C7151a4573C1678C098c2805j46678B03621A6282d55066J50736
16013c04330j8952A940a05005A18247J79393p9733c6335j11961A4103K40568e8783
16001b18692H4004K99542j43304d3012j42090e2216A42175n6073a34891J603A67137
15989g6750A1522a05572d305k68550A47189J53974A04818L66786N5948a5978B89583
15977B91670n3617A18993a06457k5350H2752a59428A235a5115G4500c73421d4131
$$ y = [-73862, 77220, -90160, -226, -165714, -87674, -415901, 53113, 113223, -119836, -81825, 216804, 251896, -130139, -95562, -125591, 37085, -27046, -57876, -23456, -72315, -67627, 87314, -93204, -408526, -22420, -106268, -170313, -17758, -209043, 136467, 52427, 54626, 26216, -230313, -4948, 20076, -240282, 37151, -14573, 31678, 3098, -32805, -179483, 203621, 16282, -455066, -304330, -323282, 1940, -105005, 118247, 297640, 217907, -36335, -148296, 14103, 254671, -58783, -218692, 84004, 383546, 240242, -43012, -185102, -52216, 142175, 86102, -134891, -133288, 167137, -76750, 11522, -105572, -4305, -272855, 147189, 301163, 104818, 471604, 527552, -15978, 289583, 291670, 238053, 118993, -106457, -131807, 82752, -159428, 1235, -15115, 74500, -373421, -44131]
15965G3364J85226M2583a99576j5214A18553i1643L4162H9730b28381m0368a08733
15953d5983m0598A19642b9824p0662K0697K0729A80821q5028g665o7878d045G4184
15940a23207b0712D1429d7543m3615G1860K8794a50825K6890l10465A38477c65263
15928a58900d1649B336a78444J2536N1759a7984B81377F6784k9536a66430B92638
15916c47128e720q5893D619g0065a5814A3341l450K07061a6481D5142B1563L0374
15904E1937a42301k99310A3467J83641a08700j03555C4513f7460j4731K0692A67648
15892c4103A42075P4319f4042B47072C1617d2633B4366b90466e7684b3865j11856
15881a35721j9694a766B8592M0729A1554O8620b21138A53527a19853A16037d2522
$$ y = [73364, 258590, 301173, -199576, -214790, 118553, -91643, -57481, 89730, -228381, -268749, -108733, -45983, -86581, 119642, -29824, -100486, -79789, -59060, 180821, 95793, -7665, -75543, -4045, 74184, -123207, -20712, 41429, -47543, -91158, 71860, 100654, -150825, -123935, -434400, 138477, -365263, -158900, -41649, 2336, -178444, -165908, -114149, -17984, 281377, 66784, 37248, -166430, 292638, -347128, -5720, -91613, 4619, -70065, -15814, 13341, 9891, 216952, -16481, 45142, 21563, 51937, -142301, -441611, 13467, 197108, -108700, -212255, 34513, -67460, -82191, -61499, 167648, -34103, 142075, 216394, -64042, 247072, 31617, -42633, 24366, -290466, -57684, -23865, -135721, -155415, -1766, 28592, 69321, 11554, 80174, -221138, 153527, -119853, 116037, -42522]
15869b44733I1618e1157m19045K09831G2858c95391A7536c44290g7948k68683
15859c46631R8540h6250o6860A73944a49519j33551a04175J4065d182B14595H6204
15847a05693G6370a0693k29838P3940j43446a10849B6688a1895D984M8476d6051
15835A28391a29246b4513j34399E8659k3756K56069j23326e7374j7202F0199A8842
15823H4765a60207e1178l338r3612j24322j77755f1559A19M8308b22129E137c23266
15810G347J26711E7842b3874l8509C5751Q9643b2624D4540d5160A21944a8962
15798H8026g2237j07283g153B62834L2247q8556E3257R9739A8507c5199d803j73755
15786a78558j49007c2053m26625a5665j97107D1984J44647K2264c00925B22098
$$ y = [-244733, 91618, -51157, -470202, -260371, 72858, -395391, 17536, -344290, -77948, -346631, -248091, -86250, -153110, 173944, -149519, -283070, -104175, -90110, -4182, 214595, 86204, -105693, 76370, -10693, -240531, -166591, -310037, -110849, 26688, -11895, 4984, 53460, -46051, 128391, -129246, -24513, -158912, 58659, 34903, 290972, 167646, -57374, -74576, 60199, 18842, 84765, -160207, -51178, -54516, -148128, -272450, -450205, -61559, 119, 48427, -222129, 5137, -323266, 7347, 134058, 57842, -23874, -62383, 35751, 125394, -22624, 44540, -45160, 121944, -18962, 88026, -72237, -179520, -7153, 262834, 295081, 206525, 53257, 152996, 18507, -35199, -4803, -178558, -327565, -32053, -458678, -15665, -212772, 41984, 186631, 208895, -300925, 222098]
15775f6554l8780p2126D4230i6250C2390L3836c2887E2292a07819C4048K64649
15764B98697I7719a35826A67326Q3522O3211j05730a79129A06786J08187M0107
15754B55080d7600A93893D8314h6959E2278g8893c1746A14716C6985J33860a17460
15742f483l61054C0954b12056m4986I5839C9122b24793G0134B1849Q8660b53472
15730a36862d0333l7465l1157i560k31721j80639i7870K3703p8711o8178f6417
15718H8518b4151l65214a46798J1084j45988Q6169d1731k6421o8654O5239D0156
15706B51777A14199c35947J66999E6771k1244f5632A93427b61563G2890R5562
15696A68452M4142a13992L8986G405L3132L47857o7662A07132h421A59192k815
$$ y = [-66554, -105334, -177460, 44230, -96250, 32390, 66226, -32887, 52292, -107819, 34048, 298697, 97719, -135826, 167326, 250848, 314059, 208329, -179129, 106786, 214973, 255080, -47600, 193893, 48314, -86959, 52278, -78893, -31746, 114716, 36985, 170845, -117460, -6483, -367537, 30954, -212056, -257042, 95839, 39122, -224793, 70134, 21849, 110509, -253472, -136862, -40333, -77798, -108955, -9560, -241281, -421920, -97870, -74167, -152878, -221056, -66417, 88518, -24151, -389365, -146798, -135714, -281702, -195533, -41731, -68152, -136806, -71567, 40156, 251777, 114199, -335947, -168948, 56771, 35527, -65632, 193427, -261563, 72890, 168452, 212594, -113992, -75006, 7405, 40537, 388394, 320732, 107132, -8421, 159192, 156377]
15685A56377K5378m1178b02643A4319c06239M375r4356h874j49578j10601C5150
15673D64920a6333C2126a30037A63037f329r9942I2708e5166k50375c2886C8340
15661I0719a34435A64958E9400h0831A44953m0695L6839C5231J02010P297b69325
15649c58786N4624J50397k3509h8425D8010m649a23698B07284i1837B15857a36033
15637a31639A04172K56226A33372h0196C42802b36913d7975A21095c16513k4488
15627c41001a19819A06150O762a09398d5075j4886A59538n7081M3818J96462g8846
15615I3403a4661A45292g6304l787A76907d00869C52332a83310a0317l8157r1408
15604a39882j08578e3182l8316o0570b8439l19338a3138B1785K0517J60193c22093
$$ y = [156377, 181755, 140577, -202643, 14319, -306239, -301864, -396220, -8874, -158452, -269053, 35150, 464920, -16333, 32126, -130037, 163037, -6329, -106271, 92708, -55166, -305541, -32886, 38340, 90719, -134435, 164958, 59400, -80831, 144953, 104258, 141097, 35231, 137241, 144538, -269325, -358786, -304162, -153765, -177274, -88425, 48010, 43361, -123698, 207284, -91837, 215857, -136033, -131639, 104172, 360398, 133372, -80196, 342802, -236913, -47975, 121095, -316513, -341001, -119819, 106150, 112912, -109398, -45075, -59961, 159538, 102457, 146275, 342737, -78846, 93403, -14661, 145292, -76304, -80091, 176907, -400869, 352332, -183310, -10317, -48474, -139882, -248460, -53182, -91498, -152068, -28439, -347777, -13138, 21785, 42302, 202495, -322093]
15592g8978m1720C55023p5332m9832i9721A28339J17159a92547B61894E1653j4533
15581C7120J12325R6903a09179k0952A80748I471b36451A49967h7667r8020e6824
15569a71022k00614a81821n4285d6010j52275H0532B3804b28160A06131l2123
15559G4008j8774J0002b53923p8972I8168g1102k8102k24260b8298j8297A31751
15547A42091C0525M05239b58742J06202f3032q1949M1635K1218B25256b41130
15536E5142a67960a3509j75050f217j10142A04358a8156k16243D2121A2835e4058
15524g8054j12800Q6569C7442a15617A26282D539J21628b92385J30979C82580
15513a36008B28205d2792G1055g0118j8624B24006A08933d23040C5549R3245e4877
$$ y = [-78978, -120698, 355023, 279691, 229859, -99721, 128339, 245498, -192547, 261894, 51653, 37120, 149445, 246348, -109179, -130131, 180748, 9471, -236451, 149967, -87667, -185687, -56824, -171022, -371636, -181821, -236106, -46010, -198285, 80532, 23804, -228160, 106131, 74008, 55234, 65236, -253923, -332895, 98168, -71102, -99204, -323464, -28298, -46595, 131751, 142091, 30525, 435764, -258742, -152540, -63032, -144981, -103346, -82128, 225256, -241130, 55142, -167960, -13509, -188559, -6217, -116359, 104358, -18156, -234399, 42121, 12835, -54058, -78054, -190854, -104285, 37442, -115617, 126282, 4539, 126167, -292385, -161406, 382580, -136008, 228205, -42792, 71055, -70118, -88742, 224006, 108933, -423040, 35549, 128794, -54877]
15501a43994c8616B47657I0185b0421B15817b32799A42062a03749j37664Q3487
15491a57926k2133c5941k93391a42820o3451I3480d46122c184k09831B09529f6954
15479B55268a76643e4262j26278P4114B35711e5073m7721C5539k474K40774j05720
15468A68119f7729E1209a25091C64786A53233J18319j24088a51808f6993A41051
15457A0273Q7762J06984a5748k8014j8788a6243H0459l0331i1330j17462A24341
15445a03126G0670b52772E1359J52049a01240A70188a06312A53499j9301e7437
15434h8446o0941c0334E8686K32810q2357a23425I9297e0172A57958n2184n1296
15423E4478c71319h0049H9071f5199j82439B40345O9222B5654b18623C09361J11247
$$ y = [-143994, -38616, 247657, 90185, -20421, 215817, -232799, 142062, -103749, -241413, -157926, -180059, -35941, -329332, -142820, -206271, 93480, -446122, -3184, -213015, 209529, -66954, 255268, -176643, -54262, -180540, -106426, 235711, -55073, -102794, 35539, 33065, 273839, 168119, -67729, 51209, -125091, 364786, 153233, 271552, 147464, -151808, -66993, 141051, 10273, 98035, 205019, -15748, -43762, -62550, -16243, 80459, 50128, -91330, -208792, 124341, -103126, 70670, -252772, 51359, 203408, -101240, 170188, -106312, 153499, 134198, -57437, -88446, -149387, -30334, 58686, 291496, 209139, -123425, 99297, -50172, 157958, 105774, 54478, -371319, -80049, 89071, -65199, -247638, 240345, 309567, 25654, -218623, 309361, 420608]
15412D20608b04166B36227e8595A06678g127j25702F9370a96525d9782k13089
15402b62871J12753d1462G6776h9111c4129b356A88886c23344H6718c04328a43302
15390b5591m4825k0790d0036D4512J8074L8681a5824l73108B60756a5199j30061
15379a45260A59064D1377R9924B5895i2796C09555J47798b11011B92118e1617
15368B49659f0984E9930a73493A11643a16958E1093g5874A3508L2223a55180b8367
15356a80750F9528J54985g5786j27898j12983a25223J135N5769a1245j3395E2913
15344I0208N8799a14955A58095B6618M1542J27174b40091A40282J34852b2445
15333D0842J57917l3046l3789K39597K0988C7990O6013b55044a05005D2722b83439
$$ y = [420608, -204166, 236227, -58595, 106678, -7127, -132829, 69370, -196525, -49782, -262871, -150118, -41462, 76776, -89111, -34129, -2356, 188886, -323344, 86718, -304328, -143302, -25591, -70416, -91206, -40036, 44512, 62586, 101267, -15824, -388932, 260756, -15199, -145260, 159064, 41377, 141301, 25895, -92796, 309555, 457353, -211011, 292118, -51617, 249659, -60984, 59930, -173493, 111643, -116958, 51093, -75874, 13508, 45731, -155180, -28367, -180750, 69528, 224513, -75786, -203684, -316667, -125223, -124088, -68319, -11245, -24640, 52913, 90208, 149007, -114955, 158095, 26618, 68160, 195334, -240091, 140282, 275134, -22445, 40842, 198759, 165713, 131924, 371521, 392509, 37990, 104003, -255044, -105005, 42722, -283439]
15321e1549A60132a73021A7230M1309K63314g9036j0053k5524C13906b69625j8166
15310b87791A35707n228a1999I249L45166a2487j24973m6739B20855R270l9626
15299A90499A6901c79095J72490K8217h297A45172J9462l3839d9402r159k9920
15288h8481k15550A64616a26641p0100A26201n3944b3644A76041p7868b9435i029
15276A17451p544a57255B22723e5435j575k3575l874C3783j5777b92780G7982
15264a00106A49024j7921N3537J6067m6978A1911L07916l3875o3745L9589a35744
15252H8774g9640B27258G1637Q8551M55019J69914J8253K67736k00457l31236
15242E39417E8237J43592g5360F7580L6641J56053A20915J41826f724m21828B18470
$$ y = [-51549, 160132, -173021, 17230, 58539, 321853, -79036, -89089, -114613, 313906, -269625, -287791, 135707, 130479, -11999, 9249, 354415, -12487, -137460, -184199, 220855, 230125, 190499, 16901, -379095, -206605, -178388, -8297, 145172, 164634, 130795, -49402, -58561, -88481, -304031, 164616, -126641, -196741, 126201, 72257, -23644, 176041, 98173, -29435, -9029, 117451, 109907, -157255, 222723, -55435, -57010, -80585, -84459, 33783, 18006, -292780, 77982, -100106, 149024, 131103, 184640, 200707, 153729, 11911, 319827, 285952, 222207, 261796, -135744, 88774, -79640, 227258, 71637, 160188, 615207, 785121, 803374, 1071110, 870653, 539417, 58237, 201829, -75360, 67580, 104221, 260274, 120915, 262741, -6724, -428552, 218470]
15230B5132J44182i73j2349A10568b40690M6260A24240a0930C49230a05972A0068
15218a87219E5479b71783C25582p3213m5081l2755n2984k5794P2219n3002a58891
15206A25136f0940B71101j25165n5863c94428b177A20441J00719m2784c4179l260
15195c7439c455D9283M3865m1516A5825R0907a51400A13764B0088K70878c642
15183C5930d9413D9058h2311B4402b557o1542N867H4731g2964C38845E801h822
15170g9740D00421B9021K54920F7596O5341a09238C58931A28444h5151o8731F96
15158c5670D9348c4956A27483Q2914H4710C1862J86342n7320K4613K3473j04446
15147A04524A6619b3957A56442g3988A98485f9635p1904h624r8737B28301a01439
$$ y = [25132, 169314, -973, -13322, 110568, -240690, -194430, 124240, -10930, 349230, -105972, 10068, -187219, 55479, -271783, 325582, 252369, 207288, 174533, 121549, 95755, 167974, 114972, -158891, 125136, -60940, 271101, 145936, 90073, -394428, -2177, 120441, 221160, 178376, -34179, -37439, -3455, 49283, 93148, 51632, 15825, 106732, -151400, 113764, 20088, 290966, -3642, 35930, -49413, 49058, -82311, 24402, -2557, -64099, -58232, 84731, -72964, 338845, 5801, -8822, -79740, 400421, 29021, 283941, 67596, 132937, -109238, 358931, 128444, -85151, -153882, 696, -35670, 49348, -34956, 127483, 210397, 84710, 31862, 218204, 160884, 185497, 208970, 104524, 16619, -23957, 156442, -73988, 198485, -69635, -141539, -8624, -107361, 228301, -101439]
15135F8637b2846A32102i0998A10049J40340j01680i1351J9411h227n5554a5226
15123A78735G7786d2272B16957f5947K0370E8983J37048A8415a87989a4919D681
15111B68805D4934K32338e8926B13940H246J08565J29438a26579b6138E81J12587
15100A13168Q0829p705a46266B94629j36737J43957b41369A41491o0603N8074
15090A38962J7624m0691a58668B27190L8596N4576a30677I5233J32225C6735J72295
15079B09030a54674C22809d139A46735N0668K08312A43722a6465N30n2038C03454
15067E561M5025J79763H7693P6314m97b71k6731A64969k3291M9195A3439M01106
15055D14545K37651a15482B85006a90289D71a5249C408K72120h801A12776c9594
$$ y = [68637, -22846, 132102, -90998, 110049, 250389, 148709, -91351, -71940, -8227, -63781, -15226, 178735, 77786, -42272, 216957, -65947, -45577, 58983, 196031, 18415, -187989, -14919, 4681, 268805, 44934, 277272, -58926, 213940, 8246, 116811, 246249, -126579, -26138, 581, 113168, 193997, 186292, -146266, 294629, 157892, 301849, -241369, 141491, 80888, 138962, 156586, 115895, -158668, 227190, 265786, 320362, -130677, 95233, 227458, 36735, 209030, -154674, 322809, -4139, 146735, 197403, 405715, 143722, -16465, -15935, -67973, 303454, 5561, 50586, 230349, 87693, 164007, 163510, -271, -27002, 164969, 141678, 190873, 13439, 414545, 652196, -115482, 285006, -190289, 471, -15249, 3408, 275528, -8801, 112776, -39594]
15043B59016I8995b45458A73398a0137C69841j68475H1909L04903j36287F5568
15032A77024l3114N8913E7751J46686a32325B94802J62951k08810J08024j74960
15022A82007Q1257p6217l908J43602K9836d5593A69482J43908E9632a02897E22227
15010B54242G6527i3073A59855A1822B0K77038A08897O590P6264p0960P8494q3579
14998A15706P7053j0863H3060a53748E0017G766K24956b82589B16145P9904j20044
14987A76005m115N7648n1351E5417J13043b54608A03363M0068K78576f9260D31390
14975D8976n89L17384A14412K60665l6726p4158A27394L2860J05136J06356k7729
14964C44017A35298K3575m3865P4807K12924n2224G8521O0322m0691b01305A92947
$$ y = [259016, 98995, -245458, 173398, -10137, 369841, 201366, 81909, 386812, 250525, 65568, 177024, 143910, 202823, 57751, 204437, -132325, 294802, 457753, 248943, 356967, 182007, 263264, 187047, 183139, 326741, 356577, -45593, 169482, 313390, 59632, -102897, 522227, 254242, 76527, -93073, 159855, 11822, 20, 277058, 108897, 115487, 191751, 120791, 199285, 115706, 192759, 181896, 83060, -153748, 50017, 7766, 232722, -282589, 216145, 296049, 176005, 171890, 229538, 178187, 55417, 168460, -254608, 103363, 143431, 422007, -69260, 431390, 48976, 48387, 365771, 114412, 375077, 338351, 264193, 127394, 160254, 265390, 371746, 344017, 135298, 158873, 115008, 189815, 402739, 350515, 78521, 138843, 98152, -201305, 192947]
14952B54646I1913P8891O1705E03J72343J39576P6436A07213L85720F2093K19344
14941B81437B104K08536f0892B77456j093G2176M15736A31050O8896J27132l733
14930C23345A20402n0618K48366J90763H9553K53945J35021j48321r1713j9530
14920B18955p9784K38400j13949o9780K20221r1764P746F6431J12725F2180M67812
14909E29992B29430J088N9539R3759q247j07042A04031M4879K2796K1771L9620
14898B33097J79942i4624B52186N2580P6543p9895j03046C2453R2148K69908G5741
14886A40865O3652H6671Q4868J97048M40653B68647n8693J20489m0288p090m3454
14875B39611A11135K10829k2171p4007K23995o4614j39611H3353N22428B84659
$$ y = [254646, 91913, 170804, 232509, 503, 172846, 312422, 388858, 107213, 492933, 62093, 281437, 2104, 210640, -60892, 277456, 276363, 72176, 487912, 131050, 199946, 327078, 323345, 120402, 69784, 318150, 508913, 89553, 343498, 478519, 330198, 238485, 218955, 139171, 377571, 263622, 193842, 414063, 322299, 330045, 66431, 179156, 62180, 529992, 229430, 230518, 290057, 383816, 375569, 268527, 104031, 148910, 171706, 193477, 233097, 413039, -94624, 252186, 304766, 381309, 301414, 198368, 32453, 124601, 394509, 75741, 140865, 204517, 86671, 171539, 368587, 809240, 268647, 209954, 330443, 290155, 283065, 239611, 111135, 321964, 299793, 225786, 449781, 385167, 245556, 83353, 605781, 284659]
14864B23252M16781j82707k22121O09564D19759k4834j33918p6998j5196K04073
14854C72886A20144K45905J53269r9992G3677J78518J06070p3720j33614m892
14844A46039K37765J72035d5978A35443K73136Q2631N5713j41260j13261L6129
14834C28531J36547j72250K44172E0910K67244R3572j29416K28371k19863F0393
14823D81977j87273N7586L68028C01178J79651k7636J74127B38871K60041j94562
14813C04350J02447M2753A45746N1760M49700k94426O0273j54570k3693K51319
14803D86109r4311j26015K3090K8688J25719A08838N81403C17707P127k092M53869
14792G76611i338I6729L48644j12092m9620K60197j04766o0182r4460P991Q7801
$$ y = [223252, 640033, 457326, 235205, 844769, 419759, 394925, 261007, 184009, 168813, 372886, 120144, 366049, 519318, 419326, 73677, 252195, 358265, 284545, 150931, 146039, 383804, 555839, -45978, 135443, 408579, 491210, 546923, 405663, 292402, 328531, 465078, 292828, 537000, 50910, 318154, 411726, 282310, 510681, 290818, 60393, 481977, 294704, 352290, 720318, 301178, 480829, 453193, 627320, 238871, 498912, 304350, 406797, 449550, 145746, 197506, 647206, 352780, 413053, 258483, 234790, 486109, 391798, 265783, 288873, 317561, 443280, 108838, 690241, 317707, 324834, 322742, 776611, -9338, 96729, 445373, 333281, 283661, 543858, 439092, 378910, 284450, 292441, 380242]
14781C80242q5837J62493Q5740r7992p3697K13546A89875K52324K18851k00427
14771D60623J4014J2896P65j58094p9182M39012j45169L62466j84212j99065l8749
14760D85305j73925J84243J54093B05623J82972q3896L71683j38424l7842J47052
14750F47168m7864o8718k11824K91754O8078l09262O065K16515L7066A55273O18444
14739G73717l20001L55065q8582k71271l7748L68352n5223k48311K85471J65543
14729I27012k93840j06914J99234l9163J33629l48699j12349M95864j73418k05487
14719D75869J01289j42886J14204j95540M21911K92469j95943C65710L79775C68104
14708A033042m82858J06824Q8413j56293K5891j12789N679m9331K42644P4422
$$ y = [380242, 294405, 456898, 542638, 444646, 370949, 584495, 189875, 442199, 661050, 460623, 474637, 487533, 488298, 330204, 251022, 690034, 544865, 907331, 723119, 524054, 485305, 311380, 495623, 649716, 205623, 388595, 304699, 676382, 537958, 500116, 647168, 599304, 530586, 318762, 610516, 678594, 369332, 375397, 591912, 628978, 155273, 773717, 453716, 808781, 720199, 448928, 411180, 779532, 724309, 475998, 761469, 927012, 633172, 526258, 725492, 686329, 819958, 471259, 358910, 854774, 681356, 475869, 577158, 434272, 548476, 352936, 774847, 1067316, 871373, 365710, 745485, 368104, 1033042, 550184, 657008, 745421, 589128, 615019, 502230, 507909, 458578, 701222, 775644]
14698G75644j10979J48443N5912r7334J53816o9849R7759j26688j40956K5258
14688G11026j74709J47306L29431l95226q3911L33713L6412j60596J93995j01784
14678H35657Q2086k48251J11962k1684L114J86060j09800j5527J46949q7626K5621
14667I08561m880j40373R7281J72209k10503p7923L33423j45433j22144R5009
14657I05227K61195j10653j75231J02551D58514N43574m3246K73066j78558l06445
14647G46905N01113j56023m51237M05804k25992J59971L698j0409K147J30499
14637A106476J5554j54808K24542L3833k5887j71207P6570p8324P2142r1329L38005
14626A345567r4954k20572q3303O8971Q7253M3769l957K78973m35256k9452J23411
$$ y = [775644, 664665, 813108, 869020, 771686, 925502, 855653, 953412, 826724, 685768, 711026, 536317, 683623, 1013054, 617828, 533917, 867630, 904042, 743446, 937441, 835657, 917743, 669492, 781454, 759770, 762884, 948944, 839144, 823617, 970566, 882940, 908561, 903681, 763308, 860589, 1032798, 822295, 744372, 1077795, 932362, 810218, 905227, 1166422, 1055769, 880538, 983089, 458514, 1002088, 958842, 1231908, 1053350, 746905, 1248018, 1091995, 640758, 1046562, 820570, 980541, 984239, 973830, 975977, 1106476, 1122030, 967222, 1191764, 1225597, 1199710, 1028503, 1105073, 1026749, 1098891, 1007562, 1345567, 1250613, 1030041, 946738, 1015709, 1102962, 1146731, 1142774, 1421747, 986491, 957039, 1080450]
14615A080450L85640l11347l86794L21278J88174m6211K72033l82396K32953k25192
14605A128588K97814p7945N5913k83432K38599m85878M17544J28184j15576K72392
14595A576203j81962K10461r2096l29667J0359N19902l44179k7345L5905J36277
14585A513858r3462o9046K54276j34566M75916k78851j0644J20659k48096K44949
14575A774993L5628J16301J6701m79728k46015Q48317j73012j6767j07179K99483
14565B068722o3011j51587M42516j14833L71314n85928J60891P0449K31248l0431
14555B399350L10885K92122R0487N08566L24400J067742J873009N245783J0019370
14546B2131714J2949691n088473j1405355I217965m281680k088054o78682j64724
$$ y = [1080450, 1466090, 1154743, 767949, 1089227, 1277401, 1231190, 1503223, 1120827, 1353780, 1128588, 1426402, 1348457, 1404370, 1120938, 1359537, 873659, 1291203, 1419387, 1303811, 1576203, 1394241, 1604702, 1512606, 1182939, 1193298, 1713200, 1369021, 1341676, 1377581, 1513858, 1420396, 1351350, 1605626, 1471060, 1946976, 1668125, 1657481, 1778140, 1530044, 1774993, 1810621, 1926922, 1943623, 1463895, 1217880, 2066197, 1893185, 1876418, 1769239, 2068722, 2005711, 1854124, 2296640, 2181807, 2553121, 1967193, 2128084, 2198533, 2429781, 2399350, 2710235, 3002357, 3092844, 3601410, 3925810, 4993552, 6866561, 12112344, 22131714, 35081405, 29992932, 18587577, 9217965, 4936285, 2848231, 2169549, 2004825]
14538B004825j40454j85155K91392o10837J85248K34399L4045j95471K5760K37691
14528A881443J9798j98708L40386J14964k12494J97600l16448J51100m2409J03143
14518B038375J48368P8013k14031j8268K30916j7641q4210L88490k64065o3992
14508B221955M1709P9357L0148k62463L3430K36008j738R8464L2373K33338j09269
14497B633312J21580O4397l59930J39884j6737O8093K49403p1045j76478J15496
14487B767975K95757p7543j22163k5289K78759l22026K20965Q7949k59294M28900
14477C273990k09752L98874P2643m74547N07193j94774p0477R7982q9292J46931
14467C458771K52948J11911r4613k74919J8681J98650k1785M32807k02294J24255
$$ y = [2004825, 1864371, 1679216, 1970608, 1359771, 1545019, 1779418, 1813463, 1617992, 1643752, 1881443, 1901241, 1702533, 2042919, 2157883, 1945389, 2142989, 1826541, 1977641, 1935232, 2038375, 2186743, 2264756, 2050725, 2032457, 2263373, 2245732, 2161522, 2550012, 2285947, 2221955, 2263664, 2343021, 2373169, 2110706, 2144136, 2380144, 2378406, 2476870, 2509243, 2742581, 2633312, 2754892, 2819289, 2459359, 2599243, 2582506, 2650599, 2900002, 2828957, 2652479, 2767975, 3063732, 2986189, 2864026, 2838737, 3117496, 2795470, 3016435, 3104384, 2845090, 3273990, 3064238, 3463112, 3535755, 3061208, 3568401, 3373627, 3303150, 3401132, 3311840, 3458771, 3711719, 3823630, 3729017, 3454098, 3472779, 3671429, 3649644, 4082451, 3880157, 4004412]
14457D004412K36579j93829J52210q9987M15592j89374O2736K33175N707J50837
14447D788058o786m59095L19893j47907J68013J12523L45876j65729L7127m4581
14437D947392J56140R9353K51452o5056j91619K87137j26150J89146K40146j06468
14427E681473J8792J70223J74182N5707J15367J04773J56424j37655J01300n199
14417F435387N333K01911J26005J55158L82777k11620j78748K71822J92945L9163
14407G420133J20209L80713J90857l97818O14992j80296L33357M67083k42938
14398H706292N24109l37913K83516K7028J96575O9994J99861L788L06469J53843
14388A0133562L03234K99724n68196P92756L48552M27947m7808q0708L17266K43664
$$ y = [4004412, 4240991, 4047162, 4199372, 4109385, 4524977, 4335603, 4398339, 4631514, 4637221, 4788058, 4781272, 4322177, 4642070, 4494163, 4662176, 4774699, 5120575, 4954846, 4991973, 4947392, 5103532, 5202885, 5454337, 5389281, 5197662, 5484799, 5358649, 5547795, 5787941, 5681473, 5700265, 5870488, 6044670, 6100377, 6215744, 6320517, 6476941, 6339286, 6440586, 6435387, 6440720, 6642631, 6768636, 6923794, 7306571, 7094951, 6916203, 7188025, 7380970, 7420133, 7540342, 7921055, 8111912, 7714094, 8329086, 8148790, 8482147, 8949230, 8706292, 9230401, 8892488, 9176004, 9203032, 9399607, 9469601, 9669462, 9673250, 9979719, 10133562, 10436796, 10736520, 10168324, 10961080, 11309632, 11737579, 11689771, 11609063, 11926329, 12169993]
14378A2169993J90551K88677K04867M82804J12310J42662P16797m45620M10311
14369A4273352N08668R2052M36992N41897o9879O62504M04200J88788K46116Q06784
14359A8091474l7771N06592J19800Q46378P62415j48349P86326L91116N29338
14350B1847319R71843J73388M90912P64488K61522M45650J218849L89450Q62261
14341B7425682P31852R07017Q43914N37859R36988R06108Q02137J249317R81851
14332C5322725R69884J301274J141741J000346J557408J364704J729528J037418
14324D5425028J620193J665945J908513J582885J577570K245250J827591K185851
14316F0038826K639336K247033K499607K961497K677108L457577L470502L150331
$$ y = [12169993, 12360544, 12649221, 12854088, 13336892, 13449202, 13591864, 14308661, 13863041, 14273352, 14782020, 14874072, 15311064, 15852961, 15783082, 16445586, 16849786, 17038574, 17284690, 18091474, 18053703, 18560295, 18680095, 19526473, 20288888, 20140539, 20926865, 21317981, 21847319, 22819162, 22992550, 23483462, 24247950, 24509472, 24955122, 26173971, 26563421, 27425682, 28157534, 29064551, 29908465, 30446324, 31383312, 32289420, 33091557, 34340874, 35322725, 36292609, 37593883, 38735624, 39735970, 41293378, 42658082, 44387610, 45425028, 47045221, 48711166, 50619679, 52202564, 53780134, 56025384, 57852975, 60038826, 62678162, 64925195, 67424802, 70386299, 73063407, 76520984, 79991486, 83141817]
14308H3141817L703972L988689M109545M190556M760769N169969N474325N669307
14300A20208949N882818O455604O953744P453258P468957Q390747Q845256R790419
14292A81449752R806205J0983354J1238084J1821573J2624092J3501173J3553606
14285B64977839J4827741J5011450J5080258J5890073J5618589J5675292J5140766
14278C72222008J4720669J4079556J2691718J1550299Q341621M264598L63855
14271D38234324r17118r08194k343580q573300k647644l303333p897975j1661041
14263C99982139j3617321j4290959j5379806j6024408j6384942j5973979j5953249
14256B92357475j5467380j4414540j3560567j3555847j2633109j2071156j1638486
$$ y = [83141817, 86845789, 90834478, 94944023, 99134579, 103895348, 109065317, 114539642, 120208949, 126091767, 132547371, 139501115, 146954373, 154423330, 162814077, 171659333, 181449752, 191255957, 202239311, 213477395, 225298968, 237923060, 251424233, 264977839, 279805580, 294817030, 309897288, 325787361, 341405950, 357081242, 372222008, 386942677, 401022233, 413713951, 425264250, 433605871, 437870469, 438234324, 437317206, 436409012, 434065432, 425492132, 422844488, 419541155, 411643180, 399982139, 386364818, 372073859, 356694053, 340669645, 324284703, 308310724, 292357475, 276890095, 262475555, 248914988, 235359141, 222726032, 210654876, 199016390]
14249A99016390j0458393j0018186r741553q613730q244877p328051p563872o885010
14241A30162718o291890o055496n294601n168621m797092m973778m226318m308353
14233H9046569l393166l584301l185865l397678k926015k891623l009067k638105
14225F4020749k302857k711692j702572k450701j905488j481210j913868j953068
14217D7599293j394353j483416j751809q44812j207400j076652j546558j380127
14209C6914166j018883p79477r05923j072858q71156j235295r07210r18853l00011
14200B8904500o84162j205347n67546o57660p17072o06116o14604n32133p51682
14191B2568178m66427o26283j00032r36466j64560j043615k28407n36291k49178
$$ y = [199016390, 188557997, 178539811, 168798258, 160184528, 151939651, 144611600, 137047728, 130162718, 123870828, 117815332, 112520731, 107352110, 102555018, 97581240, 93354922, 89046569, 85653403, 82069102, 78883237, 75485559, 72559544, 69667921, 66658854, 64020749, 61717892, 59006200, 57303628, 54852927, 52947439, 51466229, 49552361, 47599293, 46204940, 44721524, 42969715, 42124903, 40917503, 39840851, 38294293, 36914166, 35895283, 35115806, 34209883, 33137025, 32265869, 31030574, 30123364, 29204511, 28904500, 28220338, 27014991, 26447445, 25789785, 25072713, 24466597, 23851993, 23319860, 22568178, 22101751, 21475468, 21375436, 20438970, 20274410, 19230795, 19002388, 18466097, 18216919]
14182A8216919j18654m68896n75843j15705n46525l85312j60143n64173J91262
14173A5472930p64786n50991P0047m93294J22373o80052k81504O3386j40898j95699
14163A2621512p17995j17042o481m58330K26396n61775j58756k67649k43484j94796
14153A0121600P1540j89953K53646o19795k5668m37638O4524l50989K19347n68299
14143H538315K36777k01805k71146j69062J93193j72189k23876q1569k38762M9834
14133G659710m4464j46395j07526l26936R6408j29556k05864K72899k55721k8647
14123F783908o12648J15929Q3315j13005m6567j41121R58j70508K13758k40260
14113E873759k36324m3865K78506l91248p6559K50286k52723j32882k823l0031
$$ y = [18216919, 18098265, 17629369, 17053526, 16937821, 16391296, 16005984, 15845841, 15281668, 15472930, 14708144, 14157153, 14227200, 13733906, 13856279, 13176227, 12894723, 12958109, 12817211, 12621512, 11903517, 11786475, 11779994, 11321664, 11548060, 10986285, 10827529, 10559880, 10316396, 10121600, 10193140, 10003187, 10256833, 9637038, 9611370, 9173732, 9238256, 8887267, 9106614, 8538315, 8775092, 8573287, 8302141, 8133079, 8326272, 8154083, 7930207, 7848638, 7609876, 7659710, 7615246, 7468851, 7361325, 7034389, 7130797, 7001241, 6795377, 7068276, 6812555, 6783908, 6171260, 6287189, 6370504, 6257499, 6210932, 6069811, 6070769, 5900261, 6114019, 5873759, 5637435, 5593570, 5872076, 5480828, 5404269, 5654555, 5401832, 5268950, 5266127, 5236096]
14103E236096j52172J16996k57373l35440L37018j29770l12739O7683p1798J91853
14093D690354m39997L20032m86689J28088J72037m8719k07672k31983J6277P0898
14083C982626j7554J45543p8441j44214j2374j68237o9297j18400N1386m1022
14073C530016L10062m44252K8179N0861M02280m21939k45796P4454j06895K25805
14063C402775k45704J35247K20434m27141J33475J87448k35378N2435n1539j28531
14053C043521q1155k83787M76638j47942j47960J14710n13099L55127J65293p84376
14043B196970L93941K31742l39921K79063k91976k494K43291k52296j19305M1498
14033B380513l7474J4157N386P6908J75405o3844j69937j15154l7470p7317J10981
$$ y = [5236096, 5083924, 5200920, 4943547, 4608107, 4945125, 4815355, 4502616, 4570299, 4498501, 4690354, 4250357, 4570389, 4083700, 4211788, 4383825, 4335106, 4127434, 3895451, 3911728, 3982626, 3965072, 4110615, 4032174, 3887960, 3875586, 3707349, 3638052, 3519652, 3571038, 3530016, 3840078, 3395826, 3424005, 3474866, 3877146, 3455207, 3209411, 3283865, 3176970, 3402775, 3157071, 3292318, 3512752, 3085611, 3219086, 3406534, 3171156, 3223591, 3172052, 3043521, 2962366, 2678579, 3155217, 3007275, 2859315, 2974025, 2460926, 2816053, 2981346, 2196970, 2590911, 2822653, 2482732, 2761795, 2469819, 2467325, 2710616, 2458320, 2339015, 2380513, 2343039, 2357196, 2362582, 2439490, 2614895, 2551051, 2381114, 2265960, 2228490, 2151173, 2262154]
14022B262154J4809k28925J23293J14686r0908m17493J00458j95541M80957r5690
14012B067800K03479l64495j18300N28675n58703l5272J79744r7771J03666m88067
14002A420756L69802K67444l24077k52674J77426J06105j12506j37488l72556
13993A142232N59574N0012K9247O27017J253128L786076Q973728J5078202n9424
13984C1439792r835938r426351n004223k153206j169349p30650k65199n30143
13976B324733J72794k10148k11514j99094K58012j26647l5901P7633j23509K8880
13966A955239l20207K93316k29858j93051Q1262M9577L3295M4241k41306J48497
13956A621005Q8451L5031k05720k96095L51967j36167J15796l48071K20982K09431
$$ y = [2262154, 2276963, 2048038, 2171331, 2286017, 2195109, 1777616, 1878074, 1682533, 2163490, 2067800, 2271279, 1906784, 1788484, 2317159, 1758456, 1723184, 1902928, 1805157, 1908823, 1420756, 1790558, 2058002, 1733925, 1481251, 1658677, 1764782, 1652276, 1514788, 1142232, 1701806, 1751818, 1781065, 2408082, 3661210, 7447286, 16421014, 31499216, 31439792, 21603854, 12177503, 7173280, 5020074, 3850725, 3120075, 2854876, 2324733, 2497527, 2287379, 2075865, 1876771, 2134783, 2008136, 1972235, 2049868, 1926359, 1955239, 1635032, 1928348, 1698490, 1505439, 1586701, 1636278, 1669573, 1713814, 1472508, 1621005, 1709456, 1744487, 1538767, 1242672, 1594639, 1458472, 1574268, 1226197, 1447179, 1656610]
13946A656610j96194n3920k9041K02901m00107J50821J90988j2064k82386J54560
13936A382168J26415O288r0903j04938J23977j2559J09530l93339K85732J01844
13926A534215m58355j29388J94740K26728m67966L58240J23187k08163R6854m9379
13916A220713l02695K16219q6137J07896n7087l48969M12793o3025j40303r2479
13906H66926M74463j41946J60052Q204m4179Q7757k48207k69812M25047j95871
13896A122434O3685n88126L45983L22324k32612j91158J5083J94320J48858n26174
13886F74617J3532O53673k87627p7763Q5381j08629j5890k58337K01762K43680
13876A124399m63033K68731P2938k08102L52480r9768j42882N0259j78660K63028
$$ y = [1656610, 1460416, 1406496, 1377455, 1580356, 1180249, 1331070, 1522058, 1509994, 1227608, 1382168, 1508583, 1514871, 1423968, 1319030, 1443007, 1430448, 1539978, 1146639, 1432371, 1534215, 1075860, 946472, 1141212, 1367940, 899974, 1258214, 1381401, 1173238, 1270092, 1220713, 918018, 1134237, 1048100, 1155996, 1098909, 749940, 1162733, 1099708, 959405, 866926, 1341389, 1199443, 1359495, 1367699, 1323520, 1411277, 1163070, 893258, 1318305, 1122434, 1186119, 597993, 943976, 1266300, 1033688, 842530, 857613, 1051933, 1200791, 674617, 688149, 1341822, 1054195, 976432, 1061813, 953184, 937294, 678957, 880719, 1124399, 661366, 930097, 1003035, 794933, 1147413, 1047645, 904763, 955022, 776362, 1039390]
13866A039390j02553p107P8930k45441L53955k78124R0741j89762r0464J51514
13856H01079P8648r9201p9681L41677r151m0938k27715k2536k82601K19575K10697
13845H89853k9693k43678J37186l4294p7263M23368l02650M10633m76350r4050
13835F03062L02703k72448J45366Q9432k3166p7575J86957k25943J42964l19529
13825E51823P8035K57248k08262m2818k03461N0449j2660J65845M0177J72818
13815H49194l49136J68044k30839L90347l47448M52111k46574L22966C80704L69951
13805G50655l24452J49788p6884P2656J47357j95705L51378k56252R6174p9364
13795F35351p2461J33721J8375l9688j17773N3263j71797K89857k65357l3469
$$ y = [1039390, 936837, 929730, 1008660, 763219, 1117174, 839050, 929791, 740029, 649565, 801079, 879727, 780526, 700845, 1042522, 1033371, 992433, 764718, 742182, 459581, 679156, 889853, 860160, 616482, 753668, 719374, 642111, 1065479, 762829, 1173462, 697112, 603062, 905765, 633317, 778683, 868115, 844949, 767374, 954331, 728388, 871352, 551823, 629858, 887106, 678844, 636026, 432565, 483014, 470354, 636199, 676376, 849194, 500058, 668102, 437263, 827610, 480162, 932273, 685699, 1008665, 380704, 750655, 426203, 575991, 499107, 571763, 719120, 523415, 874793, 618541, 714715, 635351, 562890, 696611, 714986, 675298, 557525, 610788, 438991, 728848, 463491, 430022]
13785D30022K76673j56885N97J26981j86968J53054L3188K6179l05095L5341K18446
13774F51533N7351j0806j5566k37116J27471K14287q8432l11085L9012K84944
13764G11593j11819A90005M33580B75475L49173r4468m8624B32755J10475K25184
13754E68414J01790k2972q357B79455J89386P2546k47026M10374k35261o818A35762
13742F33714j9240j79799J50000j84697j3288N9945J2070o7327K64241k59220
13732C96399K05706A18504J98741r3654i121E71993j91881J08463O2853K2388
13722E73816k84668J67589j78915g9067C35970O3596J52236k31067j0190J05130
13712D15675M664Q9481J26973J0610B57342k9732M13789m7791j96909n55M1870
$$ y = [430022, 706695, 549810, 550407, 677388, 490420, 643474, 676662, 702841, 397746, 433087, 651533, 708884, 698078, 682512, 445396, 572867, 787154, 698722, 387637, 426649, 711593, 599774, 190005, 623585, 275475, 624648, 530180, 481556, 232755, 343230, 568414, 670204, 647232, 638875, 279455, 468841, 541387, 294361, 704735, 469474, 462656, 135762, 633714, 614474, 434675, 584675, 399978, 386690, 446635, 458705, 391378, 655619, 396399, 602105, 118504, 317245, 223591, -9121, 571993, 380112, 488575, 551428, 573816, 289148, 456737, 277822, -79067, 335970, 399566, 551802, 320735, 310545, 415675, 420339, 509820, 636793, 647403, 257342, 227610, 641399, 593608, 396699, 396144, 438014]
13701D38014j24103p1837K54712j74766M03761k64503J51153j03978k38090P0056
13691C40419k9707M28927k88618J85296k06646A65167R2845M8010J12791P8182
13681D96995p5685J19514l2159r6548r560r8832M19759k03558j38433j14268j1843
13670B55382L46094k25502q7520j30735J35919J80478j40422j9634n1564r7314
13660A65182J70885j03340J60136l6351j31227j07031J99070K39022k29110j7687
13650C09549J4442J70703K520k29684J20828j13347K53205Q021k32153j00455
13640B03629m0343j8815Q95L01265R5034j00363j44272O753J86338q3555H6503
13628B44895K40513r3819q3330Q9267D7539M39704Q2639e6164C07097o9131J42898
$$ y = [438014, 313911, 242074, 496786, 322020, 725781, 461278, 612431, 508453, 270363, 340419, 310712, 739639, 451021, 636317, 429671, 165167, 258012, 306022, 418813, 496995, 421310, 540824, 508665, 412117, 402557, 303725, 723484, 519926, 381493, 267225, 255382, 601476, 375974, 288454, 157719, 293638, 474116, 333694, 314060, 262496, 165182, 336067, 232727, 392863, 356512, 225285, 118254, 317324, 556346, 327236, 309549, 323991, 494694, 497214, 267530, 388358, 275011, 528216, 536237, 304084, 203629, 163286, 144471, 145366, 446631, 541665, 441302, 297030, 303783, 490121, 406566, 86503, 244895, 485408, 391589, 308259, 397526, 47539, 487243, 569882, -56164, 307097, 237966, 380864]
13617C80864m3314N8823A69588o8177L58360j59904I0940L00536m597q7028J05594
13606D05445L9103N6818J79216B97114m2273m6187Q090J72844r1311L03676a33032
13594A23581K26437o1643r7714J42088b7464A79557R8284M8912k6049j23685J22623
13583B99642Q8374a30923E06195j48654j14768p3000O7331G5853J57690K41296
13573D74839i8485B15317c9005F6014J07403o6458J69910l3587J00244D9168K32250
13562B81418O0036A65546L4212R1142H659f0913D1880L42153k2271A08677K52735
13551C61412j40873J54673e1343D01306d6923C64838F2538K09696n7489N6115
13541B70860A05607J97375l1726m0017L3040N1097r4052j4855J28489k0661B5270
$$ y = [380864, 337550, 396373, 169588, 101411, 459771, 299867, 90940, 391476, 386879, 299851, 405445, 444548, 501366, 680582, 297114, 254841, 208654, 216744, 389588, 298277, 601953, -133032, 123581, 350018, 288375, 190661, 332749, -27464, 179557, 277841, 326753, 300704, 177019, 299642, 388016, -130923, 506195, 357541, 242773, 169773, 237104, 75853, 233543, 474839, -98485, 215317, -39005, 66014, 173417, 106959, 276869, 243282, 343526, 49168, 281418, 341454, 165546, 199758, 290900, 8659, -60913, 41880, 384033, 361762, 108677, 361412, 220539, 375212, -51343, 401306, -46923, 364838, 62538, 272234, 214745, 270860, 105607, 302982, 271256, 231239, 264279, 315376, 221324, 206469, 334958, 314297, 25270]
13529A54851K89150F0168O1570M47295G4891d5234E03543A51285J36002L6399
13519C23686r8150o2451b9932F3824M54900A41180K36802P12A41123L76708H5245
13507A38558K68646A87033e8855H8920d244I0099L43529r3901j01174a28883E06638
13495F5054K46232E3452L00176r7905l7567q6741J9041l2718b57121A56797O2026
13484B18823p1777L29214B00321P1326r7300M529p6791K57095r1529q276r721
13473B49654j16763J53158K1832j40818a18954A90282b13555D5757e2478A22827
13462h2514A92023a72128e8039h071B59158J10407a05206A15156J82118j13451
13452A83823n3959J1886m6733J43607l1410a675A84526L5981D4219N7272M2106
$$ y = [154851, 444001, 60168, 121738, 569033, 74891, -45234, 503543, 151285, 287287, 323686, 225536, 163085, -29932, 63824, 518724, 141180, 377982, 378694, 141123, 517831, 85245, 138558, 407204, 187033, -58855, 88920, -4244, 90099, 433628, 339727, 238553, -128883, 506638, 65054, 311286, 53452, 353628, 255723, 218156, 131415, 150456, 117738, -257121, 156797, 218823, 147046, 476260, 200321, 271647, 174347, 178876, 102085, 359180, 267651, 259375, 249654, 132891, 286049, 307881, 167063, -118954, 190282, -213555, 45757, -52478, 122827, -82514, 192023, -172128, -58039, -8071, 259158, 369565, -105206, 115156, 297274, 183823, 129864, 141750, 95017, 238624, 207214, -1675, 184526, 220507, 44219, 101491, 143597]
13441A43597K04372j65728g225A93951E9389H840J61369O4755a80722B37219m3631
13430A93588R4687i4877A55279Q8291n5602H195K35205j14945m3252a12701B47365
13418I0318M4164J30990G2610c72259C62003A56156F4288L38696A18379m0770
13408G7609M35848A05728J95353C5222K65063p4279M4724p9376E8383J15289d9233
13396b08191A756K92486I5746i3190B33314a00567B48417a6047B92859C0437K81727
13385C12164F0095P1476R8101R760g5406C8561Q7184E374K55798O1813n4937A04027
13372E5270J70805a40927B38399f8131G0786J95597a4080D23016A82363b6779
13361G9840n097J14784N6437J15342A50940a21575A1056a4596A40150a10236C26153
$$ y = [143597, 347969, 182241, -7225, 193951, 59389, 8840, 170209, 234964, -180722, 237219, 193588, 288275, -94877, 155279, 243570, 187968, 8195, 243400, 128455, 85203, -112701, 247365, 90318, 134482, 265472, 72610, -372259, 362003, 156156, 64288, 402984, 118379, 77609, 513457, 105728, 301081, 35222, 300285, 226006, 270730, 191354, 58383, 173672, -49233, -208191, 1756, 294242, 95746, -93190, 233314, -100567, 248417, -16047, 292859, 30437, 312164, 60095, 131571, 229672, 239432, -75406, 38561, 125745, 5374, 261172, 322985, 268048, 104027, 55270, 226075, -140927, 238399, -68131, 70786, 266383, -14080, 423016, 182363, -26779, 79840, 74743, 189527, 245964, 361306, 150940, -121575, 11056, -14596, 140150, -110236, 326153]
13349B23649A7655N4390A6370J15562e0451A16477J74225p6561m1452K03848j00852
13338B75685b25546B01907N4864O9087B4768K06188O1414Q3876o8793j36648p8203
13327I2602m3952J60760P6639A05594P0959Q4003A09258R5089N9823H9284c9702
13315G3442L61253F6351K6660J08502n795k6804K58033A8496b87242g6312E5709
13303A51512a88330D65068j28896a208n5592c211H0549d7798j20730A40912f7079
13291C50123b72418A21859a18571B88059a17314B1502K90771g7150B32904A02546
13280c9772C94429A42018k5306Q7137f5708k31648A79078F5212J18792P3597L3317
13269B90918a30487o9198C65212c24663I6097l6183J00820i7160A62138j8704
$$ y = [223649, 17655, 72045, 16370, 131932, -50451, 116477, 290702, 214141, 172689, 376537, 275685, -225546, 201907, 256771, 325858, 24768, 230956, 292370, 376246, 307453, 170805, 92602, 48650, 209410, 286049, 105594, 176553, 260556, 109258, 204347, 264170, 89284, -39702, 73442, 434695, 66351, 93011, 201513, 195718, 168914, 426947, 18496, -287242, -76312, 55709, 151512, -188330, 465068, 336172, -1208, -56800, -3211, 80549, -47798, -168528, 140912, -67079, 350123, -272418, 121859, -118571, 288059, -117314, 21502, 312273, -77150, 232904, 102546, -39772, 394429, 142018, 116712, 203849, -65708, -297356, 179078, 65212, 184004, 257601, 290918, -130487, -199685, 365212, -324663, 96097, 59914, 160734, -97160, 162138, 143434]
13259A43434c5971j12160a1243A64599G1611J74548A22214K90451D7897L03159
13249C51056j13759B525J35675i6931D1056R6019J79925r1003H5109g7242A29694
13237B88586j30349b77026D35876A39691a3848H5229l3063L4807a23615B25961
13226D87137E6362J64446M4714a28357I9162a81134a3077O403H2698b3015B3294
13214C14527a98165A592J06699J26288b42992D24775A14740c42433F4577f9889
13203e3438k2336G9747J02348b41224R6347B13959q5742a03182B07923J91727
13193C99650j68443A00025g7369A43971j8859a35012B26255a40500j64039F5553
13182B88150M3977F5990N4731a76727Q1225A02200a28081B40405A2099J50273
$$ y = [143434, -35971, -148131, -11243, 164599, 71611, 246159, 122214, 412665, 47897, 351056, 237297, 2525, 138200, -96931, 41056, 137075, 317000, 225997, 85109, -77242, 129694, 288586, 158237, -277026, 435876, 139691, -13848, 85229, 52166, 86973, -123615, 225961, 487137, 56362, 220808, 265522, -128357, 99162, -181134, -13077, -6674, 82698, -23015, 23294, 314527, -198165, 1592, 108291, 234579, -242992, 424775, 114740, -342433, 64577, -69889, -53438, -75774, 79747, 182095, -241224, -144877, 213959, 128217, -103182, 207923, 399650, 231207, 100025, -77369, 143971, 125112, -135012, 226255, -140500, -304539, 65553, 288150, 332127, 65990, 120721, -176727, -95502, 102200, -128081, 240405, 12099, 162372]
13172A62372R4244D1701K14846M0309H0864J92616A32190m0159b26237O9021F8604
13160i5870B2398a77211B54021n6595i3546J988B20323a33949I0490e9670A4822
13148I9126P5873R4544o5135H0322O599a02205F3835J65689C2552a19697B1612
13136A48273p0491c73471J30291O1615c2709n6737o8007A11964N2804d2551B71019
13124d3452G1920J20224a4359A79510B3515a7716B74505p3300f7768b9307A37357
13112A25762A8357J19917E4890m716N1328a01005B77719I3450K18729h3133c1653
13100a04585o2437B08397a41940A99599H0806J646b80219G6815Q8082i5812K2806
13089g3006j68991B2937a36586c8175A24443a22889B39912R1228a46963A0193
$$ y = [162372, 256616, 41701, 256547, 296856, 80864, 273480, 132190, 92031, -226237, -157216, 68604, -95870, 22398, -177211, 254021, 197426, -93546, -91558, 220323, -133949, 90490, -59670, 14822, 99126, 174999, 269543, 204408, 80322, 86921, -102205, 63835, 229524, 32552, -119697, 21612, 148273, 77782, -373471, -243180, -181565, -32709, -89446, -157453, 111964, 164768, -42551, 271019, -43452, 71920, 192144, -14359, 179510, 23515, -17716, 274505, 201205, -67768, -29307, 137357, 125762, 18357, 138274, 54890, 50174, 101502, -101005, 277719, 93450, 312179, -83133, -31653, -104585, -167022, 208397, -141940, 199599, 80806, 82452, -280219, 76815, 164897, -95812, -73006, -241997, 22937, -136586, -38175, 124443, -122889, 239912, 331140, -146963, 10193]
13078I1505M5048o6773J54121N9871a33875C46583j66713l006q7489m1936L80144
13067D27583A52645k7432M9482o4076A7339a680C53224j67720a00620B70284n5232
13056B15052K79855a0168F6454m270c6744E7105B7196I411a59377F6035A4275
13044A18136K8441k9002M885c00860h1247B4755O5161a32759A52328a70407A36675
13032E1472d8211B73951r8289M4770q1444j2969J91197r361a92289C9259J40328
13021A79587p7786A8907J97832g0268C985e4200A47337E5269i9286A82298H5445
13009b67347A10754a94839H34J88841m4187a7516B01464b94904I1987K7860Q482
12998A28329Q50J02467m8143C3589b42698g3170H3394J30257J7301c04374a35398
$$ y = [91505, 136553, 69780, 223901, 283772, -133875, 346583, 179870, 176864, 89375, 47439, 427583, 152645, 125213, 174695, 110619, 17339, -1680, 353224, 185504, -100620, 270284, 215052, 494907, -10168, 66454, 62184, -36744, 57105, 27196, 9411, -159377, 66035, 14275, 118136, 146577, 117575, 122460, -300860, -81247, 24755, 89916, -132759, 152328, -170407, 136675, 51472, -48211, 273951, 175662, 220432, 138988, 126019, 317216, 307855, -192289, 39259, 179587, 101801, 18907, 216739, -70268, 3985, -54200, 147337, 55269, -99286, 182298, 85445, -267347, 110754, -194839, 834, 189675, 145488, -17516, 201464, -294904, 91987, 119847, 128329, 129179, 231646, 183503, 33589, -242698, -73170, 83394, 213651, 230952, -304374, -135398]
12986a0868m36036a66935n0620C80585A15238k8540a04864J3392C18097H4614
12975A04436K5356a50364F0075R8923C4985A7133K12391D3455M9236A1471i8080
12963a82743A72714C8219i6019m4014N7037q7859F3576Q5911a54836B224J44761
12952A46985C3168J86145b00701R3113n4183E0838Q8875d8597K410l6807c3369
12940b09256D2185i3328j1707C93352b21243g7207j26943e4579b6601j21462M0682
12929a07381e2558o6332d376A23634l2515M5002B2596K32211a26584e5834B70214
12917d3851B04270f933p9547C2755g0231j03983B52420A0591L2236a12141E8452
12905a16431H7684g6358m7025A31884J07947a0965H94a96317p6138i9442d827
$$ y = [-10868, -446904, -166935, -217555, 380585, 115238, 86698, -104864, -91472, 318097, 84614, 104436, 129792, -150364, 60075, 158998, 34985, 17133, 229524, 43455, 92691, 11471, -98080, -182743, 172714, 38219, -96019, -140033, -82996, -170855, 63576, 149487, -154836, 2224, 146985, 33168, 219313, -200701, -107588, -161771, 50838, 139713, -48597, -46187, -82994, -33369, -209256, 42185, -93328, -105035, 393352, -221243, -77207, -204150, -54579, -26601, -148063, -107381, -52558, -118890, -4376, 123634, 91119, 136121, 22596, 254807, -126584, -55834, 270214, -43851, 204270, -6933, -86480, 32755, -70231, -174214, 252420, 10591, 42827, -112141, 58452, -116431, 87684, -76358, -123383, 131884, 239831, -10965, 894, -196317, -272455, -99442, -4827]
12893d5219E6998b13506a0077A23893a24155B45909G5086J39172A01513b1157
12882D129b81085J37024C9788d2037j66135A21575c79405b5982j30433d8060C7490
12870B14367b04260a4820B03370B9561C350L82959F8439J34015G12a30824j17165
12859b47989F4719J59054K3827D6397f3024m6131M75k1043q6456e8273E3464Q548
12847F2012e970j54252n3892A74327a75281b8027D6737J0257R813J0444C2689
12835A71180b01727j32539C63324D5124j4039a89412K4661L4769A29563J4445
12825A44008g7681A14168R3904b00457M1608M3658A57164m3722L5751n4429m7185
12814D7579i3435j00968A91038b71593a13094A26492K22366D1660K45674a25219
$$ y = [-45219, 56998, -213506, -10077, 123893, -124155, 245909, 75086, 214258, 101513, -21157, 4129, -281085, -144061, 39788, -42037, -208172, 121575, -379405, -25982, -156415, -48060, 37490, 214367, -204260, -14820, 203370, 29561, 3350, 386309, 68439, 202454, 712, -130824, -247989, 64719, 223773, 247600, 46397, -63024, -109155, -108680, -129723, -216179, -58273, 53464, 62012, -5970, -160222, -214114, 174327, -175281, -28027, 46737, 56994, 66807, 77251, 32689, 171180, -201727, -334266, 363324, 45124, 31085, -189412, -164751, -129982, 129563, 144008, -77681, 114168, 208072, -200457, -158849, -115191, 157164, 113442, 149193, 94764, 47579, -93435, -194403, 191038, -271593, -113094, 126492, 348858, 41660, 287334, -125219]
12803a70041g280G2257g404H6305J16651N285p1110e1392Q251l66083a50966A46699
12790c09880C39674i1737G1786J1682L6766b74395D2383J12459j356c7337r399
12779d6736C0384Q132g0724k86207a37388a4394m0833l8507I835N9615J03597
12768A73047J43450p0091q7815a44903B5239a61782D1184K81704C0235a51777
12757b99837i6844F6917L07632a0216C1844J49011b6763A46152J27674Q0433e4531
12745b30833A01344K6632b89636c416j45046f0740G154Q5816J66988C4288b99943
12733a70411A94543N7449n3111c04924D8417h5520A94969p8602K97225b6755a092
12721G4941L6397j5159c02706b8861n5340A26768b6872I9617h4848C06095A13551
$$ y = [-170041, -7280, 72257, -7404, 86305, 202956, 208241, 137131, -51392, -43141, -409224, -150966, 146699, -309880, 339674, -91737, 71786, 83468, 120234, -274395, 42383, 154842, 153486, -37337, -46736, 30384, 38516, -70724, -356931, -137388, -14394, -55227, -93734, 9835, 69450, 173047, 316497, 246406, 158591, -144903, 25239, -161782, 41184, 322888, 30235, -151777, -299837, -96844, 66917, 374549, -10216, 31844, 180855, -26763, 146152, 273826, 354259, -54531, -230833, 101344, 127976, -289636, -3416, -148462, -60740, 7154, 92970, 259958, 34288, -299943, -170411, 194543, 251992, 198881, -304924, 48417, -85520, 194969, 116367, 413592, -26755, -1092, 74941, 111338, 96179, -302706, -28861, -84201, 126768, -26872, 99617, -84848, 306095, 113551]
12709G3539J56011q4636J3498J5528p7562K98029j96549q3835a57265A72729c2219
12697h8201o5214B82758i425B05557f1237a8665A11350a42677A6159C553K03854
12686B07407R6193j03239d9212B38336N9930a59363c5784C79444J14028H3296
12675E0321h6444D5812g5144C0726L9013a07608A05961b04890C9602b49127e7188
12663b18647a08299m6170d467j89355G6151p54a10102k3545F4386k4926J05148
12652A44608H146a60966H5734B2483a45134L5611l6043d1819I5112a31640F2678
12640F6738M270h0784l0310M5471B40695a46751A77465H5361A0053K63973j36052
12629A37974b239B1208b07532E67662I6407J06073J5546j4760J46721D1793c0878
$$ y = [73539, 229550, 144914, 158412, 173940, 96378, 394407, 197858, 114023, -157265, 172729, -32219, -88201, -153415, 282758, -9425, 205557, -61237, -18665, 111350, -142677, 16159, 3553, 207407, 303600, 200361, -49212, 238336, 298266, -159363, -35784, 379444, 493472, 83296, 50321, -86444, 45812, -75144, 30726, 69739, -107608, 105961, -204890, 39602, -249127, -57188, -218647, -108299, -154469, -4467, -193822, 76151, 75397, -110102, -133647, 64386, 39460, 144608, 8146, -160966, 85734, 22483, -145134, -109523, -145566, -41819, 95112, -131640, 62678, 66738, 71008, -80784, -111094, -65623, 240695, -146751, 177465, 85361, 10053, 274026, 137974, -2239, 21208, -207532, 567662, 96407, 202480, 218026, 203266, 349987, 41793, -30878]
12617e7226A21173a4760G1319Q7990a74871E69735D3030L07633H0676H380P9994
12606H8374Q8231p0576b63260Q9924A26161J65618e0243A6241a87065r7853C60532
12594C0491N3876d5108A2496b21586c9255j04570H2123C237e6010H272a02365
12582I7188J39756g0172C41004i652C19633b44551A38233j9128c20651B05646
12571I0279K2237L082A0616J17544b5302D09J53409c4784C64110a29852A1496
12559H1054J97654a32472c9607A5690M9204B0393a39814A02929M1716a13699M7958
12548f5741A05607J03553E3941K35332c9763r2066A36235b19063A31180a71708
12537G552a7936p6674I325e0258j49509k5348b9929A87954B71J34073K10076c1295
$$ y = [-57226, 121173, -14760, 71319, 159309, -174871, 569735, 43030, 350663, 80676, 8380, 88374, 176605, 106029, -263260, -173336, 126161, 291779, -50243, 16241, -187065, -284918, 360532, 30491, 84367, -45108, 12496, -221586, -39255, -143825, 82123, 3237, -56010, 8272, -102365, 97188, 236944, -70172, 341004, -9652, 319633, -244551, 138233, 119105, -320651, 205646, 90279, 112516, 115598, 10616, 128160, -25302, 409, 153818, -34784, 364110, -129852, 11496, 81054, 278708, -132472, -39607, 15690, 64894, 20393, -139814, 102929, 144645, -113699, -65741, 105607, 209160, 53941, 289273, -39763, -131829, 136235, -219063, 131180, -171708, 7552, -17936, -94610, 9325, -50258, -199767, -225115, -29929, 187954, 271, 134344, 344420, -31295]
12524A23809m4520J58238c18424B98173a15094C2810A6399J00986B8984J06430
12514A35414a5084A03181b71767C49878j08837h0784m22779A37095P9194H8211
12503a86268L1079k95823E26436D3706f7116m820D0028P3490c9394j54613R1537
12492a02470b1344k01699f9385J8256D3755J8354J16185f4988A19173c15203A21957
12480g5742B7778a29298B2753K4630b40060G3798J02021q2894J23008J55080a60461
12468a98074j12081J07753c2372a088j42643O2573B50116E371P6091d86296a82687
12456A58045a07266h007k48806A40757J1860J50990a37663A68600l3468B9797
12445E4584b21023G007J7855d1039j25617C40563J19682a91131C5629a98862l9529
$$ y = [123809, 79289, 237527, -318424, 298173, -115094, 32810, 16399, 117385, 28984, 135414, -15084, 103181, -271767, 349878, 241041, -80784, -503563, 137095, 216289, 88211, -186268, -155189, -451012, 526436, 43706, -67116, -71936, 40028, 113518, -39394, -194007, -102470, -21344, -223043, -69385, -51129, 43755, 62109, 178294, -64988, 119173, -315203, 121957, -75742, 27778, -129298, 22753, 47383, -240060, 73798, 175819, 92925, 215933, 371013, -160461, -198074, -310155, -202402, -32372, -1088, -143731, -81158, 250116, 5371, 81462, -486296, -182687, 158045, -107266, -8007, -256813, 140757, 152617, 303607, -137663, 168600, 135132, 29797, 54584, -221023, 7007, 24862, -41039, -166656, 340563, 460245, -191131, 35629, -198862, -238391]
12434b38391A19830g4066G0718L6667J15590I6104J08435K2267J16820b10764
12423a24943b856j25272H1653K5271b81731J26637F6615M1839B0811J18452K43383
12412C82646b27618N2462L6058i002D07973C342R7522a22474j00223j87163j49181
12401e59041B62367e4702F1565b9745k69813J11517Q3468B29240C8097b57256
12390C47711E7187c19685B04759E9062K04428F0489a70710P3657K1253C6203J98013
12379B34216G7656a40391C7697b3285l65889J17463J21654c5661P51r7836A66501
12367i4690k3380m5107A96985I4334R5440l5641c1710B04367j9997a62247A0404
12355B94237g1726o116C701b0476A21202L8237a8394B45017C6292C824L05630
$$ y = [-238391, 119830, -74066, 70718, 107385, 222975, 96104, 204539, 226806, 343626, -210764, -124943, -2856, -128128, 81653, 106924, -281731, -155094, 66615, 108454, 20811, 139263, 382646, -227618, -175156, -139098, -9002, 407973, 3342, 100864, -122474, -222697, -409860, -559041, 262367, -54702, 61565, -29745, -299558, -188041, -104573, 229240, 38097, -257256, 347711, 57187, -319685, 204759, 59062, 263490, 60489, -170710, -97053, -75800, 36203, 234216, 77656, -140391, 37697, -23285, -389174, -271711, -150057, -35661, -34910, -132746, 166501, -94690, -118070, -163177, 196985, 94334, 189774, 154133, -31710, 204367, 184370, -162247, 10404, 294237, -71726, -77842, 3701, -20476, 121202, 159439, -18394, 245017, 36292, 3824, 309454]
12344C09454B82R5438d1636n767l2700D0084a08722r199B40486j15086a7751F3448
12331a8853C53497A32873b24616m0842h0084A64967e4804C06814a02625K8442
12321g4183j8048k39523a46604B42690j18222i8173B1547b16230n94d9220j56168
12310b05388f3622C01302a12346c015A76981a60858A26147C8024h7031B2689a09296
12298a8676C2411f9448k8394a0897B71674a03685k07323A93462n0238b4940B2357
12286C8816a00394j14479j10837J12621I1616a9683B20985B5320J47824R2484
12276B65628d6810C48341J18068k13518a2597C02838A41674i7531I8263K72837
12266C71100A48089J38654E4229k3924J05363F1520J17262l4353f1002C7535J82033
$$ y = [309454, 282, 95720, -41636, -47403, -80103, 40084, -108722, -117921, 240486, 125400, -17751, 63448, -18853, 353497, 132873, -224616, -265458, -80084, 164967, -54804, 306814, -102625, -74183, -92231, -331754, -146604, 242690, 124468, -98173, 21547, -216230, -216824, -49220, -205388, -63622, 301302, -112346, -3015, 176981, -160858, 126147, 38024, -87031, 22689, -109296, -18676, 32411, -69448, -97842, -10897, 271674, -103685, -311008, 193462, 143224, -24940, 22357, 38816, -100394, -214873, -325710, -213089, 91616, -19683, 220985, 25320, 173144, 265628, -46810, 348341, 466409, 252891, -12597, 302838, 141674, -97531, 98263, 371100, 148089, 286743, 54229, 30305, 135668, 61520, 178782, 144429, -61002, 37535, 219568]
12255B19568q1449L4587K5564f6071r5576D7284J01135J12520f9850G9259b30690
12243f8958A63062C4294h5718j50760B26437J88672I3538a01053N803j4696r3766
12232b03712C51634d7459r053b3049C26021A47549c5736D24015j96726N7362H2217
12220A5071J18644N5006H0575a6349D43654k20598e4658D25234j79444H0725A7271
12208b04585A11729O5679L7440D2320J67621k6926b5431r5412C0145J52750M2630
12197B25525k3245J05511g4702m4390D34816j51228o9783k1343G0120a60854a3287
12185B5506L92450F3773J44066q8591c3278A36942j9522K2201A8273J49278m4769
12174A22782g6009C1997K17660j14462J93794o0812a6340A82221H6458i496G170
$$ y = [219568, 138119, 172706, 198270, -66071, -161647, 47284, 148419, 260939, -69850, 79259, -230690, -68958, 163062, 34294, -85718, -236478, 226437, 415109, 93538, -101053, -95250, -109946, -203712, 351634, -47459, -56512, -23049, 326021, 147549, -35736, 424015, 227289, 284651, 82217, 15071, 133715, 188721, 80575, -16349, 443654, 223056, -54658, 425234, 245790, 80725, 17271, -204585, 111729, 177408, 214848, 42320, 209941, 183015, -25431, -120843, 30145, 182895, 225525, 202280, 307791, -74702, -119092, 434816, 283588, 213805, 192462, 70120, -160854, -13287, 25506, 417956, 63773, 207839, 119248, -33278, 136942, 117420, 139621, 18273, 167551, 122782, -76009, 31997, 249657, 135195, 328989, 268177, -16340, 182221, 86458, -9496, 7170]
12162a05950a9892q9025L3159m6303A42281m4122J8025J56882b44135A76546h4073
12150B27777c7218a1012A268A17a4027A11399D1104a62037B36687R4734d8785
12138A74193J18430a6652F0125b25055A3238L40623A63038J43461D330P9412a9791
12126b51503I4333c1610J0565j74553a938j12528j3026A63561a92639C39317j60577
12115A78740o8945m9838M45553A78199g0827J0264j11761I442a13833j81699C59697
12103f4444A74939C1893f2364j13927N0944n4192n7209A4046c7667F1783e6244
12091h0023A01082h041I9232g7496C8074a81326Q8771j25437A03928c06323h4693
12079a91981A74286a0139r2889B21204L9447O6747P05844K39720k11617E02476
$$ y = [-105950, -19892, -108917, -75758, -122061, 142281, 98159, 116184, 273066, -244135, 176546, -84073, 227777, -37218, -11012, 1268, 117, -14027, 111399, 41104, -162037, 236687, 331421, -48785, 174193, 292623, -16652, 60125, -225055, 13238, 353861, 163038, 306499, 4330, 83742, -19791, -251503, 94333, -31610, -21045, -195598, -1938, -114466, -127492, 163561, -192639, 339317, 178740, 109795, 59957, 505510, 178199, -70827, -60563, -172324, 9442, -113833, -295532, 359697, -64444, 174939, 31893, -62364, -176291, -125347, -179539, -236748, 14046, -37667, 61783, -56244, -80023, 101082, -8041, 99232, -77496, 38074, -181326, -92555, -217992, 103928, -306323, -84693, -191981, 174286, -10139, -103028, 221204, 260651, 327398, 1033242, 1272962, 1061345, 502476]
12068B44217G5510J30023a10873B31516A3456K70325a26770B9938M06574i5277
12057B52898a86141A28645iI2857J0496d4039j21471j5914e5850C86a41358a3099
12044C9361a11256k8175a2972m1463B81544c4196p0433j4859j30236f867m8836
12033e5703B13531g1067L1609A63790m3442a66974c9313a5918A60400C7163a90316
12021a84550A32863C11L772J34661K99102e8556j65951a1738B6573e7772A978
12009D7767R8605n923C6289g6961C28548b08894K115q669P4993j05252A08677
11997A47809f6647j33274i855H9195a4057F9076P8794b45721B664L0684b32739
11985a66616B54650e6365b2047j47333e9677j07457A42582h4657C1121b8325E6350
$$ y = [244217, 75510, 205533, -110873, 231516, 13456, 283781, -126770, 29938, 436512, -95277, 252898, -186141, 128645, -9, 92857, 103353, -44039, -165510, -181424, -55850, 386, -141358, -13099, 39361, -111256, -139431, -12972, -54435, 281544, -34196, -104629, -119488, -249724, -6867, -55703, 213531, -71067, -39458, 163790, 120348, -166974, -39313, -15918, 160400, 37163, -190316, -184550, 132863, 311, 4083, 138744, 437846, -58556, -224507, -11738, 26573, -57772, 1978, 47767, 146372, 140449, 36289, -76961, 328548, -208894, -206779, -215448, -140455, -245707, 108677, 147809, -66647, -199921, -9855, 89195, -14057, 69076, 147870, -245721, 2664, 33348, -232739, -166616, 254650, -56365, -22047, -169380, -59677, -167134, 142582, -84657, 31121, -28325, 56350]
11973a2962e093l40991B01706C5429b76001d1687D6763i827G9632b4982j46628
11962a71610m6116I6817J02941c2787I0045a57045d052m11728B5752J41558E1587
11950A77740b7513j68264j08593l020J14663N9893l3210G7991b5848j03197E3284
11938g4615G6443a33798j21988b9102A03182N9773e5288K030B00379f4385q2400
11927a46785d2790B02285a53367D25203h9352B21919p7097E2380g0663A23720
11916h2979j3652B54554p8497D5059d967l7676j90143h2704q6570c4499j4503
11905d9002I941J9186a48396A11019R4536h3837F1899d21098D75151g1l0799I9394
11892b9199I6717b38050A64798b23695a5488j23191A68383A0654c54396a38663
$$ y = [-12962, -5093, -346084, 201706, 35429, -276001, -41687, 46763, -9827, 79632, -24982, -171610, -217726, 96817, 199758, -32787, 90045, -157045, -4052, -415780, 25752, 167310, 51587, 177740, -27513, -195777, -304370, -307390, -192727, -132834, -166044, 77991, -25848, -129045, 53284, -74615, 76443, -133798, -255786, -29102, 103182, 162955, -55288, -53258, 200379, -64385, -146785, -42790, 202285, -153367, 425203, -89352, 221919, 144822, 52380, -70663, 123720, -82979, -96631, 254554, 176057, 45059, -4967, -42643, -232786, -82704, -169274, -34499, -49002, 9941, 29127, -148396, 111019, 205555, -83837, 61899, -421098, 475151, -71, -30870, 99394, -29199, 96717, -238050, 164798, -223695, -15488, -138679, 168383, 10654, -354396, -138663]
11881B19518b033C67534j51389a34895l17216K16154A51663o1527d94096g4337
11870A11640f9621A41851C8623d1310j3524B0618N517Q1206a92969j6963l27818
11859e37750g3544c4713O9B04869p0473b22583i9272A26629B7004A2590J6710
11848B9300b20306B26473l8903q5209l8726d15051a46629C7020b76515b2943p6999
11837i9942B25030h4912B63187a9160k99189n936n3719B7095N6500f8539b883
11825A52465a29942k6401D4021a91370A43416i3824F7511B7889L31506D7131A919
11813h6677B24020n0213a450j61764k20773f4095N533k61520F4145b07814B6480
11801F0183d04907i1424j26106A3309g3196C9584J66529D8238b3255E6591K32768
$$ y = [219518, -2033, 367534, 216145, -134895, -452111, -235957, 151663, 90136, -494096, -74337, 111640, -69621, 141851, 38623, -41310, -54834, 20618, 26135, 107341, -192969, -209932, -537750, -73544, -34713, -34644, 204869, 134396, -222583, -99272, 126629, 27004, 12590, 29300, -220306, 226473, 187570, 102361, 63635, -415051, -146629, 37020, -276515, -22943, -99942, 225030, -84912, 263187, -19160, -318349, -324285, -378004, 27095, 83595, -68539, -2883, 152465, -129942, -156343, 44021, -191370, 143416, -93824, 67511, 27889, 359395, 47131, 1919, -86677, 224020, 173807, -1450, -163214, -383987, -64095, -58562, -320082, 64145, -207814, 26480, 60183, -404907, -91424, -217530, 13309, -73196, 39584, 206113, 48238, -23255, 56591, 289359]
11790B89359D526a19244k48564b298j5100A31736L95201b24170k59170J25541
11780c57799A3170J67748a379G6970a4080B74040D0656l987g6429n659A68873
11768E2547d6557a5046l67589A651a17324D4921b57935B00916d0908j63298e2113
11756a03240K2921j72848P3580M0393B32383j5270a3620C36484c0989j4976A05695
11744A33030g3651A39400b18871b7842j81680D89756C4313a31586D7940J15833
11734A63773i5325L4054A20744b3148D8357i5355r1615E5539e54606a31549G4838
11722B06854m231F2606a9354A42429a56202A4622a97409d0578B47895I3988L13953
11711D07941a44802A36934a03450j7073C10893A35719e1522C0293a88l35275D66506
$$ y = [289359, 4526, -119244, -367808, -2298, -17398, 131736, 526937, -224170, -483340, -357799, 13170, 180918, -1379, 76970, -14080, 274040, 40656, 36669, -76429, -82088, 168873, 52547, -46557, -15046, -382635, 1651, -117324, 44921, -257935, 200916, -40908, -204206, -52113, -103240, -80319, -253167, -179587, -139194, 232383, 217113, -13620, 336484, -30989, -45965, 105695, 133030, -73651, 139400, -218871, -27842, -209522, 489756, 34313, -131586, 47940, 163773, -95325, -61271, 120744, -23148, 48357, -95355, -186970, 55539, -554606, -131549, 74838, 206854, 202623, 62606, -19354, 142429, -156202, 14622, -197409, -40578, 247895, 93988, 407941, -144802, 136934, -103450, -120523, 310893, 135719, -51522, 30293, -188, -335463, 466506]
11699i3512r4008b7363j95068A15752b02561A02985a38765I7895k1341O7665e7504
11687C8417L1686k8771i0379i693D9395a0413C23568d2770k35774C10975l1637
11676B79338d4130B83893m6592g9175q5319N95R652L5126k6240D1137J24502M5272
11664B10911r1614K53954A04058b10722M906p0938B67525g2559l3539D8149J04020
11653A52169J18916q8063b2675A13613m9506c9824B22686g748I4985b815j22818
11642a25633e776E84a54027a8207A16040J96345D6539F820J01488H83R4417A2325
11629B76112a19721B27014b28752B49090o6373e2767E78098b3537j29401f4259
11618A3676b50955B8975A1568J10699K36302F9930Q788g3401j44129P6968G7010
$$ y = [-93512, -187520, -27363, -222431, 115752, -202561, 102985, -138765, 97895, 76554, 144219, -57504, 38417, 70103, 41332, -90379, -9693, 49395, -10413, 323568, -42770, -278544, 310975, 279338, -44130, 283893, 237301, -79175, -164494, -163899, -154247, -119121, -145361, 41137, 165639, 210911, 119297, 373251, 104058, -210722, -205816, -276754, 267525, -72559, -106098, 48149, 152169, 271085, 183022, -22675, 113613, 64107, -39824, 222686, -7748, 94985, -2815, -125633, -5776, 584, -154027, -18207, 116040, 312385, 46539, 6820, 108308, 883, 95300, 12325, 276112, -119721, 227014, -228752, 249090, 182717, -52767, 578098, -23537, -152938, -64259, 13676, -250955, 28975, 11568, 122267, 358569, 69930, 78718, -73401, -217530, -140562, 77010]
11606c0133k40699A62820a17873C5052b96260E7100J40100r5404K5293E4591K57793
11595C12384A22794E4181K081J67014b22137E0705J88824L0510F5017J39883A7807
11583E1049i3992A68634c4890j99270a10273C3045J04006a58921D253J58846e1062
11571A67136G6943a50514C34267j49677a478C64745A04976d8465E13917F3915
11560A47856L3276L417e551q5195C84403b31810a8483A13661j9078g5960j55455
11549b31415H4484a8349m0729E7072j7925h2242D966a6309j59416B73620b28205
11537A27149a74963Q6208I9662M7840O7164J86778A53590o3433b95649a11743
11526a29029j84396a8747A3575N22972A59515O2840o2059n0945J37412i5643A90471
$$ y = [-30133, -270832, 162820, -117873, 35052, -296260, 57100, 197200, 101796, 127089, 54591, 312384, 122794, 54181, 56262, 223276, -222137, 50705, 239529, 270039, 65017, 204900, 17807, 51049, -93992, 168634, -34890, -234160, -110273, 33045, 137051, -158921, 4253, 163099, -51062, 167136, 76943, -150514, 334267, 184590, -1478, 364745, 104976, -48465, 513917, 63915, 147856, 181132, 184549, -5551, -90746, 384403, -231810, -18483, 113661, 94583, -75960, -231415, 84484, -18349, -59078, 57072, 39147, -82242, 4966, -16309, -175725, 273620, -228205, 127149, -174963, -88755, 99662, 147502, 214666, 401444, 153590, 90157, -295649, -111743, -129029, -313425, -18747, 13575, 536547, 159515, 222355, 160296, 109351, 246763, -95643, 190471]
11514B00201c5997A84741o4136N4247J45299A56081J11846r3365i0018A20889
11503a74723C49195b9140B5R7348a08127j1905H3890J64436a58078c3462A11308
11491a48315B54333b23998A05151a26720B06563R896J3121I5738d0023A0639b07149
11479A79736L7187d8920l4306C5603N1546K16758j48102K71971j69882A27609
11468a58151A89576K9845C8332M41383k04128O566P6043A61258J5140p1314K55594
11457C60678b74624D6535G289K53965f2091J4506B3407J8088a78120A9924b59495
11445a31604M9483C6806b25230B00018a28206A65909D6387a13414B78068B3333
11434H2223a00870L6674D7563c06102g1110A58081J20030a84010b3443A5114e10548
$$ y = [200201, -35997, 184741, 120605, 174852, 320151, 156081, 267927, 174562, -90018, 120889, -174723, 349195, -29140, 25, 97373, -108127, -120032, 83890, 248326, -158078, -33462, 111308, -148315, 254333, -223998, 105151, -126720, 206563, 216459, 229580, 95738, -40023, 10639, -207149, 179736, 216923, -48920, -83226, 35603, 87149, 303907, 155805, 427776, 257894, 127609, -158151, 189576, 219421, 38332, 479715, 275587, 282153, 358196, 161258, 176398, 105084, 360678, -274624, 46535, 7289, 261254, -62091, -47585, 23407, 41495, -178120, 19924, -259495, -131604, -82121, 36806, -225230, 200018, -128206, 165909, 46387, -113414, 278068, 23333, 82223, -100870, -64196, 47563, -306102, -71110, 158081, 278111, -184010, -23443, 15114, -510548]
11422B21304n410k6707D6009a19401p2721B9443j371J69477a0380j40218c7023
11410a06252C27484b11309p7663B18906O0051c4679n3834L3856q9388a9327A62855
11398C2157K18705K3228B3571a64068e9538k20196J08515j47091A19861J6392
11388A36253g0588C35011g8613a0948A1025J64143b24531F4938N3242a02355b1401
11376A2793O32K37117b64868G2780a74021I1948j9501p584b18895B04995a19205
11364I0546A6116a24687r1409A04189A0460a32149D1838b14207i2311H3757k8377
11353E5380K6046l6722A5650a40585r1876a01256c6301C29345F6895C829J07558
11342A11387N6003D2733j8112e4836l39608c3074D5902a04576b5162D4393a70565
$$ y = [221304, 215894, 189187, 46009, -119401, -192122, 29443, 28072, 197549, -10380, -150598, -37023, -106252, 327484, -211309, -288972, 218906, 278957, -34679, -88513, -54657, -144045, -19327, 162855, 32157, 250862, 274090, 23571, -164068, -59538, -279734, -171219, -318310, 119861, 136253, -70588, 335011, -78613, -10948, 11025, 175168, -224531, 64938, 118180, -102355, -21401, 12793, 13425, 250542, -264868, 72780, -174021, 91948, 72447, 64863, -218895, 204995, -119205, 90546, 16116, -124687, -216096, 104189, 10460, -132149, 41838, -214207, -92311, 83757, 55380, 81426, 44704, 15650, -140585, -232461, -101256, -36301, 329345, 66895, 3829, 111387, 167390, 42733, 24621, -54836, -394444, -33074, 45902, -104576, -25162, 44393, -170565]
11330c9937B01288D1587b02070j37735C0227R7212Q5245b22478j93677A82263
11319E3907J82136b35230L8265A52502K5586j4959a73789a9490A06049l5419a05758
11307B32696b51320J09532A65917b22871A81379h0599A0587d87884B0828h9097
11296A35621F6194a07125M7355e468j5105A55254G0675d411o6544B68105D2276
11284B29924f0809q6902N5645b6633k33053B9128b35718h5574A52985M5077q1934
11273A16128a97795G9982J44272c06867h1909L9429q1983A26544b43900A1288
11262e2596j7448K525l6434j26071c4893j59864B78149a7480j43273I9742M793
11251A04535C2917b42320A7567M2430b41011g472j01504B0787b09990B32407b45836
$$ y = [-39937, 201288, 41587, -202070, -339805, 30227, 127439, 212684, -222478, -416155, 182263, 53907, 236043, -235230, -196965, 152502, 178088, 163129, -173789, -19490, 106049, 70630, -105758, 232696, -251320, -141788, 165917, -222871, 181379, -80599, 10587, -487884, 20828, -89097, 135621, 66194, -107125, -59770, -5468, -20573, 155254, 70675, -4411, -70955, 268105, 42276, 229924, -60809, -147711, -92066, -26633, -259686, 29128, -235718, -85574, 152985, 198062, 116128, -197795, 79982, 224254, -306867, -81909, -42480, -124463, 126544, -243900, 11288, -52596, -70044, -67519, -103953, -230024, -34893, -194757, 278149, -17480, -160753, 99742, 104535, 32917, -242320, 17567, 59997, -241011, -7472, -108976, 20787, -209990, 232407, -245836]
11239c01543A75146i673o9854c4461A6712J64850A9635f1528l43350A1441Q9113
11228A00554a27098r2939j73126b8147E845a42823J4138j16139a04170L8927L559
11217f1684C3290a32775f3887j71909C3986j0134K91152c273A54643f1476a9137
11205a93601i5521L030p2943j01351E0437b54763H5637a47728P3645C14243b12631
11193b89869A51010m9584E416R6788a20872a1727k6401p2476D10912c48719B20227
11181f254B47125Q7522c7154G8657a48053M4730K1476A78129b40728e9228A27219
11169d476F4523d4850j0595k01426E0382g6948j87937i6457K1994H8789g3250
11157F6525b42612B05475a7594C51a00387d9630A16096C2971a31688B35024C8118
$$ y = [-301543, 175146, -9673, -79527, -34461, 16712, 181562, 19635, -61528, -404878, 11441, 100554, -127098, -220037, -393163, -28147, 5845, -142823, -128685, -244824, -104170, -65243, -61684, 33290, -132775, -63887, -235796, 33986, 23852, 315004, -3273, 154643, -61476, -19137, -193601, -95521, -92491, -165434, -266785, 50437, -254763, 85637, -147728, -74083, 314243, -212631, -289869, 151010, 101426, 5416, 102204, -120872, -11727, -38128, -110604, 410912, -348719, 220227, -6254, 247125, 334647, -37154, 78657, -148053, -103323, -81847, 178129, -240728, -59228, 127219, -4476, 64523, -44850, -55445, -256871, 50382, -76948, -264885, -96457, -74463, 88789, -73250, 66525, -242612, 205475, -17594, 351, -100387, -49630, 116096, 32971, -131688, 235024, 38118]
11145f9281l4129j37980I4608B301a2848B58203a59441O5395A70200c02068g0832
11133h1854A35917K8479c24984C10679a39502F9922Q8207k815L4966B9521N9327
11122H8848K4200J35213A05787l6318P2703K08837c0288C26245b46890a8226k53166
11111b71392L2171C6567Q7168c57548A29795j3269M3106a00511K2345D4759c9721
11099C19849r4289j02479a13256A88914G3313N856a0327A2106g674r574F4462
11087A54380e3731A80323J64219L9801A85145Q1595K73948k36673J2183m0689
11077B75509K82650k75955K6186r3090L43531A77724N94261I3736J61512n3713
11067B01535J30797j7810L7007R9631A41602l4761J72355J02345L0189J85862
$$ y = [-69281, -103410, -241390, 94608, 2301, -12848, 258203, -159441, -94046, 170200, -302068, -70832, -81854, 135917, 164396, -324984, 310679, -139502, 69922, 158129, 155314, 190280, 29521, 88848, 113048, 248261, 105787, 69469, 142172, 351009, -30288, 326245, -246890, -18226, -271392, -239221, 36567, 123735, -357548, 129795, 116526, 159632, -100511, -78166, 44759, -39721, 319849, 225560, 123081, -113256, 188914, 73313, 79169, -10327, 12106, -7674, -17248, 64462, 154380, -53731, 180323, 344542, 384343, 185145, 266740, 540688, 304015, 316198, 275509, 558159, 282204, 308390, 215300, 558831, 177724, 771985, 93736, 255248, 201535, 332332, 314522, 351529, 451160, 141602, 106841, 279196, 381541, 411730, 597592]
11057E97592J32847J0928l3727j29142k3372K73418N2908l98316J90673k50143
11047D23666L30790N3788k28020J13645l06619J83814J27819L04002k36111j86297
11037E80477P5603J74615m2471J62890k46439r2946j50121J30165k11820K81420
11027F61373k87078K1436K05581n2719j05526K31229l1536m4503J45290j41656
11017F01891k72771L86531m8500k14292L1323J14047q7822k03088L56479l04248
11007C59550J63250B10169K81349O4586A71698M22576L63972k58812q6337k77999
10997C35098J27986k19811N12908l5877J28691l49151M75438k97481M6937p4758
10987F49980j03502r1252M62303M2189K32685j04682J60068R1106m02844J93331
$$ y = [597592, 730439, 741367, 707640, 578498, 555126, 828544, 881452, 483136, 673809, 423666, 754456, 808244, 580224, 693869, 387250, 571064, 698883, 1002885, 766774, 580477, 656080, 830695, 788224, 951114, 704675, 611729, 461608, 591773, 379953, 661373, 374295, 395731, 601312, 548593, 443067, 674296, 642760, 598257, 743547, 601891, 329120, 715651, 667151, 452859, 484182, 598229, 510407, 307319, 663798, 359550, 522800, 210169, 491518, 556104, 171698, 594274, 958246, 699434, 613097, 335098, 463084, 243273, 756181, 720304, 848995, 499844, 975282, 677801, 724738, 649980, 546478, 455226, 917529, 959718, 1192403, 1087721, 1247789, 1338895, 936051, 1129382]
10977A129382L51728K87885R1714n9427J36943N90589L7842r7362l14542J52465
10967B307217m53258n7459l9943r7547q6805j82287M25384j07429L54951K3697
10957B086521j24084K60703o7663l89006L14125j23116q10793l09442j44432J7058
10947G09871j27676m7472J26658k46196q6214q1908j02574C0354K68339J82592
10937D81285j76290j1215j32035F4690c2337F3982K4435a05917A82282m0491F7612
10925C0481J47780a90130B45837o2369b42995h188B32J0895J00766f5311b5647
10913g2625p4107A15792N4433c8236n9622B0814f9154j8554B12027o3689a73198
10901C07119i3261H5503A0205a93568D6404K45353D3222R9408d14475a19506A42140
$$ y = [1129382, 1481110, 1768995, 1860709, 1801282, 1938225, 2528814, 2566656, 2469294, 2154752, 2307217, 1853959, 1796500, 1756557, 1659010, 1572205, 1389918, 1815302, 1707873, 2062824, 2086521, 1962437, 2223140, 2155477, 1766471, 2080596, 1957480, 1146687, 837245, 692813, 709871, 582195, 534723, 661381, 415185, 328971, 247063, 144489, 30354, 298693, 481285, 304995, 293780, 161745, 64690, -32337, 63982, 88417, -105917, 182282, 141791, 67612, 30481, 178261, -190130, 245837, 183468, -242995, -8188, 232, 11127, 111893, -65311, -25647, -72625, -146732, 115792, 170225, -38236, -97858, 20814, -69154, -87708, 212027, 148338, -173198, 307119, -93261, 85503, 10205, -193568, 46404, 291757, 43222, 142630, -414475, -119506, 142140]
10889A1925a50123n642A03356l8423e5851D00998j21854f9712p0314c6315H4476
10877b02333j36905A5750f438C8646N8494l2273J55492H7455J07848a63618N0836
10866a12782q8241b943k6583J3689A85966L2004p828B4521a94673b274q4933A59167
10853d35390K06354A32914c8901k62429B0393e1562k29052J00916A30959L718
10843A34677B5755c9120C60347D9797b64643c6659D5227a58970C1946c90631c8829
10831D11K30134j4710I1439d04336a00428r6403A28538D4488g4435I2452a954
10819a45232A17472a92852b4245j83452R2478j09107p2149b0229j3352k03519
10809b37100a12199L7342c0963n2236F7151K9556J97620k8805a40139G291a35034
$$ y = [11925, -150123, -155765, 103356, 64933, -55851, 400998, 279144, -69712, -140026, -36315, 84476, -202333, -339238, 15750, -6438, 38646, 97140, 64867, 220359, 87455, 195303, -163618, -112782, -201023, -2943, -29526, -15837, 185966, 217970, 210142, 24521, -194673, -2274, -87207, 159167, -435390, -229036, 132914, -38901, -301330, 20393, -51562, -280614, -179698, 130959, 134677, 25755, -39120, 360347, 49797, -264643, -36659, 45227, -158970, 31946, -390631, -38829, 411, 230545, 215835, 91439, -404336, -100428, -196831, 128538, 44488, -74435, 92452, -1954, -145232, 117472, -192852, -24245, -207697, -115219, -224326, -296475, -20229, -33581, -237100, -112199, -74857, -30963, -83199, 67151, 96707, 294327, 265522, -140139, 7291, -135034]
10797A85377n1874J93288g075j37780A55867G5830J17685b01130a5982C69939
10786a64879A41294b09729B4812J84252J3715d19512E3533J74780j03073b88451
10775a49982A81469J0801H8410a37509N2365H340a06599G8604N6881d4605k01274
10764b45879O6365e7038n7043q8910i372k98688K2388o4875a31756j4831o7508
10753b14095A50202E2497K34152n6789n7476G570a74829H4601a4128k25243D5248
10741e8180B96725J226a7107j33753G478J6195a60225N0464e2103J8007D4112
10729F762a95948h1600m3007j61173J22686e465l9920m3198c6741C6621K08335
10718B44956a45826l6965d7921g167q2879J1128b2499D31575C4607i6708A76593
$$ y = [185377, 133503, 326791, -7075, -144855, 155867, 75830, 193515, -201130, -15982, 369939, -164879, 141294, -209729, 24812, 209064, 222779, -419512, 53533, 228313, 125240, -288451, -149982, 181469, 192270, 88410, -137509, -85144, 8340, -106599, 78604, 135485, -44605, -245879, -179514, -57038, -114081, -202991, -9372, -308060, -285672, -350547, -131756, -146587, -214095, 150202, 52497, 286649, 229860, 172384, 7570, -174829, 84601, -14128, -239371, 45248, -58180, 296725, 297951, -17107, -150860, 7478, 23673, -160225, -109761, -52103, -34096, 44112, 6762, -195948, -81600, -124607, -285780, -163094, -5465, -45385, -88583, -36741, 36621, 244956, -145826, -182791, -47921, -7167, -90046, -78918, -22499, 431575, 34607, -96708, 176593]
10706B36037a91803B1505P6782a83567O6998G9905a01866L8140A31426a80943
10695a26529j23025R5567G9833a60476M8133g836B5578K95224a9481j06986j94633
10684c21100H8387a04944e1909K61A13086R7789c46210f48B57741a79134P1486
10673a07648F6604q640c09937F4026J8786k945b426k38399H7631a69785e6502
10661H8646K4901J5515b84697J22967j7196J9372j45591L2159B08235e1213l02938
10650c54151J24820e4818j10246C3988b64150D9039a22126d0043O206A27940b05974
10638d77637a3166j71967n2332f5771j60143M4379c8632I7979c6872j86886A64231
10626h9630j2176b4534k69208K4927a3521n3195B5829e55882B95185j17624b05536
$$ y = [236037, -191803, 21505, 98287, -183567, -116569, 79905, -101866, -63726, 131426, -180943, -126529, -249554, -153987, 79833, -160476, -112343, -7836, 25578, 320802, -19481, -126467, -321100, 88387, -104944, -51909, -51648, 113086, 210875, -346210, -648, 257741, -179134, -107648, 66604, 57964, -309937, 64026, 82812, 79867, -2426, -240825, 87631, -169785, -56502, 88646, 113547, 129062, -284697, -161730, -178926, -159554, -305145, -272986, 208235, -51213, -354151, -229331, -54818, -165064, 33988, -264150, 49039, -122126, -40043, -33837, 127940, -205974, -477637, -13166, -185133, -237465, -65771, -225914, -181535, -38632, 97979, -36872, -223758, 164231, -89630, -101806, -24534, -293742, -268815, -13521, -66716, 25829, -555882, 295185, 177561, -205536]
10614D9387c0692l7418Q121k29956A8237c5642j6949j04583B53209a16325e4032
10602F2327R0377d819n4889I0410J8762p92b39577L9766G8000j8863c00340G1413
10589a31674A17438J743a23871a1577j42916m1732N8949O6686A08296Q7073a14848
10577A40716A6273b27646I0981e1278j19082A02311a57098D8555J36502j2136
10567A72921b53289J11691j25067j33969a11882R465q0438P4174d3747B0888b1147
10555A98867b14591A55634e999m42402J71485m3413J24023C5021P3024a86065
10544B05320C6780e3201J5439p8872E787J2653K4625K98208A49019i946E7321
10532g2981k19023A40943P8056g0726j41474j35562A28962b1214A61008d0601
$$ y = [49387, -30692, -68110, -59989, -289945, 18237, -35642, -52591, -157174, 253209, -116325, -54032, 62327, 152704, -4819, -59708, 90410, 109172, 108380, -239577, -199811, 78000, 59137, -300340, 71413, -131674, 117438, 119181, -123871, -11577, -154493, -196225, -137276, -70590, 108296, 195369, -114848, 140716, 16273, -227646, 90981, -51278, -170360, 102311, -157098, 48555, 185057, 172921, -253289, -141598, -266665, -400634, -111882, -102417, -182855, -108681, -43747, 20888, -21147, 198867, -214591, 155634, -5999, -448401, -276916, -320329, -196306, 35021, 108045, -186065, 205320, 36780, -53201, -37762, -116634, 5787, 18440, 43065, 341273, 149019, -9946, 57321, -72981, -292004, 140943, 218999, -70726, -212200, -347762, 128962, -21214, 161008, -40601]
10521a83926A35904g2864j57109J04375I963a06340r2001A67181c10685A04786
10510C843b197B4043C818f7646l7623C62153b04139I8952a2968o6507k9939C84822
10497B11011O5960a48740K8152A1329a4920n2174H7384i1062A45149b63008C94761
10485C64042p862j39837J2172A05062K37050K96855M0481B67369n5286N9792p4642
10474A97233b796n6288n339F0240b68777A25372J01705l0138C3464J8911c6855
10462B0145N2755Q2569p4624d2203A41720M1114b08230P1917k32909a05041c2549
10450b28480P3196R244A76408n2932b3868o7173l0499q2163G4031b57148A43508
10438b39041a971j7076G3174b85104r1951a69069A0955c09068A74719k0019h8241
$$ y = [-183926, 135904, -72864, -229973, -125598, 9963, -106340, -198341, 167181, -310685, 104786, 3843, -2197, 24043, 3818, -67646, -105269, 362153, -204139, 98952, -12968, -79475, -109414, 384822, 211011, 276971, -148740, -120588, 11329, -14920, -67094, 87384, -91062, 145149, -263008, 394761, 364042, 356180, 216343, 228515, 105062, 342112, 638967, 679448, 267369, 212083, 271875, 197233, -2796, -59084, -64423, 60240, -268777, 125372, 227077, 196939, 33464, 52375, -36855, 20145, 72900, 155469, 80845, -42203, 141720, 182834, -208230, -136313, -369222, -105041, -32549, -228480, -155284, -146040, 176408, 123476, -23868, -91041, -121540, -203703, 74031, -257148, 143508, -239041, -1971, -19047, 73174, -285104, -377055, -169069, 10955, -309068, 174719, 154700, -88241]
10426b88424A04005c5076k3301B3897a40314L5638l2846E5492i6950a0411j28232
10415a38643M8261b0922k67162e8293l75201B8837J10137f2865j06178A7642b52322
10403b86351B72575P6640c1478F7949G20h9308F5188r014P3330i6292A51119F6516
10390a19411B15928j06732K40215B4987h323A47303b13396P8431E7621J37408
10380A95029P7791p8510K38334j53686I8323D5400K30703J06118J22119j47810
10370C56530c7940D02289J61482k66808J81477o3359J43501A13482Q9228p2010
10360A30700C3348c2803C19206j22767M211F6825K77288D7748L06852K35802B52791
10348B40743J95247J82536k95147o0366P9342R3901R6538B08852D2188K3548J81116
$$ y = [-288424, 104005, -35076, -58377, 23897, -140314, -104676, -137522, 55492, -96950, -10411, -138643, -90382, -20922, -288084, -58293, -433494, 28837, 138974, -62865, -169043, 17642, -252322, -286351, 272575, 349215, -31478, 67949, 720, -89308, 65188, 56174, 129504, -96292, 151119, 66516, -119411, 215928, 109196, 349411, 24987, -8323, 147303, -213396, -134965, 57621, 195029, 272820, 194310, 432644, 278958, 98323, 45400, 276103, 382221, 504340, 356530, -37940, 402289, 563771, 296963, 478440, 415081, 558582, 113482, 202710, 130700, 33348, -32803, 319206, 196439, 200650, 66825, 344113, 47748, 354600, 590402, 252791, 240743, 435990, 618526, 323379, 263013, 342355, 436256, 532794, 208852, 42188, 65736, 246852]
10337B46852A7682M67518c3325A17880K57376M8164k8028b92861F2303J4610c01525
10325a71099A33754f1661j50511D00705g6034B3881J15931J36901A18339K2010
10315A40349k0974K93657K75634A59854l53C9302J35434a51159J2997K3602c9806
10303H617i671j46685C7374P4718a15535j52136a29180k4389m5116B12304c0638
10291d1757k39573i9289M0129A43960p1803L4411i5664A22123A1471J29012g2003
10279B1529e444o4771J1342A57665O1803B0253K21969o1909k6788e6801E6414
10267B89562f4680B50521I313O1112K8093J86435j015L7438D1759K41203m6753
10256B36209L4243j9575p8121L49774a82585E4484c20493a34099A30194o4198
$$ y = [246852, 17682, 485200, -33325, 117880, 375256, 423420, 395392, -292861, 62303, 76913, -301525, -171099, 133754, -61661, -212172, 400705, -76034, 23881, 139812, 276713, 118339, 140349, 119375, 413032, 688666, 159854, 159501, 39302, 174736, -151159, -138162, -114560, -39806, 8617, -9671, -156356, 37374, 112092, -115535, -267671, -129180, -153569, -198685, 212304, -30638, -41757, -281330, -99289, -59160, 143960, 72157, 106568, -95664, 122123, 11471, 140483, -72003, 21529, -5444, -70215, -58873, 157665, 219468, 20253, 242222, 180313, 153525, -56801, 56414, 289562, -64680, 250521, 9313, 70425, 98518, 284953, 283938, 321376, 41759, 282962, 236209, 270452, 250877, 172756, 522530, -182585, 54484, -320493, -134099, 130194, 65996]
10246F5996a89687g6064m0655m5971K3217A34002A6515K0747a98273R5757A04335
10234e16400D8830R1772o4760a82880A73720n5619J20447J93792B3504e3436k99049
10223c52485a37621M4282G611b8000m9037r448l3515B0703c3699j37107B7432
10211C1032d1106A73290a53583j01476R2421A72701b28447h6642B50K26593l7942
10200A88901i8527a425j11929I0499g1566l47515J73323P5345A27929a46079G8454
10188c10725A27559B4879N5393J39455F6591b04632d8290B63481b67795L712j54489
10177d18572b9642k85927D7115K06465K9788c03375A6610c39110J30105A31990
10166a20867j25155a03133I600a57207f6441b9282A8462b9352p1633j78805O0590
$$ y = [65996, -189687, -76064, -116719, -162690, -139473, 134002, 16515, 37262, -198273, -102516, 104335, -516400, 48830, 140602, 75842, -182880, 173720, 118101, 238548, 432340, 23504, -53436, -352485, -137621, -93339, 7611, -28000, -77037, -86485, -120000, 20703, -33699, -170806, 27432, 31032, -41106, 173290, -153583, -255059, -162638, 172701, -228447, -86642, 250, 226843, 188901, -98527, -1425, -113354, 90499, -71566, -419081, -245758, -170413, 127929, -146079, 78454, -310725, 127559, 24879, 80272, 219727, 66591, -204632, -48290, 263481, -267795, -264083, -418572, -29642, -315569, 47115, 253580, 283368, -303375, 16610, -339110, -209005, 131990, -120867, -246022, -103133, 9600, -157207, -66441, -29282, 18462, -29352, -100985, -279790, -219200]
10155b19200K4833C3686N1725a40791J4646A46547b93861B03458j8245a59542
10144b10295g0468k47759B75694a65018P9025b2922k73888b9768J1659L394p7143
10133i1858l25426a91092N1654B45233B0155G634c51730J17165b5635r976j97076
10122b32687G7209h9657j49534g8787r7991h989j35009e6582I382b53288a5792
10110C593g3734o2449C7139b45519A68367a55362J3493b1258B33181a11579A98418
10098d6377A89989e0142k32750m0025G3141k1624e824p5484C388a16192E9080
10086G9297a81640C8047a56587N5457b2438k05232n4456A6210O785M4847J44M9304
10074A17290a60301p6795c7047A78460O2920A10875d6513m1048k32A25949a25139
$$ y = [-219200, -194367, 33686, 85411, -140791, -126145, 146547, -293861, 203458, 185213, -159542, -210295, -70468, -318227, 275694, -165018, -85993, -22922, -296810, -29768, -18109, -14715, -91858, -417284, -191092, -139438, 245233, 20155, 7634, -351730, -234565, -25635, -35611, -232687, 77209, -89657, -239191, -78787, -176778, -8989, -143998, -56582, 9382, -253288, -15792, 3593, -73734, -136183, 37139, -245519, 168367, -155362, -141869, -21258, 233181, -111579, 198418, -46377, 189989, -50142, -282892, -322917, 73141, 51517, -5824, -81308, 3388, -116192, 59080, 79297, -181640, 38047, -156587, -101130, -22438, -227670, -282126, 16210, 22995, 67842, 67986, 117290, -160301, -237096, -37047, 178460, 241380, 110875, -46513, -87561, -87793, 125949, -125139]
10062a0049k02046f5213l13953A3968b39531a1543n0033C74401f561H9467M0561
10051A30028j8777e3741j70061l55409H1307b63065j12256C3964K21353b97524
10040c07379o9409A5287b15164g8394k757G3969E30J6323K0312e1394I3732k2538
10028G1194i9602B4027b47554A04796A3794K087a23839k7791D4850a02930A33020
10016a49055o7121E1919K5612b1678A29072A3457P7892q856b33883R2588j55879
10005b97174B01935D538a57911K93e3209r9311H587L33378a34443D00K9208F835
9992b88440d4283j24334O7956C5581h6685b7566k4122A60874L1062c05305B09110
9980a32846A68325J58125E1394K17840A25506M5995i183k70454A98536n8625a22492
$$ y = [-10049, -212095, -65213, -379166, 13968, -239531, -11543, -61576, 374401, -6561, 89467, 130028, 111251, -53741, -223802, -579211, 81307, -263065, -375321, 33964, 255317, -297524, -307379, -376788, 15287, -215164, -78394, -81151, 73969, 530, 16853, 37165, -51394, 93732, 71194, -99602, 24027, -247554, 104796, 13794, 15881, -123839, -151630, 44850, -102930, 133020, -149055, -216176, 51919, 77531, -21678, 129072, 13457, 91349, 82493, -233883, -141295, -297174, 201935, 4538, -157911, -157618, -53209, -152520, 8587, 341965, -134443, 400, 29608, 6835, -288440, -44283, -168617, -100661, 35581, -86685, -27566, -51688, 160874, 191936, -305305, 209110, -132846, 168325, 326450, 51394, 269234, 125506, 171501, -9183, -279637, 198536, 139911, -122492]
9968f0326D5284J15253F2911b15312n756A36232j5002a54628a6355j81662j0456
9957b08473j3145K7685F8624a80453G7671a60080k16355J26847B79516b89853
9946E5045i9706F6147a98356R6064G7271a90741A61997E6305c04736g2013N080
9935f6933a9687A6119a14189J7011k67275A83363I696a00312k1647k904G7532
9923a27054c953A06859e4983l8533F6688b0436H9168B6677J89446b1613N2A02572
9910a10782L9363k37515R5719c8474l738q7560b282b54I9900a98046j393d4915
9897H081P29P1381a07633n9980A06600m2639F436b56692A31975h6370H3636A7444
9884c00999j3981M1142D2813a15470A10448c47621h8063j33757C28788b24580
$$ y = [-60326, 45284, 160537, 62911, -215312, -221068, 136232, 121230, -154628, -16355, -198017, -208473, -221618, -193933, 68624, -180453, 77671, -160080, -376435, -249588, 279516, -289853, 55045, -99706, 66147, -198356, -102292, 77271, -190741, 161997, 56305, -304736, -72013, -66933, -19687, 16119, -114189, -97178, -364453, 183363, 9696, -100312, -121959, -124863, 77532, -127054, -3953, 106859, -54983, -93516, 66688, -20436, 89168, 26677, 216123, -21613, -21561, 102572, -110782, -71419, -308934, -213215, -38474, -42212, -129772, -2282, -254, 99900, -198046, -199439, -44915, 8081, 8810, 80191, -107633, -167613, 106600, 63961, 6436, -256692, 131975, -86370, 83636, 17444, -300999, -314980, -273838, 42813, -115470, 110448, -347621, -88063, -221820, 328788, -224580]
9873e1748j30278N6529L4209k8564k21062E2279R1008c41870d8185j02790d0320
9861c96754A72925G3478P2537n1347a28307a9186F9232D611a24039c2843A81220
9849D6741K5562a53023n447K3941k04569A51414b95068J23965F210P1269a37624
9837C2096M9595a21855j3137B51680B39a25491j0817M6879E0812d8110B42849
9825d45076F601a62526I863d9495A92658j1380b3788n7192j15573M3338j24288
9814b77503M5167J0766Q5748A65053D3562a32022C9262d33516a79372A17639J47161
9803B64800j27269l0505J37623j1939r2736o1805k9033b12847f9597q5777A28649
9791e6575B6969L8310L102O6586a13481j98561F1876a40112o098j66022a42190
$$ y = [-51748, -182026, -125497, -91288, -119852, -340914, 52279, 143287, -341870, -48185, -150975, -40320, -396754, 172925, 73478, 146015, 94668, -128307, -19186, 69232, 4611, -124039, -32843, 181220, 46741, 72303, -153023, -158470, -134529, -339098, 151414, -295068, -171103, 6210, 77479, -137624, 32096, 81691, -121855, -134992, 251680, 239, -125491, -136308, -89429, 50812, -48110, 242849, -445076, 6601, -162526, 9863, -49495, 192658, 181278, -23788, -80980, -196553, -153215, -277503, -232336, -221570, -135822, 165053, 43562, -132022, 39262, -433516, -179372, 117639, 264800, 137531, 107026, 244649, 232710, 139974, 78169, 49136, -212847, -69597, -155374, 128649, -56575, 26969, 65279, 68381, 134967, -113481, -312042, 61876, -140112, -146210, -312232, -142190]
9779c35149P3063A31767P9579g7512m013K5861j17381A29177d3323j02447P922
9768a37848I8550L7584a2636q8072q530G9215f0063k23106J39019c9392j40987
9757a80379A52306i6356k6445k8180M3966J5659b811A1913c39210a35408r2331
9746b27739H6340A0123c11386G8769a49024B690b33102c4436A07736M2828c5009
9734F0080b71697g9517L9516O547B7366K7837K25808M3436f5089k06721a16323
9722f4321A19880n5763k0274a92487g770B38102D8270e28264a36014A32277j1847
9711A20430a05641j89808a12424j62477a08799A46120c33576c6990j42775F5682
9700b15351j29984A01267J8066J03420q4412g2917l6952b0206k8191D1402a43153
$$ y = [-335149, -262086, 131767, 211346, -77512, -81525, -55664, -173045, 129177, -43323, -145770, -137848, 98550, 136134, -12636, -100708, -109238, 79215, -60063, -283169, -144150, -39392, -180379, 152306, -96356, -122801, -150981, -107015, -91356, -2811, 11913, -339210, -135408, -227739, 86340, 10123, -311386, 78769, -149024, 2690, -233102, -34436, 107736, 150564, -35009, 60080, -271697, -79517, -40001, -33454, 27366, 55203, 281011, 324447, -65089, -271810, -116323, -64321, 119880, 64117, 43843, -192487, -7770, 238102, 48270, -528264, -136014, 132277, 120430, -105641, -295449, -112424, -274901, -108799, 146120, -333576, -36990, -179765, 65682, -215351, -345335, 101267, 119333, 222753, 138341, -72917, -109869, -20206, -48397, 41402, -143153]
9688F497h9756K008o8842k5920B64517B2270J19327b1004A29664g0156F838b83782
9675b57326A50476J00733c36814A42320a54318f3926P956j8437A46756f2578D5615
9663a12876A9383R4535C310J631c44112a40699O6128B18564e4317m2305m2077
9652a38699I5989b36069E5965J60298G1750c61999f4404k10999N1506H6330b2084
9640b60525N7347p5291e5303j1728j21820Q740B17140d52486B7894b09680A42674
9628I2133c08315J46835A76083i8057j46452D181c24164E4582R1965p0569B6009
9616a58856O8225b6363k16621L1037e7402j60252m2673E0477A0373b09342R8566
9605a10776B9219a36497C7862c01973J09625J3109j77697B8939J56116a20455
$$ y = [6497, -89756, -87748, -156590, -182510, 264517, 22270, 141597, -21004, 129664, -70156, 6838, -283782, -257326, 150476, 251209, -336814, 142320, -154318, -63926, -55970, -74407, 146756, -62578, 45615, -112876, 19383, 113918, 3310, 4941, -344112, -140699, -74571, 218564, -54317, -96622, -138699, 95989, -236069, 55965, 216263, 71750, -361999, -64404, -275403, -223897, 86330, -22084, -260525, -203178, -278469, -55303, -67031, -188851, -180111, 217140, -452486, 27894, -209680, 142674, 92133, -308315, -161480, 176083, -98057, -244509, 4181, -324164, 54582, 146547, 75978, 26009, -158856, -90631, -26363, -242984, -211947, -57402, -217654, -260327, 50477, 10373, -209342, -110776, 29219, -136497, 37862, -301973, -192348, -179239, -356936, 28939, 185055, -120455]
9594a33354F4529B6591L4081J00803n2059j1354g7992j77705b152j99734k46538
9583d48424B8511I218O7234M2722c21608B3945d20668C5860J11216o0598c2797
9571a49909D5952a64441n2754c2350E8693b58376a8783D5340J75748F8574b36940
9559c405j4297A52703D9354a24042H2517b82879O0924A86276e03947a29327A72115
9547D9196b43980c2667j27457L8881F6503A7553J41643o3836a59678B2803b36547
9535f3653p9741B8767h8873A11799b3102o9727B18491a87807g4903A73071a31506
9523A2133L9195K84289a32218b7887N07j02130A73801b79935B28172e850l15666
9512c21516a01398n6256j17959A98333b83969A2044g4884p8920A7227K48797j29754
$$ y = [-133354, 64529, 26591, 60672, 161475, 109416, 98062, -77992, -255697, -2152, -201886, -448424, 28511, 9218, 76452, 119174, -321608, 23945, -420668, 35860, 147076, 86478, -32797, -149909, 45952, -164441, -217195, -32350, 58693, -258376, -18783, 45340, 221088, 68574, -236940, -3405, -17702, 152703, 49354, -124042, 82517, -282879, -221955, 186276, -503947, -129327, 172115, 49196, -243980, -32667, -160124, -121243, 66503, 17553, 159196, 95360, -159678, 22803, -236547, -63653, -143394, 28767, -88873, 111799, -23102, -92829, 218491, -187807, -74903, 173071, -131506, 12133, 51328, 335617, -132218, -27887, -27380, -129510, 173801, -279935, 228172, -5850, -321516, -101398, -157654, -275613, 198333, -283969, 12044, -74884, -153804, 17227, 266024, 136270]
9501A36270a03394A29108e3206n4004B28058a28177c8247F8831f6777m2525I1458
9489e3464A83265H8453a2611m2049l7620H2265A2104J16994b6271B79093a82493
9477b43835l4233a6008B65951h7534p2693B97901A16205J61500j32134o8071L8047
9466A15547b1972k90753C22750c8080j31275A94309a111B00463c25396A65542
9455b30737j51860b4560I4924b30717M8112f8589A66366Q4298g4750m837j51265
9444b30852b9948j26100a0877k87652d6511D8751b82174A14113d4775A26795K1303
9433A48098d6473k023k55502e3119k0803A2317J12636b05120M3830P1232l30265
9422d20323c4519k98818b4010l6035r0629O5419r6731A17801b00219N422E759
$$ y = [136270, -103394, 129108, -53206, -107210, 228058, -128177, -38247, 68831, -66777, -109302, 91458, -53464, 183265, 88453, -12611, -54660, -92280, 82265, 12104, 129098, -26271, 279093, -182493, -243835, -278068, -16008, 265951, -87534, -160227, 297901, 116205, 277705, 145571, 77500, 115547, -21972, -312725, 322750, -38080, -169355, 194309, -1111, 200463, -325396, 165542, -230737, -382597, -24560, 94924, -230717, -182605, -68589, 166366, 250664, -74750, -79587, -230852, -29948, -156048, -10877, -298529, -46511, 48751, -282174, 114113, -44775, 126795, 148098, -46473, -48496, -303998, -53119, -73922, 12317, 124953, -205120, -161290, -90058, -420323, -34519, -333337, -24010, -60045, -150674, -85255, -181986, 117801, -200219, -194797, 5759]
9410B39728l9755a84831L9765j49272R7111l0390K6064c8200p0357b4368l1909
9399e6277p23r9708I7288b30920D5961d23786A30012b33696A50346E2847J56008
9388B08855a16854A15927a97557k01826C98927h3474E7941J29242C1028K61424
9378B92452a4609k07888E7744c836j32693M2585A8162J74861k7312e3233n3188
9367a06421j7314K0555g150k33111f5933k07234K4543B11840e3505D1476b29199
9355E5495K42843c88613b360A75183B2726J21782i1863b9045H0429c51674F3588
9343h0285A84744D8667b84934I8352a14412p9119p6541f809C3328a6265k4430
9332d0695j3998A7475d0680l23900a17946k0792J7712j01431A79276C9729h9846
$$ y = [239728, 199973, -184831, -145066, -294338, -197227, -227617, -201553, -38200, -108557, -24368, -56277, -57000, -156708, 97288, -230920, 45961, -423786, 130012, -233696, 150346, 52847, 208855, -116854, 115927, -197557, -399383, 398927, -83474, 57941, 187183, 31028, 292452, -14609, -222497, 57744, -3836, -136529, -93944, 18162, 193023, 165711, -53233, -106421, -123735, -103180, -7150, -240261, -65933, -273167, -248624, 211840, -53505, 41476, -229199, 55495, 298338, -388613, -2360, 175183, 22726, 144508, -91863, -29045, 80429, -351674, 63588, -80285, 184744, 48667, -284934, 98352, -114412, -193531, -270072, -6809, 33328, -16265, -40695, -54693, 17475, -40680, -364580, -117946, -138738, -121026, -222457, 179276, 39729, -89846]
9320a74490e3496j5745I2770a56728j03675d2920m2105D6119f8420k99656d0905
9308B11394n7893D6675b0569I6527b73738A15065b3580k8308j10030H5495j5420
9297G0075O6524f4011A86176b20897j22018B11107a58956G3302a73942A53623
9286A05109a14311j4825H9478B5849a35864m8965f6343G6918B2522P7739a21200
9274A17357e3015m47928a34846k77107J74706O8634b2375m7801b9594A20651n01
9263A20150b27839J8335G0947b6129j06915G2733b82439J22212A75721b21239
9252A07458H028K20879a7056o0147l2067F510a07902j62801P8881j6012O6127
9241a41707A98724a89666j39777c2137O224o2576G4394h9762E2247A8616i3088
$$ y = [-174490, -53496, -69241, 92770, -156728, -260403, -42920, -85025, 46119, -68420, -368076, -40905, 211394, 153501, 46675, -20569, 96527, -273738, 115065, -23580, -51888, -161918, 85495, 70075, 136599, -64011, 186176, -220897, -342915, 211107, -158956, 73302, -173942, 153623, 105109, -114311, -129136, 89478, 25849, -135864, -184829, -66343, 76918, 22522, 100261, -121200, 117357, -53015, -500943, -134846, -411953, -237247, -168613, -22375, -70176, -29594, 120651, 120150, -227839, -209504, 70947, -26129, -133044, 72733, -282439, -160227, 175721, -221239, 107458, 8028, 228907, -17056, -77203, -109270, 6510, -107902, -270703, -191822, -207834, -141707, 198724, -189666, -329443, -32137, -25913, -88489, 74394, -89762, 52247, 18616, -93088]
9229A24661a47780j50590a45677j87807c0450r487p9831h274n4562o7990M1304
9218h9522q1356E1535M540J94884a9741F807h5005j80661D9745m961L6180a02980
9205B25891g6859A65579c7032F7701b42315A98424b23552A2310a01390j5359A6367
9193C0822O9378M3159J19686q6664c53959M8664e8258F7545N5705R3695E3387
9181i3278j17972e789l04651G5124b10295B00169p4597a01985k6610C0895a8480
9169b37268A81416a16219E1756c3792A90021h0058r4905P0339d9589k6553J3303
9158f2839o9401b2503m1156j42885A61910J7966b09880B2321a88050E93586a44536
9146e4515H3888I535P4371e3681n1153p9265m804k7599B01472b09985E7919k3530
$$ y = [124661, -147780, -298370, -145677, -333484, -30450, -39937, -119768, -8274, -62836, -130826, -89522, -170878, 51535, 56075, 250959, -19741, 6807, -85005, -265666, 49745, 44784, 80964, -102980, 225891, -76859, 165579, -37032, 67701, -242315, 198424, -223552, 12310, -101390, -116749, 16367, 30822, 100200, 143359, 263045, 176381, -353959, -305295, -58258, 67545, 123250, 216945, 53387, -93278, -211250, -5789, -310440, 75124, -210295, 200169, 125572, -101985, -128595, 30895, -18480, -237268, 181416, -116219, 51756, -33792, 190021, -80058, -174963, -104624, -49589, -76142, -62839, -132240, -22503, -63659, -206544, 161910, 179876, -209880, 22321, -188050, 593586, -144536, -54515, 83888, 9535, 83906, -53681, -104834, -184099, -188903, -216502, 201472, -209985, 57919, 34389]
9134C4389K82784c10329B48085i8176c9285G5849K44956a8856p0243J0445k43805
9123c22459d5091j19460A90155a94936A32567b64101a26690l01G887a63480g8413
9111C0113c14856o6411a27807H917c00528d13r4510n4731B9442P7155c3362q5459
9099a18821G6329P160h9820j87443C17723c14078A44643c30244B97833N6332b82495
9087e6471a6724q9767j65767B43235a21326A14366j2169a6826j37367j2843A7267
9075G382K17830b24065d5240A25561d8331C01865I0861M3254g7365j95042B66064
9063g2416C68757b4927l28908J53512A8880a92545c7931j36563j04867D4917c02403
9051C7320b86263a18248A52026K4355o0899d04226J71410E1555b59965L8270C34668
$$ y = [34389, 317173, -310329, 248085, -98176, -39285, 75849, 320805, -18856, -89099, -78654, -322459, -45091, -164551, 190155, -194936, 132567, -264101, -126690, -126991, 7887, -163480, -78413, 30113, -314856, -381267, -127807, 8917, -300528, -413, -94923, -149654, 29442, 106597, -33362, -118821, 76329, 83489, -89820, -277263, 317723, -314078, 144643, -330244, 297833, 354165, -282495, -56471, -16724, -106491, -272258, 243235, -121326, 114366, 102197, -16826, -154193, -167036, 17267, 7382, 225212, -224065, -45240, 125561, -48331, 301865, 90861, 134115, -77365, -272407, 266064, -72416, 368757, -24927, -353835, -200323, 18880, -192545, -37931, -174494, -279361, 44917, -302403, 37320, -286263, -118248, 152026, 176381, 115482, -404226, -232816, 51555, -259965, -221695, 334668]
9039a84067m2255e3157j75657O8563n879j0479A69133n1443a8505j56652B2038
9027c20825C9020K0386h5180j37603L5129H7372a0975p0516k14844J09855g1370
9015A4004K1407N8179L8638a25741A42334b33839f9344j52251b1309j68283A13782
9003E657b75871e0341I6858i702A50899a71584q6393h5813j45977B4310J61189
8992A85499b32934A75065j1668N7829o8258L04715g3650G9400q420f2780E9724
8980A34237h7790L1213G4633K22930c9555E09255j71908c04676N7233H5289a68470
8968F4526k5873d21170B3106b77647A1472J59296g6545L6781k53259O9145j67830
8957c91708d8801o3100M2701I0212R6384a79260A84196a78089j79164a00988D5524
$$ y = [-184067, -226322, -53157, -228814, -160251, -166130, -176609, 169133, 117690, -18505, -175157, 22038, -320825, 39020, 59406, -85180, -222783, -187654, 87372, -10975, -81491, -296335, -186480, -71370, 14004, 35411, 93590, 132228, -125741, 142334, -233839, -69344, -221595, -21309, -189592, 113782, 5657, -275871, -50341, 96858, -9702, 150899, -171584, -257977, -85813, -231790, 24310, 185499, -232934, 175065, 163397, 221226, 152968, 457683, -73650, 79400, 70980, -62780, 59724, 134237, -87790, -56577, 74633, 297563, -39555, 509255, 337347, -304676, -247443, 85289, -168470, 64526, 38653, -421170, 23106, -277647, 11472, 170768, -76545, -39764, -293023, -223878, -391708, -48801, -111901, -69200, 90212, 186596, -179260, 184196, -178089, -357253, -100988, 45524]
8945c0871r3047L3262L4917j31169N718a2463D2291b73395A11130b9265D19961
8933B32991G8991l1562J51170K5180d811F4954k9609L47648M31870J299267L020233
8922E134363P290379j621294m879358B248649H40430l92350A5502O0823f8938
8912A61789c0512A20940m9622j2654J76221c9177E3897j0149B0733K9002a86839
8900B1725a60350b7699j44506g2751A61817j3759e2979o6791j03362A71559C5518
8888d2163j06060f9717l6493L4709k3982J2433o7301N8933j893H3974l4931J74801
8876B23844a6711k768f468l25414K4641a16879b2061k42714K1106H1162L0782
8865A11944A4080i7296r1844M31b204B64246a64479O8950B80762C0065N1315b34993
$$ y = [-30871, -123918, -90656, -55739, -186908, -181190, -12463, 42291, -273395, 111130, -29265, 419961, 232991, 78991, 47429, 198599, 223779, -4811, 64954, 35345, 382993, 814863, 2114130, 5134363, 12424742, 10803448, 5924090, 2248649, 840430, 448080, 15502, 76325, -68938, 161789, -30512, 120940, 71318, 58664, 234885, -39177, 53897, 43748, 20733, 49735, -186839, 21725, -160350, -27699, -172205, -72751, 161817, 148058, -52979, -119770, -223132, 171559, 35518, -42163, -148223, -69717, -106210, -71501, -95483, -83050, -150351, -91418, -93311, 83974, 49043, 223844, -16711, -19479, -6468, -331882, -307241, -116879, -22061, -264775, -243669, 81162, 111944, 14080, -97296, -189140, -188709, -2204, 264246, -164479, -95529, 280762, 30065, 81380, -234993]
8852h835n389m01176c5758A14265g882C19955B0274h5461l40704A63510a09028
8840b98652B88407G1258a69741I7778J47994A2140R0664c0594k13522C7749k962
8829C4787c26160B19239c34236B31284j10644h1218B7574a73540j34112A08964
8818a12817j06768o0167M0778l19432K43815J30980A049a12723B0599J41440b23396
$$ y = [-8835, -14224, -415400, -35758, 114265, -7882, 319955, 20274, -85461, -426165, 163510, -109028, -298652, 288407, 71258, -169741, 97778, 245772, 12140, 102804, -30594, -244116, 37749, 34787, -326160, 219239, -334236, 231284, 120640, -81218, 27574, -173540, -307652, 108964, -112817, -219585, -279752, -238974, -558406, -314591, -183611, 1049, -112723, 20599, 162039, -223396]
$$ [...]
##END NTUPLES=NMR SPECTRUM
##END=
