##TITLE=AC1770_SANT_16_9683695_JZeJOlkGhm
##JCAMPDX= 6.0         $$ Bruker NMR JCAMP-DX V2.0
##DATA TYPE= NMR SPECTRUM
##DATA CLASS= NTUPLES
##ORIGIN= BRUKER
##OWNER= Administrator
$$ 1.72 TOPSPIN		Version 2.1
$$ 2016-04-16 21:02:45.814 -0700  Administrator@X
$$ Compression mode = diff/dup
##.OBSERVE FREQUENCY= 400.02188249412
##.OBSERVE NUCLEUS= ^1H
##.ACQUISITION MODE= SIMULTANEOUS (DQD)
##.ACQUISITION SCHEME= undefined
##.AVERAGES= 64
##.DIGITISER RES= 22
##SPECTROMETER/DATA SYSTEM= spect
##.PULSE SEQUENCE= noesygpps1d.comp
##.SOLVENT NAME= COFFEE_meoh
##.SHIFT REFERENCE= INTERNAL, COFFEE_meoh, 1, 14.96089
##AUDIT TRAIL= $$ (NUMBER, WHEN, WHO, WHERE, PROCESS, VERSION, WHAT)
$$ ##TITLE= Audit trail, TOPSPIN		Version 2.1
$$ ##JCAMPDX= 5.01
$$ ##ORIGIN= Bruker BioSpin GmbH
$$ ##OWNER= Administrator
$$ $$ E:\/data/COFFEE/nmr/AC1770_SANT_16_9683695_JZeJOlkGhm/12/pdata/1/auditp.txt
$$ ##AUDIT TRAIL=  $$ (NUMBER, WHEN, WHO, WHERE, PROCESS, VERSION, WHAT)
(   1,<2016-04-16 21:02:40.579 -0700>,<Administrator>,<X>,<go>,<TOPSPIN 2.1>,
      <created by zg
	started at 2016-04-16 20:51:11.111 -0700,
	POWCHK enabled, PULCHK disabled,
       configuration hash MD5:
       21 0F 79 D6 B3 7B B4 F6 88 20 88 DB 03 48 BD 9F
       data hash MD5: 64K
       D3 5D 7B 8E E1 2B F6 62 A3 A2 3E 57 35 80 F0 22>)
(   2,<2016-04-16 21:02:43.767 -0700>,<Administrator>,<X>,<proc1d>,<TOPSPIN 2.1>,
      <Start of raw data processing
       efp LB = 0.3 FT_mod = 6 PKNL = 1 PHC0 = 0 PHC1 = 0 SI = 128K 
       data hash MD5: 128K
       FB D1 BB 89 B4 F4 3D 00 07 9F 0D DB DA 03 32 93>)
(   3,<2016-04-16 21:02:44.626 -0700>,<Administrator>,<X>,<proc1d>,<TOPSPIN 2.1>,
      <pk PHC0 = -85.44617 PHC1 = 0 
       data hash MD5: 128K
       DC C1 74 12 D7 34 0E 63 F1 5D 1D E7 71 E4 F5 97>)
(   4,<2016-04-16 21:02:45.001 -0700>,<Administrator>,<X>,<proc1d>,<TOPSPIN 2.1>,
      <abs ABSG = 1 
       data hash MD5: 128K
       9A 0B 92 01 4B F7 B7 7C F8 DC 6C 4E 84 A0 14 0F>)
(   5,<2016-04-16 21:02:45.111 -0700>,<Administrator>,<X>,<proc1d>,<TOPSPIN 2.1>,
      <abs ABSG = 2 
       data hash MD5: 128K
       A9 E5 CA 19 61 D1 F4 DA F3 97 1B 57 76 5E 46 85>)
(   6,<2016-04-16 21:02:45.189 -0700>,<Administrator>,<X>,<proc1d>,<TOPSPIN 2.1>,
      <abs ABSG = 3 
       data hash MD5: 128K
       A1 D8 EF 92 26 CE 0F 4A 85 8C 9E 08 63 EA F5 FA>)
(   7,<2016-04-16 21:02:45.283 -0700>,<Administrator>,<X>,<proc1d>,<TOPSPIN 2.1>,
      <abs ABSG = 4 
       data hash MD5: 128K
       47 75 4D 90 31 ED 49 C2 5D 10 FA B3 82 1D 9E 59>)
(   8,<2016-04-16 21:02:45.408 -0700>,<Administrator>,<X>,<proc1d>,<TOPSPIN 2.1>,
      <abs ABSG = 5 
       data hash MD5: 128K
       33 F2 C6 E4 2E 3B 98 8D 35 50 08 76 DF A4 4D 40>)
$$ ##END=
$$ 
$$ $$ hash MD5
$$ $$ D1 95 1B 27 57 08 46 3E 6F 98 A3 F4 24 6F 13 58
##$RELAX= 
##$RELAX= 
##$RELAX= 
##$RELAX= 
##$RELAX= 
##$RELAX= 
##$RELAX= 
##$RELAX= 
$$ Bruker specific parameters
$$ --------------------------
##$DU= <E:\>
##$EXPNO= 12
$$ [...]
##$TP07= 0
##$TPNAME0= <>
##$TPNAME1= <>
##$TPNAME2= <>
##$TPNAME3= <>
##$TPNAME4= <>
##$TPNAME5= <>
##$TPNAME6= <>
##$TPNAME7= <>
##$TPOAL= (0..7)
0.5 0.5 0.5 0.5 0.5 0.5 0.5 0.5
##$TPOFFS= (0..7)
0 0 0 0 0 0 0 0
##$TUNHIN= 0
##$TUNHOUT= 0
##$TUNXOUT= 0
##$USERA1= <user>
##$USERA2= <user>
##$USERA3= <user>
##$USERA4= <user>
##$USERA5= <user>
##$V9= 5
##$VALIST= <valist>
##$VCLIST= <CCCCCCCCCCCCCCC>
##$VD= 0
##$VDLIST= <DDDDDDDDDDDDDDD>
##$VPLIST= <PPPPPPPPPPPPPPP>
##$VTLIST= <TTTTTTTTTTTTTTT>
##$WBST= 2048
##$WBSW= 25
##$XGAIN= (0..3)
0 0 0 0
##$XL= 0
##$YL= 0
##$YMAX_a= 6017623
##$YMIN_a= -11730908
##$ZGOPTNS= <>
##$ZL1= 120
##$ZL2= 120
##$ZL3= 120
##$ZL4= 120
##$ABSF1= 14.96089
##$ABSF2= -5.597292
##$ABSG= 5
##$ABSL= 3
##$ALPHA= 0
##$AQORDER= 0
##$ASSFAC= 0
##$ASSFACI= 0
##$ASSFACX= 0
##$ASSWID= 0
##$AUNMP= <proc_prof1d_extract.lims>
##$AXLEFT= 0
##$AXNAME= <>
##$AXNUC= <1H>
##$AXRIGHT= 0
##$AXTYPE= 0
##$AXUNIT= <>
##$AZFE= 0.1
##$AZFW= 0.1
##$BCFW= 0
##$BC_mod= 0
##$BYTORDP= 0
##$COROFFS= 0
##$CY= 15
##$DATMOD= 1
##$DC= 0
##$DFILT= <>
##$DTYPP= 0
##$F1P= 0
##$F2P= 0
##$FCOR= 0.5
##$FTSIZE= 131072
##$FT_mod= 6
##$GAMMA= 0
##$GB= 0
##$INTBC= 1
##$INTSCL= 1
##$ISEN= 128
##$LB= 0.3
##$LEV0= 0
##$LPBIN= 0
##$MAXI= 10000
##$MC2= 0
##$MEAN= 0
##$ME_mod= 0
##$MI= 0
##$NCOEF= 0
##$NC_proc= -2
##$NLEV= 6
##$NOISF1= 0
##$NOISF2= 0
##$NSP= 0
##$NTH_PI= 0
##$NZP= 0
##$OFFSET= 14.96089
##$PC= 1
##$PHC0= -85.44617
##$PHC1= 0
##$PH_mod= 1
##$PKNL= yes
##$PPARMOD= 0
##$PPDIAG= 0
##$PPIPTYP= 0
##$PPMPNUM= 2147483647
##$PPRESOL= 1
##$PSCAL= 4
##$PSIGN= 0
##$PYNMP= <proc.py>
##$REVERSE= no
##$SF= 400.020009679379
##$SI= 131072
##$SIGF1= 0
##$SIGF2= 0
##$SINO= 400
##$SIOLD= 131072
##$SPECTYP= <>
##$SREGLST= <1H.CDCl3>
##$SSB= 0
##$STSI= 131072
##$STSR= 0
##$SW_p= 8223.68421052631
##$SYMM= 0
##$S_DEV= 0
##$TDeff= 65536
##$TDoff= 0
##$TI= <>
##$TILT= no
##$TM1= 0
##$TM2= 0
##$TOPLEV= 0
##$USERP1= <user>
##$USERP2= <user>
##$USERP3= <user>
##$USERP4= <user>
##$USERP5= <user>
##$WDW= 1
##$XDIM= 131072
##$YMAX_p= 344588518
##$YMIN_p= -11831
##$CURPLOT= <Network HP LaserJet P1505>
##$CURPRIN= <$Network HP LaserJet P1505>
##$DFORMAT= <normdp>
##$LAYOUT= <+/1D_H.xwp>
##$LFORMAT= <normlp>
##$PFORMAT= <normpl>
##$SURQMSG= 1
$$ End of Bruker specific parameters
$$ ---------------------------------
##NTUPLES= NMR SPECTRUM
##VAR_NAME=  FREQUENCY,     SPECTRUM/REAL,   SPECTRUM/IMAG
##SYMBOL=    X,             R,               I
##VAR_TYPE=  INDEPENDENT,   DEPENDENT,       DEPENDENT
##VAR_FORM=  AFFN,          ASDF,            ASDF
##VAR_DIM=   131072,        131072,          131072
##UNITS=     HZ,            ARBITRARY UNITS, ARBITRARY UNITS
##FACTOR=    0.0627417313425164, 1,          1
##FIRST=     8223.62146879497, 1811,         -61580
##LAST=      0,             4062,            -62466
##MIN=       0,             -11831,          0
##MAX=       8223.62146879497, 344588518,    0
$$ Real data points
##PAGE= N=1
##DATA TABLE= (X++(R..R)), XYDATA
$$ [...]
67838 69570 69728 69978 69773 69082 68703 69354 70667 71508 71200 70151 69322 69466 70854 73367 76582 79955 83187
67821 83187 86333 89429 92082 93665 93911 93209 92238 91472 90967 90470 89630 88297 86698 85271 84228 83381
67805 83381 82458 81392 80214 78856 77288 75715 74366 73177 71915 70600 69536 68918 68635 68517 68471 68336
67789 68336 67912 67302 66938 67041 67258 67088 66506 65882 65429 65051 64694 64477 64402 64273 64080 64207 65041 66478 67995
67770 67995 69129 69717 69874 69984 70655 72276 74489 76411 77577 78431 79626 81014 81791 81588 80944 80536 80379
67753 80379 80117 79757 79605 79635 79497 79229 79461 80657 82461 84061 84956 85153 84861 84328 83837 83468 82937 81946
67735 81946 80688 79691 79166 78810 78252 77341 75909 73676 70736 67879 66046 65483 65673 65980 66154 66276 66555
67718 66555 67124 67763 67846 66895 65231 63721 62848 62390 62123 62298 63091 64024 64456 64365 64133 63800 63201 62741 63195
67699 63195 64554 65746 65891 65313 64915 65064 65567 66291 67138 67637 67259 66163 65130 64687 64733 64972 65285 65589
67681 65589 65806 66078 66642 67357 67720 67499 67004 66630 66488 66614 67096 67724 67979 67750 67690 68422 69645 70495 70631
67662 70631 70442 70256 69909 69241 68570 68369 68710 69281 69852 70468 71189 71780 71819 71192 70385 70070 70321 70432 69748
67643 69748 68495 67563 67544 68280 69331 70466 71606 72584 73265 73740 74209 74734 75304 76043 77138 78488 79611
67626 79611 80079 80010 80003 80457 81060 81093 80309 79357 79140 79854 80850 81448 81618 81793 82189 82606 82826 83001 83496 84443
67606 84443 85523 86247 86361 85998 85472 85002 84579 84017 83136 82013 81061 80707 80881 80939 80170 78347 75762 72935
67588 72935 70409 68596 67555 67000 66727 66835 67285 67513 67018 66236 66243 67481 69296 70893 72114 72954 73008 72083
67570 72083 70959 70746 71581 72622 73259 73617 73782 73345 72061 70407 69002 67915 66963 66387 66667 67742 68888
67553 68888 69422 69315 69129 69496 70611 72065 73229 73862 74172 74238 73730 72501 71166 70621 71067 71835 72151 71799
67535 71799 71129 70766 71248 72477 73499 73229 71600 69730 68758 68723 68728 68004 66653 65463 65152 65784 66856 67908
67517 67908 68871 69758 70242 69937 68956 67832 66874 65968 64990 64024 63065 61969 60856 60158 60024 59977 59452 58445
67499 58445 57438 56911 57120 58104 59662 61435 63095 64319 64664 63944 62761 62111 62208 62261 61695 60994 60786 60682
67481 60682 59800 58120 56566 55889 56138 57071 58392 59609 60329 60712 61057 61017 59995 58332 57275 57559 58765
67464 58765 60383 62613 65542 68249 69553 69346 68520 67805 67317 67041 67050 67154 66943 66411 66101 66432 67123 67534
67446 67534 67423 67163 67277 67868 68539 68801 68574 68283 68500 69512 71221 73316 75462 77365 78810 79715 80205
67429 80205 80547 80881 80965 80351 78923 77086 75261 73400 71326 69378 68299 68404 69190 69875 70011 69496 68360
67412 68360 66784 65180 64013 63530 63642 63914 63815 63264 62855 63167 63865 63935 62936 61518 60542 60219 60350 60863
67394 60863 61584 61927 61513 60916 61168 62511 64125 65064 65053 64351 63397 62723 62747 63321 63757 63594 63175 63180 63675 63912
67374 63912 63154 61521 59920 59162 59274 59689 59994 60336 61127 62459 63886 64720 64579 63771 63121 63314 64376
67357 64376 65790 66979 67504 67012 65485 63561 62202 61818 61968 62101 62223 62599 63165 63637 64080 64956 66591
67340 66591 68824 71152 73065 74313 75001 75395 75563 75320 74687 74206 74611 76248 78897 82007 84927 87119
67324 87119 88403 88946 88898 88187 86837 85292 84139 83542 83101 82213 80528 78232 76053 74752 74453 74594 74685
67307 74685 74824 75254 75757 75918 75824 76085 77165 78966 81020 82845 84139 84928 85511 86147 86820 87448 88100 88805
67289 88805 89279 89124 88234 86825 85193 83611 82289 81180 79945 78328 76422 74436 72475 70822 70085
67274 70085 70704 72451 74750 77224 79641 81674 83247 84861 86978 89216 90705 91204 91322 91652 92168 92444
67258 92444 92014 90566 88352 86358 85485 85452 85040 83566 81620 80265 79971 80486 81223 81594 81369 80915 80707
67241 80707 80598 80019 78928 77946 77426 77096 76870 77267 78481 79659 79776 78873 77772 76920 76194 75709 75982 77130
67223 77130 78507 79492 80216 81134 82135 82551 82082 81315 81058 81361 81550 81165 80460 79902 79594 79458 79529 79716 79610
67204 79610 79024 78452 78486 79017 79584 80208 81166 82140 82472 82262 82309 82823 83087 82702 82270 82408 82875 83245 83773 84906
67184 84906 86456 87888 89080 90203 91215 91970 92543 93022 93296 93441 93836 94442 94498 93573 92442 92160 92642
67167 92642 92987 92991 93403 94638 96057 96706 96252 95061 93802 93092 93092 93343 93238 92628 91721 90692 89892 90186 92276
67148 92276 95607 98593 100135 100453 100338 100156 99842 99424 99159 99317 100011 101034 101848 101959 101406 100660 100104 99892
67130 99892 100214 101245 102765 104223 105293 106018 106457 106643 106957 107971 109673 111253 112011 112134 112336 113036 114159
67113 114159 115435 116539 117160 117301 117392 117794 118309 118480 118312 118416 119354 121045 122857 124220 125110 125969 127120
67096 127120 128270 128741 128203 127099 126200 125872 125929 126159 126773 128179 130333 132527 133980 134608 135046 135903 137209
67079 137209 138661 140099 141488 142675 143505 144108 144751 145477 146163 146907 148020 149637 151604 153775 156119 158504
67063 158504 160682 162597 164402 166083 167313 167884 168065 168382 169123 170166 171168 171818 172041 172014 171991 172069 172253
67046 172253 172691 173648 175189 177031 178808 180414 182095 184200 186719 189067 190586 191406 192517 194627 197207
67031 197207 199174 200346 201627 203729 206349 208775 210763 212483 214112 215888 218276 221608 225623 229634
67017 229634 233037 235515 237045 238008 239115 240882 243238 245799 248381 251058 253939 257113 260651 264388
67003 264388 267883 270912 273837 277133 280717 284148 287445 291167 295537 299899 303384 305874 308083 310805
66989 310805 314359 318662 323450 328301 332664 336224 339270 342521 346411 350684 354775 358495 362121 365926
66975 365926 369954 374284 379073 384177 389060 393480 398036 403616 410322 417352 423970 430225 436594 443281
66961 443281 450136 457043 464087 471376 478925 486727 494802 503156 511751 520435 528871 536739 544224 552174
66947 552174 561404 571808 582470 592759 602972 613739 625165 636903 648835 661181 673992 686987
66935 686987 699984 713060 726172 739044 751673 764653 778632 793634 809200 825066 841431
66924 841431 858570 876438 894660 912796 930677 948594 967076 986404 1006429 1026895 1047775
66913 1047775 1069226 1091484 1114839 1139331 1164333 1188908 1212918 1237380 1263256 1290239 1317308
66902 1317308 1344194 1371640 1400321 1430196 1460921 1492263 1523980 1555940 1588567 1622606 1658186
66891 1658186 1694597 1731197 1768061 1805439 1843031 1880196 1916531 1951983 1986736 2021259 2056118
66880 2056118 2091345 2126344 2160672 2194569 2228337 2261638 2293888 2324978 2355008 2383564 2410006
66869 2410006 2434436 2457713 2480309 2501615 2520539 2536396 2549097 2558915 2566331 2571830 2575550 2577285
66857 2577285 2576893 2574449 2569896 2562893 2553303 2541573 2528239 2513177 2495759 2475735 2453568 2429782
66845 2429782 2404317 2376864 2347568 2316994 2285498 2253032 2219681 2185984 2152466 2119068 2085316
66834 2085316 2050856 2015563 1979355 1942282 1904790 1867519 1830845 1794870 1759710 1725399 1691521
66823 1691521 1657494 1623350 1589745 1556987 1524521 1491738 1458898 1426792 1395746 1365436 1335561
66812 1335561 1306214 1277594 1249740 1222625 1196240 1170506 1145310 1120689 1096757 1073436 1050401
66801 1050401 1027413 1004624 982555 961751 942296 923547 904514 884794 865054 846357 829035
66790 829035 812457 795894 779273 763001 747350 732297 717855 704217 691477 679343 667290
66779 667290 654995 642579 630446 618958 608241 598141 588233 577979 567062 555637 544211 533327
66767 533327 523350 514401 506256 498389 490334 482021 473697 465642 458152 451568 445814 440033 433263 425653
66753 425653 418482 412624 407473 401768 395150 388335 382016 376238 370915 366309 362615 359385 355780 351384
66739 351384 346554 341909 337649 333498 329155 324609 320026 315592 311570 308201 305345 302443 299134 295654
66725 295654 292347 289059 285549 282191 279528 277204 274207 270309 266464 263432 260838 258043 255149 252464
66711 252464 249696 246584 243807 242247 241502 240136 237402 233906 230493 227274 223983 220615 217358 214351
66697 214351 211846 210228 209568 209354 208833 207470 205127 202115 199091 196594 194612 192802 191074 189570 188153
66682 188153 186358 183886 180826 177413 174035 171368 169953 169499 169141 168461 167716 167004 165923 164359 162911
66667 162911 162019 161213 159820 158012 156518 155561 154735 153796 152917 152152 151199 149942 148754 148065 147798 147439 146502
66650 146502 144915 143108 141774 141356 141604 141724 141061 139620 137951 136651 136014 135968 136157 136038 135101 133192 130683
66633 130683 128259 126476 125550 125453 125974 126597 126617 125690 124221 122971 122289 121916 121468 120861 120260 119833 119643 119602
66615 119602 119538 119411 119382 119506 119490 119053 118406 117965 117649 116921 115598 114112 112835 111593 110097 108493 107130
66598 107130 106108 105352 104834 104404 103680 102494 101284 100638 100563 100603 100584 100782 101315 101798 101774 101282 100785 100604 100604 100435
66578 100435 100056 99874 100215 100690 100433 99125 97534 96727 96942 97545 97953 98133 98207 98053 97521 96782 96154 95685
66560 95685 95087 94080 92738 91550 91112 91602 92477 92835 92206 90903 89575 88607 88085 88092 88675 89481 89804 89199
66542 89199 87980 86942 86668 87174 88147 89283 90378 91259 91759 91719 91021 89744 88288 87159 86497 85969 85251
66525 85251 84453 83895 83559 83080 82300 81604 81554 82279 83287 83781 83148 81284 78633 75957 74029 73361 73997 75445
66507 75445 76904 77719 77693 77008 76040 75299 75292 76147 77446 78618 79407 79790 79623 78710 77202 75589 74284 73423
66489 73423 73088 73360 74080 74825 75291 75533 75717 75862 75914 75853 75619 75086 74275 73486 73089 73213 73625 73899 73817 73721
66469 73721 74270 75599 76873 77063 76074 74687 73496 72451 71482 70896 70900 71289 71916 72904 73984 74197 72965
66452 72965 71192 70553 71676 73559 74798 74925 74443 74041 74038 74365 74808 75212 75477 75414 74829 73871 73066 72775 72788
66433 72788 72713 72607 72892 73706 74708 75549 76264 77154 78460 80093 81508 81986 81321 80129 79167 78441 77390
66416 77390 75863 74418 73542 73107 72826 72832 73361 74150 74618 74617 74603 74923 75217 74733 73185 71164 69584 68797 68401
66397 68401 67956 67637 67870 68497 68768 68304 67659 67584 68003 68134 67544 66676 66280 66659 67652 69042 70639 72092
66379 72092 72957 73093 72851 72802 73329 74450 75853 77097 77899 78358 78756 79128 79124 78438 77179 75681 74106 72439
66361 72439 70805 69546 68953 69029 69483 69843 69731 69276 69124 69708 70538 70606 69617 68494 68402 69494 70811 71298
66343 71298 70733 69794 69377 69794 70558 70921 70585 69792 68860 67899 66974 66191 65562 65055 64909 65575 67121 68943
66325 68943 70216 70504 69849 68642 67562 67293 67918 68746 69011 68606 67976 67566 67632 68311 69497 70767 71800
66308 71800 72762 73991 75410 76541 77066 77063 76726 76083 75073 73768 72578 72142 72721 73649 73801 72870 71739
66291 71739 71287 71260 70854 69994 69319 69080 68839 68256 67513 66844 66242 65778 65655 65789 65788 65561 65469 65743 66204 66769
66271 66769 67689 68992 70175 70870 71382 72166 73127 73957 74830 76144 77688 78724 78944 78787 78593 77969 76414
66254 76414 74276 72582 71905 71829 71641 71198 70824 70643 70501 70546 71332 73058 75019 76153 75941 74554 72414
66237 72414 70096 68454 68250 69474 71372 73229 74817 76062 76725 76694 76242 75711 75087 74085 72598 70980
66221 70980 69986 70331 72007 73955 74736 73808 72006 70696 70631 71635 72999 73921 73912 73146 72382 72275 72800 73425
66203 73425 73737 73784 73965 74732 76201 77874 78962 79228 79346 80205 81902 83676 84638 84338 82768 80316 77793
66186 77793 76140 75850 76761 78411 80371 82161 83224 83336 82917 82682 82977 83677 84590 85565 86160 85697 84034
66169 84034 81993 80603 80076 79942 80018 80634 81808 82861 83214 83024 82641 81910 80584 79115 78340 78445 78830
66152 78830 78967 78850 78616 78284 78017 78119 78578 79022 79266 79471 79649 79545 79267 79500 80651 82151 83014 82865
66134 82865 82098 81270 80744 80720 81172 81766 82151 82306 82484 82913 83724 84902 86038 86398 85690 84650 84370 84998
66116 84998 85522 85012 83758 82919 83240 84395 85540 86193 86419 86357 85948 85202 84478 84141 84115 84087 84150 84826 86376
66097 86376 88424 90426 92171 93615 94563 94879 94799 94699 94642 94435 94024 93541 93038 92445 91789 91258 91013 91112 91564
66078 91564 92283 93014 93439 93377 92803 91801 90622 89698 89348 89494 89799 90109 90657 91802 93596 95520 96690
66061 96690 96619 95865 95697 96794 98407 99071 98110 96210 94583 93849 93798 93924 93955 93928 93916 93810 93370 92468 91284
66042 91284 90322 90203 91262 93143 94932 95926 96207 96220 95971 95155 94101 93905 95266 97608 99795 101437 102996
66025 102996 104803 106510 107596 108048 108415 109342 111047 113171 115155 116848 118563 120446 122107 123102 123470
66010 123470 123496 123245 122785 122646 123483 125324 127611 130034 132866 136416 140569 144992 149433 153656 157474 161044
65994 161044 164861 169182 173629 177520 180461 182520 183997 185159 186011 186201 185337 183503 181229 178812 175876
65979 175876 171935 167177 162300 157580 152596 147176 142252 139172 138108 137667 136359 134148 132091 130792
65965 130792 129850 128815 127843 127059 125950 124064 121985 120886 121224 122415 123751 125010 126102 126779 127070 127650
65949 127650 129326 132190 135433 137911 138924 138661 138029 137932 138609 139763 141251 143385 146444 150123 153620
65934 153620 156195 157651 158456 159466 161352 164133 167234 170002 172123 173702 175137 176904 179227 181969
65920 181969 185030 188733 193575 199577 206167 212723 218917 224531 229301 233181 236474 239497 242295 244841
65906 244841 247250 249501 251135 251580 250813 249472 248284 247496 246850 245923 244396 242152 239289 236098 232918
65891 232918 229862 226654 222806 218023 212413 206289 199926 193548 187428 181812 176784 172323 168386 164827
65877 164827 161348 157775 154334 151444 149210 147250 145054 142424 139625 137178 135454 134326 133335 132295
65863 132295 131567 131524 131941 132193 131969 131413 130616 129422 127895 126653 126446 127444 129061 130513 131511 132381 133462
65846 133462 134496 134916 134773 134930 136033 137654 138892 139543 140149 141091 142290 143703 145483 147522 149458 151329
65830 151329 153693 156896 160617 164409 168257 172385 176867 181696 186886 192291 197596 202669 207602 212241
65816 212241 216089 218875 220788 221940 222034 220918 219047 216930 214446 211110 206803 201832 196501 191079 186064
65801 186064 182013 179043 176663 174106 170808 166847 163060 160381 158843 157592 156099 154914 154821 155703 156849
65786 156849 158059 159744 162077 164734 167536 170777 174759 179452 184695 190338 196084 201522 206469 211045
65772 211045 215340 219212 222348 224242 224255 222081 218194 213441 208243 202598 196836 191808 188116 185586 183788
65757 183788 182721 182711 183990 186696 191067 197221 204834 213301 222238 231650 241651 252240 263272 274455
65743 274455 285259 294994 303131 309563 314486 317950 319589 318887 315698 310324 303056 293887 282879 270679
65729 270679 258339 246628 235661 225151 214820 204596 194662 185403 177142 169883 163381 157438 151998
65716 151998 147046 142647 139022 136357 134482 132965 131554 130329 129440 128869 128513 128302 128127 127819 127243 126417
65700 126417 125534 124977 125104 125825 126495 126555 126226 126236 126881 127750 128480 129338 130750 132593 134315 135701 137194 139393
65682 139393 142403 145790 149214 152998 157851 163946 170599 177271 184593 193798 205105 217372 229578
65669 229578 242018 255553 270255 285416 300559 315571 329859 342180 351716 358958 365183 371238
65657 371238 376986 381773 385174 387294 388489 388933 388695 388272 388714 390777 393997 397044 399012 399949 399989 398523
65641 398523 394665 388281 380032 370481 359556 346980 332876 317809 302428 287163 272107 257119
65629 257119 242171 227672 214309 202478 192021 182607 174201 166989 160948 155713 150923 146558 142896
65616 142896 140164 138242 136715 135219 133709 132341 131184 130175 129286 128501 127613 126352 124837 123590 122909
65601 122909 122498 121966 121417 121230 121541 122314 123647 125444 127000 127589 127517 127893 129242 131063 132957 135417 138920
65584 138920 142949 146724 150533 155478 161997 169463 177313 185820 195469 206150 217447 229378 242370
65571 242370 256515 271116 285005 297206 307339 315507 321949 326794 330022 331395 330367 326370 319404
65558 319404 310175 299466 287616 274837 261694 248821 236344 224149 212633 202620 194368 187173
65546 187173 180209 173412 167355 162571 159197 157043 155699 154727 153958 153488 153371 153536 154077 155294 157228 159329
65530 159329 160820 161292 160853 159876 158736 157582 156173 154100 151345 148476 146043 143923 141496 138455 135307
65515 135307 132998 132109 132340 132758 132580 131723 130627 129730 129306 129546 130379 131273 131686 131780 132210 133110 133827 133938
65497 133938 133952 134575 135698 136689 137428 138430 140104 142406 145173 148323 151688 155072 158492 161993 165295
65482 165295 168046 170378 172696 174825 175996 175864 175036 174271 173628 172777 171689 170460 168668 165578 161080
65467 161080 156028 151487 147897 145027 142487 140109 137959 136128 134539 132995 131466 130217 129449 128892 128026
65452 128026 126782 125743 125475 125868 126354 126569 126578 126585 126773 127403 128715 130560 132380 133781 134964 136443 138449
65435 138449 140836 143469 146441 149800 153197 155917 157363 157564 157204 156978 156872 156239 154664 152530 150528
65420 150528 148815 147013 144919 142859 141302 140421 140092 140016 139771 139047 138000 137198 137049 137409 137834 138072 138238
65403 138238 138675 139770 141744 144543 147953 151780 155745 159330 162116 164326 166689 169589 172604 174998
65389 174998 176344 176574 175806 174387 172794 171212 169454 167516 165829 164654 163655 162496 161529 161307 161682 161991
65373 161991 162042 162214 162586 162706 162487 162729 164307 167110 170206 172916 175473 178704 183229 188954 195221 201462
65357 201462 207670 214223 221415 229345 238109 247702 257676 267186 275426 281879 286236 288437 288828 287953 286077
65342 286077 283121 279033 273973 268124 261705 255181 249022 243073 236623 229359 221937 215318 209810 204996
65328 204996 200324 195462 190390 185544 181677 179107 177168 174796 171714 168677 166471 164986 163476 161501
65314 161501 159356 157568 156254 155135 154055 153169 152570 152047 151463 151089 151161 151288 150880 150167 150215 151703 154174
65297 154174 156786 159368 162327 165857 169706 173532 177049 179905 181766 182536 182328 181391 180265 179727 180200
65282 180200 181286 182136 182238 181632 180561 179230 177780 176216 174462 172661 171200 170187 169186 167800 166207
65267 166207 164747 163346 161846 160514 159573 158550 156906 155124 154232 154263 154190 153560 153154 153562 154058 153610 152339
65250 152339 151188 150577 150085 149221 147870 146161 144383 142882 141650 140318 138911 138195 138674 139642 140031 139968
65234 139968 140606 142411 144450 145594 145705 145301 144656 143769 142795 142004 141436 140915 140301 139498 138342 136755 134961
65217 134961 133358 132167 131358 130913 131043 132034 133829 135847 137394 138321 139095 140061 140918 141129 140662 139953 139307
65200 139307 138711 138102 137362 136170 134460 133011 132911 134185 135587 136147 136388 137498 139756 142407 144839 147128
65184 147128 149419 151432 152853 153796 154604 155483 156545 157995 159920 161966 163449 163936 163646 163260 163328 163893
65168 163893 164720 165780 167355 169637 172427 175342 178206 181046 183831 186512 189308 192708 197020 202007
65154 202007 207166 212367 218110 225039 233247 242207 251477 261355 272683 286123 301837 319752 339675
65141 339675 360993 382644 403744 424072 443682 462295 479454 495184 509959 523943 536606
65130 536606 547267 555678 561883 565745 566935 565252 560729 553517 543857 532127 518605 503153 485364
65117 485364 465227 443532 421458 399805 378746 358247 338471 319674 301951 285348 270113
65106 270113 256543 244524 233529 223200 213750 205612 198853 193138 188199 184069 180843 178378 176331
65093 176331 174363 172299 170188 168239 166585 165105 163575 162034 160834 160248 160175 160423 161122 162526 164365
65078 164365 165736 165976 165509 165461 166435 168042 169730 171603 173971 176364 177644 177181 175511 173687 172349 171620
65062 171620 171520 172096 173268 174794 176340 177512 178040 178127 178368 179045 179688 179615 178767 177719 176969 176517 176078 175359
65044 175359 174183 172638 171132 169964 168789 166828 163727 160005 156573 153989 152274 151177 150417 149750 148956
65029 148956 147853 146393 144815 143548 142794 142250 141476 140484 139739 139577 139865 140271 140592 140784 140906 141168 141871
65012 141871 143118 144701 146287 147606 148526 149185 150079 151777 154374 157362 160083 162175 163578 164392 164839
64997 164839 165181 165525 165839 166213 166929 168172 169820 171590 173269 174774 176224 178012 180556 183810 187154
64982 187154 189873 191641 192509 192658 192280 191553 190576 189434 188323 187400 186475 185059 182818 179814 176313 172650
64966 172650 169322 166788 165008 163484 161919 160505 159378 158230 156801 155383 154382 153652 152730 151544 150428
64951 150428 149561 148862 148368 148218 148235 147992 147409 146877 146644 146447 145967 145330 144990 145281 146297 147922 149745 151139
64933 151139 151745 151860 152043 152316 152032 150726 148951 147941 148389 149752 150880 151184 150962 150767 150815 151034 151381
64916 151381 151906 152631 153459 154160 154550 154929 156221 159210 163550 167968 171594 174652 177685 180757 183876 187601
64900 187601 192531 198461 204699 210954 217233 223050 227602 230834 233584 236427 239038 240981 242534 244262
64886 244262 246202 247890 248876 248818 247342 244322 240297 236209 232638 229429 226087 222467 219046 216531 215078
64871 215078 213994 212405 210222 208168 206868 206256 205955 205758 205432 204428 202223 198852 194824 190629 186645
64856 186645 183347 181129 179788 178495 176506 173783 170856 168203 165975 164264 163321 163280 163751 164034 163897 163835
64840 163835 164243 164576 163869 162071 160306 159571 159631 159584 159186 159099 159912 161366 162639 163168 163050 162877 163313 164754
64822 164754 167262 170679 174707 178961 183133 187261 191735 196956 202976 209541 216362 223390 230891 239256
64808 239256 248525 258068 266952 274650 281119 286097 288734 288255 284856 279618 273613 267291 260646 253675
64794 253675 246573 239669 233243 227381 222022 217119 212696 208747 205296 202569 200867 200130 199879 199728 199698
64779 199698 199853 199960 199893 200184 201817 205458 211080 218167 226006 233962 241830 249850 258083 265923 272648
64764 272648 278344 283805 289481 294948 299495 302820 305060 306533 307665 308781 309736 310026 309484 308574 307755
64749 307755 306775 304892 301694 297424 292580 287378 281652 275222 268323 261573 255353 249392 243269 237219
64735 237219 232015 227977 224616 221414 218432 215843 213445 211094 209196 208155 207591 206764 205647 204965 205227
64720 205227 206349 208246 211047 214528 217930 220727 223157 225653 228147 230301 232055 233428 233982 233005 230310
64705 230310 226526 222568 219052 216116 213504 210693 207189 202944 198538 194869 192555 191457 190804 189942 188959
64690 188959 188410 188400 188363 187928 187674 188625 191186 194862 198936 203081 207418 212315 218144 224918 232181 239508
64674 239508 247110 255664 265554 276456 287524 297602 305440 310289 312425 312653 311212 307665 302019 295328
64660 295328 288726 282314 275529 268326 261386 255284 250030 245534 242048 239883 238913 238555 238227 237807 237779 238881
64644 238881 241467 245238 249651 254615 260696 268725 279184 291777 305445 318997 331910 344283 355928
64631 355928 365906 373338 378347 381622 383190 382275 378349 371726 362930 352149 339744 326761 314296
64618 314296 302505 290800 279060 268181 259243 252427 246941 241850 236754 231843 227586 224432 222540
64605 222540 221567 220837 219993 219484 220124 222135 224886 227698 230553 233709 236939 239669 241876 244316 247689
64590 247689 251861 256102 259912 263392 266946 270797 274785 278513 281620 283947 285565 286744 287846 288967
64576 288967 289657 289298 287924 286329 285041 283534 280910 277105 272801 268303 263200 257266 251005 245032 239397
64561 239397 233863 228435 223274 218442 214070 210470 207722 205423 203178 201116 199563 198414 197225 195853
64547 195853 194630 193912 193752 193971 194325 194601 194748 194943 195478 196540 198043 199467 199932 198851 196680 194694
64531 194694 193738 193455 192968 192036 191164 190868 191229 192027 192912 193511 193755 194053 194870 196145 197374 198216 198814 199654
64513 199654 201339 204296 208359 212772 216912 220882 225127 229695 234411 239591 245999 254008 263318 273536
64499 273536 284449 295572 305958 314775 321684 326397 328366 327314 323758 318553 312136 304659 296654
64486 296654 289026 282320 276447 271210 266653 262701 258849 254636 250294 246484 243380 240423 237160 233957
64472 233957 231492 229755 227986 225626 222922 220536 218983 218576 219487 221483 223834 225837 227342 228568 229638
64457 229638 230501 231040 230967 229952 228248 226947 227067 228449 229998 230947 231460 232105 233231 234939 237177 239768
64441 239768 242695 246365 251188 256872 262619 268062 273613 279902 287468 297050 309433 324640 341810
64428 341810 360301 380532 403435 429612 459570 494355 535313 583252 638301 700396 769462
64417 769462 845020 925847 1009953 1094792 1177846 1257388 1332581 1402576 1465763 1520088 1563789
64406 1563789 1595474 1613999 1618997 1611415 1592810 1563978 1524664 1474642 1414648 1346312 1271757 1193367
64394 1193367 1113358 1033218 953880 876596 803304 735849 675106 620992 573035 530677 493372
64383 493372 460726 432480 408165 386982 368279 351986 338344 327302 318365 310910 304418 298511
64371 298511 292981 287690 282349 276548 270336 264535 260018 256624 253207 248925 244159 240009 237156 235505
64357 235505 234677 234446 234776 235812 237914 241416 246261 252092 258687 266011 273693 280869 286795 291351 294601
64342 294601 296246 295983 294219 291749 288791 285086 281035 277869 276168 274927 272883 270325 268743 268870 269994
64327 269994 271233 272598 274446 276629 278670 280271 281151 280821 279099 276639 274382 272579 270773 268661 266518
64312 266518 264715 263214 261591 259307 255983 251703 247096 242802 238806 234598 230025 225662 222163 219531
64298 219531 217242 214891 212567 210766 210091 210802 212465 214214 215609 217092 219381 222522 225883 229066 232447
64283 232447 236672 241840 247433 253004 258684 264934 271929 279428 287205 295323 303711 311678 318246 323084
64269 323084 326726 329671 331609 331874 330483 328247 325891 323518 321076 318961 317794 317744 318356 318969 319037 318012
64253 318012 315283 310526 304123 296976 289809 282723 275551 268423 261735 255614 249817 244293 239539 236142
64239 236142 234113 232912 232012 231224 230612 230370 230705 231588 232637 233466 234087 234743 235437 235935 236176 236339 236501 236530
64221 236530 236305 235707 234451 232383 229987 228134 227123 226393 225356 224107 223084 222427 222002 221709 221422 221003
64205 221003 220699 221151 222560 224141 224958 225105 225519 226778 228667 230915 233721 237400 242028 247734 254954
64190 254954 264069 274957 287101 300005 313318 326591 339125 350153 359241 366446 371850 374834
64178 374834 374199 369322 361065 351192 340982 330741 320460 310363 300683 291358 282250 273495 265464
64165 265464 258512 252772 247990 243618 239331 235437 232491 230493 228866 227284 226146 226007 226868 228248 229742
64150 229742 231286 233051 235222 237804 240568 243278 245912 248401 250260 250918 250553 250138 250395 251023 251208 250587
64134 250587 249406 248031 246699 245613 244919 244660 244933 245951 247694 249658 251306 252686 254396 257003 260723
64119 260723 265536 271264 277548 284113 291115 298950 307682 316917 326365 336193 346521 356717 365527 372043
64105 372043 376404 379490 382125 384702 387424 390523 394117 398096 402365 407042 412155 417283 421821 425580
64091 425580 428801 431522 433209 433156 431071 427271 422516 417675 413184 408597 402895 395449 386558 376978 367253
64076 367253 357741 348965 341487 335465 330579 326431 322820 319646 316788 314125 311639 309428 307589 306003
64062 306003 304253 301961 299271 296875 295431 295118 295802 297445 300142 303838 308197 312733 317050 321127 325395
64047 325395 330389 336235 342734 349979 358582 368971 380709 392756 404280 414982 424761 433437 440757
64034 440757 446465 450365 452521 453392 453552 453231 452246 450425 447994 445538 443620 442428 441734 441194 440586 439671
64018 439671 437944 434847 430244 424468 417879 410725 403457 396771 391050 386072 381497 377306 373520 369861
64004 369861 366107 362516 359452 356789 354178 351757 350134 349670 350206 351478 353314 355416 357467 359640 362626
63989 362626 366888 372143 377782 383547 389566 395942 402610 409582 417044 425131 433781 442958 452922 463989
63975 463989 475889 487659 498569 509125 520701 534086 548829 564268 580728 599203 620101
63964 620101 642870 666838 691984 718852 748076 780083 815046 853056 894563 940617 992476
63953 992476 1051068 1117186 1192211 1278348 1378024 1493208 1625301 1775447 1944820 2134666
63943 2134666 2345963 2578918 2832923 3107080 3400310 3710484 4033660 4364821 4699286
63934 4699286 5032690 5359503 5672332 5963254 6225519 6453724 6642951 6788620 6887271 6937092
63924 6937092 6937569 6888947 6792219 6649544 6464546 6242189 5988297 5709051 5410723 5099532
63914 5099532 4781406 4461778 4145629 3837593 3541706 3261012 2997647 2753342 2529464
63905 2529464 2326446 2143498 1979252 1832547 1702391 1587410 1485826 1396005 1316706 1246717
63895 1246717 1184624 1129142 1079401 1034627 993706 955453 919307 885457 854192 825444 799044
63884 799044 775051 753519 734139 716497 700618 686925 675755 667208 661394 658440 658251 660641 665703
63871 665703 673629 684170 696726 711019 727138 744845 763560 783375 805356 830172 856887 883734
63859 883734 909738 934883 958992 981330 1001313 1018891 1034040 1046439 1055857 1062394 1066107 1066680
63847 1066680 1063611 1056484 1045044 1029348 1009992 987900 963736 937625 909483 879465 848043 815757
63835 815757 782851 749194 714777 680392 647455 616881 588426 561446 535979 512578 491376
63824 491376 471915 453793 436952 421360 406882 393503 381276 370092 359808 350479 342119 334452
63812 334452 327339 321213 316523 312924 309575 306042 302378 298556 294636 291262 289088 287644 285637 282483
63798 282483 278836 275488 272600 270128 268096 266136 263567 260330 257146 254397 251617 248441 245292 242657
63784 242657 240379 238156 236093 234216 232109 229608 227340 225952 225268 224711 224107 223583 223184 223042 223395 223904
63768 223904 223602 222134 220510 219924 220354 221066 221883 223020 224074 224249 223488 222488 221641 220819 220179 220257 221053
63751 221053 221792 221896 221719 221997 222951 224154 225018 225340 225533 226347 228156 230571 232911 234883 236594 238147
63735 238147 239594 241102 242837 244849 247238 250124 253223 255920 258170 260839 264562 268714 272185 274845
63721 274845 277483 280560 283828 287005 289952 292206 293251 293385 293542 294041 294175 293236 291274 288623 285432
63706 285432 282108 279593 278567 278620 278719 278401 278125 278515 279549 280636 281414 282316 284151 287089 290344 293024
63690 293024 295009 296758 298569 300421 302254 303919 305078 305595 305846 306130 306013 304903 303108 301675 301236
63675 301236 301636 302570 303807 304833 305178 305332 306531 309154 311939 313232 312591 310855 309113 308000 307484 306840
63659 306840 305089 301914 298078 294645 291962 289553 286829 283648 280364 277503 275310 273514 271682 269794
63645 269794 268288 267578 267783 268856 270613 272629 274422 275864 277141 278387 279717 281499 284109 287358 290671
63630 290671 293864 297229 300809 304235 307565 311772 318008 326591 336878 347789 358429 368620 379044
63617 379044 390539 403250 416858 431563 448108 466710 486717 507609 529655 553184 577853
63606 577853 603085 628565 653718 677237 697771 714717 727834 736600 740692 740824 738326 733982 727869
63593 727869 720147 711318 701673 691084 679451 666923 653587 639292 623899 607478 590287 572729
63581 572729 555273 538157 521327 504888 489476 475899 464488 455072 447485 441762 437911 435714
63569 435714 434736 434430 434426 434863 436223 438684 441910 445666 450210 455810 462272 469428 477691 487559 498855
63554 498855 511046 524134 538645 554950 573254 594139 618292 645547 674855 705329 736665
63543 736665 768166 797968 823716 843776 857587 865304 867576 865430 859853 851439 840710 828640
63531 828640 816537 805195 794278 782580 768913 752852 734766 715205 694337 671967 648019
63520 648019 622877 597287 572064 547854 525052 503830 484259 466333 449889 434749 421042
63509 421042 409139 399001 389785 380482 370968 362107 354782 349151 344886 341724 339441 337550 335451 333001
63495 333001 330705 329199 328580 328374 328135 327877 327785 327682 327128 326112 325336 325546 326738 328241 329472 330463 331700
63478 331700 333640 336289 339130 341553 343405 344875 345777 345374 343332 340501 338121 336398 334454 331690 328563
63463 328563 325830 323640 321778 320276 319271 318540 317769 317185 317463 318993 321593 324964 328987 333479 338046
63448 338046 342485 347072 352176 357758 363592 369836 377005 385315 394479 404340 415411 428422 443495
63435 443495 460115 477904 497056 517933 540411 563651 586272 606739 623978 637917 649322
63424 649322 659088 667928 676809 687190 700279 716194 734273 754145 776019 799843 824649 849072
63412 849072 872222 893662 912596 927524 937014 940785 939900 935886 929740 921723 911870 900446 887896
63399 887896 874582 860608 845718 829303 810703 789748 766972 743122 718512 693058 666990
63388 666990 641300 617234 595326 575108 555887 537705 521313 507271 495440 485535 477803 472741
63376 472741 470238 469465 469620 470463 472120 474810 478927 484916 492748 501801 511608 522515 535322 550452
63362 550452 567782 587041 607935 630028 653035 677372 703959 733082 763564 793330 820782
63351 820782 845434 867261 885803 900200 909940 915131 916001 912658 905712 896669 887039 877157 866363
63338 866363 854222 840867 826199 809649 791105 771329 750929 729565 706850 683560 661156
63327 661156 640400 621168 603503 588041 575352 565520 558463 553987 551291 549003 546022 541901 536184
63314 536184 527918 516416 502264 487045 472032 457555 443620 430649 419226 409335 400344 391832
63302 391832 384124 377798 372974 369397 366894 365191 363421 360568 356622 352698 349655 347155 344481 341706
63288 341706 339451 337875 336623 335512 334568 333513 331932 329970 328218 326854 325473 323824 322176 320792
63274 320792 319651 318839 318647 318985 319258 319173 319254 320126 321629 323080 324200 325335 326908 329102 332027 335823
63258 335823 340410 345419 350542 355836 361503 367413 373022 377928 382441 387391 393382 400438 408414 417396
63244 417396 427502 438553 450261 462594 475717 489875 505695 524306 546532 571987 599410
63233 599410 627855 657147 687283 718109 749717 782510 816467 850726 884261 916733 948431
63222 948431 979684 1010671 1041604 1072735 1104118 1135501 1166432 1196440 1225171 1252314 1277278
63211 1277278 1299003 1316248 1327987 1333330 1331315 1321276 1303420 1278690 1248122 1212743 1173991 1133476
63199 1133476 1092128 1050123 1007913 966851 928458 893599 862669 836033 813744 795190 779659
63188 779659 767067 757671 751281 747324 745637 746592 750357 756458 764260 773496 784026 795282 806332
63175 806332 816616 826499 836918 848414 860541 872243 882654 891460 898737 904714 909545 912903 913811
63162 913811 911233 904884 895208 882633 867289 849444 829625 808135 785029 760828 736780 713970
63150 713970 692501 671883 651868 632579 614233 597225 582171 569408 558602 549252 541323 534925
63138 534925 529704 525126 521264 518657 517379 516761 516159 515597 515576 516653 519263 523559 529228 535651 542408
63123 542408 549425 556659 563868 570740 577066 582760 587954 593009 598119 602834 606250 607854 608034 607718 607591
63108 607591 607708 607699 607297 606661 606177 605946 605642 604960 603936 602684 601102 599165 597223 595593 594099 592522 591372
63091 591372 591554 593175 595305 597125 598791 600910 603626 606653 609845 613303 617165 621698 627367 634340
63077 634340 642063 649792 657560 666140 675967 686578 697298 708112 719525 731924 745530 760849
63065 760849 778554 798712 820529 843224 867011 892965 922092 954849 991485 1032311 1077409
63054 1077409 1126424 1178970 1235116 1295221 1359340 1427025 1497622 1570542 1645274 1721371 1798476
63043 1798476 1876172 1953792 2030659 2106595 2182001 2257223 2332011 2405798 2478397 2550018 2620439
63032 2620439 2688391 2752030 2809893 2861029 2904148 2937024 2957056 2962340 2952082 2926218 2885110
63021 2885110 2829652 2761363 2682211 2594463 2500599 2403005 2303644 2204263 2106958 2014147 1927729
63010 1927729 1848539 1776858 1713126 1657854 1611087 1572384 1541269 1517362 1500175 1489181 1484099
62999 1484099 1484744 1490457 1499979 1512057 1526008 1541628 1558745 1576994 1595819 1614519 1632423 1649194
62987 1649194 1664864 1679404 1692317 1702852 1710595 1715567 1717583 1715722 1708734 1695945 1677476 1653581
62975 1653581 1624189 1589396 1550090 1507658 1463181 1417279 1370652 1324201 1278488 1233546 1189534
62964 1189534 1147286 1107858 1071744 1038726 1008220 979479 951731 924613 898463 873852 850833
62953 850833 828905 807667 787143 767408 748228 729313 710812 693340 677425 662984 649442
62942 649442 636420 624117 612851 602347 591968 581652 572139 563924 556492 549088 541936 536041 531883
62929 531883 528916 526470 524486 523075 521872 520354 518527 516816 515384 514059 512926 512418 512533 512403 511111
62914 511111 508738 506055 503294 499867 495519 491077 487493 484597 481450 477687 473806 470282 467161 464543
62900 464543 462609 460965 458778 455912 453211 451241 449524 447634 446296 446540 448189 450073 451433 452253 452466
62885 452466 451866 450860 450410 450926 451851 452561 453099 453795 454709 455724 456712 457403 457449 456815 455771 454389 452507
62868 452507 450337 448590 447735 447506 447378 447106 446526 445292 443320 441265 440120 440354 441635 443282 444771 445946
62852 445946 446981 448127 449382 450508 451373 452145 453052 454100 455064 455665 455753 455420 454880 454122 452901 451292 450007
62835 450007 449643 449835 449710 449138 448855 449263 449869 450202 450603 451649 453358 455421 457734 460168 462263 463794
62819 463794 465341 467709 470970 474690 478936 484365 491259 498996 506646 513782 520624 527673 535220 543058
62805 543058 550713 558148 565995 574800 584304 594012 604304 616339 630711 646728 663262 679988 697592
62792 697592 717143 739511 765234 794645 828040 865724 907844 954418 1005771 1062841 1126674
62781 1126674 1197655 1275640 1360798 1453730 1554512 1662070 1774794 1891422 2010962 2132022
62771 2132022 2252557 2370064 2481719 2584477 2675448 2752124 2812188 2853502 2874789 2876157 2858489
62760 2858489 2822473 2768718 2698740 2615147 2520723 2417838 2308874 2196472 2082841 1969296
62750 1969296 1856975 1747603 1642909 1543593 1449621 1361468 1280208 1206212 1138477 1075718 1017565
62739 1017565 964290 915829 871774 832096 797159 766867 740317 716474 694835 675312 657831
62728 657831 642347 628953 617559 607601 598428 589997 582843 577235 572730 568771 565494 563548 563258 564402
62714 564402 566829 570816 576616 584102 593262 604681 618992 636047 655200 676301 699797 725847
62702 725847 754073 784477 817943 855313 896391 940335 986758 1035937 1088104 1142961 1199707
62691 1199707 1257070 1313355 1366894 1416524 1461430 1500666 1533173 1558103 1574724 1582026 1578846 1564574
62679 1564574 1539606 1505245 1463398 1416202 1365450 1312221 1257162 1201092 1145027 1089780 1035852
62668 1035852 983728 933972 887015 843101 802390 764895 730468 699148 671347 647209 625925
62657 625925 606236 587636 570600 555564 542240 530082 518850 508426 498523 488994 480175 472535
62645 472535 466118 460539 455453 450869 447035 444094 441827 439846 438171 437357 437690 438446 438510 437735 437072 437248
62629 437248 437874 438125 437769 437116 436356 435418 434334 433380 432947 433444 435152 437954 441329 444782 448235 452007
62613 452007 456537 462136 468779 476188 484311 493590 504400 516410 529030 542426 557507 574887 594557
62600 594557 616672 641880 670485 702028 736194 773611 815274 861573 912278 966873 1024358
62589 1024358 1083187 1141999 1200109 1256732 1310100 1357954 1398661 1431344 1455224 1469464 1473558
62578 1473558 1467390 1451150 1425651 1392453 1353111 1308534 1259581 1207875 1155265 1102650 1050104
62567 1050104 998070 947630 899593 854079 811192 771448 735279 702627 673226 646892 623363
62556 623363 602289 583577 567401 553669 541779 530994 520834 511129 502046 494090 487683 482684
62544 482684 478583 475119 472319 469981 467662 465272 463228 461879 461092 460489 459740 458575 456944 455359 454690
62529 454690 455463 457573 460700 464671 469369 474711 480852 488089 496461 505793 516227 528456 543375 561778
62515 561778 584161 610300 639023 669031 700025 732469 766222 800221 833741 867117 900609
62504 900609 933227 963360 990166 1013658 1033725 1049765 1061193 1067864 1070128 1068999 1066139 1063253
62492 1063253 1061440 1061326 1063460 1068182 1075508 1085811 1100397 1120646 1146611 1177155 1211413 1249221
62480 1249221 1289781 1330755 1369315 1403690 1433145 1456921 1473958 1483550 1485528 1479556 1464690 1439938
62468 1439938 1405103 1361082 1309591 1252713 1192415 1130243 1067556 1006016 947536 893437 843851
62457 843851 798221 756282 718266 684271 653922 626876 603344 583839 568507 556933 548499 542713
62445 542713 539236 537730 537743 538680 540056 541884 544709 549022 554581 560419 565528 569503 572570 575060 576838
62430 576838 577179 575289 571036 565068 558172 550660 542483 533716 524699 515822 507359 499429 491831 484083
62416 484083 475908 467697 460226 453919 448554 443636 438738 433550 427971 422360 417431 413724 411236 409649
62402 409649 408747 408488 408761 409238 409549 409641 409926 410920 412667 414676 416515 418204 419873 421375 422663 424270
62386 424270 426899 430509 434348 437926 441473 445352 449532 453927 458757 464194 469991 475876 482079 488994
62372 488994 496408 503528 509898 516018 522928 531368 541482 553207 566750 582576 601077 622366 646426
62359 646426 673337 703305 736617 773539 813961 856976 901078 945137 988906 1032153 1073432
62348 1073432 1110394 1141404 1166423 1186115 1200616 1209476 1212418 1209678 1201746 1189142 1172421 1152178
62336 1152178 1129057 1103827 1077269 1049890 1021916 993698 965930 939264 913917 889892 867368
62325 867368 846548 827207 808654 790159 771276 751813 731725 711114 690190 669222 648609
62314 648609 628928 610733 594220 579120 564987 551609 539203 528194 518768 510646 503363 496723
62302 496723 490900 486143 482526 479978 478364 477520 477378 478073 479733 482171 484966 487902 491074 494518 497980
62287 497980 501216 504265 507306 510436 513753 517360 521070 524325 526719 528489 530200 532068 533876 535487
62273 535487 537046 538692 540467 542769 546488 552303 559912 568367 577268 587362 599834 615300 633689
62260 633689 654861 678881 705837 735895 769586 807521 849514 894395 940953 988629 1036885
62249 1036885 1084301 1128884 1169076 1203907 1232404 1253658 1267553 1274754 1275725 1270272 1258270 1240314
62237 1240314 1217334 1189934 1158466 1123485 1085816 1046364 1006105 966067 927159 890061 855277
62226 855277 822983 792808 764152 736873 711360 687848 666124 646087 628086 612338 598288
62215 598288 584938 571698 558735 546704 536299 527769 520676 514378 508846 504624 501813 499654 497490
62202 497490 495717 495311 496657 499262 502382 505484 508263 510684 512968 515325 517842 520783 524636 529460
62188 529460 534520 539073 543324 548154 554027 560621 567406 574092 580543 586657 592435 597857 602774 607187
62174 607187 611538 616464 622426 629896 639600 652087 667194 684532 704436 727886 755406 786491
62162 786491 820132 855319 890876 925343 957421 986273 1011224 1031481 1046445 1056112 1060935 1061362
62150 1061362 1057648 1049987 1038617 1023757 1005488 983842 959185 932582 905576 879458 854854 832098
62138 832098 811624 793698 778049 764234 752248 742376 734557 728299 723167 718891 715120 711597 708674
62125 708674 707073 706931 707523 708225 709407 712055 716647 722725 729502 736695 744626 753578 763158 772462 780746
62110 780746 787595 792478 794768 794617 793280 792003 790900 789587 788445 788262 788771 788718 787697 786904 787524 789194
62094 789194 790762 791989 793721 796733 801178 807007 814185 822364 830814 838839 846105 852662 858881 865273
62080 865273 872101 879242 886632 894646 903743 913903 924757 936201 948516 961886 976100 990781
62068 990781 1005670 1020697 1036028 1052107 1069465 1088361 1108657 1129915 1151441 1172354 1191855
62057 1191855 1209444 1224666 1236735 1244738 1248273 1247640 1243263 1235166 1223205 1207577 1188746 1166903
62045 1166903 1141798 1113312 1082042 1049137 1015582 981810 948030 914650 882176 850883 820879
62034 820879 792501 766297 742528 720935 701163 683175 667070 652682 639636 627682 616622
62023 616622 606041 595510 585146 575614 567356 560062 553149 546452 540117 534073 528155 522764 518788
62010 518788 516597 515553 514848 514436 514658 515332 515963 516759 518654 522069 526268 530297 534030 537878 541885 545609
61994 545609 548633 550705 551616 551419 550581 549432 547561 544271 539528 533962 527942 521262 513805 505973 498256
61979 498256 490826 483832 477656 472536 468202 464239 460683 457971 456350 455507 454758 453552 451842 449993 448319
61964 448319 446826 445501 444635 444494 444828 445101 445154 445234 445426 445594 445951 447067 449049 451272 453245 455252 457711
61947 457711 460408 462956 465699 469478 474555 480340 486218 492156 498455 505287 512679 520577 528758 536908
61933 536908 544915 552901 560871 568518 575481 581577 586630 590289 592317 593025 593179 593275 592995 591470 588142
61918 588142 583360 578110 573254 569066 565472 562548 560709 560480 562212 565980 571638 578883 587284 596311
61904 596311 605405 613998 621481 627247 630938 632677 632955 632259 630881 629005 626750 624088 621008 617840 615111
61889 615111 612897 610667 608031 605327 603061 601039 598569 595358 591669 587659 583021 577229 569695 559869
61875 559869 547994 535793 525606 518432 513320 508913 504974 502078 500545 500362 501640 504364 507950 511756
61861 511756 516002 521554 528789 537182 546124 555674 566299 578140 590817 603910 617557 632447 649088
61848 649088 667101 685484 703501 720854 736951 750735 761768 770867 778907 785329 788644 788248 784916
61835 784916 779559 772476 764059 755385 747522 740781 735135 730918 728525 727810 728385 730317 733882 738630 743231
61820 743231 746468 748010 748087 746696 743427 737903 730080 720119 708220 694705 680217 665617 651534
61807 651534 638058 624922 611949 599195 586714 574423 562347 550856 540481 531468 523571 516249
61795 516249 509040 501831 494875 488508 482801 477575 472812 468863 466010 463876 461591 458657 455374 452321
61781 452321 449684 447351 445393 444088 443507 443504 444132 445644 447949 450422 452594 454797 457811 461978 466971
61766 466971 472375 478187 484721 492298 501107 511199 522400 534227 546007 557236 567924 578482
61754 578482 589065 599092 607763 614928 620953 625566 627502 625827 621125 614748 607289 598563 588866 579223
61740 579223 570202 561354 552184 543053 534726 527550 521472 516394 512142 508480 505503 503607 502721 502048 501064
61725 501064 500321 500691 502181 504155 506422 509317 512728 515827 518001 519513 520992 522629 524120 525064 525220
61710 525220 524596 523506 522394 521455 520566 519623 518779 518180 517585 516420 514267 511281 508079 505177 502555 499905
61694 499905 497270 495168 493902 492974 491446 488844 485508 482118 479073 476308 473540 470608 467629 464837
61680 464837 462269 459757 457314 455339 454288 454157 454395 454264 453332 451833 450609 450453 451340 452486 453254 453779
61664 453779 454597 455929 457549 459095 460261 460897 461150 461370 461680 461987 462563 464174 467132 470533 472984 473985
61648 473985 474112 474001 473731 473214 472634 472277 472277 472640 473174 473358 472625 470986 469133 467818 467319 467474 467961 468443
61630 468443 468647 468455 467824 466688 465115 463435 461888 460252 458128 455560 452986 450554 447971 445110 442328
61615 442328 439937 437741 435362 432732 429918 426711 422771 418130 413242 408529 404117 400026 396373 393239
61601 393239 390394 387353 383751 379620 375263 370897 366544 362274 358360 355040 352192 349424 346499 343633
61587 343633 341308 339759 338613 337103 334772 331862 328846 325771 322493 319481 317643 317052 316448 314624 311920
61572 311920 309753 308908 308910 308906 308452 307396 305731 303864 302525 302082 302216 302437 302594 302702 302654 302444 302486 303302 304939
61553 304939 306877 308582 310001 311497 313320 315251 316868 318069 319117 320147 320992 321588 322176 322829 323176
61538 323176 323027 322893 323367 324229 324841 325234 326076 327486 328620 328730 328074 327461 327258 327150 326580 325201 323080
61521 323080 320643 318254 315876 313363 310987 309299 308536 308551 309299 310825 312774 314498 315827 317177 318706
61506 318706 319931 320432 320405 320190 319827 319476 319764 321108 323028 324634 325620 326382 327396 328965 331376 334730
61490 334730 338612 342243 345007 346631 347045 346412 345246 344166 343481 343178 343268 343884 345036 346434 347619 348341
61474 348341 348824 349608 350911 352193 352680 352354 352055 352505 353570 354648 355359 355609 355378 354824 354326 354043 353637
61457 353637 352764 351673 351037 351317 352515 354251 355800 356390 355910 355218 355359 356579 358387 360391 362603 365008
61441 365008 367298 369137 370460 371492 372601 374039 375666 377053 378066 379095 380456 381846 382793 383452 384516
61426 384516 386439 389141 392301 395450 397907 399274 400083 401419 403736 406388 408446 409457 409269 407764 405263
61411 405263 402819 401497 401390 401655 401440 400488 398952 397071 395115 393329 391742 390171 388513 386856 385221
61396 385221 383425 381433 379766 379179 379830 380951 381527 381239 380622 380419 380906 381787 382578 383115 383852 385577 388620
61379 388620 392356 395704 398195 400375 403159 406937 411316 415472 418679 420714 421937 422902 423822 424505 424803
61364 424803 424952 425351 426107 426849 427017 426474 425922 426523 428851 432344 436007 439510 443201 447298 451645 456234
61348 456234 461328 466913 472581 478133 483726 489207 493878 497285 499733 501718 503351 504734 506256 507944
61334 507944 509006 508715 507459 506279 505718 505733 506391 507759 509193 509652 508956 508119 508201 509320 511003 513024 515576
61317 515576 518828 522551 526128 529058 531618 534864 539621 545687 552422 559891 568760 579142 590273 601442
61303 601442 612530 623385 633342 641793 648712 654170 657756 659015 658093 655439 651136 645063 637596 629488
61289 629488 621034 611865 601772 591277 581166 571747 562885 554557 547023 540514 535062 530705 527575
61276 527575 525605 524332 523221 522173 521631 522240 524457 528279 533084 537852 541889 545390 549084 553375 558166
61261 558166 563451 569513 576430 583886 591798 600561 610154 619353 626570 631411 634850 637870 640473 642148
61247 642148 642694 642243 640815 638373 635265 632256 629873 627822 625271 621859 618252 615488 613765 612238 610095
61232 610095 607508 605325 604169 604157 605284 607640 611272 616085 621850 628153 634499 640663 646820 653171 659654
61217 659654 666170 672807 679544 685953 691489 695944 699415 702174 704815 708008 711635 714585 716056 716770
61203 716770 718216 720906 724133 727348 730970 735742 742004 749789 759005 769328 780414 792285 804949
61190 804949 817559 828666 837535 844606 850377 854489 856289 855702 853095 848819 843368 837553 831894 826008
61176 826008 819028 810458 800407 789320 777834 766542 755470 743968 731491 718244 704769 691287
61164 691287 677886 665028 653229 642378 631962 621942 612841 604878 597628 590776 584805 580529 578148
61151 578148 577094 576788 577284 579053 582192 585974 589174 590783 590450 588424 585268 581482 577153 572003 566038
61136 566038 560090 555346 552315 550614 549864 550261 552014 554707 557787 561482 566720 574143 583629 594809
61122 594809 607619 622162 638352 655930 674683 694436 714902 735743 756802 778151 799820
61111 799820 821532 842768 863032 881969 899303 914923 929026 941862 953098 961728 966938 968874
61099 968874 968168 964863 958337 948301 935334 920197 903050 883682 862241 839433 816157 793156
61087 793156 770863 749327 728360 707886 688119 669383 651937 635977 621525 608251 595770
61076 595770 584281 574509 566746 560270 554125 548208 543155 539294 536290 533860 532294 531931 532499 533396 534546
61061 534546 536528 539737 543742 547816 551918 556736 562711 569509 576690 584555 593895 605127 618053 632342
61047 632342 647805 664239 681469 699592 718781 738860 759446 780489 802240 824609 847048
61036 847048 869232 891397 913877 936702 959824 983340 1007330 1031866 1057360 1084437 1113220
61025 1113220 1143151 1173753 1205107 1237391 1270519 1304629 1340448 1378760 1419975 1464710 1514471
61014 1514471 1571181 1636204 1710180 1793609 1887435 1993621 2115831 2259434 2430719 2636646
61004 2636646 2885571 3187344 3552106 3990062 4513611 5138882 5883718 6764277 7793276
60995 7793276 8975710 10295337 11697260 13085508 14347785 15394546 16185271 16728788
60987 16728788 17069064 17272279 17414290 17557380 17719514 17858784 17890821 17728981 17318363
60978 17318363 16645997 15733993 14630333 13400853 12117477 10843739 9626089 8494855
60970 8494855 7469051 6558408 5763370 5077142 4489730 3990620 3569019 3213761 2914174
60961 2914174 2660987 2446404 2263850 2107883 1974034 1858516 1758193 1670824 1595009 1529653
60951 1529653 1473526 1425297 1383732 1347623 1315607 1286334 1258974 1233507 1210344 1189566 1170672
60940 1170672 1153223 1137570 1124620 1114788 1107497 1101939 1098161 1097151 1099921 1106752 1117313 1131208 1148182
60927 1148182 1167987 1190340 1215055 1241935 1270313 1298842 1326027 1351013 1373617 1393531 1409731
60916 1409731 1420786 1425616 1423758 1415216 1400411 1380210 1355587 1327147 1295248 1260677 1224855 1189088
60904 1189088 1153759 1118612 1083745 1049955 1017945 987584 958292 930017 903387 878875 856227
60893 856227 834923 814810 795973 778344 761896 747003 733963 722177 710488 698517 687119
60882 687119 677168 668388 659785 650851 641819 632979 624271 615541 606715 597684 588349 578839 569509 560725
60868 560725 552802 545971 540130 534699 529067 523183 517461 512129 507007 501989 497363 493482 490291 487431
60854 487431 484741 482435 480698 479201 477246 474535 471634 469405 468028 466867 465318 463395 461288 458799
60840 458799 455583 451742 447769 443999 440429 436969 433534 429910 425865 421507 417391 414268 412794 413327
60826 413327 415804 419780 424641 429754 434563 438846 442890 447023 450928 453887 455799 457380 459064 460306
60812 460306 460491 459933 459341 458762 457807 456536 455264 453745 451532 449044 447323 446510 445454 443088 439481 435228
60796 435228 430617 425867 421532 418004 414924 411575 407688 403457 399026 394332 389381 384384 379588 375129
60782 375129 370991 367121 363614 360694 358345 356166 353864 351697 350010 348560 346932 345503 345196 346152 347419
60767 347419 348250 348985 350265 352044 353976 356281 359538 363854 368742 373616 378083 381987 385646 389788 394824
60752 394824 400315 405480 410039 414224 418206 421897 425086 427377 428217 427414 425526 423295 420790 417472 412991
60737 412991 407485 401244 394551 387848 381568 375714 369969 364271 358939 354084 349318 344284 339237 334844
60723 334844 331471 328890 326709 324930 323916 323710 323603 322682 320865 319036 317969 317471 316868 315992 315199 314634
60707 314634 314081 313584 313714 315001 317329 319990 322081 322870 322174 320638 319414 319379 320721 323201 326436 329837
60691 329837 332722 334943 337214 340428 344676 349221 353413 357305 361317 365648 370222 375023 380265 386227
60677 386227 393000 400282 407367 413525 418593 423045 427283 431035 433804 435656 436977 437439 435948 432028
60663 432028 426726 421592 417087 412545 407419 401873 396299 391019 386504 383150 380600 377955 374967 372442
60649 372442 371148 370913 371190 371871 372829 373172 371875 369047 365832 362955 360081 356726 353152 350006 347526
60634 347526 345563 344075 343177 342763 342423 341843 341123 340649 340740 341433 342579 344060 345847 347832 349732 351234
60618 351234 352201 352671 352722 352469 352077 351600 350861 349682 348251 347052 346414 346270 346381 346621 346905 347047 346844 346275
60600 346275 345496 344741 344248 344179 344444 344739 344985 345667 347406 350078 352660 354200 354754 355096 355683 356323 356773 357143
60582 357143 357487 357452 356713 355557 354628 354211 354090 354099 354534 356002 358972 363441 368821 374265 379320 384230 389459
60565 389459 395071 400794 406457 412015 417231 421771 425572 428748 431202 432722 433445 433773 433803 433312 432405 431650
60549 431650 431458 431810 432817 435005 438715 443641 449366 455955 463638 472234 481424 491327 502253 513875
60535 513875 525077 534707 542267 547900 551954 554598 555719 555159 553104 550095 546617 542833 538769 534453
60521 534453 529786 524711 519683 515614 512990 511344 509941 508624 507563 506571 505325 504090 503546 503898 504811
60506 504811 506366 509452 514861 522448 531613 542362 555476 571703 591054 612956 636894 662792
60494 662792 690773 720563 751230 781585 810742 838154 863139 884545 900895 910747 913029 907358
60482 907358 894298 875206 851594 824537 794671 762752 730045 698033 667788 639762 614166
60471 614166 591228 570906 552664 535971 520894 507772 496331 485616 474957 464584 455134 446933
60459 446933 439962 434111 429104 424482 419995 415803 412047 408465 404752 401041 397727 395026 392935 391362
60445 391362 389944 388069 385480 382641 380143 378012 376077 374664 374267 374662 375032 375011 374984 375271 375593 375621 375519
60428 375519 375653 376052 376492 376807 376908 376650 375953 374991 374160 373943 374738 376582 378892 380736 381531 381468 381253 381524
60410 381524 382462 383744 384818 385359 385517 385666 385965 386342 386786 387450 388505 390071 392240 394937 397806 400458
60394 400458 402809 405034 407312 409819 412832 416411 420060 423070 425266 427099 428969 430842 432579 434267
60380 434267 436034 437905 440004 442616 445792 449123 452139 454757 457111 459113 460509 461334 462038 463046 464336
60365 464336 465617 466855 468456 470787 473662 476552 479380 482812 487545 493488 499902 506202 512400 518866
60351 518866 526018 534202 543563 553819 564259 574012 582322 588766 593410 596568 598180 597566 594090 587999
60337 587999 580337 572138 564007 556343 549460 543391 537863 532555 527172 521313 514702 507638 500932 495294
60323 495294 490944 487749 485366 483260 480998 478698 476926 476091 476211 477248 479240 482002 485171 488824 493712
60308 493712 500574 509385 519474 530204 541429 553465 566732 581134 595594 608401 618181 624426
60296 624426 627103 626193 621870 614816 605993 596205 586068 576185 566983 558436 550230 542212 534519 527317
60282 527317 520610 514298 508276 502463 496824 491364 486083 480913 475759 470611 465623 461068 457143 453797
60268 453797 450846 448304 446400 445125 443957 442287 440006 437467 435000 432763 430971 429884 429563 429876 430692
60253 430692 431809 432805 433371 433746 434420 435407 436234 436680 437036 437493 437745 437450 436725 435986 435602 435823 436674 437735
60235 437735 438456 438943 440070 442456 445603 448347 450021 450925 451907 453709 456522 459921 463381 466989 471375
60220 471375 476760 482482 487825 493028 499002 506157 513951 521631 529082 536859 545588 555361 565574 575263
60206 575263 583707 590768 596788 602279 607680 613101 618229 622627 626209 629260 631952 634079 635315 635522
60192 635522 634730 633046 630657 627691 624020 619429 614013 608124 601947 595507 589110 583288 578182 573458
60178 573458 568985 565067 561720 558286 554239 549947 546151 543019 540212 537604 535403 533630 531942 529946
60164 529946 527390 524173 520511 516954 513989 511692 509937 508681 507855 507348 507380 508449 510487 512474 513479
60149 513479 513803 514487 515972 517949 520302 523352 527065 530772 533993 536988 540272 544038 548264 552953 557985
60134 557985 563097 568229 573558 579038 584272 589103 593953 599248 604745 609791 614118 618076 622163 626572
60120 626572 631204 635888 640512 645075 649641 654223 658661 662688 666169 669272 672288 675176 677388 678323
60106 678323 677951 676663 674536 671145 666386 661068 656249 652168 648256 644084 639842 635883 632224 628660
60092 628660 625068 621475 617970 614606 611286 607841 604370 601338 599098 597449 595985 594650 593520 592190
60078 592190 589986 586822 583320 579966 576665 573271 569907 566471 562365 557312 552027 547531 543978 540666
60064 540666 537085 533352 529587 525459 520661 515488 510620 506390 502559 498837 495457 493095 492271 492934 494627
60049 494627 496946 499689 502722 506022 509858 514602 520183 525943 531277 536194 541008 545682 549860 553419
60035 553419 556517 559003 560254 559911 558447 556650 554687 552051 548349 543789 538885 534013 529369 525027
60021 525027 520870 516642 512288 508041 504068 500226 496403 492835 489775 486921 483592 479520 475180 471251
60007 471251 467957 465042 462174 459226 456275 453425 450617 447654 444540 441794 440204 440198 441557 443741 446418
59992 446418 449655 453674 458361 462983 466597 469001 471112 474137 478450 483503 488552 492946 495895 496699
59978 496699 495437 492945 489906 486360 482244 477863 473521 469115 464503 459979 456090 453224 451541 450959
59964 450959 450944 450777 450371 450486 451772 453912 456041 457666 458848 459850 461029 462706 464707 466380 467540
59949 467540 468971 471437 474555 477321 479436 481328 483062 484103 484218 483760 482944 481585 479834 478516 478340
59934 478340 479218 480709 482678 485192 488065 490926 493633 496447 499898 504531 510554 517661 525394 533734
59920 533734 543140 553976 566101 578963 591841 604003 614960 624639 633136 640348 646047 650099 652316
59907 652316 652331 650086 646268 641688 636410 630172 623486 617395 612019 606391 600148 594456 590551 588170 586251
59892 586251 584640 584068 584753 586077 587693 589995 593178 596605 599566 602249 605484 609781 614976 620632 626458
59877 626458 632351 638288 644164 649667 654342 657836 660004 660760 660026 657958 655074 651929 648742 645494 642265
59862 642265 639148 635874 631927 627228 622401 618096 614237 610226 605805 601385 597614 594929 593460 593016
59848 593016 593104 593366 594090 595970 599200 603105 606793 609833 612128 613535 613970 613646 612921 612070 611447 611537 612528
59831 612528 613980 615191 615685 615159 613327 610253 606602 603132 600097 597496 595581 594541 593904 592889 591409
59816 591409 590193 589879 590459 591659 593307 595043 596043 595401 592772 588620 583932 579642 576157 573416 571334
59801 571334 569853 568486 566327 563020 559350 556334 553996 551571 548625 545301 541697 537832 534159 531267
59787 531267 528971 526467 523546 520907 519057 517724 516675 516367 517225 518796 520181 520953 521288 521582 522363 524174
59771 524174 527096 530597 534185 537966 542244 546929 551709 556576 561735 567118 572308 576906 580838 584439
59757 584439 588336 593019 598349 603716 608730 613439 617794 621450 624306 626778 629044 630474 630359 629035
59743 629035 627713 627205 627219 626961 626096 624948 623950 623099 622018 620544 619091 618266 618217 618623 619260 620212 621482
59726 621482 622800 623978 625135 626397 627628 628673 629674 630941 632616 634509 636173 637189 637596 637957 638749
59711 638749 639807 640683 641386 642299 643532 645023 647275 651231 657181 664370 671924 679602 687439 695282 703086
59696 703086 711209 719972 729274 738813 748244 756891 763874 768813 772079 774200 775580 776789 778271 779440
59682 779440 779008 776724 773879 771444 768605 764106 758252 752411 746994 741215 734650 727882 721496 715430
59668 715430 709580 704314 700141 697393 696339 697073 699249 702387 706418 711504 717414 723722 730525 738291
59654 738291 746924 755630 763806 771426 778337 783789 787021 787922 786809 783839 778847 771543 761769 749803
59640 749803 736501 722921 709712 696999 684770 673133 662290 652547 644267 637515 631863 626840
59628 626840 622381 618394 614165 608830 602405 595685 589044 581955 573927 565351 557130 549837 543508 537898
59614 537898 532617 527312 522021 517220 513382 510650 509025 508542 509030 509924 510649 511110 511650 512561 513781 514995
59598 514995 515906 516472 516979 517810 519065 520376 521177 521207 520765 520456 520625 521051 521173 520540 518937 516360 513160
59581 513160 510089 507698 505699 503330 500441 497679 495448 493322 490810 488110 485628 483251 480740 478442
59567 478442 476921 476079 475307 474380 473592 473101 472704 472259 471810 471349 470926 470915 471635 472784 473785 474671 475973 477708
59549 477708 479165 479982 480961 483467 488225 494823 502189 509505 516955 525649 536661 550147 565499 581937
59535 581937 598513 613840 626499 635804 641772 644571 644607 643005 641173 639659 638047 636113 634434 633542
59521 633542 633095 632233 630411 627550 623678 618744 612636 605279 596929 588309 580130 572494 565158 558241 552060
59506 552060 546322 540298 534033 528600 524726 521854 519133 516789 515802 516490 518110 519746 521088 522349 523870
59491 523870 525907 528590 531987 536171 541046 546011 550171 553200 555798 559013 563179 567778 572211 576401
59477 576401 580626 585028 589329 592975 595534 596973 597546 597458 596821 595848 594859 593956 592922 591641 590498 590182
59461 590182 591114 593203 596137 599796 604246 609382 614824 620374 626388 633293 640755 647847 654160 660157
59447 660157 666010 670658 672666 671726 668670 664277 658757 652281 645223 637777 630021 622424 615687 609922
59433 609922 604577 599288 594296 589833 585735 581921 578784 576836 576329 577402 580178 584557 590333 597642
59419 597642 606862 617991 630548 644222 659063 674965 691544 708621 726009 742454 755544 763263
59407 763263 765322 762752 756865 748997 740481 732124 724246 717862 715142 717572 723782 730126 733437 732591
59393 732591 727565 718221 704640 688027 670435 653534 637905 623481 610361 599037 589916 582841
59381 582841 577270 572903 569955 568744 569166 570672 572667 574837 577191 579841 582734 585621 588420 591485
59367 591485 595299 599928 605038 610462 616546 623909 632950 643516 654899 666418 678243 691418 706714
59354 706714 723826 742151 761868 783397 806095 828574 850359 872230 894684 917059 938476
59343 938476 958604 977007 992705 1005097 1014494 1021012 1023761 1022073 1016815 1009492 1000489 989314 976213
59330 976213 962329 948243 933414 917327 900408 883505 867073 851198 835938 821327 807317
59319 807317 793923 781249 769360 758317 748349 739717 732387 726039 720390 715400 711277 708430 707221
59306 707221 707583 709067 711414 714872 719770 726121 733862 743114 753824 765422 777211 788742 799403
59293 799403 807928 812900 813657 810422 803823 794715 784165 773042 761693 750358 739600 729886 721143
59280 721143 713337 707188 703586 702442 702833 704197 706636 710137 714413 719585 726113 733623 740580 745673
59266 745673 749057 751740 754149 755747 755727 753562 749108 742763 735493 728199 720861 712570 702612 691344
59252 691344 679886 669153 659450 650890 643702 637831 632618 627442 622587 618953 616892 615949 615833 616887
59238 616887 619118 621428 622563 622505 622223 622314 622561 622702 622728 622373 621018 618401 614887 610823 606135 600898 595859
59221 595859 591924 589268 587202 584868 581946 578855 576422 575246 575268 575939 576796 577760 579026 580925 583852
59206 583852 588019 593164 598727 604408 610401 617054 624464 632478 640853 649331 657702 665983 674446 683339
59192 683339 692535 701479 709541 716457 722478 728029 733237 737862 741613 744377 746118 746692 745889 743611 740098
59177 740098 736083 732541 729968 727892 725464 722543 719868 718175 717631 718260 720328 723929 728584 733596 738502
59162 738502 742861 746046 747688 748106 747827 746892 744985 742126 738803 735503 732383 729324 726123 722821 719982
59147 719982 718374 718087 718228 717760 716411 714520 712313 709631 706140 701560 695974 690109 684834 680072 674704
59132 674704 667999 660692 654160 649016 645072 642162 640211 638819 637584 636819 637318 639471 643093 647902 653653
59117 653653 659991 666739 674146 682302 690575 698251 705417 712488 719140 724557 728588 731748 734112 735179
59103 735179 734944 734166 733283 731847 729370 726015 722035 717216 711427 705310 699859 695447 691576 687504 682988
59088 682988 678496 674713 671726 668832 665359 661469 657780 654417 650907 646861 642243 637107 631611 626248
59074 626248 621520 617369 613371 609408 605621 601849 597713 593298 589131 585491 582191 578978 575594 571576
59060 571576 566623 561167 555953 551187 546753 543028 540592 539102 537400 534944 532330 530303 529070 528740
59046 528740 529435 530583 531010 530198 528804 527556 526368 525031 523957 523622 523806 524006 524230 524907 526385 528847
59030 528847 532308 536380 540459 544490 549122 554896 561734 569473 578227 587905 597917 607744 617219 625906
59016 625906 632911 637825 641219 643689 644990 644737 643357 641583 639490 636850 634179 632590 632632 633915 635868
59001 635868 638379 641622 645642 650137 654501 658220 661348 664360 667365 669845 671398 672326 673145 673912 674407
58986 674407 674616 674586 674182 673466 673068 673691 675462 678140 681648 685940 690668 695585 701188 708418 717704 728625
58970 728625 740375 752232 763745 774902 786148 797896 810072 822304 834327 845818 856035
58959 856035 864087 869624 872904 874062 872626 867924 859872 849272 837290 824637 811303 797129 782453
58946 782453 767969 754075 740729 727879 715613 703927 692845 682846 674625 668203 662741 657529
58934 657529 652755 649000 646381 644520 643033 641697 640340 638889 637367 635747 633981 632237 630752 629455
58920 629455 628147 627106 626938 627598 628205 628139 627842 628169 629402 631295 633707 636755 640639 645623 651875 659135
58904 659135 666929 675344 685104 696550 709070 721902 734983 748594 762678 777037 791737 806812
58892 806812 822031 837551 854332 873227 893871 915046 935887 956164 975645 993826 1010151
58881 1010151 1023987 1034581 1041603 1045633 1047529 1047419 1044788 1039436 1031796 1022331 1011192 998629 985328
58868 985328 972155 959710 948127 937161 926462 915911 905645 895752 886160 876819 867667 858307
58856 858307 848122 836990 825545 814460 803755 793053 782236 771566 761413 752061 743482 735139
58844 735139 726319 716861 707197 697616 687916 677977 668115 658612 649356 640243 631481 623326 615967 609789
58830 609789 605034 601093 596967 592724 589617 588347 588224 588570 589880 592707 596400 600056 603991 609032 614888
58815 614888 620462 625463 630476 635612 640233 644019 647288 650214 652612 654556 656402 658080 659037 658998 658178
58800 658178 656820 655107 653393 651822 649850 646849 643119 639570 636489 633434 630376 628063 627053 627110 627880
58785 627880 629561 632562 636890 642199 648152 654554 661304 668351 675541 682440 688296 692143 693146 691261
58771 691261 687521 683064 677725 670301 660471 649624 639345 629930 621019 612796 605620 599157 592901 587028
58757 587028 581829 576821 571492 566378 562326 559109 556001 553341 552188 552617 553666 554934 556976 560147
58743 560147 564303 569727 577040 585910 595003 603516 611755 619970 627731 634823 641721 648752 655618 662110
58729 662110 668361 674028 678143 680233 680937 681147 681252 681463 682021 682762 683283 683897 685613 688738 692268 695132
58713 695132 697345 699496 701765 703960 705872 707069 706816 704596 700347 693973 685215 674229 661694 648137
58699 648137 633775 619187 605236 591953 578343 563906 549677 537190 526967 518600 511710 506127
58687 506127 501497 497406 493684 490181 486493 482389 478308 475022 472857 471446 470116 468438 466618 465419
58673 465419 465457 466635 468539 471126 474475 478149 481696 485736 491566 499419 508039 516255 523952 530950 535988
58658 535988 537850 536955 534895 532600 529718 525619 520287 514145 507591 500967 494764 489531 485497 482293
58644 482293 479287 476375 474149 472947 472058 470459 468160 466123 464946 464424 464452 465446 467499 469830 471559
58629 471559 472551 473114 473330 473106 472574 472080 471958 472469 473751 475755 478443 481981 486389 491167 495721 500050
58613 500050 504499 509078 513652 518613 524496 530953 536941 541931 546105 549400 551439 552650 554329 557044
58599 557044 559760 561087 560752 559465 558053 557273 557799 559797 562754 566064 569516 573225 577655 583691 591935
58584 591935 601713 611512 620641 629735 639409 649278 658650 667374 675531 683014 689915 696751 703900 711378
58570 711378 719473 728931 740121 752718 766692 782983 802629 825615 850870 876973 902620 926940
58558 926940 949625 970349 988044 1001413 1010209 1015256 1017168 1016019 1012453 1008010 1003808 999746 995376
58545 995376 990570 984796 976690 965177 950470 933401 914394 893565 871230 847765 823491 799093
58533 799093 775650 753936 734160 716511 701214 688006 676449 666889 660062 655522 651654 647627
58521 647627 644175 641917 640166 638086 635887 634046 632362 630601 629129 628070 626736 624762 622859 621613
58507 621613 620355 618209 615471 612987 610827 608512 606010 603714 601958 601169 601799 603437 604732 604931 604873
58492 604873 605825 608142 611672 616543 622724 629693 637432 646951 658956 672797 687586 703504 721027
58479 721027 739586 758054 775915 792936 808253 820731 829766 835032 836045 832691 825624 815626 803484
58466 803484 790983 780711 773763 768628 763398 758155 754225 752297 752660 756267 763840 774405 786095
58453 786095 797944 809689 820371 828534 833522 835466 834351 830068 822957 813431 801661 788506 775907
58440 775907 765188 755670 746144 737006 729702 724732 721551 719887 719869 721260 723822 728026 734349 742258
58426 742258 750836 759781 768837 777059 783821 789720 795231 799257 800417 799072 796604 793352 788705 782625
58412 782625 775629 767781 759083 750325 742202 734270 726138 718915 713858 710307 706708 703096 700758 699898
58398 699898 699488 699147 699411 700370 701714 703835 707195 710827 713151 714129 715062 716485 717956 719672 722459 726159
58382 726159 729673 732674 735774 739044 741917 744571 747903 752118 756754 762054 768880 777260 786386 795966
58368 795966 806273 816953 827209 837101 847433 858450 869805 881518 893778 906155 918109 929726
58356 929726 940667 949152 953538 954397 953612 952173 950342 949052 949190 950192 951177 952814 956181 960652 965047
58341 965047 970070 977302 986521 996446 1007452 1020820 1035795 1050190 1063769 1078222 1093787 1108708
58329 1108708 1122187 1135076 1147259 1156994 1163488 1167779 1170550 1171345 1170470 1169468 1169155 1169157 1169670 1171614 1174799
58314 1174799 1178107 1181820 1187545 1195507 1204051 1212214 1220804 1230582 1241354 1253043 1265805 1279013 1291999
58301 1291999 1305551 1320681 1336413 1351099 1365387 1381208 1398289 1414613 1430044 1446454 1464369
58290 1464369 1482610 1501183 1521282 1542325 1562328 1581508 1602246 1625188 1648618 1671966 1696522
58279 1696522 1722332 1747884 1773373 1800782 1830182 1859507 1888631 1920062 1954855 1991401 2029024
58268 2029024 2069157 2112192 2156708 2202620 2251487 2303039 2355101 2407585 2462586 2519874 2576465
58257 2576465 2631453 2687067 2744141 2800984 2857651 2916783 2979184 3043178 3109282 3180610 3257492
58246 3257492 3336937 3418690 3506419 3601413 3700811 3803941 3914486 4034083 4159656 4289760
58236 4289760 4427910 4576782 4734647 4900407 5076695 5265265 5464883 5676554 5905072
58227 5905072 6152708 6417289 6699118 7003425 7333325 7687344 8066957 8479397 8929675
58218 8929675 9417353 9944881 10521473 11155239 11849774 12612567 13458371 14400452 15448126
58209 15448126 16617685 17936562 19433089 21134039 23078506 25324217 27937447 30993220
58201 30993220 34595370 38885874 44030496 50211756 57642426 66568750 77257097 90002721
58193 90002721 105156402 123102660 144178330 168593768 196322998 226812941 258559649
58186 258559649 288973486 314911617 333654860 343645856 344588518 337142232 322620755
58179 322620755 302766260 279453520 254360353 228803307 203776388 180025010 158051199
58172 158051199 138117901 120312974 104618579 90934758 79094328 68904585 60180941
58165 60180941 52742943 46406317 41001028 36388180 32449620 29074346 26166172 23652622
58157 23652622 21474208 19572850 17898742 16418460 15106380 13934984 12880723 11931009
58149 11931009 11076824 10304395 9600779 8960951 8382166 7856663 7376075 6937626 6539834
58140 6539834 6176886 5842748 5536140 5256130 4997182 4753510 4524181 4309389 4106037
58131 4106037 3911641 3728348 3558351 3399107 3247529 3105146 2974465 2853616 2739157
58122 2739157 2631173 2531270 2438203 2349670 2266064 2188654 2116237 2046970 1981362 1920326 1862486
58111 1862486 1806301 1752639 1702515 1654658 1607911 1563447 1521932 1481128 1439189 1397799 1359114
58100 1359114 1322057 1284572 1247302 1212000 1178424 1145717 1114898 1087081 1061053 1035328 1010848
58089 1010848 989014 968849 948714 929084 911078 893908 876409 859393 843956 829001 812931
58078 812931 796290 780220 763905 746113 727972 711580 697002 682938 669276 656700 644900
58067 644900 633397 623125 615058 608308 601544 595129 589861 584802 578559 571646 565426 559564 552587 544214
58053 544214 535275 526094 516676 507737 499949 492933 486308 480568 475585 469692 461912 453726 446880 440848
58039 440848 434386 428116 423302 419303 414609 409466 405149 401303 396308 389844 383088 376727 370566 364662
58025 364662 359138 353275 346339 338895 331947 325517 319449 314649 311783 309559 306134 301632 297579 294457
58011 294457 291554 288663 286233 284260 282564 281677 282013 282758 283041 283482 285051 287141 288443 289002 289682 290296
57995 290296 290139 289768 290362 291666 292440 292679 293538 295214 296593 296947 296498 295466 293983 292742 292308 292025 290865
57978 290865 289029 287347 285638 283218 280615 279130 278927 279122 279471 280434 281798 282766 283246 283590 283357 281867
57962 281867 279721 278213 277434 276457 275113 273962 272750 270619 267790 265343 263408 261209 258857 257361 256783
57947 256783 256077 254981 254425 254843 255685 256859 259068 262334 265711 268946 273060 278813 285808 293490 301743
57932 301743 310126 317794 324611 331248 337767 343205 346896 349147 350335 350434 349742 348936 348055 346454 344004
57917 344004 341272 338313 334546 330168 326478 324275 323024 322063 321653 322229 323496 324787 325540 325104 322885
57902 322885 319117 314768 310380 305682 300491 295123 289731 284112 278493 273716 270297 268011 266517 265649
57888 265649 265001 264082 263052 262503 262462 262423 262353 262621 262905 262338 260957 259875 259656 259546 258676 257033 254919 252507
57870 252507 250346 249306 249499 250133 250920 252700 256171 260794 265455 269553 273005 275942 278857 282423 286726
57855 286726 291199 295462 299598 303473 306664 309219 311688 314113 315865 316664 316886 316585 315210 312648 309630
57840 309630 306711 303753 300712 297944 295269 291784 287250 282758 279360 276844 274448 272034 269897 268104
57826 268104 266653 265743 265330 265023 264789 265075 265819 266102 265350 264181 263516 263521 263949 264750 265732 266244 265816 264604
57808 264604 262716 259744 255491 250554 245614 240745 235896 231421 227599 224303 221714 220586 221110 222200
57794 222200 222779 223313 225247 229191 234348 239478 243867 247594 251308 255594 260314 264849 269064 273377 277771
57779 277771 281545 284453 287181 290160 292725 294194 295035 296124 297447 298390 298794 298829 298168 296233 293110 289516
57763 289516 285952 282449 278930 275273 271195 266556 261684 257100 253232 250617 249830 250747 252324 253677 255023
57748 255023 257126 260221 263990 268187 272783 277775 283209 289003 294497 298754 301642 303967 306155 307602
57734 307602 307913 307912 308604 309839 310886 311762 312974 314403 315473 316141 316797 317365 317359 316663 315511 313829 311324
57717 311324 308019 304101 299474 294167 288911 284554 281113 278052 275133 272239 268764 264254 259428 255518
57703 255518 252575 249396 245292 241004 237597 235163 233014 230667 228339 226705 226215 226431 226178 224686 222413
57688 222413 220396 219133 218555 218689 219672 221363 223669 227030 231955 238378 246253 256545 270686 289111
57674 289111 311279 337242 368415 406601 452896 507542 569907 637997 708110 774981 832272
57663 832272 873754 895327 896276 878375 844285 797522 743109 686341 630425 576434 525652 480497
57651 480497 442485 410669 383180 359457 339972 324535 312098 301901 293679 286845 280512 274574
57639 274574 269950 267343 266167 265084 263317 261142 259247 257937 257083 256534 256242 255988 255366 254179 252567
57624 252567 250555 247847 244478 241292 239190 237980 236529 234044 230804 227664 225314 223924 222998 221557
57610 221557 218969 215673 212703 210590 209217 208525 208544 208722 208113 206523 204787 203594 202654 201313 199351 196787
57594 196787 193541 189793 186157 182991 179957 176749 173784 171648 170165 168615 166609 164239 161607 158746
57580 158746 155858 153130 150387 147337 144001 140538 136873 132979 129327 126383 123727 120351 115999 111666
57566 111666 108464 106478 105010 103519 101878 100033 98019 96279 95445 95675 96541 97707 99281 101233 102855
57551 102855 103352 102933 102767 103682 105293 106593 107117 107245 107579 108369 109446 110468 111235 111908 112797 113869 114703
57534 114703 115036 115147 115401 115724 115803 115592 115280 114940 114626 114629 115238 116258 117196 117865 118488 119232 120062 121025 122302
57515 122302 123887 125498 126877 127987 128973 130105 131565 133035 133748 133360 132578 132375 132768 132949 132535 131995
57499 131995 131809 131888 132015 132205 132336 131933 130682 128765 126450 123741 120724 117816 115290 112850 109998 106629
57483 106629 102994 99321 95758 92555 90025 88308 87249 86421 85306 83650 81637 79526 77265 74767
57469 74767 72400 70676 69434 67905 65710 63309 61264 59568 58021 56803 56326 56709 57684 58742 59240
57454 59240 58658 57026 54928 53013 51712 51350 52001 53157 54138 54985 56371 58376 60098 60970 61764 63501
57438 63501 65795 67214 67214 66851 67324 68433 68930 68122 66688 65860 66097 66803 67246 67322 67191 66597 65139 63069
57420 63069 61176 59809 58546 56976 55243 53634 52162 50827 49849 49357 49216 49336 49690 49956 49740 49354
57404 49354 49644 50710 51550 51446 50902 50563 49991 48454 46385 45033 44931 45631 46714 48060 49169 49263 48344
57387 48344 47453 47610 48980 51163 53681 56017 57682 58516 58646 58099 56861 55322 54184 53807 53945 54146
57371 54146 54060 53382 52018 50324 48829 47627 46489 45479 44920 44701 44272 43501 43002 43281 44079 44881 45696
57354 45696 46869 48450 50148 51725 53087 54174 55123 56390 58278 60380 61858 62354 62271 62023 61336 59662
57338 59662 57160 54855 53681 53647 54162 54889 55897 57051 57757 57471 56171 54251 52220 50610 49742 49388
57322 49388 48976 48339 47898 47903 47949 47630 47270 47525 48486 49600 50280 50232 49457 48384 47801 48205 49328 50660 52152
57303 52152 54020 56150 58224 60137 61773 62716 62827 62782 63256 63839 63663 62962 62928 63992 65259 65948 66404
57286 66404 67265 68508 69825 71169 72344 72799 72466 72224 72891 74212 75489 76678 78127 79687 80973 82277
57270 82277 84262 86757 88687 89356 89125 88649 88197 88106 89203 92025 95798 98863 100253 100501 100812 101838
57254 101838 103469 105467 107762 110170 112266 113796 114937 116032 117319 119072 121613 124912 128506 132221
57240 132221 136611 142147 148208 153540 157622 161004 164430 168298 172974 178783 185416 192013 198165 204308
57226 204308 210910 217869 224994 232373 239882 246992 253633 260649 268773 277662 286635 295930 306330 317726
57212 317726 328911 338946 348149 357667 368527 381151 395300 410290 425507 440787 456196 471697
57200 471697 487390 503856 521693 540689 559952 578984 598205 618346 639655 661955 685183
57189 685183 709583 735373 762371 790100 818376 847748 879040 912417 947213 982874 1019662
57178 1019662 1058060 1097892 1138514 1179615 1221203 1262934 1304164 1344740 1385124 1425583 1465783
57167 1465783 1505473 1545173 1585846 1628133 1672125 1717605 1764273 1811877 1860366 1909809 1960077
57156 1960077 2010830 2061925 2113589 2165928 2218442 2270410 2321794 2373436 2426096 2479489 2532660
57145 2532660 2585487 2639396 2696159 2755982 2817263 2878251 2938463 2998159 3056953 3113575 3166919
57134 3166919 3216941 3264592 3311379 3359081 3409502 3464088 3523524 3587492 3654794 3724011 3794226
57123 3794226 3864982 3935565 4004752 4071477 4135425 4196953 4257207 4318817 4385819 4461894 4548599
57112 4548599 4645366 4750519 4861732 4976494 5093693 5215072 5344597 5486736 5646041 5827898
57102 5827898 6038423 6283777 6570667 6907832 7306670 7781287 8349002 9029401 9839799
57093 9839799 10790268 11883515 13118552 14492295 15998373 17627762 19370931 21216076
57085 21216076 23145045 25135502 27167627 29220697 31257151 33216734 35038396 36689844
57077 36689844 38167632 39464862 40543908 41341705 41792521 41839537 41434206 40542626 39162564
57068 39162564 37333738 35130614 32647081 29985256 27248280 24532091 21917576 19467324
57060 19467324 17226250 15222429 13467502 11958032 10677905 9601400 8697510 7935063
57052 7935063 7286253 6727486 6239307 5806789 5419444 5069918 4752850 4464684 4203188
57043 4203188 3966094 3750392 3553130 3372165 3205796 3052526 2911685 2783490 2667745
57034 2667745 2563109 2468251 2383034 2307888 2242641 2186811 2140568 2104529 2078755 2062392 2053549
57023 2053549 2048622 2042120 2028387 2003876 1967660 1920500 1864349 1802327 1737748 1672708 1608084 1544864
57011 1544864 1484657 1428750 1377346 1330005 1286426 1246621 1210678 1178416 1148995 1121071 1093817
57000 1093817 1067660 1043508 1021390 1000393 979857 959936 941017 923234 906665 891433 877550
56989 877550 865170 854995 847847 843750 841982 841931 843195 844803 845214 843337 838877 831459 820303 805304
56975 805304 787786 769531 751465 733685 716327 699849 684820 671887 661683 654408 649678 647049
56963 647049 646427 647851 651425 657730 667622 680905 695453 708205 716878 720413 718247 710050 696285
56950 696285 678518 658842 638931 619512 600559 582111 564900 549937 537575 527484 519710 515051
56938 515051 514071 516359 521380 529515 541573 557525 576352 596849 617780 637272 652787 661943 663124
56925 663124 655588 639742 617448 591513 564410 537493 511246 485915 461877 439698 419858 402298
56913 402298 386468 372115 359713 349658 341282 333323 325380 318274 312860 309017 305977 303159 300461
56900 300461 298151 296715 296491 297208 298184 299155 300654 303416 307734 313647 321403 331290 343104 356168 369818
56885 369818 383495 396231 406450 412726 414765 413405 409576 403555 395384 385690 375683 366461 358737
56872 358737 353148 350272 350206 352615 357449 365211 376342 390867 409002 431552 459119 491081 525633
56859 525633 560369 592365 618266 635321 642543 640623 630992 615401 595932 574476 552198 530122
56847 530122 510100 494282 483526 477135 474493 476306 483911 498097 519153 547635 584394 629810
56835 629810 683038 741588 801184 856214 900940 930846 943498 938859 919005 887209 846844 801013
56823 801013 752858 705591 661845 623114 589926 562402 540667 525146 516643 515938 523141 537661
56811 537661 558908 586723 620854 659997 701362 740926 774185 797102 806943 802659 784929 756092
56799 756092 719664 679230 637390 595777 555861 519285 487364 460600 438830 421685 408966
56788 408966 400856 397743 399598 405678 415221 428240 444951 464316 483640 499779 510415 514230 510702
56775 510702 500211 484014 463670 440564 415973 391126 366888 343686 321931 302228 284998
56764 284998 270138 257267 246031 236053 226905 218332 210349 203060 196632 191389 187525 184621 181905
56751 181905 179058 176389 174176 172333 170845 169953 169663 169622 169682 170114 170928 171478 171077 169641 167553 165371 163856
56734 163856 163630 164388 165004 164870 164581 164879 165538 165912 166071 166615 167696 168924 170073 171212 172331 173363 174458
56717 174458 175683 176648 176955 176860 176954 177368 177798 178159 178621 179196 179892 181118 183239 185774 187777 189054 190342
56700 190342 192122 193901 194916 194991 194410 193495 192676 192580 193519 194972 195894 195573 194123 192274 190752 189783 189096
56683 189096 188407 187810 187591 187872 188676 190166 192413 194903 196741 197472 197465 197357 197384 197448 197581 198068 199079 200428
56665 200428 201758 202936 204124 205432 206697 207789 208992 210692 212674 214152 214703 214807 215196 215988 216830
56650 216830 217587 218450 219521 220734 222128 223830 225652 226987 227138 225764 223202 220509 218811 218313 218172
56635 218172 217605 216739 215891 214502 211628 207480 203606 201286 200275 199449 198120 196371 194432 192312 190021
56620 190021 187784 185956 184776 184219 184000 183790 183407 182838 182130 181382 180747 180344 180177 180242 180625 181359 182255 183068
56602 183068 183742 184369 184991 185591 186227 187001 187877 188653 189103 189111 188775 188425 188379 188619 188862 188963 189001 188934 188520 187707
56582 187707 186772 185900 185039 184378 184466 185482 186812 187864 188904 190548 192714 194802 196711 198965 201748 204556
56566 204556 207045 209773 213761 219523 226667 234237 241414 248036 254484 260955 266976 271778 274892 276108
56552 276108 275185 272168 267901 263654 260121 257112 254229 251391 248690 246124 243698 241461 239300 236891
56538 236891 234025 230888 227978 225803 224558 223966 223519 222998 222590 222404 222155 221625 221135 221206 221934 223083 224538
56521 224538 226218 227682 228321 227949 226899 225607 224443 223819 223978 224649 225194 225093 224131 222364 220203 218277
56505 218277 216809 215360 213605 212030 211341 211409 211439 211041 210488 210019 209534 209067 208967 209480 210511 211761 212705
56488 212705 212629 211283 209454 208318 208237 208683 209216 209926 210914 212027 213172 214313 215155 215421 215474 215936 216661 216794
56470 216794 216079 215397 215721 217055 218665 219876 220405 220368 220223 220342 220543 220417 220068 220040 220492 221038 221421 221771
56452 221771 222110 222231 222191 222297 222474 222313 221872 221723 222013 222221 222106 222183 222878 223817 224402 224497 224197 223504 222670 222354
56432 222354 222894 223791 224291 224213 223891 223649 223614 223729 223750 223524 223342 223593 224047 224072 223648 223474 223895 224438 224753 225219
56412 225219 226178 227206 227732 227874 228091 228459 228782 229077 229476 229998 230791 232225 234300 236313 237566 238124 238574
56395 238574 239277 240185 241035 241410 240894 239482 237674 236065 235108 235271 236859 239519 242393 244896 246890 248121
56379 248121 248205 247369 246446 245884 245468 245276 246056 248176 250953 253541 255766 257602 258569 258391 257626 257047 256907
56362 256907 257311 258592 260551 262019 262050 261133 260522 260760 261611 262922 264639 266296 267412 268209 269174 270095 270327
56345 270327 269941 269813 270495 271621 272560 273166 273747 274712 276309 278497 281060 283943 287260 290849 294165 296903
56329 296903 299433 302299 305527 308695 311459 313798 315987 318438 321242 323810 325417 326152 326784 327630 328310
56314 328310 328794 329805 331772 334174 336378 338384 340239 341552 342237 343066 344812 347432 350626 354463 358854
56299 358854 363154 367010 370864 374908 378347 380604 382519 385347 389159 393220 397372 401945 406795 411561
56285 411561 416542 422249 428354 434165 439908 446562 454514 463336 472714 482636 492777 502638 512302 522255
56271 522255 532529 542839 553544 565655 579821 595860 613300 631797 651172 671654 694053
56260 694053 719228 747529 779196 814958 855718 901940 953924 1012329 1077866 1150800 1231288
56249 1231288 1319794 1416644 1521620 1634577 1755870 1885476 2022144 2163990 2309189 2455367
56239 2455367 2599091 2736974 2866606 2985449 3089639 3175265 3240365 3284475 3306744 3306028 3282664
56228 3282664 3238767 3176725 3098495 3006292 2902756 2790304 2671192 2548069 2423560 2299411
56218 2299411 2176882 2057640 1943281 1834221 1730161 1631417 1538760 1452304 1371705 1297142
56208 1297142 1228904 1166271 1108149 1054601 1006369 962934 922530 884232 848722 816757 788107
56197 788107 762219 738829 717550 697842 679697 663571 649559 637352 626857 617948 609807 601540
56185 601540 593338 586003 579533 573342 567610 563114 559792 556791 553980 552089 551236 550636 550014 550064 551191
56170 551191 552881 554599 556365 558241 560186 562497 565538 569027 572495 576342 581453 587930 595235 603336
56156 603336 612528 622330 631900 641493 652349 665202 680047 697070 716537 738041 761247 787185
56144 787185 817426 852340 891756 936883 989688 1050490 1118081 1192074 1272922 1359377 1448018
56133 1448018 1535840 1621500 1703657 1780102 1849443 1912112 1969013 2020471 2066792 2108193 2143618
56122 2143618 2171064 2189551 2199501 2201115 2194142 2179468 2158903 2132771 2099338 2057175 2006442 1947485
56110 1947485 1880146 1805319 1725578 1643505 1560779 1479362 1401942 1330499 1265785 1208519 1159409
56099 1159409 1117627 1081053 1048646 1021033 998434 979792 964306 952031 942558 934919 929142 925971
56087 925971 924818 924096 923768 925243 928421 931450 933912 937510 942816 948167 952862 958673 966810 976013 985113
56072 985113 995017 1006587 1018865 1031084 1044239 1059010 1074149 1088521 1102853 1118025 1133528 1148957
56060 1148957 1164956 1181323 1196249 1208884 1220699 1232971 1245011 1256113 1267063 1278414 1289524
56049 1289524 1300609 1313378 1328250 1343370 1357758 1372888 1389760 1407189 1424567 1443514 1464926
56038 1464926 1487108 1508761 1531159 1555520 1580957 1606945 1634976 1665673 1697087 1727909 1759537
56027 1759537 1792927 1826490 1859387 1893762 1931271 1970492 2010313 2052631 2099025 2147935 2197918
56016 2197918 2250479 2306817 2365147 2424313 2486630 2553904 2624033 2695006 2768841 2847899 2930661
56005 2930661 3015052 3102757 3196310 3294915 3397100 3504519 3619268 3740418 3866907 4000707
55995 4000707 4143476 4293523 4449865 4615652 4793795 4983202 5183253 5397583 5629225
55986 5629225 5876760 6139890 6423797 6732955 7065923 7421692 7805741 8224038 8677051
55977 8677051 9166284 9700799 10290218 10937443 11645933 12428142 13299068 14268575 15349283
55968 15349283 16565725 17947070 19518993 21313985 23383803 25793584 28615509 31943856
55960 31943856 35910899 40677925 46421557 53342012 61673016 71671661 83617771 97840637
55952 97840637 114719008 134615753 157797777 184348446 213930480 245347886 276243856
55945 276243856 303419367 323773029 335238952 337130888 329930113 314947946 294064097
55938 294064097 269415519 242997142 216380805 190692870 166720095 144961611 125633588
55931 125633588 108724812 94096791 81550417 70849451 61746875 54016502 47458787
55924 47458787 41889585 37144187 33090126 29621433 26642479 24067685 21830792 19880692
55916 19880692 18169945 16656334 15310846 14113139 13041502 12075299 11202917 10417768
55908 10417768 9709002 9063956 8476341 7943665 7459179 7013917 6604147 6229387 5885318
55899 5885318 5565665 5268942 4996509 4745714 4511345 4292147 4089799 3902951 3728024
55890 3728024 3564396 3413260 3272812 3139965 3015482 2902195 2799322 2703464 2613888 2531860
55880 2531860 2455924 2382801 2312035 2245171 2181152 2117113 2052961 1990843 1930719 1870691 1811141
55869 1811141 1754471 1701150 1649726 1600252 1554089 1510806 1468746 1428112 1390220 1354362 1318731
55858 1318731 1283708 1250900 1219615 1187654 1155031 1123671 1094001 1065007 1036973 1010850 985467
55847 985467 958740 931195 905113 880617 855978 831410 809118 789548 770854 752300 735161
55836 735161 719978 705766 692242 680132 668974 657291 645310 635088 627402 620749 613813 606882
55824 606882 600447 594262 588044 581493 573661 564089 554398 546871 541574 536527 530506 523861 517059 510399
55810 510399 504935 501652 499855 498140 496695 496771 498368 500415 502905 506654 511177 514856 517077 518215 517796
55795 517796 514775 509550 503596 497173 489465 480860 472936 466120 459459 452825 447284 443073 439219 435416
55781 435416 432408 430207 427746 424669 421805 419662 418102 417693 419789 425030 433159 444144 457703 471715
55767 471715 482910 489423 491252 488413 480537 468359 453668 437469 419852 401722 384813 369714
55755 369714 355618 342249 330339 320028 310609 302120 295327 289835 284071 277626 271820 267436 263591
55742 263591 259381 254949 250367 245182 239732 235293 232218 229375 226117 223284 221539 220118 218048 215424
55728 215424 212820 210518 208786 207709 206432 203818 200247 197309 195430 193349 190490 188127 187402 187704 187976
55713 187976 188268 189042 190180 191634 193963 197238 200384 202437 203593 204303 204311 203301 201507 198994 195305 190603
55697 190603 186164 182880 180143 177000 173642 170961 169325 168513 168258 168281 168405 169046 170871 173651 176305 178479
55681 178479 181046 184528 188052 190536 192038 193198 194203 194997 195759 196487 196748 196452 196201 196363 196567 196588 196840
55664 196840 197439 197659 197101 196604 197194 198779 200602 202339 203963 205095 205398 205236 205216 205299 204927 203715 201580
55647 201580 198493 194588 190255 185842 181515 177561 174347 171794 169367 166757 164074 161305 158275 155252
55633 155252 152830 150973 148932 146396 143989 142318 141256 140495 140069 140016 140186 140623 141418 142001 141447 139796
55617 139796 138176 137305 136779 136152 135678 135472 134956 133782 132445 131339 130044 128189 126229 124694 123453 122398
55601 122398 122014 122473 122867 122211 120653 118978 117505 116238 115539 115719 116321 116545 116182 115525 114687 113570 112272
55584 112272 111068 110220 110082 110975 112639 114333 115827 117724 120467 123646 126728 129845 133356 137194 141151
55569 141151 145211 149137 152292 154428 156122 157932 159596 160507 160427 159332 157188 154295 151218 147965 143986
55554 143986 139488 135878 134196 133847 133636 133302 133189 133101 132538 131681 131171 131141 131206 131159 130995 130498 129463 128091
55536 128091 126643 125052 123404 122333 122281 122696 122629 121833 120695 119447 118054 116668 115568 114821 114363 114144
55520 114144 113877 113078 111700 110222 108795 106951 104637 102764 102019 101788 101079 99969 99271 99192 99161 98728 97907
55503 97907 96848 95780 94976 94329 93381 92283 92025 93047 94288 94510 93980 93860 94459 95224 96015 97180 98447
55486 98447 98932 98324 97143 95798 94274 92835 92134 92430 93310 94328 95351 96257 96973 97797 99096 100599
55470 100599 101528 101435 100420 98600 96027 93144 90748 89337 88840 88882 88958 88572 87723 87099 87311 88136 89023 90009
55452 90009 91420 92909 93685 93713 93927 95057 96788 98305 99185 99623 100043 100582 100789 100005 98284 96595 95785
55435 95785 95638 95404 94871 94402 94305 94775 96100 98152 99977 100679 100580 100785 101695 102699 103155 102898 101893 100242
55417 100242 98639 98034 98642 99817 100912 101650 101743 100937 99599 98616 98470 98885 99433 99966 100378 100481 100212 99560
55399 99560 98316 96389 94323 92892 92217 91830 91602 91950 93049 94432 95507 96023 96000 95719 95740 96369 97113
55382 97113 97206 96649 96077 95669 94933 93671 92375 91479 90914 90651 91008 92037 93187 93945 94362 94690 94945 95095
55364 95095 95275 95511 95642 95708 96007 96533 96778 96358 95525 94834 94602 94873 95531 96224 96461 96028 95107 93908 92510
55345 92510 91175 90395 90377 90765 91063 91170 91349 91912 93035 94588 96062 96938 97261 97585 98237 98901 99120 98908
55327 98908 98612 98276 97471 95875 93975 92910 93380 94771 95694 95482 94789 94594 95087 95810 96469 97148 98071 99492
55309 99492 101438 103197 103551 102110 99996 98565 97853 96990 95731 94654 94045 93603 93252 93349 93899 94339 94242
55292 94242 93618 92482 90831 89181 88398 88743 89674 90647 91549 92291 92676 92852 93231 93794 94100 94138 94512 95502
55274 95502 96579 97155 97280 97285 97232 97058 96877 96917 97339 98172 99123 99595 99351 98953 98991 99115 98605 97730 97500 98085
55254 98085 98547 98335 97946 97760 97332 96418 95725 95893 96502 96811 96858 97096 97483 97664 97619 97472 97023 96070 94875
55235 94875 93812 92867 91998 91602 92062 93047 93719 93465 92186 90263 88543 87935 88624 90003 91563 93232 94640
55218 94640 94891 93722 92219 91599 91804 92019 92083 92491 93325 94162 94936 95981 97242 98177 98572 98823 99307 100026
55200 100026 100899 101813 102287 101687 100080 98441 97698 97770 97813 97298 96667 96887 98365 100404 101902 102509 102799 103246
55182 103246 103537 103172 102356 101817 101986 102709 103590 104232 104307 103774 102979 102310 101889 101790 102205 103012 103506 103097 102200
55163 102200 101856 102487 103461 103995 104024 104033 104324 104729 104886 104626 104135 103821 104031 104851 106101 107463 108637 109462 109870
55144 109870 109720 108871 107609 106752 106932 107859 108678 108978 108984 108850 108351 107420 106368 105412 104500 103740 103386 103193 102470
55125 102470 101192 100386 100881 102220 103378 104072 104686 105292 105498 105134 104473 103852 103515 103684 104393 105400 106583
55108 106583 108068 109570 110087 108966 107032 105922 106383 107865 109626 111466 113262 114612 115314 115750 116376
55093 116376 117083 117358 116982 116329 115945 115883 115641 114906 114222 114459 115565 116431 116308 115795 115909 116651 117129 116773 115794
55074 115794 114667 113931 114316 116178 118698 120311 120230 119176 118490 118913 120211 121461 121565 119971 117202 114452
55058 114452 112568 111595 111140 110720 109846 108358 106825 106121 106402 106865 106711 106012 105488 105745 106852 108325 109355
55041 109355 109365 108550 107667 107220 107080 106894 106480 105726 104581 103394 102882 103405 104499 105365 105644 105487 105155 104908
55023 104908 105080 105821 106790 107406 107468 107239 106930 106454 105880 105734 106428 107460 107709 106707 105286 104678 105235 106377
55005 106377 107571 108804 110150 111488 112904 114854 117552 120479 122781 123953 123955 123104 122115 121817 122236 122271
54989 122271 120887 118547 116856 116748 117493 117669 116727 115431 114996 115964 117807 119488 120377 120590 120498 120282 120059
54972 120059 120053 120284 120417 120262 120206 120690 121566 122435 123386 124697 125925 126080 124916 123447 122877 123418 124409 125188
54954 125188 125550 125668 125901 126530 127428 128104 128161 127577 126528 125215 123972 123209 122988 122912 122684 122596 123074 123916 124446
54935 124446 124520 124932 126477 128824 130870 132199 133725 136566 140734 145434 150389 156156 163097 170703 178204
54920 178204 185276 191810 197515 202225 206224 209725 212238 212935 211473 208100 203194 197218 190948 185156
54906 185156 179950 174783 169145 163096 157211 152302 148962 147007 145509 143736 141919 140760 140396 140321 140118
54891 140118 139754 139272 138745 138535 139088 140432 142296 144744 148233 153031 158949 165612 172562 179203 185156
54876 185156 190741 196558 202517 207711 211321 213170 213329 211714 208259 203117 196552 189009 181326 174418
54862 174418 168561 163350 158466 154088 150487 147677 145511 143703 141706 139103 136289 134201 133205 132701 132014
54847 132014 131051 129862 128193 126004 123899 122496 121660 120865 120060 119621 119648 119811 119832 119690 119333 118543 117217
54830 117217 115574 114061 113109 112906 113273 113801 114223 114553 114846 114989 114870 114561 114234 114006 113983 114334 115164 116351
54812 116351 117549 118324 118419 118061 117958 118761 120467 122511 124365 125827 126830 127365 127670 128126 128797 129324 129394
54795 129394 129133 128930 129032 129389 129772 129982 130058 130262 130728 131240 131523 131601 131680 131850 132194 132895 133894 134782 135509 136886
54775 136886 139698 143505 147096 150107 153386 157723 163017 168874 175186 181801 188355 194755 201170 207159
54761 207159 211541 213626 213987 213484 212151 209626 206122 202189 197868 192796 187023 181133 175637 170693 166295
54746 166295 162365 158766 155549 153031 151362 150236 149307 148612 148324 148401 148760 149469 150432 151275 151942 153065 155299
54729 155299 158568 162349 166391 170705 175267 180193 185904 192511 199306 205374 210406 214355 216671 216686 214617
54714 214617 211403 207584 203079 198039 193001 188017 182415 175900 169337 163938 159965 156659 153244 149683
54700 149683 146529 144286 142894 141736 140216 138338 136603 135337 134338 133262 132116 131178 130496 129708 128477
54685 128477 127005 125897 125400 125036 124285 123446 123361 124264 125421 126024 125968 125530 124838 123990 123250 122672 121946 120999
54667 120999 120338 120378 120826 121251 121754 122454 122782 122158 121095 120733 121372 122347 123297 124562 126200 127561 128243 128668
54649 128668 129226 129522 129029 128007 127204 126916 126800 126391 125437 123972 122445 121580 121805 122839 124014 124830 125139
54632 125139 125040 124815 124681 124452 123717 122580 121892 122358 123627 124646 124844 124643 124864 125877 127301 128297 128224 127215
54614 127215 126189 126063 126932 128110 128962 129522 130251 131336 132417 132957 132745 131935 130752 129399 128187 127440
54598 127440 127088 126683 126033 125598 125930 126934 128060 129014 129817 130280 130023 129071 127874 126571 124848 122780 121200
54581 121200 120818 121440 122539 124125 126361 128675 130079 130396 130468 131003 131818 132392 132571 132427 131928 131185 130664
54564 130664 130729 131187 131657 132129 132714 133087 132777 131941 131253 130983 130719 130137 129517 129285 129534 130275 131626 133343
54546 133343 134637 135062 135259 136222 138024 139872 141253 142386 143559 144736 145885 147100 148155 148573 148307
54531 148307 147846 147402 146550 145029 143381 142355 142065 142119 142221 142238 142002 141488 140948 140512 139959 139241 138835 139112
54513 139112 139600 139457 138507 137350 136547 136175 136015 135715 134862 133417 132020 131403 131566 131933 132266 132868 133905
54496 133905 135048 135902 136335 136292 135732 134907 134329 134283 134624 135111 135625 135970 135899 135544 135506 136276 137771 139533 141160
54477 141160 142444 143315 143848 144137 144155 143924 143856 144580 146241 148247 149886 151002 151875 152598 152921 152682 152133 151671
54459 151671 151375 151026 150584 150337 150360 150005 148427 145654 142724 140641 139620 139494 140263 141732 143087 143503 143022
54442 143022 142334 141848 141433 140923 140332 139725 139319 139586 140717 142103 142900 142973 142755 142420 141938 141785 142635 144216
54424 144216 145316 145241 144540 144076 144130 144733 146025 147728 148938 149177 149124 149701 150788 151510 151489 151193 151192 151603 152207
54405 152207 152622 152417 151481 150304 149646 149941 151128 152817 154351 154997 154508 153480 152883 153257 154440 155860
54389 155860 156923 157354 157437 157725 158278 158405 157442 155597 153758 152657 152477 153090 154254 155627 156832 157574 157703
54372 157703 157371 157210 157969 159701 161570 162741 163274 163861 164969 166526 168158 169408 169987 170211 170959 172810
54356 172810 175383 177914 180237 182777 185768 189017 192264 195220 197269 197797 196893 195287 193458 191205 188212
54341 188212 184600 180804 177271 174427 172511 171234 169966 168445 167037 166126 165574 165036 164485 164102 163831 163361
54325 163361 162513 161454 160588 160335 160840 161735 162304 162091 161299 160463 159869 159412 158874 158140 157270 156576 156487 157033 157518
54306 157518 157062 155537 153675 152176 151079 150110 149270 148696 148222 147616 147200 147682 149229 151118 152506 153206
54290 153206 153482 153490 153387 153673 154773 156292 157190 156910 155980 155302 155166 155230 155249 155436 156097 157153 158195 158979 159701
54271 159701 160594 161369 161366 160413 159222 158607 158559 158488 158218 158219 158876 160078 161555 163130 164440 164961 164652 164179 164183 164633
54251 164633 165210 165933 166965 168049 168657 168596 168130 167590 167175 167030 167163 167338 167320 167154 166922 166369 165179 163546
54233 163546 162087 161121 160427 159751 159195 158970 159100 159580 160542 161932 163220 163793 163622 163249 163065 162882 162391 161765
54215 161765 161444 161409 161057 159980 158603 157817 158074 159007 159799 159818 159155 158692 159357 160981 162178 161825 160421 159377
54197 159377 159174 159034 158413 157873 158076 158675 158871 158545 158191 158072 158112 158389 159044 159808 160255 160590 161630 163758
54179 163758 166316 168264 169244 169741 170295 170794 170624 169471 167739 166049 164609 163402 162727 162913 163420 163065
54163 163065 161487 159778 159147 159514 160005 160265 160481 160481 159847 158870 158487 159048 159879 160289 160390 160627 161035 161386 161627
54144 161627 161824 161904 161790 161639 161745 162268 163081 163756 163743 162963 162186 162389 163584 164714 164960 164759 165165 166496
54126 166496 168007 168735 168302 166972 165349 164110 163711 164116 164884 165626 166354 167360 168812 170579 172456 174348
54110 174348 176101 177260 177365 176584 175797 175838 176754 177960 178879 179227 178950 178332 178074 178761 180122 181130 181090 180417
54092 180417 180160 180889 182221 183391 184068 184548 185265 186311 187515 188795 190159 191472 192598 193885 196132
54077 196132 199802 204475 209191 213067 215497 216229 215708 215029 215043 215636 216174 216421 216562 216602 216326 215794 215350 215135
54059 215135 215065 215186 215580 215934 215820 215492 215802 217189 219220 221348 223596 226214 229122 232094 235162 238498
54043 238498 242079 245790 249744 254246 259546 265773 272972 281095 290016 299616 309714 319954 329950 339517
54029 339517 348582 356941 364439 371341 378122 384848 391114 396649 401556 405851 409220 411436 412603 412769
54015 412769 411686 409232 405707 401380 396021 389251 381169 372324 363227 354182 345437 337147 329229 321528
54001 321528 314115 307255 301108 295560 290325 285159 280034 275156 270731 266733 263008 259574 256612 254181
53987 254181 252154 250411 248806 246992 244659 242068 239985 238879 238461 238144 237699 237244 236814 236217 235233 233890
53971 233890 232589 231837 231668 231485 230853 230224 230335 230974 231117 230412 229739 229924 230678 231388 232316 234148 236708 239023
53953 239023 240640 242205 244566 247761 251111 254025 256580 259380 262920 267091 271507 276285 282049 288982
53939 288982 296314 303200 309810 317103 325660 335133 344716 353854 362587 371481 381086 391322 401681 412142
53925 412142 423296 435117 446215 455093 461792 467488 472763 477309 481322 486049 492480 500298 508617
53912 508617 517143 526015 534981 543362 550690 556907 561991 565776 568109 568984 568578 567281 565584 563723 561467
53897 561467 558297 553732 547568 540055 531902 523724 515308 505766 494653 482656 470845 459456 447880
53884 447880 435725 423399 411576 400499 390056 380261 371352 363524 356768 350910 345589 340277 334587
53871 334587 328582 322594 316686 310596 304321 298392 293231 288510 283586 278460 273766 269812 266165 262425
53857 262425 258906 256167 254214 252565 250867 249071 247161 245138 243153 241365 239720 238208 237104 236576
53843 236576 236167 235211 233782 232724 232619 233157 233731 234214 234774 235229 235020 233846 232084 230544 229908 230380 231676
53826 231676 233240 234456 234832 234264 233266 232718 233131 234206 235306 236225 237323 238990 241390 244650 248855 253671
53810 253671 258362 262476 266385 270921 276605 283341 290724 298424 306251 314060 321713 329184 336644 344245
53796 344245 351725 358369 363629 367735 371451 375252 378989 382345 385260 387770 389652 390499 390043 388362 385879
53781 385879 383187 380625 377872 374157 368991 362645 355815 348979 342164 335136 327685 319921 312404 305851
53767 305851 300492 295837 291256 286597 282041 277564 272939 268226 263839 259972 256317 252572 248971 245934
53753 245934 243341 240601 237548 234855 233203 232286 231087 229140 227101 225846 225361 224872 223890 222737 222002
53738 222002 221850 222031 222366 222964 223948 225104 225909 225956 225380 224802 224798 225407 226132 226325 225614 224227 222988 222763 223712
53719 223712 225212 226634 227997 229600 231361 232916 234168 235238 235998 236284 236636 238149 241230 244941 247972
53704 247972 250006 251754 253920 256551 259245 261580 263350 264697 266083 267982 270559 273690 277143 280640
53690 280640 283913 286828 289279 290908 291333 290889 290679 291365 292177 291733 289767 287384 285681 284782 284356 284218
53674 284218 284029 283096 281220 279334 278537 278662 278517 277550 276521 276338 276890 277421 277586 277632 277759 277861 277872 277954 278189
53655 278189 278373 278281 277985 277762 277736 277754 277669 277654 278076 278967 279786 279924 279458 279157 279701 281157 283285 285986 289109
53636 289109 292096 294289 295569 296360 297041 297699 298422 299438 300824 302440 304313 306788 310097 314004 318086
53621 318086 322156 326177 329960 333197 335709 337472 338593 339527 341176 344359 349021 354161 358715 362517
53607 362517 366313 370913 376361 381959 387065 391696 396250 400785 404889 408228 410929 413286 415403 417277
53593 417277 418994 420568 421708 421984 421181 419458 417296 415424 414469 414399 414409 413647 411976 409844 407553 404979
53577 404979 401947 398619 395414 392698 390588 389011 387935 387511 387778 388243 388109 387070 385618 384308 383052
53562 383052 381512 379893 378813 378463 378365 378078 377791 378114 379435 381455 383225 383804 383150 382203 381835 381909 381784
53545 381784 381456 381622 382698 384436 386563 389130 392070 394971 397723 400837 404740 409058 413059 416577 420164
53530 420164 424463 429767 436078 443240 451023 459282 468051 477323 486857 496355 505832 515664 526202 537396
53516 537396 548874 560512 572911 587053 603249 620623 637992 655138 672805 691486 710785
53505 710785 730072 749197 768228 786924 804968 822463 839733 856738 873155 889013 904857
53494 904857 921084 937317 952735 967055 981037 995789 1011575 1027528 1042655 1056778 1070225
53483 1070225 1083046 1095236 1107516 1120904 1135261 1149089 1161293 1172540 1184156 1196085 1206740
53472 1206740 1214695 1219901 1223172 1225146 1225891 1225149 1222717 1218720 1213525 1207273 1199714 1190808 1181325 1172316
53458 1172316 1164022 1155681 1146517 1136483 1125934 1114989 1103465 1091156 1077960 1063912 1049349 1034797
53446 1034797 1020572 1006710 993456 981495 971254 962170 953145 943827 935046 927842 922482 918709 916496
53433 916496 915923 916414 916815 916546 916235 916879 918694 921218 924223 927988 932757 938455 945046 952731 961672 971808
53417 971808 983030 995250 1008230 1021743 1035986 1051490 1068475 1086640 1105721 1125886 1147357
53406 1147357 1170024 1193663 1218251 1243826 1270365 1298065 1327436 1358796 1391936 1426527 1462520
53395 1462520 1499813 1537943 1576610 1616190 1657155 1699158 1741295 1783190 1825174 1867314 1908866
53384 1908866 1948991 1987607 2025190 2061954 2097434 2130828 2161562 2189548 2214964 2237852 2258058
53373 2258058 2275492 2290147 2301677 2309276 2312291 2310799 2305266 2295831 2282275 2264533 2242790 2217224
53361 2217224 2188212 2156831 2124531 2092035 2058885 2024387 1988743 1952982 1917985 1883899 1850523
53350 1850523 1818039 1787157 1758462 1731647 1705589 1679250 1652400 1625416 1598699 1572489 1546983
53339 1546983 1522291 1498482 1476010 1455782 1438305 1422930 1408496 1394628 1381833 1370362 1359745
53328 1359745 1349589 1340123 1331507 1323103 1313840 1303016 1290491 1276546 1261903 1247478 1233674 1220127
53316 1220127 1206517 1193293 1181143 1170065 1159538 1149451 1140271 1132275 1125179 1118692 1112984 1108392
53304 1108392 1104955 1102478 1100915 1100482 1101467 1104006 1107984 1113135 1119313 1126737 1135896 1147172 1160500 1175349
53290 1175349 1190939 1206670 1222471 1238688 1255536 1272750 1289831 1306405 1322104 1336312 1348476
53279 1348476 1358659 1367410 1374994 1381039 1385015 1386681 1385937 1382681 1377110 1369809 1361099 1350535 1337568
53266 1337568 1322574 1306652 1290414 1273539 1255657 1237034 1218050 1198561 1178375 1157948 1137942
53255 1137942 1118234 1098068 1077246 1056521 1036624 1017474 998676 980264 962445 944932 927078
53244 927078 908702 890401 872993 856886 841954 827810 814102 800676 787484 774428 761439
53233 761439 748774 737000 726558 717485 709609 702716 696417 690173 683729 677207 670469 662738 653304
53220 653304 642384 630758 618691 605782 591857 577388 562863 548269 533513 519049 505775
53209 505775 494348 484673 475921 467091 457819 448660 440319 432694 425002 416811 408430 400162 391688 382506
53195 382506 372607 362394 352213 342352 333268 325404 318781 313045 307898 303294 299254 295698 292500 289605
53181 289605 286984 284520 281982 279255 276633 274650 273437 272429 270987 269156 267399 265793 264059 262327
53167 262327 261167 260582 259672 257727 255199 253117 251902 251270 250926 250728 250284 249027 246830 244215 241899 240330
53151 240330 239554 239274 239110 239023 239343 240135 240838 240903 240513 240171 239814 239003 237902 237292 237473 237839 237864 237850 238306 239069
53131 239069 239633 240007 240705 242050 243940 246162 248478 250442 251596 251907 251734 251379 251029 251046 251796 253016 253835
53114 253835 253744 253198 252948 253089 253185 253050 252869 252627 252032 251132 250497 250498 250807 250893 250712 250479 250056 249071 247596 246165
53094 246165 245057 243998 242768 241766 241669 242668 244170 245173 244883 243244 241053 239403 238852 239114 239545 239704
53078 239704 239452 238850 238219 238040 238470 239037 239097 238555 237908 237622 237694 237799 237632 237004 235837 234239 232557 231214
53060 231214 230408 229977 229629 229341 229416 230005 230690 230841 230426 230182 230781 232052 233215 233695 233435 232633 231533 230500
53042 230500 229927 229940 230293 230672 230951 231149 231260 231277 231275 231389 231663 232033 232540 233501 235232 237444 239158 239568 238963
53023 238963 238394 238396 238496 238171 237703 237665 237953 237979 237606 237268 237207 237192 237134 237399 238273 239523 240737 241743 242467 242726
53003 242726 242494 242041 241482 240478 238817 237097 236279 236567 237237 237656 238012 238782 239843 240562 240642 240483 240639 241223
52985 241223 241951 242579 243124 243798 244886 246628 249021 251713 254225 256320 258088 259690 261144 262369 263321
52970 263321 264021 264536 264922 265065 264632 263393 261671 260224 259511 259250 258849 258062 257029 255860 254511 253038
52954 253038 251659 250563 249836 249527 249552 249510 248955 247933 247017 246660 246709 246732 246601 246513 246514 246322 245732 245007 244675 244875
52934 244875 244999 244156 242048 239357 237190 236236 236422 237227 238066 238463 238187 237390 236562 236240 236753 238118 239974
52917 239974 241648 242533 242551 242160 241868 241856 242082 242495 242976 243233 242968 242157 241075 240070 239381 239069 239045 239172 239389
52898 239389 239696 240016 240156 240020 239745 239567 239588 239718 239762 239481 238714 237576 236499 235951 236102 236790 237752 238753
52880 238753 239597 240144 240376 240396 240410 240715 241540 242780 243947 244624 244977 245687 247317 249810 252618 255218 257532
52863 257532 259946 262884 266302 269719 272772 275541 278051 279709 279743 278161 275760 273035 269643 265299 260690
52848 260690 256867 253993 251293 248206 244969 241993 239265 236636 234344 232847 232273 232174 231753 230399 228298
52833 228298 226513 226079 226901 227937 228476 228708 228836 228317 226532 223767 220934 218661 217214 216908 217787 219035
52817 219035 219599 219475 219666 220722 222065 223041 223895 225209 226956 228626 229972 231085 231918 232224 231865 230919
52801 230919 229625 228419 227708 227320 226445 224509 221913 219550 217807 216450 215317 214602 214446 214684 215099 215601
52785 215601 216102 216438 216512 216347 216045 215809 215902 216352 216808 216963 217063 217619 218667 219633 220022 219930 219719 219451 218906
52766 218906 218109 217574 217909 219114 220398 220872 220486 220066 220308 220959 221172 220521 219407 218616 218718 219765 221288
52749 221288 222646 223584 224412 225461 226571 227415 228147 229323 231199 233433 235482 237005 237892 238254 238391 238520
52733 238520 238537 238285 237943 237778 237609 237027 236159 235715 236069 236728 236889 236166 234589 232372 230043 228468 228242 229072
52715 229072 230070 230595 230640 230505 230389 230273 229982 229328 228350 227437 227069 227376 228002 228472 228641 228691 228718 228524 227968 227443
52695 227443 227589 228496 229542 230249 230949 232250 234073 235650 236366 236221 235602 235017 234918 235347 235739 235537 234955 234702
52677 234702 234989 235323 235271 234868 234207 233213 232066 231260 231017 231078 231306 231952 233060 234119 234680 234904 235137 235401
52659 235401 235696 236323 237460 238774 239904 240967 242175 243331 244246 245285 246868 248695 250050 250703 250861
52644 250861 250436 249168 247411 246022 245250 244411 242981 241414 240501 240326 240367 240389 240721 241665 242953 244018 244643
52627 244643 245210 246239 247749 249187 249961 249885 249137 248039 246997 246345 246018 245533 244559 243338 242312 241545 240864
52610 240864 240403 240590 241542 242816 243886 244711 245734 247332 249296 250851 251421 251352 251618 252686 253983 254630
52594 254630 254347 253400 252131 250918 250248 250302 250650 250820 250949 251451 252290 253107 253862 254778 255842 256918 258223
52577 258223 260029 261980 263361 264021 264388 264653 264658 264546 264694 264851 264200 262569 260832 259776 259263 258884 258655
52560 258655 258550 258038 256787 255366 254620 254644 254913 255106 255256 255372 255410 255351 254941 253735 251878 250482 250547 251739
52542 251739 252778 252825 251980 250748 249708 249476 250224 251274 251803 251875 252117 252495 252313 251554 251332 252586 254938
52525 254938 257216 258604 258938 258434 257630 257283 257818 259005 260435 262059 264022 266304 268915 272130 276166
52510 276166 280719 285154 288983 291875 293467 293636 292854 291770 290431 288309 285188 281661 278583 276317 274664
52495 274664 273264 271849 270230 268338 266305 264373 262690 261252 260030 259063 258396 257990 257765 257764 258238 259479
52479 259479 261478 263740 265490 266181 265946 265625 266166 267780 269717 271067 271799 272792 274778 277523 280248 282595
52463 282595 284817 287155 289404 291176 292307 292826 292735 291956 290425 288180 285465 282737 280376 278303 276050
52448 276050 273366 270574 268215 266460 265082 263858 262793 262007 261623 261718 262203 262767 263136 263332 263432 263175 262202
52431 262202 260754 259742 259835 260709 261469 261574 261159 260684 260631 261446 263304 265879 268563 270915 272670 273472 273087
52414 273087 271966 271163 271444 272778 274852 277644 281202 285260 289592 294467 300274 306745 313090 318811 323875
52399 323875 328033 330591 331146 330065 327933 324923 321072 316776 312533 308457 304579 301408 299569 298894 298496
52384 298496 297902 297587 298109 299226 300275 301125 302327 304464 307684 311770 316309 320885 325366 329949 334705
52369 334705 339208 342931 345930 348714 351405 353392 354009 353289 351890 350538 349732 349792 350848 352686 354706
52354 354706 356185 356810 357114 358216 360815 364424 367859 370466 372576 374769 377200 379853 382988 386918 391565
52339 391565 396626 402032 407873 414071 420492 427330 434954 443401 452439 462168 473180 485951 500384
52326 500384 516015 532432 549348 566572 584182 602522 621755 641521 661254 680795 700517
52315 700517 720846 741822 763242 785030 807299 830026 852895 875667 898581 922130 946356
52304 946356 970640 994261 1016883 1038329 1058239 1076309 1092657 1107466 1120318 1130347 1137124 1141004
52292 1141004 1142507 1141760 1138720 1133605 1126850 1118830 1109884 1100407 1090705 1080903 1071152 1061806 1053219 1045498
52278 1045498 1038610 1032672 1028001 1024984 1023956 1025056 1028080 1032619 1038438 1045612 1054243 1064193 1075229 1087287
52264 1087287 1100463 1114886 1130653 1147693 1165610 1183850 1202115 1220352 1238266 1255219 1270911
52253 1270911 1285903 1300979 1316024 1329776 1340709 1348019 1351878 1352961 1351729 1348055 1341605 1332566 1321739
52240 1321739 1309781 1296613 1281801 1265213 1247059 1227643 1207467 1187321 1167772 1148689 1129691
52229 1129691 1110854 1092493 1074488 1056569 1039258 1023710 1010335 998210 986288 974640 964078
52218 964078 954976 947085 940279 934895 931268 929302 928633 928952 930039 931551 932885 933454 933262 933148 934109 936261
52202 936261 938774 940871 942620 944592 947164 950411 954290 958564 962855 967161 972005 977606 983154 987499
52188 987499 990456 992761 994748 995688 994649 991475 986684 980863 974464 967795 960855 953455 945755 938369
52174 938369 931646 925203 918633 912361 907287 903703 901124 899185 898092 898086 899007 900674 903243 906781 910772
52159 910772 914486 917648 920346 922432 923531 923713 923664 923926 924293 924306 924135 924631 926487 929620 933386 937210
52143 937210 940964 944911 949370 954309 959245 963689 967716 971998 977260 983908 992148 1002074 1013439 1025726
52129 1025726 1038958 1054268 1073103 1095718 1120880 1147265 1174797 1204264 1235905 1268825 1301787
52118 1301787 1334229 1366319 1398218 1429479 1459212 1486796 1512339 1536336 1558904 1579556 1597855
52107 1597855 1614067 1628938 1642948 1655993 1667692 1677748 1686009 1692488 1697344 1700606 1701902 1700660
52095 1700660 1696582 1689605 1679416 1665470 1647760 1627290 1605483 1583221 1560675 1537836 1514926 1492384
52083 1492384 1470724 1450413 1431694 1414577 1399108 1385498 1373885 1364226 1356755 1352282 1351525 1354116
52071 1354116 1358728 1364361 1371222 1380241 1392005 1406301 1422384 1439472 1457186 1475733 1495541 1516587
52059 1516587 1538169 1559367 1579544 1598288 1615223 1630177 1643384 1655137 1665191 1672697 1676786 1677194
52047 1677194 1674384 1669125 1661837 1652194 1639447 1623239 1604071 1582929 1560649 1537756 1514637 1491504
52035 1491504 1468199 1444386 1420000 1395332 1370713 1346389 1322713 1300130 1278738 1258046 1237431
52024 1237431 1216768 1196466 1176902 1158057 1139768 1122147 1105570 1090240 1075970 1062433 1049501
52013 1049501 1037192 1025421 1014018 1002969 992362 982042 971589 960682 949234 937075 923964
52002 923964 910189 896731 884324 872563 860546 848242 836602 826220 816602 807046 797569 788466
51990 788466 779375 769466 758345 746229 733322 719668 705660 692052 679176 666529 653467 639997
51978 639997 626666 613908 601858 590570 580087 570408 561748 554751 550071 547668 546847 547098 548607
51965 548607 551742 556316 561602 566929 571954 576398 579845 581940 582613 581937 579862 576230 571133 565167 559210
51950 559210 553930 549597 546422 544854 545343 547881 552075 557653 564564 572523 580905 589411 598489 608682
51936 608682 619688 630437 639933 647626 653129 656164 656828 655343 651457 644644 635154 624303 613367
51923 613367 602633 591946 581668 572490 564585 557731 552252 549195 549417 552888 558999 567092 576423 585923
51909 585923 594288 600322 603276 603149 600708 596913 592159 586187 578717 569919 560226 549996 539455 528680
51895 528680 517545 505910 493923 481879 469784 457445 445177 433943 424524 416907 410845 406584
51883 406584 404466 404109 404680 405986 408704 413351 419550 426547 433999 441879 449885 457403 463971 469471 473870
51868 473870 477008 478616 478438 476485 473398 470428 468650 468099 467945 467572 467159 467105 467279 467256 467041 467098 467682 468458
51850 468458 468798 468107 465862 461786 456190 449826 443169 436204 429042 422362 416789 412127 407688 403288 399432
51835 399432 396612 394894 394177 394314 394823 394935 394276 393246 392483 392118 391734 390830 389192 386987 384646 382467
51819 382467 380260 377631 374755 372512 371627 371935 372763 373730 374806 375773 376186 375901 375336 375073 375377 376126 376996
51802 376996 377702 378144 378391 378534 378703 379200 380227 381339 381563 380472 378849 377800 377355 376571 374905 372863
51786 372863 371160 369876 368768 367873 367343 366999 366491 365815 365346 365465 366415 368377 371355 375049 379130 383672
51770 383672 389090 395594 402872 410346 417642 424734 431630 437924 442773 445495 446238 445791 444670 442658 439368
51755 439368 434909 429674 423725 416882 409385 402068 395816 390990 387388 384459 381639 378802 376406 374889
51741 374889 373972 373018 372120 372307 374321 377593 380830 383349 385453 387699 390257 392872 394992 395969 395598 394610
51725 394610 394215 394958 396306 397485 398383 399307 400130 400202 399125 397267 395303 393435 391287 388521 385376 382561
51709 382561 380679 379780 379401 379013 378511 378333 379071 380830 383061 385107 386842 388541 390168 391144 390976 389860
51693 389860 388466 387451 387360 388575 390786 392699 392912 391173 388319 385042 381326 377204 373275 370036 367244
51678 367244 364509 362138 360803 360567 360799 360900 360638 359954 359000 358330 358552 359826 362113 365702 370818 376799
51662 376799 382466 387455 392383 397380 401289 402956 402733 401981 401488 401232 401468 403159 406983 412455 418305
51647 418305 423390 427015 428750 428331 425741 421208 415139 408121 400890 394078 387873 381996 376188 370768
51633 370768 366500 363758 362036 360645 359748 360159 362021 364310 365999 367204 368642 370345 371555 371770 371269
51618 371269 370610 370179 370290 371158 372500 373551 373713 372926 371350 369086 366424 363986 362278 361263 360601 360132
51602 360132 359970 360338 361517 363749 366940 370678 374791 379692 385838 392955 400069 406217 410874 413801 414922
51587 414922 414410 412602 409684 405649 400670 395387 390750 387695 386910 388651 392644 398356 405533 414368 424989
51572 424989 436965 449595 462655 476615 492041 509006 527250 546679 567401 589313 611993
51561 611993 635139 658912 683632 709238 735233 760958 785579 807801 826008 838950 846207 847815
51549 847815 843607 833187 816515 794391 768302 739919 710613 681251 652318 624246 597601 572927
51537 572927 550506 530459 513035 498457 486324 475430 464620 453906 444405 437018 431383 426371
51525 426371 421409 416950 413672 411644 410463 409839 409790 410410 411788 414009 416973 420256 423400 426275 428853
51510 428853 430738 431313 430391 428298 425210 420835 415041 408473 402153 396677 392110 388474 385843 383991 382385
51495 382385 380748 379382 378716 378672 378698 378378 377811 377322 376913 376182 374836 373127 371600 370465 369422 368099 366407
51478 366407 364413 362186 359911 357881 356091 354070 351414 348318 345259 342318 339295 336427 334457 333806
51464 333806 334047 334435 334661 334877 335263 335830 336460 336860 336686 336029 335645 336359 338258 340753 343414 346374 349903
51447 349903 353983 358581 364006 370633 378343 386599 395047 403743 412657 421267 428817 434796 438945 441036
51433 441036 441024 439380 436895 434002 430574 426454 421874 417160 412346 407409 402641 398401 394626 391030 387697
51418 387697 385037 383153 381790 381085 381860 384704 389018 393368 396703 398956 400645 402272 404083 406034 407756
51403 407756 408721 408630 407659 406405 405603 405786 407033 409057 411571 414515 417864 421463 425306 429883 435999 444245
51387 444245 454843 467886 483462 501554 522163 545592 572321 602478 635612 671106 708557
51376 708557 747569 787302 826371 863079 895660 922415 941856 952803 954524 947041 931354 909064
51364 909064 881555 849662 814217 776543 738141 700058 662905 627316 594063 563757 536727
51353 536727 513129 492817 475205 459621 445905 434324 424865 416989 410214 404507 399848 395778 391740
51340 391740 387646 383749 380154 376816 373883 371606 369863 368122 365947 363329 360542 357951 355918 354534
51326 354534 353427 352204 351143 351074 352367 354397 356200 357320 357741 357490 356801 356419 357164 359185 362026 365316
51310 365316 368939 372594 375784 378359 380569 382367 383166 382559 380840 378545 375874 372903 369925 367100 364054
51295 364054 360383 356336 352565 349348 346577 344311 342714 341485 340063 338511 337610 337909 339193 341092 343596
51280 343596 346683 349967 353221 356784 360991 365492 369525 372547 374263 374493 373683 373154 374067 376182 378262
51265 378262 379664 380813 382115 383313 384197 385155 386406 387224 386633 384678 382385 380500 378840 376971 375064
51250 375064 373754 373285 373068 372199 370402 368381 367121 366843 366826 366240 364956 363428 362000 360556 358726 356239
51234 356239 353100 349602 346251 343591 342041 341731 342301 342974 343084 342618 342056 341692 341485 341628 342703 344886
51218 344886 347416 349407 350981 353070 356126 359612 362790 365511 368067 370748 373812 377509 381733 385843
51204 385843 389133 391405 392908 393886 394457 394754 394898 394852 394508 393863 392937 391628 389874 387908 386041 384224
51188 384224 382116 379654 377268 375366 373847 372307 370584 368925 367693 367140 367284 367747 367779 366777 364936
51173 364936 363200 362450 362807 363784 364890 365873 366590 366980 367295 368076 369635 371606 373221 374111 374697 375653 377116
51156 377116 378686 380170 381940 384351 387053 389255 390581 391272 391610 391582 391230 390840 390496 389798 388398 386543
51140 386543 384716 382947 380957 378815 376943 375466 374099 372759 371865 371830 372621 373964 375662 377472 379085
51125 379085 380438 381853 383582 385474 387321 389212 391205 392866 393663 393811 394344 396170 399264 402863 406287
51110 406287 409374 412257 414931 417255 419300 421384 423584 425483 426752 427794 429254 430946 431915 431755 431258
51095 431258 431272 431484 430925 429373 427591 426338 425707 425461 425425 425451 425399 425320 425374 425547 425706 425933 426404 426957 427127 426692
51075 426692 425864 424924 423983 423253 423156 423942 425360 426962 428635 430749 433771 437735 442128 446501 451272 457624
51059 457624 466295 476732 487732 498664 509584 520464 530995 541171 551368 561707 571899 581830
51047 581830 591696 601357 610155 617620 623754 628297 630360 629349 625855 621087 615754 610028 604168 598498
51033 598498 592846 586616 579489 571691 563637 555698 548265 541621 535684 530214 525350 521675 519654 519215
51019 519215 519990 521896 525409 531163 539103 548035 556364 563460 570039 577068 584684 592490 600446 608862
51005 608862 617728 626658 635480 644414 653572 662627 671068 678519 684894 690554 696235 702458 708940 714878
50991 714878 719752 723603 726676 729276 731968 735445 740089 746006 753558 763424 775976 790971 808043
50978 808043 827152 848330 871310 895677 921227 948021 976356 1006869 1040496 1078118 1120352
50967 1120352 1167695 1220565 1279044 1342837 1411709 1485692 1564622 1647590 1733159 1819964 1906833
50956 1906833 1992384 2074787 2152077 2222656 2285527 2340095 2385762 2421755 2447554 2463463 2470480
50945 2470480 2469409 2460334 2443236 2419042 2389741 2357438 2323391 2287974 2251231 2213299 2174463 2135193
50933 2135193 2096288 2058733 2023028 1988548 1953799 1917519 1879392 1839658 1798376 1755479 1711285
50922 1711285 1666371 1620807 1574028 1525724 1476521 1427580 1379828 1333868 1290280 1249472 1211258
50911 1211258 1175018 1140488 1108195 1078958 1053053 1029926 1008708 988905 970572 953882 938693
50900 938693 924663 911696 900053 890014 881578 874539 868628 863497 858817 854601 851340 849624 849649 851097
50886 851097 853394 856062 858917 862041 865551 869500 874133 880055 887702 896661 905999 915490 926058 938698
50872 938698 953340 969217 985974 1003856 1023031 1043394 1065040 1088376 1113727 1141334 1171845
50861 1171845 1206236 1245055 1288232 1335941 1389210 1449312 1516960 1592556 1676918 1771159 1875923
50850 1875923 1991265 2117260 2254245 2402330 2561117 2730071 2908693 3095921 3289550
50841 3289550 3486571 3683910 3878525 4066835 4244481 4406779 4549354 4668533 4761624 4827112
50831 4827112 4864512 4874066 4856881 4815430 4753487 4675080 4583641 4482437 4375633 4268178 4164318
50820 4164318 4066403 3975250 3891165 3814121 3743099 3675891 3609878 3542844 3472978 3398533 3318027
50809 3318027 3230869 3137395 3038068 2932857 2821772 2705914 2587609 2469313 2352718 2239050
50799 2239050 2129811 2026624 1930369 1841025 1758490 1683193 1615654 1555858 1503385 1457922 1419217
50788 1419217 1386690 1359611 1337695 1321041 1309219 1300732 1293807 1287631 1282577 1279194 1277168 1275340 1272550
50775 1272550 1268328 1262876 1256581 1249623 1241977 1233630 1224671 1215141 1204829 1193342 1180458 1166441 1151987
50762 1151987 1137802 1124266 1111429 1099243 1087726 1076983 1067185 1058577 1051442 1046044 1042621 1041409
50750 1041409 1042579 1046137 1051954 1059986 1070558 1084406 1102365 1124881 1151829 1182916 1218287 1258583
50738 1258583 1304382 1355816 1412867 1475832 1545200 1621082 1703003 1790218 1882003 1977676 2076640
50727 2076640 2178435 2282536 2387967 2493283 2596897 2697159 2792038 2879055 2955745 3020004
50717 3020004 3069878 3103409 3119051 3116238 3095438 3057881 3005606 2941592 2869407 2792494 2713860
50706 2713860 2636307 2562570 2494914 2434619 2381854 2336021 2296207 2261405 2230345 2201145 2171348
50695 2171348 2138576 2101295 2058956 2011526 1959079 1901910 1840844 1777168 1712248 1647321 1583618
50684 1583618 1522459 1464939 1411537 1362355 1317850 1279053 1246786 1220841 1200357 1184911 1174792
50673 1174792 1170121 1170223 1174157 1181503 1192252 1206089 1222144 1239319 1256613 1273320 1289243 1304702
50661 1304702 1320032 1335144 1349775 1364001 1378137 1392180 1405728 1418518 1430722 1442656 1454478
50650 1454478 1466285 1478218 1490373 1502956 1516763 1533271 1553774 1578370 1605999 1635640 1667344
50639 1667344 1701999 1740153 1781283 1824241 1868108 1912276 1955904 1997891 2037678 2075644 2112386
50628 2112386 2147810 2181310 2212602 2241772 2268419 2291067 2307513 2315612 2313923 2302257 2281997 2255798
50616 2255798 2226745 2197585 2170338 2146150 2125518 2108868 2096818 2089505 2085834 2083939 2082449 2080726
50604 2080726 2077784 2071713 2060588 2043467 2020075 1990053 1953220 1910354 1863008 1812510 1759564 1704766
50592 1704766 1648992 1593169 1538089 1484631 1433848 1386624 1343351 1303932 1267848 1234285 1202565
50581 1202565 1172662 1145019 1119751 1096318 1074205 1053723 1035835 1021279 1010093 1001867 996127 992460
50569 992460 990575 990448 992230 995883 1001109 1007809 1016440 1027552 1041026 1056158 1072614 1090896 1111577
50556 1111577 1134267 1157743 1181015 1203950 1226849 1249749 1272254 1293888 1314575 1334865 1355570
50545 1355570 1376945 1398377 1419254 1440081 1462278 1486899 1514116 1544051 1577388 1614678 1655589
50534 1655589 1699535 1746778 1798260 1854506 1915325 1980631 2050931 2126778 2208200 2294885 2386566
50523 2386566 2482849 2582814 2685028 2788000 2890555 2991689 3089933 3182836 3267339 3340923
50513 3340923 3402218 3450252 3483532 3500462 3500553 3484526 3453144 3406773 3346490 3275073 3196309 3113586
50501 3113586 3029616 2947186 2869472 2799440 2739218 2690048 2652570 2627148 2614094 2613452 2624282 2644188
50489 2644188 2669740 2697353 2723599 2744991 2758090 2760090 2749172 2724250 2684701 2630540 2562731
50478 2562731 2483255 2394889 2300741 2203615 2105578 2008203 1913082 1821847 1735656 1655024 1580296
50467 1580296 1511977 1450322 1394900 1344869 1299693 1259413 1224354 1194769 1170613 1151372 1136155
50456 1136155 1124192 1115207 1109093 1105321 1103055 1101888 1102106 1104032 1107484 1112197 1118575 1127542 1139620 1154397
50442 1154397 1171037 1189031 1208241 1228348 1248457 1267254 1283439 1296081 1304857 1310206 1313236 1315267
50430 1315267 1317225 1319395 1321696 1324130 1326973 1330615 1335271 1340823 1346922 1353352 1360440 1368984 1379600 1392232
50416 1392232 1406553 1422857 1442167 1465260 1491971 1521813 1555005 1592286 1633719 1678234 1724567
50405 1724567 1772146 1820729 1869591 1917567 1963751 2007672 2048745 2085945 2118006 2143673 2161709
50394 2161709 2171003 2170777 2160509 2139739 2108404 2067570 2019435 1966317 1909860 1851422 1792898 1736696
50382 1736696 1684860 1638492 1598004 1563714 1536151 1515944 1503416 1498214 1499355 1505606 1515646 1527775
50370 1527775 1539806 1549565 1555414 1556131 1550646 1538395 1519763 1495650 1466598 1432784 1394877 1354289
50358 1354289 1312352 1269719 1226875 1184776 1144529 1106637 1070936 1037167 1005368 975819 948911
50347 948911 925009 904285 886785 872774 862744 856897 854804 855800 859491 865642 873758 883045 892550
50334 892550 901067 907260 910400 910875 909555 906735 902123 895780 888588 881784 876418 873215 872421 873626 876165
50319 876165 879790 884640 890556 896853 902830 908131 912593 916279 919761 923697 927844 931025 932484 932905
50305 932905 933739 935872 939208 943158 947124 950930 955198 961041 969016 978637 989211 1000711 1013457 1027493
50291 1027493 1042943 1060633 1081672 1106671 1135912 1169618 1206748 1243439 1273806 1292949 1298903
50280 1298903 1292005 1273666 1246388 1213953 1180282 1147968 1118197 1091685 1069081 1050618 1035974
50269 1035974 1024582 1015811 1008920 1003171 998032 993129 988125 982915 977885 973683 970622 968408 966473 964518
50255 964518 962811 962008 962706 965149 969395 975562 983661 993258 1003699 1014812 1027092 1040982 1056213
50242 1056213 1072104 1088273 1104834 1121972 1139556 1157096 1173975 1189822 1204766 1219130 1232731
50231 1232731 1244602 1253523 1258563 1259083 1254611 1245133 1231351 1214280 1194648 1172968 1150089 1127323
50219 1127323 1105937 1086687 1069769 1054883 1041267 1027896 1013828 998405 981218 962098 941245
50208 941245 919296 897196 875934 856210 838234 821885 807075 793808 781837 770563 759485
50197 759485 748659 738526 729413 721318 713969 706864 699451 691600 683836 676805 670585 664825 659409 654550
50183 654550 650185 645762 640911 636029 631833 628443 625270 621828 618325 615225 612455 609451 606032 602743
50169 602743 599992 597286 594035 590928 589615 590688 592783 594243 595004 596093 597853 599770 601844 604931
50155 604931 609437 614699 620121 626099 633111 640527 647227 653106 659110 665746 672247 677439 681036 683839
50141 683839 686961 691038 696099 702000 709012 717871 729207 743040 759136 777781 799822 825814 855357
50128 855357 887498 921572 957350 994434 1031894 1068732 1104598 1139932 1175452 1211579 1248228
50117 1248228 1284882 1320694 1354550 1385126 1410926 1430446 1442522 1446668 1443016 1431944 1413892 1389536
50105 1389536 1359878 1326082 1289392 1251270 1213277 1176499 1141269 1107680 1076176 1047237 1020662
50094 1020662 995656 971740 949189 928487 909683 892466 876610 862213 849628 839222 830986
50083 830986 824375 818841 814499 811847 810755 810267 809761 809792 811214 813756 816148 817616 818600 819791 821003
50068 821003 821428 820735 819422 818048 816467 814051 810537 806464 802684 799542 796625 793276 789246 784866 780691
50053 780691 777027 773772 770586 767274 763971 760964 758426 756493 755518 756021 758293 762202 767451 773844 781174
50038 781174 789066 797143 805310 813763 822789 832671 843599 855371 867177 877962 887139 894895 901776
50025 901776 908159 914141 919668 924481 928024 929814 930105 929948 930315 931193 931825 931802 931639 932325 934788 939959
50009 939959 948634 960599 974165 987418 1000069 1013519 1029000 1046247 1064277 1082826 1102404 1123196
49997 1123196 1144518 1165271 1184448 1201070 1213978 1221899 1223740 1218876 1207239 1189114 1164829 1134834
49985 1134834 1100121 1062265 1022886 983240 944457 907776 874088 843440 815367 789734 766924
49974 766924 747270 730619 716409 703921 692513 681976 672681 665025 658691 652766 646739 641043 636465
49961 636465 633278 631207 630049 630020 631464 634442 638683 643884 649929 656741 663955 670908 677021 682151 686506
49946 686506 690306 693615 696357 698381 699568 699954 699664 698612 696468 693037 688492 683079 676744 669284 660688
49931 660688 651173 641060 630835 621117 612265 604234 597070 591132 586389 581889 576739 571571 568207 567685
49917 567685 569242 571409 573428 575311 577207 579341 582167 585991 590657 595986 602263 609874 618678 628219
49903 628219 638371 649336 661025 672840 684034 693967 702120 708282 712807 716381 719397 721631 722422
49890 722422 721012 716854 709980 701090 691095 680580 669816 659120 648860 639152 629852 620867 612251
49877 612251 604093 596575 590053 584711 580180 575913 572061 569549 569059 570188 571792 573029 573924 575128 577311
49862 577311 580638 584790 589601 595650 603864 614416 626328 638341 649846 660678 670455 678697 685473
49849 685473 691318 696433 700461 703176 704862 705628 704785 701485 695853 688959 681663 673983 665754 657412 649710
49834 649710 642924 636797 631176 626322 622574 620102 619041 619473 621095 623187 625263 627561 630661 634752
49820 634752 639513 644588 649848 655234 660648 666093 671707 677508 683190 688245 692263 695178 697302 699071
49806 699071 700597 701477 701168 699507 696722 693035 688521 683368 677993 672724 667515 662110 656328 650069 643206
49791 643206 635686 627730 619781 612202 605103 598508 592626 587874 584557 582508 581140 579926 578783 577919
49777 577919 577456 577428 578074 579832 582927 587220 592530 598880 606167 613802 621010 627454 633313 638716 643382
49762 643382 646967 649551 651540 653130 654030 653743 652005 648940 644866 639981 634188 627188 618910 609914 601257
49747 601257 593787 587602 582295 577655 573862 571027 568860 566958 565232 563904 563244 563417 564398 565884 567463
49732 567463 569089 571158 573958 577271 580813 584734 589231 593895 598124 602157 607109 613787 622019 631310
49718 631310 641532 652536 663541 673475 681746 688262 692882 695235 695030 692221 687003 679957 672089 664349
49704 664349 657155 650664 645354 641876 640325 639999 640039 639994 639663 638739 636903 634284 631649 630022 630002 631382
49688 631382 633536 636238 639905 644967 651258 658296 665907 674193 683038 692199 701947 713174 726668 742436
49674 742436 759767 777526 794221 808155 817963 823155 824164 822004 817880 812882 807865 803592 800842
49661 800842 800148 801401 803849 806433 807971 807158 802848 794538 782509 767582 751019 734411 719095
49648 719095 705501 693379 682659 673651 666378 660350 655263 651368 648799 647066 645630 644543 643960 643433
49634 643433 642316 640609 638775 636829 634213 630552 626008 620880 615366 609777 604512 599679 595068 590584
49620 590584 586415 582806 580000 578322 577850 577976 577852 577402 577396 578349 579855 581281 582643 584384 586607 589015
49604 589015 591422 593923 596620 599490 602474 605457 608170 610370 612119 613773 615667 617902 620350 622832
49590 622832 625331 628028 630999 633945 636462 638582 640787 643357 646094 648801 651747 655353 659601 664002
49576 664002 668028 671432 674386 677484 681373 686167 691464 697150 703812 711960 721138 730342 739161 748021
49562 748021 757277 766465 774457 780089 782785 782992 781922 780429 778237 774772 770555 766985 764667 762791
49548 762791 760582 758593 757974 758994 760963 763301 765983 769083 772534 776307 780303 784137 787560 791109
49534 791109 795814 802198 810012 818999 829309 841002 853758 867522 883024 901171 922122 945260
49522 945260 969785 994850 1019294 1041770 1061204 1076858 1088127 1094841 1097857 1098848 1099168 1099186 1098922 1098909
49508 1098909 1099887 1101711 1103090 1102594 1099577 1093890 1085086 1072527 1056330 1037734 1018196 998350 978147
49495 978147 957781 938040 919765 903359 888868 876113 864618 853831 843725 834908 827885 822544
49483 822544 818648 816366 815752 815978 815821 814859 813607 812475 811318 810182 809749 810571 812316 814211 815869 817332
49467 817332 818691 820154 822211 825177 828650 831831 834290 836172 837850 839674 841801 843769 844435 842883
49453 842883 839406 835234 831320 827708 823909 819407 813958 807877 802043 797125 792927 788980 785613 783712
49439 783712 783466 784223 785679 788365 792703 798506 805886 815688 828295 842736 857904 874128 892602
49426 892602 913568 936105 959585 984445 1011401 1040554 1071165 1101435 1128374 1148847 1161375
49415 1161375 1166670 1166409 1162108 1155259 1147640 1140762 1135339 1131744 1130552 1132111 1135888 1140889 1146700 1153690
49401 1153690 1162231 1172197 1183327 1195613 1208957 1222606 1235371 1246674 1257202 1268085 1279289 1289152
49389 1289152 1295819 1298876 1299143 1297196 1292794 1285749 1276534 1265727 1253498 1240132 1226542 1213719 1202005
49376 1202005 1191364 1182062 1174538 1168800 1164519 1161635 1160368 1160766 1162651 1165878 1170166 1174750 1178732 1181778
49362 1181778 1183961 1185030 1184450 1182229 1179054 1175448 1171386 1166928 1162561 1158520 1154306 1149429 1144269 1139763
49348 1139763 1136509 1134573 1133776 1133661 1133435 1132531 1131141 1129706 1128028 1125412 1121609 1117099 1112404 1107619 1102726
49333 1102726 1097862 1093083 1088249 1083378 1078905 1075365 1073017 1071812 1071491 1071703 1072330 1073820 1076917 1081928 1088459
49318 1088459 1095902 1103913 1112401 1121498 1131704 1143733 1157995 1174454 1193002 1213564 1235691 1258590
49306 1258590 1281846 1305627 1329763 1352994 1373547 1390109 1401860 1408053 1408312 1403197 1393843 1381137
49294 1381137 1365783 1348998 1332368 1316923 1302826 1289978 1278341 1267651 1257515 1248037 1239848 1233231
49282 1233231 1227668 1222507 1217711 1213723 1210954 1209561 1209394 1209914 1210545 1211236 1212355 1213988 1215775 1217582 1219685
49267 1219685 1222000 1223659 1223777 1222209 1219233 1215031 1209908 1204464 1198978 1193046 1186489 1180211 1175462 1172582
49253 1172582 1171201 1171321 1173222 1176328 1179085 1180190 1179206 1175833 1169453 1159903 1148132 1135571 1123090 1110853
49239 1110853 1098821 1087059 1075828 1065725 1057487 1051376 1046992 1044002 1042809 1044094 1047843 1053187 1059204
49226 1059204 1065499 1071943 1078198 1083906 1089282 1095230 1102584 1111268 1120391 1129167 1137499 1145598 1153412 1160751
49212 1160751 1167724 1174580 1181227 1187379 1193245 1199686 1207491 1216780 1227186 1238288 1249687 1261040 1272359
49199 1272359 1284172 1297021 1310780 1324662 1337892 1350187 1361430 1371186 1378939 1384976 1390598 1397043
49187 1397043 1404315 1411516 1418201 1424727 1431302 1437636 1444005 1451827 1462382 1475533 1490622 1508158 1529538
49174 1529538 1555308 1584832 1617664 1653984 1693310 1733742 1772955 1809139 1840710 1866194 1885262
49163 1885262 1899221 1909736 1917498 1922700 1926127 1928951 1931803 1934833 1938288 1942270 1946182 1949296 1951917
49150 1951917 1955269 1960210 1966636 1974163 1982826 1992944 2004749 2018234 2033094 2048782 2064944 2081730
49138 2081730 2099410 2117745 2136101 2154085 2171775 2189478 2207604 2226564 2246295 2265983 2284756
49127 2284756 2302586 2320041 2337342 2354289 2371070 2388354 2406396 2424790 2443511 2463604 2486352
49116 2486352 2512189 2541081 2573825 2612348 2658607 2713652 2778153 2853630 2942651 3047169 3166263
49105 3166263 3295403 3428244 3559781 3688455 3815424 3941080 4061177 4165980 4244086 4288277
49095 4288277 4298405 4279175 4235835 4172019 4090313 3993240 3883502 3764262 3639699 3514791
49085 3514791 3394176 3281327 3178640 3087579 3008441 2940415 2882322 2833206 2792236 2758398 2730500
49074 2730500 2707226 2687139 2668994 2652272 2637176 2624019 2612709 2602702 2593008 2582350 2569904
49063 2569904 2556134 2542397 2529505 2517049 2504286 2491094 2477670 2463789 2449001 2433400 2417736
49052 2417736 2402805 2389038 2376598 2365515 2355733 2347236 2340131 2334548 2330528 2328117 2327384 2328173 2329935
49039 2329935 2331897 2333276 2333398 2331987 2329540 2327159 2325704 2325207 2325149 2325048 2324614 2323674 2322298 2320792 2319284 2317442
49023 2317442 2314931 2312024 2309444 2307595 2306172 2304527 2302227 2299318 2296248 2293704 2292397 2292806 2294838 2297665
49009 2297665 2300202 2302074 2303969 2306642 2309729 2312126 2313518 2314809 2316771 2319032 2320873 2322410 2324252 2326320
48995 2326320 2327756 2327981 2327266 2326311 2325677 2325583 2325790 2325704 2324969 2323950 2323269 2322995 2322681 2322014 2320860 2318744 2315026
48978 2315026 2309754 2303732 2297493 2290696 2282881 2274317 2265611 2256832 2247551 2237659 2227701 2218375 2210051 2202838
48964 2202838 2196864 2192342 2189463 2188313 2188889 2191190 2195257 2201064 2208340 2216615 2225555 2235218 2245902 2257748
48950 2257748 2270645 2284501 2299419 2315390 2331849 2347830 2362729 2376841 2390974 2405698 2421227
48939 2421227 2437856 2456023 2475806 2496830 2518942 2542658 2568624 2596902 2627160 2659291 2693357
48928 2693357 2729038 2765645 2802779 2840597 2879374 2919172 2960084 3002493 3046825 3093073 3140587
48917 3140587 3188281 3235242 3281369 3327330 3373660 3420029 3465669 3510212 3553607 3595371 3634750
48906 3634750 3671735 3707230 3741851 3775159 3806463 3835826 3863720 3890163 3914878 3938012 3959969
48895 3959969 3980599 3999260 4015749 4030459 4043418 4053767 4060631 4064216 4065602 4065604 4064050 4060105 4053029
48882 4053029 4042726 4029771 4014924 3998518 3980336 3960038 3937534 3912833 3885730 3855890 3823259
48871 3823259 3788260 3751636 3714163 3676381 3638378 3599814 3560351 3520136 3479827 3440120 3401356
48860 3401356 3363637 3327207 3292588 3260236 3230061 3201408 3173708 3147203 3122878 3101538 3082972
48849 3082972 3066148 3050177 3035043 3021527 3010546 3002435 2996648 2992222 2988749 2986819 2987244 2989953 2994067
48836 2994067 2999099 3005557 3014153 3024879 3037244 3050991 3066027 3081907 3097985 3114076 3130431 3147056
48824 3147056 3163607 3180039 3196794 3214169 3231981 3250158 3269118 3289152 3309807 3330467 3351277
48813 3351277 3372901 3395442 3418276 3441031 3464170 3488290 3513253 3538434 3563608 3589165 3615491
48802 3615491 3642510 3669977 3697864 3726174 3754488 3782083 3808593 3834276 3859408 3883546 3905640
48791 3905640 3924828 3940951 3954451 3966011 3976194 3984971 3991463 3994476 3993496 3988945 3981439 3971157 3958104
48778 3958104 3942530 3924599 3903880 3879744 3852297 3822571 3791715 3760166 3727607 3693452 3657356
48767 3657356 3619533 3580719 3541768 3503223 3465237 3427718 3390361 3352810 3315137 3278139 3242855
48756 3242855 3209727 3178486 3148826 3120837 3094693 3070209 3046965 3024780 3003942 2984949 2968073
48745 2968073 2953160 2939977 2928792 2920332 2914958 2912082 2910776 2910754 2912253 2915034 2918115 2920751 2923205 2926226
48731 2926226 2930117 2934620 2939449 2944531 2949933 2955824 2962341 2969245 2975916 2982013 2987896 2993929 2999540 3003535
48717 3003535 3005385 3005668 3005099 3003631 3000872 2996975 2992622 2988277 2983899 2979363 2974799 2970400 2966262 2962620
48703 2962620 2959987 2958783 2958934 2960043 2961939 2964792 2968637 2972984 2977070 2980412 2982988 2984978 2986480 2987544
48689 2987544 2988357 2989317 2990868 2993245 2996343 2999862 3003610 3007688 3012326 3017539 3022951 3027979 3032278 3035981
48675 3035981 3039520 3043261 3047460 3052510 3058881 3066570 3074795 3082563 3089397 3095041 3098384 3097195 3089286 3073779
48661 3073779 3051100 3022067 2987322 2947458 2903232 2855666 2806246 2756944 2709608 2665094 2623135
$$ [...]
##END NTUPLES=NMR SPECTRUM
##END=
