##TITLE=AC1770_SANT_16_9683695_JZeJOlkGhm
##JCAMPDX= 6.0         $$ Bruker NMR JCAMP-DX V2.0
##DATA TYPE= NMR SPECTRUM
##DATA CLASS= NTUPLES
##ORIGIN= BRUKER
##OWNER= Administrator
$$ 1.72 TOPSPIN		Version 2.1
$$ 2016-04-16 22:58:41.908 -0700  Administrator@X
$$ Compression mode = diff/dup
##.OBSERVE FREQUENCY= 400.02188249412
##.OBSERVE NUCLEUS= ^1H
##.ACQUISITION MODE= SIMULTANEOUS (DQD)
##.ACQUISITION SCHEME= undefined
##.AVERAGES= 8
##.DIGITISER RES= 22
##SPECTROMETER/DATA SYSTEM= spect
##.PULSE SEQUENCE= zg30
##.SOLVENT NAME= COFFEE_meoh
##.SHIFT REFERENCE= INTERNAL, COFFEE_meoh, 1, 14.98509
##AUDIT TRAIL= $$ (NUMBER, WHEN, WHO, WHERE, PROCESS, VERSION, WHAT)
$$ ##TITLE= Audit trail, TOPSPIN		Version 2.1
$$ ##JCAMPDX= 5.01
$$ ##ORIGIN= Bruker BioSpin GmbH
$$ ##OWNER= Administrator
$$ $$ E:\/data/COFFEE/nmr/AC1770_SANT_16_9683695_JZeJOlkGhm/20/pdata/1/auditp.txt
$$ ##AUDIT TRAIL=  $$ (NUMBER, WHEN, WHO, WHERE, PROCESS, VERSION, WHAT)
(   1,<2016-04-16 22:58:34.736 -0700>,<Administrator>,<X>,<go>,<TOPSPIN 2.1>,
      <created by zg
	started at 2016-04-16 22:57:28.501 -0700,
	POWCHK enabled, PULCHK disabled,
       configuration hash MD5:
       21 0F 79 D6 B3 7B B4 F6 88 20 88 DB 03 48 BD 9F
       data hash MD5: 64K
       5D 03 ED 63 8A 24 D0 A5 C9 42 1E 11 DD 42 D3 14>)
(   2,<2016-04-16 22:58:37.876 -0700>,<Administrator>,<X>,<proc1d>,<TOPSPIN 2.1>,
      <Start of raw data processing
       efp LB = 0 FT_mod = 6 PKNL = 1 PHC0 = 0 PHC1 = 0 SI = 32K 
       data hash MD5: 32K
       AE B2 9E 4B 2F 3E 12 AA DF 75 BC E3 6C 6B EE 9C>)
(   3,<2016-04-16 22:58:38.173 -0700>,<Administrator>,<X>,<proc1d>,<TOPSPIN 2.1>,
      <pk PHC0 = 88.396 PHC1 = 0 
       data hash MD5: 32K
       FE 9F 24 02 B3 B4 50 B1 AC 26 3E CC C1 B8 22 6B>)
(   4,<2016-04-16 22:58:38.283 -0700>,<Administrator>,<X>,<proc1d>,<TOPSPIN 2.1>,
      <abs ABSG = 1 
       data hash MD5: 32K
       8D 84 6D 5E 13 6B 8D D8 D6 A8 23 F0 E1 2F 9D E2>)
(   5,<2016-04-16 22:58:38.345 -0700>,<Administrator>,<X>,<proc1d>,<TOPSPIN 2.1>,
      <abs ABSG = 2 
       data hash MD5: 32K
       2D 63 15 CE 6A FF 29 95 79 C7 37 5F 14 5A 2D B9>)
(   6,<2016-04-16 22:58:38.408 -0700>,<Administrator>,<X>,<proc1d>,<TOPSPIN 2.1>,
      <abs ABSG = 3 
       data hash MD5: 32K
       2F 9E 6F 2F 24 03 76 0E 8F 5A 0D 3E 58 B4 94 07>)
(   7,<2016-04-16 22:58:38.470 -0700>,<Administrator>,<X>,<proc1d>,<TOPSPIN 2.1>,
      <abs ABSG = 4 
       data hash MD5: 32K
       F1 FE E1 F0 74 6C D1 A5 62 58 1B 72 24 02 24 3A>)
(   8,<2016-04-16 22:58:38.517 -0700>,<Administrator>,<X>,<proc1d>,<TOPSPIN 2.1>,
      <abs ABSG = 5 
       data hash MD5: 32K
       32 41 BB 89 36 5C A1 3C 25 59 68 F2 CF FB 46 FC>)
$$ ##END=
$$ 
$$ $$ hash MD5
$$ $$ BC 4A FF A3 9C A1 C0 37 18 DE 61 9C 39 A3 34 DE
##$RELAX= 
##$RELAX= 
##$RELAX= 
##$RELAX= 
##$RELAX= 
##$RELAX= 
##$RELAX= 
$$ Bruker specific parameters
$$ --------------------------
##$DU= <E:\>
##$EXPNO= 20
##$NAME= <AC1770_SANT_16_9683695_JZeJOlkGhm>
##$PROCNO= 1
$$ [...]
##$TP= (0..7)
150 150 150 150 150 150 150 150
##$TP07= 0
##$TPNAME0= <>
##$TPNAME1= <>
##$TPNAME2= <>
##$TPNAME3= <>
##$TPNAME4= <>
##$TPNAME5= <>
##$TPNAME6= <>
##$TPNAME7= <>
##$TPOAL= (0..7)
0.5 0.5 0.5 0.5 0.5 0.5 0.5 0.5
##$TPOFFS= (0..7)
0 0 0 0 0 0 0 0
##$TUNHIN= 0
##$TUNHOUT= 0
##$TUNXOUT= 0
##$USERA1= <user>
##$USERA2= <user>
##$USERA3= <user>
##$USERA4= <user>
##$USERA5= <user>
##$V9= 5
##$VALIST= <valist>
##$VCLIST= <CCCCCCCCCCCCCCC>
##$VD= 0
##$VDLIST= <DDDDDDDDDDDDDDD>
##$VPLIST= <PPPPPPPPPPPPPPP>
##$VTLIST= <TTTTTTTTTTTTTTT>
##$WBST= 2048
##$WBSW= 25
##$XGAIN= (0..3)
0 0 0 0
##$XL= 0
##$YL= 0
##$YMAX_a= 556518
##$YMIN_a= -488484
##$ZGOPTNS= <>
##$ZL1= 120
##$ZL2= 120
##$ZL3= 120
##$ZL4= 120
##$ABSF1= 14.98509
##$ABSF2= -5.573092
##$ABSG= 5
##$ABSL= 3
##$ALPHA= 0
##$AQORDER= 0
##$ASSFAC= 0
##$ASSFACI= 0
##$ASSFACX= 0
##$ASSWID= 0
##$AUNMP= <proc_prof1d_extract_pilot.lims>
##$AXLEFT= 0
##$AXNAME= <>
##$AXNUC= <1H>
##$AXRIGHT= 0
##$AXTYPE= 0
##$AXUNIT= <>
##$AZFE= 0.1
##$AZFW= 0.1
##$BCFW= 0
##$BC_mod= 0
##$BYTORDP= 0
##$COROFFS= 0
##$CY= 15
##$DATMOD= 1
##$DC= 0
##$DFILT= <>
##$DTYPP= 0
##$F1P= 0
##$F2P= 0
##$FCOR= 0.5
##$FTSIZE= 32768
##$FT_mod= 6
##$GAMMA= 0
##$GB= 0
##$INTBC= 1
##$INTSCL= 1
##$ISEN= 128
##$LB= 0
##$LEV0= 0
##$LPBIN= 0
##$MAXI= 10000
##$MC2= 0
##$MEAN= 0
##$ME_mod= 0
##$MI= 0
##$NCOEF= 0
##$NC_proc= -8
##$NLEV= 6
##$NOISF1= 0
##$NOISF2= 0
##$NSP= 0
##$NTH_PI= 0
##$NZP= 0
##$OFFSET= 14.98509
##$PC= 1
##$PHC0= 88.396
##$PHC1= 0
##$PH_mod= 1
##$PKNL= yes
##$PPARMOD= 0
##$PPDIAG= 0
##$PPIPTYP= 0
##$PPMPNUM= 2147483647
##$PPRESOL= 1
##$PSCAL= 4
##$PSIGN= 0
##$PYNMP= <proc.py>
##$REVERSE= no
##$SF= 400.02
##$SI= 32768
##$SIGF1= 0
##$SIGF2= 0
##$SINO= 400
##$SIOLD= 32768
##$SPECTYP= <>
##$SREGLST= <1H.CDCl3>
##$SSB= 0
##$STSI= 32768
##$STSR= 0
##$SW_p= 8223.68421052631
##$SYMM= 0
##$S_DEV= 0
##$TDeff= 65536
##$TDoff= 0
##$TI= <>
##$TILT= no
##$TM1= 0
##$TM2= 0
##$TOPLEV= 0
##$USERP1= <user>
##$USERP2= <user>
##$USERP3= <user>
##$USERP4= <user>
##$USERP5= <user>
##$WDW= 1
##$XDIM= 32768
##$YMAX_p= 441849719
##$YMIN_p= -703054
##$CURPLOT= <Network HP LaserJet P1505>
##$CURPRIN= <$Network HP LaserJet P1505>
##$DFORMAT= <normdp>
##$LAYOUT= <+/1D_H.xwp>
##$LFORMAT= <normlp>
##$PFORMAT= <normpl>
##$SURQMSG= 1
$$ End of Bruker specific parameters
$$ ---------------------------------
##NTUPLES= NMR SPECTRUM
##VAR_NAME=  FREQUENCY,     SPECTRUM/REAL,   SPECTRUM/IMAG
##SYMBOL=    X,             R,               I
##VAR_TYPE=  INDEPENDENT,   DEPENDENT,       DEPENDENT
##VAR_FORM=  AFFN,          ASDF,            ASDF
##VAR_DIM=   32768,         32768,           32768
##UNITS=     HZ,            ARBITRARY UNITS, ARBITRARY UNITS
##FACTOR=    0.250966925370066, 1,           1
##FIRST=     8223.43324360094, 126051,       -22491
##LAST=      0,             -125234,         -76496
##MIN=       0,             -703054,         0
##MAX=       8223.43324360094, 441849719,    0
$$ Real data points
##PAGE= N=1
##DATA TABLE= (X++(R..R)), XYDATA
$$ [...]
23903 238442 -174801 99799 183105 220455 148326 -42147 169774 -156067 -275936 338935
23892 -24393 -345926 -233128 -86160 286929 -86000 58593 -186821 -19074 -121823 10837 75911
23881 75911 -357250 22800 -136150 54760 -127963 69059 -12135 16503 -51116 -8109 128723
23869 -38674 -48579 -369970 105555 -123062 -222564 -457893 -11826 -83643 -41027 47755 260928
23858 260928 23411 -163498 150549 79053 -7820 280058 12258 129010 -17511 192706 -8762
23846 137366 -19466 102413 162608 207435 -81543 141265 -55048 179576 -362845 -244268
23836 -244268 -119861 125705 239834 -311668 -270486 -330724 197860 -51290 356237 -180900
23825 103264 356727 -74041 240985 -196011 -143191 -111593 -115177 -411229 54115 -35458 -236171
23814 -236171 88093 13617 -144006 -156186 -85012 -172541 -224123 -44425 -50009 50990 -10757
23802 -75080 -45809 -220719 -233498 -31741 174030 -411526 -6174 200421 178265 -153173 -337651
23791 -337651 173606 179231 -89350 -125465 -42118 -147473 137363 -267148 42941 -14164 -163605
23780 -163605 68057 244535 -65158 -136876 -78406 -6293 -2901 -15144 -345632 -145568 -15810
23768 -73204 -230400 -317318 92709 370705 28493 267073 -82084 -148138 197731 -117727 35446
23756 -73071 -341952 36211 -18952 -271069 -60579 -239686 29164 -141823 20608 -76511 -9532
23744 58955 199883 176100 -92094 116048 -94397 289273 -161063 -53073 298459 86767 177084
23733 177084 118279 -21744 -14694 -48419 -52086 241102 -457538 -118566 137173 -31096 -158106
23722 -158106 -39546 -212660 191248 -202543 -155873 152611 388285 -277572 -23291 -195554
23712 -195554 -8475 -179653 64129 91979 -52779 -197046 68103 -186150 61709 -77499 -385695
23701 -385695 245787 7439 -76498 -89725 137153 -97732 283653 -51870 258533 -126293 71820
23689 -133789 -78956 -128965 -26015 -172674 -243308 88197 79484 -37299 383185 255111 147086
23678 147086 -247746 -39105 37899 -138216 -80446 -117596 355678 -325648 -97016 -2626 44530
23666 -186936 26142 183659 -111575 -109493 142792 200292 220016 114181 -12754 199991 138408
23655 138408 51290 -300093 -7787 -124196 28964 92186 -13746 -15451 -26685 -106587 -75493
23644 -75493 -252364 254324 -21866 -44300 209812 -192618 36203 -369485 -48580 -92970 89802
23632 -89505 -181797 282571 -182807 48655 -271717 19845 -286004 23943 164423 259306 128864
23620 -132731 -88362 -171983 -253082 140101 56853 -12680 -160862 -34497 -46700 -178999 -268017
23609 -268017 427373 190801 33865 -91609 -60055 115088 -51175 -150945 -151779 -18370 369436
23597 -184882 -96921 -293938 250084 -96791 11425 113669 -72529 -75834 -156361 189114 190489
23586 190489 -327653 375453 -113896 -6039 240685 127028 247920 59585 131505 1580 65124
23575 65124 3972 176655 149355 68559 -41360 -366801 -119848 -142272 -18191 -34009 -413775
23564 -413775 411877 -149431 -100011 120480 -81689 43998 -297009 12147 -53807 -112856 24945
23552 -241156 -89016 48270 -72190 62036 -175359 -49822 -328527 -85581 -261114 -24995 -281161
23541 -281161 -202316 -242690 463367 186267 156356 -349251 23771 -173922 43302 210720
23531 210720 105872 -19538 -143004 36899 -9479 -4899 -330960 7966 -287298 11953 -75585
23519 -128049 187266 -99391 74659 234958 -10977 -2976 -297763 72645 -317802 -358094 171895
23507 125637 -16318 -62564 -135494 114244 16512 298714 -204643 151889 221244 137399 -110184
23495 -305481 -191096 14079 -144296 87861 -327751 121112 -59583 -215397 287677 -12874
23484 -80279 206541 8647 250564 -199291 -188642 142146 -163120 -334915 -273230 -105456
23473 -265914 181284 -60099 91438 124161 -193237 -21115 -75576 106524 -31393 70017 -377824
23461 -296245 -52899 -63369 -19702 123071 -40846 -207105 250748 -448303 -3910 -110190 153441
23449 -343110 -57213 -180240 -209410 76027 542 209093 -175330 -97333 25102 -152753 -192302
23438 -192302 263022 10788 75056 -91843 -260197 -213239 -54000 103568 53351 166448 78843
23426 82763 162558 54635 52748 -145916 -66386 229454 -133636 102796 -72158 -162214 17712
23414 177322 -192323 437317 -42480 84899 212463 191144 114340 -59504 -88641 -241812 -135191
23403 -135191 248376 -176510 -244734 290206 382457 227010 135038 369914 92799 119195
23393 119195 -38457 6878 132837 -257181 171329 -13357 60855 -259361 -133447 -14606 232078
23381 -169409 141596 -180927 107135 -231573 170094 -272516 -149919 39652 -420835 -173114
23370 -50537 -106125 189499 -284837 -17433 -27439 -33446 6365 -45268 19273 -212735 65158
23358 145018 -48974 -40312 16803 -2292 7421 1031 -241651 7344 160143 197249 -81747 -183582
23346 -183582 301510 324121 104149 -296184 46642 -80876 -229289 380179 103381 -53919
23335 -152057 -96118 -96832 46479 95050 -148503 118574 147797 -152973 -148917 -77918 80343
23323 -411451 58664 212104 -3880 -16397 -115351 -75614 -221627 78733 32106 -88424 -178010
23312 -178010 -243187 301489 -159741 199169 -131476 112199 -56529 -327552 -166765 293386
23301 180273 -101377 -151579 -57857 141260 -136506 -234314 -45674 -72815 -10347 -156514 117269
23289 -17102 -24971 -65249 -147873 -64712 -100575 -201041 -8165 -182193 -360124 21611 39670
23278 39670 250563 -167094 -102412 -56064 217322 227871 100487 -104044 -289454 54105
23267 -31532 -209884 141299 53181 -398328 -7229 148630 43733 91152 -79439 94587 6416
23255 22270 -45853 8768 56338 180698 -90969 13384 25939 83532 117661 14438 -171670
23243 -68882 39146 23227 76839 -159444 112273 175430 -134903 121595 -29550 -2691 -193360
23232 -193360 135863 299511 -105957 482386 103349 55603 -67985 -61646 476260 -286545
23221 167625 -159499 78723 277431 140786 -80611 -65571 9689 -196035 -240546 -295287 246199
23209 244101 48827 -116778 239738 26817 -98242 -231574 31149 32773 -116564 175463 -116157
23197 67101 -289862 107984 73616 -106917 -21922 75436 -128115 -258483 -274082 33816 -191293
23185 -6404 20815 -133109 122989 37202 189910 -322114 129101 119396 -63040 60604 24367
23173 75388 -328727 -54086 46205 191800 279765 54188 -403314 104737 -159617 -267022
23163 -267022 -375550 177166 -56295 -291451 -144731 -78942 89167 -351077 -185214 -28635
23152 -74046 -166252 -64596 14182 -168564 -8647 -154524 -286000 278289 275120 -10163 23498
23140 -63985 117200 -84746 -38446 -73693 -94928 146778 -64422 -25754 296332 -14477 191711
23128 -198104 -33163 -145082 -189484 -167500 -206292 -21611 233214 -277132 164387 350127
23118 350127 -80567 216251 -51796 -64895 344967 -248435 -139121 44121 190837 -43074
23107 -208686 -342084 -256425 62511 -87809 -79303 2828 -295049 -25892 12125 -82708 33121
23095 363410 -139607 239694 416846 73168 152382 -250046 -236042 71330 213533 -97507
23084 131173 114302 -80653 46853 42422 -163211 -177276 -145030 -238421 -46310 130448 147884
23073 147884 217331 -258249 361731 208145 289006 108808 31158 -63422 -114091 117726
23062 -152954 -20778 -297231 -131882 -130836 125610 -40810 -167394 66189 -196393 -307842
23052 -307842 236776 -17044 -107340 91871 -191974 191343 -130847 -206102 -16979 -45949 -47934
23041 -47934 -129912 -40406 346178 -24847 -114840 74907 -239670 29442 466809 -69693 134288
23029 -149184 25351 -4340 362202 -91928 15558 -193729 94182 -121685 77649 146898 -45534
23017 22329 269134 14047 -59676 173460 6934 -96292 -17829 171784 -80291 339158 118116
23005 -124923 204488 -111155 352784 -337535 -229728 -57430 288838 21848 100904 -218287
22994 119455 -360922 -5012 -285288 104338 -188029 -248508 -92893 -89454 29470 -31158 270756
22982 -303811 134679 -43493 8510 -311979 -27759 162778 -108714 -72524 -442551 -33266 47036
22970 -306763 -71611 -73622 -41036 -47563 -131640 -75592 142483 197329 179507 203184 119346 -56096
22957 -44169 57790 -161160 -38813 144085 -142526 400410 -194242 247287 51043 -542012
22946 -180245 -169900 -73347 378167 64965 173224 95345 -74678 -90182 -41170 -247391 -54911
22934 -31261 284501 -200540 158409 -137750 39733 -89658 -167091 -286738 21638 -26359 -90989
22923 -90989 -45139 -21603 -69043 -341163 -60910 -260050 -35527 -131540 -111528 -23428 -90444
22912 -90444 113856 105869 -14395 -38116 -112748 -78961 -188009 -76080 374934 203043 -222724
22900 -3019 -58941 -370478 -100614 -63126 24229 -54362 26084 42057 -6259 -123214 119004
22888 -299525 36959 167621 -24999 -404872 134783 -192603 -137754 -276639 -97783 -79900
22878 -79900 -25505 87730 20299 125499 -137574 -130186 -170037 -157227 80374 -300659 -6279
22866 -184691 157797 -20494 971 221191 90044 43862 44166 36591 35673 73085 -115247 27021
22853 152166 17872 207244 -121031 27557 84065 -420991 -102581 -85705 -109373 198935
22842 357422 134099 -260548 -30191 77648 -110617 -108243 -89720 -197010 352206 -138471
22831 430294 -184621 -82608 203260 279826 -121760 168317 11923 13774 -147250 369134
22820 -168181 41982 156769 322567 -212279 -75095 252722 7389 306335 95469 -157689
22809 -235715 10183 -155167 -24372 41698 177695 8062 59365 112615 -107575 -45613 84015
22797 145237 77926 -117588 1103 143062 167327 -63296 307632 38122 -224799 23174 -126971
22785 367694 -27123 -152502 242365 -81296 -111345 42764 -361125 71468 -417515 106266
22774 -23892 -115355 -92237 -130727 -204289 22247 -518262 -60226 97017 -343018 -88332 -42674
22762 56881 181950 45810 33223 64418 110553 -57418 165575 -177970 -281391 120963 -141053
22750 -395878 78419 -289154 -11309 -131526 130539 -84304 -268246 386921 20270 -159322
22739 124514 43824 -124065 -39381 -141860 147946 8847 -271317 68406 183447 -75381 153263
22727 -37489 -18527 9254 156290 -53501 -237329 289608 119465 294392 190357 -257037
22716 131236 -195431 337611 134136 51320 -228728 30402 18225 -173816 -144206 -77293
22706 -77293 94121 93102 -117762 -48102 -295279 -96699 69037 193322 -5586 -6203 -77792 148214
22693 163458 -51693 141268 -66700 94944 212846 120658 -316265 -26885 -147274 192688
22682 202476 5089 -11866 27933 -56353 -130485 -58147 -283289 -40102 -78818 106548 226286
22671 226286 261 -69955 -316015 11245 -11025 127625 -208184 -2595 122145 -545739 -74224
22659 38983 -86379 -51728 7230 204046 -49427 207516 131069 129534 -8906 -17940 -29212 39119
22646 -50839 59204 -168290 30509 -191662 -233086 16917 106476 -105061 123910 -233862 38563
22634 -297469 -74318 -179602 29182 -321584 126567 295327 -281655 110026 80633 199800
22624 199800 14923 113367 61513 15337 -66319 -198975 6486 -226248 -190925 -243520 -85549
22612 132481 -113118 -131674 268843 31342 -165748 79471 -215531 -62038 82444 187588
22602 187588 -177880 7861 110360 -112005 227752 45031 -49471 -38057 -268068 44780 -175478
22590 -126487 -236841 133851 -226031 -132243 -277158 43473 157269 -94910 -116220 -174583
22580 -174583 -164881 44219 -22189 -15618 12230 -257843 -145789 150199 -21140 -179434 -72613
22568 531494 -67110 -294969 105696 24570 96596 210859 238510 185362 53440 9820 266639
22557 266639 -40280 -238170 -83803 256509 -149786 34286 131512 -71906 13114 -143089 8762
22545 -176425 201377 58347 205351 -168340 -1785 -290308 256661 20529 49963 78887 -27058
22533 -144687 -242319 83565 112341 -94791 -177455 -207993 168663 -159640 -31695 -109906 124028
22521 166047 -38365 -49332 -60666 54918 -1101 195819 -189905 -143271 -77403 -177458 36511
22509 12199 -298288 -52677 -152503 -209501 -144690 160850 -19808 -129906 177089 133255 -187110
22497 -30191 -55984 150590 135400 -129687 259984 -331381 -136151 773 -166494 -57327 -19208
22485 -98895 198799 -153828 73464 -72876 -154796 -98 -94807 -268897 176624 31656 153186
22474 153186 -111660 131155 -198220 -72489 82816 157877 -186550 14024 41844 -43738 242151
22462 -57583 -111996 -83207 168162 410811 43366 421436 -52730 -162153 -186188 -173199 67770
22450 -183186 -35212 233375 16751 240567 -224656 -89192 -169958 -172667 63393 41099 -117881
22438 60846 -189265 -153512 299268 -113916 -79802 -161056 206628 59455 -77808 262112 -50014
22426 -439131 392019 48576 -298156 -159002 39366 -44795 250247 96952 -98802 -44356 44119
22414 64623 -138883 -4397 -191994 251105 -148305 -103541 -12254 -405714 -32066 -67930 400187
22402 3464 -382178 164786 1234 -192136 93995 -102947 -170491 89006 -360273 55314 117902
22391 117902 207933 -112136 93359 -39063 218893 56712 -87368 5852 -18612 380 247859
22380 247859 236172 39164 144117 118544 103335 -358113 -154181 32705 -217188 115421
22369 83015 -147484 8101 -27966 -199207 -68159 -178835 -130274 -72604 116412 -183197 -93124
22358 -93124 -43308 -55867 -164063 -123108 -90136 -312013 171250 124297 50771 51865 71842
22347 71842 -363567 17157 50688 197279 -381839 -3992 -11940 43948 21113 -97880 -312543
22336 -312543 -140512 -120607 -14153 462065 -81479 49210 -34304 -107060 207193 199806 29100
22324 -71439 -56215 198239 12993 -44099 19415 105601 80411 -250126 -53805 209759 -27444
22312 34852 242343 -123378 -115726 -217369 -59401 -43631 -312745 -67241 -206831 54347 162923
22301 162923 259726 -163563 -274518 -92357 -166410 -50010 -263583 -257886 -527235 -40681 94887
22289 -150300 -264286 -73378 -239077 71905 -11288 113217 181074 -14990 297861 -47815 167280
22277 -206857 87344 -31280 -288323 49657 52689 -195335 64954 -8026 401899 -303570 -85859
22265 -199658 6288 -37537 -315765 -545 248330 227375 -181055 -134726 -105100 -234284 -217313
22254 -217313 30760 -134129 2038 64512 -108811 -85160 180342 -106345 5334 -205148 -176
22242 -61904 -68424 181150 -105487 -342679 -248052 -92106 -149171 4977 44991 220966 -29268
22230 -71418 -189146 204895 12204 -36241 59288 -15379 12911 -147249 -116406 -93255 -169661
22219 -169661 385382 274574 -20121 149284 -404294 -294417 -23471 -19423 -209981 -196553
22209 -196553 90131 -167334 -307412 8449 155393 -175992 -7714 -333317 -109667 -206232 -283632
22198 -283632 -91944 139410 -237791 -297764 -117018 205603 -119734 -60316 62879 -126923
22187 -185594 -49223 173267 -115253 -216077 -53590 163722 -194890 -413328 10016 249753
22177 249753 -7624 -159237 47577 346592 129680 -142115 -441518 99049 -211436 -186084
22167 -186084 -206098 208439 -56472 -142470 -217975 -48438 195577 -49111 57845 -122868 -34436
22155 -148316 -243623 -330046 246921 -365435 151962 187518 -334086 -301045 -156320 92440
22144 64338 -149679 -232196 33359 -131282 138254 10960 63178 -197857 146724 -60071 -84239
22133 -84239 30355 279890 -159050 180996 -105369 -32918 -174843 -213870 -49482 293137
22122 -51411 172430 60733 37354 231040 -192341 19684 128552 -116462 -322096 130761
22111 -215861 -32651 -286438 -219377 -380220 -145132 1865 -278667 69811 -6080 359163 180143
22100 180143 105276 52128 -216376 13866 -365873 -51876 -92227 97506 -156364 -378463 -321974
22089 -321974 177897 9351 -171849 -161124 73984 -33972 -3037 -64170 -105437 28532 151094
22078 151094 111861 150276 291063 -42928 -353357 17127 -79085 -40545 95357 -258371 -55158
22066 174146 198389 79828 -300808 98799 -32865 -46183 181169 326535 -14287 -324717 -153806
22054 -294439 83158 -271078 177550 105275 -461586 -75635 -197696 -64274 -56111 -376655 -64196
22042 72733 111918 173715 -194045 -78553 -206495 -186945 88618 -20935 -258499 38318 -134850
22030 -38147 -293166 -44774 253819 59806 -327168 -276502 53348 166410 -276033 -136389
22019 -300749 116099 191936 159349 -219812 -142836 -82543 77723 177870 -118813 102934
22008 -132929 -83728 -203176 -154408 -28090 -292883 -158119 -134612 231723 -245826 -131573
21998 -131573 141487 87139 -109489 -66467 -189514 -73816 -88584 375181 -360014 23831
21987 52783 5980 1032 -122271 10694 -102623 -38081 -91383 160211 -14982 44238 176982
21976 176982 19579 -219833 86969 -158510 -303296 91492 -128108 -30551 90274 30173 -132457
21964 14475 -450426 197306 -124721 182384 228637 -59449 -59326 54837 63366 219474 -117913
21952 203479 61035 110324 -173128 53582 12710 95807 827 10312 223649 103023 -150070
21940 158636 -186266 69790 -322520 -62843 -159979 -57076 78129 -197643 -17423 695 -246300
21928 21324 -318719 -256901 -37848 135371 36621 -168519 93075 104689 152259 -55452 -259616
21917 -259616 -406889 -368842 -53472 -59820 -135978 206528 478700 -76800 -434639 -277046 -15009
21905 113403 26278 -150097 -198427 15206 -50265 -58114 -372640 -174435 44517 134901 -189654
21893 -98997 -156142 -243706 173818 -363627 245122 -116567 7431 205458 265140 -6786 -249841
21882 -249841 -219729 159813 156085 -75066 -253258 -13882 -76363 40875 180663 -160547 -99315
21871 -99315 52011 -525786 -85688 -101749 -411281 -36076 1305 200147 -174929 209135 58907
21859 -225368 40574 20064 -239439 -20230 3606 -428835 -125575 9586 58321 -113214 441848
21847 -26613 230673 192937 -195046 45501 -248887 -286044 388710 -19530 90050 -158442 150772
21835 -331430 177409 -78240 -155035 125895 -267098 -141572 248896 -193467 -18494 -366746
21825 -366746 -19807 -9345 63010 -132912 -190333 -154445 -185814 -33985 -81038 207896 269386
21814 269386 -244294 72027 -178067 -69477 -184612 -217476 111283 124995 94480 -25571 97530
21802 -482565 235077 -101989 112642 -233209 -49002 -102226 19845 -99856 34719 -265698
21791 95174 191321 78241 85353 158189 100347 24117 189968 -165345 -355279 -215500 -435590
21780 -435590 -244521 29470 -340526 49684 -227144 -28766 -163205 143804 -203033 -208737
21770 -208737 18240 1427 143430 -266598 276865 -11925 -112293 -98584 -29242 101374 28559
21758 -64190 129728 -114915 -30158 7819 186059 122379 67549 -84356 -13514 64641 22791
21746 80340 20162 -160663 -41527 -124246 -141152 -290191 22939 195069 75527 -269206 -183215
21735 -183215 139198 163213 -72293 -74358 235051 137090 -476266 10158 -57073 -182706 -48263
21723 -84945 -54363 -273057 59391 18110 -253097 102537 120489 -122568 149523 -101333
21712 99274 -32346 -31500 -106868 69000 29405 -90651 -142353 104686 166331 347928 -549925
21700 14011 -25355 -9073 -119829 -121814 40803 207448 209176 327202 311319 -136277 -326397
21689 -326397 241489 -155397 212579 -6436 -10805 71955 -338293 -97633 -154066 17646 -47683
21677 55771 -475602 -241737 209069 112886 28226 -68357 -145077 55477 -116758 -80320 -126060
21666 -126060 430297 76723 182660 67253 73427 -65879 67382 -115545 -4950 152291 163916
21655 163916 6540 44635 -88419 -113551 19609 41856 -119682 48704 112069 -31663 40468
21643 -212320 -218393 -132374 13859 -96744 40482 -415371 65437 -8102 -48418 194192 18063
21631 -368017 123551 -193372 256439 -295176 -78401 -93869 136906 -220136 -20572 -176012
21621 -176012 -40656 139028 -287996 -118774 2344 -205269 -283136 133843 392953 -90274
21610 -38732 -31383 -187551 251027 -133572 -86248 -290923 24704 21125 -38154 101564 75147
21599 75147 -125026 -35619 279462 -84351 -211539 76917 6108 -115003 -174329 174361 10365
21587 103739 348908 98562 200045 -839 -43552 -130436 93528 -338111 -152764 -203470 27384
21575 13828 -135154 -194533 202483 -222464 -95357 -189125 18510 -128081 144794 -7072 -70849
21564 -70849 64301 20510 153228 45514 66372 7353 -152101 -37911 -44293 -76444 -302464
21553 -302464 -97311 4308 -132660 -76517 -54526 -5844 -263915 52527 -51922 193577 -156223
21541 -1573 -196932 -63466 155626 20538 -132549 -10118 -304464 257219 -258910 208643
21530 141295 -165387 -168226 -136830 402551 -257671 -17367 -123714 -81864 -130214 -103670 19942
21518 -181026 25991 -148345 -174658 326115 108774 72769 23116 -145500 -63016 119341
21507 -5881 -38306 -149234 -105785 37155 -479566 -36019 -250420 75476 -129051 -58780 -311953
21496 -311953 -53351 -15938 50016 -304825 9419 -81567 93680 -44162 34475 112460 236156
21485 236156 70599 173099 164197 -118408 -177998 126247 -301958 -66912 244518 160171 170388
21474 170388 -113781 77 -320692 75529 2984 4483 -18085 -62949 243797 -153892 -232308 55488
21461 -28084 109666 85641 69207 -276368 177156 89027 96556 -116363 89674 106761 -67459
21449 -134456 -204176 -319704 -253968 20665 -108776 -58602 234598 66826 -215215 153234
21438 82640 471144 144753 547933 560518 292122 207645 -27127 -69513 -68067 191587 95418
21426 -288043 46646 -240389 -250817 -7584 36501 -99384 -103532 -260060 9076 75493 -215889
21414 127163 7184 39738 3184 21154 -28473 414714 -130396 -150806 -138916 -129808 -43073 228211
21401 -345959 -130764 -226374 51566 -45847 -339721 -114659 35061 49341 -203863 -492693
21391 -492693 -143386 -522687 -7357 249556 84495 14940 -43679 -50176 88928 315204 4436
21379 116320 -272891 41562 -282307 -5684 60013 -116381 -108037 184766 18939 181238 -245108
21367 -190096 -60257 21576 100351 -16609 9218 -242417 75906 -235587 -172024 2789 -127211
21355 -285280 -398932 -64674 -190730 -66558 51136 91380 86303 -207555 -31916 131844 -43869
21343 -86826 -248331 -22169 6826 142685 -62221 -120856 -98104 -272646 -185345 62925 171388
21332 171388 116785 167407 185273 -111018 -14168 -35957 144996 1790 44025 -303292 -179991
21321 -179991 -256548 -190368 -73437 -58040 -374848 38663 -36400 -86101 66791 -141723 -37000
21309 35546 -153169 19332 194344 -49882 -91140 -152632 -218070 76288 103546 -99523 70484
21297 -147047 -6967 138897 -105262 -205493 -248094 -30982 256838 -175034 -151304 152357
21286 -38798 -144050 -127618 45221 -267693 414410 78817 -272171 40171 -11725 76553 -181235
21274 118309 -52268 212127 59647 84567 64470 -162446 174261 -161730 -237821 73344 -42808
21262 65036 195213 -117662 -25908 23184 -16286 -267691 -122664 123542 140766 109864 -65538
21250 53492 76868 55586 14833 -11460 67994 256209 -150233 -251754 -96714 -174517 -80569
21238 -264359 -2366 15833 79387 72875 321175 87465 42860 66698 38542 -9083 -242827 -66277
21225 -207853 -190239 157407 -197889 -166139 50845 -89512 149955 -34968 -156500 160286
21214 -55963 79176 166140 11624 92598 -198960 -26128 9050 196916 248351 2067 -119247
21202 194260 -108664 102177 -134093 -209724 178163 -55829 -108 -249500 -210414 -92647 89010
21190 -44421 -181923 -82273 -150152 182572 -86816 -129460 144756 14486 388900 153671 -90584
21178 -219529 216744 -86432 180535 -5476 -1964 -3454 -39283 -98062 -165710 78272 56401 236760
21166 236760 -425220 -449878 -189193 12587 159721 -93658 -238793 18692 74156 -121915
21155 -33781 -217138 -22173 -39867 -292356 48371 -75199 36137 -96623 113917 17910 -73852
21143 -130996 -16170 -439029 -33053 -78955 70769 -226916 -338766 -92642 -47817 -400766 -156324
21131 -37085 -40635 -155293 -409867 -9195 325180 -309192 105631 -91922 -371070 53206 -16535
21119 -214981 -8062 69004 92664 479 -104176 135137 145387 -49256 -171378 182395 -302681
21107 -246295 49385 31961 -234412 99120 -80861 62668 -104822 115165 -154325 20000 -291038
21095 71635 10368 -260890 -378452 193895 -192659 -273730 164358 -89912 53720 -23560 155248
21083 -248765 -93574 91259 -154512 -6765 -96789 96192 -257089 -122319 -205331 67358 -118553
21071 153987 33827 -9221 324200 16650 -30290 -117083 56370 3778 132536 -295830 1341
21059 -18042 -44293 7228 6905 -479322 266331 -11771 83647 -63211 -147921 -399301 -76201 107694
21046 13090 128668 -168310 18028 235139 39209 211394 -134235 208066 -181413 39216
21035 -417297 -7392 -58136 170558 -245170 -96357 -82863 33307 85027 99382 220065 -307188
21023 -99027 8463 118284 112460 388005 -78808 217754 130335 -28127 108164 133500 -181952
21011 -70048 -24040 -347502 -187048 18285 291681 -85811 244302 25734 105806 -196681 134327
20999 -119724 -137100 283977 59707 2543 -27086 -197264 53090 -241764 -217615 -52896 -58689
20988 -58689 339941 -427631 49051 -56657 -255653 -257758 -140711 -193875 148867 -14676 240249
20976 -162295 -232892 -130262 229510 -74000 80450 140827 77732 57812 -141281 161502 30500
20964 14356 -164085 -86572 -102658 165572 -69501 -383023 -61326 -276617 173021 -211276
20953 62134 3162 -200450 -126323 -223655 68136 -48101 211922 236250 -81957 226787 -119782
20941 78073 -510678 -63324 60771 -262210 -191894 7213 274268 -56103 344161 65873 -319082
20929 320296 -14555 141837 -40973 114348 94037 -138392 -36850 -49842 -118197 -133328 -290898
20918 -290898 -363334 -191989 -15931 68510 256519 -213073 -153228 -169603 165055 115073 -406937
20906 -119361 -189883 23392 364715 -145692 209208 85805 103034 -233247 -198188 -369470
20896 -369470 184336 -290375 -234312 -224170 -29130 -198909 69614 97826 -25485 -264865 10747
20884 21397 -20506 150980 -8096 -184925 -101744 152958 158732 -130981 79341 -86809 -219505
20873 -219505 -92826 81925 -15473 66182 381299 -132391 26113 -29152 -11760 28573 161273
20862 161273 29069 -25714 -201446 99360 -77907 41077 -126495 -65038 -261020 26368 -149108
20850 10806 -279205 252790 76812 29459 -200646 -66991 -70793 -25328 -142286 -1539 -192035
20839 -192035 -22584 -138819 -131918 8918 50998 -85940 137772 58550 125215 19586 -281447
20827 195475 -182148 -68878 -193321 -138598 -369754 -321508 -92220 -216828 -65383 48538 278986
20816 278986 19629 -99508 199408 9565 -58014 87573 -122572 -289173 -125085 -214439 -171757
20805 -171757 24012 -432745 203179 -166800 131276 269694 120148 46069 -133421 31309
20794 16396 -204230 211786 103260 -19455 -110909 223052 40761 -635818 1143 -20902 160734
20782 142914 -280239 -117098 -64639 219652 29327 15335 60211 21026 -168236 -411079
20772 -411079 38553 370015 136905 250902 100505 53249 296220 -43006 -228400 -19577
20761 113357 -436929 -208245 83884 107920 29614 -56825 -299773 205564 -421127 -163871
20750 -126750 245257 125563 43171 -95349 89244 166093 -81029 1450 -257834 126919 25633
20738 -10374 154716 -33458 -19609 -270178 -168699 -30444 89074 11644 -1483 -367479 1552
20726 -34817 36180 86785 -179586 117310 -33120 -156879 -4525 37179 -52892 -278965 -272621
20715 -272621 -98912 113973 144929 49888 101250 -160249 105057 -151542 -45238 -337690
20705 -337690 -303557 -81580 -288919 -83857 -284415 117537 -302211 -280893 -439107 -66451
20694 182960 -3086 94604 19174 15546 154506 -122964 -16741 17049 155862 -208547 -17529
20682 -80367 -124801 266992 -102748 3641 804 87468 -33496 -23382 52869 -177801 -105368 -228044
20670 -228044 -44676 125032 129815 -172339 306730 367155 -276867 -161058 -82792 -79865 -511802
20659 -511802 38146 -6739 175850 -225411 -16154 -116550 -91054 -221449 -273307 -74246 -27880
20647 30246 -79384 327426 187176 281653 -13091 -325550 -100490 -129781 96853 -78607 99487
20635 -270778 -103503 45679 19708 -21846 241411 -365672 -165348 -257014 -106750 369137
20624 132699 -97908 130374 93795 -266005 -316968 -36639 -159481 -454950 -132375 83713
20613 55034 -6154 -55171 36450 -162064 -210275 -171741 -72721 179688 133942 -94752 160973
20601 102447 27034 -287341 -71562 -140507 -5351 -127945 115887 -146012 -291651 154763
20590 44972 198760 -13541 38499 380184 -63467 -285975 3230 -325284 3508 -139047 115209
20578 308690 173321 48921 42815 -100950 62171 -60661 3912 59784 108003 -166885 -263989
20567 -263989 53679 94408 -230958 187659 49119 -148000 251707 3587 -327403 93217 -168796
20555 -27260 29916 226727 -322702 -95204 -88469 -177528 -115086 -98795 -179687 147947 183398
20544 183398 4446 -6204 95325 39158 62278 174189 -144998 -316788 -10808 241847 -123778
20532 -16096 -89608 -247572 -358580 72453 -247310 56473 -49446 -170279 -110007 96544 24337
20520 145622 -45262 -484567 -105538 -123673 -371134 114220 31230 33949 125432 -62923 83713
20508 -259538 -75257 -2374 27280 -275356 -48323 -193998 -139245 -69774 133791 -49647 -353435
20497 -353435 25610 -29493 249043 -71793 283121 359328 -127075 73176 277125 144906
20487 144906 -171034 -47606 -170328 -67967 -16829 110363 -90286 256612 -61685 -269622
20477 -269622 -267483 -216284 3522 207753 -184413 33083 103323 129531 12176 17695 -123535
20465 112646 -113207 -5563 259920 -44947 11912 -154702 35396 15710 1262 -340330 -60347
20453 -211427 -122359 -242207 217252 -188460 -54260 -213826 -133504 -56164 -31976 -128118 -226392
20442 -226392 199190 -140130 -24390 -328972 -198200 -148451 -382572 -213782 22130 166815
20432 166815 116095 -2803 -35002 -9039 -167920 -265486 -41466 -278152 57111 116198 76642
20421 76642 -71931 -214736 43364 -317443 225809 -223889 -14911 -412087 -187156 -359814
20411 -359814 -109642 51128 -207921 34289 426319 -131458 19993 -31898 -218746 452476
20400 13836 33231 -198269 212470 -98496 -301710 2964 -239433 -326794 -69033 79107 10472
20388 37522 -65226 47412 -380015 -133731 -205675 -87176 -251374 65356 -11298 -60424 -96943
20377 -96943 16535 -75756 73059 -46815 -63667 -126524 -105832 43215 153837 21482 -24730
20365 42059 -72684 109352 -21180 186687 293054 -109961 -122523 335 241059 -290636 153243
20353 -208060 32875 -281096 4608 -66744 22175 15968 -204594 -76619 36161 -6786 -47605 128031
20340 13842 -51227 -319444 -55824 -11653 142336 45067 -189590 27000 -179629 -230744 64555
20328 -283738 -220135 -301899 -12944 -196167 41382 68468 -336905 -32737 29050 -127322 40415
20316 22807 -140510 -31293 -218306 -1649 777 268030 241723 -9489 -459707 52528 -70319 -78065
20304 -78065 129116 -302133 -560236 5243 -117475 25390 -142032 -136198 -240199 -15230 -249200
20293 -249200 41716 75977 112146 46220 -176149 138625 230345 -18522 113307 -153094 -205484
20282 -205484 -157139 -234417 -32395 -133266 126455 36074 147094 -202422 -153511 -147042 77436
20270 -77797 -46362 2511 -233567 -122876 -16938 -210917 77889 72059 -128709 24818 -282767
20258 53541 -84286 -73642 -37090 16688 88364 -148359 -128074 -133170 -320017 -7211 -202057
20247 -202057 218164 126406 -117881 100632 -191799 -118893 -255514 73632 -308809 199686
20236 -142667 -165348 -386642 -194421 122603 35376 -35141 205874 -133216 84769 33243
20225 -140579 -130416 -85284 -189659 6182 -38197 127547 -28218 -5393 63402 -53056 165593
20213 37837 -21042 -53366 -368210 -323025 -301476 -157309 -136689 -214593 -59589 183635 93743
20202 93743 130076 154618 -203464 379557 40413 92251 47692 -237383 -296298 -45458 132416
20190 129230 42495 -57069 -49051 -73555 -227670 -20895 -33154 -298224 106633 49016 19020
20178 113984 -156652 24896 -76028 149650 -213299 -122286 -83337 -76522 -326949 -72319 241356
20166 152302 101316 80306 282276 -190621 -131586 170952 -145443 -46194 126703 -275490
20155 93071 -115055 -261450 3134 -104168 70598 62649 -39603 156910 -55134 24405 -82841
20143 -133828 5606 243623 316075 79390 22326 -281556 -44950 -283440 -347543 69475 -22488
20131 89577 149864 -78059 -32230 -258206 -227337 210417 -86702 -11012 -30221 -25701 91927
20119 -61567 -229229 -67659 -90551 -102233 211700 -37655 -426245 -214113 26554 -127587 -25156
20107 -192265 152067 102212 -5308 33153 39245 -16693 246700 177547 90051 128885 -164777
20095 -96412 -244444 -61212 -69993 121788 170144 -66239 -103283 76057 18361 -374692 -61563
20083 -21476 -155189 -199795 -210661 -197382 -201149 -37070 -155616 80251 -129691 185565 -198226
20071 142845 -239238 50465 56387 -124181 177209 -442248 -187480 -117627 -396880 -81079
20060 -109221 31898 -135212 151353 -320726 -31486 -164535 -259721 -45725 -70023 -86945 51215
20048 159752 -138556 54453 -13202 126343 120794 58264 -150524 -120335 -162513 -7860 39802
20036 -321269 33159 -154676 -237683 -208407 54285 88655 167061 28116 -235288 44371 -184353
20024 -109192 19186 96501 -245448 -256944 -151820 95709 13384 -182202 -75337 430102 91182
20012 264056 -122870 -23635 -16372 -334915 -70685 160239 -215303 92051 -45988 -190743 20227
20000 -85544 235653 -282416 101966 -116547 27198 9423 -60529 -257385 66453 67682 20216
19988 1365 -171267 156520 245269 -50458 -82225 -132173 -123787 -274222 -326631 187073 316888
19977 316888 416865 -47637 -16058 -271055 -55912 -314382 16688 79394 -213341 -25791 -140917
19966 -140917 -89460 -19168 380408 51589 -150083 -256829 -1650 -7030 81298 -110003 6437
19954 -40540 116747 130306 -66332 -307438 333960 -1240 26956 -145915 -29928 148024 63706
19942 45772 -239222 -192969 -15612 -137261 171528 -196601 69524 -99801 -116536 136375 888
19930 71997 114570 -18816 130259 -31509 30862 192957 133793 -259253 -220968 155119 -54119
19918 -35741 -36631 -272235 -176414 152916 20599 -6778 126873 63695 -9755 143982 26392 -107659
19905 -103937 58635 -198102 -371323 45687 -327049 -453514 -217946 79504 -159707 -113554
19895 -113554 47753 -285104 -294056 -177762 -1222 -70662 175793 54592 -397992 -156184 -368240
19884 -368240 229789 -266779 -485485 -182301 62127 -312523 14976 -186997 242135 220080
19874 220080 98871 -75879 -507 -124016 11932 260376 -63783 -10353 -41294 -243615 -39526
19862 -213185 86891 371408 589 -302036 -215884 -272623 -237592 -198372 -3940 -228975 -170720
19851 -170720 -286518 -154158 -168251 -15203 -131343 -108927 311772 -70881 -98815 -31083 -11586
19839 236399 -126442 111384 357043 -275057 193323 79057 47430 29234 312431 119417
19828 -54758 -223409 -28410 -299423 -604626 -173254 -14204 -193432 85335 33462 -50477 -152336
19817 -152336 -129684 -255597 115007 -76136 -30666 17704 -29221 212439 147404 -65627 2557
19805 -82041 -13632 46558 26225 -263512 236720 153931 -103071 -55483 7586 -294863 -129453
19793 -146150 -217935 -146607 48789 -105843 -52306 28102 122145 38303 37604 -141521 -175029
19782 -175029 103698 -121877 -181395 -279074 125637 -83438 159319 -39250 -221386 116341
19771 11801 -32904 -115011 56927 -260039 222752 -195703 158605 276516 -75006 -87286 -323191
19760 -323191 293579 -122608 208158 -290611 -162864 -286699 204415 20682 -96266 35109
19749 221169 -133039 144939 -283203 40277 -141990 -302379 10981 -92783 23307 130055
19739 130055 -534596 -122178 11548 81427 -8349 103859 -196831 -79829 26990 -437309 -130994
19727 -24150 236865 88966 -74367 -53136 166950 -109589 -280863 -33320 172257 -244465
19716 -31310 -89602 -43483 124044 -91538 20517 -134023 158712 -6949 16847 51806 339317
19705 339317 47448 11987 -135997 81976 -352859 -71505 -139801 151750 62353 -6612 38205
19693 -132952 -189887 -97387 46843 336637 -168910 -61743 224298 -44783 -222235 -388732
19683 -388732 103681 -84875 -71306 115787 391249 -120092 -64337 -29561 -48993 -161842
19673 -161842 -63179 11519 -273784 -57689 -326045 -101712 186290 -479520 -23858 -244014
19663 -244014 -192552 -186950 -85507 -31666 203869 62055 29122 -439969 491987 -56475 -279629
19652 -279629 -265093 -83398 -104466 104951 20234 -346305 -119960 40018 270933 120612
19641 -184037 50006 42823 -263573 52930 -270191 -62847 115974 -74069 -100855 -22353 85180
19629 346221 -457142 -105705 36783 -7878 -91517 232031 -65029 27667 125869 -279654 -245614
19618 -245614 164393 5130 -571518 -112476 -274718 3784 -14363 -33549 247801 -185966 237937
19606 232658 -125921 -170421 -208448 -20457 -109919 -219598 -87878 -28046 -54830 34765 -138132
19594 -178223 -30307 -146965 112901 20543 117028 -120595 60613 194198 -188836 74005
19583 213399 -96314 -285683 -5257 -239085 31206 -248010 94267 321511 96042 81374 157470
19572 157470 -101564 -272043 112445 -127013 -127984 39328 -366640 64845 190293 -295413
19561 -354955 177209 -22672 -183936 213037 -411149 -109054 -97496 -68944 -190298 16693
19550 -118552 -76924 -201193 140036 -159573 -4758 43402 16429 -90042 -108971 -127326 30639
19538 -248654 229518 -34256 -190684 -330560 114699 253591 -278526 -88273 -280800 -456346
19528 -456346 1244 -141479 121785 -47464 88623 -142494 -96464 -87386 -168086 -72229 -98335
19517 -98335 -266659 -119882 39772 -425239 -114498 -66163 147556 -38220 -132515 -80684 -113531
19506 -113531 193772 190103 250455 -46416 -152834 -44062 -5989 -38998 108032 13139 149889
19495 149889 -246435 -266564 -263479 -166430 -85754 -133322 -142306 -114099 -76220 -326909 15267
19483 247249 -11901 -235967 -328492 -89397 -277204 -62051 31603 -108151 -217187 155770
19472 -116166 -88584 13983 32760 -57496 140834 -299552 -15486 -135510 -58710 -56234 92475
19460 66293 -85092 105450 -9663 -207235 127490 -62212 65618 353656 -221261 -283389 -42541
19448 -123384 74962 51844 -18233 -395816 -9373 29708 -151925 90797 -2814 -222503 28455
19436 -232149 -85076 -12044 342200 -141734 123626 -215599 117047 38735 65542 218070
19426 218070 168951 203773 73546 -360679 109510 -147593 -273628 -38342 79337 -233125
19415 -129795 -274661 -60956 -228166 -176101 -17318 -104805 -200481 -54924 -65350 -277784 -315498
19404 -315498 -58000 -130825 -500133 -59034 94957 -124984 -107457 80653 -241306 165324 -122856
19392 -147118 144199 -62817 -29188 25714 196335 -136634 48979 -131125 -61043 -195029
19382 -195029 -74898 -58433 140798 -345017 -303392 -88540 149906 27256 -236810 -70117 -58267
19371 -58267 -269049 -97486 -107387 8322 -201404 -65141 189465 -8910 -85517 252159 -79991
19359 131207 -127942 241802 65988 45982 -117837 -123757 -299351 -134765 -86687 -33728 190240
19347 -309927 -62157 64682 127412 -69707 -83945 314400 -524714 124425 21958 -72997 140002
19335 82935 1910 -36286 85341 56306 85002 -102339 361636 -45408 63326 69812 57301 105896
19323 105896 195768 214734 -202484 -35614 42861 -244380 -122332 65808 100973 -30603 -57185
19312 -57185 -59868 -38819 -13265 -205459 -16308 72379 26610 11286 -355608 -87132 -60394
19301 -60394 -30338 11200 -161386 -129836 -130087 37968 59701 -280813 60895 -395247 -157939
19289 140225 -199710 105005 -52547 -137178 132307 -140547 -30841 88169 -90664 90690 -299864
19277 -10911 -147349 99966 84555 -165986 -228606 -312128 80040 95534 -27270 -281410 -210922
19266 -210922 -50518 129143 -210016 -39888 61264 31665 199805 55590 -79201 -71891 180692
19254 101763 126324 146675 -48360 -9921 605 -172103 -283209 432414 187029 -158162 -78489
19242 -26679 -96737 -234 -25356 -161498 -139838 -78609 -102474 -267629 -180787 -7210 221697 17350
19229 -542085 -89605 7606 -135349 -39569 7130 61269 191125 -228943 -53385 214712 31173
19217 114749 194703 48537 -108407 141256 16025 6790 -128926 12688 63967 24446 -158202
19205 -231211 -4498 257603 -67578 106346 -163145 -101838 -6308 -375765 -88460 -472991 -445828
19194 -445828 -130030 -110846 133262 200021 -336464 -36986 -26562 188879 -35949 72379 205267
19183 205267 -3180 -203539 -363171 211943 465 42845 88339 -365681 98065 324873 82597
19171 -76600 -147251 -36344 -393780 131660 11127 -151591 -80839 -267600 -108022 109899
19160 -165174 120826 -54580 -239228 158650 2446 -180748 116900 -304674 -321734 -134523
19149 -275118 -25205 -329266 69460 -91336 -63837 345467 256229 -20354 -148644 -207391 132458
19137 -233539 47221 28321 -264775 3597 -282113 -21439 -83144 -703054 -6745 112607 147406
19126 147406 -471108 -402684 48367 -101722 -254502 -287037 62280 217578 -379071 -294211
19116 -294211 205009 186286 -24060 -245816 -206364 -139868 63614 327397 -257946 -31504 -71401
19105 -71401 54720 49405 59057 51590 -56041 -32102 29890 -9970 -122107 33075 -247743 -171650
19093 -171650 108555 -137728 -237423 66980 12902 -234958 -327978 36919 117986 156029 -81564
19081 244942 255559 -88137 -102207 -130465 52445 -87757 -181973 -9915 318663 -73659 260240
19069 -138902 64168 137757 -42098 -39124 34682 -28910 -119655 18354 229249 23113 -148675
19057 213113 -112884 93980 44805 123660 111238 21496 -62492 -54343 69151 -214372 278648
19045 -233607 -93281 30516 9136 -328097 -270971 73961 -166638 126540 72525 -209586 -30293
19033 -85434 -141762 -24468 -51851 189368 -40281 -85485 99842 74888 128966 156564 19374
19021 -39531 157914 224576 28932 -177820 -227049 -289352 -239854 118036 -165020 -73644 76363
19009 107509 -209899 -146108 -276508 -48432 123899 -230880 196358 -81747 131480 42345
18998 -155390 -320800 214655 -215468 402769 -43677 116701 -199572 117221 -127392 275765
18987 109281 185899 -111417 -123573 96595 -146119 65994 127768 -1760 -236307 57763 -259876
18975 -111838 144716 109719 -189181 133892 -226992 -89672 126767 180925 108830 106943 -194635
18963 192868 123836 308371 -87065 -184556 -26199 -57276 -190119 -52940 109711 -128455 34171
18951 4422 -79885 6393 -367070 -4761 -47010 -209136 129152 -59912 -96890 -96612 -132857 -223003
18939 -223003 -116564 69249 6050 -362319 132403 170118 -91130 -327595 121571 81066 104557
18928 104557 -226284 15872 59477 -60895 -93714 -200504 -203219 -287397 209235 165166 -219568
18916 -221525 -81495 -156854 -280246 173572 45300 -20421 -173844 -211495 -88940 27214 -127481
18904 -64441 44844 -6940 -137517 75478 5001 -354215 -259506 -20876 -89683 -25931 -128242
18893 -128242 -202752 -221874 55512 -554056 -224892 -44848 -293674 -281976 -212707 62598 27302
18881 254792 76459 -343180 5848 -204752 -64414 -252581 -40916 -23106 243513 86191 -129317
18869 223696 -174107 35053 -48339 -52410 -277117 35566 57700 -413721 -126141 112868 -219029
18857 7184 193558 6176 103143 -174903 -93694 -48978 -186992 -189506 -26274 -347689 24465
18845 254386 4313 -246707 -26579 5516 142942 -243948 -189069 -261018 205227 -210065 -49186
18833 -653392 -64184 54200 -190048 -222608 -165856 -31310 -107204 -53332 -24744 -153902 289636
18821 270374 -34558 270161 61403 325595 137604 -104054 14916 26904 -91481 -28536 -35171
18810 -35171 116256 -88641 24412 78835 81381 68338 -27174 -150462 -171573 220481 252326
18799 252326 67574 289095 -200157 55181 134490 -32617 73184 57300 31877 -157255 -95105
18788 -95105 166687 -146457 -158738 76058 -237576 -36118 132025 -306634 -478593 11624
18777 96045 58304 -65093 -164280 218198 -306118 91006 109051 -317411 -6729 189571 74248
18765 158445 -395760 -90559 69915 37958 -153090 166578 2211 -160340 179584 61452 -138138
18753 34948 -98818 -125882 -169253 -479 -147615 -271618 22509 266317 -7425 -131135 234651
18741 56101 -102936 -76008 -252035 -99233 -38371 -73227 148043 -2644 -58703 -152136 -441487
18730 -441487 147245 -72964 22561 -34418 4944 -36556 -37666 -248728 192670 237138 -250012
18718 304786 -107966 75921 205329 14970 33327 -58430 -20899 -92247 11498 74171 -19841
18706 -288001 -18744 16710 -32618 -188181 -40020 -266850 -38710 -82416 -104057 -196516 -28289
18694 -170983 -171056 -98549 -406007 -56544 -80483 -100405 49543 -25731 -66084 -287162 139791
18682 27673 -147080 20781 -145812 -164434 72456 12392 218907 -396336 -234 127196 92200
18671 92200 -166214 81690 -28549 -150869 -203426 -39613 -139973 75255 -3861 26592 -23924
18659 17152 -24700 -46775 -304421 40018 199236 -76691 206887 -42492 15606 58790 112624
18648 112624 -180709 278761 -96858 -62242 63100 -250517 -40341 97672 -84228 -154671 63009
18636 -367980 -171753 -17800 -25283 -121957 79950 165527 3493 91744 281166 -117962 -43627
18624 105938 -141051 -155831 -130076 -218829 97 -70287 -152966 171180 117379 -274047 -178664
18613 -178664 -117614 203075 144201 -140836 40347 -116573 -195363 -49931 202114 -310665
18602 -204832 49920 415061 -145049 34629 -82887 37073 228187 -10179 -476031 -206581
18591 -96344 -462002 23988 28492 87997 -276306 -1160 85802 -277487 97392 -132699 -36324
18579 51331 -64466 -116 -95954 69800 39512 -38227 215058 -55072 132343 244753 -150003
18567 -38195 -104388 164632 -74233 -16554 -173094 -300004 -214212 -100044 -51658 -111951 42849
18555 -201641 95022 -235418 146 15206 -15429 41409 -396470 27794 101257 -258976 -1921
18543 104605 -1681 127340 -129039 -242661 123582 -405847 56616 -182975 -1151 -433457
18533 -433457 210190 -57359 59336 130802 -176157 162540 37748 -74933 -189265 142190
18522 -15714 -220235 144420 -4884 186172 21583 -130914 -51761 -7561 -219471 85885 -95318
18510 -85370 187036 96450 -206305 -74375 -14692 -88971 -45288 -59724 -135040 -10344 102053
18498 -74421 17169 -41110 -64328 -95870 312835 -93235 46270 -53454 99436 -166495 118943
18486 24623 -29421 -253790 161438 -8600 -29175 147110 -53818 -124076 -36304 9391 109956
18475 109956 20749 269455 -380353 112321 -106230 -237663 -6130 -135980 156785 23792
18464 -301530 281464 -100721 174871 -298338 -72885 -41633 -183863 -254335 67586 105869
18454 105869 40208 52039 -328416 -160151 -202950 -391904 -38288 -67767 25438 -222179 -236551
18443 -236551 -22042 44639 -68856 327245 -64254 129383 -198047 144802 -167913 -397752
18433 -397752 83400 -25408 -124032 -109508 74876 45242 27037 -390446 19929 116918 -307329
18421 67225 -300796 -157185 -184343 -256578 -195672 -238666 -146451 -142043 -127844 -2494 -174924
18410 -174924 -42964 175496 -129767 395544 274597 182587 153403 -4421 -89924 116384 -120010
18398 -111478 -273964 69879 52154 -209626 -194248 -82004 122077 245098 -15923 204096
18387 -131664 58549 -29512 -60580 -194699 370005 29761 9244 -104439 -339130 -218764 138339
18375 34270 -45249 -390456 87456 63467 193936 -289402 121962 108179 33560 -107114 -153131
18364 -153131 39861 239641 45457 245008 109089 74741 114527 -72051 -5686 246005 21512
18352 354983 -232393 -260957 -184954 -168722 -74134 67291 86105 -7643 -335859 217014 113889
18341 113889 -63285 16021 64660 2163 232935 5058 -108242 -20449 -202393 -122970 151913
18329 -5632 121692 156263 -310117 -34872 -33622 -132801 165742 28996 -96006 95196 -149401
18317 -67832 121123 100284 180083 -52946 116945 -188907 61181 329879 -223692 -244421 -66439
18305 -39721 -54550 -265651 13601 92904 4362 8133 410267 36718 6116 -231303 68067 -124042
18292 9176 -49539 -174371 335467 141561 179903 -3699 108032 300877 -127595 110062 -26774
18280 -162307 -115153 -64473 -157885 261894 82638 242646 -33863 39223 179701 -445839 139514
18268 55720 -56779 -261055 -246757 -132033 252107 -68489 35292 7283 -230483 -254412 39463
18256 54612 34877 -221278 -99696 9008 -142505 -189394 75691 -270379 22494 324501 -214385
18244 10270 26143 -91975 80467 -21365 -18392 -58418 -163505 -110233 -184 -206514 -244711 -60820
18231 -112828 -89401 104993 153156 -182801 -56418 -107620 375817 -15242 71186 -145553 -15997
18219 -182873 412063 -52629 -279779 333925 -124646 -191819 -241803 90459 -228742 57635
18208 -312301 -78361 28307 157657 -306618 98302 60148 72512 -6526 -91584 63856 34110
18197 34110 30214 -207775 149333 332975 -201712 -61511 -436008 -87711 -10561 -96038 265923
18185 22638 -128525 -85460 140985 -243242 -230603 43482 -60408 121177 -117696 -68113 53300
18173 -123058 35178 -184109 -93467 37764 84347 -89099 -380553 -161869 -74505 198776 108751
18162 108751 -65760 -93845 2535 -87856 -268199 -100329 -147793 76239 -298858 -374081 -288903
18151 -288903 -51101 123733 -126750 -535606 59868 163850 85152 -62313 -182581 -102599
18141 -102599 261129 175115 75220 199256 -40623 -50960 45203 -56168 262511 -54867 27693
18129 -389258 -1323 108950 -394167 -178773 -248236 20340 23387 -164652 126374 -38197 -140369
18118 -140369 -167618 -281385 -191435 -62215 -17187 183619 69736 -51468 126232 233813 -22782
18106 15220 -223891 89754 33648 -101833 311202 -127566 -20517 49278 -18236 -58866 -142111
18095 -142111 -112510 -98593 108604 19675 -5187 -2785 -413872 9982 -220295 124354 -100015
18083 -69594 -191086 287892 -265682 125036 -285184 -19597 146214 51149 196050 -34197
18072 200536 -153807 -405951 5404 -163575 -113384 128643 -25399 -152012 143003 -190289
18061 -63942 -109510 -59898 344416 18444 -3047 -25460 199936 210967 10894 -155988 -13792
18049 -166853 86538 -29641 -84644 247226 51094 4280 100901 -100256 -186576 97555 -154742
18037 -214963 -283920 -233333 -175084 106800 79835 -240356 -204105 -135047 -278819 21393 -160666
18025 -178172 -242743 -44854 -154407 -89358 -410604 -152391 273591 256399 58322 -75342 28424
18013 -7948 -131726 159999 766 93523 -10814 74453 -30570 -162894 -76943 295150 42466
18001 -201152 -139289 -70451 -57451 -44987 118331 -24997 153501 -252058 -102137 -143694 147797
17989 -102878 -166766 141629 -309757 -39012 -18710 -11098 -4875 -233639 -128185 32004 9748
17977 276718 -85989 -1450 -245361 220665 -246871 -137174 -350155 -162170 292730 -8287
17966 -36485 -204892 134225 -76631 -5487 73223 40869 24058 -283317 233526 -148348 187805
17954 1526 83237 -39994 -250332 -129289 39266 263371 -159406 30582 428607 181427 169006
17943 169006 159465 -379133 -136 102480 -3900 -79995 -78791 117042 32606 -170960 102106
17931 -207752 188862 -115389 -33273 -138192 -98655 -355999 96013 65707 -203117 -255807
17921 -255807 -183985 -115041 57849 -57964 58623 18430 -240117 27897 -155310 125581 115038
17910 115038 -3621 4194 213943 300983 8918 88166 185686 -320592 173147 133909 69230
17899 69230 -25643 -33228 -50837 170831 -174458 22190 175148 106545 -295294 -22334 102120
17887 159597 122594 -4855 72120 29951 -203105 -172775 89762 93390 144982 133030 -29485 6756
17874 -314179 -64760 -75677 -31783 -83486 -34526 -229585 357038 54534 -88796 -60966 -50624
17863 -50624 85598 -2544 -274083 115574 229610 -28221 -175022 -330572 -202445 256141
17852 123984 -181734 -44488 -89161 163007 5832 90405 219307 -54174 96878 205403 -180725
17840 -241297 -179913 93606 -98936 -118487 190749 123110 -165632 -68691 -63170 -36941 -108521
17829 -108521 -15151 -81848 148776 386716 506862 258984 11632 -58524 95795 -110501
17818 -89731 100931 -69503 97585 56682 103686 7313 -88360 -231583 -8128 -126491 -14498
17806 80451 -43421 123721 -187322 -86078 54137 -261009 104043 91923 222456 44133 221932
17795 221932 -34806 -107324 -115916 -75117 -16704 158346 15292 122701 -369838 228393 -208622
17783 -33147 -87155 48952 154137 -204983 -169124 273998 138564 212926 -98391 -162371 -114858
17772 -114858 -70462 158260 12944 17172 87223 19965 40010 159308 -41865 -45188 -21362
17760 85799 123599 40308 -102623 -113585 15945 4560 -256495 8554 232157 -2209 104768
17748 24733 33420 -330238 11587 -145013 23243 -90500 69838 52052 -74865 -168890 -6135 -18432
17736 -18432 -64238 -58379 62082 74005 -44536 228890 -359203 -226369 -295773 335553 -70992
17724 -56143 155559 30612 103496 -146273 -100988 -239408 218064 -83707 153978 50223 -70002
17712 -337304 -147227 -151332 16567 90212 156490 -56715 -208823 20074 128805 78942 -321893
17700 -10666 184608 190468 151011 120574 46096 -191445 -163659 117773 -117234 26823 78220
17689 78220 -83743 55101 -335587 -126425 24396 59138 -300182 39934 93630 301614 -51460
17677 -270863 -326400 -242691 -36996 173484 120720 62796 157590 -69516 -39068 -11741 338333
17665 96321 -70651 156597 186358 260490 -119116 55674 -126577 -55181 37458 -44203 118181
17653 -117371 -203059 105079 -205054 -199028 93252 -179807 114557 -182112 175207 254691
17643 254691 411773 -83808 11225 20492 -112306 124900 -50036 237770 -79955 -99124 181584
17631 73521 112726 -108806 14290 8692 58543 85110 -212263 50063 -124997 212701 22662
17619 6777 -133012 59239 -353832 253427 221874 322989 87963 -157187 148276 -266023
17608 95456 -50181 205426 -33964 114946 -557557 78593 169037 58563 64802 47616 -2232
17596 116862 -86083 -162415 188511 -183911 61298 5035 494453 276021 61182 -200635 455123
17584 -70885 39471 -54593 -216256 -48672 -203042 32584 -47850 326216 -62327 249491 180290
17573 180290 49970 -119738 34115 40298 212983 -5450 -16413 -59150 -115670 -29606 -3605 106816
17560 41433 -212498 -123268 101993 137726 79997 129475 -230533 390 108930 175848 -98728
17548 154673 -60980 162134 -182816 -88043 18221 131700 117776 48168 -58811 236909 294075
17537 294075 98880 71891 117618 124245 -76602 50023 2316 56932 -42498 -28093 6980 111244
17525 111244 192254 156162 -87340 -231138 75647 308881 152138 -159152 -245818 272951
17514 459035 160828 178733 22163 147137 124780 277942 289337 208909 235504 -269994 192288
17502 284532 97267 104773 -25950 67299 -215064 24588 7487 10661 232017 146571 -2643 112733
17489 80782 415816 243632 -71532 83562 -13842 385375 48606 75108 7131 75617 22759
17477 67644 -69033 255842 -73007 184897 315130 71615 80020 109648 378580 196515 190202
17466 190202 -29299 241772 -151577 269603 28693 -24678 35391 -117777 -188206 -69427 -36081
17455 -36081 193028 87737 331332 131459 229077 -16098 155543 23529 68620 58592 260739
17444 260739 70899 323898 537030 248859 380795 387549 191057 -116311 208962 149104
17434 149104 47302 186659 245579 9214 256957 -40105 -131847 111112 230217 -29594 145217
17422 181128 343450 367520 271528 50900 208671 489687 187022 439157 78310 40206
17412 40206 -170239 5694 128656 176857 121929 232566 -370213 -69035 140021 -167862 -76380
17400 -33465 162844 184561 403507 105629 16655 -42230 154124 172780 -47531 23214 257401
17389 257401 46158 336029 99056 148715 37274 142233 191953 -128253 10512 -131826 295870
17377 -109569 -15498 8475 154114 388222 54043 149169 31799 126956 160639 62515 -261524
17365 28134 231636 114513 457066 120134 16215 -87328 32958 194529 272159 186527 371538
17354 371538 148748 166753 363774 383617 121278 -261928 421911 -18103 148862 -22997
17343 290285 -71048 284104 47202 144814 -131384 52748 182331 63598 198560 217902 581529
17332 581529 -97550 -32030 71105 184525 8651 105733 -28559 141557 -225481 158007 -154775
17320 209144 129226 -90830 188031 159290 134065 296031 281200 430575 -137193 -49607 52273
17308 198010 -35523 106980 16760 86714 -120601 180613 59806 306799 -66162 79422 139071
17297 139071 175522 384929 5277 11972 145360 -288773 188864 111996 208250 349215 264224
17286 264224 22570 284656 -82777 103681 141306 157911 243097 22610 50529 -240783 146776
17274 -10383 177637 139298 -342341 249398 332138 94102 195404 333259 208705 169213
17264 169213 -79832 52404 2896 -96462 326527 93955 71615 -41581 -42548 -113564 25688 306254
17252 306254 -26031 318166 158463 367884 484914 -56731 -74375 158959 -36473 74085
17241 -116277 455957 116045 339737 400318 172195 2532 333712 202277 62304 192190
17231 192190 28770 160571 310532 472819 -178736 148086 39519 -104957 290890 290980 118640
17219 463653 174061 -72467 351311 311158 30758 468267 -119150 221883 -17944 -154270
17209 -154270 -180278 265411 286416 330206 131480 -91309 -109150 404127 123665 46516 361947
17198 361947 -25498 234922 104719 326214 570009 60270 155840 549295 686553 213983
17187 110743 254052 168912 296247 -72239 123293 204819 135988 500268 259988 508573
17177 508573 106751 220964 -88507 345176 619272 310637 269379 578034 -112238 401278
17166 317626 170419 152830 143427 356919 -129787 84489 303848 512397 222948 117548
17156 117548 645220 329378 411680 218246 280896 248728 266142 281846 150706 119389 362828
17145 362828 273560 83047 300846 274469 1290 287746 474396 288680 545614 359248
17135 359248 306200 279343 283973 239714 58338 -166050 108984 134171 204260 346916 8448
17123 281618 117924 60675 322079 356247 209966 111914 282325 186349 168568 306265
17113 306265 353945 520680 211904 437189 522952 128618 284677 81459 205799 352882
17103 352882 220851 24139 266562 414769 434644 464491 359308 594534 392014 717120
17093 717120 424360 277020 282756 479403 85945 181584 382963 459259 441233 334441 396186
17082 396186 442999 490728 369335 480137 486040 33109 472442 559879 486036 375752 447671
17071 447671 6323 467289 376831 15536 69177 296713 243658 179253 652779 248210 468093
17060 468093 318325 356747 511138 416011 315372 307256 336417 366806 480281 391229 376476
17049 376476 509868 77039 218229 343677 324222 598764 531749 78893 336650 644893
17039 644893 561875 469237 737911 543891 236999 325747 453137 561392 589881 565557
17029 565557 313612 591450 692680 749024 587339 543571 614013 603178 463506 728902
17019 728902 271874 462252 692272 701951 459521 511944 524860 718892 556062 265830
17008 411987 777344 582671 355690 628630 796557 653678 812934 568457 621918 878468
16998 878468 951660 438772 400354 770216 686806 358103 385094 673287 921563 631173
16988 631173 663858 807951 495466 595473 839236 349247 460134 590003 906322 613275
16978 613275 914578 619813 788679 1016904 585365 839462 413320 452638 568517 835211
16968 835211 562745 907254 844224 943618 864716 758674 936819 878308 673285 593226
16958 593226 1322248 685486 1054401 1092226 603451 1027733 866443 996040 1054110 1157812
16948 1157812 907811 754756 913364 1149182 1063781 700572 957697 1261443 989221 1108337
16938 1108337 697748 1292446 702203 1101593 1334079 909206 884064 1419591 1345481 1005739
16928 1005739 971959 845002 1159695 1117990 1157000 1181878 1330814 952172 1234221 1056340
16918 1056340 1077261 1339131 1106343 1689757 1420435 1081221 1215190 1528257 1030521 1130498
16908 1130498 1368703 1239609 1321460 1230859 1437580 1665011 1293434 1686818 1447609 1530136
16898 1530136 1467364 1471357 1343288 1494041 1680506 1516288 1742869 1839495 1506777 1485317
16888 1485317 1587688 1809542 1517646 1600533 1970395 2232656 1662275 1638956 1823066 1918927
16878 1918927 1819310 1946614 1994516 2467313 2106294 1739605 1884651 1847214 2029752 2347095
16868 2347095 1990564 2042194 2185221 2288469 2396231 2271778 2439007 2105710 2435909 2621618
16858 2621618 2784311 2615593 2550292 2502330 2743230 2625249 2578540 2748372 2915691 2257631
16848 2257631 2562941 2801132 2872453 2684353 3103660 3367282 3046845 3231923 3302699 3200303
16838 3200303 3192541 3490891 3470594 3800950 3411034 3604637 3765679 3954599 3729020 3872435
16828 3872435 3910496 4135196 4231126 4250790 4115736 4104214 4351633 4523730 4493641 4614978
16818 4614978 4612108 4662639 5012873 4940045 4958868 5150162 5277585 5227551 5424758 5317890
16808 5317890 5886050 5795820 5811399 6205570 6098710 6268160 6379828 6841843 6819299 7089703
16798 7089703 6741567 7276959 7468117 7823371 8007806 8208612 8157226 8371139 8679279 8834553
16788 8834553 9148139 9241933 9784256 9780968 10210133 10494325 10604932 10910968 11505803 11861965
16778 11861965 11910480 12373298 12782745 13160844 13714259 14369938 14719030 15200058 15658508
16769 15658508 15898549 16767259 17352153 17713946 18399728 18975990 19531882 20718834 21701535
16760 21701535 22235460 22980058 23915768 24572926 25825223 27443722 28539096 29871347 31333797
16751 31333797 32837733 33717765 35959252 37924136 39370638 41482401 43835621 46038198
16743 46038198 48549123 51277814 54127631 57209337 61030399 64423254 67977627 72316379
16735 72316379 76410179 81127322 86512793 91574526 97434979 103479491 109737250 116085911
16727 116085911 122486945 129313224 136246067 142667390 149338582 155282630 160958355 165799266
16719 165799266 169523436 172707218 174562950 175408644 174710819 173117501 170320976 166843132
16711 166843132 161917347 156348489 150167721 144079707 137304758 130711503 123643344 116898215
16703 116898215 109894604 103664474 97515904 91737539 86320613 80994665 76355446 71741600
16695 71741600 67593457 63775071 59938777 56418041 53612138 50432722 48132375 45307684
16687 45307684 42645568 40673660 38511370 36872454 34924866 32971219 31620793 29996255
16679 29996255 28778863 27218913 26436288 25179883 24045623 23274598 22110841 21429652
16671 21429652 19896356 19589980 18691141 18322235 17436351 16923313 16053623 15696174 15105189
16662 15105189 14647584 13924589 13351100 12998293 12509845 12097294 11705245 11631733 11172533
16653 11172533 10852273 10623273 10354798 9745338 9593218 9171183 8939199 8845291 8390311
16644 8390311 8373834 8239347 7822938 7596907 7419798 7354159 7009285 7008931 6761411 6515693
16634 6515693 6268542 6217656 6113023 5972047 5843846 5677741 5699565 5465454 5232542 5440259
16624 5440259 5026842 5001238 4847458 4780998 4664624 4415526 4252152 4441170 4638863 4162884
16614 4162884 4128231 4140369 3789656 4008576 4069590 3769281 3136117 3611594 3296524 3241691
16604 3241691 3195090 3512761 3047040 3095181 3214657 2963913 3035511 2903119 3012657 2821587
16594 2821587 2741104 2463880 2637660 2597400 2912600 2503152 2596466 2244427 2382005 2359923
16584 2359923 2492428 2340168 2211622 2143985 2363997 2355619 2245488 2184415 1768359 1895021
16574 1895021 2072007 1984423 2054442 2241138 1702492 1838133 1882877 2038171 1802719 1744303
16564 1744303 1654121 1889544 1275571 1730927 1854791 1679066 1513638 1625825 1397696 1569588
16554 1569588 1480541 1347569 1489303 1276545 1454436 1363162 1766728 1417483 1264610 1117853
16544 1117853 1230223 1298684 1457155 1483051 1428491 1234706 1131408 1165624 1063984 1351373
16534 1351373 1345298 1074961 1365078 1321283 1401229 896750 1125692 1002003 1106846 961083
16524 961083 914910 830362 1156930 1043721 914834 1149275 973612 853166 1291647 1281371
16514 1281371 1073314 815548 761460 967624 857967 802965 1134636 1008044 1109897 475759
16503 668288 793795 1050434 1131685 912434 810399 784302 620144 1011805 521275 753002
16493 753002 753280 809075 825487 549195 839636 754141 1024717 869941 441317 492263 840358
16482 840358 655167 730212 705340 572228 701778 711305 709850 510951 493193 589008 458096
16471 458096 654936 299100 627424 810556 535231 524291 516681 692208 475977 857229
16461 857229 548870 418737 455078 710436 201193 529158 514817 534139 612727 428329
16451 428329 754470 213533 491951 669557 653371 453163 567497 219499 381668 437450
16441 437450 602627 662714 220703 521847 482540 463587 581407 352245 412915 347378
16431 347378 441545 426735 118759 364428 167858 283439 282694 355903 345530 156732 456530
16420 456530 311987 322899 406079 374919 553680 325931 559324 270990 313422 420505
16410 420505 131015 461941 504082 259755 544106 289640 554881 390499 343260 343391
16400 343391 440424 488376 421105 144237 455309 -196574 220289 200146 343445 442032
16390 442032 30652 247110 599076 105567 62569 283825 186567 162639 378944 284675
16380 284675 133038 194249 110936 82851 588629 247648 -16744 108736 262414 167060
16370 167060 151953 184166 350713 209207 317775 339393 155100 166598 95983 485413
16360 485413 -102145 466820 237186 380447 -150442 348842 -210145 583455 293251 14185
16349 23318 -147781 234010 33329 289935 389184 39535 424077 -145708 405055 291570
16339 291570 48180 65880 437514 -3643 341673 267946 254987 245414 229507 -56692 -39788
16328 -39788 -61272 277692 357018 -633 303150 67753 -54788 392363 250879 27248 -7452
16316 68777 355425 101533 114041 293929 117324 108272 344861 213492 119962 135413 -87909
16304 172608 -1080 306400 -40132 420249 177322 -89756 310747 -113036 331864 -83426
16293 116663 101108 24848 432709 162777 148900 58944 36733 51061 -68062 116686 94365
16282 94365 -13714 459355 173670 458248 -82758 232783 192857 78128 -36323 91223 -23236
16270 334724 -9870 226434 321061 -141235 130550 88844 4381 196254 -205165 9838 -110216
16258 90041 182981 288668 95587 48778 230718 133056 228250 48695 -120702 90243 132305
16247 132305 168658 113960 286311 20526 168267 352044 65173 87437 -99325 386923 122576
16235 -17866 24491 292327 210483 389583 65712 211942 -138705 39564 -185160 -2548 49149
16223 255515 295152 -238733 108264 145909 87959 328489 323967 -84078 117384 -66525 -134838
16212 -134838 -155861 64634 43206 -19923 7383 30843 -2922 -70239 -110806 82315 187686 -269582
16199 108240 -189686 72994 -191747 -49322 77834 -123806 141291 -21583 -193223 282459
16188 126440 -265452 -106956 76601 -36204 -32772 70886 -22126 104821 -28344 171172 -118748
16176 62347 45197 -306409 77047 17965 -285102 96294 59764 40261 -63320 183966 -146858
16164 19376 141869 207272 -226982 162784 -43857 -72296 -204996 96978 -69993 180649 104439
16153 104439 222583 60693 -148104 217693 -32281 -183047 134948 26518 153000 -128608
16142 -57822 896 -118107 233746 205542 189791 -181890 -53847 -228126 187766 164847 377199
16131 377199 138629 -182228 -39715 -76474 -506531 -343789 -153475 65366 278815 38233
16120 -69822 -84751 269227 -95216 -175226 42941 -341100 35421 -72290 -104812 -356855 42655
16108 69672 -286273 -11047 193375 -9812 92589 346963 439075 -28254 -96435 188646 -56647
16096 21600 103498 -112734 -104345 -261160 -64746 -164405 8398 -116486 17904 85689 103977
16085 103977 -207736 41647 53938 44979 44252 68851 88839 -214748 -83582 -9713 -50263 126987
16072 15244 451727 79318 210735 -259130 70455 -74601 -7705 -252971 146150 135303 -57933
16060 19389 166512 51442 -103706 51441 -90743 -319019 -58878 201299 188824 -19160 -155661
16049 -155661 -184573 31586 46921 -200392 -150780 -39097 -25368 82964 -92454 52540 67422
16038 67422 -147059 -109069 -31678 29795 -57949 -223938 48413 199556 99111 48206 63420
16027 63420 59718 -126671 7501 -303234 84312 -60163 173057 36155 -152283 79204 -240121
16015 -125585 -189791 -153671 4615 102078 -408660 -80611 53705 -30524 -48650 -629 -45377 -245125
16003 -245125 -138433 158737 46427 -71990 -208912 -86732 11689 282613 141244 -78974
15992 20290 -20133 213349 -66916 -34153 201827 186245 -162669 231334 128899 120088 370338
15981 370338 466765 512508 227857 175122 290799 -163265 -129678 99743 248482 36057 -51237
15969 -227294 -74480 27463 -342399 333252 87549 21829 -185600 125666 32798 187019
15959 187019 98857 836 58292 -27158 166401 -6542 -160572 -95063 -205615 -160990 157062
15947 316504 -298479 143577 173660 128360 98569 -147185 134697 -1607 204013 393014
15937 393014 -36886 -155401 -195935 -495056 120013 118404 59706 -74706 115825 196021 188622
15926 188622 -8859 41194 33689 -134510 -479346 -437971 -103754 -262991 -144892 -94968 -64306
15915 -64306 152460 125524 -94099 -261879 174100 175958 47245 -330548 -228577 -91709 -288743
15904 -288743 113732 209716 -159906 -185902 -174217 -162031 -109583 80028 89777 -283886 168076
15892 179885 -33513 144322 112612 -188676 52358 -102432 -152356 81096 -87317 -314013 23649
15880 192143 10835 81843 -179082 88103 -157708 60943 104498 -116150 6524 -169593 57804
15868 183057 -5600 239909 301975 -61879 -175842 -227914 184638 -306413 102363 -252447
15857 35269 -136473 -201967 -99440 -98580 321069 -226307 54784 -250243 -174828 -35266 -115182
15846 -115182 172114 -408539 -122384 -188945 -25485 -227791 -173122 41900 143671 -204899
15835 184679 25413 103069 -23521 -31720 -107019 -12580 -71534 37663 260469 281879 182207
15824 182207 -19368 -229070 460596 -82644 153708 92623 162882 -15981 -380822 -124942
15813 -119862 -152719 -181218 -126022 -302896 -368875 -179552 179070 52865 111608 -80943 262590
15801 245521 119887 -251059 -313619 92768 118460 -104054 71050 -35072 140114 -108163
15790 200042 -82572 233938 102175 -55965 -170802 -102652 -88012 -145099 33028 -289776 -227160
15779 -227160 -422318 -37071 -132131 -123663 31300 -190783 216077 122845 153431 -380685 -196678
15768 -196678 101287 204562 154175 -78537 170074 -205239 133170 157209 -208265 258789
15757 62667 219404 64248 110238 70958 205978 -47196 -70412 -152367 -146824 -59414 232818
15745 172663 -6940 -183521 -1513 -114437 -132458 89302 152193 -283676 -32217 -1965 -263272
15734 -263272 -147107 324153 -260330 -188491 137346 -132390 -51898 -31213 -17383 -393003
15724 -393003 -221546 -153664 55063 -14436 -119416 52253 -1697 98246 228211 152230 38705
15712 94156 -64115 -9604 11233 -207419 -449203 -91886 135700 110456 -70605 308281 19232
15700 -153088 -201033 -67962 -164620 92451 -161263 20346 33468 -64769 237312 82882 188744
15689 188744 104300 45309 -45297 -146139 -7930 45461 -171003 -29475 94106 -202465 -147727
15678 -147727 -211477 -323743 -81707 -361047 -235677 -60374 127086 -17913 170519 -11304
15667 94874 -116262 -134100 81281 -22760 -222077 -214060 24182 -96679 -125378 -47230 -256965
15656 -256965 -90506 -94312 -366350 -20592 -48457 -65045 -77281 -301006 -40606 368210 206553
15645 206553 222020 133286 -180500 9870 8572 -143940 112332 69745 -63578 42870 54661
15634 54661 109075 -17816 63257 -82915 -257220 -103260 -235971 115605 35070 39603 158719
15623 158719 67178 136898 -31581 54167 -121624 -12221 58587 -51130 -218714 -63026 51628
15611 -9485 -133154 -262975 -20551 31767 80578 18508 -80793 111015 368224 1101 126669
15600 126669 166389 -129706 118183 -309805 179864 216375 -152275 247304 -169415 201104
15589 -7779 155080 -19318 -56002 -309462 -65924 -116373 -122577 -110163 176064 -6590 -6064 297732
15576 18961 -314192 -64306 -59908 245706 142128 -94443 127280 -249352 327537 -148389
15565 -177900 -371258 167220 -167901 -70016 -233598 307155 193504 -28878 261761 -120075
15554 -44238 -111094 -377907 -41240 -112551 230124 154062 203749 -710 183176 46452 -182410
15542 100957 -216857 17659 7012 18646 86721 259706 190769 181410 -18622 -5547 -90211 -425536
15530 -425536 66085 -60577 -56382 -205507 -454961 -47645 -101559 23509 175820 -108759 96038
15518 58108 -102489 -38285 -154151 -350923 199912 89056 24449 -58069 197754 54176 175313
15507 175313 -35607 -57683 139211 -203108 57030 115694 -62851 -14807 138584 -33897 -92581
15496 -92581 -93538 11557 13145 24392 -71123 212098 93160 -42251 169824 142960 95499 -26383
15483 61014 -151088 -153596 -62378 60977 -109843 33876 333152 -78934 -145952 22839 378731
15472 378731 36368 108267 223332 47764 -70890 -165562 -11359 335073 -30426 -261848 3604
15460 101863 -15457 -38337 -105136 -155415 -254331 -100935 -112281 -66170 -38749 23894 81619
15449 81619 98205 33963 -49827 -225584 -158619 -128647 -80781 140471 151840 -112164 -70459
15438 -70459 -114863 -300439 -21877 -176382 38080 -52762 -251967 82098 -273527 -423626 140707
15426 19638 66169 308616 -197416 52099 -271510 -64402 -61696 3799 -36219 36848 3845 -124058
15413 50017 -287652 137792 386394 -101805 -201266 -164368 284287 -144659 -208388 -51 253095
15401 -130225 -20284 53318 -161050 -47315 -281304 -32358 123263 -71155 -131813 -118978 -171657
15390 -171657 -59134 119993 48140 -75216 -270809 103801 -257216 -138327 41665 247153
15380 247153 170805 -126673 54028 -426205 -214269 -192188 -275352 -257068 -5689 -49319 216444
15368 108068 -326855 143629 -373086 38960 -86732 -6401 65097 318469 164282 259 83959
15357 83959 -69814 51390 132457 35956 -287751 29841 103287 -75719 -19341 37384 186769
15346 186769 -177461 74476 84064 -54637 167939 -22740 146676 146632 -122215 32146 220450
15335 220450 207643 -144301 -132426 -179982 -59522 -239235 -82119 -194513 -157029 -317784 336102
15323 308819 14775 73593 301526 -31178 156877 6947 34911 118815 -141926 255596 -59918
15311 18770 38014 -164883 -228048 -85655 199631 -209400 52613 63166 -118878 93635 149441
15300 149441 128101 181603 18494 25913 -227297 -144199 -54151 46502 -254313 -10889 -60403
15289 -60403 -91646 113828 213737 68900 256849 154289 11227 29475 -159242 96128 312428
15278 312428 57434 -44856 81538 422601 14306 -4386 66472 -54014 -402882 4638 56262
15267 56262 102455 260647 162262 -96464 -155790 -11864 105402 -101961 102402 79555 16913
15255 99142 -309080 -102690 -80354 73800 187579 309173 497293 714413 883112 939099
15245 939099 1019852 769200 646600 262439 197066 115112 24034 115603 224013 230919 -107803
15233 221546 129511 44454 140040 110416 169898 152621 -218245 123424 167826 92513 -391449
15221 75216 236720 124849 -102914 155393 -43082 67152 -179082 93104 388526 69898
15210 291213 -226648 -37766 4441 41723 259236 -219389 -68367 55339 118160 224408 -8172
15198 -358430 188991 -37983 197695 54735 -90921 216037 158222 30069 -26222 243216 332937
15187 332937 -134994 206777 176630 104760 79524 36535 130201 -96942 20583 -63882 -133600
15176 -133600 59484 -196315 -31345 142081 150910 100901 351774 -243401 -34618 159667 -14539
15164 268842 190926 131472 -75897 41538 318688 11048 -232846 109360 -106617 63987 254869
15153 254869 178600 19620 28348 117963 23356 6523 126594 64330 -21189 -128237 -2284 26396
15140 700148 -22734 -219990 211533 -10230 -8051 -273181 160054 -87589 109779 26986 -17652
15128 494787 242033 34442 230898 39133 228012 -70145 -13613 -39884 -199361 212368
15117 161882 -3759 100813 55176 -2931 39873 158131 188830 337399 171312 20044 233918
15106 233918 -49816 -242453 96784 47027 -17521 591736 177007 -8920 323912 133719 -62005
15094 50735 148670 88168 -124836 -30512 148442 43903 18102 -81111 177798 -59355 165535
15082 -82030 101074 64917 27398 132831 229659 196233 -13927 -270194 19586 67965 -186905
15070 144588 100302 53247 208662 139545 121381 -142154 128302 -33006 91308 -39873 80549
15058 -48497 -30392 294875 98408 295065 105900 65213 230526 48937 265082 45256 281474
15047 281474 -62462 -115618 -224246 35749 -104197 235465 167568 -33835 -36742 309565 -105181
15035 342154 271630 46348 239760 157559 84398 317246 375687 200996 76706 123742 291863
15024 291863 218945 216092 -177824 215600 64362 59199 43191 -30949 212035 15099 -63429
15012 231018 -199702 16041 341769 106493 129728 -1382 31872 -66925 227709 39333 168967
15001 168967 -153103 25234 250696 463675 96946 623204 160787 498771 23424 421465
14991 421465 79437 155735 370223 -120534 157833 -165815 413859 -60362 259914 76942
14980 -198976 151068 400393 132795 487353 -127080 105632 -41290 433829 198446 373587
14970 373587 360378 -72748 237462 161432 321433 434186 60730 59130 410327 445916 385067
14959 385067 265050 24351 94440 116468 282782 45398 140715 126042 331797 360704 -121263
14947 198069 6375 365757 185491 94161 216885 337099 -117247 204381 44749 134482
14937 134482 357302 -141805 -92684 393197 -42789 444382 269306 108234 -367772 -8578
14926 309923 13405 95227 353531 256261 -57557 196643 343210 510498 405040 408035 349884
14915 349884 -4488 83443 148100 397404 179758 163731 60211 358392 319435 339495 -2227
14903 12205 289127 488231 79811 512601 356699 -144797 348465 264689 271345 234608 316916
14892 316916 479174 234213 3362 220190 499040 98466 293412 60873 383118 184202
14881 96675 196177 286959 176666 475730 231226 486070 231020 315896 220197 431551
14871 431551 143648 8939 68933 245462 359783 117542 362815 213261 139319 254502
14861 254502 135436 402313 277626 132441 168687 243909 268098 458790 474989 602700
14851 602700 314678 421513 539844 258346 71981 264148 410806 94524 506546 350060
14841 350060 108468 258570 562831 119252 521355 393984 470574 244283 495961 389923
14831 389923 456104 432888 402982 241569 306707 298546 434784 421730 688356 237631 613987
14820 613987 421560 362687 646902 253256 384412 598903 313082 591751 250364 105460
14809 180959 124165 448927 498986 379845 300522 387561 427141 -13475 98753 439340 560610
14798 560610 268928 634831 187147 526650 201474 379467 358494 308055 424490 444309
14788 444309 570835 583840 439133 509574 396619 414058 234734 243938 400369 473665 422872
14777 422872 600410 562007 368442 211086 461820 431283 465887 549610 42105 545433
14767 545433 457228 518725 467689 280168 743752 238259 329686 293896 515627 328538
14757 328538 159009 427274 476616 927354 293662 772740 741387 775489 319304 451163
14747 451163 740983 488924 576871 424242 633546 888563 802433 520744 595879 375814
14737 375814 460495 577790 633213 666579 523182 793197 573975 551619 349808 644509
14727 644509 417397 542446 579668 601836 406430 442693 985350 703450 727805 703894
14717 703894 465545 712355 877126 755428 619413 667158 961694 774545 714848 380387
14707 380387 709553 950682 681391 703173 396609 562610 804418 770466 762681 593339
14697 593339 412841 826110 566325 785117 652163 939465 749769 553478 772907 885259
14687 885259 351419 585178 664798 1162770 557004 578735 597704 664312 698263 805832
14677 805832 1163055 788728 686720 1023229 665884 714621 1054253 649017 1160322 897137
14667 897137 812532 462639 965623 1274394 576356 899290 1118858 791456 652878 822352
14657 822352 810370 871951 824768 578334 975598 1070124 896863 833164 885519 778866 802209
14646 802209 884994 1116639 1236520 913204 844934 733393 1369673 972550 1196063 867645
14636 867645 1089433 955019 879069 1221474 1138256 1073646 932965 1332508 865476 834909
14626 834909 1160453 1232691 1204778 1366535 1095885 1007198 917385 1186031 1117860 1106652 1200246
14615 1200246 1638813 1192113 1079219 1030429 1253407 1225829 1355650 1443791 1401465 1052160
14605 1052160 1149645 1074971 1054196 1402130 1485543 1113765 1476403 1264277 1743744 1275587
14595 1275587 1306218 1492485 1193785 1573760 1643061 1500156 1197818 1654142 1660817 1498351
14585 1498351 1748682 1300079 1522735 1666787 1613351 1661245 1604298 1443867 1533894 1715113
14575 1715113 1733299 1683521 1831536 1392698 1862724 1752097 1705096 1615675 1566259 1913027
14565 1913027 1837745 1904823 2053814 2243675 2236582 2186744 1852740 2326277 2455560 2536867
14555 2536867 2772129 2759610 3160899 3621115 4348644 5810693 8441422 13455176 23201023
14546 23201023 33504440 33148191 17923732 8035081 3659783 2296403 1855410 1555802
14538 1555802 1412697 1595353 1792587 1680621 1970137 1968550 1959391 1469916 1597456 1551851
14528 1551851 1981330 1659877 1615090 1911568 1854972 1821636 2157108 1619719 2097039 2087203
14518 2087203 2144031 2085081 2304765 2073366 1866182 2247160 2091083 2366539 2520402 2327187
14508 2327187 2329212 2556119 2581051 2729317 2444202 2262202 2300902 2270683 2412409 2444848
14498 2444848 2613115 2691198 2820951 2666174 2650123 2664283 2815957 2706074 3001651 2564320
14488 2564320 2633851 2739240 2999260 2759303 2867003 2998415 2931666 2659023 3186583 2762270
14478 2762270 3396842 3452972 3177096 3246843 3057344 3340539 3454328 2786439 3262884 3331943
14468 3331943 3319522 3558528 3712519 3469398 3737135 3786933 3705780 3937164 3635855 3862269
14458 3862269 3785465 3800985 3935990 4185533 4274568 4329840 4190661 4275838 4569090 4660614
14448 4660614 4492907 4512206 4760830 4421755 4661260 4875809 5005600 4584100 4928335 5125584
14438 5125584 5044662 5192622 5337496 5241217 5447993 5618305 5360888 5913172 5750316 5572749
14428 5572749 5645919 5719359 6131729 5881725 6550409 6055210 6268064 6482816 6610461 6533804
14418 6533804 6385612 6588620 7132773 6592580 7057371 7071176 7313091 7500382 7528856 7710769
14408 7710769 7719310 7784972 7873325 8020408 8123566 8361779 8340114 8535797 8684062 8685980 8962241
14397 8962241 9139554 9392550 9364687 9576292 9728343 9845891 9546916 10094033 10525778 10634854
14387 10634854 10785509 11037430 11173017 11314536 11656090 11453348 12002035 11793458 12323685
14378 12323685 12465074 12897743 13053885 13046479 13794774 13807254 14217675 14518471 14753114 14922067
14368 14922067 15440217 15566708 15647394 16003737 16782879 17204846 17292744 18019584 17933907 18384866
14358 18384866 19094733 19299691 19934265 20449949 20740821 21408601 21665619 22463606 22939997
14349 22939997 23702328 23960638 24537065 25596777 25884701 26690773 27633590 27957565 28830104
14340 28830104 29857351 30564841 31464505 32490706 33404679 34237708 35267007 36624920 37602387
14331 37602387 38781406 39943301 41231822 42513275 43908100 45381836 47036676 48300605
14323 48300605 50249928 52523126 54076795 56018411 57857867 60161894 62623146 64823604
14315 64823604 67565367 70630080 73165629 76388826 79808970 82923763 86825526 90308234
14307 90308234 94760863 98841995 103733840 108890602 114254596 119612351 125663054 132552543
14299 132552543 139093653 146203698 154085707 162186746 171423565 180845133 190776753 201457397
14291 201457397 212929562 224924886 237804234 251221905 265314387 279842178 295093413
14284 295093413 310957331 326845105 343383128 359578570 375482390 391012971 405421484
14277 405421484 418879062 430789678 439405872 441750623 441849719 441117235 438755982 434453999
14269 434453999 434192125 430683903 425381579 417450253 405585726 392340233 378095726 363568401
14261 363568401 348151803 332016806 315227551 298558464 283194975 267943647 253678985
14254 253678985 240439641 227124185 215141922 203448318 192110268 182400164 172287199
14247 172287199 163367759 154838722 147307276 140213178 133158791 126659316 120695256 114867405
14239 114867405 109639383 104848349 99817277 95839753 91577504 87423163 83696940 80327203
14231 80327203 77186815 74090576 71133413 68104357 65527140 62910534 60462735 58373667
14223 58373667 56523648 54187474 52845107 50662377 48961147 47444259 45955654 44161169
14215 44161169 42928012 41727097 40372411 39315807 37767364 36477897 35623046 34789249
14207 34789249 34136803 33377262 32092257 30809241 30081425 29623992 28813137 27612829 27504766
14198 27504766 26465522 25963022 25223678 24430300 23965307 23386569 22968166 22001672 21907838
14189 21907838 21079404 20846595 20005234 19644979 19763603 18726974 18267565 18093127 17748024
14180 17748024 17240695 17017508 16611957 16453655 16120690 15992617 15245726 14745904 14913440
14171 14913440 14500128 14409613 14264257 13682974 13243821 12995901 12664188 12762332 12617849 12505145
14161 12505145 11996965 11590176 11360341 11248072 11092339 10796037 11103181 10661819 10407188
14152 10407188 10355200 10317573 9624777 9731263 9504855 9591260 9417667 9151564 8841433 8791372
14142 8791372 8874303 8718581 8431502 8311929 8353588 8051399 8290933 7826106 8000993 7713960
14132 7713960 7236902 7520778 7311754 7477804 7010589 6970331 6960114 6902802 6451391 6832479
14122 6832479 6765751 6486070 6280611 6219569 5945285 6185941 6201212 6054832 5912197 5969882
14112 5969882 5884099 5702972 5647440 5350233 5285077 5506421 5517414 5206127 4918887 5077475
14102 5077475 5063189 5068938 4793172 4983433 5116146 4589362 4834857 4498529 4594776 4345055
14092 4345055 4870205 4575860 4374497 4466902 4293588 4511489 4176832 4019277 4487313 4070417
14082 4070417 4166442 3894510 4068864 4197909 3942595 3895862 3730599 3931897 3514339 3865456
14072 3865456 3617023 3562161 3620973 3537623 3508176 3342613 3744130 3401386 3339528 3481651
14062 3481651 3481690 3177745 3499239 3328468 3404172 3480359 3427937 3315342 3222885 3034984 2928733
14051 2928733 3040954 2959776 3095555 2827004 2765434 3017847 2851134 2936464 2683407 2987824
14041 2987824 2778345 2499390 2663128 2557812 2898998 2451686 2589255 2338294 2623230
14032 2623230 2610164 2562475 2535482 2532264 2738972 2372425 2337439 2273897 2376903 2297120 1979366
14021 1979366 2323226 2181069 2102709 2302795 2178418 2181246 2049441 2168658 1771771 2294694
14011 2294694 1897319 1487983 1909284 1832571 2074214 1736132 1940683 2239489 2219156 1679652
14001 1679652 1808414 1710968 1763790 1575734 1761125 1889753 1716622 1647411 1553520 1661072
13991 1661072 2086908 3066440 4506491 8777177 17531669 29914150 34486294 21324292
13983 21324292 11338431 6664089 4555298 3618922 3330128 2895190 2419467 2121296 2688251
13974 2688251 2229995 2137983 2328819 2254485 2316657 1882656 1914060 2161637 2067460 1974622
13964 1974622 1599154 1799488 2110257 1645881 1774249 2021214 1764438 1809550 1635864 1745165
13954 1745165 1888276 1584351 1613872 1737957 1667856 1808353 1393863 1858579 1506690 1343067
13944 1343067 1528233 1597717 1660732 1524445 1417525 1404248 1170410 1336617 1830049 1511447
13934 1511447 1166764 1524781 1279280 1361644 1089269 1443980 1403649 1386946 1382332 1103655
13924 1103655 1343443 1922709 1269160 1174820 1075489 1422588 920640 1288530 1137293 1270953
13914 1270953 1148451 1148381 1129814 1233020 1176311 1161492 1089026 1038683 1129718 1187706 1098425
13903 1098425 1188565 1052622 1128429 1140408 1245924 1118079 1082962 836881 1342691 1030304
13893 1030304 1075948 1096446 1184945 939194 1095494 1243337 779694 1218205 945107 1484924
13883 1484924 1197340 1241260 929339 979265 882704 1388885 1009227 977330 847872 1082556
13873 1082556 1138542 955591 690029 1170103 698990 894698 924554 889415 851520 859390
13863 859390 1259046 962580 853671 1057151 955962 1022350 945184 640096 724493 659404
13853 659404 987718 611059 833887 553366 925936 746054 752340 863194 1001388 730695
13843 730695 806789 667703 744890 787634 1032077 895884 708555 1127550 1098731 710515
13833 710515 699648 512954 1077353 775493 661641 448767 870317 896476 742163 773725
13823 773725 713301 1090599 790918 765332 721640 770713 637401 723967 848671 422974
13812 788446 869653 495565 879899 511413 643288 965467 763125 449869 214997 820691
13802 820691 801692 180225 541086 343734 680133 724759 330385 689379 818008 455821
13792 455821 882586 692828 787485 692507 519920 920416 470806 677598 435553 386665
13782 386665 604910 634075 171003 481314 777767 803534 538455 587267 731153 700333
13772 700333 806420 634390 538829 462869 449904 264623 619450 663878 678066 618453 616773
13761 616773 433139 475995 449990 746083 325278 473205 504258 702457 523529 468342
13751 468342 544807 673196 669219 717442 365952 289201 468789 435487 580832 817050 607296
13740 607296 346177 472519 324438 405274 855554 523313 500681 511871 415355 425069 546193
13729 546193 359962 446089 567133 486157 203603 471850 202648 418964 515361 673333
13719 673333 453810 452497 332957 315120 435663 362557 358921 432747 559891 336995 558929
13708 558929 370676 536332 394961 428071 394207 315433 503822 402807 227609 806434
13698 806434 574272 265964 334145 186607 480930 368218 526083 254164 400767 374539
13688 374539 462938 544947 461045 559029 382799 182452 419473 528135 379030 558635
13678 558635 473959 203714 286388 278545 517841 650634 403871 609881 196502 163027
13668 163027 245653 280915 125500 452303 208976 638289 244034 420571 535314 403047
13658 403047 275993 126255 156079 -132382 439149 213151 633008 237686 354974 573119
13648 573119 343997 317441 183435 317760 314216 247978 173071 54050 327373 176326 696283
13637 696283 771568 418985 259704 623930 565576 560042 461632 541616 411506 290680 359670
13626 359670 238968 763748 31766 364206 203801 73812 526401 332147 545734 490689
13616 490689 168164 270634 469706 -39056 104073 517048 256574 269858 44586 364812
13606 364812 131281 212654 87162 518054 36521 415913 268559 516631 501740 337840
13596 337840 331892 459171 101683 286475 281149 587825 80806 183628 217295 354442 259054
13585 259054 335428 139765 465093 335540 106580 189952 573873 313330 232624 -33969
13574 262439 427858 565503 260509 416573 314956 308778 514273 353628 115251 208761
13564 208761 160798 310325 374979 89029 366058 390837 156153 272460 363230 48617 356832
13553 356832 55375 290277 52157 606053 143570 195148 486008 -157453 345899 475913
13543 475913 363124 311438 220294 249374 188799 108475 393034 277836 144451 530968
13533 530968 88812 507996 314044 558964 124294 130764 526868 376716 227859 173263
13523 173263 353576 275130 308962 318155 187889 274547 68224 266777 238568 299606 310527
13512 310527 237912 477092 286501 96906 207845 119336 268732 169706 -90982 462285
13501 51186 304673 222473 132021 159544 90527 18576 270390 54448 31999 176524 495669
13490 495669 234181 164932 298956 147948 256365 286007 -185099 1597 252646 212495
13480 212495 -52030 321947 315015 286650 71342 342435 127711 365774 114574 232841
13470 232841 61936 95771 226599 416937 92666 263814 360653 323837 162171 171738 109334
13459 109334 78993 60506 107786 396843 175279 438739 -135531 285537 283595 263748 340114
13448 340114 135588 71646 149834 304195 251965 207366 190175 243483 114004 63440 397292
13437 397292 47194 -49750 166092 55667 209454 412816 235934 268147 44694 90318 -9413
13425 20768 195013 358316 204195 200212 276988 79274 309032 513174 294473 95566 209201
13414 209201 169800 -47219 474100 162926 383146 23242 4198 322212 -157575 382883
13403 -335293 227639 179102 127836 101309 -22701 340777 -104129 193936 -4041 334923 395709
13392 395709 -248176 98312 -18138 259497 284291 353230 5214 341694 -193200 183415 237597
13381 237597 768 257311 96657 254641 313230 156848 51812 -166660 543699 95197 93784
13370 93784 160759 232930 59490 486306 257230 232609 310806 287071 283481 2020 148320
13359 148320 482883 142032 235737 45017 67172 233964 84044 -27345 51642 172393 244887
13348 244887 181730 334095 368653 344855 272142 511850 85062 375181 411653 101888 483916
13337 483916 378994 -176070 182500 12137 298436 -30708 347139 363983 218238 258199
13327 258199 118626 266323 293993 82014 169816 273608 23122 375699 409152 78411 24448
13315 237367 237961 192777 38611 133748 -2313 30979 214591 -98559 276082 38058 175414
13304 175414 49309 149268 -91217 27185 260282 -94989 69527 -150473 302680 440387 275356
13293 275356 -281298 224371 -180549 312298 -98470 98952 -123720 17868 158428 430045
13283 430045 271946 -134896 -108252 6501 -59727 -225182 80294 162275 163501 89108 -1800
13271 198012 241094 258157 171508 201023 -121297 334548 -39017 -58783 -205416 153094 -88326
13259 308064 -147627 130934 -290075 178910 143071 360237 -74646 -23531 141667 156580
13249 156580 157190 140983 -130023 308163 -114621 -44254 246759 69872 212569 -240039 68621
13237 62541 56147 97805 -11026 232848 165774 -109043 -349364 -54504 379972 127421 -106357
13225 71357 -85849 220368 -105578 388669 86661 -46597 62641 323770 41475 -360469 34129
13213 -178516 120090 100060 202379 197644 172337 245676 133531 18563 152715 160358 -97631
13201 -19427 74511 38279 54553 291793 -88865 309138 -23096 137626 -439063 225472 -99968
13189 30470 75142 69587 -217754 99288 32363 -202065 466014 -27629 66046 -72846 192088
13177 57835 94284 137846 104691 287920 345029 58691 276294 4890 242261 109832 270678
13166 270678 227534 15463 88069 36123 98578 260244 92768 174504 33564 -43152 142174
13154 -162340 -74460 -3708 63142 308167 62871 -33315 -159343 93005 214209 157537 226541
13143 226541 456 310225 -192907 238704 183201 287492 -111023 -33196 113178 -182885
13132 290794 68329 463469 72248 7247 70432 98294 78952 35474 -145704 138189 -174101
13120 -275718 174868 -204126 96727 -45020 144851 -146009 45054 54373 41876 38761 -101222
13108 -209436 211640 108091 332638 -32137 286320 203952 181717 -261574 -138566 76252
13097 -161534 38672 -127854 330891 -59757 174221 -223080 -57298 -32257 -109114 45810 -99793
13085 82885 -36984 196727 422724 -4729 -92612 222204 10898 247387 -66674 129012 -185835
13073 315439 -68470 133699 -28972 12957 281364 172895 436724 115713 236479 71792
13062 18520 164844 129547 234330 16584 -3108 -261852 -57194 52160 76327 12205 192602
13051 192602 -266019 112954 -129836 -27985 -24948 400158 267868 35733 -178585 -160552
13041 -160552 -66328 1195 -163570 224171 18694 279224 -18059 192690 345203 312653 206281
13030 206281 -127005 248398 448706 91249 197621 35616 389568 -43244 364426 317554
13020 317554 118510 131273 47483 84846 20019 268725 -197042 64427 301485 -84890 171718
13008 16747 75166 182618 34135 324782 367789 5903 171074 20503 56391 331911 53620
12996 -28615 -116273 102108 13564 508186 -36769 208299 17530 61425 -324576 115661 -191290
12984 223008 73335 75360 296303 231688 201808 -69715 101729 137243 14014 -209757 6932
12972 -19158 -154298 242976 24755 -138998 -50495 53154 -99692 -86082 -105240 -27461 229110
12960 -25734 -8300 76975 158214 -148008 -180982 -8166 245030 133317 -126402 -328072 -255276
12949 -255276 -1486 159807 -157810 -76624 -12477 335681 24271 -29927 336810 98580 322074
12938 322074 192511 10302 34805 -69267 141538 15817 -5193 91840 -28677 94464 346503
12927 346503 -254536 -248115 -223527 165800 272088 -143742 76706 128137 -99182 341860 148114
12915 237618 -100707 37570 208257 -5966 116350 376759 30994 97087 -29177 357385 -144308
12903 -175879 104877 475274 -243431 -212103 -107541 211114 141319 -181826 33964 -15825
12892 -137851 -30770 -76285 28374 -105738 -54873 265446 131629 78112 -88056 157020 -107869
12880 37068 -295645 31758 -184402 39970 145420 215342 181394 28167 118962 58184 -168125
12868 141592 43855 -5045 129147 414070 -20382 167172 -117712 -354869 -92318 371401
12857 39938 17535 -243644 -45264 35513 -129519 -4932 -175148 -163943 -114357 182738 -108413
12845 -142442 -214426 -66793 34117 -78138 136978 154209 -228005 -74408 29132 4911 225089
12834 225089 23474 265332 -90059 -247070 -118381 6855 398938 -74302 95935 110478 -467271
12822 235836 239866 -43825 -69689 123507 -21107 -100763 -98696 -217151 2104 163728 32147
12810 -36842 151771 84423 -25608 56176 241395 125253 -331231 143046 178303 -282631
12799 -166204 -374571 -14761 209440 101479 326223 -148147 -140659 -24701 14700 87235 -201079
12787 159251 52000 229175 -14252 187726 -56959 61186 -33040 -98858 208785 176197 107970
12776 107970 59008 139721 90365 34220 -166899 266544 5184 -293130 -40282 -39928 -259464
12765 -259464 53722 214469 259826 -95485 117112 -31259 -35521 119837 -208747 -130792 102122
12753 -237804 -125606 362057 114933 103719 89326 -104980 -46487 160458 187973 137636
12743 137636 44930 -241770 137151 2249 227257 247123 210533 468022 97255 -55694 326227
12731 98233 -42867 127997 -94308 51157 56163 120028 -12309 89326 504074 108025 -247838
12719 174983 -48184 -35206 -236283 98210 27379 -44986 286373 145023 55354 -21975 43004
12707 325183 -43665 245692 176732 367429 -37422 -135197 -153502 265887 50539 -344567 -5212
12695 -41356 -86308 -6076 16977 -143096 -211682 -288135 -184526 -104407 4129 103731 -139437
12683 -86394 -75861 193052 -18607 96930 -3259 -13691 110069 207400 -87198 -101316 91303
12671 70180 -258767 -308687 223176 -24608 -66922 21792 113124 114391 120829 180618 277921 65401
12658 7739 8734 442319 -2891 238470 -98044 329787 206385 101811 113364 105577 -166691
12646 -106176 86411 -37716 -124703 39137 75308 34581 -310701 183210 -31471 -175255 -64493
12634 528318 336385 120661 141848 175170 320162 192047 269674 134355 -187448 149131
12623 92678 -194074 107788 161564 -40794 120964 -233383 169915 228116 243930 -169681
12612 185973 -23438 -95305 387414 70987 59863 -199123 7161 38243 -197009 257792 106864
12600 43629 -33194 -61758 235302 -97229 36159 -214588 -150312 168846 299837 107524 -129656
12588 42333 -21062 127991 30276 53056 134947 11208 -33496 44662 66928 -49407 211697
12576 -188983 -135369 9298 145514 -120736 155709 -67124 -1639 96204 222217 -35467 -320874
12565 -320874 115512 -119646 3922 291792 69758 300347 97461 293454 60827 182501
12555 182501 -80858 66287 188759 57858 280076 -95610 134049 -37017 -28096 -168599 14152
12543 104086 89752 63398 363353 -275609 5922 -235770 121532 -227542 8425 90912 -261605
12531 -194438 49358 82384 -237648 -66509 59219 -108255 -113240 -29951 17294 70890 -99748
12519 46300 128938 -169181 -163724 223265 -162593 87295 83710 476903 -172658 -268262 -153741
12508 -153741 -177816 34806 100862 -66585 -93816 326295 34710 -182606 174940 63684 21029
12496 -185524 194371 -52296 246018 369822 19691 64872 98251 -119968 -65901 -273196
12486 -273196 -173055 -355870 -129765 -53274 -2138 -128515 -134512 61327 66522 -106630 16480
12474 -263172 4558 148780 -51141 71428 -54481 295857 -372601 -91685 247723 -159541 -178641
12463 -178641 58832 156135 170968 148770 23965 -68292 136111 94468 -168608 -240783 61107
12451 -116304 335830 326525 -144353 211703 -66912 30219 16264 -23692 277785 -107752 8950
12439 -102615 -171511 -53651 -108880 -49311 30049 -186981 6289 135745 153185 23698 -160221
12427 116823 -130852 -53812 -223686 152789 325094 235055 -270904 14642 153157 86386
12417 86386 -130875 139428 -15575 273768 -181869 -168903 214586 -4315 -176468 -233646 16021
12405 13134 195094 95428 -80521 9775 -98309 54781 -6396 -18125 197912 182004 87014 33139
12392 -411869 -296561 -205221 48572 313110 -149394 165360 128885 87764 -335820 163074
12381 -7506 158124 -112801 282105 -137319 55454 -217261 75225 -88486 -211126 193064
12370 117464 -134497 -47594 40227 332818 -217671 -181965 82218 29234 150350 -11195 -13156
12359 -13156 290460 -125995 -224958 74823 -78195 121190 168720 -15076 -27144 3060 8364
12348 8364 -231669 -161710 -5144 90963 220615 -188978 228162 -81071 333591 -128731 -155917
12337 -155917 -63982 -95092 245143 -310300 201102 65564 -31715 -155987 30311 27489 215031
12326 215031 8083 -47232 118727 379126 117657 -200117 261942 -243384 105353 -199601
12315 -151913 -67687 41075 -16402 75425 -59967 -225811 90906 -100501 -30091 -213480 -110096
12304 -110096 -217441 144548 -42507 -60118 -84785 93046 -27635 -182645 -27430 75811 108396
12293 108396 264608 -335263 29597 215644 261607 -26674 306215 82641 56838 186777
12283 186777 -159993 27156 71589 -107452 225076 155800 -776 110193 317594 -4642 -4542
12272 -4542 218628 -46914 27188 -16985 156971 148958 197082 315680 129420 -223950 -64596
12260 -32562 69833 276370 -139329 -48505 116907 375571 -14140 86699 263544 -67874 -128912
12249 -128912 -142925 -147574 10708 272666 112635 154701 80521 72254 -1545 -34735 -155240
12238 -155240 50730 88828 444972 157796 -59120 108688 58460 186257 96212 3452 191173
12227 191173 49623 89723 316336 -37613 -4189 -67408 -19704 -5779 227482 145542 74302
12216 74302 70366 213898 63639 177707 -56258 9246 14024 229634 283749 148064 108374
12205 108374 -38231 -229282 82975 135316 352453 -180583 -11897 127636 118749 -58934 -90674
12194 -90674 -47721 260957 211306 3303 -161100 123193 4551 33646 167349 -72509 63668
12182 490025 -172702 170060 -258383 -75106 78511 114535 163138 205479 -186824 298966
12171 366300 71802 -122938 -52670 -4920 -66358 98630 -44855 151195 -6032 127761 283612
12160 283612 281389 277459 -237517 57791 -130496 -107771 350506 -13986 -363435 98433 193568
12149 193568 407579 -75990 -90282 -162192 -34159 105990 -15056 429956 110037 187611 159906
12138 159906 13266 -123765 -223514 67155 129192 -37639 198382 80059 194645 239701 332685
12127 332685 -46161 353957 180807 100005 747 -239964 98726 287076 201480 -50030 254558
12115 -149587 218736 -13374 -208229 -50264 213461 259797 113109 12895 34101 -110687
12104 -127057 -24347 -280941 -36160 -17337 29792 -60403 -194445 87872 24256 -206369 -147831
12093 -147831 6922 150168 -40997 -276418 -313378 199757 -35061 25331 -32349 -62996 96184
12081 56503 -120842 -318114 -21834 -63283 289493 77687 276679 345837 610148 1467959
12071 1467959 1372049 744047 370637 41281 -6741 132484 170250 -88343 162332 190753 363638
12060 363638 49911 -109436 103331 302653 -240164 110540 -142994 112911 111537 -222512
12049 161399 -20318 178956 54270 -94581 285233 -48699 104007 -41093 -205968 106784
12038 207322 138444 -34355 137358 -187884 50892 -79276 -85401 109876 227298 -123950 -213754
12027 -213754 76974 -111431 182290 134808 -32087 -112728 -251758 233516 65459 -203821
12016 -64578 -36309 -65492 284258 -91332 36768 37725 194927 -33977 -51869 -40784 -300035
12005 -300035 -186307 -47677 119862 -155264 -204653 -208637 59890 -32928 -43675 100173 54004
11994 54004 -105405 -37042 -42194 126419 38140 120535 70800 78951 39737 327655 -265771
11982 163935 194116 55891 232402 -302203 -159090 -254729 136217 -29883 104374 94955 -77970
11970 8599 22922 127731 240727 -106426 -286830 115881 -28606 -324004 -29810 102865
11959 123075 -154047 145564 -220203 -31648 -224333 104561 -9672 -8333 -167140 -153348 189446
11947 -352571 3681 -186115 348977 -69017 -119070 79526 -3435 136600 182183 231188 -201502
11935 54609 -105310 -10614 -86004 -54403 47588 86460 62944 446512 -81646 27824 -74332
11923 36946 -1392 57653 123363 -52757 90927 -14350 -75138 161763 169170 197764 81006 180762
11911 180762 140245 183942 25089 244832 -174087 3656 120995 183383 -56726 -58989 156774
11899 -108921 -57128 -135292 -213616 155251 -54924 -104597 -71566 -98375 -52991 226396 -281115
11887 -150723 -198361 44721 -238311 -210410 -124937 -51176 -408567 -122315 -122431 -212725 -262038
11876 -262038 -138796 205444 8237 90891 -220551 -11260 -38061 -6607 -74614 -171691 75319
11864 93817 -103248 -72285 538961 -102602 -118314 7889 116536 -243718 135018 -59021 72233
11852 -269895 -3519 12740 -250767 116667 130575 -168332 -137943 237806 -17992 -191502 494586
11840 -63832 -222 94480 -295164 -248653 100192 -125609 44229 -161858 200188 1794 23896
11829 23896 22215 -93127 -178141 72361 -167935 -194195 55309 -219011 -99695 -107913 139625
11817 61480 182803 -95952 -254969 59912 163766 145440 -227878 -146869 455576 28827 -158402
11805 -57431 -53879 -131608 257124 107251 162767 -82728 -101323 318163 90759 197160 157525
11794 157525 -140722 43608 -379583 71025 9955 -52597 -105255 217000 -257413 -85801 337051
11782 -268516 -36838 29866 136997 -189841 -107596 -277093 61624 -45044 -132217 -173755 -146229
11771 -146229 108690 105498 -185547 -158220 -162011 -61126 59234 284906 -114901 -87540 104139
11759 446781 390140 -207425 -134066 3327 -223329 -218516 -229311 194420 109470 -251540 -124489
11747 94252 -106200 -91914 57841 -117502 87734 127243 -190547 -55015 -46574 251914 291292
11736 291292 64933 -88714 146298 -32947 202975 -76766 -17426 145976 -224490 236378
11725 95147 18943 228174 193177 -48891 85443 -109161 -248479 -372663 191554 -32569 -132323
11714 -132323 202903 38030 -268726 276402 100114 116402 53155 82111 50537 193221
11704 193221 -211432 28686 191996 94386 191163 88626 7311 31713 98329 158478 -121630
11692 -39712 16296 -86565 60603 9131 184140 53136 -158479 -118662 258162 -126128 179912
11680 -248425 -41658 355556 111643 215832 -143229 139413 36875 -29622 175761 440248
11670 440248 201024 92265 -146892 -47555 168814 80886 56091 301009 342025 -143536
11659 24225 -21778 -39415 131899 -23610 13353 114695 -61160 -34184 286359 109039 -105455
11647 -72908 -42426 -109323 43493 -70173 114413 -699 -156307 -136926 128745 19776 268687
11636 268687 -4562 164172 273832 144062 296727 -123040 -44087 182547 289252 131936
11625 468990 194310 105679 320737 -91249 -387391 -243991 -36871 76126 -117100 -231010
11615 -231010 -161669 87628 -32938 -224711 17155 -37068 -96315 149405 152257 -161881 261771
11603 -264903 -376156 -53715 -223000 -43488 291493 368426 176320 68281 218619 -16321
11592 278162 139118 -79335 139734 107111 348514 166865 187446 -78126 36572 -46546 281797
11580 -67229 215811 265105 141131 132151 32031 -53295 -97203 51867 237837 -49301 -152134
11569 -152134 -123317 90500 15980 228860 39566 348944 255621 -103824 215553 168704 161006
11558 161006 -226500 80914 108775 -105018 -41072 -97131 -67548 127927 357823 -182321
11547 -118965 229723 122671 302956 -60702 111741 136732 -150746 -106927 -3778 210722
11536 230025 -46404 163689 -125175 -128084 313526 109881 55393 50772 207302 317169 203989
11525 203989 31334 -105333 56645 142839 131238 -4865 50986 229853 -113780 -2696 194679
11513 234776 276311 -137096 -22356 280760 93451 207108 157991 -18888 223228 66350 345186
11502 345186 147083 -48798 232270 266276 67011 157901 146396 -227260 -19672 -112914 241359
11490 83613 4271 44760 -171198 270349 404841 156387 180545 218540 -57469 -97546 459320
11478 103283 132155 16208 61657 244403 -28523 126920 -30749 443665 -69454 -158279 436697
11466 316026 -37914 351679 139915 14203 -23623 52366 118946 245698 287612 66304 363793
11455 363793 414061 72619 -68010 -211736 -39644 -170688 -37280 141821 -131257 159241
11444 86785 -24580 101924 -57162 4174 8662 12962 347396 -51176 158706 -116046 -102699
11433 -102699 -137368 105393 39684 164066 -58888 -210924 421963 -209073 411021 -58900
11422 14438 113682 -200229 91090 141434 -297670 401011 21792 159424 -232495 -274158 262657
11410 -68386 -17429 -342627 160616 -71233 -4206 88216 -1310 74203 207203 184302 201279
11399 201279 260466 124084 191195 251245 -339684 98326 -210283 -99914 79577 -257819 146366
11387 -101570 183225 -17487 182697 -233778 12864 -135960 -268359 430064 197247 300341
11377 300341 71962 216923 25765 -4558 282223 96862 -90531 117758 -411620 -14604 67433
11365 333770 217447 -265181 -173826 -39521 25941 -358127 4749 288177 -43989 -74628 183562
11353 -183281 -108936 -310929 36663 -82428 53406 -283148 -323852 138274 99107 45519 -140151
11341 285419 -35829 -71788 146182 -48785 -287135 58665 -107237 -93797 64926 192037 -199847
11329 94686 -359680 -122826 -132200 -16978 -137470 -232446 -1663 -39767 337218 172295 -163457
11317 -22284 -145966 -154651 -34004 -54838 176045 26545 266792 11156 -89245 -69075 -191891
11306 -191891 -233795 -104711 -137225 101320 -180901 -189420 371078 -290909 -322032 68161 -162253
11294 11352 170044 -74392 83393 -54896 81810 -57856 -174121 -58750 131673 339050 77757
11282 -142883 214976 -120910 -134390 -18865 57142 -71560 -153442 172065 -67821 -456013 102286
11270 -195356 -151549 -96110 41685 163576 -126856 94352 -51659 15290 89741 168556 -53586
11258 36734 -266068 -43691 -258794 62858 53006 84035 -29112 415189 -57151 10913 -27994
11246 225114 -122281 80041 392114 81506 -165296 132149 351539 -234321 158610 164524
11236 164524 -244408 -330769 -69926 -45378 58903 -183099 -118483 364305 -138094 -151115 -70406
11224 321064 -204115 -190220 -165040 -59039 -76556 176866 -236247 176346 241546 167281 -41882
11212 364290 15869 -55550 -73323 -236708 195025 61459 -2365 100589 94729 -258933 -175837
11201 -175837 -162510 -127008 210763 -48137 82256 47487 -35798 -48021 82437 53686 47473
11190 47473 -244701 -149916 -108330 347272 -90924 -201830 49124 319448 -305356 -176092
11180 -176092 210364 -133780 -79903 -106462 -14665 99000 155262 -366909 -28290 -311755 -74340
11168 -189412 -91295 -22585 -38996 215011 -108728 54561 162660 -87490 333408 -41741 40699
11156 -163514 -18843 -155085 3791 -93472 45632 357041 211380 68607 -92677 21622 -11313
11144 -179588 -44973 70157 83659 -190923 62184 -27740 39997 -22246 33027 -114318 212566
11132 -23552 -160877 -53405 70219 114851 30636 168913 139970 -16315 164114 12793 179130
11121 179130 -110354 19808 -11168 -300848 144847 -46519 256382 192343 79146 -120245
11110 -217844 383478 15292 -272512 -23043 142946 -93131 -2775 113671 136040 60692 28085
11098 87012 -22085 295109 215251 21644 392133 200569 283007 293216 138392 42288 228759
11087 228759 206426 208756 -52729 -255752 58850 203941 410820 358743 99603 -277325 154031
11075 73043 13816 461068 510167 163429 134092 -32209 170146 517425 172840 417749
11065 417749 263399 459845 74084 312368 335436 108660 297412 520966 530088 304182
11055 304182 610373 437005 494862 615547 594955 527318 587164 391912 659718 619516
11045 619516 609940 1028745 391357 543093 489159 408988 730610 473229 413752 729307
11035 729307 522332 427571 346378 690090 714308 994955 547439 449765 533545 775454
11025 775454 768361 631732 341406 560162 336260 337696 623161 433976 388636 484686 375760
11014 375760 523747 34464 140308 575900 389461 532564 563529 675445 593839 786375
11004 786375 221254 478915 846919 588421 534427 530571 889151 700150 602075 601656 795205
10993 795205 725826 922870 827595 748043 813096 887171 785424 686402 1070957 560280 855175
10982 855175 1247008 1189348 974634 1391982 1162499 1490561 1444165 2055265 2082651 2027865
10972 2027865 2404837 2540381 2368778 2516669 2187817 2157357 1657560 1763580 1817886 1676782
10962 1676782 1511276 1807791 1864945 2117845 2217388 1890920 1927715 2064211 2210643 1637514
10952 1637514 1519201 1515405 1001393 1279204 684611 700141 699707 332482 303487 415908 226240
10941 226240 242461 380322 279471 413072 371800 -14233 217344 123329 130044 182377 -125518
10929 -11369 298586 24170 -49474 48387 -4145 251966 233027 -235873 151839 157118 239192
10918 239192 -319612 -35521 33666 282223 -62049 -128369 51103 194553 206947 45824 14936
10906 179896 -173308 -224753 -103704 -61527 -254735 -165734 29019 -94330 134491 248338
10896 248338 -20357 38451 -118589 190831 163164 194636 1555 4481 -154469 170712 -136159
10884 -171041 -252115 -8858 -11137 26449 112889 -405858 134822 -135316 -31539 -172842 132100
10872 -251271 -127487 -249950 -108130 -299078 58569 -36545 -109065 130845 -309237 -36533
10861 19129 -147081 12502 117154 522267 146402 -104990 -61875 -151681 228892 8285 -278384
10849 141989 -88293 141029 -192846 -69794 -35821 -88768 42772 -360650 149722 3003 -220839
10837 3058 -121616 -105943 46991 76307 -43291 85328 -226522 76671 -78337 144323 132173
10826 132173 139292 -165406 3417 -217958 106157 146825 -160657 -49921 145299 304771 -62566
10814 228496 -223898 35047 106300 -171611 50835 -130890 107299 225518 -213218 -97462
10803 -289455 337463 -197196 -31016 195424 -240920 -249053 -25983 -102022 236399 -388482
10792 -58489 108128 -54100 158965 4235 202190 35569 122955 -62876 -239186 -81538 -81731
10781 -81731 307091 -98932 10526 -88378 17498 -385326 337045 -69712 -69866 101369 -53575
10769 -108700 -65131 16157 94495 -202986 49208 45770 52250 -100037 -72453 -295312 -14709
10757 120873 99906 -193421 -180326 -19755 -165589 283129 -44500 86906 -424609 73835 -157905
10745 -154895 -21289 -135239 22163 -85062 111762 236295 3261 -193084 -35350 -64382 -136867
10734 -136867 65440 138412 26098 -2878 216672 80363 -77373 -347479 134032 187378 -79923
10722 -174404 -101817 186915 55175 -81489 -139851 95298 -44162 -323528 219990 166377 87366
10711 87366 -123075 211897 -81175 259418 -17577 -196185 -54754 -224921 -122473 100530
10700 -100026 37297 -78393 130533 -134439 -64036 -111448 -44744 73748 -201499 -405866 -250417
10689 -250417 245378 62743 -252513 -121373 27155 242801 -189320 -153504 141825 -134636
10678 -53582 -307571 33341 -228885 -30775 15975 -86081 -71190 -240029 -175461 -84772 129077
10666 -74250 -65112 -325428 -480369 88088 -390556 -82262 -150398 4894 -189274 9013 -112503
10654 -91494 -207323 -115681 -102084 -61041 2404 108162 237200 77353 163107 -4341 -50917
10643 -50917 -74217 286617 -67909 -184881 -22492 156646 -189949 -287216 111293 11409 -46650
10631 61907 44384 305021 -139430 -210409 85348 -132034 62479 -70665 -166427 -326264 -74227
10619 -348434 60118 -115666 178329 -263505 -101203 -188250 -269992 366768 -110041 -304066
10609 -304066 35802 -168768 -86359 240691 -40890 -70661 32126 188971 78685 -23869 -123018
10598 -123018 -159994 199540 -27090 367171 143898 -141196 -48361 -97798 94754 158521 -74929
10586 -125112 -377323 -162297 117187 283020 -258323 -92170 165370 -50708 136695 -180085
10575 66380 50508 -146894 64274 -241859 -65037 -206154 180144 -20072 -48800 5011 235854
10564 235854 58514 -294748 47237 -140476 -188737 -175760 48178 86280 -276374 61819 -294097
10552 311619 -185101 28101 -207435 -335018 224071 -8399 -104579 296782 75657 94863 74232
10541 74232 -104819 -132466 52989 104734 -162833 -125402 -92065 -236512 433106 -11456 -127065
10530 -127065 -227856 -7611 -187326 196314 -7613 35104 -42200 -144178 -169348 110832 -553012
10518 20952 -244680 -303801 -14775 -317283 -173311 -62450 229498 -222045 -115860 -70531
10508 -70531 25113 -159352 -74155 94114 27471 -77750 250245 155003 -126760 -202111 -40995
10496 23410 285595 -4101 -86357 196418 54947 108396 35469 124814 262003 223619 1258
10484 -102880 294597 258664 715289 635613 669032 765706 500614 435054 58644 456515 304820
10473 304820 -63207 -35740 64899 223842 135909 -143206 77370 -169367 -270116 407892
10462 -95352 21935 18555 -15410 27080 -132096 -23307 124701 136186 -105379 -274157 81201
10450 60953 -19217 171313 115471 -239896 118598 38787 -53474 402248 -19384 332801 -25752
10438 37920 -91181 94163 56579 11742 -102364 179692 163901 -5380 114990 -260208 -65368
10426 -115745 25982 -194905 37451 -59832 -310617 -417981 67540 172343 -62739 34756 5931
10414 7169 -326025 -3607 -91395 -182353 226650 74866 -92061 -175346 -226443 1255 -25704 -58857
10402 -58857 -61861 -376681 83111 8848 103043 296403 268846 -5282 -154324 -40287 -98725 159669
10389 -68100 -151553 -45686 262358 146141 268907 -83694 -26722 -133688 -204149 291851 -108054
10377 304353 260304 322341 31295 71065 226945 268638 229626 406799 417006 283432 309732
10366 309732 500757 193662 408260 338776 -133744 164541 191520 81143 344875 503275
10356 503275 77844 -35283 373872 249103 650193 343298 383981 646009 400565 404802
10346 404802 536918 349966 508698 664366 626212 361134 254189 169080 226835 -99556
10335 79687 102536 59709 109090 44185 -43279 482035 -96888 -240307 122002 -87893 48645
10323 433466 74092 -13829 153720 -85068 -1205 81146 35947 -74140 62575 242948 40522
10311 -56832 -73881 219380 186959 -22867 44554 61657 370143 -47619 80490 -354575 170150
10299 270253 -199483 305668 2625 -35620 325450 116991 60556 -198103 -125778 -218219 136319
10287 97732 8952 -292099 2463 -259284 -517126 -38592 -329435 -191763 -244691 12551 -96993
10275 -71565 202821 -54124 -56947 153268 75104 90734 105970 169787 83683 24696 149131
10264 149131 18073 330863 -36128 58247 146104 167517 362978 126199 -143528 361939
10253 12652 -207566 -267378 -90777 140681 -179016 64200 -220223 10023 -511690 -161057
10242 -215498 -251365 -70401 -73035 -198064 -252196 93702 -94696 -165223 342130 -173440 -91064
10231 -91064 -156286 30890 -267057 42899 56415 -102654 147607 -235315 -251619 -130291 203180
10219 -124177 -296551 85595 -152503 -48267 -320031 -162492 -53726 126683 -186951 226642
10208 -335409 -151622 -128619 -463 -137459 54603 127809 206984 -166917 159181 73829 -254409
10196 -167842 -152946 -260612 39048 -161600 -270599 -44912 86945 -230511 234 7625 -59396
10184 62540 -17321 144792 -261839 275596 273115 -145991 53547 217189 -58144 -369464 93182
10172 -104327 294273 -63999 -188737 -186218 -305456 26366 -173922 -674251 -60275 46675 -164558
10160 -256179 413747 -268475 -196524 -130230 160186 42434 -228149 -46435 -116402 -131336 95738
10148 -446756 156176 -338469 59800 -49417 -138717 16726 3597 75802 194826 -183509 88988
10136 -97449 -82030 -168327 311807 -314370 -13880 79525 -11631 -226772 33964 -143510 40370
10124 -19098 77503 34580 -144867 103960 -160337 -255881 224994 120446 -112963 -30200
10113 -60620 -191219 -145074 -193057 -150219 126386 -463987 -179239 -308716 -126761 158414
10102 92951 -112055 -199203 241310 -82302 -24703 -281482 -33345 -8594 -14060 8823 237279
10091 237279 -214080 212934 -68357 52518 -231005 -124525 141001 78663 -146394 -125620
10081 -125620 -173745 -133162 89074 -134194 -42217 78132 -46521 36174 -72574 289333 -294944
10069 -87569 186458 224557 -42073 -5655 -62350 184380 50183 55348 -90532 123882 -38753
10057 160559 239344 -82427 -168591 -143471 264008 -161204 16753 -251909 -182863 139617 -308872
10045 75094 -360385 158565 -47481 -189352 -36400 -314698 13948 -193792 60276 -235732
10034 -130319 200468 79234 -149449 31412 -291662 -75897 -172695 329963 94621 -37794 -75685
10023 -75685 -105881 -36895 26911 44170 -104473 -135113 43711 376307 -189462 200445 -56391
10011 -48129 71790 -176597 -356405 183504 152458 -399046 121902 183613 -164673 18104
10000 142527 -157401 -348214 1697 -160008 383424 -186389 -27319 -112599 -225341 -100926
9989 -87231 233124 72658 15283 -169326 -20607 -395947 48661 212799 -77720 -230865 -143197
9978 -143197 125191 132232 259613 -119545 135118 -136828 77656 -136454 38565 25054 -104073
9966 -108611 -28740 -61355 -39401 -183295 -48983 5294 166995 61747 -38962 -100296 -199527
9955 -199527 -232498 -40385 -237831 347503 -280691 -88705 129318 265836 97289 188025 69940
9943 -103212 -176684 -41123 -176319 -124033 -202648 286069 -248304 -396542 -34680 131473 -29077
9931 23269 -122290 -242330 96999 -341966 98668 153146 -8390 87332 -281243 5262 -98814
9919 -35530 -227502 159747 -140691 67021 276330 -123389 -254183 -458506 -41247 -126822
9909 -126822 67421 205506 247718 164884 -23133 -46270 -50457 -169387 -254495 -18844 -104346
9898 -104346 180989 -162861 -130966 -390158 -90418 -257202 -261910 -214847 -29221 -68281 232693
9886 -78660 -164172 -435958 -18678 -295843 19304 -24523 -450124 -116949 -134283 -20900 77966
9874 -101686 89964 -127632 -208080 -316623 -184784 -216440 -101408 -421005 -144244 -347316
9864 -347316 -103529 280828 -425694 36633 22590 262169 -426746 -388009 190836 -15790
9853 -131901 -312010 6905 -246088 -349178 -324104 30515 -144831 -249915 33081 -132007 168770
9841 -13772 13494 232889 -151978 -17547 110280 20867 117619 -382669 137924 -26459 -34436
9830 -34436 -340677 -77863 -113963 -7920 97572 129054 -285877 301263 101935 -297395 -60268
9818 73376 -119899 30269 -32328 -104669 127273 45796 -220647 -56594 -109996 -69870 -112236
9807 -112236 48617 -220893 -29236 -94543 -49404 -272096 -155350 266076 154087 -141480
9796 85419 194185 -93662 -145941 293578 163685 -45949 -161343 -102967 453981 -223786 139085
9784 72516 -144436 -5769 -152142 -432320 9058 -58078 58718 -174669 -493178 -11904 -130259
9773 -130259 67330 295058 -266226 -160263 -64556 51275 -173239 -149341 -14691 74188 -296295
9761 -33967 -82842 59208 -186467 -364848 169941 -220025 -54191 45666 101556 -53804 -13989
9749 -99789 -472954 -101224 59365 181289 7395 -449563 -227100 218259 10994 175965 -165674
9737 -142536 -43620 -134099 -60357 -38224 269297 -149012 -111058 10719 -262950 65115 40807
9726 40807 -305782 -152040 185664 -153605 -12758 172567 -38928 70545 124583 109058 -31385
9714 -371669 -104744 -159644 -226355 -214188 -270418 209954 239397 -172221 142788 -125283 -285770
9703 -285770 77076 37546 1901 -321851 57784 -364294 -200073 52015 -71614 58553 -243220
9691 -262395 79120 -73341 36223 -63155 -92584 -19969 59151 82989 -204407 48879 49205 -42113
9678 7876 -221107 41051 48317 137081 -268907 -92544 -157489 -91628 -272374 -384997 -270162
9667 -270162 162004 65052 209847 -57295 151153 -152317 -319330 28350 -41066 -32191 -89442
9656 -89442 135109 117519 -120784 -245913 -271753 -6196 -61179 -30883 -82200 -51580 28063
9644 106413 97531 -303433 -140411 -383111 13438 -58970 -156797 70397 -117033 13509 98902
9633 98902 155188 6854 -247354 -1357 -468163 -74485 -370341 -108309 20949 16694 270799
9622 270799 -131513 115127 86377 -269631 37287 -230137 -79929 228840 -223346 -321090
9612 -321090 -112287 228548 -111884 348022 -122946 -192728 98961 -243762 -169345 39686
9601 -370 155966 90242 39462 -147532 89582 269701 -30022 -2603 -120961 -224443 -151815
9590 -151815 -221216 -6371 -19613 -345010 66749 11517 119238 -44331 33848 -378228 -69504
9578 115383 25885 -350653 -122705 4694 -116568 -121218 -125285 245133 -71179 139092 263814
9567 263814 -226787 -61872 -238279 -183173 99043 -119670 -165580 -4963 8939 133224 113344
9556 113344 -137854 -222157 -51662 -88771 98577 235481 -84741 -375525 208665 -265337 -102275
9544 -36158 358674 18667 -84783 166809 -321859 -262658 -12288 -58009 22292 16829 325351
9533 325351 -387814 -216043 -219192 -185562 -66686 -71546 -38543 -129558 -343608 -21296 107847
9521 -38755 -87671 -126753 -74785 109463 -295824 -162877 -39850 -63852 316912 -210260 -385924
9510 -385924 -166259 132874 110812 -277581 51307 -125762 68779 -163574 -500647 -203951
9499 -46324 -100723 46203 179904 63742 -11403 291295 -5339 87856 -24101 163001 -115742
9487 130292 -69125 183122 -34120 -20355 -283557 258682 -294072 56688 -103310 121216
9476 -237593 -115796 -80194 -95429 -144443 95992 -167526 -314494 -157844 -33446 78325 -51676
9464 -138163 -250818 -13203 -279747 35368 -29387 -215102 -365947 -20647 -420291 227933
9453 -171766 -59606 74549 -203723 -215572 -36382 29196 -14159 -1122 141065 37725 -212790
9441 -88540 12585 172507 -175756 3492 -112179 324138 128116 25903 154558 52319 -71633
9429 -26012 -164394 -215708 -195837 72037 293223 -144875 60153 266338 162112 -232905 -91687
9417 60670 -6357 3537 110693 -236115 -139351 156134 33017 -88965 90205 150535 97524 272997
9405 272997 -239403 -161672 -168337 -30143 -204577 70858 -52361 -169335 -190335 59041 -151272
9393 -56839 -153057 -360794 127927 95240 -181704 -47126 -32957 -360653 -47227 74089 45117
9382 45117 82747 16949 263202 43028 120955 -208164 19875 -221826 -44532 134773 124593
9371 124593 -10193 -273072 -143704 -104972 -230625 -155450 -207686 -119107 251945 -184310 219184
9359 53401 -169709 -343090 -263703 -317155 -102002 29912 73509 -246254 -199545 -104085 -135548
9348 -135548 -267806 -218193 -286386 14441 -388239 155558 -31549 -73667 -136203 241746 27285
9336 26908 163255 -6056 51193 -267097 -63274 294184 -161295 30204 -116930 88390 52177
9325 52177 -28585 -244928 -136079 61811 -221587 93350 83107 -123636 -430423 -252989 -43123
9313 61642 37695 66282 -166261 -176771 184927 -50235 -109976 16350 -206417 -212331 -332878
9302 -332878 84908 -119663 252479 -69146 -131551 -4579 -30169 -104506 282249 -34111 -125307
9291 -125307 1177 474633 -153661 -144824 80091 -150063 -274495 -161170 42781 -70577 -178173
9280 -178173 -204779 -207786 -976 66202 155564 -148646 -341345 -211917 -4202 -27486 169687 -100647
9267 -157756 371429 19300 23757 39860 -237133 -212774 -150371 50010 215036 458000 -180300
9255 -97864 -91654 -8831 -34886 -98081 -2049 169502 -259482 23678 -153839 -162551 -405052 -195469
9242 -188474 52470 -11462 -19919 -251831 -874 187754 -57647 181923 170308 36191 -410325
9230 -7508 -97492 -292955 -221326 45498 -127560 191318 157510 -195832 158135 -62571 -74368
9219 -74368 -39589 -40968 -166693 16651 -471118 -376692 -101602 211565 -103429 332061 98659
9207 -201730 289970 93387 264714 -44378 -312113 79434 69435 173508 -120860 18175 351966
9196 351966 -154854 -22330 6364 153468 -11327 218566 -5186 -86426 -242951 190299 30428
9184 -181658 157065 -335409 -118810 -96934 -250846 -98291 -24153 -261626 -51498 -245504
9174 -245504 155713 -92172 129422 8369 -121000 11703 -530487 -15838 -68982 -171108 -370548
9163 -370548 -238769 -76071 -45265 64845 54700 166753 -404923 -31070 -234056 191 175213
9152 175213 -92134 -65599 124759 36787 127656 90274 -201552 153057 -11931 -101898 -64210
9141 -64210 -229742 132951 -106660 -133707 199734 51640 258236 -113331 -239933 -191700
9131 -191700 104440 -529672 -34290 80253 148435 1787 -193751 -324171 22055 -206470 -131937
9120 -131937 74249 55273 -183928 -72185 -99440 173856 119455 -87877 66248 -30674 305184
9108 -220920 -65947 -64088 180964 -42646 24107 -272397 -21912 -68277 -161638 152647 -253798
9096 -183548 27207 33971 72642 -131168 -267625 250012 -138441 -434590 -30665 36932 -220357
9084 -173729 -104301 -118343 -120426 184152 7996 190711 -29793 -39335 -51084 -76173 -137746 57497
9071 -19188 -2763 228011 -134810 78688 -111727 55191 58473 -124049 32732 -276238 16938
9059 -80991 333323 -81709 -260325 -4850 122324 11899 -66406 -102587 -530206 -169457 -55638
9047 -104703 -34471 -227488 -246924 -15469 127925 57054 -38298 -85715 113016 221090 -109414
9035 -44978 -326144 186585 -316041 -112667 -186630 -33677 -317870 -22802 -447731 -28209 341183
9023 -313673 -164694 -17539 -199339 -51510 -376049 -162870 -57387 264832 -50183 -142588 -158728
9012 -158728 146468 -237359 -168276 -418836 -56984 -73157 -126686 -54663 38008 242500 -391892
9000 -50169 -99050 -312705 61951 211679 378239 -199621 -199150 -345099 24513 53283 -169959
8988 23998 -22381 -140182 131396 -174572 -70297 303273 107773 47233 270368 123205
8977 -17718 112712 -7778 -397233 98593 66154 -6666 -44896 210842 -10373 -168255 -77822
8965 73192 -175325 173667 145789 116789 22299 73720 126446 -69127 26127 1508 -129701
8953 -521726 -152274 319 -453584 -276411 -39759 -524372 -231417 202334 2488 -137338 330790
8941 -175924 -134776 -39057 -221729 -269122 140905 241559 61175 189943 -84307 -211671 -314981
8930 -314981 121898 -10158 385442 91107 637165 852560 2244028 6179268 10627180 12404565
8920 12404565 4659053 1752710 670425 254075 211546 93951 -126470 142842 204299 14125
8909 -18219 224444 -6188 378067 -197245 89734 -98253 124977 -223079 -241999 -153019 14743
8897 -114013 155009 -260471 93022 -46370 179115 38274 200920 92302 -202044 -251111 -119397
8885 -38851 -128245 126266 141054 34070 -151160 6301 -176730 792 42147 -52308 -98047 -353815
8873 -353815 200383 -15698 -6604 162584 42487 366458 -142258 39305 65866 -77869 281689
8861 196468 37055 -6560 -87854 74235 13145 -506066 -10557 -137317 -250327 252685 284264
8850 284264 -307206 -119410 104552 -48880 5086 -177017 117783 -156346 41647 -112470
8839 -62819 -52811 178054 -169736 -90964 395643 -304928 -87805 -98267 -45413 355324 -54987
8827 -181796 -48755 -109371 86050 -111087 72844 -169570 -229955 -176915 -115863 169124 44992
8815 -147859 -462466 -483117 31221 -246629 -31416 196121 -99748 173121 -211701 -175928 -9894
8803 -62092 391250 99698 -176037 192215 -220118 14843 55944 -236373 -50006 -131769 153642
8791 -17794 -280154 -49710 -428373 -124898 -13567 -185471 -193985 -83281 125980 -70047 -7001
8779 -32921 -72054 -10168 -165400 -63939 8806 -7547 -262992 -122189 -253633 -300660 189415
8767 -202326 -231599 -90808 -32597 -72580 -274532 35349 93016 -9937 99523 -88622 -225320
8756 -225320 39691 223562 -330892 -36977 -198665 177436 -203071 -151627 -195238 73149 -439911
8744 -36755 -195567 -47551 -153932 -4829 35061 -32568 -53671 -180026 -166100 -306406 91421
8732 -74664 97562 -17262 185858 251968 -394672 -99875 -101080 -121203 43440 19852 -30236 -79108
8720 -79108 -75301 17675 -235565 32860 -202612 -130691 -83422 27007 99755 90632 -126921 413155
8707 -116669 -121515 112296 -54495 -110974 55235 427879 188798 253133 178024 69435 -416261
8695 -55239 143515 -124569 -110202 146292 -110690 -160714 -157133 -116377 -332373 419929 -1592
8683 35546 51944 -190101 -91656 -46959 103507 -22806 -36494 -254964 124041 -106494 -161597
8672 -161597 -142547 27035 -114679 -41482 -43434 -85716 -68888 35593 -137501 -62948 -30208
8660 -284159 -234011 152120 -28044 -99446 11952 23364 304757 -277543 109605 15398 -155845
8648 163438 -23397 -110532 -369678 26651 -139827 -119903 -47422 74806 -245556 111635 11882
8636 -29988 -173856 108601 -673 -187415 -14059 180744 -21835 -112806 267154 -99514 -62356
8625 -62356 49198 -42365 112617 51017 16230 -219176 -238711 92902 -187932 177265 -26416
8613 -91340 -1722 -224311 228023 -292628 47667 -48111 11155 21492 200908 42346 307478
8602 307478 -290560 -154952 -350911 -39021 -12889 -77846 -92524 73930 -217658 23271 -164492
8590 -31030 -213487 142231 -99849 41793 140603 -35533 -187076 -221615 -239368 -56793 -71761
8579 -71761 10543 179000 -84725 49721 -385023 -179284 -193562 309105 -321013 322088 -93923
8567 -35653 -174 -226885 -91223 -183182 -208769 178074 69921 153217 168066 -71983 -328120 -72395
8554 -334952 -122415 273483 90973 -353596 245535 -171851 -158041 -38607 91949 -230797
8543 -47575 -120400 -367441 -139641 152079 -225187 -290477 -40413 -128972 -40190 294820 -80236
8531 78160 -5020 -78460 -118135 137996 10245 2308 -153312 332903 101768 -285819 134024
8519 -191633 145915 -236402 -133868 -201634 158542 162833 -198394 -34480 -503924 26132 -78944
8507 35180 -18572 130627 -1075 118736 8335 24513 25855 -4855 -501763 88619 -13340 182712
8494 110735 -206861 65665 -538139 -164086 149321 26521 -212300 -114716 107145 -127427
8483 -90091 102914 5343 74380 -262952 102939 181887 -116424 -343098 -260364 -639742 -34536
8471 190053 -24648 -128052 -344049 -76722 -10414 239714 -26189 172770 -106077 91098 143067
8460 143067 -70245 -403946 150455 -510397 -102964 -29713 -36606 -325379 -53549 -69136 -84216
8449 -84216 -195427 90004 47230 67632 -58270 15041 -134242 53348 124128 20165 149528
8438 149528 -107803 -137069 226517 -63903 -183666 17565 68248 317479 -600658 127126
8427 191633 104927 -205842 -237632 -117437 50046 9046 -174783 -77951 -99538 -32178 211646
8415 -198975 -61902 -316578 -133429 5042 65436 -168505 -128399 154094 72083 22461 106248
8404 106248 52555 7348 -98410 -78680 -321399 118733 89847 -129550 -56981 -429814 -109671
8392 -58322 -101412 -153851 -132981 12678 -19781 -57713 -21009 -83613 78160 -17304 67373 99610
8380 99610 155890 -33772 -116755 299967 153233 -112460 -155268 -51177 -209324 -11476 140827
8368 106283 -82522 48901 -164786 -73473 151548 -44911 -65604 111170 -221288 47816 24012
8357 24012 -175720 -280408 47277 118671 -84082 -28657 103021 11811 -130950 79642 137540
8346 137540 -66023 431091 10235 -7519 -80580 39267 44693 -178190 -40258 -77251 -59281 15500
8333 108017 -308411 -218634 70169 -166817 -76177 -129122 -69172 -158671 -48487 -279560 33752
8321 73559 -154332 -243468 -22345 4889 -197294 99074 -48311 162165 -241186 -74469 410408
8309 215006 -172755 -23320 335865 -243360 82130 -480446 -103839 -148132 133047 196373
8299 196373 -182998 -91401 -295163 -81018 62200 -95203 258727 117360 123915 -104978 -227946
8288 -227946 16664 -87433 -132260 -23948 7856 -32754 -53688 118578 -316565 -13401 205780
8276 152909 -77701 8996 -62539 -218654 379979 20806 -27572 -355658 23424 78864 295264
8265 295264 107728 -310950 -35468 130104 -160676 -73273 65444 214476 -31605 -282935
8255 -282935 330244 71672 -269329 -30471 -97523 23320 -1909 109971 -207510 -40434 182835
8243 177264 46426 90341 67557 -183735 -166446 -53280 -11839 -61867 315914 -329916 -26299
8231 -75867 49514 -219016 42944 -271217 -290386 -140396 -150587 -127183 166021 -280248 125677
8219 -36154 -267388 -140997 -55761 -237391 118222 92265 376395 169404 321109 69202
8208 -110630 -29008 -28837 -22911 -222201 -151934 -519948 62819 -137549 -39956 118779 78037
8197 78037 50696 -115084 251297 -436759 167548 -405473 25798 -77977 -52427 -191888 -73950
8185 919 382790 -140111 -253708 -117559 -26900 -235495 7183 -185008 -30231 33515 -21322
8173 133547 -283294 -161020 378127 -251847 70752 -180229 -38282 163477 -216530 -71324
8162 -74625 -113054 -294201 162034 -63505 -47983 -164359 -44299 75571 -169450 -365841 -331839
8151 -331839 -184255 -209046 42122 -297648 152010 -337818 -116753 -34447 -339706 -21249
8140 -186833 -240606 -9040 244210 192443 -130895 112432 -153461 -80592 -36583 -26080 -114793
8129 -114793 -75675 194457 -57319 155807 -15274 -156567 130571 -184707 85332 -82240 56966
8117 27073 -11938 254177 -174572 29986 83692 276907 101074 -420548 -24797 233776 62945
8105 100224 -84804 227379 62636 35636 6168 -18321 -19999 -135597 52539 -226682 -145967
8094 -145967 -18652 149082 -141709 100412 140578 -97688 210664 -14208 101585 90101 8256
8082 -146292 -245353 -223984 -273342 -57495 57551 69775 -202863 -87139 30056 -288990 40786
8070 -91315 -124011 -25615 6458 -39689 229799 -190809 -159901 65402 -66865 47118 -28796 -176328
8058 -176328 137934 139398 126171 73983 233214 190310 -29193 52342 -316745 225495 143233
8047 143233 290561 -29634 -190792 -4276 176564 241879 44064 62489 12349 -385712 -167100
8035 -315935 -54772 19493 71939 123941 130391 55536 -272949 -121288 -98630 -230748 129576
8023 10173 -14532 293763 142769 -162596 -141471 232262 73245 66156 357757 -7675 -23560
8012 -23560 50100 -10003 -119087 9485 92209 93982 -9475 -23323 -44400 134552 -214276 -262207
8000 -262207 45171 -136821 -214357 53407 120155 21882 -423502 46597 -224146 -91851 96473
7988 -179947 383425 127573 -60704 -89974 14468 -212494 -91669 -7302 59616 99435 -169208
7976 140392 -205203 -208102 -405558 241096 20766 -76978 -80912 16428 -185379 160867 54495
7964 -70986 -33407 -57953 -76563 158487 123817 -238129 -71236 -134559 89655 -143071 -397086
7953 -397086 43444 -142075 -59300 121859 263059 19926 370335 -83793 153394 -136550
7942 170558 -120486 194047 297386 154250 101013 -61108 -360352 156566 172334 69720
7931 -243948 -57206 -31376 9117 91250 94415 -500265 192432 117397 -51277 -10547 23061 -61549
7918 -345757 152015 -88458 -196052 53262 -31810 -98171 -257461 -90953 -110846 -349031 -253745
7907 -253745 -57893 -25053 26524 -88644 -75700 -74058 101097 83828 395936 -491662 -295578
7896 -295578 118917 -182478 53473 -19681 73843 -172003 24145 -145913 79017 155764 -33132
7884 34654 -297390 -218809 -24703 -150635 -204841 -103812 18423 -62188 105957 -50767 -32739
7873 -32739 -29934 32310 -98634 9708 -61998 -77566 -75762 -60594 -148327 -51596 245452 -213640
7860 -340309 -295664 23572 14681 -32515 98526 -77899 -101265 -6464 -238429 -57630 -21412 60991
7847 -230002 122429 153173 -231478 60625 -179373 -70405 -77497 -19564 -171311 431460 -162922
7835 -260320 -127330 -130304 182034 -313182 235964 -74725 -44041 -116155 -155251 -269183 -229433
7824 -229433 -113579 -240291 171021 -241053 294897 -22226 -196836 63549 137965 244990
7814 244990 112049 -133752 -193889 104933 -109007 114298 -279489 -245751 173683 -171725
7803 102439 -49067 106335 -218648 127058 52058 105430 156564 -210766 -25096 -123754 -117984
7792 -117984 -100984 60000 47942 -49871 91189 -152783 -15824 263326 -76494 -100738 -34563
7780 -29127 -260097 295144 13151 87480 -134452 -3691 229329 -7159 284393 66191 84594
7769 84594 -95379 -204016 64222 -213367 -369038 -83285 -263583 242371 -43478 -266746 -302431
7758 -302431 76150 -40740 126634 -82308 -305438 -109360 -88818 -57216 261062 -51766 -259153
7747 -259153 -147841 160060 -315987 284846 147948 -161611 -245247 95722 87362 175015 106958
7736 106958 -234784 7288 11289 68389 77391 -73466 85502 -23122 101426 237883 6020 -252464
7723 168260 90275 -80955 -49805 121107 59520 306572 -116984 39298 -137969 93195 -216541
7711 125573 47956 -304697 -21108 -167035 -87698 15941 -186563 -13889 -105616 172879 325131
7700 325131 -39320 -59304 305864 -13702 184863 165523 -50940 312478 -365160 -91918 54553
7688 467407 10875 253780 -344782 370098 8021 -51945 70327 -136151 -142183 -113863 134502
7676 113236 -325233 -153452 30108 -57544 -220184 87627 110748 -66481 18803 163244 -206313
7664 85953 -207804 -73583 -134901 -119165 214523 104821 -123114 56073 46314 37511 -219879
7652 40890 38002 -74770 -23337 57165 -31480 -53688 -133182 152383 -62490 -157305 198900 95167
7639 -227400 -23662 -404941 -103459 164290 -18358 153628 81468 -206480 -312382 -275930
7629 -275930 -104520 -79767 176553 -160626 -164985 140589 120502 6465 51357 -86372 226787
7617 53882 91455 273256 -188662 65321 87025 -86327 -236669 -169622 -328556 35251 -298675
7605 -64773 -552313 -374652 343946 -154363 -4337 26141 -128410 154195 45148 248267 104123
7593 191050 -108169 81890 -60986 -42118 -193057 -124821 -38088 18498 -52785 194835 -80204
7581 67075 -189093 -227907 7973 -132837 41777 34381 -103896 193512 77435 4166 -66048 101479
7568 31156 198653 -70505 -30427 32578 -15272 -206253 42437 -243294 -150801 -27892 -105185
7557 -105185 -77158 237842 -228813 -266547 -212430 7324 -19713 182681 277680 86339 -145149
7545 -33697 -51104 170753 -88694 248297 -124746 -5194 57379 32437 -38209 -163802 -31186
7533 1660 -80733 -111477 311214 -218706 -32680 -250071 -101528 3581 -74936 403061 341042
7522 341042 47973 -220266 -30689 -64387 -45492 -317616 48844 6610 3861 91280 153763 -166758
7509 -129297 -220490 -117651 -153334 -21899 73598 -61472 -31388 47703 -271848 13683 107033
7498 107033 194143 -153912 55631 10486 53250 22897 -191455 -115504 344789 58718 -55883
7486 78019 -217200 106040 -16298 -321576 52212 -243767 179101 -128246 -57868 -54424 110032
7474 -62677 35950 -122435 50651 -15635 151509 60224 -373059 -100422 88779 65960 -107099
7462 -73453 35726 130825 -46874 -243698 -14073 -12668 85630 -201637 205777 26385 106338
7451 106338 -140232 -10181 -177437 -209722 289207 -31941 -180915 131042 -266436 16323
7440 -403383 -94916 66675 27431 178403 -47061 -90789 -115628 -352687 -257573 -256544 -24459
7428 -178277 -27342 126612 148641 160504 72713 -138792 102131 -250248 -150145 29255 -210457
7416 -5446 148806 -305151 44680 45325 -212258 -121877 -88768 253110 4353 58318 -160628 95857
7403 -213433 72167 361785 -96142 99388 -31478 170496 -121889 53710 156132 -249907 -246111
7392 -246111 359027 65809 -111915 165915 -120888 -102944 86468 -63261 167056 62328 -231545
7380 150470 33346 -173380 -234189 50540 49981 170566 -247869 -212964 -63968 -110330 -96399
7369 -96399 -106261 192110 -62425 -451129 -163736 57677 -35365 324113 35214 -92211 128850
7357 -106963 -280294 17380 73274 190486 117809 -49120 -96560 20558 -93250 292651 170207
7346 170207 -134508 -100672 131543 38259 93137 149317 -58608 -365102 91288 533735 -135449
7334 -252681 -395908 -218684 -3506 -76973 55214 -19563 77011 -320980 -240852 29193 -10261
7322 85352 52805 -313247 111351 85116 148261 -177693 28927 16504 -20643 20395 -277357
7310 -46020 53189 176231 -61315 191996 20713 -84847 -155287 55044 12828 -86976 -63432
7299 -63432 -67034 214072 -73014 65891 -250613 -145118 -67916 -260875 75502 -78196 -240977
7288 -240977 157569 29768 18277 -457211 -101617 -111123 -124140 45967 -498578 -37914 99912
7276 -150862 96938 305910 -73196 -218383 -85421 -311118 -262603 167931 -89902 36295 144365
7265 144365 96378 -71460 76410 -69239 -197337 93208 -349251 2780 -439262 -43219 24614
7253 -70149 182705 109447 -81948 -166290 -398925 -260157 117173 64104 -33065 55057 81539
7242 81539 -42154 100932 100160 -54365 -189440 50116 -6315 -321925 -285940 -402046 58669 20220
7229 -35073 -176399 268341 -42924 172676 -168056 69736 171298 -234590 17980 122172
7219 122172 -153034 -85040 85427 -78492 -90514 399527 -13632 -77067 14339 75778 -85517
7207 23691 296246 54620 -64902 15577 -139364 36541 -156563 -79092 -123854 92222 54387
7196 54387 -183842 -67070 -82612 150860 204599 249507 109628 58349 -131326 -490674 47744
7184 253115 -231300 -143159 9637 -252895 86404 349045 10761 -24395 -90826 -193920 -132597
7173 -132597 -54125 63069 565468 -54159 -39092 -263120 49933 -82993 35389 -130969 202116
7161 131720 -157606 -267658 103698 -183004 201236 -85400 20988 -209441 -52020 -193653
7151 -193653 -13680 166915 -181561 -135890 -85808 -27882 96762 143346 139502 -99797 -188225
7140 -188225 -50845 111506 105883 -119514 -268867 49428 168282 -253948 -34990 -13255 184640
7128 55284 -101959 -36907 7319 111537 130927 -246028 -91268 -58133 96640 -127155 -35214
7116 103707 -83323 -112527 18267 3641 -180892 163454 139570 -285013 125890 -12385 116230
7104 -266149 231046 -275738 -138257 -3638 -85358 -196680 69337 185309 -57179 28472 67761
7093 67761 133131 436613 176631 -125366 -8149 -227383 -156107 11939 -68916 -238368 24089
7081 -353087 -12792 -129063 22335 2053 271195 183007 181709 37192 79680 -261987 -180967
7070 -180967 -266086 195366 25280 -301373 233286 96065 -172507 237126 -203239 7211 116446
7059 116446 -157980 90171 -323780 -141165 -174481 -3108 -93460 249546 50843 -14680 -31365
7048 -31365 -108404 -310630 -73168 -236467 122106 60138 85767 20970 46922 -176997 77880
7036 -426024 256520 -228685 -151726 224425 -17471 127478 285552 -254689 211716 -28742
7025 -111980 217295 -246695 -88749 63044 77055 -110214 -174392 -158423 55252 -177178 -73944
7013 12989 -119106 139841 -10850 -113940 18328 -58540 -190809 -216729 -33220 -71932 405361
7001 -189548 -237065 191988 -17807 342621 -157403 50890 -105488 14619 79038 213529 -105084
6989 103452 -25221 -62255 -136854 -279669 60861 139299 -251056 -84858 80878 -456153 -81754
6977 -224769 -19646 -104436 -98249 -117021 111197 -14085 -432455 -47432 -53657 -12309 -14411 -303917
6965 -303917 -276576 -268121 10688 -75268 -49802 -115583 -107143 -24836 -40331 18429 -278615 -177844
6953 -177844 17879 -157768 156279 -105398 -34113 9869 -68149 22753 124150 -164857 -56954
6941 -138073 -298372 -324867 226955 167290 -21422 23410 257416 45666 60270 85339 88097
6930 88097 -142336 -115829 -71166 -3628 10006 69168 30558 -75503 -27655 -342963 -58840 -126831
6918 -126831 -41832 161165 20383 252677 -115449 -67489 -26060 141973 -118671 -121933 823
6906 159011 -370792 134391 106317 71134 119465 -354995 14144 -107835 -17573 -131393 316674
6894 -217888 13451 -98342 -83384 20904 257767 -41442 159148 -44894 -45705 -3716 -51998 -93963
6882 -93963 13624 68570 -190849 -156119 174031 -69552 -372488 -318694 -13830 232892 223812
6871 223812 -269200 -51598 146828 197594 279042 92176 -3956 -104139 135957 87758 -148945
6859 -209292 126385 -341355 68800 20291 -31681 29571 84670 -123107 -129456 -130065 21554 19885
6847 19885 20302 -328710 -349499 -194146 -228409 220209 218834 16508 286912 6359 -192319 -55887
6834 16869 145716 140326 148055 107042 194797 -186173 -8072 426894 116681 349088 -35700
6822 197430 73452 -84893 -62868 77353 -263790 -102881 123839 101512 348310 -140152 -166234
6811 -166234 -181850 -74744 115961 -2638 -212632 -24718 -11727 -123037 -126564 15308 -25090
6799 -185164 83242 -159054 -275944 36132 -280423 -22745 31288 -129233 -219869 -167203 -2567
6787 -248364 188073 -28069 -133708 -191787 -321507 -152784 663 188051 -19936 -106187 55947
6775 -114646 547 -250381 -89552 -11621 -109679 -120186 153691 208771 -281787 -51969 -85635
6764 -85635 112627 117108 -47412 98581 162574 -82404 239514 -154939 -114333 -143389 216790
6752 -14983 -83767 -330662 4080 -91095 47528 -271592 -58841 -171397 -109230 221280 151528
6741 151528 114757 161735 -150968 234636 -9434 -2245 3924 -14540 30742 204341 -16379 19201
6728 146047 105110 -224510 -105886 -187182 228829 238944 -80784 -10226 -6005 -252240 -127348
6717 -127348 -97118 -250356 105902 -68564 -130869 -327311 158125 50021 20820 -306351 219753
6705 -93265 -255092 36472 14470 -204025 35493 108690 109771 335435 181550 -13988 -261229
6694 -261229 -11432 300424 -77890 -312600 79508 55806 -99689 -279130 23600 -23460 -240515
6683 -240515 159518 -68383 -208487 -178561 9550 -234487 50803 -46965 -324017 -28990 99470
6671 62090 -220933 130298 340795 -224844 -152228 -249497 -348888 157617 16983 113049 -230772
6659 -10320 83500 -291 -260175 -240321 54353 -184300 89620 -6420 -11316 156156 -170019 147515
6646 -16473 -42935 -24299 -172013 -217107 -132619 -205565 93985 -35886 -135328 -173635 -205854 81602
6633 -189982 -60154 60440 -38990 6199 41017 -57587 72461 183556 -125799 121418 204707
6622 204707 158241 60981 195981 207093 -163416 54729 89095 19569 -13311 -381440 -337520
6611 -337520 -28672 65626 121999 -63456 -193334 -14979 -164449 -64480 124281 24823 33209
6600 33209 140503 -270250 -63473 53000 151137 -14229 -51796 -258318 -61276 35795 -66136
6588 163457 -229572 -135043 179430 114935 85662 -29829 32030 -32416 -144735 841 -88954
6576 -69058 -109051 -343665 -106485 -3953 -64484 407239 -292497 206288 75004 973 -57151
6564 124381 -29554 255926 174608 115678 79788 274017 -262381 -149072 214644 -116665
6553 -314866 245133 300614 24103 -173673 -83385 122801 -219145 169258 21997 -27367 -83973
6542 -83973 -264347 185548 279062 -150000 5231 -138938 50957 -404401 176860 350544 350132
6531 350132 -54483 -37058 107483 -28761 -40649 -178833 99714 66810 55314 325337 -156210
6519 173828 214835 -129379 -420892 96396 -174881 16421 -34952 -279962 -192727 -89278 -97699
6508 -97699 102308 57039 -81841 93576 258927 -46371 -246703 94927 -41549 177461 -160407
6496 -10302 -28658 254371 -114473 -366545 -38907 -178258 55137 -67124 125389 55098 118778
6485 118778 -106530 70083 -239429 7340 -139161 -22374 -48533 -215464 -8588 68108 155800
6474 155800 -111484 246486 -45811 156195 -229083 143779 -41622 -233029 -52125 -90322
6464 -90322 14624 -95938 15989 -128808 -138433 -117338 6506 -13111 241463 47294 -263354 -25543
6451 46298 30541 72835 -10577 -138985 -24003 -53585 -37032 70405 111461 207224 26463 -134822
6438 -51227 57179 30833 156317 12025 -234457 48625 -25596 -79417 5049 -14552 138125
6426 71970 -26637 6509 109383 18171 -15075 -363903 17517 -154284 135714 356629 -215600
6414 -179733 88058 11042 49840 184476 148415 -253336 -13762 -334330 150372 191070 -68098
6402 -82927 153086 43052 -282025 56303 -173566 137636 122295 -16440 57698 250590 -135690
6390 -52317 54420 -17779 12076 -131709 -63777 -156002 -53476 -66070 9593 144600 153022 117949
6378 117949 191848 -156649 341372 -169890 -112115 -5024 -29834 166565 -71691 97504 157236
6367 157236 -87133 175798 -188505 36544 -299846 -30277 -112285 15050 -60131 -120875 -176345
6356 -176345 17430 237951 -133236 -77884 -2542 -197205 71606 188835 -3182 -88954 27537
6344 -231484 -46002 9031 -151511 -90325 -192368 56432 -79105 -55721 -62339 -155063 9355 25164
6332 25164 83322 262155 37251 209062 331720 -237508 109047 -61115 -18834 -222604 -32805
6320 -369163 -167643 160229 36481 -92885 39518 39146 187054 -185468 -252271 290694 86992
6308 18945 -174030 8270 -39245 135474 -156669 -275511 -243353 -73086 10871 -348333 -48134
6296 -111544 175251 84012 -91922 168046 127064 -112187 198990 188384 22572 522120 -82260
6284 110762 -75256 43227 -155366 -100347 -1004 -112646 203401 -130350 -183583 295096 -372759
6272 382435 -28312 -229225 166564 138317 -64094 -88602 -82 124295 214110 24869 339556
6261 339556 -119218 71116 -47681 -183937 62440 37630 154332 -371008 -221649 73643 -288563
6249 -9275 -223473 -263964 -136122 -249774 103915 -38741 170422 -11345 -210491 -49205 35520
6237 39636 -38057 -148898 -438619 -218051 -61980 -46764 -50629 16891 213364 387942 -41106
6225 37904 372400 -459349 21747 -10715 -139168 -89421 72662 47336 144458 8388 91000
6214 91000 300307 5073 173549 70118 430 -243279 22049 30529 -284821 -81524 -330706 -180633
6202 -180633 -18823 -350957 8818 27913 193719 83930 -99028 90333 -134539 71734 -126013
6190 -14210 -164619 -184191 302539 -153313 42034 136872 -157146 244067 19516 123844 121409
6179 121409 279969 264825 -64115 -109473 54497 168837 -35410 122088 -46014 56343 264568
6168 264568 91298 -22811 -31275 299923 -158142 75993 -62172 32890 -159236 -208218 45404
6156 88980 162673 -203151 78804 -36770 63011 34092 -302 116162 -273771 34349 126964 325713
6144 325713 1768 296644 99808 -58280 16138 -292696 91141 220031 -96254 -202688 -255000
6133 -255000 -181406 74950 116611 173051 88390 407971 -326955 -70156 -9489 223146 -6573
6121 7941 -273375 -40998 -104048 102945 -156507 121851 70764 198934 -69652 -89119 -119826
6110 -119826 -228599 -71714 215475 -32553 188374 -97027 -178278 -140284 -23011 -50275 272358
6098 17700 -8284 61438 258744 -255832 233213 -30289 -139547 -285780 164598 16114 -196606
6086 102588 205605 -39564 123737 47372 71926 189336 -16707 -180341 -134707 205302 366475
6075 366475 41813 62652 -185337 -14888 78708 66095 69659 -131375 -12943 238208 86948
6063 -342584 193521 216609 114274 137089 51976 -26807 -251285 -109244 156797 42263 47763
6052 47763 -62919 -69860 -47056 -205696 -264128 74801 -76067 -128352 260391 156370 73314
6040 18304 41765 -69300 -199374 161449 -44826 -245007 65480 95244 -308873 -114691 -56298
6028 171273 98042 -108026 44813 -96208 -57500 -95552 82795 -138216 278536 299442 -193369
6016 -166573 -159723 339917 -78173 -155739 276953 -177517 -204036 -296904 57459 38810 -58068
6004 -3601 -14761 37341 135237 24872 -53315 38678 -291950 -138397 36879 9052 5431 -65593
5991 -6690 -143130 182184 391749 76391 -221256 -38984 114248 -148607 -219585 -8928 374901
5979 -100724 -25781 -205269 197153 -123162 28153 54188 -143031 2071 -205545 -142211 74875
5967 1123 -294912 248681 -98060 -374771 -237991 -175651 164923 -133124 -28312 167589 113589
5956 113589 180788 58818 -137316 -366183 165436 57199 -192495 -179482 8397 2095 114158
5945 114158 81444 5628 262048 -37844 518057 -19164 42111 56941 -103575 6234 -8896 91812
5932 129861 -163897 -104870 217994 -207655 80725 165053 -202467 149837 344452 7155 423751
5921 423751 252154 271166 -160310 78337 86920 -104820 -1734 140313 11161 -83138 -69873
5910 -69873 -316619 -220502 -86331 -185310 -121382 -137541 -159602 160935 -141046 -183940 -383151
5899 -383151 -292160 6842 -92635 158203 -75654 137615 42312 -42504 114303 -357608 -392090
5888 -392090 -106975 -209905 235969 80623 -59799 -16912 -82175 107899 -5256 -29483 129998
5876 91883 -46908 -97045 234414 106813 7819 56091 -243728 195137 28459 -172588 -232301
5865 -232301 148379 -21855 -224579 48775 157449 -124880 -169354 98264 -178092 -222518 -40821
5853 121529 102112 397776 -48250 77460 53226 -265894 -146694 387930 -37749 -64900 7861
5841 -134173 37012 -17999 60340 -274391 82035 104638 -14567 -147234 66376 -181189 162728
5829 257098 -116481 123133 204052 -30716 122473 -79856 94077 -118074 -104670 -17049 -39129
5818 -39129 298168 78585 -234407 -71282 -70538 -33479 55703 2179 197088 -192289 149060
5806 -15809 -21309 -20211 49061 -131694 -314689 323047 88855 170995 357168 -283855 -22714
5794 288938 -88922 62045 27920 -178970 -65401 147912 -151299 143554 -48039 189049 -31634
5782 -31986 123948 37925 -121676 -9354 101376 282476 -45478 257007 -139346 -131749 -64808
5770 63538 190144 74819 22367 332302 -67288 347662 73953 -433997 -317905 -151400 -76597
5759 -76597 -222599 5365 19550 137704 -98361 161217 -460412 27227 -120328 241087 187842
5748 187842 136704 133008 107558 71166 -175969 210552 101160 -54350 171402 123334 44616
5736 -94418 -240290 117901 -131106 -272602 -273873 -211364 123455 29716 136024 -400912 35047
5724 -135967 -243218 334258 -67701 -200141 1934 -79589 20861 115423 -247276 -34586 -228537
5713 -228537 307978 211891 -33499 -316448 133180 -111960 127084 260666 19798 316925
5703 316925 -144382 -212138 198398 -170292 112954 -115828 83326 205024 189691 -159531
5692 -6759 -68157 -164548 -258867 -104621 -305955 -147651 15789 258125 -219441 148836 293186
5681 293186 -47656 -321697 57528 100482 -3557 88099 52501 -149314 -227644 135941 221066
5670 221066 47315 132343 191168 281521 29381 199916 -62437 79739 235099 -201382 -67345
5658 -11948 -193519 -91944 -103732 -66215 23895 -29937 264128 -47233 85236 118661 -215616
5646 85229 56033 48968 -163165 -72816 131413 125485 -313624 48852 -24165 285800 -380332
5634 245477 12078 104178 -189507 -80590 -219308 -255757 221658 237481 8833 -106199 283915
5622 28563 -56176 142235 20411 152865 87170 251153 110331 -67179 -154286 52633 22137
5610 285004 -63262 59061 -74055 45935 -128437 250707 291160 -28553 -199491 -367325 18471
5598 -21332 22240 65802 -203518 -22416 107685 237126 -25 248379 -160382 -29406 144686
5586 -291694 -132211 20105 49019 -69281 -33458 -46480 45292 303993 -86968 -100906 83847
5574 -63242 -26689 422190 235158 -69100 115160 -180025 301278 -430641 146036 258511
5564 258511 -123974 38847 25488 36233 71790 -213697 11568 -17736 -113768 -5815 -229290
5553 -229290 17191 -46528 -219123 122625 223953 -167449 -161033 -223577 -115107 -47075 15693
5541 170861 -11578 -145215 -70389 -43050 216385 274609 -119191 188215 105171 -78097 36936
5529 72180 202711 -170594 188205 -117917 200199 34884 -129680 249932 198678 7476 -201427
5517 -7188 42212 -99868 -25610 112485 14068 72177 -154347 79412 33817 -78107 -310661
5506 -310661 27253 178636 44451 -155628 87704 -440956 -23813 125398 -193005 52626 -288110
5494 -33240 -14354 5225 -1044 166855 -48005 28650 52144 145232 94264 -23622 -211760 62588
5481 234100 -181013 -84338 -287267 51887 94880 169406 210468 4895 483349 -19026 88744
5469 77315 128579 179972 -120661 364391 -59208 -183706 13840 118443 342764 -310885 -68035
5457 -46231 164303 383058 -38183 -316722 106852 -62700 147026 101068 -122590 165998
5446 272736 -20370 -183175 -57765 -28789 -104289 49392 -42060 143474 -31248 -134928 -93718
5435 -93718 -293270 330117 -11425 -11836 138729 291771 -8640 -344996 145963 -270181 -142562
5424 -142562 42234 -245034 11409 -20467 254199 -152620 144378 21876 40228 143890 -175813
5412 -41659 -179239 20817 367067 -38682 -239129 14852 75664 -68905 51221 259963 -252748
5400 28352 14872 33275 281975 117992 171847 -50890 82204 -20974 -7054 -292109 37563
5388 -129232 78933 93397 -2864 420824 -223250 -259183 -27762 13694 140902 -12895 38489
5376 -19363 275041 112545 -105402 288399 360402 128662 319833 150107 79969 115980
5366 115980 -3168 -165985 -64460 77816 16986 -152014 66295 83371 -49930 10267 -70760
5354 -111249 -114255 -72746 203322 170322 19433 44040 -75097 2808 56656 -49046 40469 151909
5342 151909 -153185 60514 -320956 150218 318003 229404 -30372 113429 -356666 -43862
5331 177316 -93201 106778 10546 76362 -218956 -212478 10095 158608 57844 131343 82807
5320 82807 114950 216627 -273649 -107689 137062 189021 -69623 -312250 315346 -182643
5309 67828 -104332 -36245 14119 -52477 235729 -125674 -191583 -203291 -90944 -65205 -134460
5298 -134460 167099 85399 77193 333085 -36376 53900 169512 -140508 135109 230556 31022
5286 -48248 56827 136463 77971 83112 13168 -150908 195128 171766 157280 -136862 -11413
5274 -119032 215101 -249238 -4029 255575 10219 -135938 87931 37121 -38519 -64605 106557
5262 -89995 -183127 67882 13430 64660 -110095 468370 -99734 -224949 100852 -192278 -234487
5251 -234487 54858 56857 217914 -254584 97555 182460 -85 -89674 -166499 236945 114659 106248
5239 106248 64984 -14376 -45818 -30455 422447 -27148 -28538 -52488 -258783 148400 38839
5227 125579 71542 252348 -31000 -176280 -170111 -70429 -171424 156197 123517 313840 -181059
5215 86530 165502 -91895 188638 -55520 -108000 -82063 -81372 -233442 201657 61522 26888 304890
5203 304890 -219443 -18801 159783 -71283 -239817 276025 -145873 -113594 214065 96793
5192 -88086 324452 110339 71854 68237 188087 141929 276265 202623 123711 -446983 -3145
5180 -17321 -155947 -88410 36173 265250 -50758 -74003 -42561 -40949 98817 50670 -286779
5168 -134683 18126 306316 -75536 10810 119464 -126419 -55732 136419 -105850 210761
5157 -75595 -116546 -223729 -70230 506005 -29020 -174019 -48145 -68776 12144 398654 122185
5145 366465 92036 -79609 60030 81567 97803 261320 -117082 -26311 77225 -32652 260164
5133 56437 -260191 -41854 -139126 -166460 -29882 -160445 10547 -13463 -81196 209054 -221869
5121 -82801 71927 276945 -131173 -78348 39468 -48029 167861 2563 102708 318460 20705
5109 135735 -73510 47938 351606 119138 61560 -19903 139456 108009 -31236 175512 206277
5098 206277 5575 122000 -238808 -151575 153903 107510 75912 -72972 91759 129102 -8874
5086 -81596 364220 29760 29802 -105392 7623 -102768 -3871 260037 -3339 112927 53755 118495
5074 118495 -713 -264389 -164127 35986 -51013 72810 -7430 128082 116177 185761 -93405 -173297
5062 -173297 150940 150200 -137121 -138421 54671 -256851 -221716 -133939 97323 66294 -21229 -106050
5050 -106050 -104722 -121182 -221695 -9248 4012 56971 179688 -124233 -50034 -45750 225579 235824
5038 235824 49885 44978 -293095 -26990 23682 49548 374653 -24313 43173 -108204 140487
5026 -36518 -28042 39402 184846 10418 -131027 224345 -233303 -109667 68244 332973 -189521
5014 -273738 379950 -31908 95059 -229016 -28385 39125 30980 122344 101872 -403879 -68880
5002 23142 -50312 18995 -143729 141816 21863 68770 73428 36246 30804 -166027 89265 -75509
4989 -28529 155697 284201 -107883 44814 93015 -90440 -357579 -168067 -674 -65354 -13593
4977 -36184 53281 -406036 114319 -19148 -205610 -14931 140582 -82121 209584 203546 157106
4966 157106 80170 119677 117483 -8470 202124 -157557 79736 29850 87634 -122385 9101 129907
4954 129907 81767 -7497 -194262 299328 7360 -71777 -20199 32310 -193103 60257 149464
4943 149464 18731 16926 -188058 260850 -74187 -188736 -76918 -204445 -64786 -147763 -137451
4932 -137451 64950 99650 10562 -20749 282720 -84078 -13481 -153166 630 -80441 -93848 90590
4919 20757 -127174 -158896 25994 235687 -49545 -88695 -97906 187685 -109028 -29145 -81885
4908 -81885 126208 -252510 -529108 -158956 150186 192183 48150 -20990 -35046 -9334 43447
4896 -64216 308916 -1375 -137904 135571 95151 108393 -4814 512642 222666 235586 -269702
4884 -185355 -160879 38006 132490 -192561 37608 -56373 10302 -93591 35786 -187087 -155914
4873 -155914 -194148 374878 -30353 253637 -168439 42766 -186054 7609 -109781 -47843 -50814
4862 -50814 -148268 179108 -72692 -144155 341615 21087 -44788 -94289 -13098 -112891 446957
4850 -133319 48169 -48593 14897 -186458 67768 -45536 32186 -18275 -136255 91057 230625
4839 230625 21659 242501 259170 -163901 -56343 188841 166601 421706 259650 47887 -31399
4827 47860 -161399 -127902 -6532 -367730 62371 -28399 -208496 43094 153135 156171 -220230
4815 -76392 292012 -105807 -228264 248762 24703 205713 132718 -98466 424773 65950 -73356
4803 128511 163184 -309906 188285 163594 57978 -33690 -29187 -6541 268982 -96407 2759 -36306
4790 -11358 -107810 168527 44389 127692 81387 -70472 -367087 34511 -160389 -307210 6045
4778 -256161 24668 188565 33107 -29095 141131 -387644 -37867 -35906 -22261 -75309 25968
4766 -13620 -123333 -103277 13890 299593 -40755 -301138 -6895 192675 -93303 329965 -91491
4754 -283887 23525 -296931 54851 207721 -70340 -162088 -235094 -374351 -22951 158911 -59913
4742 138513 61551 -5798 232466 37948 53178 22743 -50849 -340071 165785 -123289 -178026
4731 -178026 122707 91231 112704 -104560 64386 -83954 200657 297756 37055 -253430 5854
4719 245239 -42489 88033 -386063 -103216 -186091 256267 165021 -97918 -49808 264647 182227
4708 182227 -40990 -180218 246607 214049 162544 -158462 37947 -281662 -135799 -204718 177100
4696 -479097 -170854 -211737 -19452 -116195 254775 -7675 -48167 201614 -99506 111189 -180375
4684 77483 20034 -312395 -239269 65354 -106327 144753 200483 -8619 400330 135469 293727
4673 293727 -46767 -427576 -54398 -17238 -14027 -92293 -141573 -188255 50418 25010 203541
4662 203541 137040 -91606 38761 74150 -31658 -88884 -5166 -274770 -285357 80502 151946 -139321
4649 -248646 128937 -209942 -207127 -185973 -34912 4505 273136 28103 118818 17867 91060
4638 91060 38017 -111210 226854 -12955 -317869 -10842 3726 46744 223655 20456 59119
4627 59119 -80856 43182 -229640 -310458 92099 -50059 132247 -194339 160291 -148391 -350291
4616 -350291 113761 -117827 74860 118721 -19701 -24204 -245134 245332 293207 -104301 133286
4604 -4243 -110058 -28779 65271 21024 255245 -73501 -1879 -201656 -42130 3834 78703 -200685
4591 96140 -199057 8413 192598 -410095 -78149 -231134 -126070 -115632 67235 -155984 63395
4579 9205 -151833 120506 314030 87676 -168357 -94532 -100310 -283411 -305703 -153787 -10587
4567 -133813 -243318 307787 95059 87227 300644 67103 59382 -278357 326225 -25007 355129
4555 -63222 28542 115233 147543 -179601 -206434 116399 -17639 101327 302514 264025 -24371
4543 127881 -181771 1787 -152006 -42788 -19584 -128690 13457 97605 174554 -70052 -53827
4532 -53827 116081 73186 -374322 -212757 386411 -27561 206129 99056 198690 -158824 -194694
4521 -194694 -8086 213830 -38616 106415 -105421 -78578 -266133 37074 -200390 -109973 52640
4509 14642 217717 182932 244928 63351 -77733 161401 19346 288963 -1415 45567 129705
4498 129705 -64991 46840 24066 351088 392020 22352 34372 23167 -344855 174043 131844
4487 131844 -51856 -73779 -281208 148583 -213656 -50880 253875 391132 340299 98181 -269796
4475 121231 -64587 50469 -17831 -67981 297744 -59155 285645 121133 108803 59035 -271322
4463 -19987 -15491 118580 -215902 231446 103670 -32034 176625 -329404 -30836 22430 50675
$$ [...]
##END NTUPLES=NMR SPECTRUM
##END=
