##TITLE=AC1770_SANT_16_9683695_JZeJOlkGhm
##JCAMPDX= 6.0         $$ Bruker NMR JCAMP-DX V2.0
##DATA TYPE= NMR SPECTRUM
##DATA CLASS= NTUPLES
##ORIGIN= BRUKER
##OWNER= Administrator
$$ 1.72 TOPSPIN		Version 2.1
$$ 2016-04-16 23:11:45.017 -0700  Administrator@X
$$ Compression mode = diff/dup
##.OBSERVE FREQUENCY= 400.02188249412
##.OBSERVE NUCLEUS= ^1H
##.ACQUISITION MODE= SIMULTANEOUS (DQD)
##.ACQUISITION SCHEME= undefined
##.AVERAGES= 64
##.DIGITISER RES= 22
##SPECTROMETER/DATA SYSTEM= spect
##.PULSE SEQUENCE= noesygpps1d.comp
##.SOLVENT NAME= COFFEE_meoh
##.SHIFT REFERENCE= INTERNAL, COFFEE_meoh, 1, 14.96092
##AUDIT TRAIL= $$ (NUMBER, WHEN, WHO, WHERE, PROCESS, VERSION, WHAT)
$$ ##TITLE= Audit trail, TOPSPIN		Version 2.1
$$ ##JCAMPDX= 5.01
$$ ##ORIGIN= Bruker BioSpin GmbH
$$ ##OWNER= Administrator
$$ $$ E:\/data/COFFEE/nmr/AC1770_SANT_16_9683695_JZeJOlkGhm/22/pdata/1/auditp.txt
$$ ##AUDIT TRAIL=  $$ (NUMBER, WHEN, WHO, WHERE, PROCESS, VERSION, WHAT)
(   1,<2016-04-16 23:11:39.829 -0700>,<Administrator>,<X>,<go>,<TOPSPIN 2.1>,
      <created by zg
	started at 2016-04-16 23:00:10.236 -0700,
	POWCHK enabled, PULCHK disabled,
       configuration hash MD5:
       21 0F 79 D6 B3 7B B4 F6 88 20 88 DB 03 48 BD 9F
       data hash MD5: 64K
       B1 52 80 4E 07 3A 41 E5 00 B2 23 3E EF 3E A9 1E>)
(   2,<2016-04-16 23:11:42.970 -0700>,<Administrator>,<X>,<proc1d>,<TOPSPIN 2.1>,
      <Start of raw data processing
       efp LB = 0.3 FT_mod = 6 PKNL = 1 PHC0 = 0 PHC1 = 0 SI = 128K 
       data hash MD5: 128K
       A8 A1 C0 56 BD 20 D6 90 33 2D 18 51 70 13 2A 64>)
(   3,<2016-04-16 23:11:43.829 -0700>,<Administrator>,<X>,<proc1d>,<TOPSPIN 2.1>,
      <pk PHC0 = -88.31909 PHC1 = 0 
       data hash MD5: 128K
       D3 43 15 B7 81 B9 3A 57 0D 07 CC DE 18 F1 A7 11>)
(   4,<2016-04-16 23:11:44.204 -0700>,<Administrator>,<X>,<proc1d>,<TOPSPIN 2.1>,
      <abs ABSG = 1 
       data hash MD5: 128K
       B7 AC B1 0D 1C CC 72 B6 70 4E 34 D4 51 6D 13 80>)
(   5,<2016-04-16 23:11:44.298 -0700>,<Administrator>,<X>,<proc1d>,<TOPSPIN 2.1>,
      <abs ABSG = 2 
       data hash MD5: 128K
       FD ED D6 BA EB DE 0F 30 9C 9E 72 2F 93 47 DE CC>)
(   6,<2016-04-16 23:11:44.392 -0700>,<Administrator>,<X>,<proc1d>,<TOPSPIN 2.1>,
      <abs ABSG = 3 
       data hash MD5: 128K
       8E FE 5E 0B C9 5D 15 07 57 15 7C 27 3F D3 F8 E7>)
(   7,<2016-04-16 23:11:44.470 -0700>,<Administrator>,<X>,<proc1d>,<TOPSPIN 2.1>,
      <abs ABSG = 4 
       data hash MD5: 128K
       90 20 EE 63 FD 93 0D 27 8B 2F A5 17 DF AC F3 C8>)
(   8,<2016-04-16 23:11:44.595 -0700>,<Administrator>,<X>,<proc1d>,<TOPSPIN 2.1>,
      <abs ABSG = 5 
       data hash MD5: 128K
       21 BC E0 7D D3 92 5B E4 6C 86 57 F4 AC 75 F8 9D>)
$$ ##END=
$$ 
$$ $$ hash MD5
$$ $$ 21 DD 3B EC B6 FE CD 3C 73 42 D5 2E C2 F6 28 36
##$RELAX= 
##$RELAX= 
##$RELAX= 
##$RELAX= 
##$RELAX= 
##$RELAX= 
##$RELAX= 
##$RELAX= 
$$ Bruker specific parameters
$$ --------------------------
##$DU= <E:\>
##$EXPNO= 22
$$ [...]
##$TP07= 0
##$TPNAME0= <>
##$TPNAME1= <>
##$TPNAME2= <>
##$TPNAME3= <>
##$TPNAME4= <>
##$TPNAME5= <>
##$TPNAME6= <>
##$TPNAME7= <>
##$TPOAL= (0..7)
0.5 0.5 0.5 0.5 0.5 0.5 0.5 0.5
##$TPOFFS= (0..7)
0 0 0 0 0 0 0 0
##$TUNHIN= 0
##$TUNHOUT= 0
##$TUNXOUT= 0
##$USERA1= <user>
##$USERA2= <user>
##$USERA3= <user>
##$USERA4= <user>
##$USERA5= <user>
##$V9= 5
##$VALIST= <valist>
##$VCLIST= <CCCCCCCCCCCCCCC>
##$VD= 0
##$VDLIST= <DDDDDDDDDDDDDDD>
##$VPLIST= <PPPPPPPPPPPPPPP>
##$VTLIST= <TTTTTTTTTTTTTTT>
##$WBST= 2048
##$WBSW= 25
##$XGAIN= (0..3)
0 0 0 0
##$XL= 0
##$YL= 0
##$YMAX_a= 5745664
##$YMIN_a= -11505540
##$ZGOPTNS= <>
##$ZL1= 120
##$ZL2= 120
##$ZL3= 120
##$ZL4= 120
##$ABSF1= 14.96092
##$ABSF2= -5.597261
##$ABSG= 5
##$ABSL= 3
##$ALPHA= 0
##$AQORDER= 0
##$ASSFAC= 0
##$ASSFACI= 0
##$ASSFACX= 0
##$ASSWID= 0
##$AUNMP= <proc_prof1d_extract.lims>
##$AXLEFT= 0
##$AXNAME= <>
##$AXNUC= <1H>
##$AXRIGHT= 0
##$AXTYPE= 0
##$AXUNIT= <>
##$AZFE= 0.1
##$AZFW= 0.1
##$BCFW= 0
##$BC_mod= 0
##$BYTORDP= 0
##$COROFFS= 0
##$CY= 15
##$DATMOD= 1
##$DC= 0
##$DFILT= <>
##$DTYPP= 0
##$F1P= 0
##$F2P= 0
##$FCOR= 0.5
##$FTSIZE= 131072
##$FT_mod= 6
##$GAMMA= 0
##$GB= 0
##$INTBC= 1
##$INTSCL= 1
##$ISEN= 128
##$LB= 0.3
##$LEV0= 0
##$LPBIN= 0
##$MAXI= 10000
##$MC2= 0
##$MEAN= 0
##$ME_mod= 0
##$MI= 0
##$NCOEF= 0
##$NC_proc= -2
##$NLEV= 6
##$NOISF1= 0
##$NOISF2= 0
##$NSP= 0
##$NTH_PI= 0
##$NZP= 0
##$OFFSET= 14.96092
##$PC= 1
##$PHC0= -88.31909
##$PHC1= 0
##$PH_mod= 1
##$PKNL= yes
##$PPARMOD= 0
##$PPDIAG= 0
##$PPIPTYP= 0
##$PPMPNUM= 2147483647
##$PPRESOL= 1
##$PSCAL= 4
##$PSIGN= 0
##$PYNMP= <proc.py>
##$REVERSE= no
##$SF= 400.020009669085
##$SI= 131072
##$SIGF1= 0
##$SIGF2= 0
##$SINO= 400
##$SIOLD= 131072
##$SPECTYP= <>
##$SREGLST= <1H.CDCl3>
##$SSB= 0
##$STSI= 131072
##$STSR= 0
##$SW_p= 8223.68421052631
##$SYMM= 0
##$S_DEV= 0
##$TDeff= 65536
##$TDoff= 0
##$TI= <>
##$TILT= no
##$TM1= 0
##$TM2= 0
##$TOPLEV= 0
##$USERP1= <user>
##$USERP2= <user>
##$USERP3= <user>
##$USERP4= <user>
##$USERP5= <user>
##$WDW= 1
##$XDIM= 131072
##$YMAX_p= 304989655
##$YMIN_p= -12634
##$CURPLOT= <Network HP LaserJet P1505>
##$CURPRIN= <$Network HP LaserJet P1505>
##$DFORMAT= <normdp>
##$LAYOUT= <+/1D_H.xwp>
##$LFORMAT= <normlp>
##$PFORMAT= <normpl>
##$SURQMSG= 1
$$ End of Bruker specific parameters
$$ ---------------------------------
##NTUPLES= NMR SPECTRUM
##VAR_NAME=  FREQUENCY,     SPECTRUM/REAL,   SPECTRUM/IMAG
##SYMBOL=    X,             R,               I
##VAR_TYPE=  INDEPENDENT,   DEPENDENT,       DEPENDENT
##VAR_FORM=  AFFN,          ASDF,            ASDF
##VAR_DIM=   131072,        131072,          131072
##UNITS=     HZ,            ARBITRARY UNITS, ARBITRARY UNITS
##FACTOR=    0.0627417313425164, 1,          1
##FIRST=     8223.62146879497, 2038,         -61754
##LAST=      0,             3689,            -61236
##MIN=       0,             -12634,          0
##MAX=       8223.62146879497, 304989655,    0
$$ Real data points
##PAGE= N=1
##DATA TABLE= (X++(R..R)), XYDATA
$$ [...]
$$ plain form
63933 5299137 5566346 5813702 6036108 6229208 6389172 6512191 6594709 6634505 6631174 6585329
63923 6585329 6497911 6370687 6206744 6009770 5783253 5531035 5258216 4970724 4674199 4373905
63913 4373905 4075226 3783110 3500952 3230841 2974977 2735923 2515305 2313183 2129112
63904 2129112 1963082 1814960 1683630 1567312 1464385 1373461 1293035 1221678 1158487 1102890
63894 1102890 1053995 1010446 970898 934486 900878 870089 842215 817124 794351 773355 753937
63883 753937 736389 721164 708336 697400 687818 679758 674058 671393 671762 674936 680918 689553 700122
63870 700122 711973 725382 741088 759060 778370 798349 819159 841043 863630 886288 908595
63859 908595 930109 950184 968489 985375 1001228 1015598 1027344 1035562 1040160 1041594 1040211 1035796
$$ packed form
63933E299137K67209K47356K22406J93100J59964J23019Q2518L9796l331m5845
63923F585329q7418j27224j63943j96974k26517k52218k72819k87492k96525l00294
63913D373905k98679k92116k82158k70111k55864k39054k20618k02122j84071
63904B129112j66030j48122j31330j16318j02927r0924q0426p1357o3191n5597
63894A102890m8895m3549l9548l6412l3608l0789k7874k5091k2773k0996j9418
63883G53937j7548j5225j2828j0936r582q060n700k665L69L174N982Q635J0569
63870G00122J1851J3409J5706J7972J9310J9979K0810K1884K2587K2658K2307
63859I08595K1514K0075J8305J6886J5853J4370J1746Q218M598J434j383m415
$$ plain form
63847 1035796 1027705 1015589 999946 981673 961095 937819 911635 883086 853012 821942 790179
63836 790179 758082 726014 694317 663560 634395 606917 580623 555253 531206 508770 487525
63825 487525 467068 447873 430726 415630 401944 389374 378059 367797 357952 348216 338847 330133
63813 330133 322222 315490 310307 306238 302212 297894 294232 292144 291156 289895 287593 284522 281176 277706
63799 277706 274242 271191 268891 267138 265241 262533 258906 254927 251377 248592 246325 244275 242458 240871
63785 240871 239122 236844 234360 232354 230872 229185 226893 224696 223614 223713 224106 224110 223881 223839 223939 223759 223085
63768 223085 222115 221246 220810 220945 221529 222285 222988 223509 223652 223200 222243 221258 220665 220498 220709 221540 223187 225191
63750 225191 226614 226952 226612 226390 226732 227557 228533 229328 229807 230174 230889 232303 234411 236957 239705 242582 245685
$$ packed form
63847A035796q091j2116j5643j8273k0578k3276k6184k8549l0074l1070l1763
63836G90179l2097l2068l1697l0757k9165k7478k6294k5370k4047k2436k1245
63825D87525k0457j9195j7147j5096j3686j2570j1315j0262r845r736r369q714
63813C30133p911o732n183m069m026m318l662k088r88j261k302l071l346l470
63799B77706l464l051k300j753j897k708l627l979l550k785k267k050j817j587
63785B40871j749k278k484k006j482j687k292k197j082R9L93Mk29m2J00j80o74
63768B23085r70q69m36J35N84P56P03N21J43m52r57r85n93j67K11Q31J647K004
63750B25191J423L38l40k22L42Q25R76P95M79L67P15J414K108K546K748K877L103
$$ plain form
63733 245685 249114 252707 255983 258548 260544 262477 264605 266792 269012 271666 275107 279003 282445 284674
63719 284674 285656 286048 286679 287941 289556 290913 291610 291643 291193 290527 289994 289714 289242 287969 286070 284637 284527
63702 284527 285328 285874 285624 285166 285381 286483 287929 289068 289744 290349 291379 292962 294913 297146 299758 302635
63686 302635 305256 307118 308208 308872 309360 309656 309617 309116 308215 307354 307151 307778 308663 309012 308509 307391 306076
63669 306076 304960 304330 304092 303717 302783 301441 300104 298840 297415 295746 293911 291820 289361 286770 284428
63654 284428 282250 279743 276711 273473 270345 267389 264819 263145 262542 262462 262224 261834 261928 263032 265127 267809
63638 267809 270709 273804 277379 281633 286265 290661 294522 298091 301732 305578 309737 314547 320318 327014
63624 327014 334411 342527 351699 362292 374378 387568 401125 414501 427939 442329 458287 475637
$$ packed form
63733B45685L429L593L276K565J996J933K128K187K220K654L441L896L442K229
63719B84674R82L92O31J262J615J357O97L3m50o66n33k80m72j273j899j433j10
63702B84527Q01N46k50m58K15J102J446J139O76O05J030J583J951K233K612K877
63686C02635K621J862J090O64M88K96l9n01r01q61k03O27Q85L49n03j118j315
63669C06076j116o30k38l75r34j342j337j264j425j669j835k091k459k591k342
63654B84428k178k507l032l238l128k956k570j674o03q0k38l90R4J104K095K682
63638B67809K900L095L575M254M632M396L861L569L641L846M159M810N771O696
63624C27014P397Q116R172J0593J2086J3190J3557J3376J3438J4390J5958J7350
$$ plain form
63612 475637 493934 513137 533361 554238 575050 595422 615406 634784 652783 668700 682503
63601 682503 694546 704798 712579 717006 717673 715041 710213 704117 696754 687379 675552 661918 647797
63588 647797 634058 620523 606445 591398 575729 560247 545553 531632 518017 504320 490631
63577 490631 477509 465713 455849 448041 441871 436827 432893 430553 430074 431047 432883 435528 439305 444123
63563 444123 449381 454791 460830 468069 476397 485400 495280 506848 520513 535722 551618 568032 585565
63550 585565 604831 625834 648082 671108 694759 718940 743167 766497 787952 806885 822811
63539 822811 835027 842695 845342 843184 836982 827714 816263 803160 788608 772920 756796 740857
63527 740857 724908 708090 689876 670581 650752 630469 609565 588192 566751 545427 524157
$$ packed form
63612D75637J8297J9203K0224K0877K0812K0372J9984J9378J7999J5917J3803
63601F82503J2043J0252P781M427O67k632m828o096p363r375j1827j3634j4121
63588F47797j3739j3535j4078j5047j5669j5482j4694j3921j3615j3697j3689
63577D90631j3122j1796r864p808o170n044l934k340m79R73J836K645L777M818
63563D44123N258N410O039P239Q328R003R880J1568J3665J5209J5896J6414J7533
63550E85565J9266K1003K2248K3026K3651K4181K4227K3330K1455J8933J5926
63539H22811J2216P668K647k158o202r268j1451j3103j4552j5688j6124j5939
63527G40857j5949j6818j8214j9295j9829k0283k0904k1373k1441k1324k1270
$$ plain form
63516 524157 503053 482604 463481 446282 431292 418186 406114 394411 383282 373555 365785 359789
63504 359789 355017 351055 347746 345029 342803 340851 338858 336587 334037 331397 328920 326936 325802 325593
63490 325593 325887 326067 325829 325353 325037 325230 326093 327537 329327 331354 333688 336231 338545 340278 341588 342850
63474 342850 344062 344858 344999 344512 343410 341607 339150 336245 333105 329981 327300 325409 324228 323408 322761
63459 322761 322242 321722 321310 321783 324002 327717 331573 334568 337098 340267 344650 350072 356152 362594 369225
63444 369225 376240 384300 393955 404993 416604 428202 439882 452244 466009 481727 499506 518903
63432 518903 539160 559572 579690 599348 618547 637171 654727 670561 684419 696680 708075
63421 708075 719443 731794 746041 762334 779851 797551 815036 832491 850005 867158 883061
$$ packed form
63516E24157k1104k0449j9123j7199j4990j3106j2072j1703j1129r727p770n996
63504C59789m772l962l309k717k226j952j993k271k550k640k477j984j134k09
63490C25593K94J80k38m76l16J93Q63J444J790K027K334K543K314J733J310J262
63474C42850J212P96J41m87j102j803k457k905l140l124k681j891j181q20o47
63459C22761n19n20m12M73K219L715L856K995K530L169M383N422O080O442O631
63444C69225P015Q060R655J1038J1611J1598J1680J2362J3765J5718J7779J9397
63432E18903K0257K0412K0118J9658J9199J8624J7556J5834J3858J2261J1395
63421G08075J1368J2351J4247J6293J7517J7700J7485J7455J7514J7153J5903
$$ plain form
63410 883061 896588 906777 913267 916252 915925 912285 905624 896706 886017 873232 857950 840753 822882
63397 822882 804883 786107 765679 743517 720300 696812 673516 650555 627995 606120 585454
63386 585454 566374 548848 532752 518293 505793 495190 486169 478760 473368 470145 468706 468618 469910
63373 469910 472961 478148 485544 494683 504580 514451 524547 535986 549626 565468 583196 602745 623958
63360 623958 646118 668410 690687 713340 736447 759450 781684 802823 822664 840731 856349
63349 856349 869070 878884 885975 890260 891231 888387 881860 872452 860984 847760 832808 816455 799336
63336 799336 781866 764017 745658 726847 707675 688089 668138 648269 629039 610609 592852
63325 592852 576065 561227 549203 539834 532095 525087 518567 512592 507088 501917 496913 491534 484795
$$ packed form
63410H83061J3527J0189O490K985l27l640o661q918j0689j2785j5282j7197j7871
63397H22882j7999j8776k0428k2162k3217k3488k3296k2961k2560k1875k0666
63386E85454j9080j7526j6096j4459j2500j0603r021p409n392l223j439q8J292
63373D69910L051N187P396R139R897R871J0096J1439J3640J5842J7728J9549K1213
63360F23958K2160K2292K2277K2653K3107K3003K2234K1139J9841J8067J5618
63349H56349J2721R814P091M285R71k844o527r408j1468j3224j4952j6353j7119
63336G99336j7470j7849j8359j8811j9172j9586j9951j9869j9230j8430j7757
63325E92852j6787j4838j2024r369p739p008o520n975n504n171n004n379o739
$$ plain form
63312 484795 475998 465455 454099 442491 430610 418595 407174 397070 388364 380763 374293 369368
63300 369368 366134 364017 362051 359587 356679 353832 351406 349247 346841 343840 340425 337191 334617 332581
63286 332581 330452 327788 324906 322566 321014 319668 317919 315961 314474 313675 313110 312356 311529 310992 310927 311290
63270 311290 311925 312632 313395 314645 317001 320587 324814 328948 332601 335623 337985 340042 342582 346185 350763
63255 350763 355971 361809 368378 375279 381908 388388 395686 404560 414755 425444 436277 447769 460825
63242 460825 476036 493313 512034 531617 552039 573770 597185 622181 648413 675786 704566
63231 704566 735067 767278 800746 834745 868606 901904 934346 965655 995781 1025217 1054735
63220 1054735 1084573 1114011 1141963 1167873 1191882 1214197 1234562 1252339 1266863 1277677 1284518
$$ packed form
63312D84795q797j0543j1356j1608j1881j2015j1421j0104q706p601o470m925
63300C69368l234k117j966k464k908k847k426k159k406l001l415l234k574k036
63286C32581k129k664k882k340j552j346j749j958j487p99n65p54q27n37o5L63
63270C11290O35P07P63J250K356L586M227M134L653L022K362K057K540L603M578
63255C50763N208N838O569O901O629O480P298Q874J0195J0689J0833J1492J3056
63242D60825J5211J7277J8721J9583K0422K1731K3415K4996K6232K7373K8780
63231G04566L0501L2211L3468L3999L3861L3298L2442L1309L0126K9436K9518
63220A054735K9838K9438K7952K5910K4009K2315K0365J7777J4524J0814O841
$$ plain form
63209 1284518 1287121 1284907 1276975 1262689 1242384 1217284 1188613 1156913 1122270 1084970 1045782 1005877
63197 1005877 966727 929829 896126 865668 838133 813652 792873 776259 763656 754594 748658 745490
63185 745490 744747 746250 749940 755647 763137 772382 783295 795076 806407 816663 826474 836610 846736
63172 846736 855895 863868 871210 878026 883550 887136 888945 889320 888046 884645 878943 870886 860177 846587
63158 846587 830473 812571 793371 772980 751513 729319 706912 684931 664055 644673 626730
63147 626730 610119 595060 581820 570134 559324 548992 539335 530767 523573 518003 514371 512762 512741
63134 512741 513585 514791 516264 518071 520211 522705 525802 529860 534918 540524 546163 551740 557488 563451
63120 563451 569349 574934 580177 584995 589117 592433 595231 597844 600212 601983 602922 603089 602800 602532 602613 602739
$$ packed form
63209A284518K603k214p932j4286k0305k5100k8671l1700l4643l7300l9188l9905
63197A005877l9150l6898l3703l0458k7535k4481k0779j6614j2603r062n936l168
63185G45490p43J503L690N707P490R245J0913J1781J1331J0256R811J0136J0126
63172H46736R159P973P342O816N524L586J809L75j274l401n702q057j0709j3590
63158H46587j6114j7902j9200k0391k1467k2194k2407k1981k0876j9382j7943
63147F26730j6611j5059j3240j1686j0810j0332r657q568p194n570l632j609k1
63134E12741Q44J206J473J807K140K494L097M058N058N606N639N577N748N963
63120E63451N898N585N243M818M122L316K798K613K368J771R39J67k89k68Q1J26
$$ plain form
63104 602739 602071 600158 597559 595306 593899 593177 592914 593049 593390 593580 593428 592978 592287 591578 591480 592666 595125
63087 595125 598272 601767 605747 610190 614702 619292 624674 631232 638176 644536 650812 658774 669389 681592
63073 681592 693572 704908 716875 730791 746667 763724 781733 801319 823065 846906 872587
63062 872587 900219 930061 962153 996632 1034106 1075181 1119804 1167663 1219158 1275177 1335818
63051 1335818 1400053 1466996 1536768 1609572 1684507 1760040 1835412 1910926 1986964 2063315 2139432
63040 2139432 2214750 2288571 2360076 2428670 2494154 2556501 2615584 2671044 2722091 2767447 2805742
63029 2805742 2836021 2857663 2869855 2871419 2861191 2838409 2802877 2755125 2696451 2628455 2552404
63018 2552404 2469306 2380623 2288662 2196110 2105366 2018301 1936342 1860477 1791298 1729198 1674563
$$ packed form
63104F02739o68j913k599k253j407p22k63J35L41J90j52m50o91p09r8J186K459
63087E95125L147L495L980M443M512M590N382O558O944O360O276P962J0615J2203
63073F81592J1980J1336J1967J3916J5876J7057J8009J9586K1746K3841K5681
63062H72587K7632K9842L2092L4479L7474M1075M4623M7859N1495N6019O0641
63051A335818O4235O6943O9772P2804P4935P5533P5372P5514P6038P6351P6117
63040B139432P5318P3821P1505O8594O5484O2347N9083N5460N1047M5356L8295
63029B805742L0279K1642J2192J564j0228k2782l5532m7752n8674o7996p6051
63018B552404q3098q8683r1961r2552r0744q7065q1959p5865o9179o2100n4635
$$ plain form
63007 1674563 1627735 1588757 1557133 1531932 1512460 1498961 1492279 1492444 1497849 1506261 1516499 1528598
62995 1528598 1542530 1557504 1572665 1587788 1602908 1617741 1631787 1644636 1655879 1665031 1671861 1676450
62983 1676450 1678648 1677767 1673056 1664162 1650819 1632540 1609038 1580709 1548308 1512431 1473631 1432708
62971 1432708 1390397 1347023 1302917 1258871 1215693 1173616 1132752 1093855 1057830 1024538 992879
62960 992879 962156 932685 904953 878899 854302 831198 809507 788812 768905 750135 732776
62949 732776 716462 700663 685372 670839 656919 643214 629744 616994 605301 594569 584568
62938 584568 575240 566692 559141 552808 547641 543125 538596 533846 529362 525878 523659 522062 519939 516669
62924 516669 512789 509344 506686 504343 502074 500381 499695 499655 499638 499479 499043 497552 494269 489734 485530 482636
$$ packed form
63007A674563m6828l8978l1624k5201j9472j3499o682J65N405Q412J0238J2099
62995A528598J3932J4974J5161J5123J5120J4833J4046J2849J1243R152O830M589
62983A676450K198q81m711q894j3343j8279k3502k8329l2401l5877l8800m0923
62971A432708m2311m3374m4106m4046m3178m2077m0864l8897l6025l3292l1659
62960I92879l0723k9471k7732k6054k4597k3104k1691k0695j9907j8770j7359
62949G32776j6314j5799j5291j4533j3920j3705j3470j2750j1693j0732j0001
62938E84568r328q548p551o333n167m516m529m750m484l484k219j597k123l270
62924E16669l880l445k658k343k269j693o86m0j7j59m36j491l283m535m204k894
$$ plain form
62908 482636 480620 478547 476055 473341 470639 468141 466085 464566 463391 462275 460972 459196 456806 454199
62894 454199 452161 451073 450552 450057 449531 449221 449168 449221 449325 449462 449426 448987 448220 447470 447061 447148 447658 448203 448249 447635
62874 447635 446769 446113 445603 444858 443775 442667 441886 441601 441829 442356 442689 442430 441743 441173 440973 440899 440770 440917
62856 440917 441854 443582 445452 446751 447447 448308 450147 452854 455300 456347 455931 454971 454382 454389 454716 455050 455197
62839 455197 455060 454672 454133 453460 452668 452022 451968 452660 453723 454668 455403 456202 457303 458707 460318 462111 464196
62822 464196 466823 470296 474692 479667 484636 489178 493292 497294 501569 506356 511631 517144 522678 528370
62808 528370 534753 542378 551327 561077 570932 580634 590571 601379 613433 626811 641646 658239 676791
62795 676791 697243 719631 744480 772592 804401 839742 878422 920903 968243 1021319 1080194
$$ packed form
62908D82636k016k073k492k714k702k498k056j519j175j116j303j776k390k607
62894D54199k038j088n21m95n26l10n3N3J04J37l6m39p67p50m09Q7N10N45M6o14
62874D47635q66o56n10p45j083j108p81k85K28N27L33k59o87n70k00p4j29J47
62856D40917R37J728J870J299O96Q61J839K707K446J047m16r60n89PL27L34J47
62839D55197j37l88n39o73p92o46n4O92J063R45P35P99J101J404J611J793K085
62822D64196K627L473M396M975M969M542M114M002M275M787N275N513N534N692
62808E28370O383P625Q949R750R855R702R937J0808J2054J3378J4835J6593J8552
62795F76791K0452K2388K4849K8112L1809L5341L8680M2481M7340N3076N8875
$$ plain form
62784 1080194 1144301 1213150 1286785 1365613 1449909 1539530 1633950 1732426 1834100 1937992 2042963
62773 2042963 2147640 2250378 2349260 2442143 2526760 2601003 2663208 2712152 2746761 2765971 2769021
62762 2769021 2755725 2726297 2681042 2620532 2546106 2459922 2364402 2261817 2154394 2044478 1934267
62751 1934267 1825506 1719571 1617630 1520446 1428209 1340918 1258981 1183200 1114088 1051385 994251
62740 994251 941807 893527 849426 810005 775854 747024 722704 701497 682075 663742 646575
62729 646575 631089 617650 606140 596227 587819 581093 576090 572508 569945 568167 567149 567069 568368 571568
62715 571568 576868 583999 592545 602267 613177 625607 640313 658076 678935 702117 727130 754600
62703 754600 785528 819877 856500 894510 934128 976022 1020359 1066869 1115311 1165312 1215873
$$ packed form
62784A080194O4107O8849P3635P8828Q4296Q9621R4420R8476J01674J03892J04971
62773B042963J04677J02738R8882R2883Q4617P4243O2205M8944L4609J9210L050
62762B769021j3296k9428m5255o0510p4426q6184r5520j02585j07423j09916j10211
62751A934267j08761j05935j01941r7184r2237q7291q1937p5781o9112o2703n7134
62740I94251n2444m8280m4101l9421l4151k8830k4320k1207j9422j8333j7167
62729F46575j5486j3439j1510r913q408o726n003l582k563j778j018q0J299L200
62715E71568N300P131Q546R722J0910J2430J4706J7763K0859K3182K5013K7470
62703G54600L0928L4349L6623L8010L9618M1894M4337M6510M8442N0001N0561
$$ plain form
62692 1215873 1265502 1312858 1357021 1397265 1432976 1463820 1489610 1509827 1523413 1529172 1526305 1514610
62680 1514610 1494408 1466454 1431826 1391647 1346818 1297966 1245718 1191043 1135259 1079673 1025205
62669 1025205 972465 922097 874836 831208 791371 755285 722737 693102 665519 639657 616076
62658 616076 595414 577392 561080 545983 532329 520214 509108 498472 488419 479393 471491 464495
62646 464495 458389 453441 449757 447005 444584 441970 439075 436396 434679 434146 434154 433845 433106 432603 432886 433697
62630 433697 434222 433860 432650 431122 429874 429291 429537 430654 432515 434714 436745 438483 440415 443272 447515
62615 447515 453200 460118 467853 475930 484293 493604 504758 518000 532707 548083 563981 581090 600485
62602 600485 622928 648375 676179 705990 738362 774200 813681 856113 900782 947405 995632
$$ packed form
62692A215873M9629M7356M4163M0244L5711L0844K5790K0217J3586N759k867j1695
62680A514610k0202k7954l4628m0179m4829m8852n2248n4675n5784n5586n4468
62669A025205n2740n0368m7261m3628l9837l6086l2548k9635k7583k5862k3581
62658F16076k0662j8022j6312j5097j3654j2115j1106j0636j0053r026p902o996
62646D64495o106m948l684k752k421k614k895k679j717n33Ql09p39n03K83Q11
62630D33697N25l62j210j528j248n83K46J117J861K199K031J738J932K857M243
62615D47515N685O918P735Q077Q363R311J1154J3242J4707J5376J5898J7109J9395
62602F00485K2443K5447K7804K9811L2372L5838L9481M2432M4669M6623M8227
$$ plain form
62591 995632 1044692 1093937 1143241 1192323 1239891 1284032 1323350 1357208 1384976 1405641 1418275
62580 1418275 1422414 1417804 1404340 1382567 1353852 1319621 1280634 1237287 1190298 1140678 1089272 1036924
62568 1036924 984997 935042 887763 842827 799992 759961 723729 691471 662622 636835 614237
62557 614237 594744 577731 562584 549145 537332 526669 516609 507120 498607 491341 485227 480055
62545 480055 475646 471701 467847 463964 460369 457543 455753 454924 454751 454863 454975 454979 454956 455229 456395 459042 463136
62528 463136 467837 472292 476658 482050 489335 498341 508411 519450 532082 546963 564294 583889 605366
62515 605366 628285 652524 678638 707467 739033 772033 804732 836341 867198 897617 926938
62504 926938 953977 978114 999552 1018551 1034833 1047939 1057890 1065212 1070490 1074158 1076739 1078997 1081779
$$ packed form
62591I95632M9060M9245M9304M9082M7568M4141L9318L3858K7768K0665J2634
62580A418275M139m610j3464k1773k8715l4231l8987m3347m6989m9620n1406n2348
62568A036924n1927m9955m7279m4936m2835m0031l6232l2258k8849k5787k2598
62557F14237j9493j7013j5147j3439j1813j0663j0060r489q513p266o114n172
62545D80055m409l945l854l883l595k826j790q29j73J12J12Mk3K73J166K647M094
62528D63136M701M455M366N392P285R006J0070J1039J2632J4881J7331J9595K1477
62515F05366K2919K4239K6114K8829L1566L3000L2699L1609L0857L0419K9321
62504I26938K7039K4137K1438J8999J6282J3106R951P322N278L668K581K258K782
$$ plain form
62491 1081779 1085834 1091795 1100092 1110855 1124119 1140220 1159717 1182706 1208358 1235391 1262919 1290649
62479 1290649 1318245 1344709 1368401 1387582 1400983 1408067 1408799 1403045 1390205 1369552 1341002 1305388
62467 1305388 1264042 1218230 1169028 1117365 1063963 1009381 954437 900543 849347 801962 758678
62456 758678 719396 684093 652819 625543 602242 583011 567818 556212 547488 541112 536791 534199
62444 534199 532932 532768 533675 535490 537865 540758 544594 549579 555001 559611 562720 564579 565662 565893 564760
62429 564760 561960 557710 552497 546610 539894 531979 522874 513245 503908 495052 486261 477354 468839 461291
62415 461291 454613 448231 441855 435715 430124 425169 420844 417191 414223 411883 410127 408896 407984 407097 406101
62400 406101 405105 404317 403972 404351 405641 407733 410326 413258 416560 420165 423741 426910 429445 431259 432446
$$ packed form
62491A081779M055N961Q297J0763J3264J6101J9497K2989K5652K7033K7528K7730
62479A290649K7596K6464K3692J9181J3401P084P32n754j2840k0653k8550l5614
62467A305388m1346m5812m9202n1663n3402n4582n4944n3894n1196m7385m3284
62456G58678l9282l5303l1274k7276k3301j9231j5193j1606q724o376m321k592
62444E34199j267j64R07J815K375K893L836M985N422M610L109J859J083K31j133
62429E64760k800m250n213n887o716p915r105r629r337q856q791q907q515p548
62415D61291o678o382o376o140n591m955m325l653k968k340j756j231r12q87r96
62400D06101r96p88l45L79J290K092K593K932L302L605L576L169K535J814J187
$$ plain form
62385 432446 433489 435219 438317 442873 448506 454750 461188 467408 473137 478523 484126 490538 498001 506319
62371 506319 515153 524483 534794 546672 560146 574655 589812 606009 624079 644532 667414 692750
62359 692750 720715 751338 784384 819604 856732 895071 933400 970647 1006492 1041001 1073734
62348 1073734 1103486 1128883 1149034 1163605 1172574 1176101 1174539 1168447 1158561 1145660 1130233 1112220
62336 1112220 1091280 1067470 1041589 1014719 987601 960590 934065 908476 883968 860285 837291
62325 837291 815325 794685 774962 755260 735135 714933 695088 675525 656086 637216 619698
62314 619698 603675 588420 573271 558492 544925 532935 522020 511445 501107 491707 484187 479046
62302 479046 476139 474951 474899 475339 475583 475286 474799 474825 475635 476902 478460 480775 484299 488602 492675 496076
$$ packed form
62385D32446J043J730L098M556N633O244O438O220N729N386N603O412P463Q318
62371E06319Q834R330J0311J1878J3474J4509J5157J6197J8070K0453K2882K5336
62359F92750K7965L0623L3046L5220L7128L8339L8329L7247L5845L4509L2733
62348A073734K9752K5397K0151J4571Q969L527j562o092r886j2901j5427j8013
62336A112220k0940k3810k5881k6870k7118k7011k6525k5589k4508k3683k2994
62325H37291k1966k0640j9723j9702k0125k0202j9845j9563j9439j8870j7518
62314F19698j6023j5255j5149j4779j3567j1990j0915j0575j0338r400p520n141
62302D79046k907j188n2M40K44k97m87K6Q10J267J558K315L524M303M073L401
$$ plain form
62286 496076 499270 502742 506237 509191 511616 514193 517566 521721 526016 529648 532213 533984 535717 538095
62272 538095 541441 545915 551781 559314 568609 579685 592621 607336 623389 640372 658562 678931
62260 678931 702377 729053 758486 790142 823819 859640 897689 937507 977896 1017443 1055294
62249 1055294 1091157 1124442 1153772 1177712 1195864 1208811 1217017 1220138 1217464 1208653 1193889 1173677
62237 1173677 1148778 1120138 1088533 1054408 1018354 981587 945496 910634 876550 842790 809768
62226 809768 778451 749474 722903 698620 676508 656262 637457 619916 603734 588840 574861
62215 574861 561600 549406 538760 529645 521625 514523 508652 504225 500782 497483 494050 491205 489974
62202 489974 490569 492151 493745 495226 497174 499982 503447 507267 511482 516181 520998 525264 528670 531645
$$ packed form
62286D96076L194L472L495K954K425K577L373M155M295L632K565J771J733K378
62272E38095L346M474N866P533R295J1076J2936J4715J6053J6983J8190K0369
62260F78931K3446K6676K9433L1656L3677L5821L8049L9818M0389L9547L7851
62249A055294L5863L3285K9330K3940J8152J2947Q206L121k674q811j4764k0212
62237A173677k4899k8640l1605l4125l6054l6767l6091l4862l4084l3760l3022
62226H09768l1317k8977k6571k4283k2112k0246j8805j7541j6182j4894j3979
62215E74861j3261j2194j0646r115q020p102n871m427l443l299l433k845j231
62202D89974N95J582J594J481J948K808L465L820M215M699M817M266L406K975
$$ plain form
62188 531645 535077 539678 545473 551778 557771 563254 568832 575253 582656 590552 598418 606159 614102 622626
62174 622626 631803 641344 651101 661642 674005 688689 705182 722798 741690 762660 786134 811759
62162 811759 838835 866591 894089 920425 945180 968183 988696 1005348 1017127 1023990 1026237 1023766
62150 1023766 1016422 1004751 989875 972737 953860 933684 912649 890970 868785 846635 825424
62139 825424 805771 787643 770769 755183 741239 729293 719567 712158 706912 703298 700593 698327 696524
62126 696524 695521 695566 696656 698668 701573 705452 710317 715949 721893 727723 733421 739441 746153 753150 759422
62111 759422 764370 768370 772014 775120 777021 777630 777579 777278 776525 775270 774138 773788 774217 775102 776417 778272
62095 778272 780516 783002 785938 789504 793420 797495 802299 808591 816162 823994 831517 839018 846744 854452
$$ packed form
62188E31645L432M601N795O305N993N483N578O421P403P896P866P741P943Q524
62174F22626R177R541R757J0541J2363J4684J6493J7616J8892K0970K3474K5625
62162H11759K7076K7756K7498K6336K4755K3003K0513J6652J1779O863K247k471
62150A023766p344j1671j4876j7138j8877k0176k1035k1679k2185k2150k1211
62139H25424j9653j8128j6874j5586j3944j1946r726p409n246l614k705k266j803
62126F96524j003M5J090K012K905L879M865N632N944N830N698O020O712O997O272
62111G59422M948M000L644L106J901O09n1l01p53j255j132l50M29Q85J315J855
62095G78272K244K486K936L566L916M075M804O292P571P832P523P501P726P708
$$ plain form
62081 854452 862128 870401 879767 889972 900637 911983 924329 937271 950096 962900 976603 991762
62069 991762 1007894 1024130 1040116 1056070 1072277 1088807 1105530 1122120 1138122 1153175 1167144
62058 1167144 1179842 1190707 1198951 1204115 1206268 1205566 1201754 1194365 1183331 1169109 1152103 1132232 1109244
62045 1109244 1083302 1055072 1025355 994843 964012 933031 901920 871109 841627 814269 788615
62034 788615 763455 738330 714205 692412 673312 656311 640745 626320 612896 600374 588754
62023 588754 578052 568216 559367 551954 546329 542149 538532 534802 530858 526930 523272 520158 517762 515926
62009 515926 514267 512671 511487 511101 511524 512560 514193 516563 519668 523252 526967 530475 533464 535787 537632
61994 537632 539330 540847 541589 540905 538790 535937 533075 530341 527279 523282 517942 511210 503485 495524 488026
$$ packed form
62081H54452P676Q273R366J0205J0665J1346J2346J2942J2825J2804J3703J5159
62069I91762J6132J6236J5986J5954J6207J6530J6723J6590J6002J5053J3969
62058A167144J2698J0865Q244N164K153p02l812p389j1034j4222j7006j9871k2988
62045A109244k5942k8230k9717l0512l0831l0981l1111l0811k9482k7358k5654
62034G88615k5160k5125k4125k1793j9100j7001j5566j4425j3424j2522j1620
62023E88754j0702r836q849p413n625m180l617l730l944l928l658l114k396j836
62009E15926j659j596j184l86M23J036J633K370L105L584L715L508K989K323J845
61994E37632J698J517P42o84k115k853k862k734l062l997n340o732p725p961p498
$$ plain form
61979 488026 481239 475028 469291 464103 459522 455449 451751 448382 445357 442827 441156 440630 440997 441528 441692
61964 441692 441571 441520 441725 442268 443264 444605 445782 446313 446211 445803 445338 445168 446019 448443 451916 455082 457187
61947 457187 458948 461758 466333 472338 479049 485970 492872 499661 506426 513557 521560 530531 539764 548134
61933 548134 555064 560987 566711 572500 578057 583120 587561 590923 592558 592401 591119 589242 586635 583165
61919 583165 579393 576079 573338 570901 568999 568304 568985 570444 572154 574290 577293 581198 585701 590660 596191
61904 596191 602286 608502 614053 618270 621092 623056 624648 625692 625634 624346 622257 619612 616110 611603 606802
61889 606802 602722 599482 596153 591929 587082 582499 578480 574328 569171 562933 556348 550147 544352 538311
61875 538311 531313 523201 514687 507093 501502 497922 495445 493470 492523 493546 496586 500762 505503 511208
$$ packed form
61979D88026o787o211n737n188m581m073l698l369l025k530j671n26L67N31J64
61964D41692j21n1K05N43R96J341J177N31j02m08m65j70Q51K424L473L166K105
61947D57187J761K810M575O005O711O921O902O789O765P131Q003Q971R233Q370
61933E48134O930N923N724N789N557N063M441L362J635j57j282j877k607l470
61919E83165l772l314k741k437j902o95O81J459J710K136L003L905M503M959N531
61904E96191O095O216N551M217K822J964J592J044n8j288k089k645l502m507m801
61889F06802m080l240l329m224m847m583m019m152n157o238o585o201n795o041
61875E38311o998q112q514p594n591l580k477j975r47J023L040M176M741N705
$$ plain form
61861 511208 518387 526753 535576 544632 554287 564850 576314 588655 601961 616249 631418 647275
61849 647275 663309 678630 692623 705645 718558 731488 743498 753629 761725 768015 772387 774567
61837 774567 774712 773298 770526 766290 760750 754627 748775 743646 739216 735342 732149 730117 729713 730885 732973
61822 732973 735114 736612 736966 735894 733527 730260 726107 720433 712645 702897 691743 679337 665583 651017
61808 651017 636834 623803 611605 599526 587337 575161 562980 550814 539168 528701 519502 511106
61796 511106 503252 496098 489665 483588 477690 472379 468116 464765 461876 459347 457378 455858 454294 452449
61782 452449 450688 449560 449284 449726 450532 451169 451213 450925 451231 452806 455383 458262 461230 464576 468430 472744
61766 472744 477839 484296 492069 500284 508210 516046 524480 533858 544087 554883 565629 575270 582988
$$ packed form
61861E11208P179Q366Q823R056R655J0563J1464J2341J3306J4288J5169J5857
61849F47275J6034J5321J3993J3022J2913J2930J2010J0131Q096O290M372K180
61837G74567J45j414k772m236n540o123n852n129m430l874l193k032m04J172K088
61822G32973K141J498L54j072k367l267m153n674p788r748j1154j2406j3754j4566
61808F51017j4183j3031j2198j2079j2189j2176j2181j2166j1646j0467r199q396
61796E11106p854p154o433o077n898n311m263l351k889k529j969j520j564j845
61782D52449j761j128k76M42Q06O37M4k88L06J575K577K879K968L346L854M314
61766D72744N095O457P773Q215P926P836Q434R378J0229J0796J0746R641P718
$$ plain form
61753 582988 588935 593902 598291 601728 603614 603619 601686 597950 592791 586654 579749 572152 564189 556429 549231
61738 549231 542550 536209 530136 524298 518716 513605 509286 505901 503411 501844 501226 501244 501343 501330 501598 502541
61722 502541 503996 505459 506705 507908 509210 510374 510965 510913 510839 511599 513322 515115 515976 515851 515413 514953 514076
61705 514076 512513 510612 508707 506525 503624 500162 496838 494275 492697 491966 491593 490902 489512 487556 485243
61690 485243 482388 478709 474440 470275 466736 463803 461152 458593 456296 454647 453749 453064 451854 450122 448712
61675 448712 448209 448131 447601 446511 445512 445093 445293 446177 447940 450385 452822 454694 455946 456687 456936 456922 457229
61658 457229 458267 459767 461075 461888 462473 463208 464095 464795 465135 465464 466370 467973 469698 470894 471471 471690 471564
61641 471564 470958 470163 469795 469917 469736 468530 466581 464789 463549 462412 460901 459278 458252 458013 457790 456512
$$ packed form
61753E82988N947M967M389L437J886Nj933l736n159o137o905p597p963p760p198
61738E49231o681o341o073n838n582n111m319l385k490j567o18J8R9j3K68R43
61722E02541J455J463J246J203J302J164N91n2p4P60J723J793Q61j25m38m60q77
61705E14076j563j901j905k182k901l462l324k563j578p31l73o91j390j956k313
61690D85243k855l679m269m165l539k933k651k559k297j649q98o85j210j732j410
61675D48712n03p8n30j090r99m19K00Q84J763K445K437J872J252P41K49j4L07
61658D57229J038J500J308Q13N85P35Q87P00L40L29R06J603J725J196N77K19j26
61641D71564o06p95l68J22j81j206j949j792j240j137j511j623j026k39k23j278
$$ plain form
61625 456512 453870 450581 447612 445307 443347 441312 439005 436360 433378 430253 427333 424841 422705 420698
61611 420698 418570 416046 412863 408945 404512 400018 395999 392834 390418 388106 385139 381220 376648 371993
61597 371993 367757 364197 361258 358658 356149 353646 351020 347971 344314 340262 336179 332201 328294 324511
61583 324511 320896 317361 314004 311293 309451 307883 305803 303340 301406 300448 300075 299986 300442 301445 302177 301885
61567 301885 300853 299939 299501 299345 299438 299988 300898 301757 302498 303610 305517 307944 310011 310899 310435 309180 307947
61550 307947 307184 306873 306954 307549 308693 310099 311413 312517 313482 314434 315512 316646 317309 316899 315644 314669 314804
61533 314804 315689 316457 316936 317609 318600 319328 319167 317986 316017 313615 311185 309006 307065 305279 303845 303084
61517 303084 303002 303286 303649 303938 304054 304084 304323 304800 304926 304142 302847 302225 303095 305334 308358 311604 314477 316454
$$ packed form
61625D56512k642l289k969k305j960k035k307k645k982l125k920k492k136k007
61611D20698k128k524l183l918m433m494m019l165k416k312k967l919m572m655
61597C71993m236l560k939k600k509k503k626l049l657m052m083l978l907l783
61583C24511l615l535l357k711j842j568k080k463j934r58l73q9M56J003P32k92
61567C01885j032r14m38j56R3N50R10Q59P41J112J907K427K067Q88m64j255j233
61550C07947p63l11Q1N95J144J406J314J104R65R52J078J134O63m10j255r75J35
61533C14804Q85P68M79O73R91P28j61j181j969k402k430k179j941j786j434p61
61517C03084q2K84L63K89J16L0K39M77J26p84j295o22Q70K239L024L246K873J977
$$ plain form
61499 316454 317545 318296 319118 319986 320912 322280 324348 326775 329002 330894 332717 334596 336273 337401 337906
61484 337906 338109 338492 339233 340008 340418 340564 340926 341708 342633 343379 343870 344127 344243 344571 345417 346414 346692 345961 344932
61465 344932 344384 344278 344210 344206 344396 344328 343424 342113 341794 343396 346391 349417 351505 352559 352963 353070 353041 353026 353377
61446 353377 354493 356337 358236 359426 359802 360001 360780 362439 364707 366932 368464 369150 369520 370349 372024 374389
61430 374389 377091 379848 382513 385087 387584 389692 390746 390424 389419 389020 389981 392052 394539 396904 398768
61415 398768 399854 400196 400162 400045 399835 399489 399120 398703 397929 396585 394827 392814 390388 387458 384493 382171
61399 382171 380621 379408 378212 377099 376063 374835 373385 372293 372251 373274 374671 375789 376587 377452 378646
61384 378646 380082 381590 383233 385249 387724 390512 393495 396692 399987 402950 405264 407240 409514 412140
$$ packed form
61499C16454J091P51Q22Q68R26J368K068K427K227J892J823J879J677J128N05
61484C37906K03L83P41P75M10J46L62P82R25P46M91K57J16L28Q46R97K78p31j029
61465C44932n48j06o8mJ90o8r04j311l19J602K995L026K088J054M04J07k9j5L51
61446C53377J116J844J899J190L76J99P79J659K268K225J532O86L70Q29J675K365
61430C74389K702K757K665K574K497K108J054l22j005l99R61K071K487K365J864
61415C98768J086L42l4j17k10l46l69m17p74j344j758k013k426k930k965k322
61399C82171j550j213j196j113j036j228j450j092m2J023J397J118P98Q65J194
61384C78646J436J508J643K016K475K788K983L197L295K963K314J976K274K626
$$ plain form
61370 412140 414391 415709 416529 417794 419776 421841 423319 424185 424716 424979 425040 425422 426798 429137 431545 433213
61354 433213 434370 436046 438978 442947 447162 451057 454686 458539 463160 468768 474952 480760 485364 488725
61340 488725 491459 493992 496114 497567 498675 499974 501320 501957 501567 500757 500237 499965 499562 499168 499274 499868
61324 499868 500437 500886 501789 503527 505736 507990 510498 513632 517198 520815 524783 529820 536005 542632 549280
61309 549280 556369 564330 572814 581183 589361 597683 606083 613991 620920 626720 631272 634385 636137 636876
61295 636876 636716 635295 632211 627444 621200 613600 604735 594901 584554 574173 564291 555444 547815 541075
61281 541075 534848 529260 524726 521283 518491 516013 513958 512588 512045 512540 514416 517699 521781 525890 529787
61266 529787 533785 538227 543279 549098 555772 562972 570054 576716 583334 590390 597714 604553 610358 615250
$$ packed form
61370D12140K251J318Q20J265J982K065J478Q66N31K63O1L82J376K339K408J668
61354D33213J157J676K932L969M215L895L629L853M621N608O184N808M604L361
61340D88725K734K533K122J453J108J299J346O37l90q10n20k72m03l94J06N94
61324D99868N69M49R03J738K209K254K508L134L566L617L968N037O185O627O648
61309E49280P089P961Q484Q369Q178Q322Q400P908O929N800M552L113J752P39
61295F36876j60j421l084m767o244p600q865r834j0347j0381r882q847p629o740
61281E41075o227n588m534l443k792k478k055j370n43M95J876L283M082M109L897
61266E29787L998M442N052N819O674P200P082O662O618P056P324O839N805M892
$$ plain form
61252 615250 619607 623319 625673 626127 625124 623893 623293 623013 622157 620478 618619 617159 615893 614283 612217
61237 612217 609958 607686 605600 604249 604141 604959 605709 605870 606011 607054 609285 612415 616262 620902 626275
61222 626275 632092 638144 644372 650561 656327 661515 666386 671221 675950 680361 684538 688827 693374 697882
61208 697882 701877 705163 707968 710740 713796 717158 720659 724190 727876 732082 737301 743939 752049 761133
61194 761133 770336 778971 786985 794927 803419 812533 821523 829151 834435 837217 837980 837093 834417 829740 823363
61179 823363 815955 807865 798887 788846 778157 767584 757500 747567 737088 725585 713081 700074
61167 700074 687287 675285 664197 653764 643677 633859 624431 615476 606901 598552 590483 583073 576817
61154 576817 571931 568270 565640 564061 563548 563787 564292 564866 565612 566392 566631 565899 564422 562682 560684 558049
$$ packed form
61252F15250M357L712K354M54j003j231o00k80q56j679j859j460j266j610k066
61237F12217k259k272k086j351j08Q18P50J61J41J043K231L130L847M640N373
61222F26275N817O052O228O189N766N188M871M835M729M411M177M289M547M508
61208F97882L995L286K805K772L056L362L501L531L686M206N219O638Q110R084
61194G61133R203Q635Q014P942Q492R114Q990P628N284K782P63q87k676m677o377
61179H23363p408q090q978j0041j0689j0573j0084r933j0479j1503j2504j3007
61167G00074j2787j2002j1088j0433j0087r818r428q955q575q349q069p410o256
61154E76817m886l661k630j579n13K39N05N74P46P80K39p32j477j740j998k635
$$ plain form
61138 558049 554801 551549 548745 546199 543719 541921 541934 544356 548824 554604 561203 568368 575944 584072 593366
61123 593366 604567 617987 633337 650014 667421 685198 703376 722278 742043 762232 782063
61112 782063 801036 819131 836405 852663 867700 881581 894345 905505 914178 919891 923049 924414
61100 924414 924185 921787 916543 908381 897807 885276 870803 854199 835634 815808 795498 775016
61088 775016 754194 732888 711358 690096 669493 649907 631898 615986 602047 589244 576796
61077 576796 564662 553336 543257 534661 527741 522504 518552 515410 513018 511540 510791 510389 510439 511404 513135
61062 513135 514754 515931 517592 520796 525437 530778 536821 544229 553079 562708 572893 584322 597568
61049 597568 612352 628156 644943 662817 681476 700473 719656 739020 758537 778503 799544
$$ packed form
61138E58049l248l252k804k546k480j798J3K422M468N780O599P165P576Q128R294
61123E93366J1201J3420J5350J6677J7407J7777J8178J8902J9765K0189J9831
61112G82063J8973J8095J7274J6258J5037J3881J2764J1160Q673N713L158J365
61100I24414k29k398n244q162j0574j2531j4473j6604j8565j9826k0310k0482
61088G75016k0822k1306k1530k1262k0603j9586j8009j5912j3939j2803j2448
61077E76796j2134j1326j0079q596o920n237l952l142k392j478p49m02N0R65J731
61062E13135J619J177J661L204M641N341O043P408Q850R629J0185J1429J3246
61049E97568J4784J5804J6787J7874J8659J8997J9183J9364J9517J9966K1041
$$ plain form
61038 799544 821772 844330 866370 888160 910628 934091 958154 982715 1008288 1035242 1063391
61027 1063391 1092566 1122998 1154896 1188103 1222569 1258893 1298101 1341028 1388119 1439781 1497052
61016 1497052 1562216 1638871 1731087 1842326 1975160 2131784 2314311 2524662 2764950 3038602
61006 3038602 3350974 3708637 4118232 4586145 5118656 5721300 6397101 7144987 7960114
60997 7960114 8836466 9769450 10754418 11779404 12816665 13821528 14742528 15536624 16178466
60988 16178466 16658755 16977262 17139422 17158392 17055898 16855333 16569913 16196338 15720749
60979 15720749 15131622 14427729 13615932 12705427 11707775 10643307 9545875 8459404 7427789
60970 7427789 6484865 5649586 4926973 4312334 3795790 3365376 3008644 2713565 2469268
$$ packed form
61038G99544K2228K2558K2040K1790K2468K3463K4063K4561K5573K6954K8149
61027A063391K9175L0432L1898L3207L4466L6324L9208M2927M7091N1662N7271
61016A497052O5164P6655R2216J11239J32834J56624J82527K10351K40288K73652
61006C038602L12372L57663M09595M67913N32511O02644O75801P47886Q15127
60997G960114Q76352R32984R84968J024986J037261J004863R21000P94096O41842
60988A6178466M80289L18507J62160J8970j02494k00565k85420l73575m75589
60979A5720749n89127p03893q11797r10505r97652j064468j097432j086471j031615
60970G427789r42924q35279p22613o14639n16544m30414l56732k95079k44297
$$ plain form
60961 2469268 2266463 2097456 1955937 1836618 1734892 1646817 1569608 1501875 1442962 1391837
60951 1391837 1346888 1306852 1271539 1241305 1215881 1193941 1173860 1154788 1137030 1121430 1108340
60940 1108340 1097162 1086963 1077457 1069271 1063277 1059923 1059236 1061189 1065838 1073268 1083607 1096953 1113062
60927 1113062 1131227 1150774 1171669 1194337 1218739 1243899 1268535 1291928 1313840 1333707 1350374
60916 1350374 1362840 1370882 1374682 1374060 1368512 1357853 1342336 1322138 1297355 1268753 1237948 1206316
60904 1206316 1174008 1140557 1106182 1071869 1038361 1005852 974747 945936 919872 895979 873479
60893 873479 852302 832677 814205 796141 778480 762025 747245 733634 720420 707410 694840
60882 694840 682821 671323 660461 650316 640554 630642 620520 610802 602131 594495 587252 579765 571907
$$ packed form
60961B469268k02805j69007j41519j19319j01726q8075p7209o7733n8913n1125
60951A391837m4949m0036l5313l0234k5424k1940k0081j9072j7758j5600j3090
60940A108340j1178j0199r506q186n994l354o87J953M649P430J0339J3346J6109
60927A113062J8165J9547K0895K2668K4402K5160K4636K3393K1912J9867J6667
60916A350374J2466Q042L800o22n548j0659j5517k0198k4783k8602l0805l1632
60904A206316l2308l3451l4375l4313l3508l2509l1105k8811k6064k3893k2500
60893H73479k1177j9625j8472j8064j7661j6455j4780j3611j3214j3010j2570
60882F94840j2019j1498j0862j0145r762r912j0122r718q671p636p243p487p858
$$ plain form
60869 571907 564058 556719 550114 544068 538213 532312 526392 520634 515208 510280 506096 502889 500569 498576
60855 498576 496189 493112 489703 486567 483904 481287 478075 474010 469463 465141 461594 458918 456934 455522
60841 455522 454687 454214 453429 451506 448119 443778 439484 436059 433674 431872 430043 427998 426110 424873 424359
60826 424359 424318 424752 426054 428392 431261 433978 436576 439785 444122 449254 454329 458606 461612 463061 463065 462298
60810 462298 461574 461151 460614 459474 457687 455545 453266 450860 448270 445546 442877 440473 438277 435805 432502
60795 432502 428379 424151 420528 417483 414428 410969 407213 403370 399406 395246 390952 386443 381283 375265
60781 375265 369161 364394 361588 359736 357148 353212 348893 345520 343486 342322 341681 341722 342600 344070 345858
60766 345858 348149 351376 355598 360369 365209 369947 374513 378696 382309 385517 388750 392281 396016 399723
$$ packed form
60869E71907p849p339o605o046n855n901n920n758n426m928m184l207k320j993
60855D98576k387l077l409l136k663k617l212m065m547m322l547k676j984j412
60841D55522q35m73p85j923l387m341m294l425k385j802j829k045j888j237n14
60826D24359m1M34J302K338K869K717K598L209M337N132N075M277L006J449Mp67
60810D62298p24m23n37j140j787k142k279k406k590k724k669k404k196k472l303
60795D32502m123m228l623l045l055l459l756l843l964m160m294m509n160o018
60781C75265o104m767k806j852k588l936m319l373k034j164o41M1Q78J470J788
60766C45858K291L227M222M771M840M738M566M183L613L208L233L531L735L707
$$ plain form
60752 399723 403321 406888 410424 413686 416247 417806 418500 418826 419069 418852 417528 415047 412132 409360 406339
60737 406339 402135 396353 389451 382088 374659 367483 360929 355013 349296 343535 338253 334247 331649 329846
60723 329846 328200 326498 324699 322716 320611 318678 317113 315818 314699 313979 313914 314320 314593 314314 313728 313517
60707 313517 314054 314944 315448 315402 315463 316279 317646 318801 319439 319984 320855 321927 322919 323916 325253 327126 329611
60690 329611 332785 336562 340590 344651 348985 353908 359233 364395 369102 373582 378252 383429 389267 395591
60676 395591 401766 407128 411641 415858 420078 423841 426459 427829 428478 428905 429075 428536 426895 424188 420823
60661 420823 417162 413188 408660 403581 398351 393464 389173 385508 382441 379932 377890 376152 374459 372492
60647 372492 370058 367335 364848 363122 362358 362338 362500 362181 361030 359274 357409 355568 353423 350770 347932
$$ packed form
60752C99723L598L567L536L262K561J559O94L26K43k17j324k481k915k772l021
60737D06339m204n782o902p363p429p176o554n916n717n761n282m006k598j803
60723C29846j646j702j799j983k105j933j565j295j119p20o5M06K73k79n86k11
60707C13517N37Q90N04m6O1Q16J367J155O38N45Q71J072R92R97J337J873K485
60690C29611L174L777M028M061M334M923N325N162M707M480M670N177N838O324
60676C95591O175N362M513M217M220L763K618J370O49M27J70n39j641k707l365
60661D20823l661l974m528n079n230m887m291l665l067k509k042j738j693j967
60647C72492k434k723k487j726p64k0J62l19j151j756j865j841k145k653k838
$$ plain form
60632 347932 345376 343197 341284 339825 339249 339680 340777 342204 343925 345869 347592 348602 348924 349062 349371
60617 349371 349689 349642 349130 348381 347665 347095 346663 346372 346369 346909 348044 349275 349777 349197 348097 347347 347213 347338 347510
60598 347510 347935 348716 349553 350206 350771 351200 351045 350225 349621 350201 351685 352821 353016 352973 353499 354438 355214 355883
60580 355883 356950 358428 359711 360418 360858 361571 362806 364609 367128 370544 374745 379261 383548 387401 391139
60565 391139 395388 400581 406517 412389 417296 420862 423450 425790 428383 431262 434216 436978 439054 439730
60551 439730 438720 436861 435733 436399 438747 442154 446400 451694 458070 465149 472437 479621 486646 493728
60537 493728 501222 509235 517379 525040 531817 537558 542102 545250 546972 547413 546670 544688 541380 536748 531014
60522 531014 524713 518585 513171 508592 504839 502118 500672 500413 501000 502163 503726 505496 507484 510195 514313
$$ packed form
60632C47932k556k179j913j459n76M31J097J427J721J944J723J010L22J38L09
60617C49371L18m7n12p49p16n70m32k91lN40J135J231N02n80j100p50j34J25J72
60598C47510M25P81Q37O53N65M29j55q20o04N80J484J136J95m3N26R39P76O69
60580C55883J067J478J283P07M40P13J235J803K519L416M201M516M287L853L738
60565C91139M249N193N936N872M907L566K588K340K593K879K954K762K076O76
60551D39730j010j859j128O66K348L407M246N294O376P079P288P184P025P082
60537D93728P494Q013Q144P661O777N741M544L148J722M41p43j982l308m632n734
60522E31014o301o128n414m579l753k721j446k59N87J163J563J770J988K711M118
$$ plain form
60507 514313 520084 527322 535951 546089 557614 570114 583478 598156 614673 633223 653858 676587
60495 676587 700929 725716 749688 772139 792797 811438 827890 841991 853144 860212 862372 859757
60483 859757 852765 841055 824039 802245 777313 750487 721938 691954 661971 633721 607850 584094
60471 584094 562499 543614 527498 513369 500490 488867 478706 469642 460994 452571 444770 437865
60459 437865 431584 425483 419481 413914 409164 405359 402242 399207 395593 391232 386784 383339 381472 380705
60445 380705 379983 378658 376897 375176 373643 372138 370629 369345 368412 367631 366763 365871 365170 364649 364135 363723
60429 363723 363826 364577 365458 365814 365658 365604 366017 366615 367065 367571 368541 369925 371221 372069 372492 372622 372569 372545 372830
60410 372830 373555 374802 376843 379858 383332 386269 388275 390020 392273 394826 396790 397687 397812 397690 397753 398480
$$ packed form
60507E14313N771P238Q629J0138J1525J2500J3364J4678J6517J8550K0635K2729
60495F76587K4342K4787K3972K2451K0658J8641J6452J4101J1153P068K160k615
60483H59757o992j1710j7016k1794k4932k6826k8549k9984k9983k8250k5871k3756
60471E84094k1595j8885j6116j4129j2879j1623j0161r064q648q423p801o905
60459D37865o281o101o002n567m750l805l117l035l614m361m448l445j867p67
60445C80705p22j325j761j721j533j505j509j284r33p81q68q92p01n21n14m12
60429C63723J03P51Q81L56j56n4M13N98M50N06R70J384J296Q48M23J30n3k4K85
60410C72830P25J247K041L015L474K937K006J745K253K553J964Q97J25j22O3P27
$$ plain form
60394 398480 400246 402836 405481 407600 409325 411202 413628 416604 419802 422752 425165 427184 429213 431504
60380 431504 434045 436716 439314 441559 443418 445347 447786 450494 452789 454449 455828 457065 457836 458140 458682
60365 458682 460111 462333 464975 468096 471931 476303 480771 485142 489440 493734 498376 504086 511235 519259
60351 519259 527268 535021 542809 550695 558466 566071 573401 579713 584030 586150 586679 586034 584011 580404 575437
60336 575437 569435 562592 555162 547359 539048 530137 521354 513916 508185 503271 498271 493351 489274 486405
60322 486405 484545 483207 481753 479791 477833 477096 478243 480796 484111 488307 493701 499895 506218 512733
60308 512733 520074 528486 537626 547170 556994 566820 576196 584816 592462 598774 603484 606696 608518 608598 606494
60293 606494 602288 596304 588494 578742 567688 556541 546059 536277 527222 519248 512606 507190 502804
$$ packed form
60394C98480J766K590K645K119J725J877K426K976L198K950K413K019K029K291
60380D31504K541K671K598K245J859J929K439K708K295J660J379J237P71L04N42
60365D58682J429K222K642L121L835M372M468M371M298M294M642N710P149Q024
60351E19259Q009P753P788P886P771P605P330O312M317K120N29o45k023l607m967
60336E75437o002o843p430p803q311q911q783p438n731m914n000m920m077k869
60322D86405j860j338j454j962j958p37J147K553L315M196N394O194O323O515
60308E12733P341Q412R140R544R824R826R376Q620P646O312M710L212J822Q0k104
60293F06494m206n984p810r752j1054j1147j0482r782r055p974o642n416m386
$$ plain form
60280 502804 499120 495425 491058 486245 481802 477858 473560 468371 462957 458330 454583 451023 447215 443416
60266 443416 440172 437865 436480 435516 434344 432851 431508 430630 429899 428894 427754 426975 426803 427214 428169 429523
60250 429523 430844 431690 431963 431750 431077 430140 429527 429668 430224 430467 430152 429601 429010 428327 427935 428836 431700 435910
60232 435910 439956 442769 444527 446188 448431 451160 453977 456917 460450 464845 469862 475153 480622 486143
60218 486143 491337 496096 501057 507051 514162 521821 529719 537983 546398 554205 561115 567945 575673 584120
60204 584120 592124 598846 604392 609209 613417 616912 619688 621823 623353 624361 625010 625261 624680 622723 619217
60189 619217 614497 609112 603521 597980 592611 587520 582783 578289 573644 568500 563034 557874 553381 549250
60175 549250 545062 541017 537685 535055 532337 528893 525013 521494 518704 516366 514111 511881 509831 508125
$$ packed form
60280E02804l684l695m367m813m443l944m298n189n414m627l747l560l808l799
60266D43416l244k307j385r64j172j493j343q78p31j005j140p79j72M11R55J354
60250D29523J321Q46K73k13o73r37o13J41N56K43l15n51n91o83l92R01K864M210
60232D35910M046K813J758J661K243K729K817K940L533M395N017N291N469N521
60218D86143N194M759M961N994P111P659P898Q264Q415P807O910O830P728Q447
60204E84120Q004O722N546M817M208L495K776K135J530J008O49K51n81j957l506
60189F19217m720n385n591n541n369n091m737m494m645n144n466n160m493m131
60175E49250m188m045l332k630k718l444l880l519k790k338k255k230k050j706
$$ plain form
60161 508125 506880 506081 505487 504787 503940 503232 502998 503412 504547 506389 508733 511199 513489 515527 517333 518933
60145 518933 520506 522423 524976 528165 531873 536072 540654 545203 549328 553225 557565 562626 567876 572711
60131 572711 577363 582633 588751 594979 600458 605063 609158 612947 616465 619990 623881 628022 631893 635284
60117 635284 638539 641963 645345 648302 650803 653074 655216 657145 658709 659645 659614 658533 656745 654666 652391
60102 652391 649806 646872 643543 639655 635217 630666 626493 622738 619152 615760 612898 610733 608985 607123
60088 607123 604597 601053 596667 592235 588585 585856 583544 581147 578558 575934 573478 571174 568540 564908
60074 564908 560297 555707 551980 548678 544709 539829 534695 529619 524303 518955 514522 511328 508319 504394
60060 504394 499848 495925 493415 492316 492318 492884 493220 492925 492540 492887 494053 495523 497057 498820 500920 503456
$$ packed form
60161E08125j245p99n94p00q47p08k34M14J135J842K344K466K290K038J806J600
60145E18933J573J917K553L189L708M199M582M549M125L897M340N061N250M835
60131E72711M652N270O118O228N479M605M095L789L518L525L891M141L871L391
60117F35284L255L424L382K957K501K271K142J929J564R36l1j081j788k079k275
60102F52391k585k934l329l888m438m551m173l755l586l392k862k165j748j862
60088F07123k526l544m386m432l650k729k312k397k589k624k456k304k634l632
60074E64908m611m590l727l302l969m880n134n076n316n348m433l194l009l925
60060E04394m546l923k510j099KN66L36k95l85L47J166J470J534J763K100K536
$$ plain form
60044 503456 506857 511429 516650 521608 526081 530531 535041 539083 542468 545614 548529 550269 549976 547928
60030 547928 545021 541660 537759 533480 529259 525143 520742 515940 511114 506528 501976 497287 492829 489142
60016 489142 486223 483540 480644 477441 473871 469772 465267 460920 457132 453575 449675 445607 442328 440466
60002 440466 439571 438667 437269 435618 434201 433389 433410 434360 436244 439123 443070 447816 452619 456810 460376 463830
59986 463830 467559 471522 475412 478811 481237 482389 482452 482001 481506 480928 479695 477082 472834 467617 462671
59971 462671 458816 455929 453479 451257 449285 447394 445403 443620 442677 442845 443859 445382 447265 449366 451523
59956 451523 453731 456048 458284 460087 461378 462418 463499 464858 466797 469422 472257 474524 475880 476547
59942 476547 476755 476583 476373 476714 477728 478824 479418 479584 479811 480533 482088 484686 488081 491659 495199 499243
$$ packed form
60044E03456L401M572N221M958M473M450M510M042L385L146K915J740k93k048
60030E47928k907l361l901m279m221m116m401m802m826m586m552m689m458l687
60016D89142k919k683k896l203l570m099m505m347l788l557l900m068l279j862
60002D40466q95r04j398j651j417q12K1R50J884K879L947M746M803M191L566L454
59986D63830L729L963L890L399K426J152O3m51m95n78j233k613m248n217m946
59971D62671l855k887k450k222j972j891j991j783r43J68J014J523J883K101K157
59956D51523K208K317K236J803J291J040J081J359J939K625K835K267J356O67
59942D76547K08j72k10L41J014J096N94J66K27P22J555K598L395L578L540M044
$$ plain form
59926 499243 504361 510455 517182 524692 533333 542881 552650 562303 571970 581615 590862 599628 608261 616735
59912 616735 624133 629402 632464 634107 634853 634366 632118 628280 623647 618918 614369 610089 606078 602051 597612
59897 597612 592905 588772 585901 584122 582899 582261 582642 583931 585358 586506 587941 590527 594417 598943 603263
59882 603263 606943 610164 613522 617440 621732 625977 630205 634724 639230 642724 644638 645526 646182 646490 645655
59867 645655 643302 639876 636089 632424 629044 625786 622319 618584 614917 611488 607888 603735 599474 596080
59853 596080 594024 592983 592482 592272 592042 591340 590159 589278 589726 591921 595424 599359 602952 605748 607586 608522
59837 608522 608820 608837 608659 607960 606529 604848 603648 602852 601617 599649 597734 596465 595167 592935 590181 588109
59821 588109 586943 585816 584419 583593 584016 585289 586779 588459 590301 591595 591632 590631 589288 587699 585357
$$ packed form
59926D99243N118O094O727P510Q641R548R769R653R667R645R247Q766Q633Q474
59912F16735P398N269L062J643P46m87k248l838m633m729m549m280m011m027m439
59897E97612m707m133k871j779j223o38L81J289J427J148J435K586L890M526M320
59882F03263L680L221L358L918M292M245M228M519M506L494J914Q88O56L08q35
59867F45655k353l426l787l665l380l258l467l735l667l429l600m153m261l394
59853E96080k056j041n01k10k30p02j181q81M48K195L503L935L593K796J838R36
59837F08522K98J7j78o99j431j681j200p96j235j968j915j269j298k232k754k072
59821E88109j166j127j397q26M23J273J490J680J842J294L7j001j343j589k342
$$ plain form
59806 585357 581988 577870 573481 569291 565727 562849 560152 557134 553969 551217 548979 546758 544126 541121
59792 541121 537931 534600 531158 527795 524776 522282 520348 518801 517282 515532 513670 512132 511363 511594 512757
59777 512757 514480 516318 518139 520168 522569 525192 527878 530730 533836 537015 540187 543773 548329 553874
59763 553874 559926 566099 572225 577994 582960 587048 590680 594229 597615 600591 603225 605932 609075 612601
59749 612601 616039 618908 621134 622918 624177 624474 623728 622656 622064 621940 621627 620725 619364 617797 616269 615138
59733 615138 614485 613746 612436 611217 611405 613262 615575 617215 618303 619389 620294 620480 620047 619596 619450 619630
59717 619630 620327 621749 623646 625523 627209 628839 630573 632773 636039 640378 644679 647865 650517 654558
59703 654558 661186 669799 679008 687995 696599 704781 712508 719857 726840 733331 739332 745117 750936 756764
$$ packed form
59806E85357l369m118m389m190l564k878k697l018l165k752k238k221k632l005
59792E41121l190l331l442l363l019k494j934j547j519j750j862j538p69K31J163
59777E12757J723J838J821K029K401K623K686K852L106L179L172L586M556N545
59763E53874O052O173O126N769M966M088L632L549L386K976K634K707L143L526
59749F12601L438K869K226J784J259K97p46j072n92j24l13r02j361j567j528j131
59733F15138o53p39j310j219J88J857K313J640J088J086R05J86m33m51j46J80
59717F19630O97J422J897J877J686J630J734K200L266M339M301L186K652M041
59703F54558O628Q613R209Q987Q604Q182P727P349O983O491O001N785N819N828
$$ plain form
59689 756764 762327 767177 770817 773092 774373 775020 774802 773336 770928 768243 765196 761030 755653 750003 744640
59674 744640 738847 731832 724192 717379 712065 707805 704094 700987 698732 697459 697289 698325 700475 703593
59660 703593 707708 712831 718697 725042 731876 738999 745542 750624 754403 757794 761089 763483 764164 763258 761361
59645 761361 758563 754347 748234 740200 730598 719928 708656 697099 685467 673995 662941 652519
59633 652519 642977 634685 627851 622123 616694 610884 604517 597742 590694 583398 575856 568201 560852 554367
59619 554367 548895 543864 538495 532619 526718 521192 515990 511084 506967 504342 503333 503155 502661 501350 499907
59604 499907 499608 500988 503223 504997 505790 506048 506338 506827 507531 508463 509424 510042 510275 510524 511075 511638 511661 510892
59586 510892 509515 507928 506474 505219 503922 502368 500691 499149 497629 495714 493307 490808 488575 486500
$$ packed form
59689G56764N563M850L640K275J281O47k18j466k408k685l047m166n377n650n363
59674G44640n793p015p640o813n314m260l711l107k255j273j70J036K150L118
59660G03593M115N123N866O345O834P123O543N082L779L391L295K394O81r06j897
59645G61361k798m216o113q034r602j0670j1272j1557j1632j1472j1054j0422
59633F52519r542q292o834n728n429n810o367o775p048p296p542p655p349o485
59619E54367n472n031n369n876n901n526n202m906m117k625j009j78m94j311j443
59604D99907k99J380K235J774P93K58K90M89P04R32R61O18K33K49N51N63K3p69
59586E10892j377j587j454j255j297j554j677j542j520j915k407k499k233k075
$$ plain form
59572 486500 484230 481592 478768 476293 474791 474330 474082 473089 471399 469947 469273 468996 468693 468581 468920 469400
59556 469400 469672 469983 470718 471713 472634 473815 476028 479557 484044 489193 495085 501767 508996 516509 524256
59541 524256 532314 540769 549687 559096 569080 579867 591444 602933 612902 620732 627228 633315 638513
59528 638513 641418 641475 639451 636287 632373 628105 624261 621298 618819 616099 612771 608706 603685 597655 590996
59513 590996 584121 577020 569594 562226 555585 549905 544750 539498 533848 527952 522406 518081 515593 514674
59499 514674 514227 513238 511698 510527 510606 512018 514252 516933 520069 523635 527326 530983 534956 539666 544895
59484 544895 549905 554268 558214 562069 565728 568945 571846 574814 577988 581214 584455 587865 591328 594237
59470 594237 596040 596857 597245 597448 597230 596540 595902 595898 596597 597833 599766 602633 606166 609851 613754 618447 623954
$$ packed form
59572D86500k270k638k824k475j502m61k48r93j690j452o74k77l03j12L39M80
59556D69400K72L11P35R95R21J181K213L529M487N149N892O682P229P513P747
59541E24256Q058Q455Q918R409R984J0787J1577J1489R969P830O496O087N198
59528F38513K905N7k024l164l914m268l844k963k479k720l328m065n021o030o659
59513E90996o875p101p426p368o641n680n155n252n650n896n546m325k488r19
59499E14674m47r89j540j171P9J412K234K681L136L566L691L657L973M710N229
59484E44895N010M363L946L855L659L217K901K968L174L226L241L410L463K909
59470E94237J803Q17L88K03k18o90o38mO99J236J933K867L533L685L903M693N507
$$ plain form
59453 623954 629420 634126 638266 642352 646330 649771 652522 654607 655774 655687 654403 652125 648636 643506 636854
59438 636854 629513 622454 616323 611335 607205 603348 599495 595956 592921 589882 586338 582876 580849 581050
59424 581050 583295 587245 592938 600440 609610 620280 632080 644140 655630 666660 677951 689610
59412 689610 701077 712282 723685 734697 743206 747506 748021 746351 743309 738801 733037 726695 720129
59399 720129 713428 707276 702820 700414 699017 696947 692827 685951 676409 664995 652491 639000 624485
59386 624485 609836 596672 585916 577235 570069 564500 560715 558292 556680 556030 556889 559291 562664 566556
59372 566556 570861 575372 579698 583809 588266 593623 599944 607103 615244 624515 634503 644443 654126 664331
59358 664331 676127 689917 705332 721819 739082 756982 775381 794235 813676 833796 854357
$$ packed form
59453F23954N466M706M140M086L978L441K751K085J167q7j284k278l489n130o652
59438F36854p341p059o131m988m130l857l853l539l035l039l544l462k027K01
59424E81050K245L950N693P502R170J0670J1800J2060J1490J1030J1291J1659
59412F89610J1467J1205J1403J1012Q509M300N15j670l042m508n764o342o566
59399G20129o701o152m456k406j397k070m120o876r542j1414j2504j3491j4515
59386F24485j4649j3164j0756q681p166n569l785k423j612o50Q59K402L373L892
59372E66556M305M511M326M111M457N357O321P159Q141R271R988R940R683J0205
59358F64331J1796J3790J5415J6487J7263J7900J8399J8854J9441K0120K0561
$$ plain form
59347 854357 874817 894629 913539 931517 948420 963680 976436 986064 992593 996491 998026 996921
59335 996921 992639 985053 974850 963264 951252 938817 925207 909834 892894 875078 857003 839183
59323 839183 822248 806789 792955 780496 769132 758595 748537 738837 729989 722660 716791 711616
59311 711616 706720 702629 700137 699481 700404 702596 705742 709456 713639 718680 724923 732087 739489 746725 753819
59296 753819 760797 767384 772992 776865 778390 777537 774822 770674 765032 757844 749713 741665 734341 727691
59282 727691 721389 715328 709813 705528 703135 702656 703394 704693 706511 708978 711733 714290 716903 720420 725129
59267 725129 730207 734420 737000 737811 737143 735578 733645 731241 727555 721814 714072 705145 695909 686727 677453
59252 677453 667862 658092 648631 639845 631739 624397 618433 614506 612409 611127 609933 609002 608792 609231 609872
$$ packed form
59347H54357K0460J9812J8910J7978J6903J5260J2756R628O529L898J535j105
59335I96921m282p586j0203j1586j2012j2435j3610j5373j6940j7816j8075j7820
59323H39183j6935j5459j3834j2459j1364j0537j0058r700q848p329n869n175
59311G11616m896m091k492o56R23K192L146L714M183N041O243P164P402P236P094
59296G53819O978O587N608L873J525q53k715m148n642p188q131q048p324o650
59282G27691o302o061n515m285k393m79P38J299J818K467K755K557K613L517M709
59267G25129N078M213K580Q11o68j565j933k404l686n741p742q927r236r182r274
59252F77453r591r770r461q786q106p342n964l927k097j282j194r31k10M39O41
$$ plain form
59237 609872 610512 611239 611970 612339 612059 611097 609491 607247 604499 601576 598700 595651 591840 586905 581309 576231
59221 576231 572683 570635 569123 567214 564814 562587 561310 561356 562620 564729 567300 570067 572846 575530 578293
59206 578293 581638 585995 591258 596921 602687 608699 615203 622344 630323 639254 648599 657204 664424 670992
59192 670992 678264 686600 694993 702312 708429 713928 719135 723802 727505 729959 730997 730628 729260 727637
59178 727637 726362 725443 724388 722721 720458 718109 716247 715027 714150 713253 712286 711528 711419 712430 714876 718517
59162 718517 722384 725351 727025 727873 728392 728432 727571 725847 723744 721550 719197 716796 714808 713389 711924
59147 711924 709644 706620 703683 701312 699023 696086 692530 688992 685688 682055 677627 672839 668503 664677
59133 664677 660628 656015 651500 647817 644665 641100 636918 633071 630642 629848 630239 631493 633702 637043 641501
$$ packed form
59237F09872O40P27P31L69k80r62j606k244k748k923k876l049l811m935n596n078
59221E76231l548k048j512j909k400k227j277M6J264K109K571K767K779K684K763
59206E78293L345M357N263N663N766O012O504P141P979Q931R345Q605P220O568
59192F70992P272Q336Q393P319O117N499N207M667L703K454J038l69j368j623
59178G27637j275r19j055j667k263k349j862j220q77q97r67p58j09J011K446L641
59162G18517L867K967J674Q48N19M0q61j724k103k194k353k401j988j419j465
59147G11924k280l024k937k371k289k937l556l538l304l633m428m788m336l826
59133F64677m049m613m515l683l152l565m182l847k429p94L91J254K209L341M458
$$ plain form
59118 641501 646895 653002 659606 666501 673501 680543 687768 695304 702813 709465 714649 718595 721932 724691
59104 724691 726201 726007 724435 722052 718955 714942 710080 704771 699352 693934 688558 683347 678459 673926
59090 673926 669525 664921 660148 655789 652347 649516 646529 643161 639805 636503 632618 627788 622535 617451
59076 617451 612407 607138 602056 597732 593890 589713 584982 580248 575960 572121 568725 565840 563173 560198
59062 560198 556851 553548 550397 546970 543059 539121 535731 532993 530774 529080 527881 526829 525501 523826
59048 523826 522162 520998 520614 520829 521136 521280 521557 522302 523253 523904 524368 525266 526750 528287 529577 531114 533501
59031 533501 536742 540461 544328 547974 551069 553959 557772 563259 569823 576247 582162 588261 595209 602916
59017 602916 610771 617997 623727 627320 628908 629334 629362 629159 628618 627871 627302 627200 627620 628436 629465 630636 632145
$$ packed form
59118F41501N394O107O604O895P000P042P225P536P509O652N184L946L337K759
59104G24691J510j94j572k383l097m013m862n309n419n418n376n211m888m533
59090F73926m401m604m773m359l442k831k987l368l356l302l885m830n253n084
59076F17451n044n269n082m324l842m177m731m734m288l839l396k885k667k975
59062E60198l347l303l151l427l911l938l390k738k219j694j199j052j328j675
59048E23826j664j164l84K15L07J44K77P45R51O51M64Q98J484J537J290J537K387
59031E33501L241L719L867L646L095K890L813N487O564O424N915O099O948P707
59017F02916P855P226N730L593J588M26K8k03n41p47n69j02M20Q16J029J171J509
$$ plain form
59000 632145 634341 637370 640997 644829 648577 652014 654804 656597 657349 657452 657482 657876 658844 660434 662518 664729
58984 664729 666642 668174 669727 671888 675036 679260 684517 690693 697585 705024 713026 721697 730974 740633
58970 740633 750563 760915 771869 783251 794430 804659 813629 821628 829059 835780 841104 844458 845828
58957 845828 845464 843482 839850 834511 827303 818060 807086 795237 783161 770713 757470 743581 729684
58944 729684 716230 703440 691771 681765 673393 666062 659401 653559 648706 644738 641569 639223 637454
58931 637454 635717 633701 631540 629399 627246 625140 623305 621737 620132 618384 616809 615784 615518 616244 618072
58916 618072 620504 622607 623952 625001 626420 628507 631486 635732 641365 648047 655459 663539 672036 680478
58902 680478 688951 698341 709409 722190 736636 752986 770841 788665 805182 820815 836804 853316
$$ packed form
59000F32145K196L029L627L832L748L437K790J793P52J03L0L94R68J590K084K211
58984F64729J913J532J553K161L148M224N257O176O892P439Q002Q671R277R659
58970G40633R930J0352J0954J1382J1179J0229Q970P999P431O721N324L354J370
58957H45828l64j982l632n339p208r243j0974j1849j2076j2448j3243j3889j3897
58944G29684j3454j2790j1669j0006q372p331o661n842m853l968l169k346j769
58931F37454j737k016k161k141k153k106j835j568j605j748j575j025k66P26J828
58916F18072K432K103J345J049J419K087K979M246N633O682P412Q080Q497Q442
58902F80478Q473R390J1068J2781J4446J6350J7855J7824J6517J5633J5989J6512
$$ plain form
58890 853316 869435 884781 899974 915446 930810 945645 960013 973831 986398 996962 1005308 1011549
58878 1011549 1015724 1017789 1017579 1014664 1008690 1000097 990104 979754 969214 958100 946129 933389 920374
58865 920374 907873 896430 885791 875219 864422 853775 843574 833560 823450 813420 803810 794629
58853 794629 785652 776733 767808 758789 749629 740270 730482 720116 709552 699503 690168 681016 671591
58840 671591 662071 652725 643392 633965 624983 617159 610506 604473 598782 593577 588871 584450 580449 577509
58826 577509 576168 576418 577941 580431 583514 586789 590238 594365 599570 605525 611414 616701 621389 625631
58812 625631 629401 632633 635396 637706 639348 640100 640100 639825 639688 639791 640004 640048 639431 637613 634500 630694 627023
58795 627023 623859 621050 618482 616345 614779 613571 612518 611948 612563 614752 618300 622790 627937 633368 638451
$$ packed form
58890H53316J6119J5346J5193J5472J5364J4835J4368J3818J2567J0564Q346O241
58878A011549M175K065k10k915n974q593r993j0350j0540j1114j1971j2740j3015
58865I20374j2501j1443j0639j0572j0797j0647j0201j0014j0110j0030r610r181
58853G94629q977q919q925r019r160r359r788j0366j0564j0049r335r152r425
58840F71591r520r346r333r427q982p824o653o033n691n205m706m421m001k940
58826E77509j341K50J523K490L083L275L449M127N205N955N889N287M688M242
58812F25631L770L232K763K310J642P52%k75j37J03K13M4o17j818l113l806l671
58795F27023l164k809k568k137j566j208j053n70O15K189L548M490N147N431N083
$$ plain form
58780 638451 642761 646603 650630 654878 658563 660986 662196 662511 661756 659496 655810 651300 646292 640470 633420
58765 633420 625172 616082 606556 597065 588140 580078 572783 566066 559986 554831 550885 548262 546765 545889
58751 545889 545214 544834 545136 546145 547501 549144 551546 555075 559556 564710 570542 576990 583697 590576 598146
58736 598146 606649 615188 622449 628170 633247 638401 643389 647676 651265 654583 657838 660773 662952 664191
58722 664191 664807 665358 665994 666240 665682 664742 664430 665380 667384 669685 671434 672070 671733 671137 670556 669085 665492
58705 665492 659695 652716 645172 636620 626548 615195 602967 589844 576009 562485 550286 539180
58693 539180 528051 516488 505353 495631 487323 479741 472558 466147 460978 457023 453853 451149 448950
58680 448950 447403 446407 445663 445009 444578 444655 445450 446996 449130 451555 454133 457101 460858 465485 470679 476200
$$ packed form
58780F38451M310L842M027M248L685K423J210L15p55k260l686m510n008n822p050
58765F33420q248r090r526r491q925q062p295o717o080n155l946k623j497q76
58751E45889o75l80L02J009J356J643K402L529M481N154N832O448O707O879P570
58736E98146Q503Q539P261N721N077N154M988M287L589L318L255K935K179J239
58722F64191O16N51O36K46n58r40l12R50K004K301J749O36l37n96n81j471l593
58705F65492n797o979p544q552j0072j1353j2228j3123j3835j3524j2199j1106
58693E39180j1129j1563j1135r722q308p582p183o411n169l955l170k704k199
58680D48950j547r96p44o54m31P7P95J546K134K425K578K968L757M627N194N521
$$ plain form
58664 476200 482193 488831 495701 501744 505955 508136 508879 508784 507839 505707 502430 498517 494321 489771 484854
58649 484854 479941 475297 470692 465943 461572 458338 456284 454742 453245 451827 450440 448768 446869 445475
58635 445475 445245 446039 447245 448557 450147 452196 454560 456813 458446 459146 459129 459158 460058 462078 464747 467352
58619 467352 469592 471767 474307 477234 480267 483392 486950 491066 495429 499855 504623 509823 514776 518679
58605 518679 521598 524279 527180 530300 533736 537637 541617 544952 547481 549649 551587 552877 553506 554321 556149
58590 556149 558997 562511 566720 571941 578369 586099 595177 605230 615439 625249 634792 644292 653511 662184
58576 662184 670646 679509 688905 698465 707855 716996 726015 735358 745785 757883 771646 786796 803281
58563 803281 821154 840180 859872 879736 899160 917268 933290 947016 958542 967616 973571 975974
$$ packed form
58664D76200N993O638O870O043M211K181P43r5r45k132l277l913m196m550m917
58649D84854m913m644m605m749m371l234k054j542j497j418j387j672j899j394
58635D45475k30P94J206J312J590K049K364K253J633P00j7K9R00K020K669K605
58619D67352K240K175K540K927L033L125L558M116M363M426M768N200M953L903
58605E18679K919K681K901L120L436L901L980L335K529K168J938J290O29Q15J828
58590E56149K848L514M209N221O428P730R078J0053J0209R810R543R500R219Q673
58576F62184Q462Q863R396R560R390R141R019R343J0427J2098J3763J5150J6485
58563H03281J7873J9026J9692J9864J9424J8108J6022J3726J1526R074N955K403
$$ plain form
58551 975974 975176 972199 968129 963478 958018 951260 943083 933704 923142 911134 897584 882618 866066
58538 866066 847421 826699 804877 783088 761753 740885 720809 702052 684835 669255 655779
58527 655779 644885 636283 629048 622590 617067 612816 609807 607722 606163 604672 602944 601155 599870 599445
58513 599445 599641 599851 599535 598421 596466 593792 590647 587428 584678 582878 582100 581939 581897 581767 581651 581802 582486
58496 582486 583755 585229 586433 587534 589504 593278 598976 606107 614273 623277 632751 642162 651294 660495
58482 660495 670403 681513 693890 707109 720511 733617 746206 757961 768144 775846 780471 782005
58470 782005 780985 778268 774546 769922 764095 757070 749500 742330 736329 732049 729866 729920 732154 736462 742536
58455 742536 749618 756878 764087 771425 778520 784267 787849 789335 788929 786278 781042 773647 764827 754792
$$ packed form
58551I75974p98k977m070m651n460o758q177r379j0562j2008j3550j4966j6552
58538H66066j8645k0722k1822k1789k1335k0868k0076j8757j7217j5580j3476
58527F55779j0894q602p235o458n523m251l009k085j559j491j728j789j285m25
58513E99445J96K10l16j114j955k674l145l219k750j800p78j61m2j30j16J51O84
58496E82486J269J474J204J101J970L774N698P131Q166R004R474R411R132R201
58482F60495R908J1110J2377J3219J3402J3106J2589J1755J0183P702M625J534
58470G82005j020k717l722m624n827p025p570p170o001m280k183N4K234M308O074
58455G42536P082P260P209P338P095N747L582J486m06k651n236p395q820j0035
$$ plain form
58441 754792 743513 731580 720126 710031 701673 695346 691339 689581 689638 691110 693766 697370 701674 706513
58427 706513 711759 717305 723267 729894 737034 743914 749707 754050 756807 757737 756768 754251 750542 745612 739407
58412 739407 732247 724494 716194 707492 699038 691475 684814 678760 673349 668756 664825 661374 658725 657348
58398 657348 657184 657815 659085 660981 663142 665052 666628 668106 669515 670807 672365 674846 678551 683224 688287
58383 688287 693011 696860 700112 703668 707766 711467 714085 716583 720605 726467 733069 739571 746171 753337
58369 753337 761238 770063 779996 790731 801722 812963 824763 836651 847329 856046 863389 870450 877670
58356 877670 884738 891112 896358 900300 903104 905160 906868 908594 910562 912642 914551 916525 919283 923078
58342 923078 927456 932400 938886 947529 957440 967449 977818 989526 1002356 1015008 1026838 1038205
$$ packed form
58441G54792j1279j1933j1454j0095q358o327m007j758N7J472K656L604M304M839
58427G06513N246N546N962O627P140O880N793M343K757R30r69k517l709m930o205
58412G39407p160p753q300q702q454p563o661o054n411m593l931l451k649j377
58398F57348j64O31J270J896K161J910J576J478J409J292J558K481L705M673N063
58383F88287M724L849L252L556M098L701K618K498M022N862O602O502O600P166
58369G53337P901Q825R933J0735J0991J1241J1800J1888J0678Q717P343P061P220
58356H77670P068O374N246L942K804K056J708J726J968K080J909J974K758L795
58342I23078M378M944O486Q643R911J0009J0369J1708J2830J2652J1830J1367
$$ plain form
58330 1038205 1049216 1059474 1069061 1078482 1087477 1095082 1101014 1105879 1109886 1112589 1114138 1115554 1117396
58317 1117396 1119277 1121104 1123674 1127567 1132475 1138150 1145027 1153329 1162439 1171815 1181787 1192869 1204841
58304 1204841 1217039 1229081 1241040 1253387 1266881 1281881 1297644 1312977 1327690 1342624 1358276
58293 1358276 1374311 1390564 1407479 1425289 1443699 1462662 1482552 1503276 1524133 1544901 1566268
58282 1566268 1588886 1612774 1637823 1663981 1690819 1717896 1745772 1775703 1808144 1842513 1878506
58271 1878506 1916491 1956475 1997928 2040916 2086119 2133330 2181195 2228893 2276990 2326280 2376883
58260 2376883 2428762 2481872 2535524 2588892 2642478 2697746 2755033 2813292 2872174 2932844 2996365
58249 2996365 3062865 3132704 3206743 3284981 3366727 3452698 3545119 3645137 3751990 3865351 3986364
$$ packed form
58330A038205J1011J0258R587R421Q995P605N932M865M007K703J549J416J842
58317A117396J881J827K570L893M908N675O877Q302R110R376R972J1082J1972
58304A204841J2198J2042J1959J2347J3494J5000J5763J5333J4713J4934J5652
58293A358276J6035J6253J6915J7810J8410J8963J9890K0724K0857K0768K1367
58282A566268K2618K3888K5049K6158K6838K7077K7876K9931L2441L4369L5993
58271A878506L7985L9984M1453M2988M5203M7211M7865M7698M8097M9290N0603
58260B376883N1879N3110N3652N3368N3586N5268N7287N8259N8882O0670O3521
58249B996365O6500O9839P4039P8238Q1746Q5971R2421J00018J06853J13361J21013
$$ plain form
58238 3986364 4115564 4252105 4396229 4550344 4716285 4893554 5081693 5282484 5498295
58229 5498295 5730100 5978659 6245940 6533960 6844014 7178432 7541310 7936331 8366032
58220 8366032 8834482 9348509 9915088 10540325 11232853 12005849 12874492 13855142 14970085
58211 14970085 16251549 17741079 19490955 21570294 24064802 27062803 30639303 34852925
58203 34852925 39753205 45387903 51810001 59086472 67300245 76539582 86887611 98424809
58195 98424809 111231733 125368724 140834709 157535011 175285352 193851436 212984833
58188 212984833 232384236 251541844 269560836 285144333 296877543 303662045 304989655
58181 304989655 300884754 291655974 277734481 259717082 238494737 215276571 191430434
$$ packed form
58238C986364J29200J36541J44124J54115J65941J77269J88139K00791K15811
58229E498295K31805K48559K67281K88020L10054L34418L62878L95021M29701
58220H366032M68450N14027N66579O25237O92528P72996Q68643R80650J114943
58211A4970085J281464J489530J749876K079339K494508K998001L576500M213622
58203C4852925M900280N634698O422098P276471Q213773R239337J0348029J1537198
58195I8424809J2806924J4136991J5465985J6700302J7750341J8566084J9133397
58188B12984833J9399403J9157608J8018992J5583497J1733210O784502J327610
58181C04989655m104901r228780j3921493j8017399k1222345k3218166k3846137
$$ plain form
58174 191430434 168211532 146528625 126869303 109393162 94087892 80870521 69607690
58167 69607690 60111270 52155569 45507861 39949078 35284360 31350643 28017025 25176044
58159 25176044 22736829 20626212 18788796 17180027 15760672 14498797 13371593 12360841
58151 12360841 11448894 10621182 9868872 9185510 8563256 7994817 7476332 7005351 6577814
58142 6577814 6189275 5836907 5517836 5227340 4960958 4716680 4492857 4285689 4091022
58133 4091022 3907196 3734088 3570770 3416064 3270075 3133087 3004049 2881865 2766920
58124 2766920 2659613 2558635 2462569 2371982 2287979 2209739 2135388 2064418 1997374 1933966 1873363
58113 1873363 1815689 1761437 1709936 1660146 1612445 1567971 1526561 1486928 1448433 1411191 1374842
$$ packed form
58174A91430434k3218902k1682907j9659322j7476141j5305270j3217371j1262831
58167F9607690r496420p955701o647708n558783m664718l933717l333618k840981
58159B5176044k439215k110617j837416j608769j419355j261875j127204j010752
58151A2360841r11947q27712p52310o83362o22254n68439n18485m70981m27537
58142F577814l88539l52368l19071k90496k66382k44278k23823k07168j94667
58133D091022j83826j73108j63318j54706j45989j36988j29038j22184j14945
58124B766920j07307j00978r6066r0587q4003p8240p4351p0970o7044o3408o0603
58113A873363n7674n4252n1501m9790m7701m4474m1410l9633l8495l7242l6349
$$ plain form
58102 1374842 1338866 1303881 1271062 1240388 1210857 1182285 1155444 1130469 1106592 1083622 1062322
58091 1062322 1043018 1024930 1007305 990263 974170 958897 944083 929613 915475 901506 887389
58080 887389 872748 857365 841574 826165 811535 797205 782508 767419 752372 737687 723634
58069 723634 710538 698327 686436 674668 663675 654073 645591 637657 630211 623254 616245 608739 601132
58056 601132 593965 586948 579516 571874 564550 557388 549964 542708 536535 531511 526840 522059 517329 512621
58042 512621 507559 502123 496716 491488 486296 481311 476878 472754 468179 462742 456554 449627 441816 433411
58028 433411 425086 417164 409480 401948 394655 387469 380229 373321 367401 362519 358132 353923 349961 346144
58014 346144 342309 338900 336635 335339 333944 331911 329908 328764 328478 328603 328899 329109 328684 327342 325585
$$ packed form
58102A374842l5976l4985l2819l0674k9531k8572k6841k4975k3877k2970k1300
58091A062322j9304j8088j7625j7042j6093j5273j4814j4470j4138j3969j4117
58080H87389j4641j5383j5791j5409j4630j4330j4697j5089j5047j4685j4053
58069G23634j3096j2211j1891j1768j0993r602q482p934p446o957p009p506p607
58056F01132p167p017p432p642p324p162p424p256o173n024m671m781m730m708
58042E12621n062n436n407n228n192m985m433m124m575n437o188o927p811q405
58028D33411q325p922p684p532p293p186p240o908n920m882m387m209l962l817
58014C46144l835l409k265j296j395k033k003j144k86J25K96K10m25j342j757
$$ plain form
57999 325585 324250 323820 324438 326208 328971 332033 334495 335879 336291 336153 335919 335810 335588 334752 333111 331057
57983 331057 329240 328061 327472 327019 326091 324392 322251 320303 318862 317766 316735 315594 314260 312828 311655
57968 311655 310986 310530 309759 308668 307850 307796 308400 309145 309407 308642 306728 304207 301876 300083 298692 297520 296407
57951 296407 294997 293084 291165 290022 289685 289477 289240 289845 292173 296151 301087 306395 311693 316725 321658
57936 321658 326968 332647 338001 342667 347318 352768 358800 364532 369599 374207 378185 380807 381688 381295 380395
57921 380395 379408 378368 377019 374790 371151 366314 361341 357297 354479 352583 351382 350834 350654 350146 348709
57906 348709 346382 343702 341042 338284 335193 331885 328631 325348 321700 317772 314240 311602 309538 307368
57892 307368 305002 303043 301968 301531 301092 300323 299428 298745 298251 297579 296567 295646 295412 295766 295837 294973 293553
$$ packed form
57999C25585j335m30O18J770K763L062K462J384M12j38k34j09k22q36j641k054
57983C31057j817j179n89m53r28j699k141j948j441j096j031j141j334j432j173
57968C11655o69m56p71j091q18n4O04P45K62p65j914k521k331j793j391j172j113
57951B96407j410j913j919j143l37k08k37O05K328L978M936N308N298N032M933
57936C21658N310N679N354M666M651N450O032N732N067M608L978K622Q81l93r00
57921C80395r87j040j349k229l639m837m973m044k818j896j201n48j80n08j437
57906C48709k327k680k660k758l091l308l254l283l648l928l532k638k064k170
57892C07368k366j959j075m37m39p69q95o83m94o72j012r21k34L54P1q64j420
$$ plain form
57875 293553 292487 292153 292217 292373 292756 293537 294576 295695 297003 298734 300998 303781 306936 310001 312363 313956
57859 313956 315560 318068 321576 325485 329310 332988 336472 339526 342012 343991 345434 346195 346366 346256 345831
57844 345831 344639 342526 340003 337520 334824 331590 328290 325699 323676 321277 318170 315147 312904 310987
57830 310987 308474 305258 302123 299778 298282 297256 296267 295046 293679 292542 291869 291526 291358 291469 291876 292188
57814 292188 292029 291568 291213 290901 290155 288715 286607 283663 279617 274812 270236 266516 263260 259760 256066
57799 256066 252973 251088 250236 249821 249569 249833 251189 253694 256555 258706 259815 260643 262312 265348 269460
57784 269460 274093 278915 283783 288486 292810 296846 300920 305028 308521 310726 311842 312772 313959 314806 314562
57769 314562 313324 311710 309876 307455 304398 301229 298401 295864 293376 290784 287904 284578 281111 278265
$$ packed form
57875B93553j066l34O4J56L83P81J039J119J308J731K264K783L155L065K362J593
57859C13956J604K508L508L909L825L678L484L054K486J979J443P61J71j10m25
57844C45831j192k113k523k483k696l234l300k591k023k399l107l023k243j917
57830C10987k513l216l135k345j496j026r89j221j367j137o73l43j68J11M07L12
57814B92188j59m61l55l12p46j440k108k944m046m805m576l720l256l500l694
57799B56066l093j885q52m15k52K64J356K505K861K151J109Q28J669L036M112
57784B69460M633M822M868M703M324M036M074M108L493K205J116R30J187Q47k44
57769C14562j238j614j834k421l057l169k828k537k488k592k880l326l467k846
$$ plain form
57755 278265 276594 276030 276263 277203 278851 281073 283767 286970 290564 294171 297611 301189 305153 309138 312526
57740 312526 315282 317996 321143 324640 328117 331256 333809 335606 336704 337319 337508 337146 336328 335586 335419 335686
57724 335686 335705 335008 333783 332406 330729 328154 324442 320167 316148 312680 309526 306481 303531 300531 297132
57709 297132 293193 288961 284720 280506 276313 272315 268678 265327 262135 259232 256921 255311 254190 253239
57695 253239 252300 251450 250855 250485 250038 249293 248528 248382 249292 251309 254503 259144 265324 272745 281269 291437
57679 291437 304104 319668 338003 359034 383035 410307 440908 474700 511351 550235 590595
57668 590595 631895 673658 714735 752862 785133 808873 822092 823502 812587 789770 756411 714593
57656 714593 666989 616771 567182 520751 478801 441732 409697 382866 361106 343725 329738
$$ packed form
57755B78265j671n64K33R40J648K222K694L203L594L607L440L578L964L985L388
57740C12526K756K714L147L497L477L139K553J797J098O15J89l62q18p42j67K67
57724C35686J9o97j225j377j677k575l712m275m019l468l154l045k950l000l399
57709B97132l939m232m241m214m193l998l637l351l192k903k311j610j121r51
57695B53239r39q50n95l70m47p45p65j46R10K017L194M641O180P421Q524J0168
57679B91437J2667J5564J8335K1031K4001K7272L0601L3792L6651L8884M0360
57668E90595M1300M1763M1077L8127L2271K3740J3219J410j0915k2817l3359m1818
57656G14593m7604n0218m9589m6431m1950l7069l2035k6831k1760j7381j3987
$$ plain form
57645 329738 318369 309252 302248 297247 294088 292488 291950 291852 291700 291326 290842 290375 289826 288887 287376 285535
57629 285535 283858 282584 281477 280155 278449 276344 273798 270848 267756 264825 262115 259484 256775 253863
57615 253863 250745 247793 245637 244442 243556 242239 240583 239210 238274 237344 236200 235090 234062 232669 230604
57600 230604 228109 225535 222938 220382 218205 216599 215230 213578 211399 208718 205698 202686 199967 197266
57586 197266 194014 190334 187204 185221 183799 182080 180070 178181 176134 173179 169189 164762 160321 155872
57572 155872 151569 147792 144552 141465 138371 135408 132465 129271 126144 123946 123036 122866 122829 122895 123120 123211
57556 123211 123047 123054 123551 124158 124467 124843 125918 127516 128831 129533 130015 130549 130978 131420 132532 134593 136813
57539 136813 138119 138406 138502 139035 139909 140877 142044 143511 144931 145817 146093 145958 145387 144262 142960 142341 142907
$$ packed form
57645C29738j1369r117p004n001l159j600n38r8j52l74m84m67n49r39j511j841
57629B85535j677j274j107j322j706k105k546k950l092k931k710k631k709k912
57615B53863l118k952k156j195q86j317j656j373r36r30j144j110j028j393k065
57600B30604k495k574k597k556k177j606j369j652k179k681l020l012k719k701
57586A97266l252l680l130j983j422j719k010j889k047k955l990m427m441m449
57572A55872m303l777l240l087l094k963k943l194l127k198r10j70l7O6K25R1
57556A23211j64PM97O07L09L76J075J598J315P02M82N34M29M42J112K061K220
57539A36813J306K87R6N33Q74R68J167J467J420Q86K76j35n71j125j302o19N66
$$ plain form
57522 142907 144290 145790 147146 148540 150074 151589 152935 154158 155490 157265 159732 162658 165249 166723
57508 166723 166974 166480 165664 164635 163531 162761 162659 163012 163047 161949 159471 156148 152864 150104 147633 144957
57492 144957 141997 139189 137029 135638 134716 133833 132790 131704 130604 129036 126441 123021 119795 117513 115879
57477 115879 114195 112378 110830 109579 108199 106497 104721 103072 101526 100182 99250 98581 97665 96274 94743
57462 94743 93467 92529 91966 91972 92519 93070 92947 91899 90202 88459 87333 87179 87717 88265 88440 88409 88417 88386 88194
57443 88194 88138 88863 90807 93697 96526 98162 98301 97722 97400 97530 97807 98334 99514 101008 101632 100707 98989
57426 98989 97839 97828 98398 98511 97376 95013 92477 91106 91176 91630 91410 90556 89673 88934 88266 88022 88602 89612
57408 89612 90192 90105 89779 89313 88300 86855 85948 86195 86838 86588 85251 83906 83480 83745 83974 84115 84744 85968
$$ packed form
57522A42907J383J500J356J394J534J515J346J223J332J775K467K926K591J474
57508A66723K51m94q16j029j104p70j02L53L5j098k478l323l284k760k471k676
57492A44957k960k808k160j391r22q83j043j086j100j568k595l420l226k282j634
57477A15879j684j817j548j251j380j702j776j649j546j344r32o69r16j391j531
57462I4743j276r38n63ON47N51j23j048j697j743j126j54N38N48J75l1Ql1j92
57443H8194n6P25J944K890K829J636J39n79l22J30K77N27J180J494O24r25j718
57426I8989j150j1N70J13j135k363k536j371P0M54k20q54q83p39o68k44N80J010
57408H9612N80q7l26m66j013j445r07K47O43k50j337j345m26K65K29J41O29J224
$$ plain form
57390 85968 87027 87319 87354 88113 89656 90959 91117 90197 88916 88091 88412 89987 91846 92597 92043 91480 91954
57373 91954 92867 92944 91920 90482 89060 87639 86443 85806 85479 84924 84225 83841 83556 82654 81191 80104 79772
57356 79772 79458 78511 77282 76354 75762 75524 76198 78148 80784 83151 84879 85984 86274 85676 84772 84229 83963
57339 83963 83574 83349 83935 85138 85947 85901 85594 85569 85502 84954 84295 84203 84567 84511 83562 82298 81757 82412 83818 85130
57319 85130 85850 86071 86060 85779 85038 84031 83391 83527 84185 84806 85103 85045 84616 83966 83647 84137 85064 85398 84641
57300 84641 83435 82679 82396 81943 81189 80920 81923 84005 86123 87343 87594 87623 88278 89693 91181 92057 92543
57283 92543 93580 95729 98524 101015 102639 103450 103871 104535 106069 108628 111700 114615 117120 119223 120738
57268 120738 121451 121651 121946 122486 122769 122399 121716 121417 121822 122745 123891 125093 126241 127316 128537 130248 132477
$$ packed form
57390H5968J059K92L5P59J543J303J58r20j281q25L21J575J859P51n54n63M74
57373I1954R13P7j024j438j422j421j196o37l27n55o99l84k85r02j463j087l32
57356G9772l14r47j229r28n92k38O74J950K636K367J728J105K90n98r04n43k66
57339H3963l89k25N86J203Q09m6l07k5o7n48o59r2L64n6r49j264n41O55J406J312
57319H5130P20K21j1k81p41j007o40J36O58O21K97n8m29o50l19M90R27L34p57
57300H4641j206p56k83m53p54k69J003K082K118J220K51K9O55J415J488Q76M86
57283I2543J037K149K795K491J624Q11M21O64J534K559L072K915K505K103J515
57268A20738P13K00K95N40K83l70o83k99M05R23J146J202J148J075J221J711K229
$$ plain form
57251 132477 134681 136150 136694 136818 137155 137843 138585 139098 139264 138973 138263 137676 138027 139572 141668 143495 144843
57234 144843 146006 147254 148774 150822 153443 156211 158686 161016 163697 166832 170085 173227 176296 179307
57220 179307 182333 185802 190134 195010 199559 203452 207238 211427 215784 219930 224131 229032 234855 241320
57206 241320 248174 255368 262741 269886 276503 282791 289445 297183 306102 315544 324791 333847 343272 353282
57192 353282 363467 373531 383890 395181 407468 420266 433262 446680 460854 475554 489876
57181 489876 503036 515407 528481 543410 559795 576392 592774 609584 627186 645106 663161
57170 663161 682216 703076 725254 747597 769686 791881 814331 836848 859626 883249 907912
57159 907912 933299 959352 986536 1015140 1044819 1075049 1105731 1137201 1169978 1204637 1241621
$$ packed form
57251A32477K204J469N44J24L37O88P42N13J66k91p10n87L51J545K096J827J348
57234A44843J163J248J520K048K621K768K475K330K681L135L253L142L069L011
57220A79307L026L469M332M876M549L893L786M189M357M146M201M901N823O465
57206B41320O854P194P373P145O617O288O654P738Q919R442R247R056R425J0010
57192C53282J0185J0064J0359J1291J2287J2798J2996J3418J4174J4700J4322
57181D89876J3160J2371J3074J4929J6385J6597J6382J6810J7602J7920J8055
57170F63161J9055K0860K2178K2343K2089K2195K2450K2517K2778K3623K4663
57159I07912K5387K6053K7184K8604K9679L0230L0682L1470L2777L4659L6984
$$ plain form
57148 1241621 1280977 1322403 1365512 1409927 1455290 1501614 1549570 1600007 1653051 1707922 1763619
57137 1763619 1819483 1875216 1930852 1986807 2043617 2101520 2160609 2221310 2284185 2349273 2416246
57126 2416246 2485404 2557916 2634756 2715937 2801231 2891143 2986662 3088395 3196552 3311579 3434216
57115 3434216 3564976 3704195 3852950 4013940 4191792 4392998 4625622 4898803 5222730
57106 5222730 5609698 6075506 6639385 7321776 8141057 9110952 10239858 11532704 12994676
57097 12994676 14634086 16461410 18484695 20705487 23118931 25717455 28494949 31450113
57089 31450113 34589396 37927529 41480830 45252338 49216948 53317902 57476315 61601785
57081 61601785 65590969 69315706 72616710 75315748 77241506 78252590 78248226 77172963
$$ packed form
57148A241621L9356M1426M3109M4415M5363M6324M7956N0437N3044N4871N5697
57137A763619N5864N5733N5636N5955N6810N7903N9089O0701O2875O5088O6973
57126B416246O9158P2512P6840Q1181Q5294Q9912R5519J01733J08157J15027J22637
57115C434216J30760J39219J48755J60990J77852K01206K32624K73181L23927
57106E222730L86968M65808N63879O82391Q19281R69895J128906J292846J461972
57097A2994676J639410J827324K023285K220792K413444K598524K777494K955164
57089C1450113L139283L338133L553301L771508L964610M100954M158413M125470
57081F1601785L989184L724737L301004K699038J925758J011084m364j075263
$$ plain form
57073 77172963 75026308 71876962 67868982 63208486 58132466 52872493 47627119 42549856
57065 42549856 37751228 33307697 29269558 25664121 22496260 19750475 17395912 15392541
57057 15392541 13696501 12264074 11054384 10030684 9160516 8415776 7773143 7214243 6724875
57048 6724875 6293331 5908452 5558228 5230120 4913504 4602629 4297501 4002091 3721895
57039 3721895 3462508 3228611 3022524 2843368 2688181 2553935 2438270 2338803 2252877 2178363
57029 2178363 2114085 2059069 2011849 1970912 1935289 1904056 1875474 1847358 1818349 1788156 1756189
57018 1756189 1720476 1678533 1629275 1573741 1514096 1452487 1390974 1331895 1277470 1228869 1185934
57007 1185934 1147813 1113707 1083053 1055417 1030478 1008018 987847 969685 953064 937242 921454
$$ packed form
57073G7172963k146655l149346m007980m660496n076020n259973n245374n077263
57065D2549856m798628m443531m038139l605437l167861k745785k354563k003371
57057A5392541j696040j432427j209690j023700q70168p44740o42633n58900m89368
57048F724875m31544l84879l50224l28108l16616l10875l05128k95410k80196
57039C721895k59387k33897k06087j79156j55187j34246j15665r9467q5926p4514
57029B178363o4278n5016m7220m0937l5623l1233k8582k8116k9009l0193l1967
57018A756189l5713m1943m9258n5534n9645o1609o1513n9079n4425m8601m2935
57007A185934l8121l4106l0654k7636k4939k2460k0171j8162j6621j5822j5788
$$ plain form
56996 921454 905594 890552 877392 866177 855983 846151 837012 829164 822627 817107 812593 809107 806153
56983 806153 803021 799499 795606 790665 783351 772918 760000 745854 731128 715592 698905 681391
56971 681391 664104 648244 634515 623011 613698 606791 602484 600524 600390 601801 604695 608735 613232
56958 613232 617698 622063 626140 629188 630296 629023 625377 619305 610585 599286 586073 571907 557574
56945 557574 543705 531192 521287 515006 512412 512661 514826 518614 524258 531923 541384 552211 564052
56932 564052 576612 589347 601158 610461 615714 615996 611137 601453 587549 570264 550475 528867 506042
56919 506042 482839 460234 438944 419383 401914 386687 373263 361049 350258 341732 335498 330220
56907 330220 324655 319039 314345 310735 307635 304974 303405 303319 304495 306734 310074 314347 319216 324809 331618
$$ packed form
56996I21454j5860j5042j3160j1215j0194r832r139p848o537n520m514l486k954
56983H06153l132l522l893m941p314j0433j2918j4146j4726j5536j6687j7514
56971F81391j7287j5860j3729j1504r313o907m307j960j34J411K894M040M497
56958F13232M466M365M077L048J108j273l646o072q720j1299j3213j4166j4333
56945E57574j3869j2513r905o281k594K49K165L788N644P665R461J0827J1841
56932E64052J2560J2735J1811R303N253K82m859r684j3904j7285j9789k1608k2825
56919E06042k3203k2605k1290j9561j7469j5227j3424j2214j0791q526o234n278
56907C30220n565n616m694l610l100k661j569q6J176K239L340M273M869N593O809
$$ plain form
56892 331618 339638 348115 356290 363847 370666 376808 382848 389398 395998 401161 403865 404424 403568 401306 397220
56877 397220 391444 384862 378618 373685 370602 369368 369893 372649 378443 387450 399094 413045 429558 448455
56863 448455 468549 488748 509070 529832 550305 568880 584167 595196 600985 600907 595420 585695 572560
56850 572560 556571 539110 522611 509343 500436 496212 496884 502619 513319 528679 548419 572310
56838 572310 600032 630963 664013 697832 731350 763791 793834 818990 836387 844165 841877 829840
56826 829840 808801 780270 746456 709610 671816 635451 603084 576424 555696 540529 531206 528559
56814 528559 532772 542821 557254 575136 595997 619010 642611 664973 684576 700126 710168 713298
56802 713298 708930 697569 680170 657465 630104 599213 566476 533803 503112 476155 454065 437032
$$ packed form
56892C31618Q020Q477Q175P557O819O142O040O550O600N163K704N59q56k262m086
56877C97220n776o582o244m933l083j234N25K756N794R007J1644J3951J6513J8897
56863D48455K0094K0199K0322K0762K0473J8575J5287J1029N789p8n487r725j3135
56850E72560j5989j7461j6499j3268q907m224O72N735J0700J5360J9740K3891
56838E72310K7722L0931L3050L3819L3518L2441L0043K5156J7397P778k288j2037
56826H29840k1039k8531l3814l6846l7794l6365l2367k6660k0728j5167r323k647
56814E28559M213J0049J4433J7882K0861K3013K3601K2362J9603J5550J0042L130
56802G13298m368j1361j7399k2705k7361l0891l2737l2673l0691k6957k2090j7033
$$ plain form
56790 437032 424731 417006 413859 414782 418634 424404 431877 441249 452162 463345 473173 480434 484535 485148
56776 485148 481936 474679 463497 448723 430733 410172 388273 366538 345936 326650 308704 292460
56764 292460 278303 266175 255686 246489 238301 230839 224067 218329 213931 210686 208024 205391 202390
56751 202390 198880 195239 192249 190359 189201 188107 186820 185399 183793 182043 180626 180007 179899 179538 178658
56736 178658 177696 177073 176771 176727 177093 177995 179336 180933 182517 183681 184225 184592 185465 186907 188363 189540 190726
56719 190726 192006 192793 192574 191773 191387 191922 193049 194191 195090 195789 196332 196711 197032 197564 198488 199696 201022
56702 201022 202627 204729 206882 208047 207758 206778 206087 205607 204659 203336 202472 202268 201944 201068 200336 200504 201226
56685 201226 201613 201455 201228 201135 200837 200133 199390 199173 199687 200684 201723 202530 203169 203828 204483 204891 204951 204855 204900 205336
$$ packed form
56790D37032j2301p725l147R23L852N770P473R372J0913J1183R828P261M101O13
56776D85148l212p257j1182j4774j7990k0561k1899k1735k0602j9286j7946j6244
56764B92460j4157j2128j0489r197q188p462o772n738m398l245k662k633l001
56751B02390l510l641k990j890j158j094j287j421j606j750j417o19j08l61q80
56736A78658r62o23l02m4L66R02J341J597J584J164N44L67Q73J442J456J177J186
56719A90726J280P87k19q01l86N35J127J142Q99O99N43L79L21N32R24J208J326
56702B01022J605K102K153J165k89r80o91m80r48j323q64k04l24q76p32J68P22
56685B01226L87j58k27r3k98p04p43k17N14R97J039Q07O39O59O55M08O0r6M5M36
$$ plain form
56665 205336 206342 207809 209162 209862 210110 210646 211689 212632 212998 213160 213729 214708 215760 216972 218706 220838
56649 220838 222678 223704 224012 224088 224465 225572 227472 229636 231205 231606 230897 229605 228359 227576 227217 226842
56633 226842 225993 224500 222376 219634 216441 213251 210513 208260 206192 204104 202037 200053 198105 196163
56619 196163 194394 193157 192800 193273 193954 194111 193701 193424 193800 194463 194651 194163 193431 192790 192115 191204 190177 189404
56601 189404 189184 189548 190177 190614 190683 190638 190729 190853 190899 191176 191955 192676 192291 190643 188979 188705 189996 191991 193975
56582 193975 195785 197245 198010 198246 198852 200526 202849 204815 206130 207480 209440 211677 213556 215097 216946
56567 216946 219588 223144 227752 233499 239786 245391 249631 253211 257421 262586 267635 271155 272552 272196
56553 272196 270859 269117 267038 264206 260210 255287 250383 246405 243502 241222 239231 237592 236365 235320
$$ packed form
56665B05336J006J467J353P00K48N36J043R43L66J62N69R79J052J212J734K132
56649B20838J840J026L08P6L77J107J900K164J569M01p09j292j246p83l59l75
56633B26842q49j493k124k742l193l190k738k253k068k088k067j984j948j942
56619A96163j769j237l57M73O81J57m10k77L76O63J88m88p32o41o75r11j027p73
56601A89404k20L64O29M37O9m5R1J24M6K77P79P21l85j648j664k74J291J995J984
56582A93975J810J460P65K36O06J674K323J966J315J350J960K237J879J541J849
56567B16946K642L556M608N747O287N605M240L580M210N165N049L520J397l56
56553B72196j337j742k079k832l996m923m904l978k903k280j991j639j227j045
$$ plain form
56539 235320 234259 233336 232783 232466 232044 231485 231065 230865 230628 230158 229533 228837 228116 227716 228166 229387 230467 230679
56521 230679 230335 230141 230090 229671 228915 228374 228085 227442 226308 225418 225229 225069 224012 222120 220152 218381 216372
56504 216372 213897 211420 209481 208025 206607 205137 204100 203960 204457 204726 204276 203656 203841 205065 206635 207850
56488 207850 208616 209083 209251 209264 209627 210619 211759 212348 212416 212685 213610 214835 215676 215877 215816 216116 217111 218546 219800
56469 219800 220414 220441 220297 220411 220977 221862 222678 223135 223366 223735 224249 224500 224275 223911 223825 223973 224085 224190 224571
56450 224571 225300 226102 226685 227003 227256 227713 228450 229155 229332 228819 227959 227224 226897 227120 227781 228202 227438 225369
56432 225369 223172 222180 222430 222811 222560 222078 222213 223184 224450 225361 225689 225614 225342 224862 224086 223156 222427 222087
56414 222087 222083 222459 223492 225258 227360 229340 231175 233062 234896 236321 237213 237805 238364 238992 239671 240251 240454
$$ packed form
56539B35320j061r23n53l17m22n59m20k00k37m70o25o96p21m00M50J221J080K12
56521B30679l44j94n1m19p56n41k89o43j134q90j89j60j057j892j968j771k009
56504B16372k475k477j939j456j418j470j037j40M97K69m50o20J85J224J570J215
56488B07850P66M67J68J3L63R92J140N89O8K69R25J225Q41K01o1L00R95J435J254
56469B19800O14K7j44J14N66Q85Q16M57K31L69N14K51k25l64q6J48J12J05L81
56450B24571P29Q02N83L18K53M57P37P05J77n13q60p35l27K23O61M21p64k069
56432B25369k197r92K50L81k51m82J35R71J266R11L28p5k72m80p76r30p29l40
56414B22087mL76J033J766K102J980J835J887J834J425Q92N92N59O28O79N80K03
$$ plain form
56397 240454 240144 239595 239307 239579 240373 241497 242720 243807 244612 245115 245305 245258 245402 246368 248215 250085 251020
56380 251020 250993 250761 250856 251163 251454 251789 252229 252528 252386 251859 251362 251352 252069 253452 255204 256982 258575 259934
56362 259934 261143 262380 263750 265057 265868 265916 265323 264386 263436 263027 263880 266172 269030 271150 272070 272595 273896
56345 273896 276322 279124 281233 282256 282745 283548 284982 286749 288486 290107 291623 293006 294358 295905 297683
56330 297683 299527 301389 303342 305210 306667 307849 309318 311187 312875 314099 315493 317652 320054 321669
56316 321669 322326 322759 323459 324216 324807 325507 326758 328732 331275 333980 336425 338685 341473 345355 349949 354405
56300 354405 358516 362840 367789 373152 378530 383702 388437 392523 396179 400041 404476 409174 413585 417525
56286 417525 421305 425456 430411 436228 442595 449222 456193 463749 471879 480411 489368 498930 509065 519558
$$ packed form
56397B40454l10n49k88K72P94J124J223J087Q05N03J90m7J44R66J847J870R35
56380B51020k7k32R5L07K91L35M40K99j42n27m97j0P17J383J752J778J593J359
56362B59934J209J237J370J307Q11M8n93r37r50m09Q53K292K858K120R20N25J301
56345B73896K426K802K109J023M89Q03J434J767J737J621J516J383J352J547J778
56330B97683J844J862J953J868J457J182J469J869J688J224J394K159K402J615
56316C21669O57M33P00P57N91P00J251J974K543K705K445K260K788L882M594M456
56300C54405M111M324M949N363N378N172M735M086L656L862M435M698M411L940
56286D17525L780M151M955N817O367O627O971P556Q130Q532Q957R562J0135J0493
$$ plain form
56272 519558 530426 542078 555062 569748 586178 604044 622974 643053 664929 689305 716600
56261 716600 747252 781948 821136 864634 912160 964026 1020973 1083606 1152367 1227736 1309974
56250 1309974 1398893 1494304 1596348 1704906 1819051 1937653 2060123 2185815 2312924 2438719
56240 2438719 2560755 2677120 2785721 2884211 2970725 3043949 3102302 3143705 3166400 3169589 3153294
56229 3153294 3118108 3065197 2996144 2912758 2817304 2712636 2601537 2486019 2367678 2248395
56219 2248395 2130063 2013920 1900869 1792220 1689331 1592705 1502204 1417932 1340006 1267706
56209 1267706 1199946 1136599 1078343 1025188 976245 931064 890059 853325 820075 789644 762048
56198 762048 737213 714653 694352 676941 662358 649235 636315 623797 612585 602869 594140 586109
$$ packed form
56272E19558J0868J1652J2984J4686J6430J7866J8930K0079K1876K4376K7295
56261G16600L0652L4696L9188M3498M7526N1866N6947O2633O8761P5369Q2238
56250A309974Q8919R5411J02044J08558J14145J18602J22470J25692J27109J25795
56240B438719J22036J16365J08601R8490Q6514P3224N8353M1403K2695L189j6295
56229C153294l5186n2911o9053q3386r5454j04668j11099j15518j18341j19283
56219B248395j18332j16143j13051j08649j02889r6626r0501q4272p7926p2300
56209A267706o7760o3347n8256n3155m8943m5181m1005l6734l3250l0431k7596
56198G62048k4835k2560k0301j7411j4583j3123j2920j2518j1212r716q729q031
$$ plain form
56186 586109 578871 572478 566851 561873 557276 552826 548843 546047 544594 543794 543052 542523 542571 543169 544186 545685
56170 545685 547617 549780 552399 556080 560792 565521 569376 572514 575617 579120 583421 589148 596612 605446
56156 605446 615307 626432 639098 653082 668241 685192 704870 727762 754010 783800 817160 853749
56144 853749 893401 936669 984458 1037325 1095311 1158076 1225015 1295580 1369579 1446593 1525018
56133 1525018 1602382 1676864 1747810 1814555 1875676 1930010 1977640 2019185 2054617 2083377 2105116
56122 2105116 2119708 2126862 2126304 2118056 2102218 2078780 2047905 2010011 1965389 1914261 1857405 1796125
56110 1796125 1731372 1663510 1593141 1521443 1449492 1378128 1308872 1244061 1185509 1133659 1088375
56099 1088375 1049753 1017705 991557 970500 953747 939958 927668 916822 908830 904374 902139 900525
$$ packed form
56186E86109p238o393n627m978m597m450l983k796j453q00p42n29M8N98J017J499
56170E45685J932K163K619L681M712M729L855L138L103L503M301N727P464Q834
56156F05446R861J1125J2666J3984J5159J6951J9678K2892K6248K9790L3360L6589
56144H53749L9652M3268M7789N2867N7986O2765O6939P0565P3999P7014P8425
56133A525018P7364P4482P0946O6745O1121N4334M7630M1545L5432K8760K1739
56122B105116J4592P154n58q248j5838k3438l0875l7894m4622n1128n6856o1280
56110A796125o4753o7862p0369p1698p1951p1364o9256o4811n8552n1850m5284
56099A088375l8622l2048k6148k1057j6753j3789j2290j0846p992m456k235j614
$$ plain form
56087 900525 899582 900352 903112 907288 912416 918257 924494 931176 938883 947681 956495 964285 971291 978487 986458
56072 986458 995483 1005990 1018058 1031041 1044397 1058313 1072989 1088014 1103015 1118028 1132616 1145687
56060 1145687 1157077 1168337 1180947 1194533 1207706 1219784 1230822 1241007 1251074 1262402 1275496
56049 1275496 1289104 1301915 1314290 1327382 1341556 1356877 1374101 1393747 1414942 1436564 1458827
56038 1458827 1482492 1507286 1532542 1558681 1586602 1616171 1646664 1678170 1711260 1745821 1781530
56027 1781530 1818879 1858421 1899448 1940690 1981908 2023735 2066552 2110562 2156326 2204131 2253548
56016 2253548 2304557 2358204 2415117 2474513 2535851 2600183 2668532 2740233 2814434 2892023 2974373
56005 2974373 3061420 3152702 3249071 3351488 3459309 3571705 3689791 3815466 3949209 4090812
$$ packed form
56087I00525r43P70K760M176N128N841O237O682P707Q798Q814P790P006P196P971
56072I86458R025J0507J2068J2983J3356J3916J4676J5025J5001J5013J4588J3071
56060A145687J1390J1260J2610J3586J3173J2078J1038J0185J0067J1328J3094
56049A275496J3608J2811J2375J3092J4174J5321J7224J9646K1195K1622K2263
56038A458827K3665K4794K5256K6139K7921K9569L0493L1506L3090L4561L5709
56027A781530L7349L9542M1027M1242M1218M1827M2817M4010M5764M7805M9417
56016B253548N1009N3647N6913N9396O1338O4332O8349P1701P4201P7589Q2350
56005B974373Q7047R1282R6369J02417J07821J12396J18086J25675J33743J41603
$$ plain form
55995 4090812 4241089 4401098 4570964 4751293 4944245 5151306 5371835 5605969 5856994
55986 5856994 6128382 6420657 6734060 7072227 7440053 7840163 8275188 8751644 9277788
55977 9277788 9859639 10503406 11220449 12026049 12935769 13968539 15152985 16527915 18141034
55968 18141034 20054509 22349555 25115854 28432532 32361116 36953421 42259415 48330701
55960 48330701 55227886 63027886 71817536 81679202 92688938 104923894 118449135 133273987
55952 133273987 149310581 166374452 184232285 202656444 221410753 240105316 257971760
55945 257971760 273762083 285964427 293271909 294976502 291013182 281717500 267598306
55938 267598306 249319859 227812849 204312540 180223212 156864706 135232962 115889843
$$ packed form
55995D090812J50277J60009J69866J80329J92952K07061K20529K34134K51025
55986E856994K71388K92275L13403L38167L67826M00110M35025M76456N26144
55977I277788N81851O43767P17043Q05600R09720J032770J184446J374930J613119
55968A8141034J913475K295046K766299L316678L928584M592305N305994O071286
55960D8330701O897185P800000Q789650R861666J1009736J2234956J3525241J4824852
55952A33273987J6036594J7063871J7857833J8424159J8754309J8694563J7866444
55945B57971760J5790323J2202344P307482J704593l963320r295682j4119194
55938B67598306j8278447k1507010k3500309k4089328k3358506k1631744j9343119
$$ plain form
55931 115889843 99015524 84553002 72332220 62123130 53654300 46642627 40827706
55924 40827706 35985348 31925055 28490891 25563567 23051953 20880891 18988888 17330501
55916 17330501 15871137 14579004 13425739 12391301 11461637 10622408 9859503 9163964 8531214
55907 8531214 7956051 7432191 6955344 6522456 6128598 5768206 5438542 5138540 4865099
55898 4865099 4613860 4382774 4171545 3978111 3798793 3631435 3475578 3330056 3193181
55889 3193181 3064868 2945936 2835586 2731834 2633934 2542174 2455918 2374097 2296993 2225222
55879 2225222 2157536 2091880 2028063 1967147 1908789 1851570 1795524 1741925 1690740 1640516 1590808
55868 1590808 1542669 1496762 1452804 1410837 1371261 1333701 1297529 1263330 1232183 1203607 1175933
$$ packed form
55931A15889843j6874319j4462522j2220782j0209090q468830p011673n814921
55924D0827706m842358m060293l434164k927324k511614k171062j892003j658387
55916A7330501j459364j292133j153265j034438r29664q39229p62905o95539o32750
55907H531214n75163n23860m76847m32888l93858l60392l29664l00002k73441
55898D865099k51239k31086k11229j93434j79318j67358j55857j45522j36875
55889C193181j28313j18932j10350j03752r7900r1760q6256q1821p7104p1771
55879B225222o7686o5656o3817o0916n8358n7219n6046n3599n1185n0224m9708
55868A590808m8139m5907m3958m1967l9576l7560l6172l4199l1147k8576k7674
$$ plain form
55857 1175933 1148584 1122284 1097054 1071739 1045692 1019464 993675 968479 944191 921188 899179
55846 899179 877667 857003 837868 819875 801808 783173 764538 746645 730158 715808 703616
55835 703616 692332 680714 668943 657789 647084 636298 625893 616658 608249 599895 592018 585535
55823 585535 579966 573921 567161 560525 554040 546856 539036 531758 525596 520088 515030 510815 507429 504526
55809 504526 502523 502222 503236 504217 504734 505576 507103 508713 510034 511317 512488 513172 513742 514871 515871 515010
55793 515010 511776 507372 502552 496553 488831 480432 472802 466309 460700 456027 452335 449277 446786 445499
55779 445499 445919 447769 450587 454295 458701 463099 466851 470058 473430 477846 483903 491195 497983 502288
55765 502288 503304 501142 495509 485750 472215 456440 439756 422604 405294 388361 372025 356404
$$ packed form
55857A175933k7349k6300k5230k5315k6047k6228k5789k5196k4288k3003k2009
55846H99179k1512k0664j9135j7993j8067j8635j8635j7893j6487j4350j2192
55835G03616j1284j1618j1771j1154j0705j0786j0405r235q409q354p877o483
55823E85535n569o045o760o636o485p184p820p278o162n508n058m215l386k903
55809E04526k003l01J014R81N17Q42J527J610J321J283J171O84N70J129J000q61
55793E15010l234m404m820n999p722q399p630o493n609m673l692l058k491j287
55779D45499M20J850K818L708M406M398L752L207L372M416O057P292O788M305
55765E02288J016k162n633r759j3535j5775j6684j7152j7310j6933j6336j5621
$$ plain form
55753 356404 342450 331467 323372 316594 310076 304206 299338 294605 288972 282461 275628 268758 262244 256891
55739 256891 252952 249525 245633 241289 236991 232909 229261 226693 225434 224652 223485 222201 221571 221503 221130
55724 221130 219960 218227 216309 214449 212875 211660 210611 209705 209378 209924 210882 211538 211838 212344 213444 215033
55708 215033 216861 218776 220574 221923 222501 222148 220996 219441 217808 216014 213793 211174 208434 205620 202519
55693 202519 199112 195662 192407 189627 187910 187689 188445 189091 189303 189821 191216 193057 194637 195877 197082
55678 197082 198376 199764 201245 202422 202536 201384 199836 198963 198985 199427 199931 200385 200508 199824 198113 195740
55662 195740 193615 192758 193473 194860 195621 195539 195736 197248 199865 202580 204678 206020 206740 207063 207095 206490 204701
55645 204701 201769 198424 195155 191700 187772 183703 179896 176141 172057 167839 163941 160371 156922 153912
$$ packed form
55753C56404j3954j0983q095o778o518n870m868m733n633o511o833o870o514n353
55739B56891l939l427l892m344m298m082l648k568j259p82j167j284o30o8l73
55724B21130j170j733j918j860j574j215j049r06l27N46R58O56L00N06J100J589
55708B15033J828J915J798J349N78l53j152j555j633j794k221k619k740k814l101
55693B02519l407l450l255k780j717k21P56O46K12N18J395J841J580J240J205
55678A97082J294J388J481J177J14j152j548q73K2M42N04M54J23o84j711k373
55662A95740k125q57P15J387P61q2J97J512K617K715K098J342P20L23L2o05j789
55645B04701k932l345l269l455l928m069l807l755m084m218l898l570l449l010
$$ plain form
55631 153912 152002 151294 151113 150825 150464 150431 150825 151203 150963 149931 148587 147605 147229 147235 147392 147594 147583 147001 145869
55612 145869 144664 143777 143111 142286 140918 138728 135825 132967 131063 130289 130035 129754 129417 129087 128683 128268 128030
55595 128030 127815 127282 126637 126521 127027 127555 127867 128382 129081 129075 127954 126736 126713 127977 129836 132048 134718 137433
55577 137433 139550 141149 142916 145185 147827 150882 154530 158482 162046 164839 166948 168519 169676 170679
55563 170679 171586 171906 171147 169528 167575 165215 161957 157836 153460 149171 144879 140812 137668 135778 134665
55548 134665 133637 132388 130880 129151 127502 126425 126127 126348 126788 127394 128115 128720 129012 128951 128491 127630 126683
55531 126683 126147 126143 126239 125993 125407 124722 124002 123091 121752 119796 117302 114802 112938 111758 110572 108792 106725
55514 106725 105260 104801 104814 104473 103575 102653 102292 102514 102849 102830 102333 101583 101001 100946 101374 101819 101910 101861 102162 102841
$$ packed form
55631A53912j910p08j81k88l61l3L94L78k40j032j344r82l76OJ57K02j1n82j132
55612A45869j205q87o66q25j368k190k903k858j904p74k54k81l37l30m04m15k38
55595A28030k15n33o45j16N06N28L12N15O99oj121j218k3J264J859K212K670K715
55577A37433K117J599J767K269K642L055L648L952L564K793K109J571J157J003
55563A70679R07L20p59j619j953k360l258m121m376m289m292m067l144j890j113
55548A34665j028j249j508j729j649j077k98K21M40O06P21O05K92o1m60q61r47
55531A26683n36mR6k46n86o85p20r11j339j956k494k500j864j180j186j780k067
55514A06725j465m59J3l41q98r22l61K22L35j9m97p50n82n5M28M45R1m9L01O79
$$ plain form
55494 102841 103439 103755 104193 105136 106339 107239 107624 107712 107721 107631 107308 106685 105895 105320 105299 105733 106131 106175 105997 105810
55474 105810 105552 105072 104426 103815 103400 103270 103353 103305 102765 101785 100708 99602 98297 97040 96515 96917 97550 97674
55456 97674 97271 96652 95911 95251 95279 96325 97838 99055 99919 100728 101240 100880 99669 98240 97045 96182 95909
55439 95909 96576 97982 99422 100460 101233 101975 102741 103598 104552 105215 105072 104244 103514 103432 103778 104053 104116 104138 104252
55420 104252 104492 104923 105602 106467 107267 107640 107368 106672 106109 106055 106496 107354 108588 109757 109983 108897 107253 106075
55402 106075 105475 104886 104169 103761 103853 104168 104542 105036 105419 105230 104547 104106 104461 105449 106560 107344 107372 106424 104957
55383 104957 103901 103714 103976 104044 103684 103007 102298 102108 102975 104711 106445 107641 108670 109976 111166 111457 110794
55366 110794 109989 109775 110137 110588 110773 110640 110222 109493 108455 107239 105974 104618 103115 101716 100826 100371 99708
$$ packed form
55494A02841N98L16M38R43J203R00L85Q8Rr0l23o23p90n75k1M34L98M4j78j87
55474A05810k58m80o46o11m15j30Q3m8n40r80j077j106j305j257n25M02O33J24
55456I7674m03o19p41o60K8J046J513J217Q64Q09N12l60j211j429j195q63k73
55439I5909O67J406J440J038P73P42P66Q57R54O63j43q28p30q2L46K75O3K2J14
55420A04252K40M31O79Q65Q00L73k72o96n63n4M41Q58J234J169K26j086j644j178
55402A06075o00n89p17m08R2L15L74M94L83j89o83m41L55R88J111P84K8r48j467
55383A04957j056j87K62O8l60o77p09j90Q67J736J734J196J029J306J190K91o63
55366A10794q05k14L62M51J85j33m18p29j038j216j265j356j503j399q90m55o63
$$ plain form
55349 99708 98455 97086 96321 96196 96202 96100 96072 96230 96548 97153 98112 98964 99074 98474 97783 97327 96921 96522 96372
55330 96372 96370 96023 95280 94797 95069 95857 96695 97404 97867 97954 98033 98874 100539 101955 102160 101524 101159 101543 102342 103236
55310 103236 104208 105158 105868 106327 106590 106349 105181 103279 101545 100792 101103 101970 102841 103461 103911 104345 104636 104383
55292 104383 103404 102112 101209 101013 101220 101308 101099 100904 101101 101537 101568 100901 100193 100355 101349 102172 102110 101469 100918
55273 100918 100692 100755 101201 101969 102559 102564 102253 102156 102291 102284 102125 102298 103127 104354 105417 105943 105963 105809 105798 105930 106002
55252 106002 105998 106092 106238 106182 106066 106543 107895 109453 110375 110615 110595 110202 108908 106825 104911 103836 103177 102022
55234 102022 100094 98005 96599 96261 96767 97638 98630 99840 101317 102725 103532 103506 102886 102138 101648 101551 101705
55217 101705 101911 102203 102733 103332 103484 102962 102149 101485 100898 100204 99813 100435 102146 104190 105805 106861 107659
$$ packed form
55349I9708j253j369p65j25Oj02k8J58L18O05R59Q52J10o00o91m56m06l99j50
55330I6372kl47p43m83K72P88Q38P09M63Q7P9Q41J665J416K05o36l65L84P99Q94
55310A03236R72R50P10M59K63k41j168j902j734p53L11Q67Q71O20M50M34K91k53
55292A04383r79j292r03j96K07Q8k09j95J97M36L1o67p08J62R94Q23o2o41n51
55273A00918k26O3M46P68N90Nl11r7J35pj59J73Q29J227J063N26K0j54j1J32P2
55252A06002mR4J46n6j16M77J352J558R22K40k0l93j294k083j914j075o59j155
55234A02022j928k089j406l38N06Q71R92J210J477J408Q07k6o20p48m90r7J54
55217A01705K06K92N30N99J52n22q13o64n87o94l91O22J711K044J615J056P98
$$ plain form
55200 107659 108422 109130 109638 109871 110023 110448 111127 111434 110788 109481 108443 108201 108481 108895 109522 110576 111834
55183 111834 112729 112876 112327 111438 110623 110095 109768 109481 109283 109269 109197 108630 107611 106823 106787 107157 107157 106591 106080 106273
55163 106273 107130 108075 108637 108789 108802 108991 109548 110409 111210 111528 111309 110960 110906 111140 111336 111285 110924 110034 108371
55144 108371 106219 104494 103983 104639 105804 106855 107448 107427 106949 106566 106784 107512 108245 108684 108866 108775 108328 107813
55126 107813 107873 108755 109887 110456 110291 109897 109746 109743 109383 108343 106934 105945 105943 106731 107619 108279 109080 110499 112395
55107 112395 114089 115020 115147 114805 114426 114425 115099 116454 118135 119619 120527 120771 120468 119812 119021 118348 118034 118213
55089 118213 118836 119658 120324 120586 120571 120711 121270 121993 122469 122763 123331 124223 124788 124462 123552 122835 122580 122410 122083
55070 122083 121863 121999 122310 122561 122899 123536 124218 124405 123942 123208 122541 121845 120902 119842 119062 118721 118539 118107
$$ packed form
55200A07659P63P08N08K33J52M25O79L07o46j307j038k42K80M14O27J054J258
55183A11834Q95J47n49q89q15n28l27k87j98j4p2n67j019p88l6L70%n66n11J93
55163A06273Q57R45N62J52J3J89N57Q61Q01L18k19l49n4K34J96n1l61q90j663
55144A08371k152j725n11O56J165J051N93k1m78l83K18P28P33M39J82r1m47n15
55126A07813O0Q82J132N69j65l94j51ll60j040j409r89kP88Q88O60Q01J419J896
55107A12395J694R31J27l42l79jO74J355J681J484R08K44l03o56p91o73l14J79
55089A18213O23Q22O66K62j5J40N59P23M76K94N68Q92N65l26r10p17k55j70l27
55070A22083k20J36L11K51L38O37O82J87m63p34o67o96r43j060p80l41j82m32
$$ plain form
55052 118107 117295 116332 115595 115345 115566 116005 116435 116874 117466 118108 118387 118041 117409 117151 117512 118019 118042 117535 117101
55033 117101 117311 118028 118465 117976 116777 115791 115774 116675 117885 118884 119440 119378 118564 117153 115611 114336 113334
55016 113334 112354 111197 109941 108995 108894 109918 111826 114068 116173 117878 119088 119969 120889 121955 122703 122623
55000 122623 121871 121052 120372 119564 118648 118128 118245 118604 118852 119274 120309 121867 123441 124643 125314 125423 125178
54983 125178 124940 124760 124266 123207 121829 120551 119754 120065 122085 125322 128059 129082 129131 129799 131287 132162
54967 132162 131301 129222 127342 126605 126942 127527 127352 126073 124456 123672 124072 125036 125894 126438 126564 126132 125440
54950 125440 125199 125727 126518 126889 126684 126128 125418 124778 124591 125151 126388 127987 129572 130727 131187 131202 131479 132627
54932 132627 134805 137868 141494 145173 148512 151704 155300 159425 163646 167756 172178 177242 182532 187325
$$ packed form
55052A18107q12r63p37k50K21M39M30M39N92O42K79l46o32k58L61N07K3n07m34
55033A17101K10P17M37m89j199r86j7R01J210R99N56o2q14j411j542j275j002
55016A13334r80j157j256r46j01J024J908K242K105J705J210Q81R20J066P48q0
55000A22623p52q19o80q08r16n20J17L59K48M22J035J558J574J202O71J09k45
54983A25178k38j80m94j059j378j278p97L11K020L237K737J023M9O68J488Q75
54967A32162q61k079j880p37L37N85j75j279j617p84M00R64Q58N44J26m32o92
54950A25440k41N28P91L71k05n56p10o40j87N60J237J599J585J155M60J5K77J148
54932A32627K178L063L626L679L339L192L596M125M221M110M422N064N290M793
$$ plain form
54918 187325 191373 194839 197754 199996 201675 203017 203876 203661 201839 198364 193654 188334 182961 177817 172859
54903 172859 167916 162949 158247 154380 151845 150577 149969 149581 149633 150415 151419 151621 150709 149506 149007 149499
54887 149499 150800 152832 155567 158776 162251 166074 170346 174847 179315 183872 188896 194495 200236 205290
54873 205290 208842 210621 211103 210888 209855 207270 202833 197097 190741 184036 177327 171382 166670 162708 158776
54858 158776 154925 151714 149210 146927 144613 142428 140394 138350 136491 135266 134547 133439 131310 128661
54844 128661 126603 125615 125131 124310 122969 121684 121012 120881 120843 120750 120819 121077 121249 121290 121539 122034 122203 121651 120802
54825 120802 120247 119880 119300 118709 118626 118925 119038 119072 119790 121314 122701 123220 123322 123862 124855 125619 125798 125731 125988
54806 125988 126902 128419 130042 131011 130892 129996 129121 128934 129632 130967 132436 133616 134476 135191 135684 135659 135216
$$ packed form
54918A87325M048L466K915K242J679J342Q59k15j822l475m710n320n373n144m958
54903A72859m943m967m702l867k535j268o08l88N2P82J004K02r12j203m99M92
54887A49499J301K032K735L209L475L823M272M501M468M557N024N599N741N054
54873B05290L552J779M82k15j033k585m437n736o356o705o709n945m712l962l932
54858A58776l851l211k504k283k314k185k034k044j859j225p19j108k129k649
54844A28661k058r88m84q21j341j285o72j31l8r3O9K58J72M1K49M95J69n52q49
54825A20802n55l67n80n91q3K99J13L4P18J524J387N19J02N40R93P64J79o7K57
54806A25988R14J517J623R69j19q96q75j87O98J335J469J180Q60P15M93k5m43
$$ plain form
54789 135216 135009 135460 136117 136213 135690 135329 135921 137617 139974 142278 143866 144570 145049 146424 149341 153388 157568
54772 157568 161311 164982 169384 174843 180889 186814 192288 197277 201592 204991 207691 210243 212706 214386
54758 214386 214650 213596 211486 207994 202706 196187 189780 184192 178919 173356 167873 163374 160139 157674
54744 157674 155512 153708 152569 152266 152755 153742 154686 155133 155230 155646 156854 158618 160327 161715 163088 164942
54728 164942 167481 170462 173478 176410 179603 183422 187647 191522 194555 196968 199163 200976 201845 201561 200435
54713 200435 198709 196284 193143 189619 185947 181880 177151 172117 167550 163828 160679 157754 155148 153194
54699 153194 151949 151026 149869 148101 145716 143107 140911 139695 139587 140102 140441 140092 139193 138206 137353 136541
54683 136541 135826 135552 135824 136118 135778 134741 133476 132317 131228 130214 129512 129211 128978 128435 127653 127013 126679
$$ packed form
54789A35216k07M51O57R6n23l61N92J696K357K304J588P04M79J375K917M047M180
54772A57568L743L671M402N459O046N925N474M989M315L399K700K552K463J680
54758B14386K64j054k110l492n288o519o407n588n273n563n483m499l235k465
54744A57674k162j804j139l03M89R87R44M47R7M16J208J764J709J388J373J854
54728A64942K539K981L016K932L193L819M225L875L033K413K195J813Q69k84j126
54713B00435j726k425l141l524l672m067m729n034m567l722l149k925k606j954
54699A53194j245r23j157j768k385k609k196j216j08N15L39l49q99r87q53q12
54683A36541p15k74K72K94l40j037j265j159j089j014p02l01k33n43p82o40l34
$$ plain form
54666 126679 126375 125741 124799 124011 123838 124254 124773 125029 125207 125698 126443 126910 126736 126091 125316 124592 124159 124450 125602
54647 125602 126994 127819 128068 128473 129409 130372 130825 131064 131757 132862 133599 133481 132865 132372 132165 132001 131637 130908
54629 130908 129779 128637 128233 128861 129768 129876 129033 128097 127815 128115 128597 129120 129627 129908 129902 129934 130255 130651 130893
54610 130893 131258 132049 132781 132477 130891 128968 127858 127813 128239 128523 128579 128709 129192 130027 130998 131909 132664 133109
54592 133109 132982 132276 131463 131070 131088 131118 131072 131304 131941 132536 132633 132383 132229 132197 131874 131089 130228 129741 129603 129421
54572 129421 128996 128570 128525 128975 129733 130533 131153 131392 131182 130802 130734 131132 131591 131655 131381 131171 131180 131262 131401 131809 132505
54551 132505 133185 133670 134191 135027 136115 137238 138404 139782 141419 143230 145192 147289 149355 151093 152224
54536 152224 152561 152144 151438 151123 151344 151329 150203 148144 146317 145521 145288 144588 143117 141576 140744 140657 140728 140422
$$ packed form
54666A26679l04o34r42p88j73M16N19K56J78M91P45M67j74o45p75p24m33K91J152
54647A25602J392Q25K49M05R36R63M53K39O93J105P37j18o16m93k07j64l64p29
54629A30908j129j142m04O28R07J08q43r36k82L00M82N23N07K81oL2L21L96K42
54610A30893L65P91P32l04j586j923j110m5M26K84N6J30M83Q35R71R11P55M45
54592A33109j27p06q13l93J8L0m6K32O37N95R7k50j54l2l23p85q61m87j38j82
54572A29421m25m26m5M50P58Q00O20K39k10l80o8L98M59O4k74k10RQ2J39M08O96
54551A32505O80M85N21Q36J088J123J166J378J637J811J962K097K066J738J131
54536A52224L37m17p06l15K21j5j126k059j827p96k33p00j471j541q32q7P1l06
$$ plain form
54518 140422 139643 138574 137359 136066 134887 134222 134380 135245 136395 137560 138731 139724 139983 139174 137814 136867
54502 136867 136660 136649 136384 136199 136568 137169 137150 136221 134946 133960 133409 133207 133313 133584 133852 134428 136042 138855
54484 138855 141893 143963 144872 145247 145347 144729 143131 141148 139768 139495 140073 140866 141423 141838 142603 143947 145417
54467 145417 146326 146568 146689 147200 148181 149543 151213 152935 154238 154814 154665 153821 152261 150294 148639 147804
54451 147804 147597 147458 147065 146381 145397 144132 142792 141682 141037 141012 141625 142528 143139 143237 143210 143429 143649 143429 142876
54432 142876 142515 142463 142273 141671 141015 140851 141313 142124 142953 143597 144009 144316 144725 145308 145969 146652 147474 148577 149926
54413 149926 151268 152171 152220 151417 150437 150235 151240 153035 154911 156555 158095 159679 161210 162439 163137 163266
54397 163266 163072 162938 163006 163038 162773 162299 161883 161552 161109 160535 160065 159813 159649 159565 159832 160539 161229 161348 160947 160603
$$ packed form
54518A40422p79j069j215j293j179o65J58Q65J150J165J171R93K59q09j360r47
54502A36867k07j1k65j85L69O01j9r29j275r86n51k02J06K71K68N76J614K813
54484A38855L038K070R09L75J00o18j598j983j380k73N78P93N57M15P65J344J470
54467A45417R09K42J21N11R81J362J670J722J303N76j49q44j560j967j655q35
54451A47804k07j39l93o84r84j265j340j110o45k5O13R03O11R8k7K19K20k20n53
54432A42876l61n2j90o02o56j64M62Q11Q29O44M12L07M09N83O61O83Q22J103J349
54413A49926J342R03M9q03r80k02J005J795J876J644J540J584J531J229O98J29
54397A63266j94j34O8L2k65m74m16l31m43n74m70k52j64q4K67P07O90J19m01l44
$$ plain form
54377 160603 160757 161420 162494 163868 165164 165798 165648 165313 165472 166177 167045 167873 168724 169618 170551 171754 173562
54360 173562 175982 178662 181245 183512 185263 186453 187491 188991 191098 193294 194950 195798 195800 194889 193119
54345 193119 190855 188589 186579 184711 182605 179875 176499 172994 170063 168033 166752 165939 165378 164869 164409
54330 164409 164412 165292 166725 167747 167756 167054 166257 165622 165169 164967 164914 164606 163861 163052 162542 162095 161307 160354 159829 159987
54310 159987 160587 161336 162045 162480 162539 162513 162697 162822 162306 161058 159586 158303 157200 156232 155571 155326 155371 155544
54292 155544 155726 155755 155613 155703 156527 157965 159302 160064 160447 160870 161560 162646 164129 165495 165948 165419 164875 165142
54274 165142 165846 166060 165698 165576 166193 167181 168031 168711 169303 169584 169475 169532 170391 171741 172368 171466 169647 168504
54256 168504 169230 171729 174825 177131 177903 177402 176496 175774 175059 173873 172225 170610 169302 168024 166414 164440
$$ packed form
54377A60603J54O63J074J374J296O34j50l35J59P05Q68Q28Q51Q94R33J203J808
54360A73562K420K680K583K267J751J190J038J500K107K196J656Q48Kr11j770
54345A93119k264k266k010j868k106k730l376l505k931k030j281q13n61n09m60
54330A64409LQ80J433J022Rp02p97o35m53k02n3l08p45q09n10m47p88r53n25J58
54310A59987O00P49P09M35N9k6J84J25n16j248j472j283j103r68o61k45M5J73
54292A55544J82K9j42R0Q24J438J337P62L83M23O90J086J483J366M53n29n44K67
54274A65142P04K14l62j22O17R88Q50O80N92K81j09N7Q59J350O27r02j819j143
54256A68504P26K499L096K306P72n01r06p22p15j186j648j615j308j278j610j974
$$ plain form
54240 164440 162256 160039 158183 157229 157237 157544 157557 157503 158007 159169 160491 161549 162197 162297 161805 161107 160750 160815
54222 160815 160982 161172 161624 162354 163067 163676 164349 164986 165174 164859 164500 164421 164504 164710 165262 166050 166440 166072 165382
54203 165382 164939 164725 164495 164409 164755 165415 166069 166642 167066 166949 166019 164727 163879 163737 163906 163965 163841 163721 163912
54184 163912 164645 165701 166514 166979 167779 169443 171424 172710 173076 173076 173048 172898 172728 172899 173367 173664 173641 173565 173379
54165 173379 172579 171039 169342 168005 166918 165817 164777 163945 163284 162874 162969 163410 163471 162719 161644 161006 160908
54148 160908 160906 160798 160878 161607 163265 165620 167707 168395 167547 166272 165685 165806 166124 166665 167767 169120 169919 169933
54130 169933 169696 169622 169623 169702 170220 171296 172502 173410 174014 174361 174295 173881 173602 173736 173870 173502 172845 172622 173269 174719
54110 174719 176761 179067 180924 181569 181025 180246 180172 180847 181625 182011 182085 182254 182906 184255 186229 188413 190280
$$ packed form
54240A64440k184k217j856r54QL07J3n4N04J162J322J058O48J00m92o98l57O5
54222A60815J67J90M52P30P13O09O73O37J88l15l59p9Q3K06N52P88L90l68o90
54203A65382m43k14k30q6L46O60O54N73M24j17r30j292q48j42J69N9j24j20J91
54184A63912P33J056Q13M65Q00J664J981J286L66%k8j50j70J71M68K97k3p6j86
54165A73379q00j540j697j337j087j101j040q32o61m10R5M41O1p52j075o38r8
54148A60908kj08Q0P29J658K355K087O88q48j275n87J21L18N41J102J353P99J4
54130A69933k37p4JP9N18J076J206R08O04L47o6m14k79J34J34l68o57k23O47J450
54110A74719K042K306J857O45n44p79p4O75P78L86P4J69O52J349J974K184J867
$$ plain form
54093 190280 191630 192679 193592 194068 193634 192399 191225 190978 191729 192899 194087 195498 197513 200136 203015
54078 203015 205851 208542 211011 213145 214975 216718 218485 220075 221210 221915 222462 222912 222931 222243 221079 219984
54062 219984 219187 218426 217405 216187 215105 214543 214917 216548 219217 222069 224342 226191 228463 231671 235490
54047 235490 239296 242855 246351 250093 254417 259597 265543 271728 277746 283853 290682 298468 306833 315307
54033 315307 323779 332316 340804 348982 356724 364137 371388 378535 385485 391978 397555 401667 403989 404776
54019 404776 404773 404597 404141 402768 400201 396953 393714 390446 386409 381002 374291 366751 358806 350735 342740
54004 342740 334890 327127 319457 311968 304615 297202 289762 282744 276665 271716 267828 264822 262235 259310
53990 259310 255634 251718 248531 246456 245063 243841 242608 241145 239048 236340 233758 231969 230820 229807
$$ packed form
54093A90280J350J049R13M76m34j235j174k47P51J170J188J411K015K623K879
54078B03015K836K691K469K134J830J743J767J590J135P05N47M50J9o88j164j095
54062B19984p97p61j021j218j082n62L74J631K669K852K273J849K272L208L819
54047B35490L806L559L496L742M324N180N946O185O018O107O829P786Q365Q474
54033C15307Q472Q537Q488Q178P742P413P251P147O950O493N577M112K322P87
54019D04776lj76m56j373k567l248l239l268m037n407o711p540p945q071p995
54004C42740p850p763p670p489p353p413p440p018o079m949l888l006k587k925
53990B59310l676l916l187k075j393j222j233j463k097k708k582j789j149j013
$$ plain form
53976 229807 228994 228824 229173 229317 228964 228663 228892 229298 229350 229281 229813 231114 232613 233844 234905 236020 237137
53959 237137 238236 239566 241257 242978 244376 245689 247510 250051 252987 256018 259207 262734 266672 271097
53945 271097 276089 281478 286918 292437 298599 305803 313637 321289 328477 335614 343136 351052 359204 367587
53931 367587 376322 385586 395664 406810 418866 431163 442917 453594 462924 470909 477917 484462 490651
53918 490651 496140 500881 505571 510952 516873 522529 527643 532898 539048 545869 552273 557284 560742 563062
53904 563062 564460 564582 562992 559904 556140 552224 547817 542304 535698 528567 521273 513652 505395 496310
53890 496310 486300 475497 464441 453641 442973 431986 420794 410033 399843 389669 379394
53879 379394 369896 361925 355068 348527 342359 337054 332283 327091 321277 315605 310563 305765 300841 296081
$$ packed form
53976B29807q13j70L49J44l53l01K29M06N2o9N32J301J499J231J061J115J117
53959B37137J099J330J691J721J398J313J821K541K936L031L189L527L938M425
53945B71097M992N389N440N519O162P204P834P652P188P137P522P916Q152Q383
53931C67587Q735R264J0078J1146J2056J2297J1754J0677R330P985P008O545O189
53918D90651N489M741M690N381N921N656N114N255O150O821O404N011L458K320
53904E63062J398J22j590l088l764l916m407n513o606p131p294p621q257r085
53890D96310j0010j0803j1056j0800j0668j0987j1192j0761j0190j0174j0275
53879C79394r498p971o857o541o168n305m771n192n814n672n042m798m924m760
$$ plain form
53865 296081 291806 287778 283725 279898 276628 273747 270930 268250 265940 263939 262114 260594 259417 258151
53851 258151 256361 254156 251713 248613 244456 239997 236761 235345 234856 234301 233757 233629 233474 232423 230519
53836 230519 228843 228234 228484 228989 229570 230279 230780 230541 229597 228709 228604 229353 230641 232313 234403 236796 239246
53819 239246 241684 244172 246583 248699 250719 253316 256976 261504 266369 271262 276154 281106 286326 292138
53805 292138 298548 305078 311447 318183 326002 334686 343095 350376 356716 362812 369035 375212 380793 385061
53791 385061 387635 388977 390074 391432 392761 393726 394440 394848 394182 391662 387481 382487 377086 371077 364478
53776 364478 357871 351657 345502 338783 331378 323793 316706 310529 305187 300129 294694 288700 282684 277454
53762 277454 273374 270132 267148 264110 261088 258196 255362 252542 250012 248165 246989 245983 244695 243097
$$ packed form
53865B96081m275m028m053l827l270k881k817k680k310k001j825j520j177j266
53851B58151j790k205k443l100m157m459l236j416m89n55n44j28j55j051j904
53836B30519j676o09K50N05N81P09N01k39r44q88j05P49J288J672K090K393K450
53819B39246K438K488K411K116K020K597L660M528M865M893M892M952N220N812
53805B92138O410O530O369O736P819Q684Q409P281O340O096O223O177N581M268
53791C85061K574J342J097J358J329R65P14M08o66k520m181m994n401o009o599
53776C64478o607o214o155o719p405p585p087o177n342n058n435n994o016n230
53762B77454m080l242k984l038l022k892k834k820k530j847j176j006j288j598
$$ plain form
53748 243097 241371 239602 237872 236336 234898 233078 230600 227925 225783 224288 222960 221592 220630 220607 221528
53733 221528 222912 224109 224577 224247 223765 223962 224878 225656 225648 225275 225462 226473 227699 228475 228718 228797 229115 229919
53715 229919 231283 233158 235455 238125 241084 244104 246872 249116 250639 251319 251245 250895 251032 252242 254490
53700 254490 257173 259699 262005 264433 267151 269943 272593 275172 277728 280016 281891 283717 285886 288041
53686 288041 289376 289689 289617 289649 289561 288981 287973 286700 285129 283531 282720 283116 283875 283709 282416 281001 280353
53669 280353 280445 280789 281025 280949 280572 280356 280859 281910 282581 282196 280919 279183 277128 275084 274030 274835 277110
53652 277110 279389 280473 280339 279802 279759 280729 282637 284776 286274 286828 286901 287183 288052 289581 291715 294230 296738
53635 296738 299056 301424 304050 306525 308060 308413 308291 308678 309943 311793 313867 316038 318240 320366 322427
$$ packed form
53748B43097j726j769j730j536j438j820k478k675k142j495j328j368r62k3R21
53733B21528J384J197M68l30m82J97R16P78ql73J87J011J226P76K43P9L18Q04
53715B29919J364J875K297K670K959L020K768K244J523O80p4l50J37J210K248
53700B54490K683K526K306K428K718K792K650K579K556K288J875J826K169K155
53686B88041J335L13p2L2q8n80j008j273j571j598q11L96P59j66j293j415o48
53669B80353R2L44K36p6l77k16N03J051O71l85j277j736k055k044j054Q05K275
53652B77110K279J084j34n37m3R70J908K139J498N54P3K82Q69J529K134K515K508
53635B96738K318K368K626K475J535L53j22L87J265J850K074K171K202K126K061
$$ plain form
53620 322427 324593 327009 329761 333042 337005 341352 345422 348985 352700 357366 362855 368188 372665 376519
53606 376519 380312 384088 387418 390141 392727 395846 399654 403592 406942 409577 412029 414701 417144 418430
53592 418430 418234 417296 416681 416742 416889 416227 414340 411633 408986 406974 405365 403533 401320 399178 397439 395847
53576 395847 394083 392395 391278 390740 390274 389457 388134 386115 383258 380052 377608 376691 376956 377445 377674 377899
53560 377899 378367 378773 378687 378250 378064 378353 378543 377977 376913 376408 377101 378459 379551 380283 381356 383122 385124
53543 385124 386988 389190 392390 396352 400124 403238 406165 409475 413167 417108 421643 427177 433349 439241
53529 439241 444544 450050 456769 464839 473597 482510 491637 501250 511373 521850 532638 543833 555573
53516 555573 568076 581671 596587 612681 629511 646675 663988 681362 698775 716423 734670
$$ packed form
53620C22427K166K416K752L281L963M347M070L563L715M666N489N333M477L854
53606C76519L793L776L330K723K586L119L808L938L350K635K452K672K443J286
53592D18430j96r38o15O1J47o62j887k707k647k012j609j832k213k142j739j592
53576C95847j764j688j117n38m66q17j323k019k857l206k444r17K65M89K29K25
53560C77899M68M06q6m37j86K89J90n66j064n05O93J358J092P32J073J766K002
53543C85124J864K202L200L962L772L114K927L310L692L941M535N534O172N892
53529D39241N303N506O719Q070Q758Q913R127R613J0123J0477J0788J1195J1740
53516E55573J2503J3595J4916J6094J6830J7164J7313J7374J7413J7648J8247
$$ plain form
53505 734670 753620 772813 791576 809646 827267 844667 861702 878125 894043 909869 925896
53494 925896 942041 957970 973281 987610 1000858 1013481 1026353 1040107 1054598 1069115 1083107
53483 1083107 1096605 1109973 1123443 1136924 1150084 1162466 1173592 1183078 1190711 1196469 1200626 1203892
53471 1203892 1207166 1210823 1214165 1215801 1214747 1211145 1205928 1199952 1193511 1186447 1178498 1169539 1159625 1148890
53457 1148890 1137415 1125317 1112945 1100736 1088714 1076376 1063432 1050457 1038375 1027268 1016201
53446 1016201 1004323 991697 978880 966215 953965 942735 933135 925181 918500 913071 909260 907137
53434 907137 906274 906251 906908 908032 909298 910773 912993 916254 920216 924560 929681 936288 944542 953987 964177
53419 964177 975020 986611 999139 1012862 1027822 1043653 1060085 1077545 1096807 1117958 1140152
$$ packed form
53505G34670J8950J9193J8763J8070J7621J7400J7035J6423J5918J5826J6027
53494I25896J6145J5929J5311J4329J3248J2623J2872J3754J4491J4517J3992
53483A083107J3498J3368J3470J3481J3160J2382J1126R486P633N758M157L266
53471A203892L274L657L342J636j054l602n217n976o441p064p949q959r914j0735
53457A148890j1475j2098j2372j2209j2022j2338j2944j2975j2082j1107j1067
53446A016201j1878j2626j2817j2665j2250j1230r600p954o681n429l811k123
53434I07137q63k3O57J124J266J475K220L261L962M344N121O607Q254R445J0190
53419I64177J0843J1591J2528J3723J4960J5831J6432J7460J9262K1151K2194
$$ plain form
53408 1140152 1162569 1185258 1208826 1233624 1259628 1286921 1315882 1346771 1379355 1413048 1447385
53397 1447385 1482339 1518214 1555223 1593183 1631677 1670489 1709771 1749735 1790290 1831069 1871749
53386 1871749 1912128 1951889 1990422 2027081 2061570 2093921 2124119 2151998 2177565 2201103 2222614
53375 2222614 2241364 2256456 2267797 2275996 2281202 2282692 2279928 2273439 2264028 2251488 2234836 2213752
53363 2213752 2189099 2161928 2132609 2101185 2068058 2033914 1999260 1964373 1929540 1895051 1861051
53352 1861051 1827594 1794849 1763186 1733116 1705029 1678720 1653256 1627714 1602131 1577346 1553765
53341 1553765 1530769 1507643 1484671 1462815 1442613 1423938 1406724 1391258 1377591 1365134 1353178
53330 1353178 1341538 1330372 1319550 1308586 1297290 1286171 1275936 1266632 1257495 1247630 1236647 1224595
$$ packed form
53408A140152K2417K2689K3568K4798K6004K7293K8961L0889L2584L3693L4337
53397A447385L4954L5875L7009L7960L8494L8812L9282L9964M0555M0779M0680
53386A871749M0379L9761L8533L6659L4489L2351L0198K7879K5567K3538K1511
53375B222614J8750J5092J1341Q199N206J490k764o489r411j2540j6652k1084
53363B213752k4653k7171k9319l1424l3127l4144l4654l4887l4833l4489l4000
53352A861051l3457l2745l1663l0070k8087k6309k5464k5542k5583k4785k3581
53341A553765k2996k3126k2972k1856k0202j8675j7214j5466j3667j2457j1956
53330A353178j1640j1166j0822j0964j1296j1119j0235r304r137r865j0983j2052
$$ plain form
53318 1224595 1211650 1198236 1185224 1173503 1163243 1153871 1144856 1136201 1128109 1120578 1113619 1107575 1102936
53305 1102936 1099959 1098629 1098742 1099825 1101306 1103132 1106080 1111139 1118660 1128288 1139502 1151878 1165052
53292 1165052 1178900 1193658 1209430 1225640 1241428 1256619 1271733 1286864 1301052 1313185 1323212
53281 1323212 1332004 1340123 1347146 1352264 1355256 1356651 1357065 1356519 1354408 1350054 1343248 1334327 1323855 1312307
53267 1312307 1299927 1286726 1272571 1257284 1240733 1222842 1203671 1183542 1163014 1142604 1122503
53256 1122503 1102563 1082563 1062463 1042503 1023028 1004171 985730 967545 949904 933258 917491
53245 917491 901883 886051 870527 855939 841912 827364 811953 796694 782985 771261 760718
53234 760718 750094 738643 726637 715102 704926 696054 687605 678798 669586 660383 651396 642357 632803
$$ packed form
53318A224595j2945j3414j3012j1721j0260r372r015q655q092p531o959o044m639
53305A102936k977j330J13J083J481J826K948N059P521R628J1214J2376J3174
53292A165052J3848J4758J5772J6210J5788J5191J5114J5131J4188J2133J0027
53281A323212Q792Q119P023N118K992J395M14n46k111m354o806q921j0472j1548
53267A312307j2380j3201j4155j5287j6551j7891j9171k0129k0528k0410k0101
53256A122503j9940k0000k0100j9960j9475j8857j8441j8185j7641j6646j5767
53245I17491j5608j5832j5524j4588j4027j4548j5411j5259j3709j1724j0543
53234G60718j0624j1451j2006j1535j0176q872q449q807r212r203q987r039r554
$$ plain form
53221 632803 622495 611631 600595 589447 577800 565413 552746 540544 528856 516900 504088
53210 504088 490891 478458 467550 458036 449250 440548 431573 422248 412681 403131 394025 385870 378903
53197 378903 372804 366894 360628 353789 346302 338147 329546 320998 313040 306081 300424 296175 293033 290398
53183 290398 287785 285000 281955 278670 275484 272872 270842 268871 266636 264481 262875 261718 260530 259097
53169 259097 257548 255950 254201 252273 250302 248460 246929 245824 244887 243519 241476 239422 238327 238337 238675
53154 238675 238652 238336 238114 238056 237976 237827 237729 237761 237934 238214 238391 238122 237365 236691 236833 237886 239129 239802 239934 240243
53134 240243 241224 242558 243543 243966 244265 244829 245482 245878 246170 246890 248206 249637 250647 251261 251910 252828 253824
53117 253824 254664 255446 256467 257725 258686 258721 257790 256628 256160 256711 257782 258503 258292 257241 255991 255187 254914
$$ packed form
53221F32803j0308j0864j1036j1148j1647j2387j2667j2202j1688j1956j2812
53210E04088j3197j2433j0908r514q786q702q975r325r567r550r106q155o967
53197C78903o099n910o266o839p487q155q601q548p958o959n657m249l142k635
53183B90398k613k785l045l285l186k612k030j971k235k155j606j157j188j433
53169B59097j549j598j749j928j971j842j531j105r37j368k043k054j095J0L38
53154B38675k3l16k22n8q0j49r8L2J73K80J77k69p57o74J42J053J243O73J32L09
53134B40243R81J334R85M23K99N64O53L96K92P20J316J431J010O14O49R18R96
53117B53824Q40P82J021J258R61L5r31j162m68N51J071P21k11j051j250q04k73
$$ plain form
53100 254914 254707 254113 253138 252043 250920 249635 248126 246469 244747 243084 241742 240921 240386 239581 238244 236776
53084 236776 235883 236004 237099 238728 240191 240789 240275 239091 238036 237649 237944 238632 239401 239975 240123 239819 239315
53067 239315 238908 238569 237988 237031 235988 235209 234640 234001 233342 233083 233416 234037 234604 235133 235711 236146 236281 236370 236692
53048 236692 236975 236747 236209 236132 236812 237671 238158 238481 239048 239605 239503 238638 237605 236959 236737 236729 236814 236890 236790 236467
53028 236467 236090 235807 235569 235272 234961 234800 234950 235525 236539 237717 238524 238636 238396 238546 239413 240515 241102 240929
53010 240929 240344 239737 239226 238898 239037 239846 241079 242134 242530 242190 241352 240317 239308 238469 237988 238118 238870
52993 238870 239705 239889 239352 238911 239319 240404 241575 242950 245270 248616 251870 253805 254279 254020 253639 253324
52977 253324 253226 253560 254345 255410 256728 258402 260312 262043 263281 264028 264409 264448 264141 263567 262836 262023 261217
$$ packed form
53100B54914k07n94r75j095j123j285j509j657j722j663j342q21n35q05j337j468
53084B36776q93J21J095J629J463N98n14j184j055l87K95O88P69N74J48l04n04
53067B39315m07l39n81r57j043p79n69o39o59k59L33O21N67N29N78M35J35Q9L22
53048B36692K83k28n38p7O80Q59M87L23N67N57j02q65j033o46k22qQ5P6j00l23
53028B36467l77k83k38k97l11j61J50N75J014J178Q07J12k40J50Q67J102N87j73
53010B40929n85o07n11l28J39Q09J233J055L96l40q38j035j009q39m81J30P52
52993B38870Q35J84n37m41M08J085J171J375K320L346L254J935M74k59l81l15
52977B53324r8L34P85J065J318J674J910J731J238P47L81L9l07n74p31q13q06
$$ plain form
52960 261217 260520 259960 259513 259203 258997 258581 257492 255668 253710 252344 251688 251297 250851 250503 250404 250189 249277 247641
52942 247641 245927 244766 244144 243590 242782 241823 241065 240859 241358 242347 243297 243763 243674 243148 242207 240967 239975 239911
52924 239911 240850 242125 243015 243319 243215 242902 242600 242578 242874 243134 242972 242415 241776 241249 240847 240633 240739 241128 241462
52905 241462 241295 240470 239422 239006 239725 241125 242216 242562 242576 242658 242584 242060 241387 241040 240926 240677 240500 241046 242434
52886 242434 243998 245132 245858 246395 246649 246386 245602 244489 243300 242417 242268 242934 244014 245028 245805 246399 246902
52869 246902 247504 248558 250306 252659 255297 257902 260218 262108 263677 265165 266559 267477 267589 267031 266258
52854 266258 265544 264772 263629 261914 259703 257309 255049 253066 251344 249796 248242 246432 244261 241947 239822
52839 239822 238009 236388 234746 232799 230311 227525 225244 224124 223976 224153 224388 224727 224867 224345 223388 222772
$$ packed form
52960B61217o97n60m47l10k06m16j089j824j958j366o56l91m46l48r9k15r12j636
52942B47641j714j161o22n54q08r59p58k06M99R89R50M66q9n26r41j240r92o4
52924B39911R39J275Q90L04j04l13l02k2K96K60j62n57o39n27m02k14J06L89L34
52905B41462j67q25j048m16P19J400J091L46J4Q2p4n24o73l47j14k49j77N46J388
52886B42434J564J134P26N37K54k63p84j113j189q83j49O66J080J014P77N94N03
52869B46902O02J054J748K353K638K605K316J890J569J488J394R18J12n58p73
52854B66258p14p72j143j715k211k394k260j983j722j548j554j810k171k314k125
52839B39822j813j621j642j947k488k786k281j120j48J77K35L39J40n22r57o16
$$ plain form
52823 222772 222701 222588 222229 222326 223393 224877 225921 226364 226347 225640 224192 222818 222382 222572 222423 221870 221853 222868
52805 222868 224304 225381 225986 226365 226576 226460 225725 224016 221416 218907 217688 217916 218641 219040 219053 218781 218120
52788 218120 217352 217228 217959 218741 218852 218652 218868 219371 219441 218972 218649 218979 219764 220579 221252 221811 222295 222714 222921
52769 222921 222639 221877 221243 221414 222346 223272 223486 222832 221477 219693 218003 217143 217535 218819 220101 220676 220599
52752 220599 220629 221637 223925 227071 230365 233265 235435 236659 237014 236994 237175 237776 238695 239791 240868 241529
52736 241529 241484 241001 240701 240821 240996 240895 240698 240702 240777 240579 240156 239920 239971 239804 238897 237359 235763 234427 233129
52717 233129 231533 229631 227657 225831 224436 223919 224593 226213 228139 229915 231431 232539 232887 232320 231196
52702 231196 230140 229655 230035 231285 232863 233826 233621 232667 231908 231876 232361 232835 232901 232473 231864 231631 232062 232825
$$ packed form
52823B22772p1j13l59R7J067J484J044M43j7p07j448j374m36J90j49n53j7J015
52805B22868J436J077O05L79K11j16p35j709k600k509j219K28P25L99J3k72o61
52788B18120p68j24P31P82J11k00K16N03P0m69l23L30P85Q15O73N59M84M19K07
52769B22921k82p62o34J71R32R26K14o54j355j784j690q60L92J284J282N75p7
52752B20599L0J008K288L146L294K900K170J224L55k0J81O01R19J096J077O61
52736B41529m5m83l00J20J75j01j97MP5j98m23k36N1j67r07j538j596j336j298
52717B33129j596j902j974j826j395n17O74J620J926J776J516J108L48n67j124
52702B31196j056m85L80J250J578R63k05r54p59l2M85M74O6m28o09k33M31P63
$$ plain form
52684 232825 233383 233737 234426 235735 237220 238181 238385 238178 237969 237822 237584 237294 237245 237518 237604 236830 235234 233749
52666 233749 233313 234013 235245 236496 237680 238900 240216 241570 242745 243534 244139 245188 247053 249285 251053
52651 251053 252001 252355 252375 252096 251526 250693 249582 248345 247456 247218 247209 246665 245389 243847 242450 241286 240544 240622
52633 240622 241639 243276 245153 246910 247961 247872 247159 247028 247985 249360 250490 251644 253158 254332 254072 252368
52617 252368 250385 249165 248827 249005 249416 249874 250207 250406 250605 250887 251265 251773 252337 252610 252272 251504 250879 250736
52599 250736 250872 250885 250632 250319 250254 250588 251253 252176 253501 255379 257528 259270 260205 260627 261119 261951 262989 263925
52581 263925 264387 264145 263489 263138 263499 264254 264929 265517 266164 266593 266367 265504 264377 263173 261951 261012 260620 260425
52563 260425 259770 258569 257381 256592 256068 255627 255320 255119 254836 254473 254204 253909 253249 252377 251989 252411 253039 253026
$$ packed form
52684B32825N58L54O89J309J485R61K04k07k09j47k38k90m9K73Q6p74j596j485
52666B33749m36P00J232J251J184J220J316J354J175P89O05J049J865K232J768
52651B51053R48L54K0k79n70q33j111j237q89k38rn44j276j542j397j164p42P8
52633B40622J017J637J877J757J051q9p13j31R57J375J130J154J514J174k60j704
52617B52368j983j220l38J78M11M58L33J99J99K82L78N08N64K73l38p68o25j43
52599B50736J36J3k53l13o5L34O65R23J325J878K149J742R35M22M92Q32J038R36
52581B63925M62k42o56l51L61P55O75N88O47M29k26q63j127j204j222r39l92j95
52563B60425o55j201j188p89n24m41l07k01k83l63k69k95o60q72l88M22O28j3
$$ plain form
52545 253026 252236 251244 250670 250725 251172 251510 251402 250991 250627 250298 249741 249048 248681 248748 248883 249021 249633 250856 252031
52526 252031 252622 253068 254106 255641 256948 257767 258533 259684 261384 263792 266916 270124 272450 273666 274629
52511 274629 276309 278729 281087 282742 283855 285166 287138 289285 290442 289860 287957 285820 284070 282529
52497 282529 280859 279097 277425 275740 273726 271283 268767 266759 265551 264815 263927 262696 261665 261524 262382
52482 262382 263781 265197 266314 267018 267441 267896 268484 268874 268837 268772 269334 270633 272281 274108 276258 278599 280695
52465 280695 282534 284707 287531 290440 292572 293629 293893 293750 293487 293227 292766 291764 290280 288697 286949
52450 286949 284439 281168 278267 276665 275683 273904 271171 268691 267162 265886 264118 262304 261380 261524 262329
52435 262329 263665 265516 267236 267806 266958 265511 264526 264491 265269 266365 267139 267212 266812 266512 266587 266958 267723 269214
$$ packed form
52545B53026p90r92n74N5M47L38j08m11l64l29n57o93l67O7J35J38O12J223J175
52526B52031N91M46J038J535J307Q19P66J151J700K408L124L208K326J216R63
52511B74629J680K420K358J655J113J311J972K147J157n82j903k137j750j541
52497B82529j670j762j672j685k014k443k516k008j208p36q88j231j031j41Q58
52482B62382J399J416J117P04M23M55N88L90l7o5N62J299J648J827K150K341K096
52465B80695J839K173K824K909K132J057K64j43k63k60m61j002j484j583j748
52450B86949k510l271k901j602r82j779k733k480j529j276j768j814r24J44Q05
52435B62329J336J851J720N70q48j447r85l5P78J096P74P3m00l00P5L71P65J491
$$ plain form
52417 269214 271397 273740 275954 278432 281546 284866 287579 289529 291356 293686 296595 299876 303390 307068
52403 307068 310846 314698 318509 321859 324214 325371 325486 324626 322628 319540 315920 312429 309308 306460 303900
52388 303900 301904 300743 300420 300665 301148 301812 303033 305256 308317 311359 313648 315382 317473 320563 324450
52373 324450 328431 331992 335152 338295 341730 345318 348546 351013 352806 354282 355615 356753 357701 358595 359394
52358 359394 359790 359607 359153 359033 359609 360790 362316 364146 366482 369472 372963 376622 380253 383905 387678
52343 387678 391541 395428 399433 403784 408661 414117 420153 426805 434185 442480 451883 462389 473713 485537
52329 485537 497887 511244 526245 543239 562000 581786 601785 621645 641611 662087 683140
52318 683140 704453 725647 746529 767121 787709 808798 830789 853557 876517 899199 921626
$$ packed form
52417B69214K183K343K214K478L114L320K713J950J827K330K909L281L514L678
52403C07068L778L852L811L350K355J157J15q60j998l088l620l491l121k848k560
52388C03900j996j161l23K45M83O64J221K223L061L042K289J734K091L090L887
52373C24450L981L561L160L143L435L588L228K467J793J476J333J138R48Q94P99
52358C59394L96j83m54j20N76J181J526J830K336K990L491L659L631L652L773
52343C87678L863L887M005M351M877N456O036O652P380Q295R403J0506J1324J1824
52329D85537J2350J3357J5001J6994J8761J9786J9999J9860J9966K0476K1053
52318F83140K1313K1194K0882K0592K0588K1089K1991K2768K2960K2682K2427
$$ plain form
52307 921626 944056 966444 988327 1009137 1028494 1046226 1062323 1076982 1090541 1103159 1114560
52296 1114560 1124186 1131606 1136627 1139052 1138660 1135626 1130714 1124717 1117790 1109689 1100603 1091327 1082532 1074259
52282 1074259 1066307 1058654 1051362 1044487 1038524 1034517 1033161 1033974 1035839 1038314 1041953 1047426 1054865 1064077
52268 1064077 1074856 1086930 1100034 1114195 1129561 1145724 1161659 1176650 1191032 1205756 1221365
52257 1221365 1237570 1253571 1268520 1281875 1293609 1304072 1313437 1321370 1327299 1330885 1332114 1331149 1328210
52244 1328210 1323410 1316499 1306980 1294682 1280066 1263781 1246178 1227547 1208561 1190035 1172240 1154776
52232 1154776 1137126 1119009 1100318 1081211 1062441 1045128 1029821 1015992 1002791 990156 978828
52221 978828 969284 961084 953474 946340 940235 935590 932265 929883 928227 927147 926413 925983 926221 927461 929440
$$ packed form
52307I21626K2430K2388K1883K0810J9357J7732J6097J4659J3559J2618J1401
52296A114560R626P420N021K425l92l034m912n997o927q101r086r276q795q273
52282A074259p952p653p292o875n963m007j356Q13J865K475L639N473P439R212
52268A064077J0779J2074J3104J4161J5366J6163J5935J4991J4382J4724J5609
52257A221365J6205J6001J4949J3355J1734J0463R365P933N929L586J229r65k939
52244A328210m800o911r519j2298j4616j6285j7603j8631j8986j8526j7795j7464
52232A154776j7650j8117j8691j9107j8770j7313j5307j3829j3201j2635j1328
52221I78828r544q200p610p134o105m645l325k382j656j080p34m30K38J240J979
$$ plain form
52206 929440 931502 933324 935083 937042 939437 942729 947299 952610 957288 960531 963046 966074 969861 973667
52192 973667 977053 980321 983683 986764 989216 991200 992826 993547 992601 989844 985673 980300 973662 966029 958224
52177 958224 950946 944200 937596 931008 924630 918621 913145 908711 905987 905025 905026 905178 905470 906297 907559 908736
52161 908736 909813 911496 914268 917718 921122 924267 927335 930266 932721 934555 935942 937101 938191 939420
52147 939420 940956 942784 944895 947519 950942 955192 960197 966113 973135 981048 989316 997659 1006244 1015358
52133 1015358 1025285 1036495 1049560 1064757 1082013 1101272 1122611 1145971 1171110 1197910 1226390
52122 1226390 1256280 1286910 1317665 1348268 1378561 1408348 1437562 1466202 1493915 1520032 1544257
52111 1544257 1566938 1588313 1607884 1624940 1639476 1652068 1663026 1672144 1679265 1684611 1688416 1690566
$$ packed form
52206I29440K062J822J759J959K395L292M570N311M678L243K515L028L787L806
52192I73667L386L268L362L081K452J984J626P21r46k757m171n373o638p633p805
52177I58224p278o746o604o588o378o009n476m434k724r62JJ52K92Q27J262J177
52161I08736J077J683K772L450L404L145L068K931K455J834J387J159J090J229
52147I39420J536J828K111K624L423M250N005N916P022P913Q268Q343Q585R114
52133A015358R927J1210J3065J5197J7256J9259K1339K3360K5139K6800K8480
52122A226390K9890L0630L0755L0603L0293K9787K9214K8640K7713K6117K4225
52111A544257K2681K1375J9571J7056J4536J2592J0958R118P121N346L805K150
$$ plain form
52099 1690566 1690718 1688571 1683955 1676903 1667736 1656876 1644386 1629869 1612934 1593744 1572998 1551436
52087 1551436 1529502 1507518 1486066 1465969 1447816 1431558 1416708 1402930 1390371 1379519 1370919
52076 1370919 1364950 1361683 1360902 1362512 1366853 1374380 1384938 1397643 1411629 1426638 1442743 1459782 1477318
52063 1477318 1494964 1512496 1529778 1546803 1563674 1580330 1596320 1611029 1624062 1635340 1644988
52052 1644988 1653197 1659909 1664431 1665640 1662853 1656308 1646616 1634061 1618836 1601648 1583438 1564488 1544275
52039 1544275 1522324 1498837 1474387 1449366 1423910 1398148 1372347 1346931 1322338 1298732 1275914
52028 1275914 1253727 1232431 1212346 1193262 1174599 1156174 1138427 1121751 1106030 1090972 1076585
$$ packed form
52099A690566J52k147m616p052r167j0860j2490j4517j6935j9190k0746k1562
52087A551436k1934k1984k1452k0097j8153j6258j4850j3778j2559j0852q600
52076A370919n969l267p81J610M341P527J0558J2705J3986J5009J6105J7039J7536
52063A477318J7646J7532J7282J7025J6871J6656J5990J4709J3033J1278R648
52052A644988Q209O712M522J209k787o545r692j2555j5225j7188j8210j8950k0213
52039A544275k1951k3487k4450k5021k5456k5762k5801k5416k4593k3606k2818
52028A275914k2187k1296k0085j9084j8663j8425j7747j6676j5721j5058j4387
$$ [...]
##END NTUPLES=NMR SPECTRUM
##END=
