##TITLE=AC1771_BRADRY_9683836_JopLPTxuFu
##JCAMPDX= 6.0         $$ Bruker NMR JCAMP-DX V2.0
##DATA TYPE= NMR SPECTRUM
##DATA CLASS= NTUPLES
##ORIGIN= BRUKER
##OWNER= Administrator
$$ 1.72 TOPSPIN		Version 2.1
$$ 2016-04-16 19:13:13.736 -0700  Administrator@X
$$ Compression mode = diff/dup
##.OBSERVE FREQUENCY= 400.02188249412
##.OBSERVE NUCLEUS= ^1H
##.ACQUISITION MODE= SIMULTANEOUS (DQD)
##.ACQUISITION SCHEME= undefined
##.AVERAGES= 8
##.DIGITISER RES= 22
##SPECTROMETER/DATA SYSTEM= spect
##.PULSE SEQUENCE= zg30
##.SOLVENT NAME= COFFEE_meoh
##.SHIFT REFERENCE= INTERNAL, COFFEE_meoh, 1, 14.98509
##AUDIT TRAIL= $$ (NUMBER, WHEN, WHO, WHERE, PROCESS, VERSION, WHAT)
$$ ##TITLE= Audit trail, TOPSPIN		Version 2.1
$$ ##JCAMPDX= 5.01
$$ ##ORIGIN= Bruker BioSpin GmbH
$$ ##OWNER= Administrator
$$ $$ E:\/data/COFFEE/nmr/AC1771_BRADRY_9683836_JopLPTxuFu/10/pdata/1/auditp.txt
$$ ##AUDIT TRAIL=  $$ (NUMBER, WHEN, WHO, WHERE, PROCESS, VERSION, WHAT)
(   1,<2016-04-16 19:13:06.626 -0700>,<Administrator>,<X>,<go>,<TOPSPIN 2.1>,
      <created by zg
	started at 2016-04-16 19:12:00.798 -0700,
	POWCHK enabled, PULCHK disabled,
       configuration hash MD5:
       21 0F 79 D6 B3 7B B4 F6 88 20 88 DB 03 48 BD 9F
       data hash MD5: 64K
       7D 45 79 1D A9 66 F8 9A 3B 64 78 6A F6 73 23 E3>)
(   2,<2016-04-16 19:13:09.704 -0700>,<Administrator>,<X>,<proc1d>,<TOPSPIN 2.1>,
      <Start of raw data processing
       efp LB = 0 FT_mod = 6 PKNL = 1 PHC0 = 0 PHC1 = 0 SI = 32K 
       data hash MD5: 32K
       64 00 79 48 AB 2B C1 25 3A 27 E8 87 8C 8E B7 D6>)
(   3,<2016-04-16 19:13:09.986 -0700>,<Administrator>,<X>,<proc1d>,<TOPSPIN 2.1>,
      <pk PHC0 = 87.35229 PHC1 = 0 
       data hash MD5: 32K
       85 9F 37 BF A6 12 60 33 A4 96 AC 22 F1 6F 16 EF>)
(   4,<2016-04-16 19:13:10.095 -0700>,<Administrator>,<X>,<proc1d>,<TOPSPIN 2.1>,
      <abs ABSG = 1 
       data hash MD5: 32K
       A1 15 FC 19 68 14 B6 B2 B9 2E E4 EA 8C AC DA DE>)
(   5,<2016-04-16 19:13:10.158 -0700>,<Administrator>,<X>,<proc1d>,<TOPSPIN 2.1>,
      <abs ABSG = 2 
       data hash MD5: 32K
       03 0E E4 08 3D EF E0 4C 10 63 86 65 2F 36 C8 9E>)
(   6,<2016-04-16 19:13:10.220 -0700>,<Administrator>,<X>,<proc1d>,<TOPSPIN 2.1>,
      <abs ABSG = 3 
       data hash MD5: 32K
       99 99 6C 18 33 34 61 A8 D9 0E E9 4E B1 E6 2B 2F>)
(   7,<2016-04-16 19:13:10.283 -0700>,<Administrator>,<X>,<proc1d>,<TOPSPIN 2.1>,
      <abs ABSG = 4 
       data hash MD5: 32K
       7F A6 15 A5 AC FF 5F C6 5B 4D 67 DE D0 31 B9 0F>)
(   8,<2016-04-16 19:13:10.345 -0700>,<Administrator>,<X>,<proc1d>,<TOPSPIN 2.1>,
      <abs ABSG = 5 
       data hash MD5: 32K
       A5 60 CC 4D BE F8 5E 23 AF 91 22 0F 0D A0 31 CF>)
$$ ##END=
$$ 
$$ $$ hash MD5
$$ $$ 20 EA A7 C9 B4 43 63 19 10 D4 03 72 97 B6 0E B2
##$RELAX= 
##$RELAX= 
##$RELAX= 
##$RELAX= 
##$RELAX= 
##$RELAX= 
##$RELAX= 
$$ Bruker specific parameters
$$ --------------------------
##$DU= <E:\>
##$EXPNO= 10
##$NAME= <AC1771_BRADRY_9683836_JopLPTxuFu>
##$PROCNO= 1
$$ [...]
150 150 150 150 150 150 150 150
##$TP07= 0
##$TPNAME0= <>
##$TPNAME1= <>
##$TPNAME2= <>
##$TPNAME3= <>
##$TPNAME4= <>
##$TPNAME5= <>
##$TPNAME6= <>
##$TPNAME7= <>
##$TPOAL= (0..7)
0.5 0.5 0.5 0.5 0.5 0.5 0.5 0.5
##$TPOFFS= (0..7)
0 0 0 0 0 0 0 0
##$TUNHIN= 0
##$TUNHOUT= 0
##$TUNXOUT= 0
##$USERA1= <user>
##$USERA2= <user>
##$USERA3= <user>
##$USERA4= <user>
##$USERA5= <user>
##$V9= 5
##$VALIST= <valist>
##$VCLIST= <CCCCCCCCCCCCCCC>
##$VD= 0
##$VDLIST= <DDDDDDDDDDDDDDD>
##$VPLIST= <PPPPPPPPPPPPPPP>
##$VTLIST= <TTTTTTTTTTTTTTT>
##$WBST= 2048
##$WBSW= 25
##$XGAIN= (0..3)
0 0 0 0
##$XL= 0
##$YL= 0
##$YMAX_a= 546866
##$YMIN_a= -482079
##$ZGOPTNS= <>
##$ZL1= 120
##$ZL2= 120
##$ZL3= 120
##$ZL4= 120
##$ABSF1= 14.98509
##$ABSF2= -5.573092
##$ABSG= 5
##$ABSL= 3
##$ALPHA= 0
##$AQORDER= 0
##$ASSFAC= 0
##$ASSFACI= 0
##$ASSFACX= 0
##$ASSWID= 0
##$AUNMP= <proc_prof1d_extract_pilot.lims>
##$AXLEFT= 0
##$AXNAME= <>
##$AXNUC= <1H>
##$AXRIGHT= 0
##$AXTYPE= 0
##$AXUNIT= <>
##$AZFE= 0.1
##$AZFW= 0.1
##$BCFW= 0
##$BC_mod= 0
##$BYTORDP= 0
##$COROFFS= 0
##$CY= 15
##$DATMOD= 1
##$DC= 0
##$DFILT= <>
##$DTYPP= 0
##$F1P= 0
##$F2P= 0
##$FCOR= 0.5
##$FTSIZE= 32768
##$FT_mod= 6
##$GAMMA= 0
##$GB= 0
##$INTBC= 1
##$INTSCL= 1
##$ISEN= 128
##$LB= 0
##$LEV0= 0
##$LPBIN= 0
##$MAXI= 10000
##$MC2= 0
##$MEAN= 0
##$ME_mod= 0
##$MI= 0
##$NCOEF= 0
##$NC_proc= -8
##$NLEV= 6
##$NOISF1= 0
##$NOISF2= 0
##$NSP= 0
##$NTH_PI= 0
##$NZP= 0
##$OFFSET= 14.98509
##$PC= 1
##$PHC0= 87.35229
##$PHC1= 0
##$PH_mod= 1
##$PKNL= yes
##$PPARMOD= 0
##$PPDIAG= 0
##$PPIPTYP= 0
##$PPMPNUM= 2147483647
##$PPRESOL= 1
##$PSCAL= 4
##$PSIGN= 0
##$PYNMP= <proc.py>
##$REVERSE= no
##$SF= 400.02
##$SI= 32768
##$SIGF1= 0
##$SIGF2= 0
##$SINO= 400
##$SIOLD= 32768
##$SPECTYP= <>
##$SREGLST= <1H.CDCl3>
##$SSB= 0
##$STSI= 32768
##$STSR= 0
##$SW_p= 8223.68421052631
##$SYMM= 0
##$S_DEV= 0
##$TDeff= 65536
##$TDoff= 0
##$TI= <>
##$TILT= no
##$TM1= 0
##$TM2= 0
##$TOPLEV= 0
##$USERP1= <user>
##$USERP2= <user>
##$USERP3= <user>
##$USERP4= <user>
##$USERP5= <user>
##$WDW= 1
##$XDIM= 32768
##$YMAX_p= 442629899
##$YMIN_p= -703094
##$CURPLOT= <Network HP LaserJet P1505>
##$CURPRIN= <$Network HP LaserJet P1505>
##$DFORMAT= <normdp>
##$LAYOUT= <+/1D_H.xwp>
##$LFORMAT= <normlp>
##$PFORMAT= <normpl>
##$SURQMSG= 1
$$ End of Bruker specific parameters
$$ ---------------------------------
##NTUPLES= NMR SPECTRUM
##VAR_NAME=  FREQUENCY,     SPECTRUM/REAL,   SPECTRUM/IMAG
##SYMBOL=    X,             R,               I
##VAR_TYPE=  INDEPENDENT,   DEPENDENT,       DEPENDENT
##VAR_FORM=  AFFN,          ASDF,            ASDF
##VAR_DIM=   32768,         32768,           32768
##UNITS=     HZ,            ARBITRARY UNITS, ARBITRARY UNITS
##FACTOR=    0.250966925370066, 1,           1
##FIRST=     8223.43324360094, -169659,      -118449
##LAST=      0,             -96713,          -101429
##MIN=       0,             -703094,         0
##MAX=       8223.43324360094, 442629899,    0
$$ Real data points
##PAGE= N=1
##DATA TABLE= (X++(R..R)), XYDATA
$$ [...]
19597d7892j07274A38472A7826a87640B52520A0K9881M697d84505A04576h1090
19585a04183l3828K8066j95029a30439q3551a05242j20013k5143J19432k04989
19575c35955C54390E0973K27116a2378p1988J9617K8569A58391e0350k11471c6280
19563b05768D5473b03147A58358f7743J9489j85479K0494e2575F9585a25918d235
19551d5007E5754h3242A07368b16323p9748A7453a99334J0651I2039m1649c01269
19539C16011g3935j32851b6998p8822H5175a97381K2628N6334A53534c24592A09155
19527d0038j04161C1526f5424E0867K28033a10666j52401B08868d0845E4218K43152
19516B97370a84981a3140o7385A1308K3958d071A2418O2385O2954c82735c9616
$$ plain form
19597 -47892 -155166 138472 17826 -187640 252520 10 29891 34588 -484505 104576 -81090
19585 -104183 -138011 -109945 -304974 -130439 -213990 -105242 -225255 -250398 -130966 -335955
19575 -335955 354390 50973 278089 -12378 -84366 -64749 -36180 158391 -50350 -261821 -36280
19563 -205768 45473 -203147 158358 -67743 -48254 -233733 -213239 -52575 69585 -125918 -4235
19551 -45007 55754 -83242 107368 -216323 -296071 17453 -199334 -188683 92039 50390 -301269
19539 316011 -73935 -206786 -26998 -105820 85175 -197381 -174753 -118419 153534 -324592 109155
19527 -40038 -144199 31526 -65424 50867 278900 -110666 -263067 208868 -40845 54218 297370
19516 297370 -184981 -13140 -80525 11308 35266 -4071 12418 74803 137757 -382735 -39616
19504b91397f5054F6701b45680L6858p1118j58806a7479l54097A06179e24621
19493A25917E3037d3146A37240a0327k80084h8477K7725F9479c9959j12548M0751
19482a11756A26962e0098B72221h2498m38486B16869b86331K388D9702O0988E1608
19470a38904e7198B39412b79539B31601n0989q7370e085l41483G7042n001O9298
19459A41339F5086a62856L0098N6416k34153f1558j06786e0243j94647E4267g6665
19447a6815D6671a50602b0406j81474i286B71037E7599e0405k03600A11968R1260
19436B03228a83349i1293H1661a10150E4761K23055d39341A0400K8918c4411k0191
19425e4602l6553b6303n8824A23331B8113e879k70276l2190H302b42542n7357
$$ plain form
19504 -291397 -65054 66701 -245680 -208822 -279940 -438746 -17479 -371576 106179 -524621
19493 125917 53037 -43146 137240 -10327 -290411 -88477 -60752 69479 -39959 -152507 -111756
19482 -111756 126962 -50098 272221 -82498 -520984 216869 -286331 -283943 49702 110690 51608
19470 -138904 -57198 239412 -279539 231601 180612 93242 -5085 -346568 77042 72041 141339
19459 141339 65086 -162856 -132758 -76342 -310495 -61558 -168344 -50243 -244890 54267 -76665
19447 -16815 46671 -150602 -20406 -201880 -9286 271037 57599 -50405 -254005 111968 203228
19436 203228 -183349 -91293 81661 -110150 54761 277816 -439341 10400 39318 -34411 -54602
19425 -54602 -91155 -26303 -85127 123331 28113 -5879 -276155 -308345 8302 -242542 -299899
19414b99899c8984j24324d1305k58755A35942F496J5603f20619B136b33750a2993
19402a53389G0528a18038k2202C7202l001H500N2666c8149A10893a77577A01489
19390E537e4075A4876i3411r5296A50936f0373m0787c1469m1599J8676K5771E6629
19377c77338J21108E5893K8696a36421A73415b19571B85202o1570F2869b1662
19366D0960a16899m667n7668H2214j4821i549k53719C0760c55398f410E0511c491
19353B02560a83569P0914H5824P38k7470a35638K2928A21957K30888b01529D66926
19341b35232k9752J12023J5368C1962d7290H1938J98895b27832J1223a3445j05738
19330a19183k2747B00769b7200A05370J37813A03880c05011c3542O398n8392j73737
$$ plain form
19414 -299899 -38984 -163308 -41305 -300060 135942 6496 22099 -620619 2136 -233750 -12993
19402 -153389 70528 -118038 -140240 37202 34201 8500 61166 -38149 110893 -177577 101489
19390 5537 -54075 14876 -93411 -188707 150936 -60373 -101160 -31469 -73068 -54392 -28621 56629
19377 -377338 -256230 55893 84589 -136421 173415 -219571 285202 223632 62869 -21662
19366 40960 -116899 -121566 -179234 82214 67393 -9549 -263268 30760 -355398 -6410 50511 -3491
19353 202560 -183569 -112655 85824 86562 59092 -135638 -112710 121957 352845 -201529 466926
19341 -235232 -264984 -152961 -137593 31962 -47290 81938 280833 -227832 -216609 -13445 -119183
19330 -119183 -141930 200769 -27200 105370 243183 103880 -305011 -33542 -27144 -85536 -259273
19319b59273e3740n6315j64619b3033B03255d7634l19844D3406a98696B35712
19308d27294A78302a20714j27499B2994b80008a7847j65197A51175A3070a73510
19297a87849l7410G648c1120j48140f6178j07132C7692b37535f7683B9388J39376
19286A68764K05489a18142A10139c8060A17684f7534k52501l7125f7217l49701
19276d16918A61422b3762D2082d90567a78091c8754G7428a28045A11535N9426
19266A70961F449b48782A14816b71060J11150A13186L9268E8107B6415a38294
19255i2738p7369Q498G392i8438l09715A74027p2130b41659k7551A17337b10125
19243i0952l21213J12085A62924f6367j40489A35867b9557j01518E7230A0089
$$ plain form
19319 -259273 -53740 -110055 -274674 -23033 203255 -47634 -367478 43406 -198696 235712
19308 -427294 178302 -120714 -248213 22994 -280008 -17847 -183044 151175 13070 -173510
19297 -187849 -225259 7648 -31120 -179260 -66178 -173310 37692 -237535 -67683 29388 168764
19286 168764 374253 -118142 110139 -38060 117684 -67534 -320035 -357160 -67217 -416918
19276 -416918 161422 -23762 42082 -490567 -178091 -38754 77428 -128045 111535 170961
19266 170961 6449 -248782 114816 -271060 -159910 113186 152454 58107 26415 -138294
19255 -92738 -170107 -161609 7392 -98438 -408153 174027 101897 -241659 -269210 117337 -210125
19243 -90952 -412165 -300080 162924 -66367 -206856 135867 -29557 -131075 57230 10089
19232I1402N7325B0663a35915d5144j03391A50574A6560i9028j1111j10294c9436
19220c52401a68064A81922a68943d5303A40645a08644A71779g8238n6572J5011
19210a19799d9612k1953h601q8222q7486e3909D0040c97455A04745a24950N41
19199a24409E6580J05890j6932N1053E8124J48965i7590D12781A67808o1018d9373
19187a26267A5241g7868L8838G67J95101c85592A4167d81551A17097a68510f6112
19175b46975A26166M2119a17266F6370i1703j72782B98494A10320D2980a08157
19164a91222C1487J51694c57851a69166m5336b237l9102K0480j78779A42570d261
19152b56588A08544a2700m847m07431J95418J7687A94842b07795J0002E1010j7701
$$ plain form
19232 91402 148727 20663 -135915 -45144 -148535 150574 16560 -99028 -110139 -220433 -39436
19220 -352401 -168064 181922 -168943 -45303 140645 -108644 171779 -78238 -134810 -119799
19210 -119799 -49612 -71565 -8601 -96823 -184309 -53909 40040 -397455 104745 -124950 -124409
19199 -124409 56580 162470 145538 196591 58124 207089 -97590 412781 167808 106790 -49373
19187 -126267 15241 -77868 -39030 767 195868 -385592 14167 -481551 117097 -168510 -66112
19175 -246975 126166 168285 -117266 66370 -91703 -264485 298494 110320 42980 -108157
19164 -191222 31487 183181 -357851 -169166 -214502 -2237 -41339 -20859 -199638 142570 -4261
19152 -256588 108544 -12700 -17547 -424978 -229560 -211873 194842 -207795 -197793 51010 33309
19141C3309a32279k51292J59142P3352e8682D2825a85908D2668O8913J46370b37672
19129I1006h6038j20354f3816K8105j60448N5499r8091b4827J0853k34864b9377
19117f3376l71967a96169n5680a1849j10714j65429a27681N2131A28963a05037
19106c92837J07849C7624g9477A86296c977m2858j5620k16723E3992J6447J58466
19095B28905h4707C62548A352b18452d3629A34406K47368a54217e7468C9698c2857
19083A49237g740k7151j54621L5286R955O4157A68839c68670J43246A18039k2756
19072I5283i7286A19086b35937l663e6511A7844a3419k59276A67484d21813a72954
19060c1087j59746o8553c4172A52520D7259a57946j10695i9105P536J2782k1680
$$ plain form
19141 33309 -132279 -383571 -224429 -151077 -58682 42825 -185908 42668 111581 257951 -237672
19129 91006 -86038 -206392 -63816 -35711 -196159 -140660 -238751 -24827 -13974 -248838 -29377
19117 -63376 -435343 -196169 -251849 -11849 -122563 -287992 -127681 -75550 128963 -105037
19106 -392837 -284988 37624 -79477 186296 -3977 -46835 -62455 -279178 53992 70439 228905
19095 228905 -84707 362548 1352 -218452 -43629 134406 381774 -154217 -57468 39698 -32857
19083 149237 -7740 -34891 -189512 -154226 -144271 -80114 168839 -368670 -225424 118039 95283
19072 95283 -97286 119086 -235937 -239600 -56511 17844 -13419 -272695 167484 -421813 -172954
19060 -31087 -190833 -259386 -34172 152520 47259 -157946 -268641 -99105 -91569 -78787 -100467
19049a00467C722e8434j44975C6070L484A0457b2546p7875j81687b0802B57601
19037A12972a60782H397e8764k2984B07556f2616D9798N1355M9867G1650l3875
19026C7775p783J03680b90607g166A73834J7519d581j08458A8825J66667g3240
19014a12402E8441P0389h5289I4783J09898B2610a28591D4029a37042H4099a24491
19002d1007j63007B91740b20951c8534l39354d8601k08702m8742b3581H2321a71655
18990g7921K1224A14506d1274k1537A79088A8259b48752g876A6376J95889b08286
18978B06037a80013E9353a95941i0267A29444c0014o5450k2923A87249i7215E8555
18966B21991E3198K25159h4975C4591K429h174A50595h4990m4477d7829l22778
$$ plain form
19049 -100467 3722 -58434 -203409 36070 39554 10457 -22546 -100421 -282108 -20802 257601
19037 112972 -160782 8397 -58764 -81748 207556 -62616 49798 101153 151020 71650 37775
19026 37775 29992 133672 -290607 -7166 173834 191353 -4581 -113039 18825 185492 -73240
19014 -112402 58441 128830 -85289 94783 204681 22610 -128591 44029 -137042 84099 -124491
19002 -41007 -204014 291740 -220951 -38534 -377888 -48601 -257303 -306045 -23581 82321 -171655
18990 -77921 -56697 114506 -41274 -62811 179088 18259 -248752 -7876 16376 212265 -208286
18978 206037 -180013 59353 -195941 -90267 129444 -30014 -95464 -118387 187249 -97215 58555
18966 221991 53198 278357 -84975 34591 37020 -8174 150595 -84990 -129467 -47829 -370607
18955c70607J44332L6542B4265a74658M9108b224l48721A82573a64253B4807L2287
18944E7094b218C6955M5213K4475f855j09835c0418j34578D8853I060q05a66610
18931a12616B04702E7392O9052c09823R1715H1084b44301j33364C9497A930J30698
18920A32628D8483a7949k02979O5477A33173i887n18004e8861j83664R4569M7438
18909a00518F1459a07429J5049B41003E1773b65360f2724F4226k3167a63079m3005
18898b06084i502H4115K5286b61712B84766g1485D9693R2089c42744K0303B9118
18886h3537j53176A8156g2892L3890l7204q4161A48449a72893e0585C03272d8857
18874a23415E8555a83089Q7378o726H889R5950l767a41694D5491a60496a8773
$$ plain form
18955 -370607 -226275 -189733 24265 -174658 -125550 -2224 -350945 182573 -164253 24807 57094
18944 57094 -2218 36955 82168 106643 -6855 -116690 -30418 -164996 48853 9060 8255 -166610
18931 -112616 204702 57392 126444 -309823 -218108 81084 -244301 -377665 39497 1930 132628
18920 132628 48483 -17949 -220928 -155451 133173 -9887 -527891 -58861 -242525 -147956 -100518
18909 -100518 61459 -107429 -92380 241003 51773 -265360 -62724 64226 41059 -163079 -206084
18898 -206084 -9502 84115 109401 -261712 284766 -71485 49693 141782 -342744 -322441 29118
18886 -83537 -236713 18156 -72892 -39002 -76206 -160367 148449 -172893 -50585 303272 -48857
18874 -123415 58555 -183089 -95711 -102437 8889 104839 101072 -141694 45491 -160496 -18773
18862a45432A64712K23241h8959j46863i1933A9729b6022l1776n6760A32976b7630
18850b07817B60224r8323m8439J08983F5798L9522l3266Q068f7724j17630A24439
18838b34205q9531B423c53383B4136b34434g9139j41350C2058K13325i5924j67572
18827b63496e6154n6584J9106G3098a96348B43956J03863a07237a3098q4968C79874
18815A77838a72149c4252C32300b70756C17782I4516L12413A66741a43144G7731
18804a99092A19944a5876B021b43431J04215C4265J49958b23066A93515E516a03904
18792H3541d7770A6517K41258a89094d9317H4628f7880j84706A04662D5956h2516
18780d0115p7844j12C61816a92502j9156C94551e779k18589j04297A63873f7561
$$ plain form
18862 -145432 164712 387953 -88959 -235822 -91933 19729 -26022 -57798 -114558 132976 -27630
18850 -207817 260224 161901 113462 222445 65798 105320 72054 80122 -67724 -185354 124439
18838 -234205 -323736 2423 -353383 24136 -234434 -79139 -220489 32058 245383 -95924 -263496
18827 -263496 -56154 -112738 -93632 73098 -196348 243956 347819 -107237 -13098 -98066 379874
18815 177838 -172149 -34252 332300 -270756 317782 94516 406929 166741 -143144 77731
18804 -199092 119944 -15876 2021 -243431 -139216 34265 184223 -223066 193515 5516 -103904
18792 83541 -47770 16517 257775 -189094 -49317 84628 -67880 -252586 104662 45956 -82516
18780 -40115 -117959 -118071 361816 -192502 -211658 394551 -5779 -224368 -328665 163873 -67561
18768c3292n610k03960A10003b96667a29866K0267A66635c7468q3868j59118C34337
18756i4703J4385j33450F353M2163b6256D7184A1191R6678h6854j82689K2142
18745b47401q9112D7539J4044O265i7386B14320m4605h5335E8491J34876a17191
18733A7074b37430A37423b08449Q7187p89N3097c602l62926A77397a01640B0399
18721b49128a14164F6046g5266A60003a28126A81428c48824a24440j92935e2669
18710D7223J34062a73564N9004A7789J39144b88013a22495I5781h5473j74222
18700b59695e7937m2771i642E8222B1361b37311J0830d2343J5585B68282a51175
18688h0688H6847a6823j67079l1459R8454A13288j2210a87553A63903a33041j46505
$$ plain form
18768 -33292 -38902 -242862 110003 -296667 -129866 -109599 166635 -37468 -121336 -280454 334337
18756 -94703 -80318 -213768 6353 48516 -26256 47184 11191 107869 -86854 -269543 -247401
18745 -247401 -336513 47539 61583 67848 -97386 214320 169715 -85335 58491 193367 -117191
18733 17074 -237430 137423 -208449 -121262 -122051 -68954 -3602 -366528 177397 -101640 20399
18721 -249128 -114164 66046 -75266 160003 -128126 181428 -348824 -124440 -317375 -52669
18710 47223 181285 -173564 -114560 17789 156933 -288013 -122495 95781 -85473 -259695
18700 -259695 -57937 -100708 -9642 58222 21361 -237311 -226481 -42343 -26758 268282 -151175
18688 -80688 86847 -16823 -183902 -215361 -116907 113288 101078 -187553 163903 -133041 -279546
18677b79546e0715A97395G3740c00H5820g3338R566j94727b245q2622l40436A58959
18664A64536F5038K11345g0827B7930J33697a86424O4837G2042a51399A65463
18653B5589J91130a15432H7919d2619B76872d58407Q7644C2804b17118B15799
18642d324D0848d81157D8078N9047c22982a04391d3241J1394J0586n883j7808
18631d4952k92465c7964C88998c31373g8664C36886a54667C60649j60129g8093
18620h4804a4494k5481B79524b69095B55645b47865a05184B1962a19528I9393
18609b61836E5958B0782c15701A13265c1965A41491c27883c4860j48962B42625
18598b2509k15723G4456g4717A10186M3750i5819k62722i1915j8093a3748q1474
$$ plain form
18677 -279546 -50715 197395 73740 -300 85820 -73338 -63772 -258499 -2245 -84867 -425303 158959
18664 164536 65038 276383 -70827 27930 161627 -186424 -121587 72042 -151399 165463
18653 25589 216719 -115432 87919 -42619 276872 -458407 -370763 32804 -217118 215799
18642 -4324 40848 -481157 48078 107125 -322982 -104391 -43241 -31847 -21261 -27144 -44952
18631 -44952 -337417 -37964 388998 -331373 -78664 336886 -154667 360649 200520 -78093
18620 -84804 -14494 -39975 279524 -269095 255645 -247865 -105184 21962 -119528 99393
18609 -261836 55958 20782 -315701 113265 -31965 141491 -327883 -34860 -183822 242625
18598 -22509 -238232 74456 -74717 110186 153936 -95819 -358541 -91915 -110008 -13748 -95222
18587i5222A17631j3089l0783L3610C8883Q5810F0060b77952n615A96718a41497
18575D34889c4640D7088K21765F8462J64724a20931A7643N7545b92426R8251F4682
18563A7256a21600k78190e1790G2192J44088D5955a32129n408K342l1730B23598
18551a65859G485O8846a24187d8384C4312J323g2276B8223K03003c71947J62141
18540b09806P5725I001J75465b37708A91558h9370A24802a95793j08818R9343
18530b05268R8422A96454b60608O6628q9974i2825p2897b4563c229l4159l01437
18519c38825L7470J7105H0788L6655R3113b39255A6858f6276a8511H360h9229
18507c5107j71877B57439d3081C7498c8949k9756j58974A24180a56968A2802P2850
$$ plain form
18587 -95222 117631 104542 73759 107369 38883 124693 60060 -277952 -283567 196718 -141497
18575 434889 -34640 47088 268853 68462 233186 -120931 17643 75188 -292426 -194175 64682
18563 17256 -121600 -399790 -51790 72192 216280 45955 -132129 -137537 -135195 -166925 223598
18551 -165859 7485 76331 -124187 -48384 34312 35635 -72276 28223 231226 -371947 -209806
18540 -209806 -134081 9001 184466 -237708 191558 -89370 124802 -195793 -304611 -205268
18530 -205268 -106846 196454 -260608 -193980 -283954 -92825 -165722 -24563 -3229 -37388 -338825
18519 -338825 -301355 -284250 80788 117443 210556 -239255 16858 -66276 -18511 8360 -89229
18507 -35107 -206984 257439 -43081 37498 -38949 -68705 -227679 124180 -156968 12802 85652
18496H5652c56879J7752A0900g3707A80581a51958k14354A57122d3180k73140
18486c16320J4251f1257A86446n5385d62722I0857a06777j38188G6380b69490
18475I2620J20574e821j07587A00215b29270P0356l36809C5129h6002j61748H8224
18463E7296i2107j06712l6175B0713d410r2819o2919m3217d4636a6856q8106D3298
18450F5772a60864A26497g8943c015l8168J518c894j68431B39603b1712B36125
18438a5165n3556A94217m4067h217r0228B18783a88586F6068a60785k09324B77783
18426E3412f7212l5813n1525L2430D5481J9807c5416A54304G0061H934J7031K1807
18414D7772a56087F3392c6016k19640b6573B7292j2809f2449A98817O1875E1188
$$ plain form
18496 85652 -356879 -339127 10900 -73707 180581 -151958 -366312 157122 -43180 -316320
18486 -316320 -302069 -61257 186446 131061 -462722 90857 -106777 -244965 76380 -269490
18475 92620 213194 -5821 -113408 100215 -229270 -158914 -495723 35129 -86002 -247750 88224
18463 57296 -92107 -198819 -234994 20713 -4410 -97229 -160148 -203365 -44636 -16856 -104962 43298
18450 65772 -160864 126497 -78943 -3015 -41183 -39665 -3894 -172325 239603 -21712 236125
18438 -15165 -68721 194217 150150 -8217 -98445 218783 -188586 66068 -160785 -370109 277783
18426 53412 -67212 -103025 -154550 -122120 45481 65288 -35416 154304 70061 8934 25965 47772
18414 47772 -156087 63392 -36016 -255656 -26573 27292 14483 -62449 198817 260692 51188
18402a2039P47E2050a34971f3699m1090j10327d9761B13538a8328o5542o4503
18391a48373e3084B12385N5186I9445L4137o2263g7706j26762N1078j72108A32550
18379d9040C2469a8711e061m025L13A02857D7752b34694E5440R2615B8347a7291
18366f3298l07046i030B20256b49007G7625k4855e5153B3604b55582M1331j27870
18355c42121P0903e4426q0415A5660h5952A08258d7606B92068a46813A09369d0078
18343A96430a34343H9347i9388A9352J32845m283A5860J242c02864B5111b00015
18331B976J94325a93179c073I4082A2942a05789E5191i8345j2631j52392B5256
18319a37260A30883b41242j5266H021c34386a53030E4596a01827k64331A55774
$$ plain form
18402 -12039 -11292 52050 -134971 -63699 -104789 -215116 -49761 213538 -18328 -83870 -148373
18391 -148373 -53084 212385 267571 99445 133582 71319 -77706 -204468 -153390 -325498 132550
18379 -49040 32469 -18711 -5061 -9086 -8773 102857 47752 -234694 55440 148055 28347 -17291
18366 -63298 -370344 -9030 220256 -249007 77625 52770 -55153 23604 -255582 -214251 -342121
18355 -342121 -271218 -54426 -134841 15660 -85952 108258 -47606 292068 -146813 109369 -40078
18343 196430 -134343 89347 -99388 19352 152197 147914 15860 17102 -302864 25111 -200015
18331 2976 197301 -193179 -3073 94082 12942 -105789 55191 -98345 -110976 -263368 25256
18319 -137260 130883 -241242 -256508 8021 -334386 -153030 54596 -101827 -366158 155774
18308i1047B76153n8224b23000e282m2971A0731a50497A33515A5554L6979J7120
18297F9653M3048B9404b03363L0979l6225h5281A03071i5495o7338b4471C89444
18285E7236d29617K00932M6696e8902l58966C26432a9846C37351b42405a11036
18274E0904a04582A78892h4956k65223J16513N5460l2900p1682A42128l6160e7293
18262A20562c3383G8566c71039O0020B12614C2219a05847j97099a48880A43959
18251b84074A83253n8642c50478E0846a54471B3790O5345c0829k76864I2282M2966
18240A35248K396e6082j72108j04559B31801j09196e6777f649n8008B0594N2204
18229G2798b52306B00039g8612A32987b17217i4231j18373P7403A54663b01035
$$ plain form
18308 -91047 276153 217929 -223000 -5282 -48253 10731 -150497 133515 15554 52533 69653
18297 69653 112701 29404 -203363 -172384 -208609 -85281 103071 -95495 -162833 -24471 389444
18285 57236 -429617 -228685 -181989 -58902 -417868 326432 -19846 337351 -242405 -111036
18274 50904 -104582 178892 -84956 -350179 -233666 -178206 -211106 -282788 142128 105968 -57293
18262 120562 -33383 78566 -371039 -311019 212614 32219 -105847 -302946 -148880 143959
18251 -284074 183253 124611 -350478 50846 -154471 23790 89135 -30829 -307693 92282 135248
18240 135248 137644 -56082 -228190 -332749 231801 122605 -56777 -6649 -64657 20594 72798
18229 72798 -252306 200039 -78612 132987 -217217 -94231 -212604 -135201 154663 -201035
18218b71249i8157A48573c11115e1481l57017D1644N0924A1274b61993J22518
18208a39475C00250a57838H2019c0862I5189m0595d1524f70D1024K07345c27515
18196e6943j88282Q9757J6440I1955a36989k46840a53911r935B12562c7927A59156
18184a31681j69032e6264j60140m3736C03810j15857G8160b17667j41906R7254
18174b62319A19066C788g0853r444L8948A59602b6845C60121a97111G8940a94902
18162a22593F5756a56087E4090b9512p7533c2215A59837a35232D2425i4118B2499
18150e5915a9025B17553b88344H897O7660J7704m0594K41328J41856F6981c0928
18138B69726L8522r6559d3325B69715A16926b28339j9510A4145J12517a28585
$$ plain form
18218 -271249 -98157 148573 -311115 -51481 -408498 41644 92568 11274 -261993 -139475
18208 -139475 300250 -157838 82019 -30862 95189 54594 -41524 -670 41024 248369 -327515
18196 -56943 -245225 -155468 -139028 91955 -136989 -383829 -153911 -163846 212562 -37927 159156
18184 -131681 -300713 -56264 -216404 -260140 303810 187953 78160 -217667 -359573 -262319
18174 -262319 119066 3788 -70853 -80297 -41349 159602 -26845 360121 -197111 78940 -194902
18162 -122593 65756 -156087 54090 -29512 -107045 -32215 159837 -135232 42425 -94118 22499
18150 -55915 -19025 217553 -288344 8897 76557 94261 53667 294995 436851 66981 -30928
18138 269726 308248 211689 -43325 269715 116926 -228339 -247849 14145 126662 -128585
18127a96143P7024K3459F2018R4597l921e9081n8368j48702K2370A41052a2509
18115a35812A74639f3318C34707a3282j20793G4326b87237J07561M8527j18434
18105b49583A8078d1214A52152E4090b25479L5031b8666k1542F6647b32195j5663
18094b47858R9080A3349c5612B02964c09863C1083b39683N5197N9335e7529J1303
18083d6226e424D1970a89867H0402O7390b18517I556J93706b8522k23204Q3902
18072a67824d2835k56601d5939j7359E8566a11481C04940c2232A26017l7840b28064
18060a45905G7539a67326A51119K52382c89819I2483b86229A9523a54533j15316
18050b69849R0305B5754b34672I1840O6241e8624J4224a3686j6035r6491B13545
$$ plain form
18127 -196143 -119119 -95660 62018 156615 152694 -59081 -117449 -266151 -243781 141052 -12509
18115 -135812 174639 -63318 334707 -13282 -134075 74326 -287237 -179676 -131149 -249583
18105 -249583 18078 -41214 152152 54090 -225479 -190448 -28666 -50208 66647 -232195 -247858
18094 -247858 -148778 13349 -35612 202964 -309863 31083 -239683 -184486 -125151 -57529 -46226
18083 -46226 -5424 41970 -189867 80402 147792 -218517 9556 203262 -28522 -251726 -167824
18072 -167824 -42835 -299436 -45939 -63298 58566 -111481 304940 -32232 126017 88177 -228064
18060 -145905 77539 -167326 151119 403501 -389819 92483 -286229 19523 -154533 -269849
18050 -269849 -179544 25754 -234672 91840 158081 -58624 -44400 -13686 -29721 -126212 213545
18038A3673O6480P3890C8360a57385e0557C6775a5022B28969J59153A02361J71566
18027B73927g5115l057A12980J40720g4870A30556a4714l4033a7915m23121f4367
18015A20046C9804i1967B099b31680D0116J94276A4747c2068j83842K465b4570
18003B61644a47231B06223J1543N1871d51064G9403b35664l4981O619N3651I0920
17991C77864b3633A39064J54104f49762c3536m17153A29286a10648A31116f6128
17980A12105a17214E3243f4030A1936c025A15478K21502G069K2439P9263a23312
17968b50557B8352q054K3854b69442f0310j62087p4893b1093j30359d6401A13557
17956a39513j7342E3085h6964D37853A90737c58797A36338J49811K32394H3298
$$ plain form
18038 13673 80153 154043 38360 -157385 -50557 36775 -15022 228969 388122 102361 273927
18027 273927 -75115 -78172 112980 253700 -74870 130556 -14714 -48747 -17915 -441036 -64367
18015 120046 39804 -91967 2099 -231680 40116 234392 14747 -32068 -215910 -213445 -24570
18003 261644 -147231 206223 217766 269637 -451064 79403 -235664 -270645 -264026 -210375 90920
17991 377864 -23633 139064 293168 -649762 -33536 -450689 129286 -110648 131116 -66128
17980 112105 -117214 53243 -64030 11936 -3025 115478 336980 7069 29508 108771 -123312
17968 -250557 28352 20298 44152 -269442 -60310 -222397 -297290 -21093 -151452 -46401 113557
17956 -139513 -156855 53085 -86964 437853 190737 -358797 136338 286149 518543 83298
17945f2918j62124o260P1809N4830j38500O1904B76827a44904M3485E7955n385
17934E2570a64656a2716k3084k43606h1B43994a23668M7610k55582B8059Q7482
17923A15541C6856J43516a29316l2385c9720H8497d8090C11409B0288a56343P6230
17912h0113L2432B28784a67884g2981j20974d6586A09210b15569A8210a43422
17901a1251A85289M0030a23034o8845A50064k9754k7112a13430N1214A88304a19065
17889b61605c6948A87004a40851b5440B28678q6707d2553d385j04024D4394M0981
17878H5375a39945K4632d9628m2965B5538b10084B14166e9105l5030A11300g5444
17866a44436C28963e0211A59648a12147A3516a74468d9110a8219B92390a63794
$$ plain form
17945 -62918 -225042 -231302 -159493 -104663 -243163 -181259 276827 -144904 -101419 57955 52570
17934 52570 -164656 -12716 -35800 -279406 -81 243994 -123668 -76058 -331640 28059 115541
17923 115541 36856 180372 -129316 -161701 -39720 88497 -48090 311409 20288 -156343 -80113
17912 -80113 -47681 228784 -167884 -72981 -193955 -46586 109210 -215569 18210 -143422
17901 -11251 185289 225319 -123034 -191879 150064 120310 93198 -113430 -62216 188304 -119065
17889 -261605 -36948 187004 -140851 -25440 228678 141971 -42553 -4385 -108409 44394 85375
17878 85375 -139945 -115313 -49628 -92593 25538 -210084 214166 -59105 -94135 111300 -75444
17866 -144436 328963 -50211 159648 -112147 13516 -174468 -49110 -18219 292390 -163794
17855A84376C3886a73399C07210a13642A07686L5518b62667A44629n0812J28289
17845B22106a71694d7923L710B5291J0324J44951c51481B76446a71796A64212
17834C8679b23597O3213q3449B57725b61151c3076C9901R2117i5442l547c9677
17822B8368J6829e1293K3705j42057N1780G6804N0919i9855A88358o8013j9889
17811A00456A41J68063J25846a36850C8593J55755b376j00683j13579b529G9066
17799a05524E9353b25933E2043K9128K09246A39315L6307m9574A9554h8871G1417
17787b40452C65023i6087A55943a10689H2845K63864c55721a47826c1644b719
17776A06867N9263J5501a29469l0618g930k8104j12416L4218L7911A40429a01002
$$ plain form
17855 184376 33886 -173399 307210 -113642 107686 143204 -262667 144629 93817 222106
17845 222106 -171694 -47923 -44213 25291 35615 180566 -351481 276446 -171796 164212
17834 38679 -223597 -160384 -243833 257725 -261151 -33076 39901 132018 -95442 -98989 -39677
17822 28368 45197 -51293 -27588 -169645 -117865 76804 127723 -99855 188358 120345 100456
17811 100456 141 168204 294050 -136850 38593 194348 -2376 -103059 -216638 -2529 79066
17799 -105524 59353 -225933 52043 81171 290417 139315 175622 126048 19554 -88871 71417
17787 -240452 365023 -96087 155943 -110689 82845 346709 -355721 -147826 -31644 -2719
17776 106867 166130 181631 -129469 -160087 -7930 -36034 -148450 -114232 -76321 140429 -101002
17764E9757b72219H2089b41491B41886r8326e7294j54895m040A20915C177R7013
17753A00190a08611A77975b25913n6504c6369A68404n6446K8615b58241B97483
17742a39887n6426I7412a41780I0039a11078D2423a99449B4091N60509e8289B1057
17730e32j69871e108H1999C8900b75754B74015g5248m6571j47886h1202G9174
17718A36315d57990a274k15026F0902J416J69698E2111a37207O8048k50997D67954
17706c3872a290k1751B31339A00020b43530I653J58534D9081J82984b62299G7820
17694c84620A43060g5822A64020a12029H070a80167g1981b0942m8424K1524k3710
17683g1552r707A2354J03452a03829l5990A89921a36585k60950J22763G0843L66055
$$ plain form
17764 59757 -272219 82089 -241491 241886 143560 -57294 -212189 -216229 120915 3177 100190
17753 100190 -108611 177975 -225913 -282417 -36369 168404 111958 140573 -258241 297483
17742 -139887 -196313 97412 -141780 90039 -111078 42423 -199449 24091 584600 -58289 21057
17730 -532 -170403 -5108 81999 38900 -275754 274015 -75248 -121819 -269705 -81202 79174
17718 136315 -457990 -1274 -216300 60902 62318 232016 52111 -137207 -69159 -320156 467954
17706 -33872 -1290 -23041 231339 100020 -243530 9653 168187 49081 232065 -262299 77820
17694 -384620 143060 -75822 164020 -112029 8070 -180167 -71981 -20942 -69366 -47842 -71552
17683 -71552 -81259 12354 115806 -103829 -139819 189921 -136585 -397535 -274772 70843 436898
17672D36898j75517c08571a7624j5616E7993K86185D4819J35806m2474b18465
17661g403F7321L4773a32957o8948F6806d0425A4307K09543D6107J81609g6678
17649H0769J16938o2696i0569N981A27730R214h9290m3846A52682G147Q8350d41060
17636d743E7073J03783A0137M432L28812E9612c7211q4485q9700Q6218B43097
17624b4488I2140B4734J91210J25756c5505B56541p8162a70411A59576c49295
17613b95141C5295N0658Q680d6053p2969j8234A1907b0550j78152D7411j0612
17602C6799e7821E0827I807g7886A74841R2675f826j05061C566J15772f1501C33530
17589B01205a86754A21111K34818a17167q3063J3291g5890A19689K2022a2447
$$ plain form
17672 436898 261381 -308571 -17624 -33240 57993 344178 44819 180625 138151 -218465
17661 -7403 67321 102094 -132957 -201905 66806 -40425 14307 223850 46107 227716 -76678
17649 80769 197707 135011 -90569 -84588 127730 136944 -89290 -133136 152682 7147 95497 -441060
17636 -4743 57073 160856 10137 14569 343381 59612 -37211 -121696 -211396 -125178 243097
17624 -24488 92140 24734 215944 341700 -35505 256541 178379 -170411 159576 -349295
17613 -295141 35295 85953 94633 -46053 -119022 -137256 11907 -20550 -198702 47411 36799
17602 36799 -57821 50827 9807 -77886 174841 267516 -6826 -111887 3566 119338 -61501 333530
17589 201205 -186754 121111 355929 -117167 -200230 -186939 -75890 119689 141711 -12447
17578A02226A742a4039K894A8156P0876R612I301b29942H0244b6911L08E3854
17565F8081a70617A06500B9758F276N5935K950d1666l5474o7985B8207c819n2112
17553e5931D0838J34719c8261A59351a16537c9727D13046e0319H8247B7924e7581
17541C5743K11199a45209f0384A51004a21786N7290j11996g0278A65069a10950
17530b4630D55309B7241L92839H5674P8076b6485B89750A2128h1029k53380B05004
17518D54656A74124f9725H3362k100L77588e8508M452B48622B7773K27081G6169
17506a41335A39650J37923j38040o5335b57114b5761G3972l5615a32093C8291
17495D11463C6608K91547q8438A14564c7573D50315A65465a11202B31608c9827
$$ plain form
17578 102226 1742 -14039 -11145 18156 89032 98644 9301 -229942 80244 -26911 -26603 53854
17565 68081 -170617 106500 29758 6276 62211 65161 -41666 -77140 -145125 28207 -3819 -55931
17553 -55931 40838 175557 -38261 159351 -116537 -39727 413046 -50319 88247 27924 -57581
17541 35743 246942 -145209 -60384 151004 -121786 -64496 -176492 -70278 165069 -110950
17530 -24630 455309 27241 420080 85674 163750 -26485 289750 12128 -81029 -334409 205004
17518 454656 174124 -69725 83362 81262 458850 -58508 -54056 248622 27773 254854 76169
17506 -141335 139650 277573 139533 74198 -257114 -25761 73972 38357 -132093 38291
17495 411463 36608 328155 239717 114564 -37573 450315 165465 -111202 231608 -39827
17484i1793H0715a24615A87122B4473L18675a39700L2019B95881A06651N5395
17474A62046h6159L9330I7013L54441a41117B71805A20461A9692a86519C40137
17463A05788J27275q2248a33856j07588B35982r3774C4334L71383A6196Q9604
17453A05800K19067F0192A2433R9360K62337Q7476l5957A85106l5085J26019F2595
17441C70835A10124k6084e5779C6807j2027J53907a34562A62380G5480o722N33968
17430F02726A44270l0490b4334D80478k01763J61002A93833K24651e7620B89008
17419B85080j29631K53608l1297l9463j09615K24487j66629g2266A6172e9704
17408C08101a16596A5329R2636J22273a99146O9633D2733J3272J31355n1180D2511
$$ plain form
17484 -91793 80715 -124615 187122 24473 343148 -139700 -107681 295881 106651 162046
17474 162046 -86159 -46829 97013 451454 -141117 271805 120461 19692 -186519 340137
17463 105788 233063 150815 -133856 -241444 235982 142208 34334 405717 16196 105800
17453 105800 324867 60192 12433 111793 374130 461606 425649 185106 150021 276040 62595
17441 370835 110124 84040 -55779 36807 24780 178687 -134562 162380 75480 68758 602726
17430 602726 144270 113780 -24334 480478 278715 439717 193833 418484 -57620 289008
17419 285080 155449 409057 377760 338297 228682 453169 286540 -72266 16172 -59704
17408 308101 -116596 15329 107965 230238 -199146 -129513 42733 56005 187360 136180 42511
17396B92365e0559A20960N7992b0295R196E21104q2602A47324f9384F5621J53461
17385B19082q0374J34463c3028B454J64761a15586C1045j1702K08348i5330D00653
17373a22651D93456J09404A04242l1157N834N12K37145b01884a1062B58832C9198
17361D7249N0813A9565P8885L18991A12343K07458j18400o5679P318P035b14966
17349e9295k37782A61883f328A71098k8300K84251A34371L0198e731B14234J31573
17338C45807f9283D5711J66793g0683D72694B31363B3921L55302a55169C00412
17327c2149r307A28811d3676F1094a17403H7987K01542E3454M5073J07951n4561
17316A51917L23962a23684C46297D9515J44292g3538A84016B7537K38928L7757
$$ plain form
17396 292365 -50559 120960 178952 -20295 -11099 521104 438502 147324 -69384 65621 219082
17385 219082 138708 273171 -33028 2454 167215 -115586 31045 19343 227691 -95330 400653
17373 -122651 493456 602860 104242 73085 78919 79431 316576 -201884 -11062 258832 39198
17361 47249 98062 19565 98450 417441 112343 319801 201401 135722 143040 150075 -214966
17349 -59295 -297077 161883 -6328 171098 142798 427049 134371 164569 -5731 214234 345807
17338 345807 -69283 45711 212504 -70683 472694 231363 23921 379223 -155169 300412
17327 -32149 -41456 128811 -43676 61094 -117403 87987 289529 53454 98527 206478 151917
17316 151917 475879 -123684 346297 49515 193807 -73538 184016 27537 266465 304222
17306C04222k5952j14787F0842g2066H8675k1680K6790c26165g8841D12555a16702
17294A62995A6060K3676K14248p6082A5707O6168C6784j2752K05771B0166g381
17282d8936B36213K29341a59759A31984a70451D69904I9809B982J9999K54202
17272B77183N0414g0085L0056D5332i1162A22764o90K06448D4942d7288j0119
17261e7407f875l0195B13661E0159L48413A03999a5234I5072J39751p0312m7387
17250A17124a42473B18603D1124J67964J57192e0205C40283I7894P4551c0005
17239B19497G8251M7598a06738B3503L85738A80250F8938b3824A59262p8560b18327
17227i3032C39P5063O388N3693K7286G5772K21160g4599B69504f992B01860R662
$$ plain form
17306 304222 278270 163483 60842 -72066 88675 66995 93785 -326165 -78841 412555 -116702
17294 162995 16060 39736 253984 177902 15707 81875 36784 24032 229803 20166 -7381
17282 -48936 236213 465554 -159759 131984 -170451 469904 99809 2982 22981 277183
17272 277183 327597 -70085 -40029 45332 -91162 122764 122074 328522 44942 -47288 -57407
17261 -57407 -6875 -37070 213661 50159 398572 103999 -15234 95072 234823 164511 117124
17250 117124 -142473 218603 41124 209088 366280 -50205 340283 97894 172445 -30005
17239 219497 78251 125849 -106738 23503 409241 180250 68938 -23824 159262 80702 -218327
17227 -93032 339 75402 81790 135483 162769 75772 296932 -74599 269504 -6992 201860 211522
17215B11522G6888L93165A69288K20n236f392B34393r195P6340j40919j2252L80758
17203E29125B32464L9626r0293K5984Q5036j41274m3135J31190K9999R6058r3689
17192B71966A00140b42900A62228C0177K53590B9924L64807d7326B65783n6740
17182B09043I5840e6200A01830L85519l0119o4356D9540k3818K15474q8561d495
17170A5084a94142B94486o3536r7224K55182j67807G4887J32712P7853O1569p3579
17159B73442a9036C81167e3404B48834G4915O5966J33634D060D65M32110q2561
17148C50014q1784d54861C35455p3006I3970K31504M4178j78317h846D92149I7685
17136E0896L09576O1658A04348L02669j88334A4080M11786j75622k1085A04994
$$ plain form
17215 211522 76888 470053 169288 169508 164272 -6392 234393 225198 301538 160619 148367 529125
17203 529125 232464 272090 181797 207781 292817 151543 108408 239598 269597 365655 271966
17192 271966 100140 -242900 162228 30177 283767 29924 394731 -47326 265783 209043
17182 209043 95840 -56200 101830 487349 457230 392874 49540 25722 241196 152635 -4495
17170 15084 -194142 294486 230950 133726 388908 221101 74887 207599 285452 347021 273442
17159 273442 -19036 381167 -53404 248834 74915 140881 274515 4060 465 432575 350014
17148 350014 268230 -454861 335455 262449 93970 325474 369652 191335 -8846 492149 97685
17136 50896 360472 422130 104348 407017 218683 14080 425866 250244 229159 104994
17125A27883l4134a6611A76973J115Q8775I9673Q9406G1257K26542J61510j04863
17114C54446J11507I3051J6252K05965q6151j9746J2484j3127a5073C54950Q0181
17103D35131q7593B0184M48212j09926j10165J34444J86446B22720j5593K24699
17093D31826A06888J46663K83833A54900N71446D2350K61929q9248M87265C00060
17082D5114M67173o8702I7327L58928K49376C00650P2588j157J04561k13433K57268
17071E20477j07481M6041A66481K43359N5205A10220L83118B29356L97874k59541
17061C67689L72308l42487K64849k90858N4797K55657k72506P6147P6952j1446
17051E51102j8293p9790J49405B79586K82767k77070L185j00276m9872J79099
$$ plain form
17125 127883 93749 -16611 176973 178088 266863 99673 189079 71257 297799 459309 354446
17114 354446 465953 93051 109303 315268 229117 209371 221855 208728 -15073 354950 435131
17103 435131 347538 20184 468396 358470 248305 382749 569195 222720 207127 431826
17093 431826 106888 253551 537384 154900 726346 42350 304279 215031 702296 300060
17082 45114 512287 443585 97327 456255 705631 300650 373238 372081 476642 263209 520477
17071 520477 412996 459037 166481 409840 465045 110220 493338 229356 627230 367689
17061 367689 739997 397510 662359 371501 426298 681955 409449 485596 562548 551102
17051 551102 532809 453019 602424 279586 562353 285283 288468 188192 138320 317419
17041C17419j17981K28532n6507K06299K27123C81827J25908J59421k86492L4572
17031D15236K44713l01857L0184L61669k43182F9014L12113J90273N14k4548o2973
17020D84393K05923m0364k18525r7357J13586L47379l51652J12050r8220P5969
17010E33182M9470k37712K95981j57666j62751K22611J86176n2394J50341j25656
17000G01582j10719n5950R5579N3668j09619Q1337k48691k07R2302k2034p9401
16989C97847Q1030j2197Q1045K93639l33419L52993k70369k15574L81497n8150
16979F98342j26763M76320m47294j42277L67316k98962M08263k57322J25437k97856
16969E05204R4283J46324J63452k00496k1644p3300M2473J62976O1803j7999j8448
$$ plain form
17041 317419 199438 427970 371463 577762 804885 381827 507735 667156 380664 415236
17031 415236 659949 358092 388276 749945 506763 69014 381127 571400 571914 547366 484393
17020 484393 690316 649952 431427 334070 447656 795035 443383 555433 457213 533182
17010 533182 582652 344940 640921 483255 320504 543115 729291 676897 827238 701582
17000 701582 590863 534913 630492 684160 574541 655878 407187 406980 499282 477248 397847
16989 397847 478877 466680 547725 841364 507945 860938 590569 374995 756492 698342
16979 698342 571579 1047899 600605 458328 825644 526682 934945 677623 803060 505204
16969 505204 599487 745811 909263 708767 687123 613823 656296 819272 881075 863076 844628
16958H44628J01664J3477j50315j1188M6930L7772j24757K339P6891K7985J83526
16947A048952k77979N3421J43309j60325K12281l24830L69136j74370k49558o5106
16937E74931M95338Q8530r1588k33436k6170m3417L61752k75881n9776L75360
16927A165643j94795L21813n06859N98238l38408l9792o4523K146Q4626j16684
16917I11405K46253n4650L95158n06033J60635J64259j89238J16013k55259J11492
16907A100035K32259J38739m4562M557j07197J39257M7751j31133j25198Q6874
16897A341382j39225Q941K10822J60799j06168q7957J70559K36486j50735j22130
16887A522774j57222M85718l46918M810J94759J44014k60262p4543P4348J6636
$$ plain form
16958 844628 946292 959769 809454 798266 845196 882968 758211 760550 837441 865426 1048952
16947 1048952 770973 824394 967703 807378 1019659 694829 1063965 889595 640037 574931
16937 574931 1070269 1158799 1067211 833775 807605 764188 1125940 850059 790283 1165643
16927 1165643 970848 1292661 785802 1384040 1045632 1005840 941317 943463 1028089 911405
16917 911405 1157658 1103008 1498166 992133 1152768 1317027 1127789 1243802 988543 1100035
16907 1100035 1332294 1471033 1426471 1431028 1323831 1463088 1510839 1379706 1254508 1341382
16897 1341382 1202157 1211098 1421920 1582719 1476551 1388594 1559153 1795639 1644904 1522774
16887 1522774 1365552 1851270 1504352 1509162 1703921 1847935 1587673 1513130 1587478 1604114
16877A604114Q5726J4049K09185k80507l4226M33599k8130J9018j24946J24779
16867B022661R4862j17652L83809l18031l290J9103K25234j70297l42269P64806
16857B558936k90597j39280L02568j8683K7745q6056m9584K20107L47363n3620
16847B818899k08363k84949N29372K78725j83723m885p6924N6001P8936L21612
16837C324701m45731J94574K19665j07672J70460o5552J81706k24188K86175l4372
16827C499766K08598r1519n8102L19085L12004k94601k111K5213R3501Q5935L07415
16816D405184l5643L59386L37092l81022J1454N95692j56192j02084K55918P5764
16806E365549K85936J38019L65070l1202m15302M70238o0902N07677p5095j71297
$$ plain form
16877 1604114 1689840 1703889 1913074 1632567 1598341 2031940 2003810 2022828 1897882 2022661
16867 2022661 2117523 1999871 2383680 2065649 2062359 2081462 2306696 2136399 1794130 2558936
16857 2558936 2268339 2129059 2431627 2412944 2440689 2354633 2305049 2525156 2872519 2818899
16847 2818899 2610536 2325587 2854959 3133684 2949961 2945076 2868152 2924153 3003089 3324701
16837 3324701 2878970 3073544 3293209 3185537 3355997 3290445 3472151 3247963 3534138 3499766
16827 3499766 3708364 3616845 3558743 3877828 4189832 3895231 3893120 3918333 4011834 4097769 4405184
16816 4405184 4369541 4728927 5066019 4684997 4696451 5292143 5135951 5033867 5289785 5365549
16806 5365549 5651485 5789504 6154574 6123372 5708070 6178308 6117406 6625083 6549988 6378691
16796F378691M75399J13661K8875N93636L039M64984j2147L51857M9276M13235
16786H860506n6582N83392K92422R7080L47398L66336j7499L96788K12102M75913
16776A1557856K92027N39946p0268P48486L53561Q42642K54397M18577Q40613
16767A5777837M38090P03906N12805P07355N12344J178813K94392J267774M54867
16758B1848183J105283J011421O93990J186485J361355J255293J316760J327675
16750C1106445J637066J425282K002780J688378K247821K142281K283171K311210
16742D6844434K624350L357340K937696L668561L042195M071202M544843M249022
16734G5339643M925001N594169N245894O253039O025995O341446P279482P218540
$$ plain form
16796 6378691 6854090 6967751 6996626 7590262 7593301 8058285 8046138 8397995 8447271 8860506
16786 8860506 8803924 9387316 9679738 9776818 10124216 10490552 10473053 10869841 11081943 11557856
16776 11557856 11849883 12389829 12319561 13068047 13421608 14264250 14518647 14937224 15777837
16767 15777837 16215927 16919833 17432638 18139993 18652337 19831150 20125542 21393316 21848183
16758 21848183 22953466 23964887 24658877 25845362 27206717 28462010 29778770 31106445
16750 31106445 32743511 34168793 36171573 37859951 40107772 42250053 44533224 46844434
16742 46844434 49468784 52826124 55763820 59432381 62474576 66545778 71090621 75339643
16734 75339643 80264644 85858813 91104707 97357746 103383741 109725187 117004669 124223209
16726A24223209P011020P490805P344216P397029O631035N987051N461032M408035
16718A75953432L046632K156170M23213q49514k315167l207807m437312n607094
16710A65162553o317720o994608p305756p333861p685572p078253p676044o872631
16702A07898108o590870o641470n819942n121521n651361m731296m269299m130553
16694F4941796m185512l526293l211960l138323k833333k825466k440246k365503
16686D0415160j953848k090107j991654j258638j705451j729030j365423j141115
16678B7179894j212759j367026j021375j017747r56240q79158o15280j225671
16670A8884638n10335r01952n83047q23576n89277k96428p96143n49407l24388
$$ plain form
16726 124223209 131234229 138725034 146069250 153466279 160097314 166084365 171545397 175953432
16718 175953432 179000064 181156234 181579447 180729933 178414766 175206959 170769647 165162553
16710 165162553 158844833 151850225 144544469 137210608 129525036 122446783 114770739 107898108
16702 107898108 101307238 94665768 88845826 83724305 78072944 73341648 69072349 64941796
16694 64941796 60756284 57229991 54018031 50879708 48046375 45220909 42780663 40415160
16686 40415160 38461312 36371205 34379551 33120913 31415462 29686432 28321009 27179894
16678 27179894 25967135 24600109 23578734 22560987 21604747 20725589 20110309 18884638
16670 18884638 18374303 17472351 16889304 16065728 15476451 15180023 14383880 13834473 13510085
16661A3510085n82757k18203l25405q08378j51648k81659m02789j60675n40338
16652A0038233j90486n79550N3472m27899O7027l04352k50763j37359m58078j47568
16642G662677j52337m59090l11321k35813k34188L35216l24846J3955k27703j63802
16632E902748n8035k38486p38278L17288K45800j136m69713j74221Q7049l04049
16622D568967K09949n03302Q4818k25273K03177m48430K97214j36650j07402k63217
16612C679851j7000N9672l83831P8493J2059K6119p5095j90800L8431q0227k43877
16601B903795m5061K5004j35058m3758K97563l93970K25686l86023k9494j53203
16591B265481K79837j28128j01829O2491K06443k50281k37068L6785j43537N12015
$$ plain form
16661 13510085 12927328 12709125 12383720 11575342 11423694 11142035 10739246 10578571 10038233
16652 10038233 9847747 9268197 9321669 8893770 8960797 8656445 8405682 8268323 7810245 7662677
16642 7662677 7510340 7051250 6739929 6504116 6269928 6605144 6280298 6294253 6066550 5902748
16632 5902748 5844713 5606227 4867949 5185237 5431037 5429901 4960188 4785967 4873016 4568967
16622 4568967 4778916 4275614 4360432 4135159 4338336 3889906 4187120 4050470 3943068 3679851
16612 3679851 3662851 3722523 3338692 3417185 3429244 3455363 3380268 3189468 3227899 3147672 2903795
16601 2903795 2858734 2883738 2748680 2704922 3002485 2608515 2834201 2448178 2418684 2265481
16591 2265481 2545318 2417190 2315361 2377852 2584295 2334014 2096946 2133731 1990194 2502209
16581B502209l33925k83040Q7820r4345J65117k55983K95069P0674j10607j65901
16571A877088m9956j21139K30793j17813K3144q5887k06669J04589J31628m12318
16561A373460M86891n9066m39553J94380P3532k15367n5620j27700o9856O6863
16551A227964K60548j05746l09167M68959m81255L47067j0959J9220l93202P6869
16541A100298L11543j40055M3287m21839M00549j93827j13372J90452M4128j42783
16531A078381j76201j14273J54955j563M31061m85508R9977J52987k25165J8592
16521I33243j49969P974J58627K16897l11157j58954K83390k02917J57787K3583
16511I58504J50389m49855N2426k1523o2078J66107L1016k60659M24059D21422
$$ plain form
16581 2502209 2168284 1885244 1973064 1878719 2043836 1787853 2082922 2153596 2042989 1877088
16571 1877088 1827132 1705993 1936786 1818973 1842117 1756230 1549561 1654150 1785778 1373460
16561 1373460 1860351 1801285 1361732 1556112 1629644 1414277 1358657 1230957 1161101 1227964
16551 1227964 1488512 1382766 1073599 1542558 1061303 1408370 1397411 1416631 1023429 1100298
16541 1100298 1411841 1271786 1315073 893234 1293783 1099956 986584 1177036 1221164 1078381
16531 1078381 902180 787907 942862 941299 1372360 886852 986829 1139816 914651 933243
16521 933243 783274 791248 949875 1166772 855615 696661 980051 777134 934921 958504
16511 958504 1108893 659038 711464 689941 627863 793970 824986 564327 988386 421422
16500F37721O5014j51598N13243k83047j39604B86167L83370M1080R2868j34862
16490F68623L85511m08575N7403k52439L82840k97759K59497j66440J1258j45411
16480D94508L45478C71913O7558m8876K14558J32811l48780N8321J962P0034J13471
16469F32972j83393J63374l554K9305k24418L63665l29186B03754P951C8715N75548
16458F14263m2565K26120l50566P3036j55011j75069K67692K53818k09080j43741
16448C58897j00434J29032L7977k12083J2165A12262L76310q0378K05588B13722
16437E46276r2678j73969L3887J45941k24564N4121L93754l2324j96218l2743
16427D21483J75324J15235k42476j15524l2391j41226J42891j6069K33626O1436
$$ plain form
16500 637721 702735 551137 1064380 781333 641729 286167 669537 710617 803485 668623
16490 668623 1054134 645559 702962 450523 833363 535604 795101 628661 639919 494508
16480 494508 839986 371913 439471 390595 605153 737964 389184 447505 449467 519501 632972
16469 632972 449579 612953 609399 638704 414286 777951 448765 203754 211705 38715 614263
16458 614263 571698 797818 447252 520288 365277 190208 457900 711718 502638 358897
16448 358897 258463 387495 425472 213389 225554 112262 488572 408194 613782 213722
16437 546276 453598 279629 313516 459457 234893 289014 682768 650444 454226 421483
16427 421483 596807 712042 469566 354042 321651 180425 323316 307247 540873 602309
16417F02309q9755b6829A89200K63156J51567j49273q001M8303j22768J19419
16407D91603k12861A16530J15601o9523N7671N702N1790K7206J59884A22947J44196
16396B67143o6998N1012J72995L4790j19193G6119J59278J7834A06302J60578
16386B66880E3590O05571A61236L90824j28260m3869o6039J41739H5682J23009
16376B08691J7784m9516J43148Q6539j40080p6196O7044E8800J52678J97740A62264
16364A67867d5826G36888B5821L92034A49295J97834C8678M63107A24199K37589
16354C61788A61864g3693B40052l2947a9557F29694A58148J6191N4226B6137K30069
16343B56206K70145A7074M13330C7566J94543K37722B28072o0570K19624b27546
$$ plain form
16417 602309 512554 -26829 189200 452356 603923 454650 446649 494952 372184 491603
16407 491603 278742 116530 232131 162608 220279 225981 277771 304977 464861 122947 267143
16396 267143 200145 251157 424152 458942 339749 76119 235397 253231 106302 266880
16386 266880 53590 659161 161236 552060 423800 379931 313892 455631 85682 208691
16376 208691 226475 176959 320107 406646 266566 190370 257414 58800 211478 409218 162264
16364 167867 -45826 736888 25821 417855 149295 347129 38678 501785 124199 361788
16354 361788 161864 -73693 240052 207105 -19557 629694 158148 174339 228565 26137 256206
16343 256206 526351 17074 430404 37566 232109 469831 228072 167502 387126 -227546
16332A56271h2759H26L03365A30697J24033K34115a65270K4830A15415M8910F6398
16320b45410a08422E18623G0970K08622p484J2818A01466b00879C51541B2753
16309g6311K4212A28162K35453G991K02989d8207F2002J28448B5742g8849j56126
16298b34975A91410e938A56639J6317n0477J15635Q1652j43068a35330A30581
16287A52838J33319A41718N7899h7300B78770b12610A6380J99974N4011E7426
16276D01J77894k236J26653j15970a99216A50700J1015Q5087a50848A7713c35825
16264G2022r001J50901A06470K86303a06926j3148j47007B53002o7120J16857
16254C02739a33378A06829J0968Q771c3870C5374L7055j4085J77416I0519f3183
$$ plain form
16332 156271 -82759 826 304191 130697 254730 488845 -165270 -140440 115415 164325 66398
16320 -245410 -108422 518623 70970 279592 272108 284926 101466 -200879 351541 22753
16309 -76311 -52099 128162 363615 7991 210980 -48207 62002 190450 25742 -78849 -234975
16298 -234975 191410 -5938 156639 172956 122479 238114 319766 176698 -135330 130581
16287 152838 286157 141718 199617 -87300 278770 -212610 16380 216354 270365 57426
16276 401 178295 176059 302712 186742 -199216 150700 161715 246802 -150848 17713 -335825
16264 72022 63021 213922 106470 392773 -106926 -120074 -267081 253002 185882 302739
16254 302739 -133378 106829 117797 126568 -33870 35374 72429 58344 235760 90519 -63183
16242B03571g2652a2451k2734F8187L43424f3738A36433b81753B11862d4991B9568
16230B94817A28946J23355K31528A01718a23552f193A23458K51170C2812c09203
16219G369c42866c3070I3152g4197L784K7222k50583i01B84924b96068A58572
16207b5302A24708q886J7774K1520C7861K1776K03895j21559a14093q9873A2410
16195i3199D5426R3812J24222A09771b80552C19164h8550A86569H9513j8003Q3737
16184A55247f8967I9797k072B6972O5494j3152b38034H5045K57285E7082J11015
16173A68097p6957g9142o5685A6544a7159j08843j3783k9638B31273a43116b4408
16161a67525j12402A95069O6194p5074i6429C7870J62877c4396A07764d5125o1282
$$ plain form
16242 203571 -72652 -12451 -35185 68187 411611 -63738 136433 -281753 211862 -44991 29568
16230 294817 128946 252301 483829 101718 -123552 -6193 123458 374628 32812 -309203
16219 7369 -342866 -33070 93152 -74197 -70413 -43191 -293774 -901 284924 -296068 158572
16207 -25302 124708 115822 133596 155116 37861 59637 263532 141973 -114093 -203966 12410
16195 -93199 45426 139238 263460 109771 -280552 319164 -88550 186569 89513 71510 155247
16184 155247 -68967 99797 97725 26972 92466 79314 -238034 85045 342330 57082 168097
16173 168097 91140 -79142 -144827 16544 -17159 -126002 -139785 -169423 231273 -143116 -24408
16161 -167525 -279927 195069 261263 186189 -96429 37870 200747 -34396 107764 -45125 -106407
16150a06407B51681b22723P7226B23230i8742A18174g1942C1250a20626D7440
16139D9304k0852J40594B1685N9010a17294A72735M4966e0927a9875b209A34545
16127h9255H5032a9522B47046d3863A50245a39766A11383J31670J40937j58052
16117B25938g7435A58116E4275c892j23085l6766a972l42039b3841o794B18501
16105D2870J73199a99047D5054J81758L63774A26119a33573A10257J4966J47469
16095B72692b74830B5445a73068A110b62683c0667A81021p2679J67620a40647
16084A89704i7694k3878r7812A508L3542L829a79094c1327k90334H8347a5508
16072F9639l0844b20321k0447H8354a48856l2410G742J60124a19281D2081a9773
$$ plain form
16150 -106407 251681 -222723 -145497 223230 -98742 118174 -71942 31250 -120626 47440
16139 49304 28452 169046 21685 80695 -117294 172735 217701 -50927 -19875 -2209 134545
16127 -89255 85032 -19522 247046 -43863 150245 -139766 111383 243053 383990 225938
16117 225938 -77435 158116 54275 -3892 -126977 -163743 -1972 -344011 -23841 -30635 218501
16105 42870 216069 -199047 45054 226812 590586 126119 -133573 110257 125223 272692
16095 272692 -274830 25445 -173068 1110 -262683 -30667 181021 108342 275962 -140647
16084 189704 -97694 -121572 -219384 1508 35050 38879 -179094 -31327 -321661 88347 -15508
16072 69639 38795 -220321 -240768 88354 -148856 -181266 7742 167866 -119281 42081 -19773
16060A03065b7993n7365R31A16167c7473J5512j76364B06966M7820j24614E5258
16048A75112a74301f1494k54487F5520b41022A90139G9192a9019e584j64789b7428
16036a41747A13744g0499j15553A71992q4536K29497I6891L1135i68j11194I8651
16024B51465F9108J3568P515b21213B6405P7430d386k40745R0283j15012A69011
16012g9858L4274B20956a4814l56150J29279l20A62534a00987A92472k8240b10260
16000a91532g3558I1463b55080L6185L6570A13521a29545e7578A70399E1003a13116
15988A46798c0170A45357d0764A11964J29467R8951G97M14617r9207G8533b7647
15976a4433E9415b4004m4341I7314J17559a15268C75518E5713N1422h6488A24246
$$ plain form
16060 103065 -27993 -85358 -84427 116167 -37473 -21961 -198325 206966 254786 130172 55258
16048 175112 -174301 -61494 -315981 65520 -241022 190139 79192 -19019 -5584 -170373 -27428
16036 -141747 113744 -70499 -186052 171992 87456 316953 96891 128026 -968 -112162 98651
16024 251465 69108 82676 90191 -221213 26405 103835 -4386 -245131 -154848 -269860 169011
16012 -79858 -45584 220956 -14814 -370964 -241685 -242005 162534 -100987 192472 164232 -210260
16000 -191532 -73558 91463 -255080 -218895 -182325 113521 -129545 -57578 170399 51003 -113116
15988 146798 -30170 145357 -40764 111964 241431 340382 797 415414 316207 78533 -27647
15976 -14433 59415 -24004 -68345 97314 214873 -115268 375518 55713 107135 -86488 124246
15964A46498c56555a0735A84035c30152C61408D1844a0789j11860p9510K8672
15954a73487P8727l5341k9763B27656a80866l898k5845E0457a47056M4510A06518
15942c5453C9534O5691b91189A51392A7278O4171e2953B33578A288O8103H842
15930C08284b04230j45381l630A43424a61607B85211a33080A95595e7583G8549
15919C796J22059j9657i1110j39547B2478L5472b47181G4303h282j66676A26808
15907B9571b29677f7820j53389M7146B19326a02331C0164b64080A47688K1052
15897A68740d8270n4916A47808d2301C77746a10976L2393B7682d39808A425b36081
15885b28179i1614A24826i5251B20679C6453i226C49925G6153a20916A5880b6414
$$ plain form
15964 146498 -356555 -10735 184035 -330152 361408 41844 -10789 -122649 -202159 -173487
15954 -173487 -94760 -130101 -159864 227656 -180866 -184764 -210609 50457 -147056 -102546 106518
15942 -35453 39534 105225 -291189 151392 17278 81449 -52953 233578 1288 69391 8842
15930 308284 -204230 -349611 -353241 143424 -161607 285211 -133080 195595 -57583 78549
15919 3796 125855 106198 -91110 -230657 22478 57950 -247181 74303 -8282 -174958 126808
15907 29571 -229677 -67820 -221209 -174063 219326 -102331 30164 -264080 147688 168740
15897 168740 -48270 -103186 147808 -42301 377746 -110976 -78583 27682 -439808 1425 -236081
15885 -228179 -91614 124826 -95251 220679 36453 -9226 349925 76153 -120916 15880 -26414
15873g1118k9j79372b615k28538B57144m3523q805h4738k3535j27059C2561L0176
15861F2737O8196b69921e9593k14672h8560G6118d6994C3949K7749O5709f915
15849D03406c86093a89214C4384f7535C78606a0798p7528c1221A57577L6634C7476
15837b20118C60761a63720k30144H7626d6286j08592A29192O4162a92337j89769
15827c82106l5794C85602a93534A4754J20191g8330I8996l7811H504R3421P4299
15816A76224d0773j56364a2502j01538k01482J11251P5958j68520B39794j17030
15806A22764c47137i9367B26788A6058b01403A90367E0610b66583l2289A172P3760
15795G4932j3186a5956k0958j00937F4984a88928B853Q8579g3712A56451F0568
$$ plain form
15873 -71118 -71147 -250519 -2615 -231153 257144 213621 204816 -84738 -108273 -235332 32561 62737
15861 62737 130933 -269921 -59593 -274265 -88560 76118 -46994 33949 61698 127407 -6915
15849 403406 -386093 -189214 34384 -67535 378606 -10798 -88326 -31221 157577 194211 37476
15837 -220118 360761 -163720 -393864 87626 -46286 -154878 129192 193354 -192337 -382106
15827 -382106 -417900 385602 -193534 14754 134945 -78330 98996 61185 8504 101925 176224
15816 176224 -40773 -197137 -12502 -114040 -315522 -204271 -128313 -296833 239794 122764
15806 122764 -347137 -99367 226788 16058 -201403 190367 50610 -266583 -298872 1172 74932
15795 74932 61746 -15956 -36914 -137851 64984 -188928 2853 91432 -73712 156451 60568
15783A50081h0472C004L2737b7494C42431f3266p3431f3320E3448a53690c1988
15771b31432n2625i2677H4970i3693l0108A45568n6763J8852c17035d1053j22701
15760a63754g6085D5572J0895b56097A55562e33632g1853B7473c22170B9972d9310
15748a50847n1922h9544C2870K54497D863b7422A15107J14564a21963d6377k41265
15737b87642L6663C15261O6859b7484I1609k3384b73048A56277c1260B35295f3640
15725h2981I18a55217c3838I2023a43266f0215n7230B75112f3859j13350c4333
15713a95988A83631n8977F1243O4217l8146c64131A9293J41962L764a9687A3279
15701g2872k01575c3268g846j7186A5204e2774A9750J04307b89402A47309b96018
$$ plain form
15783 150081 -80472 3004 35741 -27494 342431 -63266 -136697 -63320 53448 -153690 -31988
15771 -231432 -284057 -92677 84970 -93693 -123801 145568 88805 107657 -317035 -41053 -163754
15760 -163754 -76085 45572 56467 -256097 155562 -533632 -71853 27473 -322170 29972 -49310
15748 -150847 -202769 -89544 32870 287367 4863 -27422 115107 229671 -121963 -46377 -287642
15737 -287642 -250979 315261 382120 -27484 91609 68225 -273048 156277 -31260 235295 -63640
15725 -82981 918 -155217 -33838 92023 -143266 -60215 -117445 275112 -63859 -177209 -34333
15713 -195988 183631 124654 61243 125460 87314 -364131 19293 161255 165019 -19687 13279
15701 -72872 -274447 -33268 -7846 -25032 15204 -52774 19750 124057 -289402 147309 -296018
15689A13034a92388b9036j92076e2304j8348A6519a05851k22240J61156M8164
15679a18771a213H166a86033D8840a42576J6960L1130J6018A51044c3152C16756
15667c3489j7310n2283r0068j36886A76948r457h3474A79419i114A08677a23253
15655A24589D1644i5301m7443f2494A02664D9340M5688a66611A83978H5949c0717
15643C14860c09363J1820A36655b75633N2520M8053m1401A29743L1501i4789l2685
15632a27474B34395a72253O9145C3421K9418d1056o9502A73228a78647D6307c08919
15620H0877B1940K47125D23e9208B11452a25955j04315j45510d6113l85844I8263
15608i2180b6900j4332A18942c777m7224A94425H7171O2510b27379M6518A25413
$$ plain form
15689 113034 -192388 -29036 -221112 -52304 -70652 16519 -105851 -328091 -166935 -118771
15679 -118771 -1213 8166 -186033 48840 -142576 -125616 -94486 -78468 151044 -33152 316756
15667 -33489 -50799 -103082 -193150 -330036 176948 167491 -83474 179419 -9114 108677 -123253
15655 124589 41644 -95301 -142744 -62494 102664 49340 95028 -166611 183978 85949 -30717
15643 314860 -309363 -297543 136655 -275633 -223113 -175060 -216461 129743 161244 -94789 -127474
15632 -127474 234395 -172253 -103108 33421 62839 -41056 -110558 173228 -178647 46307 -308919
15620 80877 21940 269065 423 -59208 211452 -125955 -230270 -375780 -46113 -431957 98263
15608 -92180 -26900 -41232 118942 -3777 -51001 194425 87171 149681 -227379 -180861 125413
15596f9103j16404B39576D601e7232I4864a39581A25276e1030B06309b28851H6966
15584b02756i5601C8940K82a45565B79669d9764C36297E7533N3249f5754K456
15573f3298K1834l09964a16617H051b7758j66990g8773A22855l9118a62430j60039
15562c22469C813P8006L25207a20538J6341j06286E8533f3128m8489B2715J98904
15551B21619b74317M4459B27715h3616A47275a67049g553r5515J3704k3936C02700
15539C04269i426j49744A83835K4915l5379q4948K47f9386C27773g1057a6048
15527g1843D7043b42313K4242h3884j1404B90705a07810j34811g0459p064I3348
15515a04576a525n3987J3995A84739h7866A54223a97578A12026b38041A1218a57683
$$ plain form
15596 -69103 -185507 239576 4601 -57232 94864 -139581 125276 -51030 206309 -228851 86966
15584 -202756 -95601 38940 39222 -145565 279669 -49764 336297 57533 110782 -65754 -63298
15573 -63298 -41464 -351428 -116617 8051 -27758 -194748 -78773 122855 83737 -162430 -322469
15562 -322469 3813 81819 407026 -120538 -104197 -210483 58533 -63128 -111617 22715 221619
15551 221619 -274317 -229858 227715 -83616 147275 -167049 -7553 -103068 -89364 -113300 302700
15539 304269 -9426 -159170 183835 208750 173371 88423 88670 -69386 327773 -71057 -16048
15527 -71843 47043 -242313 -218071 -83884 -95288 290705 -107810 -242621 -70459 -77523 93348
15515 -104576 -1525 -55512 -41517 184739 -87866 154223 -197578 112026 -238041 11218 -157683
15503a17399A8087K79445B0428J56154A5462R7539J88149f3711L1341G881f1639
15491e1282A76807a93897A19929c70947J84287g1661a1250A85208e8087m2785
15481a00872A98256o3317A6822L00383I1260g540c53n6550F6467c18578a56861
15469a34046A5800J98349e8456p2304A14691n482j4646b21596e0728H0821L4393
15458A15214J43156r9502R6481a70366G0983a47771B81825i469o0341j05343O8212
15447a06941j20964R4482E0927i6568A11003a82237N7735A42530f1964l25760
15437c87724F770K66072a30210A41035K0603l7587B6033b95628A58414m5186K95825
15426D09053b25604J07390j08133A2550a22429A60158l8401a4881A98610b4587
$$ plain form
15503 -117399 18087 297532 20428 176582 15462 113001 301150 -63711 -32370 7881 -61639
15491 -51282 176807 -193897 119929 -370947 -186660 -71661 -11250 185208 -58087 -100872
15481 -100872 198256 134939 16822 317205 91260 -7540 -353 -56903 66467 -318578 -156861
15469 -134046 15800 214149 -58456 -130760 114691 109209 94563 -221596 -50728 80821 115214
15458 115214 258370 158868 255349 -170366 70983 -147771 281825 -9469 -69810 -175153 -106941
15447 -106941 -227905 -133423 50927 -96568 111003 -182237 -124502 142530 -61964 -387724
15437 -387724 6770 272842 -130210 141035 161638 124051 26033 -295628 158414 113228 409053
15426 409053 -225604 -118214 -226347 12550 -122429 160158 121757 -14881 198610 -24587
15415a21280A97587a88751N3267B27114D55a22261p5354l5977B86196i1484j54755
15404b46239B55004a42922p7253a05865K7270A63097B3647a47907A71507a30789
15393G9704a54322A24093l4536k3503a39827A80936n0348l3716a41570D6727b36791
15381E760R4764l9844c5650j06284C308J20105N6465c11326j68285D5802g9803
15369a7616j59900G8059j4211a159l09607A87984h8619B56394a04955A14267c0336
15357f5612G1092E635b9157j26654d1296A99580b04076d9309A16858j8079M4280
15346A43059a79456C8239J4159L67104d718m9640J5008G81a4894j62355A41417
15334a53853B05757k8363k2758l7133E3372O0884J1262m7280M5887l3107K13114
$$ plain form
15415 -121280 197587 -188751 -135484 227114 455 -122261 -197615 -233592 286196 -91484 -246239
15404 -246239 255004 -142922 -220175 -105865 -78595 163097 23647 -147907 171507 -130789
15393 79704 -154322 124093 89557 66054 -139827 180936 130588 96872 -141570 46727 -236791
15381 5760 100524 60680 -35650 -141934 3308 123413 179878 -311326 -479611 45802 -79803
15369 -17616 -177516 78059 63848 -1159 -310766 187984 -88619 256394 -104955 114267 -30336
15357 -65612 71092 5635 -29157 -155811 -41296 199580 -204076 -49309 116858 98779 143059
15346 143059 -179456 38239 52398 419502 -4718 -54358 -39350 781 -14894 -177249 141417
15334 -153853 205757 177394 154636 117503 53372 114256 125518 78238 124125 91018 304132
15323C04132a14346J3078G4998a2126q7805K8866C48158n9619h8912l3518K9270
15312i3160B10824J07757A12717D9549c41148J4456n4680i7039A64023o3426f2294
15300g1226A15590a64331k8421A15734a83793A77860b8714k21954A8683a75752
15289B1M54411a31978A17344R0665a36605C9429A3968a10870G5538K9212a26641
15277a38311B07336e9968m2689l8475p200A80830a34520c8517E9691K54955A7137
15265a7716r4588b3197E1817c0475n9638o1417b5041B13J85675d58349B0912O517
15253B7429M97189A63251R3312f7234G18264K20410O90958p43325O66864l47386
15243A205785E13434k24792A30532j9965J46465e6125D9644m878L33671A18108
$$ plain form
15323 304132 -114346 -101268 74998 -12126 -99931 -71065 348158 288539 -88912 -122430 -93160
15312 -93160 210824 318581 112717 49549 -341148 -326692 -381372 -97039 164023 100597 -62294
15300 -71226 115590 -164331 -192752 115734 -183793 177860 -28714 -250668 18683 -175752
15289 21 454432 -131978 117344 208009 -136605 39429 13968 -110870 75538 104750 -126641
15277 -138311 207336 -59968 -102657 -141132 -148332 180830 -134520 -38517 59691 314646 17137
15265 -17716 -112304 -23197 51817 -30475 -90113 -151530 -25041 213 185888 -458349 20912 27429
15253 27429 524618 163251 256563 -67234 718264 938674 1629632 886307 1553171 1205785
15243 1205785 513434 288642 130532 110567 257032 -56125 49644 44766 378437 118108
15232a15205J4276j0523m6372K6967A43852C2606J83782m986q6964E4252a38652
15220b23170a08545A09990M7061a38126B4999J91740b4710D00756e22474B34527
15209B4124J39245K3965E8064a15387j61451c628j07740B33882i4404k39705B02836
15197B592J33711B7879d0576b933C6564j6294c329n6857K4470B16234D2459K43347
15185B85806A06109K04969a6965I6391K5003C1297O4618j1541k4019K16487A1714
15173B27388b15445B37440b4014F9667b8679j97268B56762J63731B0520a0647
15162B23063c8725J1280B62403E8405N3456d6746l6762A64651e4315E442g5683
15150D8162K83073a48043A57636P7733a54184G3810j8881f8707J8095I0686b49598
$$ plain form
15232 -115205 -100929 -111452 -157824 -130857 143852 32606 216388 211402 124438 54252 -138652
15220 -223170 -108545 109990 157051 -138126 24999 216739 -24710 400756 -522474 234527
15209 24124 163369 187334 58064 -115387 -276838 -3628 -111368 233882 -94404 -334109 202836
15197 2592 136303 27879 -40576 -2933 36564 20270 -3329 -60186 -35716 216234 42459 285806
15185 285806 106109 311078 -16965 96391 121394 31297 95915 84374 60355 276842 11714
15173 227388 -215445 237440 -24014 69667 -28679 -225947 256762 420493 20520 -10647
15162 223063 -38725 -27445 262403 58405 111861 -46746 -83508 164651 -54315 5442 -75683
15150 48162 331235 -148043 157636 235369 -154184 73810 54929 -68707 -50612 90686 -249598
15138a6546l82608A07279I202a2177A76975D7697a47681B20492a35409B26300
15127I9121K75547I3328m1410O31606a42260B93612R9952a57086O3713C63756
15116I6130a10433A49099b29628I5268J77682a58462A91638r2661f8872R425D39262
15104f8916F9534J727c5651A27731N4753b22811A80431l1896A2171R3850P6086
15093A82107B9565L64259h080B1079a8062D3872J35337J59351A07844a45635E4814
15081a46365A65268B306i5882A24311L0019J53070e0558A46703J36012A18815
15070A81582b9557G5476M14066k16097e0591b3262p8078A95891h919l4948H9231
15058A18846c0914p55A76514a7240A04783M5714J4245j5145c2240A34380o0670
$$ plain form
15138 -16546 -399154 107279 9202 -12177 176975 47697 -147681 220492 -135409 226300
15127 99121 374668 93328 51918 683524 -142260 293612 393564 -157086 -93373 363756
15116 96130 -110433 149099 -229628 95268 272950 -158462 191638 98977 -68872 -59447 439262
15104 -68916 69534 71261 -35651 127731 182484 -222811 180431 148535 12171 106021 182107
15093 182107 29565 393824 -8080 21079 -18062 43872 179209 338560 107844 -145635 54814
15081 -146365 165268 2306 -95882 124311 154330 307400 -50558 146703 282715 118815
15070 181582 -29557 75476 489542 273445 -50591 -23262 -101340 195891 -8919 -43867 89231
15058 118846 -30914 -31669 176514 -17240 104783 150497 164742 149597 -32240 134380 73710
15047G3710Q0624E698i997C9626L4163M13719j57237A01473J01680r7538D7649
15035A82837K3680f1024j45737D16600f743C75169j57798B4144L03006A57984
15024A27825a38702A1055Q8270e7591B96905j44876M9745A00213a27881H0464
15013C64032q9991J98502j97543a06526B47106q7064p9761J122B1889a4636D80793
15001C11963F5833B874J02739K28098L5973A44180J10274m6167b9970C80424I504
14989A82524L1837M2388B0087a22013C96145B6096Q6625P0569J36269D803L7249
14978D2052K31468b8361A57897R0486A12669J54524B6436N17900k12905j20353
14968B11078J64791A46311K57451c9715D35273A12853h1776C29200m1597J79504
$$ plain form
15047 73710 154334 5698 -9997 39626 73789 487508 330271 101473 203153 105615 47649
15035 182837 206517 -61024 -206761 416600 -6743 375169 217371 24144 327150 157984
15024 127825 -138702 11055 99325 -57591 296905 152029 201774 100213 -127881 80464
15013 364032 274041 472543 275000 -106526 247106 160042 80281 81403 21889 -14636 480793
15001 311963 65833 2874 105613 333711 369684 144180 254454 208287 -29970 380424 9504
14989 182524 214361 256749 20087 -122013 396145 26096 112721 183290 319559 4803 42052
14978 42052 273520 -28361 157897 248383 112669 267193 26436 544336 331431 211078
14968 211078 375869 146311 403762 -39715 435273 112853 -81776 329200 287603 467107
14958D67107B10811L60985k74945o9047b84751f4975E4784J06828B4633K15729
14948B40362o3166J72131H3733J13488k7712a82097D25957j88733q3286P1868
14938B25806a8072D31103j63638O6994I4806K059M31171d6832B89565e1715c571
14926A64837J66602E5292A9077K68882I1504J70129E0906O6215j9860K56642J67033
14915E20936k52951J9315n2700L62310B82650B6009L20487M751D8730L52777n2487
14904C49020j06951L1787J35008J14096B0488M5032J80674L2278j9082l7712J45215
14893C66893A51455N987J59810C8830g2781G48823A33710K60350a02233A39835
14882A40693N0051a14417B47688h7414C83625j9317J10239j98697P1507i5C16674
$$ plain form
14958 467107 210811 571796 296851 227804 -284751 -64975 54784 161612 24633 240362
14948 240362 177196 349327 83733 197221 169509 -182097 425957 237224 153938 225806
14938 225806 -18072 431103 267465 334459 94806 96865 528036 -46832 289565 -51715 -3571
14926 164837 331439 55292 19077 287959 91504 261633 50906 117121 97261 353903 520936
14915 520936 267985 287300 234600 596910 282650 26009 346496 351247 48730 401507 349020
14904 349020 242069 273856 408864 522960 20488 65520 246194 278472 259390 221678 366893
14893 366893 151455 157442 317252 38830 -72781 748823 133710 394060 -102233 139835
14882 140693 190744 -114417 247688 -87414 383625 364308 474547 275850 347357 -95 316674
14870C54903J56107j63281j43114p7605M6558j6643L02434j55814L3836A9278
14859D67591A73097K29297A80392a03559C59829k6022j1758j28259H8878L09616
14849C98494l0589J58641j54489J08553J93536k05243I0721n519J66640a75614
14838E0313K75812J13776j39210J63788N5422A1374N81670B53339m3938J76020
14828C85421K3155A15603K89892j79017n5244J29700R2925l401A31265M15303
14818E46568M4865o957k70894l9416r2008K14126J66476j12335j77943J21764
14808C94246J18469B4315N31177j00077m3468J03187D264O89481k53092K44501
14798F85154j84728p118A53360K19121j70836J95851J48881B51989P2810K14346
$$ plain form
14870 354903 511010 347729 204615 127010 173568 156925 459359 303545 337381 19278
14859 467591 173097 402394 180392 -103559 359829 333807 322049 193790 88878 398494
14849 398494 367905 526546 372057 480610 674146 468903 90721 85202 251842 -175614
14838 50313 326125 439901 300691 464479 519901 11374 593044 253339 209401 385421
14828 385421 408576 115603 405495 226478 171234 300934 393859 390458 131265 546568
14818 546568 591433 584476 313582 274166 182158 396284 562760 450425 272482 394246
14808 394246 512715 24315 555492 455415 411947 515134 4264 693745 440653 685154
14798 685154 500426 493308 153360 372481 201645 397496 546377 251989 324799 539145
14788E39145r8442K76036l22767p6362M6912k6973K10223j0311L819q6477J40706
14777E95509j18269m2657P272o8981K01643N7983k42188q8135J44370o3207O0287
14766D43627O7850j53945K61321r7068k4277k00191L13957B17984K07148J05049
14756E30181q4434n362J82312K10440C1847N00565j55062M2779J94225m4490B45923
14744D13153L9754A79177L09059P5047k35677L81232j4189l46148L00842r2076
14734E57267K19071j18375j35133L81761m21057j28213K23738j63582K45338p2179
14724E88636J07816l31553J61264R3935J35687p661l32949Q7207L42359j80142
14714F64599j1782j58586M9081K06218j98775L8352K423M7722J14891j65681P4423
$$ plain form
14788 539145 440703 716739 393972 317610 364522 337549 547772 537461 541280 454803 595509
14777 595509 477240 434583 441855 372874 574517 632500 390312 302177 446547 383340 443627
14766 443627 511477 357532 618853 521785 497508 297317 611274 217984 425132 530181
14756 530181 445747 440385 622697 833137 31847 532412 377350 420129 614354 569864 245923
14744 413153 452907 179177 488236 563283 327606 708838 694649 348501 649343 557267
14734 557267 776338 657963 522830 904591 483534 355321 579059 415477 660815 588636
14724 588636 696452 364899 526163 620098 755785 748124 415175 502382 844741 664599
14714 664599 652817 494231 543312 749530 550755 589107 591530 639252 754143 588462 662885
14703F62885L68902D73455M82812J7781j34607n1758j6944k48457L27372J03929
14693I53583k20195j16043L11918j61265J14198o2948k032J52824l17805J12371
14683G64606j90191L95601l59489J81848L7147J5924k87513K18668J0781q4988
14673G02394K73722q7014j34426J48416J58586m01196J45109p787k26157M58571
14663A030218k74626M9607R4776l97237M50591l09818J04293K4290L7885J88635
14653I98614l28042K0509J57138L0837r8161J59096k38056J82759j41839J12821
14643H55676L38406j42535J25888J11105l83478L28221J36170l36807N096n1255
14633I86487k648R7073l7777L6368j91517N3181J46829J19725l47549K06894l78193
$$ plain form
14703 662885 1031787 473455 956267 974048 839441 787683 770739 522282 849654 953583
14693 953583 733388 617345 929263 767998 882196 819248 817216 970040 652235 764606
14683 764606 574415 970016 610527 792375 829522 845446 557933 776601 787382 702394
14673 702394 976116 889102 754676 903092 1061678 660482 805591 797804 571647 1030218
14663 1030218 755592 805199 899975 502738 953329 643511 747804 772094 809979 998614
14653 998614 670572 691081 848219 879056 780895 939991 701935 884694 742855 855676
14643 855676 1194082 1051547 1177435 1288540 905062 1233283 1369453 1032646 1037742 986487
14633 986487 983839 1080912 1043135 1079503 887986 941167 1087996 1207721 860172 1067066 688873
14622F88873L81706J23080k10868J00156j4942q768j05946K98791r5938j67240
14612I88904J04669j4067J97831j3188j77297p084K63971k20406k4424j5696K54225
14601A337438L31676m75680J46550J36990l29683O4675J53137j03943J09555k02324
14591A168391K54240J38185m54457K04506R5205J1796K13869j88688P8600J25075
14581A646722j91034L68170m02588J59313K48283m37230O5122O7733M37372j11629
14571A850234J13669m01340K31117J05390l9679p2959J94101l93611L12324M49116
14561B348362l02054K56301j46770J14831M09671j35725j13127P22374o0440P06985
14551C800408M66799J070478K682460N471587R793261J4107447m359641A4935030
$$ plain form
14622 688873 1070579 1193659 982791 1082947 1068005 1059237 953291 1252082 1156144 988904
14612 988904 1093573 1079506 1277337 1264149 1086852 1079768 1343739 1123333 1098909 1083213 1337438
14601 1337438 1669114 1193434 1339984 1476974 1147291 1211966 1365103 1261160 1370715 1168391
14591 1168391 1422631 1560816 1106359 1310865 1406070 1417866 1631735 1443047 1521647 1646722
14581 1646722 1455688 1823858 1421270 1580583 1828866 1391636 1456758 1524491 1961863 1850234
14571 1850234 1963903 1562563 1793680 1899070 1859391 1786432 1980533 1586922 1899246 2348362
14561 2348362 2046308 2302609 2155839 2270670 2680341 2544616 2431489 3153863 3093423 3800408
14551 3800408 4267207 5337685 8020145 13491732 23284993 37392440 33032799 14935030
14542H030887C954011j195237r48277J1882k35950q0359J93106k31409O5292L22575
14532A855634k5324k39768L37684k55238J4470L27094J3047j90242j80963M98130
14522B154524m7450J857q4971j5167J35085J15417m97765K86652K01375k14504
14512B035053K24290q5037J26428k13910J19549k58329L92804r5626N7666K8303
14502B331191J31247q3878L33809k34300R7569q1777O5319P1948N8426j85812
14492B503742L78249k34009k09281K30463J42972l69999M27160J20129L42252
14483C331678l39559n3285K06107k20357L54655r8651J22551J73894N5576l04733
14473C227876K99705j26565J0990L4964J76240l68233M41635k1424j66048K99860
$$ plain form
14542 8030887 3954011 2758774 1810497 1822379 1586429 1506070 1699176 1467767 1533059 1855634
14532 1855634 1830310 1590542 1928226 1672988 1687458 2014552 2027599 1837357 1656394 2154524
14522 2154524 2107074 2108931 2023960 2008793 2143878 2259295 1761530 2048182 2249557 2035053
14512 2035053 2259343 2174306 2300734 2086824 2206373 1948044 2340848 2245222 2302888 2331191
14502 2331191 2462438 2378560 2712369 2478069 2575638 2493861 2559180 2631128 2689554 2503742
14492 2503742 2881991 2647982 2438701 2669164 2812136 2442137 2869297 2989426 3331678
14483 3331678 2992119 2938834 3144941 2924584 3279239 3180588 3303139 3477033 3532609 3227876
14473 3227876 3527581 3401016 3412006 3446970 3623210 3254977 3696612 3675188 3509140 3809000
14463C809000K32274j41826k51485J15480M50200K18721o55570N48933j77284
14454D148443l20817P11237l39644J84237l72804J41881K88291O7938j44146N58497
14444D923113k64339j44601K3832M56021l58092K3772N26493j57517O8674K32324
14434E329680l21875K03687P4644J25733K10162j14822J01351J70534K09887n756
14424E983225j17520L57079j18459K02495J22266L54653j48589j40051J70382
14415F665481L54709R4918l15806J45737J71164K55274j13667K09358L07147M1934
14405G816249J59517J30294l9029N00522k11794j81894J45914O68365K37660j66998
14395I058806L44398K15566j80699O621M00964J20116M25106j15034L75414K1200
$$ plain form
14463 3809000 4041274 3899448 3647963 3763443 4213643 4432364 3776794 4325727 4148443
14454 4148443 3827626 4538863 4199219 4383456 4010652 4152533 4440824 4508762 4364616 4923113
14444 4923113 4658774 4514173 4538005 4994026 4635934 4659706 5186199 5028682 5097356 5329680
14434 5329680 5007805 5211492 5286136 5411869 5622031 5507209 5608560 5779094 5988981 5983225
14424 5983225 5865705 6222784 6104325 6306820 6429086 6783739 6635150 6495099 6665481
14415 6665481 7020190 7115108 6799302 6945039 7116203 7371477 7257810 7467168 7774315 7816249
14405 7816249 7975766 8106060 8067031 8567553 8355759 8173865 8319779 8988144 9225804 9058806
14395 9058806 9403204 9618770 9438071 9444692 9845656 9965772 10390878 10275844 10651258 10672458
14385A0672458M67070K14320Q3352j03682L62747J39130M74079Q8831K2784O82456
14375A3103545K67696k69324P94402k91157P38482O0685N40317J01164K91351
14366A5337161K67855O74878O8709J49290R46114J03528N39199J68346P17420
14357A8972500M12666k6539O80747M47253O83189J18395O55771O43245O70593
14348B3257820M20398N09254J095649N36032O67358O03049R39742N78429O05852
14339B9213583Q36299Q49744O96242J106018J338299P78441J126104J555703J052140
14330C8552573J013576J285279J501146J432475J242218J662614J527065J829710
14322E0046656J319157K428005J712537K361184K136300K260641K739518K324238
$$ plain form
14385 10672458 11139528 11353848 11437200 11333518 11696265 11835395 12309474 12398305 12421089 13103545
14375 13103545 13371241 13101917 13896319 13605162 14343644 14404329 14944646 15045810 15337161
14366 15337161 15605016 16279894 16348603 16497893 17444007 17547535 18086734 18255080 18972500
14357 18972500 19385166 19358627 20039374 20486627 21169816 21288211 21943982 22587227 23257820
14348 23257820 23678218 24187472 25283121 25819153 26486511 27089560 28029302 28607731 29213583
14339 29213583 30049882 30899626 31595868 32701886 34040185 34818626 35944730 37500433 38552573
14330 38552573 39566149 40851428 42352574 43785049 45027267 46689881 48216946 50046656
14322 50046656 51365813 53793818 55506355 57867539 60003839 62264480 65003998 67328236
14314F7328236K652127L093782L049683L039394L670862L740672L856439M170443
14306I4601638M509215M837235N087322N284782N766356N808952O373119P118202
14298A39386821P554186P520599Q835676R152592R588732J0033521J1108938J1547461
14290B14728526J2169982J2697468J3676783J3698346J4929520J5337507J5467935
14283C12706067J5668956J6022941J5479872J5434784J4734107J3815185J2890903
14276D16752815J1258176R112180N506728l08425k513114j867489j464943j843060
14268D34632868o755321m302148r894474j3183240j4181250j5057789j6201031
14261C55057615j6602453j6854412j6062132j6373957j5230051j4698860j3966487
$$ plain form
14314 67328236 69980363 73074145 76123828 79163222 82834084 86574756 90431195 94601638
14306 94601638 99110853 103948088 109035410 114320192 120086548 125895500 132268619 139386821
14298 139386821 146941007 154461606 163297282 172449874 182038606 192072127 203181065 214728526
14290 214728526 226898508 239595976 253272759 266971105 281900625 297238132 312706067
14283 312706067 328375023 344397964 359877836 375312620 390046727 403861912 416752815
14276 416752815 428010991 437123171 442629899 442321474 439808360 437940871 436475928 434632868
14268 434632868 427877547 423575399 413680925 400497685 386316435 371258646 355057615
14261 355057615 338455162 321600750 305538618 289164661 273934610 259235750 245269263
14254B45269263j2249190j2741201j1798104j1440898j0864984r837533r163610
14247A67173743q689433p868090p742209o792911o931550n912352o108649n651297
14239A11477252n077230m672217m653494m271161l897442m323251l230155l354502
14231G7997800k723811l288698k814767k862252k611560k211685k246617k628928
14223E6609482j718434k023291j889746j719499j692134j372479j715472j337747
14215D3140680r91789j368667j122285j466303j346605j133107n83169j436068
14207C3692687k43547j237884r02809q95650q64898o90084m33319q66698n04601
14198B7053197r44855q54411n30702o02228n51779o20094n32015p64041m34490
$$ plain form
14254 245269263 233020073 220278872 208480768 197039870 186174886 176337353 167173743
14247 167173743 158484310 150616220 142874011 136081100 129149550 123237198 117128549 111477252
14239 111477252 106400022 101727805 97074311 92803150 88905708 84582457 81352302 77997800
14231 77997800 75273989 71985291 69170524 66308272 63696712 61485027 59238410 56609482
14223 56609482 54891048 52867757 50978011 49258512 47566378 46193899 44478427 43140680
14215 43140680 42148891 40780224 39657939 38191636 36845031 35711924 35128755 33692687
14207 33692687 33449140 32211256 31308447 30412797 29547899 28857815 28424496 27557798 27053197
14198 27053197 26108342 25253931 24723229 24121001 23569222 22949128 22417113 21653072 21218582
14189B1218582p19864p16791l75150j0277n60217n12441l35785l63241k32269
14180A7392547m38059m57019n01915l44308J5546o25559j23069m12682k40044
14171A4265438k08295m63382j63864l15767j90607j77452k75746l16484N2533
14162A2206374m65487K56769k06767o04659p2175j63797m21197k9780j42040l18371
14152A0038870k08816k3125j78969j95185j42673l15853k5452j44891l18429O711
14142H492188J18339o06774L39765j05414k06124j87309q1015j28150k9900r2273
14132G513333k39808R8360j25279K05979m61370n187J68292m04553l72252J54364
14122F531879P1063j70765k8258k58287j99480k6445J23444r2303j26654M4814
$$ plain form
14189 21218582 20498718 19781927 19406777 19396500 18836283 18323842 17988057 17624816 17392547
14180 17392547 16954488 16497469 15995554 15651246 15666792 15041233 14918164 14505482 14265438
14171 14265438 14057143 13593761 13429897 13114130 12923523 12746071 12470325 12153841 12206374
14162 12206374 11740887 11997656 11790889 11186230 11114055 10950258 10529061 10499281 10357241 10038870
14152 10038870 9830054 9806929 9627960 9432775 9290102 8974249 8948797 8803906 8485477 8492188
14142 8492188 8610527 8003753 8343518 8238104 8031980 7844671 7763656 7635506 7605606 7513333
14132 7513333 7273525 7371885 7246606 7452585 6991215 6986028 7154320 6749767 6377515 6531879
14122 6531879 6602942 6432177 6403919 6145632 5946152 5919707 6043151 5950848 5824194 5869008
14112E869008m34930J45015Q6398k26367o3624J7244j81484j90524R9056J57598
14102E277390o35192L59039k9877l36140K68651l87225J74719N004l45623J19925
14092D470671j4857m5859K3970j25637m6836j63617j50436L38831q5324n2055
14082D148851l06572M7340j270J0014M0706n080m11273J26828m5028O8699j90892
14071C482323o3976J07588j37106J682O6496k39828P0081j2260l9094J21859n21748
14060B836017L84302J18909k03984P9688k22522Q1328j19080K18036n8017k39716
14050B874961O9583q3791j48930P2945J37930j02586k02394L53942m54868L12567
14040B829359j22380l85210K96395j79764M55142k92639m4038J31615J65346k70830
$$ plain form
14112 5869008 5434078 5579093 5665491 5439124 5375500 5392744 5211260 5020736 5119792 5277390
14102 5277390 4642198 5001237 4971360 4635220 4903871 4516646 4691365 4696369 4350746 4470671
14092 4470671 4455814 4409955 4433925 4308288 4261452 4097835 3947399 4286230 4200906 4148851
14082 4148851 3842279 3889619 3888349 3898363 3939069 3933989 3522716 3649544 3604516 3673215 3482323
14071 3482323 3418347 3525935 3388829 3390511 3457007 3217179 3287260 3275000 3235906 3357765 2836017
14060 2836017 3220319 3339228 3135244 3214932 2992410 3073738 2954658 3172694 3114677 2874961
14050 2874961 2944544 2860753 2711823 2784768 2922698 2820112 2617718 2971660 2516792 2829359
14040 2829359 2706979 2321769 2618164 2438400 2893542 2600903 2556865 2688480 2853826 2582996
14030B582996n7260J01096n27229K67767k33636R0048J78492j87287J29725m0185
14020B304527l93933L80319k02526L32363l21030k16605J96320l66763K83680
14011A996352k07615L01843k26682N2552p5720n4182K56302Q1338n15448L28038
14001A936778l57069J61160q9531j53607m0862L32931l63681L23919Q3475k03782
13991A629731N12868K62911K081119L929893R173111J6107472J712693j7383404
13983A8026394q684828l835539j239897r49895J25052r67487J372k54046L16981
13974B538107j94588j38804J79300l52092l7685m08852O32955k23774q978j3963
13964A971626j01893k7195j33851J17072l52412M10020J31345m77967L34308j96767
$$ plain form
14030 2582996 2525736 2626832 2099603 2367370 2133734 2223782 2402274 2214987 2344712 2304527
14020 2304527 1910594 2290913 2088387 2420750 2099720 1883115 2079435 1712672 1996352
14011 1996352 1788737 2090580 1863898 1916450 1840730 1786548 2042850 2124188 1608740 1936778
14001 1936778 1579709 1740869 1651338 1497731 1456869 1789800 1426119 1750038 1833513 1629731
13991 1629731 2142599 2405510 4486629 8416522 17589633 33697105 35409798 18026394
13983 18026394 9341566 5506027 4266130 3316235 3441287 2473800 2475172 2221126 2538107
13974 2538107 2343519 2204715 2384015 2031923 1994238 1585386 2218341 1994567 1985589 1971626
13964 1971626 1869733 1842538 1708687 1825759 1473347 1883367 2014712 1536745 1871053 1674286
13954A674286L56640m49833P2976q587l99877L3001R4152R9145r7924J67747J44655
13943A686381r6732k34979L55671j05224k19008J32713j89456L10733k74193n6425
13933A309481J65512j7226Q7717j54712r5423J24971j05766n0984J46526j77074
13923A233022J69464K4806n8611k51640L92351k83900j36143L13559j7411l4900
13913A350597k20815J01916O0118P7879q6272k56828n4395j7899K82867j43647
13903A093521J73857k99640M13035n10554J20364J34960j92916K12842l67681
13894G77788L00000O0758L9869l12053j14741L51807P7222j1772J34826m21066
13884H82638L60373k55198l17545L00567K7793R5687E38499N69714j44265J29500
$$ plain form
13954 1674286 2030926 1581093 1654069 1645482 1245605 1278606 1372758 1471903 1373979 1541726 1686381
13943 1686381 1589649 1354670 1710341 1605117 1386109 1518822 1329366 1640099 1365906 1309481
13933 1309481 1474993 1457767 1545484 1390772 1295349 1420320 1314554 1263570 1410096 1233022
13923 1233022 1402486 1427292 1368681 1117041 1509392 1225492 1089349 1402908 1385497 1350597
13913 1350597 1129782 1231698 1291816 1369695 1283423 1026595 972200 954301 1237168 1093521
13903 1093521 1267378 967738 1380773 870219 990583 1125543 932627 1145469 777788
13894 777788 1077788 1138546 1178415 866362 751621 1103428 1180650 1168878 1303704 882638
13884 882638 1243011 987813 670268 970835 998628 1094315 538499 1108213 963948 1093448
13874A093448j44850M3951n4678J78940j07782k17126J48973R0238n3530L1310
13864A008894O9366j36130j59776q7249m2844K60272j10051N7802P2473R394K16163
13853A158314k83773K8202j33858K10460k217j56408k2983J78193N2514k39821
13843G88623Q3053r2573j59053J34720Q9388l35404J88059p4909J41339o2407
13833G00836m2395N557K64690j30420Q8946m1272R5261l45971K87690l69799M9361
13822E62484J68983k00196L98757o1199J5687j270J14986k99052J9650K42794
13812I61624k53456p2200K04587C91042K39861k04998K59779J97957l18875O4579
13802F29345K41768k20772j78602j1627M20825l73925K75734k34447O934r7532
$$ plain form
13874 1093448 948598 992549 937871 1116811 1009029 791903 940876 1031114 977584 1008894
13864 1008894 1078260 942130 782354 695105 652261 912533 802482 860284 932757 942151 1158314
13853 1158314 874541 902743 768885 979345 977128 820720 797737 975930 1028444 788623
13843 788623 871676 779103 620050 754770 844158 508754 696813 621904 763243 700836
13833 700836 658441 663998 928688 798268 887214 845942 941203 595232 882922 513123 562484
13822 562484 731467 531271 930028 868829 884516 883246 998232 699180 718830 961624
13812 961624 708168 635968 840555 391042 630903 425905 685684 883641 564766 629345
13802 629345 871113 650341 471739 460112 880937 507012 782746 548299 555233 457701
13792D57701J93290J73472C72872l6009L13089P9105K9039j60731J16469k69616
13782D44218o236J7934J28559L7509N8959l28184L40154J48722M9183k70301p8504
13771E42013J98998l20863R0682L82417l27889K2196k88440J82927K2323j10144
13761C94220p7232J941M8616J73906j99005J97981J21036O7647j57977N6274j3304
13750F14103k15120r258J02588A10046J90737L91801p8508B81257J29020K39638
13740F49915o0687q0862m8818j30730M90994l46398j03136J66046I8291L75439
13730D73730B28810L74000k72275L6709J43549M845J45584j08450J7296j61709
13720D08359j28605K87994J85402j64355M8270B34166K55166j9403j53771R6069
$$ plain form
13792 457701 650991 824463 372872 336863 649952 729057 758096 597365 713834 444218
13782 444218 437982 455916 584475 621984 680943 352759 692913 841635 890818 620517 542013
13771 542013 741011 420148 510830 893247 565358 587554 299114 482041 504364 394220
13761 394220 316988 318929 367545 541451 342446 540427 661463 729110 571133 627407 614103
13750 614103 398983 389725 492313 110046 300783 692584 614076 281257 410277 649915
13740 649915 589228 508366 459548 328818 819812 473414 370278 536324 98291 473730
13730 473730 228810 602810 330535 367244 510793 515638 661222 552772 570068 408359
13720 408359 279754 567748 753150 588795 637065 234166 489332 469929 316158 412227
13710D12227K4331j91488K3939L30209k87422K69017j96266J86906m6032A17794
13699B33281O7987J83983o0080K7917N4481A28271M29248r6371K53303l44578
13689C69873j21319P2744L08778k59981K7529j84710K81716K4568A23081M15237
13679E38318c3587B09939P672M5915K88621j06397B11493L18616B11241L24735
13669E35976k09472K55182j70121r0473J05875N760l1524A60166J73077K53657
13659E86900K1333o2228B47910P3912H1684M29678M8569B51185Q9160j56074M15588
13648E99859A2959O2048J69164K27090A51682M8328J12683J80694k10180L2489
13638C15696Q5614j13668l4490K20189A48866K95410O3823B28265K56002J37531
$$ plain form
13710 412227 436558 245070 269009 599218 311796 580813 384547 571453 525421 117794
13699 233281 301268 485251 425171 453088 507569 128271 557519 461148 714451 369873
13689 369873 248554 321298 630076 370095 397624 212914 494630 519198 123081 538318
13679 538318 -33587 209939 217611 263526 552147 445750 211493 530109 211241 535976
13669 535976 326504 581686 411565 321092 426967 432727 401203 160166 333243 586900
13659 586900 608233 546005 247910 321822 81684 511362 559931 251185 340345 184271 599859
13648 599859 12959 75007 244171 471261 151682 200010 312693 493387 283207 315696
13638 315696 401310 287642 253152 473341 148866 444276 508099 228265 484267 621798
13628F21798q5852B9986K67137J00937J42442p6728j49436A56224J17702m9373
13618B24553O1177m55c5143B3707L08498p0975A25228O6752K84315A91300N9504
13607B50804q8542K86651j72623j14193M7221J75664j31771j00138L48185k06706
13597B94552n0856J32058J85926B17408J50616H6454K65387M1887J62155b3567
13586h3597a6287B94030p1317Q6136K11295j87918R9964j31997j4049o653R9644
13575C79135p7932j33304Q0734M3625L6281J29056A05108L39774e7381A31201
13564E2734P2386M59000B22289m5099o3369J66909n3998k165L0820D4633L59805
13553D04438K392d8659B03015O904g5944I6848J49925j5167J26653J97977f483
$$ plain form
13628 621798 535946 29986 297123 398060 540502 463774 314338 156224 273926 224553
13618 224553 285730 285275 -35143 23707 332205 261230 125228 191980 476295 191300 250804
13607 250804 162262 448913 276290 162097 209318 384982 253211 153073 501258 294552
13597 294552 243696 375754 561680 217408 368024 86454 351841 393728 555883 -23567
13586 -83597 -16287 294030 222713 308849 520144 332226 432190 300193 286144 279491 379135
13575 379135 301203 167899 248633 292258 328539 457595 105108 444882 -57381 131201
13564 52734 125120 584120 222289 177190 113821 280730 226732 224567 255387 44633 404438
13553 404438 406830 -48659 203015 209919 -75944 96848 246773 231606 358259 556236 -6483
13541C35369m2334A42779D6371J65953K37338i872C38297p0288j18174J93655
13531C43490j0786J59256j65199M003G8399O2235M6185J4275R8347r3226a73536
13519B40059H0995J66786a0788B38085o3963m94J40500k122i0145D29278l7746
13508C91532A10971L14224c7339G7208J70680L5837j01844M9705R0687K97748
13498F20021B51370j1243M3339K54295B15215k8289M5895J5396p8549p1329a18544
13486I7464J01101d9805B67331g2963C46486p2067l1218K18115A02039L1018J53532
13475B86589p0061k3862p2272K62059A1069K37337A6929L58941A02766J93162
13465B95928I1424N162J13334Q0143K1332A55361J24652n3320j12112B1018J87251
$$ plain form
13541 335369 293035 142779 46371 212324 449662 -9872 338297 268009 149835 343490
13531 343490 332704 491960 326761 330764 78399 140634 186819 201094 299441 206215 -173536
13519 240059 80995 247781 -10788 238085 174122 173628 314128 312006 -90145 429278 391532
13508 391532 110971 425195 -37339 77208 247888 283725 181881 231586 322273 620021
13498 620021 251370 240127 283466 537761 215215 186926 232821 248217 169668 98339 -118544
13486 97464 198565 -49805 267331 -72963 346486 274419 243201 461316 102039 133057 286589
13475 286589 216528 192666 120394 382453 11069 248406 16929 375870 102766 295928
13465 295928 91424 96586 209920 290063 311395 155361 280013 226693 114581 21018 208269
13454B08269R8832D344L19172a32358A72510A5202K64665C3468J67956N908e7859
13442A90907F0706L2474m996J36865L6721J5761A26648L29223o2293J04653o485
13431D91746e8659A83651d5519i199F5585R830L51535A36859K65191A74488F4755
13419A76357o3393j6482q299J89605H5230a37649D83006G7937O9221n5541c351
13407A75716p2738J00946K07859G1963R8111c4C65400A59530N96K10467K07159
13396E77752A48179r870L6681B4458R0523J17747c6817p7284A5065O0785j1128
13385F4722c9017m4193D5058J54104D0142M36248C7732K13031A8990M63089h8004
13373H9438J68900A07664J12551J17151m3976K64710A82795K12409C6384Q306
$$ plain form
13454 208269 307101 4344 323516 -132358 172510 15202 279867 33468 201424 207332 -57859
13442 190907 60706 93180 88184 225049 261770 277531 126648 455871 393578 498231 491746
13431 491746 -58659 183651 -45519 -9199 65585 75415 426950 136859 402050 174488 64755
13419 176357 112964 96482 88183 277788 85230 -137649 483006 77937 147158 91617 -3351
13407 175716 102978 203924 411783 71963 170074 -34 365400 159530 160126 370593 577752
13396 577752 148179 138309 174990 24458 114981 232728 -36817 -114101 15065 75850 64722
13385 64722 -39017 -83210 45058 199162 40142 476390 37732 250763 18990 482079 -88004
13373 89438 258338 107664 220215 337366 293390 558100 182795 395204 36384 44690
13363D4690K40726J07830H1107B4328K540J66469L84365A37144L87168A04795
13352B08436l1659L3203p6914L50345B17308A00899M41371k55670j35214K94903
13342D46289n5916j29023J24079r8059k6467M1044G2682H174R5982L91734a38021
13330a71572A89162F356e9388j4985C02464I1260K46074j37264J32802j50192
13320A82680J10803D9257J30772O9279K1765K29349j02043j07786e3062D1179
13309b18053N0558n2284B59300C5770J97020J24101j47370M0369N3497r8311D4676
13297A11715a40114D04842b0610I5667a83241E0713P8115J91167G8682f3733A76102
13285a20522A1031J11476a18601A31869J31963D6870N97759A9893c3604p9094
$$ plain form
13363 44690 285416 393246 81107 24328 26868 193337 577702 137144 524312 104795
13352 208436 176777 209980 133066 483411 217308 100899 542270 286600 151386 446289
13342 446289 390373 261350 385429 287370 260903 301947 72682 8174 104156 495890 -138021
13330 -171572 189162 6356 -59388 -74373 302464 91260 337334 200070 332872 182680
13320 182680 293483 49257 180029 249308 271073 500422 398379 290593 -53062 41179
13309 -218053 -167495 -219779 259300 35770 232790 356891 209521 249890 303387 205076 44676
13297 111715 -140114 404842 -20610 95667 -183241 50713 128828 319995 78682 -63733 176102
13285 -120522 11031 122507 -118601 131869 263832 46870 644629 19893 -33604 -112698
13275a12698F37935A58854J04467a85759D79247k14245D5325N2868G818N02876
13265E10694j721A12762J80966I6016F515d0842j80460B01121o3840L6588f3461
13253B2318a24757d1527B85907b01374A55726O9916J06777G8741K76303J7215
13243C72259b22098f0321b1710A5244J40373n459k1371a1078C38660B5135e1246
13231A67058O5384a48479E87971F4704J16020a5059j1345B36240J86181G5784
13220A37362i4122o0091A09510a46388B11687f1383E54340B43629B7483J41612
13210A69095O4639f088C13986a5348E47777H8482J8394j8643K32556f0564C42637
13198i2345l7245B97804I4797K64735h1570A02686K439H864L70012J987f8696
$$ plain form
13275 -112698 637935 158854 263321 -185759 479247 265002 45325 98193 7818 510694
13265 510694 508973 112762 293728 96016 6515 -40842 -221302 201121 137281 173869 -63461
13253 22318 -124757 -41527 285907 -201374 155726 225642 332419 78741 355044 372259
13243 372259 -222098 -60321 -21710 15244 155617 150158 128787 -11078 338660 25135 -51246
13231 167058 232442 -148479 587971 64704 180724 -15059 -26404 236240 422421 75784
13220 137362 -94122 -154213 109510 -146388 211687 -61383 554340 243629 27483 169095
13210 169095 233734 -6088 313986 -15348 547777 88482 106876 88233 320789 -60564 342637
13198 -92345 -129590 297804 94797 359532 -81570 102686 105125 8864 378876 380863 -68696
13186C66042A32279Q0948N35G1468g5466l4664B32984g0471A52837n2999K11168
13175C11006A49378a34615f4742C03142a01527C75162i3600c1898E5191L7173
13165I2364M1989a65999e255D87515E0023O8074B0757b23563g5634F7798K9799
13154I7597C9836L47950I0550P3165K5323F2933c6516i198B42053p4239i3110
13142a6587k7565B80916o2586a72039c5509A00848a67697g0503j1665B28144d18415
13130C4251h7795B33478j09257a60090B12011c9012C8419K82819o2922q2856J27646
13119C03106A27473e4574J5003q2694B803c5484A66044a6212j24410I2741b38783
13107b6054o687A30094a12284k1266e5246C22918I193a42890j90613B37115a22055
$$ plain form
13186 366042 132279 213227 213762 71468 -75466 -110130 232984 -70471 152837 99838 311006
13175 311006 149378 -134615 -64742 303142 -101527 375162 -93600 -31898 55191 92364
13165 92364 134353 -165999 -5255 487515 50023 118097 20757 -223563 -75634 67798 97597
13154 97597 39836 387786 90550 163715 189038 62933 -36516 -9198 242053 167814 -93110
13142 -16587 -44152 280916 218330 -172039 -35509 100848 -167697 -70503 -82168 228144 -418415
13130 34251 -87795 233478 124221 -160090 212011 -39012 38419 321238 258316 175460 303106
13119 303106 127473 -54574 -39571 -122265 2803 -35484 166044 -16212 -140622 92741 -238783
13107 -26054 -32741 130094 -112284 -133550 -55246 322918 9193 -142890 -333503 237115 -122055
13095C1305L2041K38236c0901C03661i7065a1487G6597g4346H5853b52375J19337
13084a33038b5037A32900E901R9327P2114b74312A07626n3264K10280A07684i145
13072A59496b86967i03A74519N991a82819A13971C9249b3154A74644a33872l7590
13061a71462c9576C97825c9979A26581E3402L41846A05159J24840b34955C80945
13050a30374B19544b18171R5297D0844R4370E4544K74787a09170k7911D3007p575
13039C5432M05624r0731j9493I6306K87761j61011A3195g2554D5720O7981R5581
13028B09282a30449e3999A60567J58130g8652c6138A22014O6267r0444e5990J8962
13017c7028l64232A46926J0999J16053j19253N532a37512B64154j13167o3731
$$ plain form
13095 31305 63346 301582 -30901 303661 -97065 -11487 76597 -74346 85853 -252375 -133038
13084 -133038 -25037 132900 5901 105228 177342 -274312 107626 54362 264642 107684 -9145
13072 159496 -286967 -903 174519 180510 -182819 113971 39249 -23154 174644 -133872 -171462
13061 -171462 -39576 397825 -39979 126581 53402 395248 105159 229999 -234955 380945
13050 -130374 219544 -218171 -122874 40844 135214 54544 329331 -109170 -137081 43007 35432
13039 35432 441056 350325 330832 96306 384067 223056 13195 -72554 45720 113701 209282
13028 209282 -130449 -53999 160567 318697 -78652 -36138 122014 188281 97837 -55990 -37028
13017 -37028 -401260 146926 157925 273978 154725 160257 -137512 264154 150987 87256
13007H7256J72378C7811J47516O0531N5842m7379a32224M7408E9510J84197n8122
12996A85585b37543i687k61318H9412J81203A21054C6066J23054a58079B52189
12985B97004A726a26361B19933l6953e9529E1439a5943C14225A0783J89667H7351
12973A75604L9615a00022H9066A0375J24466a75564B6854M076J83776B6364N353
12962C1717K30858j17830o49f6084J2828j5167D00631j62412j01360i4388h01
12950c41772D03141j90228p056b68639B5628J43621p5066K8959a59951G7267j8168
12939E9099a83936A73063a0453D795f5151A87790F9021C3736P5387D0615j5760
12928B4855r405K73005h241C03375h0361A22746m2068a97186B08480l0206J09916
$$ plain form
13007 87256 259634 37811 185327 245858 301700 254321 -132224 -84816 59510 243707 185585
12996 185585 -237543 -9687 -271005 89412 270615 121054 36066 159120 -158079 252189
12985 297004 1726 -126361 219933 182980 -59529 51439 -15943 314225 10783 200450 87351
12973 175604 215219 -100022 89066 10375 134841 -175564 26854 30930 214706 26364 31717
12962 31717 262575 144745 144096 -66084 -53256 -68423 400631 238219 136859 -94388 -801
12950 -341772 403141 212913 205857 -268639 25628 169249 94183 123142 -159951 77267 59099
12939 59099 -183936 173063 -10453 4795 -65151 187790 69021 33736 109123 40615 24855
12928 24855 15450 288455 -8241 303375 -80361 122746 80678 -197186 208480 178274 288190
12917B88190O2772j17716g6803j29903R4256J5805A88841a5964k46943C0975J12146
12906A43121n2165a8604A15262Q1973N8885a84376h3827k37233I4538d36372a77893
12894A0581K57680J31076b80052D2495a13084B23161L2254e5867q3110c5731A74596
12882G6748e2362B09122J0824a65239E2938a538k14576I419L14305H4379Q9848
12871A74227a48304O0300C9403P34a59515q7374B02471p4996L1014b42074B03676
12859A50076J20602A05331e531j84103C08516b030C3807N2150b00983e3706A83819
12847a10330A63358n4472a69555G4022M1043J69880E4450a01517c0725j38032
12837a68757B1310c9542B6737N0463i023j0366o2802L9053F7059c7758b59k8769
$$ plain form
12917 288190 350962 233246 -76803 -206706 -112450 -96645 188841 -15964 -262907 30975 143121
12906 143121 90956 -18604 115262 197235 256120 -184376 -83827 -321060 94538 -436372 -177893
12894 10581 268261 399337 -280052 42495 -113084 223161 255415 -55867 -138977 -35731 174596
12882 76748 -52362 209122 219946 -165239 52938 -1538 -216114 9419 323724 84379 174227
12871 174227 -148304 -88004 39403 40137 -159515 -246889 202471 127475 158489 -242074 203676
12859 150076 270678 105331 -5531 -189634 308516 -2030 33807 85957 -200983 -53706 183819
12847 -110330 163358 108886 -169555 74022 115065 284945 54450 -101517 -30725 -168757
12837 -168757 21310 -39542 26737 77200 -9023 -19389 -82191 -43138 67059 -37758 -259 -29028
12825b9028k5691A73766a64953C2267b23124C5044h5242j62190e1705K293A07920
12813A32224J3071a12661g291j17101B76630a91421p0945a5013A76528J02301
12803B78829f2779E9566k8652R760a52793H5021J39964b59924A89226D4719A5220
12791g9321J1791j685C4394i9881A69454H4135j6923c20736D00629a94221e6236
12779A09722a85387E7998b57834m7986B4716g7181G7288a11742L2316B1467i2764
12767b84668A3937J40253k0526K80957I2084P7034p8416a55055f4677p1687F4792
12755A86914g0787K7549j97263B18981k5705G8118N4638h6681r4398Q8003A07365
12743A05177C3881O1128c66445H5446N7064e4605F8789g7983D520K70412F1360
$$ plain form
12825 -29028 -54719 173766 -164953 32267 -223124 35044 -85242 -247432 -51705 -49412 107920
12813 132224 145295 -112661 -7291 -124392 276630 -191421 -262366 -15013 176528 278829
12803 278829 -62779 59566 30914 40674 -152793 85021 224985 -259924 189226 44719 15220
12791 -79321 -67530 -69215 34394 -99881 169454 84135 67212 -320736 400629 -194221 -56236
12779 109722 -185387 57998 -257834 -305820 24716 -77181 77288 -111742 -79426 21467 -92764
12767 -284668 13937 154190 133664 414621 92084 169118 90702 -155055 -64677 -136364 64792
12755 186914 -70787 -43238 -240501 218981 193276 78118 132756 -86681 -181079 -93076 107365
12743 105177 33881 95009 -366445 85446 142510 -54605 68789 -77983 4520 274932 61360
12731a34120A97035J55935E7273j1632e5409M228A50379c6736A66238C089K5812
12720B8901R3161b1080k35374k6469H1968F026J99598B1357M6069F216K86827
12709B93043f0881j2110H295a9905C43538q7531e3618D49814C664a53698A04487
12697C18823j36432K2090A1410J8130K3065d7730A07377j5913a78214M2875R704
12686a25635B03742F7338a56364A29400D6973a27231l3424e3091D76513I184K54696
12675B63880B1688K87603A41363B1306K73099c8709A24591b02860N1313c2632
12664H4453J73438C5175K24855K721l1883E1278e042k9513r1883C90017j91783
12653A98234L9166a3973A56502e1380j1800B33054d7291J1136m14883i7218e862
$$ plain form
12731 -134120 197035 352970 57273 45641 -55409 -51181 150379 -36736 166238 3089 28901
12720 28901 122062 -21080 -256454 -282923 81968 6026 205624 21357 67426 6216 293043
12709 293043 -60881 -72991 8295 -19905 343538 256007 -53618 449814 3664 -153698 104487
12697 318823 182391 204481 11410 29540 52605 -47730 107377 91464 -178214 -135339 -125635
12686 -125635 203742 67338 -156364 129400 46973 -127231 -160655 -53091 476513 9184 263880
12675 263880 21688 309291 141363 21306 294405 -38709 124591 -202860 -151547 -32632
12664 84453 257891 35175 260030 262751 230868 51278 -5042 -34555 -126438 390017 198234
12653 198234 237400 -13973 156502 -51380 -63180 233054 -47291 -36155 -451038 -97218 -5862
12641e0429l10850B0233a36606A87446E2691K01059H5400J86054m4647D885P6704
12630H1589L80634B13077A00692K4989L9968J1739a05438c1806D90198j57606
12620C32592q3626a26689b0314q6626j52547c2867a6263F881b39684b9876r5313
12609a25189F9407P1983N0333a45963B20176a19214A15985K7744a64115A53724
12598G3243a17532C59595G3085K05359A26714l9602j0754d2434j17620O3928H6614
12586c8626A12184q095c4801I5964A292a28174b1159n0116E011c59775G8555R6810
12574A75365D9118b3052j07911A73043b83946C87436E235N0582j9480J40271N1002
12563B27610A5373b14261d7792j24905A02761b21563C6516J27346G8230e0F8558
$$ plain form
12641 -50429 -361279 20233 -136606 187446 52691 253750 85400 271454 226807 4885 81589
12630 81589 462223 213077 100692 125681 165649 177388 -105438 -31806 490198 332592
12620 332592 248966 -126689 -20314 -106940 -259487 -32867 -16263 6881 -239684 -29876 -125189
12609 -125189 69407 141390 191723 -145963 220176 -119214 115985 143729 -164115 153724
12598 73243 -117532 359595 73085 278444 126714 87112 76358 -42434 -160054 -96126 86614
12586 -38626 112184 104089 -34801 95964 1292 -128174 -21159 -71275 5011 -359775 78555 175365
12574 175365 49118 -23052 -130963 173043 -283946 387436 5235 55817 36337 176608 227610
12563 227610 15373 -214261 -47792 -172697 102761 -221563 36516 163862 78230 -50 68558
12551B10271H5990c6896B03480H9363O3014c6082L770m621j62896D3472Q4316
12540A27788b45804P467a04460A98018a02543B78526H3726L9572K8193a20458
12529a22807k1030F28i2489l9731B0474M88387j68888K0304A70120b2324A41663
12517C9786K5086k5966K64289a04979A45737C615h0478o994A07680a05439M5824
12506e9615I5133a30971A09284p825r238J31865a38181b4939m1215A63747Q9896
12495B53643B3559J57035J06015K84392f9630A12530l5172j2549J39164H3663
12484d8207A5080K12726g1653j0721B0628b32189a1940E0355d2354j10614P1836
12473h1132B62181O9855h565j83750b3656E292L58586i4604n4517B4272O2591
$$ plain form
12551 210271 85990 -36896 203480 89363 152377 -36082 -32312 -36933 -199829 43472 127788
12540 127788 -245804 -238337 -104460 198018 -102543 278526 83726 123298 151491 -120458
12529 -122807 -143837 628 -92489 -132220 20474 508861 339973 360277 170120 -22324 141663
12517 39786 64872 38906 303195 -104979 145737 3615 -80478 -87472 107680 -105439 -59615
12506 -59615 95133 -130971 109284 101459 92221 224086 -138181 -24939 -66154 163747 253643
12495 253643 23559 180594 286609 571001 -69630 112530 77358 64809 203973 83663
12484 -48207 15080 227806 -71653 -82374 20628 -232189 -11940 50355 -42354 -152968 -81132
12473 -81132 262181 332036 -8565 -192315 -23656 5292 363878 -94604 -149121 24272 86863
12462H6863B1210b67720d5341j82503R2243o7397B0371g7567A80429K9134h5502
12450B528M1096c27271a11729a6072B9310J77376j1845L0735B8367a29905p4973
12439b04878F4515g6384a6368B28819i5328j14590b4594j8928o0297c6898A4245
12427a00173A98829m6889b82941k4989a34627B35462J7143D9688b6655j3925n8449
12416i9029D1376A5425M26917a36611B2267h5241k82953e817C2447a02042n9099
12405a61141K9059A07215l8183J49816I1879a47196h469B51852f7090b9114C15226
12393a16202A01963a03810o3493n9547B27819c4048j1601P874A60526g6948j058
12382g8006k32830p11b1950A03528B6295a95102C8029K2237J0500M3547a62844
$$ plain form
12462 86863 21210 -267720 -45341 -227844 -135601 -202998 20371 -77567 180429 209563 -85502
12450 2528 43624 -327271 -111729 -16072 29310 206686 194841 225576 28367 -129905 -204878
12439 -204878 64515 -76384 -16368 228819 -95328 -209918 -24594 -43522 -103819 -36898 14245
12427 -100173 198829 151940 -282941 -307930 -134627 235462 252605 49688 -26655 -40580 -99029
12416 -99029 41376 15425 442342 -136611 22267 -85241 -368194 -5817 32447 -102042 -161141
12405 -161141 -132082 107215 69032 218848 91879 -147196 -8469 251852 -67090 -29114 315226
12393 -116202 101963 -103810 -167303 -226850 227819 -34048 -45649 -37775 160526 -76948 -78006
12382 -78006 -310836 -311547 -21950 103528 26295 -195102 38029 60266 70766 114313 -162844
12370h1271A32104a12547A48031h5713j01921A04115a70194e6455n4441A40489
12359b4626E3431J43190a74070j5247N8489B4492c6610A44042L2174C1804b84590
12347A66228G9700B1578a9499p830k9549b2626C8700J3924b28282B17625b00328
12335A08510f5832j4402A55635a71615A4558P0151J77264a463k00653A07770n2836
12324E4934K05057N0238h4392r453F7444M7646g7762F3137A3969a72716P9589
12313i3127M4935o0839c9672j36945Q043g8830j04740A59349E1914M42562A83592
12301A45110b5235k47059O1050E5629d2204C6555b0031j32849d2275R487a0489
12289D50941F9622L1718b44706A84015m4383m2205k7786N2892M184l8360G288
$$ plain form
12370 -81271 132104 -112547 148031 -85713 -187634 104115 -170194 -56455 -110896 140489
12359 -24626 53431 196621 -174070 -189317 -130828 24492 -36610 144042 176216 31804 -284590
12347 166228 79700 21578 -19499 -27329 -56878 -22626 38700 52624 -228282 217625 -200328
12335 108510 -65832 -80234 155635 -171615 14558 84709 261973 -1463 -202116 107770 54934
12324 54934 259991 310229 -84392 -93845 67444 115090 -77762 63137 13969 -172716 -93127
12313 -93127 -48192 -109031 -39672 -176617 -168574 -78830 -183570 159349 51914 494476 183592
12301 145110 -25235 -272294 -211244 55629 -42204 36555 -20031 -152880 -42275 -32788 -10489
12289 450941 69622 101340 -244706 184015 139632 97427 69641 122533 126717 88357 7288
12277D2231K05049a06414B94656e5251l0876B76799A3397a3499B46933c0962C30601
12265B13180g461B7272i3138b1022j1502j42067B08322m6463m7711K1886J33551
12254B69585L5536E5623i1189c556B0116O539O8657c4625C67576c389A25568c20757
12241A66240B5609J4917i6149C56016A08495J84912G3488J60154h800j44137C14841
12229A33185J34484J55454I2462B7936K79528C2511L07495j44946p0819M1730
12219A65971p8387K30520A57217B6487M1541O5556J4120R4896b01587B23408p0510
12208A52898K20852j40009c6428B84416B1614J3998J24724a04758A3370J76234
12198A89604N4976r2735J75443E8125B1372K49569K6844g4412D06080L4950j67142
$$ plain form
12277 42231 247280 -106414 294656 -55251 -86127 276799 13397 -13499 246933 -30962 330601
12265 213180 -7461 27272 -93138 -21022 -32524 -174591 208322 161859 114148 136034 269585
12254 269585 305121 55623 -91189 -3556 20116 26655 95312 -34625 367576 -3389 125568 -320757
12241 166240 25609 40526 -96149 356016 108495 293407 73488 233642 -8800 -152937 314841
12229 133185 267669 423123 92462 27936 307464 32511 340006 195060 124241 165971
12219 165971 87584 318104 157217 26487 68028 133584 147704 242600 -201587 223408 152898
12208 152898 373750 233741 -36428 284416 21614 35612 160336 -104758 13370 189604
12198 189604 244580 151845 327288 58125 21372 270941 297785 -74412 406080 441030 273888
12187B73888j2818j04240J42828f4588C33545A7746K61182a5195M23C30824H7568
12175D93996A55107C134f6890A51739F3237M00837A25484b61090A78659q8994
12165H9665K6665J41531r8545J73037j61481c1364m6157F1019R3448J13283a15913
12153A5691e234A24570A6693K61006j00361h4264C11435J65823C5520L0414b42325
12141A14469L901L32487A58329a74148A49558m5407j8484A4626J03274b38392
12130H9718a75916D4473M4713J7075J44584D5385n810a01994j4859m3155p736
12119a67744h2687F3666c4074A0022c65230I3021a00590M1910I5797O4858j2953
12108A47702e6782I6443D2997b20418A52243G3654a5109B19822g1139a6088H4874
$$ plain form
12187 273888 261070 156830 299658 -64588 333545 17746 278928 -15195 -14772 330824 87568
12175 493996 155107 3134 -66890 151739 63237 464074 125484 -261090 178659 89665
12165 89665 116330 257861 159316 332353 170872 -31364 -77521 61019 154467 267750 -115913
12153 15691 -5234 124570 16693 277699 177338 -84264 311435 477258 35520 65934 -242325
12141 114469 118370 450857 158329 -174148 149558 104151 85667 14626 117900 -238392
12130 89718 -175916 44473 89186 106261 250845 45385 39575 -101994 -116853 -160008 -167744
12119 -167744 -82687 63666 -34074 10022 -365230 93021 -100590 -58680 95797 160655 147702
12108 147702 -56782 96443 42997 -220418 152243 73654 -15109 219822 -71139 -16088 84874
12096C6914j84J51286J19019a51094D5215L5016b62879B66323D2294N5385n240
12085I2439g9536A05143b48841C24693a30485C53715c2362C38525j13255a49851
12074A49429g9038j0028K5581C1179J27723c1104o2026a9222C40406Q28145K07707
12063A376258B43472K64095b29199a9771q3889q4796D8390i854A05407c0244g541
12051a28884L845C34254B0020a98025H0864b22725j37762C24685A12383b58370
12040b63948J24314j16859j04319i6688n2699D00308H178J59155h6263Q385A72009
12028G5545d19657C46672j16594J6902i9832A94350G4462C2530g0030o414o287
12017h2731k3937C79874a82327D0207a46866F7859M8998a16711a6058I4678c03116
$$ plain form
12096 36914 36730 188016 307035 -151094 45215 80231 -262879 266323 42294 97679 92439
12085 92439 -79536 105143 -248841 324693 -130485 353715 -32362 338525 225270 -149851
12074 149429 -79038 -89066 -63485 31179 158902 -31104 -93130 -19222 340406 1168551 1376258
12063 1376258 243472 507567 -229199 -19771 -103660 -188456 48390 -9854 105407 -30244 -7541
12051 -128884 -125039 334254 20020 -198025 80864 -222725 -360487 324685 112383 -258370
12040 -263948 -139634 -256493 -360812 -96688 -149387 400308 8178 167333 -86263 -77878 172009
12028 75545 -419657 346672 230078 246980 -99832 194350 74462 32530 -70030 -76444 -82731
12017 -82731 -106668 379874 -182327 40207 -146866 67859 116857 -116711 -16058 94678 -303116
12005i92A08779a23290j5687B28399A6014a63785M0719c2628q6680A1202J64273
11994A75475a47008o4221G1467J3820b561C4566K1530M71416B35723D2013K4780
11983F6793O3867R6595Q3905f9018b6414k36786Q9151C672R2379b17706B5586
11971I5674b73169A14986b81058j17750a04490c0915A39201a4314j77740N9555
11961a32499I28a38373B06708a62702C36454j07959a51569O8600n8203a0252l35609
11950c45861E5938M399g7338A87715g742j0774A97370h6780F2114b9277o552F1064
11937B36676b4542q2739B7970M4523j9912K27096b00182M6061B99076a20439B85201
11925I3470j0176E520b6089r5047r9992r3932P5921A23608J8077d9577C50988
$$ plain form
12005 -992 108779 -123290 -138977 228399 16014 -163785 -123066 -32628 -119308 11202 175475
11994 175475 -147008 -211229 71467 85287 -2561 34566 56096 527512 235723 42013 66793
11983 66793 130660 227255 311160 -69018 -26414 -263200 -174049 3672 96051 -217706 25586
11971 95674 -273169 114986 -281058 -398808 -104490 -30915 139201 -14314 -192054 -132499
11961 -132499 928 -138373 206708 -162702 336454 228495 -151569 -82969 -141172 -10252 -345861
11950 -345861 55938 60337 -77338 187715 -7742 -18516 197370 -86780 62114 -29277 -35829 61064
11937 236676 -24542 -107281 27970 72493 52581 279677 -200182 -154121 299076 -120439 285201
11925 93470 83294 5520 -26089 -121136 -221128 -315060 -239139 123608 141685 -49577 350988
11913b55007C28702i9629A08362A1232b0935A50499b98995a9934r1880l23310
11903d35124E0924f4473C7292P7276b0506A13859b2863o3593j1117b794j0908
11892a3702j30665A99034J98328b09002L6478a5955A03213J69666G0849G895a16354
11880A6712a65870B43946f3691K3227B26554a78054E6369e7057b3714H8818m0610
11869D8208o33P790b38994h2921a3078p7844d1764A24909a21173d095F3353B4011
11856c42774D3602e359E4085L1737c03990A9374M8750b06647P3250j44543b3132
11844b07276B93258F5231B4175a01942A03158c10747p927a50044j41653B12717
11833B61506b9558q6854e1033m16758f8562A53683b6039j05016o6129A11329c71134
$$ plain form
11913 -255007 328702 -99629 108362 11232 -20935 150499 -298995 -19934 -111814 -435124
11903 -435124 50924 -64473 37292 114568 -20506 113859 -22863 -86456 -97573 -2794 -13702
11892 -13702 -144367 199034 397362 -209002 -172524 -15955 103213 272879 70849 7895 -116354
11880 16712 -165870 243946 -63691 -40464 226554 -178054 56369 -57057 -23714 88818 48208
11869 48208 47575 55365 -238994 -82921 -13078 -90922 -41764 124909 -121173 -4095 63353 24011
11856 -342774 43602 -5359 54085 85822 -303990 19374 68124 -206647 -133397 -277940 -23132
11844 -207276 293258 65231 24175 -101942 103158 -310747 -318674 -150044 -291697 212717
11833 261506 -29558 -116412 -51033 -467791 -68562 153683 -26039 -131055 -197184 111329 -371134
11821B13455a02961o4435G5294a6008N857k94732c4664o5086F3640b18661n9644
11810b78305a9148F2062a54343L9968A35784e5025j87795J09080B38056e4428
11799A82013a9558j78407A21723f4882k0586l5146M2238F7314a38661r7397K0176
11788b15882h7155b8865b192k8999e33j25613E7352L16567j83848d02493B68829
11776b55078K8679q9565A28065a93006A02786g4865A7401J19516F2603h7455B26130
11764a18798D41779G1133J36646P6533B1183a72181A34903m4739M5162o3463j6823
11753E5040J0K83018F1381e04843A9307a59438B8960M2130g745B348i5357q423
11741a03780k78848A66624a54923g6636r214E7893a74315A10197e0837j9946F9601
$$ plain form
11821 213455 -102961 -167396 75294 -16008 -10151 -304883 -34664 -99750 63640 -218661 -278305
11810 -278305 -19148 62062 -154343 -114375 135784 -55025 -242820 -133740 238056 -54428
11799 182013 -19558 -197965 121723 -64882 -85468 -120614 -78376 67314 -138661 -236058 -215882
11788 -215882 -87155 -28865 -2192 -31191 -533 -126146 57352 373919 190071 -402493 268829
11776 -255078 -226399 -315964 128065 -193006 102786 -74865 17401 136917 62603 -87455 226130
11764 -118798 441779 71133 207779 284312 21183 -172181 134903 90164 135326 71863 55040
11753 55040 55050 338068 61381 -504843 19307 -159438 28960 71090 -7745 2348 -95357 -103780
11741 -103780 -382628 166624 -154923 -76636 -85850 57893 -174315 110197 -50837 -70783 69601
11729c0046C3564b5284A92213J18663B5357c2318J4603B7411i5457b9788G7075
11717A9651K30080E0581A4225a31212B25606a13406M5588E3976J47638b60150
11706A15403a73669D204J29091c31899A63078F2513K2218c1818D42605H3410J0929
11695I4339L3184D1653O4383f8660b6383D6828K7848A6755d2972k07282K3883
11684b26371A78406a17647F9838B1320R0065c10353h6272m4148B50866m8806E1075
11672d8622A3692J76316l2861m1741b5842o3371q7323D64847b3177O083n3960
11661g1054G8591J29749G8493g997j98239a7029B96240H5189J10706A6916N2456
11650F9372J88262F016D83K634c2376A36054a79651A11419Q3266o6898J45280
$$ plain form
11729 -30046 33564 -25284 192213 310876 25357 -32318 -17715 27411 -95457 -29788 77075
11717 19651 249731 50581 14225 -131212 225606 -113406 -67818 53976 201614 -260150
11706 115403 -173669 4204 133295 -331899 163078 62513 84731 -31818 442605 83410 94339
11695 94339 127523 41653 106036 -68660 -26383 46828 74676 16755 -42972 -250254 -226371
11684 -226371 178406 -117647 69838 21320 111385 -310353 -86272 -130420 250866 202060 51075
11672 -48622 13692 190008 157147 115406 -25842 -89213 -176536 464847 -23177 -17094 -71054
11661 -71054 78591 208340 78493 -7997 -206236 -17029 296240 85189 195895 16916 69372
11650 69372 257634 6016 483 3117 -32376 136054 -179651 111419 194685 127787 273067
11639B73067p4045a48708a6310E2317a89675f243j12997A23520b82842C41969
11628I0246a12626r6448E3400J95777a3697A0146b4230j0044B88865F482M5409
11617E1891b62108c6264A17272C2422g9834C6856L38892b7340C12580G8871K66096
11606C44967j52452b93180B34591C7341c7217C1621K57449H670K08330f6587G0648
11594f5157B40707a0582H312R7743K05371A06189L21375B0131N10746k46819a20216
11582A58727k8316K4495J2185c29338E6017j041J034p754A1976f1289I948N9394
11570F9342J56228B817J14683o362l6084a04237E8743d7439F7646M7018E2216
11558c28294A43144m9847a95895A15872a81195C6K90129j02727J79456A64549
$$ plain form
11639 273067 199022 -148708 -16310 52317 -189675 -6243 -119240 123520 -282842 341969
11628 90246 -112626 -209074 53400 249177 -13697 10146 -24230 -34274 288865 6482 51891
11617 51891 -262108 -36264 117272 32422 -79834 36856 375748 -27340 312580 78871 344967
11606 344967 192515 -293180 234591 37341 -37217 31621 289070 8670 217000 -66587 70648
11594 -65157 240707 -10582 8312 106055 311426 106189 427564 20131 530877 284058 -120216
11582 158727 130411 154906 167091 -329338 56017 54976 56010 48256 11976 -61289 9948 69342
11570 69342 225570 2817 117500 111138 75054 -104237 58743 -47439 67646 114664 52216
11558 -328294 143144 93297 -195895 115872 -181195 36 290165 187438 366894 164549
11547D9587k3819a3184j20503L8062A56905b18133B00284G9829Q3044G5943K56293
11536C32236d9771I7098J0166o671l5341M46823b6535C9267K04275M0442e2316
11524B31480a62440A86629Q4118B7062a62989f9065a8126B05775q8510a3663B28815
11512E086K78444K50147B5438L75219b29654H1032j2442Q5410K26607p4195k1399
11501B85013j14313J80374j0764C1457M0673M6086E5541e7008C00631b83962B37448
11489D5241K20912p5419m1363D9326a41089D49182B11337J99623j77998j14532
11479A18430K25310K1724j06843F1713k0622b52870B53056m588K83425B05251
11468A42920K97603n776F3130K03085J43763j99598J00597a57401D27887N3173
$$ plain form
11547 49587 25768 -13184 -133687 -95625 156905 -218133 200284 79829 162873 75943 332236
11536 332236 -49771 97098 107264 100593 65252 512075 -26535 39267 243542 283984 -52316
11524 231480 -162440 186629 270747 27062 -162989 -69065 -18126 205775 117265 -13663 228815
11512 5086 283530 533677 25438 400657 -229654 81032 68590 154000 380607 306412 285013
11501 285013 170700 351074 340310 31457 72130 118216 55541 -57008 300631 -283962 237448
11489 45241 266153 190734 149371 49326 -141089 449182 211337 410960 232962 118430
11479 118430 343740 365464 258621 61713 41091 -252870 253056 248468 531893 205251
11468 142920 440523 434747 63130 266215 409978 210380 310977 -157401 427887 481060
11458D81060B15983r6606B2581e0186A47932L4672q2133L7253N0920j322C882
11446B1831f8294A02746a03978H8702A2604M16299A78604H177J154J02619a01570
11434b2891D7835a85440F0592b3915H1509N911j59b15151R6317b552E8213i5408
11421B38454l5366F354c3719A22720D5395c787q5168o2169A80341J49083j14762
11410B14662L2869a29941E4675b92728B19765d33964B20932a55209p7049A70140
11399A4234f2605B76257H5504e7198o5354a107k0043E3342J21839b18196B1781
11387A27429a53278O3172C38130c91109b1406p9989L3974j3405m2714G8838a45922
11375B96017b1685C13677C3410d6713a5585r1544N0925C841c03013J9618A42333
$$ plain form
11458 481060 215983 119377 22581 -50186 147932 182604 100471 137724 188644 187322 3882
11446 21831 -68294 102746 -103978 88702 12604 428903 178604 8177 9331 111950 -101570
11434 -22891 47835 -185440 60592 -23915 81509 87420 87261 -215151 -118834 -2552 58213 -95408
11421 238454 203088 6354 -33719 122720 45395 -3787 -88955 -151124 180341 329424 214662
11410 214662 247531 -129941 54675 -292728 219765 -433964 220932 -155209 -232258 170140
11399 14234 -62605 276257 85504 -57198 -122552 -1107 -21150 53342 175181 -218196 21781
11387 127429 -153278 -90106 338130 -391109 -21406 -101395 -67421 -80826 -123540 78838 -145922
11375 296017 -21685 313677 33410 -46713 -15585 -107129 -56204 3841 -303013 -283395 142333
11363b1265p4196k30146B06807b0911B91295i7399A8113J0281b53196a25268d8905
11351A8898n639b6654e257A6505Q3192b62641B04011I1504J27515C1799j5692
11340A6107J66644C3625c53880i9188H9448a04613A22351a18331d6205J6801j05332
11329a34736N6451A01754K47443b40420M8417A77727a49130B5615J46301a49578
11318H2319a35595B32955a64598D0864c8383a8675j69707F814L0812K49718G307
11306C41345A25299J5330f8677q3428L6104B97479b43570A576L4295b91554B25091
11294b26856b4038A05326c6798G8160J58805i4877A59854f8519D09562H4495a32636
11282D34a70996h0858G2954a3503k47911B09243A3111A438a0181j92383a2560
$$ plain form
11363 -21265 -95461 -325607 206807 -20911 291295 -97399 18113 28394 -253196 -125268 -48905
11351 18898 13259 -26654 -5257 16505 99697 -262641 204011 91504 219019 31799 16107
11340 16107 182751 33625 -353880 -99188 89448 -104613 122351 -118331 -46205 -29404 -134736
11329 -134736 -78285 101754 349197 -240420 -192003 177727 -149130 25615 171916 -149578
11318 82319 -135595 232955 -164598 40864 -38383 -18675 -188382 6814 37626 287344 7307
11306 341345 125299 140629 -68677 -152105 -116001 297479 -243570 1576 35871 -291554 225091
11294 -226856 -24038 105326 -36798 78160 236965 -94877 159854 -68519 409562 84495 -132636
11282 434 -170996 -80858 72954 -13503 -261414 209243 13111 1438 -10181 -202564 -12560
11270c55522f5733b0267m730B08200A7116K2795R5107a93092A81151A581b36592
11258C29811r2996a23974B8300h2901k5333A34726g8888o0437r304O8266b7053
11246d5109A41093a80018P1003M7639A98644A713a7856A51057D4370b53805F3459
11234b1911O451F2255j3282b49164Q7278N8346A8873b05193q2731k1089A66773
11222c3947P884A89497D1979a9669I9815d5818j90476e593B50896C5593a1049
11210i0494b4628j94580b6006r4341A47818a55180l8318B25139c46885D3009a70564
11198b58549A05510h9913C8557K7284a99838B8015b8883D3147a97477B75845c395
11186h0329j31822A34910k3859g136C6748f5012A24915J49355a14418A17827a44570
$$ plain form
11270 -355522 -65733 -20267 -24997 208200 17116 39911 135018 -193092 181151 1581 -236592
11258 329811 236815 -123974 28300 -82901 -108234 134726 -78888 -139325 -148629 -80363 -27053
11246 -45109 141093 -180018 -109015 -61376 198644 1713 -17856 151057 44370 -253805 63459
11234 -21911 -15460 62255 48973 -249164 -161886 -103540 18873 -205193 -287924 -309013 166773
11222 -33947 -26063 189497 41979 -19669 99815 -45818 -236294 -5593 250896 35593 -11049
11210 -90494 -24628 -219208 -26006 -120347 147818 -155180 -193498 225139 -346885 43009 -170564
11198 -258549 105510 -89913 38557 65841 -199838 28015 -28883 43147 -197477 275845 -3395
11186 -80329 -212151 134910 111051 -7136 36748 -65012 124915 274270 -114418 117827 -144570
11174A22250j6321b02329e9779o9089L6021A03025b95786h0197A42911J10551
11164B53462q6799h3915A50238b1257D05598E6921b69181A16619b15107o2874
11154b77981a26047B04295h4628q7339A81930o414p4942f4814j53570Q2306j77936
11143c14014h8885A64578e9941J5168B3220Q3602J37112o5845a36888B17724k7218
11132A90506n4103l2841a26368C8466R3377J53964a51153A61858M2799J5130a26810
11120i7021D406L0944e1170B62794J672H455L63499b45247E1566K67543E7954
11108A77632a74930D77149G0314P9959L23183j57832q8830L02818B34080n2134
11098A81946B1373J04608K36903p0806j26302J86757l4153N0552o0905O2381J56627
$$ plain form
11174 122250 105929 -202329 -59779 -128868 -92847 103025 -295786 -80197 142911 253462
11164 253462 166663 -83915 150238 -21257 405598 56921 -269181 116619 -215107 -277981
11154 -277981 -126047 204295 -84628 -171967 181930 175516 100574 -64814 -218384 -136078 -314014
11143 -314014 -88885 164578 -59941 -44773 23220 106822 243934 178089 -136888 217724 190506
11132 190506 136403 103562 -126368 38466 131843 285807 -151153 161858 204657 219787 -126810
11120 -97021 4406 35350 -51170 262794 264466 8455 371954 -245247 51566 319109 57954
11108 177632 -174930 477149 70314 150273 473456 315624 226794 529612 234080 181946
11098 181946 21373 125981 362884 292078 165776 352533 318380 368932 308027 370408 527035
11087E27035C778i1384C94221A91652J97706n4199J57068k32713K86153k21010
11077C24657j59072K85723O5814J96991j84780L0687B75273J44837j20343J65005
11067D64772M8137L7023k69018Q7051M37452k17895L35809k55237K5221j95937
11057D97378J48533K24203j03505p1071K78612j23623J33704L2408q2111M6214
11047I80742l44681R7311j95240L59349J17064L71125l94504r1935Q2635J41474
11037A123340K10808m09735J24298k15816n4199J69413J59394J57865l48926K49684
11027A166126j17526J976l7294k07192O3723j5611l51157K08078J19280K89198
11017A119601j67531D52542K71260K63187L8342k09886J1398J46523k53777j03939
$$ plain form
11087 527035 3778 -91384 394221 191652 389358 335159 492227 259514 545667 324657
11077 324657 165585 451308 517122 714113 529333 560020 275273 420110 299767 464772
11067 464772 512909 549932 280914 367965 805417 587522 923331 668094 693315 497378
11057 497378 645911 870114 766609 695538 974150 850527 984231 1016639 934528 980742
11047 980742 636061 733372 538132 897481 1014545 1385670 991166 899231 981866 1123340
11037 1123340 1334148 924413 1048711 832895 778696 948109 1107503 1265368 916442 1166126
11027 1166126 1048600 1050576 1013282 806090 869813 854202 503045 711123 830403 1119601
11017 1119601 952070 452542 723802 986989 1025331 815445 826843 973366 719589 615650
11007F15650J97806j51808L1795J83399j3701P5535j27551k27095J83494K69313
10997A036837p3398l84696L06160o0262Q578Q7682L03755j48777M2449j28870
10987I89458K3208M42786k37272m1066M39805K01723j23168P464L56941n5066
10977B004813L91582J84032M62794M04410N08363K58994q5458K78962k98028j78413
10967C932051m60624l36172p61941j77940j10869K9471m8882k16362J09763o7369
10957A891126j33156R2833l62591k19669j08019j19139L1485l37620k39761j87016
10947C08473p5798J35372H6061J69396J0482O3018Q6295A90916L50C1770J4190
10936D5960L12766j17043e665B99190A29287J46467B709b7343h490A8613J01909
$$ plain form
11007 615650 813456 661648 693443 876842 863141 938676 811125 584030 767524 1036837
10997 1036837 963439 578743 884903 824641 833219 920901 1224656 1075879 1118328 989458
10987 989458 1012666 1455452 1218180 1177114 1616919 1818642 1695474 1702938 2059879 2004813
10977 2004813 2396395 2580427 3043221 3447631 3955994 4214988 4129530 4408492 4110464 3932051
10967 3932051 3471427 3135255 2373314 2195374 2084505 2113976 2065094 1848732 1958495 1891126
10957 1891126 1757970 1850803 1488212 1268543 1160524 1041385 1072870 735250 495489 308473
10947 308473 232675 368047 86061 255457 265939 328957 415252 190916 191266 31770 45960
10936 45960 358726 241683 -5665 299190 129287 275754 2709 -27343 -8490 18613 120522
10925A20522O3369g2173G9495c34490A46536A4285P4143i9778j10875L5281E28478
10913F4853f820A4470L1540A2928g7771A26938R6724a17549a5238B888J71313
10902A74201a29383B99678j35323J8594A8650a5691r3208l46547A23449J67062
10892B90511h7380B65906I8317h5148B5017c612A52629G3666C2552K7486a92989
10880a8553p9830m4156r8719i518l480A14610d73n19752H1325d5826A27158b90921
10867D518c02626A53230J56775a97418b8566p217B6218b30404M0150f2024k84336
10856c46360a7546C3323i204A20944b39168P5441j0334A09389l9129K90419h6318
10844e6331A7716g1948K0280A0760P94N2284J28234b52470J02056r8442d7786
$$ plain form
10925 120522 183891 -72173 79495 -334490 146536 14285 88428 -99778 -210653 -175372 528478
10913 64853 -6820 14470 46010 12928 -77771 126938 223662 -117549 -15238 2888 174201
10902 174201 -129383 299678 164355 182949 18650 -15691 -108899 -455446 123449 290511
10892 290511 -87380 265906 98317 -85148 25017 -3612 152629 73666 32552 60038 -192989
10880 -18553 -98383 -142539 -241258 -9518 -12998 114610 -473 -520225 81325 -45826 127158 -290921
10867 4518 -302626 153230 310005 -197418 -28566 -35783 26218 -230404 -190254 -62024 -346360
10856 -346360 -17546 33323 -9204 120944 -239168 -163727 -174061 109389 70260 360679 -86318
10844 -56331 17716 -71948 -51668 10760 11554 63838 192072 -252470 -150414 -248856 -47786
10832i5222E227J12598a88517a3224l66617G2730B9105g9325j62697I4050b05593
10820B37639a68600q9462A24583l0198A2898K19636a82341h5720j48160h0132
10809H5447h2911n3119A78554q5770a6216j77715EJ23397a51711B49755N9434
10798C09189j12891b9991l4104D0678K09922a28566b5308D32821b55456a20855
10787b60500h6504j44214a10897C68395D6608g9079A84358b59688L3697A91027
10776B6446a78921P2450O500d6557A7736J07071c9565F1405h0564A91333b22195
10764C5319d5072I0183B1800r122L50382f8832o1514B24825a62496I665c77816
10752g4375j16014h0142B5556b36726A43362a5114A97031B6243i6203j20696H8231
$$ plain form
10832 -95222 5227 117825 -188517 -13224 -379841 72730 29105 -79325 -242022 94050 -205593
10820 237639 -168600 -258062 124583 94385 12898 232534 -182341 -85720 -233880 -80132
10809 85447 -82911 -136030 178554 92784 -16216 -193931 5 123402 -151711 249755 309189
10798 309189 196298 -29991 -64095 40678 250600 -128566 -25308 432821 -255456 -120855
10787 -260500 -86504 -230718 -110897 368395 46608 -79079 184358 -259688 -225991 191027
10776 26446 -178921 -106471 -99971 -46557 17736 124807 -39565 61405 -80564 191333 -222195
10764 35319 -45072 90183 21800 12678 363060 -68832 -130346 224825 -162496 9665 -377816
10752 -74375 -190389 -80142 25556 -236726 143362 -15114 197031 26243 -96203 -216899 88231
10740h3542j13771C14262c73248J36066E5449b86158A9899c8462r0001n8850I9749
10728A22069e35544A36943d1997q909J1087B12167a29163C4424K17274e5152B80298
10716a68299B14502b53686a21806j49365A41187A740c9063G8903b80789A94110
10705c80797a36218N5256j61205A41563N7302a41663e8954j38849q6522a18114
10694i360B78385b16107D3211N3245N0147f5452E9453c45706J60022G6180a38714
10682b94587a2994E4179K16050q1538L2244a06336q7634I8026h3014C3363g4946
10670B26475a92010h2893l362n8231j20514a15336l2915N4745n553A89942g4273
10658A9859a02916A15421f3464A51857b93302m8775e9598G4836a41347p5424A39998
$$ plain form
10740 -83542 -197313 314262 -373248 -237182 55449 -286158 19899 -38462 -128463 -187313 99749
10728 122069 -535544 136943 -41997 -50906 -39819 212167 -129163 34424 251698 -55152 280298
10716 -168299 214502 -253686 -121806 -271171 141187 1740 -39063 78903 -280789 194110
10705 -380797 -136218 -80962 -242167 141563 198865 -141663 -58954 -197803 -284325 -118114
10694 -9360 278385 -216107 43211 96456 146603 -65452 59453 -345706 -185684 76180 -138714
10682 -294587 -12994 54179 270229 188691 220935 -106336 -193970 98026 -83014 33363 -74946
10670 226475 -192010 -82893 -86255 -144486 -265000 -115336 -148251 -93506 -99059 189942 -74273
10658 19859 -102916 115421 -63464 151857 -293302 -342077 -59598 74836 -141347 -216771 139998
10646c2051k9272I0118R0028d6693l37994A91079c8658j32302J3341g3668k1020
10635i4688l11925b3657A15404J15168Q0654B263a40793j64321A79158a48868
10624G652h0122c7518k06003B9672K12263r5737C5683b80773A07079f0238k27217
10613b87455J21416G8084a97955f7674C53369a85834N9032A50396h7190l9972
10603a27162b1071l2014j7451A91661j5645c11414e4062A32206M7650e8391j98071
10592b56462h9303L7062A68840a56802k78624R1451b8926n7483E9329a46394D16411
10580b17023d3153k18749B62040c1631B00628p6927b55398Q9786O172f5805m4088
10569a09893A3478J09897h9197C7480J12071g8617B48164J39888a97875f9854
$$ plain form
10646 -32051 -61323 90118 180146 -46693 -384687 191079 -38658 -170960 -157619 -73668 -94688
10635 -94688 -406613 -23657 115404 230572 311226 2263 -140793 -305114 179158 -148868
10624 7652 -80122 -37518 -243521 29672 241935 146198 35683 -280773 107079 -60238 -287455
10613 -287455 -166039 78084 -197955 -67674 353369 -185834 -126802 150396 -87190 -127162
10603 -127162 -21071 -53085 -70536 191661 176016 -311414 -54062 132206 179856 -58391 -256462
10592 -256462 -89303 -52241 168840 -156802 -435426 -343975 -28926 -86409 59329 -146394 416411
10580 -217023 -43153 -261902 262040 -31631 200628 123701 -255398 -165612 -159440 -65805 -109893
10569 -109893 13478 123375 -89197 37480 149551 -78617 248164 388052 -197875 -69854
10558d2490n5163H0202k3882B5575J11183c16183E3538J63570p4678a91603K9572
10547a62031i199n2744E7152a78255J6527B11187C2732i3594C0408b19604A03779
10535b99503A63085B3945c08139G4115b49015B56854b9563H6427a76441g1107
10524A24646f2912o1347n7653H9064a1397j67992B14278r2891J93355D1944J10466
10513A52410a56860g8259a4411j06760N5444e706j91068C93107H7666N4087R5535
10502B37288o8762f380o1001j15099A4063b06517h3874C80085j88811M4466H6064
10490b15336A39221h934k39094d7361B70446A09805M2980n6275K79170j21031
10480B54649K30405A84557K26141E0998J74647e3191j39756M5724e8529n1983
$$ plain form
10558 -42490 -97653 80202 56320 25575 136758 -316183 53538 217108 142430 -191603 -162031
10547 -162031 -9199 -61943 57152 -178255 -161728 211187 32732 -93594 30408 -219604 103779
10535 -299503 163085 23945 -308139 74115 -249015 256854 -29563 86427 -176441 -71107
10524 124646 -62912 -124259 -181912 89064 -11397 -179389 214278 121387 314742 41944 152410
10513 152410 -156860 -78259 -14411 -121171 -65727 -5706 -196774 393107 87666 141753 237288
10502 237288 168526 -6380 -67381 -182480 14063 -206517 -83874 380085 191274 235740 86064
10490 -215336 139221 -8934 -248028 -47361 270446 109805 152785 96510 375680 254649
10480 254649 485054 184557 410698 50998 225645 -53191 -192947 -147223 -58529 -110512
10470a10512B29311g7628D3164R0659c33549a24456f759j82470B60305b6330l7225
10459f3555F7729c4928H4660a09494P446A23503c530n8859j96662a20007A84978
10447A99395p1160e1345B20940b59279A04396b5150E3984J05854c11344J33236
10437a78108A06457N1996c2269A07882J54197b60215I5352b383F6409m292a18586
10425a14249A53650E1583b05738d0550P736K622A33333b60574o33I5089J13017
10414B08106c6077A71938H3324K7826q085m5203b02435g3366B27182a28483A3260
10402D1374J16706G2431N0572e6649B43442f8804A52647k7512K47335a54523B24697
10390A4831K37997b5582f904B25438F2352l1040R137M9282F440J60186J54095
$$ plain form
10470 -110512 229311 -77628 43164 133823 -333549 -124456 -6759 -189229 260305 -26330 -63555
10459 -63555 67729 -34928 84660 -109494 -102048 123503 -3530 -62389 -259051 -120007 184978
10447 199395 128235 -51345 220940 -259279 104396 -25150 53984 159838 -311344 -178108
10437 -178108 106457 158453 -32269 107882 262079 -260215 95352 -2383 66409 62117 -118586
10425 -114249 153650 51583 -205738 -40550 -32814 -30192 133333 -260574 -261207 95089 208106
10414 208106 -36077 171938 83324 111150 103065 57862 -202435 -73366 227182 -128483 13260
10402 41374 158080 72431 123003 -56649 243442 -68804 152647 125135 372470 -154523 224697
10390 14831 252828 -25582 -6904 225438 62352 31312 40449 89731 6440 166626 320721
10379C20721o6822K36225j96917K49624k05872H7127L58858A5724N00312Q3109
10369E99145o4106p5697B00985L19400n782o4639O7388k3987j33147A12035K2244
10358A34279J88708A22639K80256L590j56297P6608M57488O7220j09858j94244
10348E47402J98295j23420k83910K26809A65930J625J35460J42180e8100G7219
10337A74318j3754J50428J8534B0464N453i984C91064h982A70417m0016j8114
10326A12287l1360Q9775L08656k35789J71628P9807A13028N8663j6829K81856
10316D36718b90257A40205J1145h3216G7253R497a8111l7610F9030a5712k37832
10305b53544q007B19659g5650k7110k29150A19090C4652L43657d9945K1207B49465
$$ plain form
10379 320721 253899 490124 293207 542831 336959 87127 445985 15724 516036 599145
10369 599145 535039 459342 200985 520385 514603 449964 517352 493365 360218 112035 134279
10358 134279 322987 122639 402895 406485 250188 326796 784284 851504 741646 547402
10348 547402 745697 622277 338367 565176 165930 167555 303015 445195 -58100 77219
10337 174318 160564 310992 329526 20464 25917 -9984 391064 -8982 170417 130401 112287
10326 112287 80927 170702 479358 243569 415197 495004 113028 171691 154862 436718
10316 436718 -290257 140205 151350 -83216 77253 86750 -18111 -55721 69030 -15712 -253544
10305 -253544 -261551 219659 -75650 -102760 -331910 119090 34652 378309 -49945 -28738 249465
10293d62242A55444b23309b6722C431a17006b483A17522c12796b0105j83886F1038
10281A64779a38419A50026B5879K93633b87659G2170a87541I6028N3087g2634
10270b32816F8304b955D8980J74437J94279b75531e1662D832J7832a96810C54969
10258E15787j78547M2288q8389o1810L4571j31441n3698J42092A00249J07567
10248B07816b8508A13048M2921g926l35750B5514J27181d5843j16294j2962f5335
10236C19714a87067C802N8821j3452a6364k65241I026a11917a0637l78874g0301
10224b10532F106g6469A71659a0045A73162L38839a44316A4551b58347f7239j61936
10213b29175e5805n2665M4949A44268J98031M8871A44631h6547D6008J2976L5218
$$ plain form
10293 -462242 155444 -223309 -26722 3431 -117006 -2483 117522 -312796 -20105 -203991 61038
10281 164779 -138419 150026 25879 319512 -287659 72170 -187541 96028 149115 -72634
10270 -232816 68304 -2955 48980 223417 417696 -275531 -51662 4832 22664 -196810 354969
10258 515787 337240 379528 291139 229329 263900 132459 78761 220853 100249 207816
10248 207816 -28508 113048 155969 -7926 -343676 25514 152695 -45843 -162137 -175099 -65335
10236 319714 -187067 3802 62623 49171 -16364 -281605 9026 -111917 -10637 -389511 -70301
10224 -210532 6106 -76469 171659 -10045 173162 512001 -144316 14551 -258347 -67239 -229175
10213 -229175 -55805 -108470 -63521 144268 342299 391170 144631 -86547 46008 58984 94202
10202I4202c601B6597J01853a56973j43226O8946n8356B32878c67067d9409k58286
10191c07695k53631b60510G8945g1598A0865h4999N598A63184b06289A15523a58953
10179A23674d1995j31832P5996K5156f464j32706A3591e0673k03333i3523F119
10167E4802J03519a45304J9929I5115K20707g1683H7915a24518A17284b55231
10156i9109D9363I650c0925A61430h0237A07525a50751H0567C9164a2473n0756
10145f3229I2153a58368E5969R4858c87256J4514D2546a58692J3851A08697a40695
10133A2897b6602o1416a861C2854c21718a00092k5078H2692a76800L0418B2730
10121i8596K0127j1713I6690A9379b30000k21340a7860k32245a09071A53765a61604
$$ plain form
10202 94202 -3601 26597 128450 -156973 -300199 -231253 -289609 232878 -367067 -49409 -307695
10191 -307695 -561326 -260510 78945 -71598 10865 -84999 -79401 163184 -206289 115523 -158953
10179 123674 -41995 -173827 -97831 -72675 -6464 -139170 13591 -50673 -254006 -93523 6119
10167 54802 158321 -145304 -125375 95115 315822 -71683 87915 -124518 117284 -255231
10156 -99109 49363 9650 -30925 161430 -80237 107525 -150751 80567 39164 -12473 -63229
10145 -63229 92153 -158368 55969 150827 -387256 -372742 42546 -158692 -144841 108697 -140695
10133 12897 -26602 -88018 -1861 32854 -321718 -100092 -125170 82692 -176800 -146382 22730
10121 -98596 -78469 -90182 96690 19379 -230000 -451340 -17860 -250105 -109071 153765 -161604
10109a25682G1085M3368b21415Q5767A00736h9816A438J54344A0988K6551A1345
10097F2430a92406b2042k48982h7658o8254e2760j38544I5022r678b83053a24695
10085b6645A25112K8293a34618A3009a37200N7360L0434k11578g38j04976a0106
10073E3577P4259a33608j00507B5112J01649c01837O7636D4800a631H063Q3599
10062I1662d2500o2878C62059c1436j01060I0511h1560j48506H9968c11400c1124
10050c86908D936a28327e7114k06582R7226N8879c7469k58423D4813j7215K6344
10039E3942A2567J62689J7355E1559c9967r525j42543A06594a45667B1767J08368
10028A30135m1721a35203j66783m367A79808k1540m0851D4899g8974k5944k79541
$$ plain form
10109 -125682 71085 114453 -221415 -135648 100736 -89816 1438 155782 10988 37539 11345
10097 62430 -192406 -22042 -271024 -87658 -155912 -52760 -191304 95022 85344 -283053 -124695
10085 -26645 125112 153405 -134618 13009 -137200 -79840 -49406 -260984 -738 -105714 -10106
10073 53577 127836 -133608 -234115 25112 126761 -301837 -234201 44800 -1631 8063 91662
10062 91662 -42500 -105378 362059 -31436 -132496 90511 -81560 -230066 89968 -311400 -31124
10050 -386908 4936 -128327 -57114 -263696 -166470 -107591 -37469 -295892 44813 27598 53942
10039 53942 12567 175256 192611 51559 -39967 -49492 -192035 106594 -145667 21767 130135
10028 130135 88414 -135203 -301986 -306353 179808 158268 117417 44899 -78974 -104918 -384459
10017c84459a90834f4806b7757A13803N7329A6063f3141J8214q7085c4135k1930
10006e6065j65922c3950B62120p8556L4050a68634D4324j5569c06982m000D2844
9994h9329A31237a54376B00J84799d89680I9493a5602A8622J82777a13334p1706
9983a85040b2713r737D2838h5093k27871B13773c54938B42135a76655J3170C27404
9971c5842j71012k05328C057b24946B28928a28457A13856c8942j97628B04028
9960a37927J9769h770B40768G6917e0423B5010L33641j65163p9463b09206B60291
9948A6591J08329a43958n2489B02703F5573f6809l437B0466d9145r553A80424
9936b03427A73324q0245B0946f0364p5908e5298k29483K0686H0858c34396f5897
$$ plain form
10017 -384459 -190834 -64806 -27757 113803 171132 16063 -63141 -44927 -132012 -34135 -56065
10006 -56065 -221987 -33950 262120 183564 217614 -168634 44324 28755 -306982 -310982 42844
9994 -89329 131237 -154376 200 184999 -489680 99493 -15602 18622 201399 -113334 -185040
9983 -185040 -22713 -32450 42838 -85093 -312964 213773 -354938 242135 -176655 -163485 327404
9971 -35842 -206854 -412182 3057 -224946 228928 -128457 113856 -38942 -236570 204028
9960 -137927 -118158 -8770 240768 76917 -50423 25010 358651 193488 114025 -209206 260291
9948 16591 124920 -143958 -196447 202703 65573 -66809 -70246 20466 -49145 -58698 180424
9936 -203427 173324 93079 20946 -60364 -136272 -55298 -284781 -264095 80858 -334396 -65897
9924a05039b0802j85483C5895b77012a03808A74214G4573a11676A01217J11862
9914B13079g6819q5505B60296b30782j5630k3901J10379j33623I0605b60539a04038
9902a12918E0818J06959F5601a55311j24218a34417p973A70370d24351h8130F0612
9890a8002m0070A70422A4010c0025Q602D9592b8112k6188G2317f4400d573m12719
9878d17292C2962c7477B0653L1146J21683a24154A92744c20750A0082K02442o6037
9867A46487C0945e2791A66872a9496q9654d9355C19668I0865J61800A06644i6351
9855B23881b87582d6192q5981D8172Q4175L0483a02563F2076g8845D6115O5384
9844A11499i9945c0201j09582B38050r6830i3306k10844D1848A6165f1796j16742
$$ plain form
9924 -105039 -20802 -206285 35895 -277012 -103808 174214 74573 -111676 101217 213079
9914 213079 -76819 -162324 260296 -230782 -246412 -270313 -159934 -293557 90605 -260539 -104038
9902 -112918 50818 157777 65601 -155311 -279529 -134417 -142390 170370 -424351 -88130 60612
9890 -18002 -58072 170422 14010 -30025 -21423 49592 -28112 -54300 72317 -64400 -4573 -417292
9878 -417292 32962 -37477 20653 51799 173482 -124154 192744 -320750 10082 212524 146487
9867 146487 30945 -52791 166872 -19496 -109150 -49355 319668 90865 252665 106644 -96351
9855 223881 -287582 -46192 -132173 48172 132347 162830 -102563 62076 -78845 46115 111499
9844 111499 -99945 -30201 -139783 238050 141220 -93306 -304150 41848 16165 -61796 -178538
9833a78538K8969A5418J14379k0244k0661C1231c10683J10041C1095a65479e6180
9821b24529b2448j96361G1372A1844a97652B39029a93698A15795a76724k04596
9811c81320k1777D2682a01510D5302d5279q3151j7414A27425a07486A13159f7156
9799i5213m3878k03197a10342m6984B11488d8615G1105a57799K257n2006A68968
9787i4160L343n6365l3037j68334C401M5767h8322K8325k62526R7788H8611c51619
9774b23158A31613a14715A89500d47157E3278J72964i2398E1869J11096b04466
9763D6710g0685a1455E263L1900b151j24375k17213J52180Q7607A03453c8759
9751G0589a1404k41357a08508A12872a55814c7046j39844A9830K54483a8461A10994
$$ plain form
9833 -178538 -149569 15418 129797 109553 88892 31231 -310683 -200642 31095 -165479 -56180
9821 -224529 -22448 -218809 71372 11844 -197652 239029 -193698 115795 -176724 -381320
9811 -381320 -403097 42682 -101510 45302 -45279 -128430 -145844 127425 -107486 113159 -67156
9799 -95213 -139091 -342288 -110342 -157326 211488 -48615 71105 -157799 -155542 -207548 168968
9787 -94160 -90817 -147182 -180219 -348553 3401 49168 -88322 -59997 -322523 -224735 88611 -351619
9774 -223158 131613 -114715 189500 -447157 53278 226242 -92398 51869 162965 -204466
9763 46710 -70685 -11455 5263 37163 -2151 -126526 -343739 -191559 -103952 103453 -38759
9751 70589 -11404 -252761 -108508 112872 -155814 -37046 -176890 19830 274313 -18461 110994
9739b76173b1970D9768c47974N6669A98757a74956f9148N790C6858J19739a19255
9727A37229e1795i428k89384A1672e7787B16968h9524A04140a41240B3452a8239
9715i9306c0943q5521j6635F3095c04607A61034b22329g9235I3070a98115F3571
9703b3903A00648c17559e9127J1396m479b5797j50891B45118d2809B40949A292
9691b19947G3616k0645b85904a8389r4431A7455a25026F7980c06507F9299l3L9552
9679A08818j5627E789a94770A9710J05646e2223b3939G7167J29205c507k04787
9668b08294A58348E2754b67755g9166A026P2893f0652p6440A11343b32921j25753
9657c58674a26885B5035e7870F7300b28270o6300c3128A13549a02405n404G2887
$$ plain form
9739 -276173 -21970 49768 -347974 -291305 198757 -174956 -69148 -63358 36858 156597 -119255
9727 137229 -51795 -9428 -298812 11672 -57787 216968 -89524 104140 -141240 23452 -18239
9715 -99306 -30943 -116464 -133099 63095 -304607 161034 -222329 -79235 93070 -198115 63571
9703 -23903 100648 -317559 -59127 -47731 -52210 -25797 -176688 245118 -42809 240949 1292
9691 -219947 73616 52971 -285904 -18389 -112820 17455 -125026 67980 -306507 69299 69266 108818
9679 108818 93191 5789 -194770 19710 125356 -52223 -23939 77167 206372 -3507 -208294
9668 -208294 158348 52754 -267755 -79166 1026 73919 -60652 -137092 111343 -232921 -358674
9657 -358674 -126885 25035 -57870 67300 -228270 -294570 -33128 113549 -102405 -107809 72887
9645a38836A08812b6274A05103a04006k5995j3232l10119A66179b04524j29913
9635c34437O5464a10604l22538o8947D5094J88404a38026L1469h946j92554f7975
9623b71293J06928k00152J20212r8510D2960b28214g6907r4528D7062b43984c3741
9611a9870j22252o1606C0058d4274H7539a97408B20812J73944A06909c22249P4590
9600b47659O8791l2903h6220j20674b9427l983n11855K01918b0228B30085H4771
9588A35676e2247l67221K02732e9993G0134e10720a70498I0938a3317M598j3355
9577b2074p9614j50866R5051A31038c5173m65471C8328a78301j09989g1352J4862
9566e6490o7296A05566c845G096O2710k0998K7908b46379n6700c4717G773b6967
$$ plain form
9645 -138836 108812 -26274 105103 -104006 -130001 -143233 -453352 166179 -204524 -334437
9635 -334437 -268973 -110604 -433142 -502089 45094 233498 -138026 -106557 -8946 -201500 -67975
9623 -271293 -164365 -364517 -244305 -342815 42960 -228214 -76907 -171435 47062 -243984 -33741
9611 -19870 -142122 -203728 30058 -44274 87539 -197408 220812 394756 106909 -322249 -247659
9600 -247659 -178868 -211771 -86220 -206894 -29427 -33410 -545265 -343347 -20228 230085 84771
9588 135676 -52247 -419468 -216736 -59993 70134 -510720 -170498 90938 -13317 -8719 -22074
9577 -22074 -101688 -252554 -157503 131038 -35173 -500644 38328 -178301 -288290 -71352 -56490
9566 -56490 -123786 105566 -3845 7096 69806 48808 76716 -246379 -303079 -34717 7773 -26967
9553b67239A93984a09508A05963C5737c52056a62362n4406g9274m3113j9839b2610
9541A59917K8260b31361A502J1628e7581B589a15253A83653b81531a14932d7415
9529b30150I3909a42664j28205D3263b09883g8710G5340M5844L7666c63784A42043
9517A0613J5701J46268a72505f0868D81085f7749c0161k86015l7504a0874A04988
9505B8059p120c0822l73392d4820G1534N7571c15585A85978l9765d809j78140
9494a82949r2429e6222J0825a9823k952g133r5992A32376A8289e3229F9948b55033
9481b3692k18009F3075d6026l075B37868b82414M1162j38075e543k16862K208
9470b20197H8265a6465B04985C5361J62752b27592b4877j70583A61141C9769R8681
$$ plain form
9553 -267239 193984 -109508 105963 35737 -352056 -162362 -216768 -79274 -122387 -142226 -22610
9541 159917 188177 -231361 1502 13130 -57581 2589 -115253 183653 -281531 -114932 -47415
9529 -230150 93909 -142664 -270869 43263 -209883 -78710 75340 121184 158850 -363784 142043
9517 10613 26314 172582 -172505 -60868 481085 -67749 -30161 -316176 -353680 -10874 104988
9505 28059 20939 -30822 -404214 -44820 71534 129105 -315585 185978 146213 -4809 -182949
9494 -182949 -275378 -56222 -45397 -19823 -22775 -7133 -103125 132376 18289 -53229 69948 -255033
9481 -23692 -241701 63075 -46026 -49101 237868 -282414 -241252 -379327 -5543 -222405 -220197
9470 -220197 88265 -16465 204985 35361 198113 -227592 -24877 -195460 161141 39769 138450
9459A38450l4790a05355r874m2977D5252h8692d475k9255C57543a47048A83859
9447b10459L0013A7807e8723A76370b24761M8653j49136c0461F5950N100a61870
9435B66101g4295A3721h7295L9795k85438a64149G8781R4220c53144a59320j68650
9424c27970A13819g2169J4840A76556b97554g9350j65523A11628E4269c5128l5790
9413g0918l5727C5845a56271A15036K2787J11359b94225i1949j24401j2034A18269
9401I2358P5340C3608a15176a0279A65954b91111A25143a81166e5935A4673N411
9390B0084L3010b66922B05160f3331B04221a12969k02487a42494j77068i6965
9379C3877P9033a67132e7512A24111h3866j52444G9178M06695F1667J4925D059
$$ plain form
9459 138450 103660 -105355 -115229 -158206 45252 -88692 -4475 -33730 357543 -147048 183859
9447 -210459 -180446 17807 -58723 176370 -224761 -176108 -325244 -30461 65950 71050 -161870
9435 266101 -74295 13721 -87295 -47500 -332938 -164149 78781 173001 -353144 -159320 -327970
9424 -327970 113819 -72169 -57329 176556 -297554 -79350 -244873 111628 54269 -35128 -70918
9413 -70918 -106645 35845 -156271 115036 137823 249182 -294225 -91949 -216350 -228384 118269
9401 92358 167698 33608 -115176 -10279 165954 -291111 125143 -181166 -55935 14673 20084
9390 20084 53094 -266922 205160 -63331 204221 -112969 -315456 -142494 -319562 -96965
9379 33877 112910 -167132 -57512 124111 -83866 -236310 79178 485873 61667 76592 4059
9367b55155I726a17946j22349h3244k06626Q6850D9646P8420a2983B36170a11996
9355F6268a06706B15788d3965E8054B0968a91969F5997b612q0661N294j20520
9344a98499P3130j71519J45908k01746i054p9748a0142H2349f0n6888j79135C0632
9331F1340e4344A02931b52926A9756a76783e2833A1616J11639b78972k5303G0956
9319C67214c2190J0270m44004a52096b4305j26270p835M1743B4165a07221A17350
9307b04132A48198d10335g0905p1242A16848a96685O5704C03296A28838k6127
9297A02711b39916P7169F3788d2801G6728b29668B11277b03939A67657b01939
9286a5322l0875k85080B90162A0431a90666Q5171A6455a86749D4692f7974C4389
$$ plain form
9367 -255155 9726 -117946 -240295 -83244 -289870 -203020 49646 128066 -12983 236170 -111996
9355 66268 -106706 215788 -43965 58054 20968 -191969 65997 -2612 -83273 -77979 -198499
9344 -198499 -125369 -296888 -150980 -352726 -9054 -88802 -10142 82349 -60 -56948 -236083 30632
9331 61340 -54344 102931 -252926 19756 -176783 -52833 11616 123255 -278972 -304275 70956
9319 367214 -32190 -21920 -465924 -152096 -24305 -150575 -158410 -116667 24165 -107221 117350
9307 -204132 148198 -410335 -70905 -142147 116848 -196685 -130981 303296 128838 102711
9297 102711 -239916 -162747 63788 -42801 76728 -229668 211277 -203939 167657 -201939
9286 -15322 -46197 -331277 290162 10431 -190666 -105495 16455 -186749 44692 -67974 34389
9274a06939j85144E975a60337P2413j34034j26686c6738j53508j22177a1809C20666
9262F2418a6943o8453j21573D2387O5896a52335j3195O0811k6830A11033Q8237
9251A99270A0525c1062f959A68409i7763j77945b1349j54457q7411f91k8183j42835
9239a71709a8541k99358c9702E3366O4735e0367I5592a8685k4417j97300C85559
9227E6749a25413B73264b03833k8192i9104j72459p0114a56103D3068J17168a54309
9215h0985c5156j39625K5547J9943A77361C3725b91394Q7934H2949a89305k30113
9204d19418d3807j2193p2442A18359K8370a48806A19679e5798l9605L1979A23404
9192a075j94398j31920g1597k43859c6866A67282a83123E5189a36755j22147P4233
$$ plain form
9274 -106939 -292083 5975 -160337 -87924 -221958 -348644 -36738 -190246 -312423 -11809 320666
9262 62418 -16943 -85396 -206969 42387 108283 -152335 -165530 -104719 -131549 111033 199270
9251 199270 10525 -31062 -6959 168409 -97763 -275708 -21349 -175806 -263217 -691 -28874 -171709
9239 -171709 -18541 -317899 -39702 53366 118101 -50367 95592 -18685 -43102 -240402 385559
9227 56749 -125413 273264 -203833 -232025 -99104 -271563 -341677 -156103 43068 160236 -154309
9215 -80985 -35156 -174781 -149234 -129291 177361 33725 -291394 -203460 82949 -189305 -419418
9204 -419418 -43807 -56000 -128442 118359 146729 -148806 119679 -55798 -95403 -63424 123404
9192 -1075 -195473 -327393 -71597 -315456 -36866 167282 -183123 55189 -136755 -258902 -184669
9181a84669g9245B08653d8916k56496e2386B00134h1014J47D16492H7087J95410
9170B82497e14998A53549a29530M0612j52693h0345j35275f1653n5452a456m1614
9159d3070j02320D09947b15324a06202j30548C20512b07169A31807M7796o1760
9149A17843h2807j3020I7123a58989E9429a79396f3071l3427K7201k67707I6466
9137F4239K19793J31500A31183b6144l03291G9535i4764A89292b07275c4995l9699
9126g4694m4706j88455A70200H0904b69040G9788J28368d942r1328A63079b93910
9114b75886B24952a54182A84319C1757P1768N2992F4624b28817R6790l61212A95041
9102A2950b18636B32453E1608J59361d3650C7232b27727a08344I5774C8159f4409
$$ plain form
9181 -184669 -79245 208653 -48916 -305412 -52386 200134 -81014 -80867 416492 87087 282497
9170 282497 -514998 153549 -129530 -88918 -241611 -80345 -215620 -61653 -117105 -1456 -43070
9159 -43070 -145390 409947 -215324 -106202 -236750 320512 -207169 131807 179603 117843
9149 117843 -82807 -95827 97123 -158989 59429 -179396 -63071 -96498 -69297 -337004 96466
9137 64239 284032 415532 131183 -26144 -329435 79535 -94764 189292 -207275 -34995 -74694
9126 -74694 -119400 -307855 170200 80904 -269040 79788 208156 -4942 -96270 163079 -293910
9114 -275886 224952 -154182 184319 31757 103525 156517 64624 -228817 -132027 -493239 195041
9102 12950 -218636 232453 51608 210969 -43650 37232 -227727 -108344 95774 38159 -64409
9090A47144a44861J1125l75381B57655a39770M7144A65626L563K632E2221c31373
9078B54318l7236i1961j87106M5891j23037J17613B17491c39609A43747g7211
9067A02728J27726g0531j40460Q8806F4388J68848A3586A996a36916M1588q3036
9056a78364H9740b10756f8568m844K5551A71510G982J00945a8547j08710C2177
9044A57778o4372L3783b83529A05712i2543q6170C2705a76395K4490i929F0239
9032a52023f8504j79211K6129A21298g0753q8648k3822b6653l6225A86164Q3254
9021B69418a1309D0686N9442a9250j53553P2512C3900Q1055a19160e0390k65616
9010c16006F1643e2106F5893e8922k26539c1041j01652M0574c5195j43159E2744
$$ plain form
9090 147144 -144861 -133736 -509117 257655 -139770 -92626 165626 169189 171821 52221 -331373
9078 254318 217082 -91961 -279067 -233176 -356213 -238600 217491 -339609 143747 -77211
9067 102728 230454 -70531 -210991 -122185 64388 233236 13586 1996 -136916 -95328 -178364
9056 -178364 89740 -210756 -68568 -73412 -47861 171510 7982 108927 -18547 -127257 32177
9044 157778 93406 127189 -283529 105712 -92543 -178713 32705 -176395 -151905 -9929 60239
9032 -152023 -68504 -247715 -221586 121298 -70753 -159401 -183223 -26653 -62878 186164 269418
9021 269418 -11309 40686 100128 -19250 -172803 -100291 33900 114955 -119160 -50390 -316006
9010 -316006 61643 -52106 65893 -58922 -285461 -31041 -132693 -92119 -35195 -178354 52744
8998a2224k80427A27152C7765c14728I9093j1883a34097G5961a4391p7765b6618
8986a86404f6910a5365B9608J11328M7875i8094k27013A01089C605K4292a64685
8974a83907k6155N7451N1280L1630E391h5380j43183D1514K53671g6596j05784
8963a82380P4181B00281a3090A66914a12822E7041a85567j1271G4367L8470a44937
8951c25477b0201n0735F0164a02055l36976g916B50154b00113F9265Q5238b51937
8939a47796A74725a1472j55208B01739K42431A64605F1461D46K49196e9016B16611
8927I7240J24994K32513R21118K008471N203212Q345977F963543B191332D31109
8917C09388r9934P0600b15235B27609b41822C58727b181I6911j7202M35013I7824
$$ plain form
8998 -12224 -292651 127152 37765 -314728 99093 87210 -134097 75961 -14391 -92156 -26618
8986 -186404 -66910 -15365 29608 140936 188811 -98094 -325107 101089 3605 27897 -164685
8974 -183907 -210062 -152611 -101331 -69701 5391 -85380 -228563 41514 295185 -76596 -182380
8963 -182380 -108199 200281 -13090 166914 -112822 57041 -185567 -196838 74367 112837 -144937
8951 -325477 -20201 -70936 60164 -102055 -439031 -7916 250154 -200113 69265 154503 -251937
8939 -147796 174725 -11472 -166680 201739 444170 164605 61461 446 249642 -59016 216611
8927 97240 222234 454747 1375865 3384336 8587548 16933525 6963543 2191332 431109
8917 309388 209454 280054 -215235 227609 -241822 358727 -2181 96911 79709 514722 97824
8905H4524a11490j37546a23770d3117I5653b8683A65904f1687E8474i1354r8060
8894a89414E6737b3880m706k23485J22296j0470A3686e9743A55838L9181a00196
8882B3587a98412d2880J9679o8018b8521A80443a44359J7830C48294b97361h8813
8870E2416g4133c380F3871L7148e8456M335l32951B03715i2768D2868a21899J8642
8858a03257M1523a6091O801k10293H8160A2205L74383b56077a00658B1811J2008
8847C3819a17440b5712A9336a06172L3676a9590m13388N4904B7657a56780C1264
$$ plain form
8905 84524 -111490 -249036 -123770 -43117 95653 -28683 165904 -61687 58474 -91354 -189414
8894 -189414 56737 -23880 -28586 -252071 -129775 -140245 13686 -59743 155838 195019 -100196
8882 23587 -198412 -42880 -23201 -91219 -28521 180443 -144359 -126529 348294 -297361 -88813
8870 52416 -74133 -3380 63871 101019 -58456 -54121 -387072 203715 -92768 42868 -121899 -103257
8858 -103257 -61734 -16091 -9290 -219583 88160 12205 386588 -256077 -100658 21811 33819
8847 33819 -117440 -25712 19336 -106172 -72496 -19590 -432978 -378074 27657 -156780 31264
$$ [...]
##END NTUPLES=NMR SPECTRUM
##END=
