##TITLE=AC1771_BRADRY_9683836_JopLPTxuFu
##JCAMPDX= 6.0         $$ Bruker NMR JCAMP-DX V2.0
##DATA TYPE= NMR SPECTRUM
##DATA CLASS= NTUPLES
##ORIGIN= BRUKER
##OWNER= Administrator
$$ 1.72 TOPSPIN		Version 2.1
$$ 2016-04-16 19:26:16.751 -0700  Administrator@X
$$ Compression mode = diff/dup
##.OBSERVE FREQUENCY= 400.02188249412
##.OBSERVE NUCLEUS= ^1H
##.ACQUISITION MODE= SIMULTANEOUS (DQD)
##.ACQUISITION SCHEME= undefined
##.AVERAGES= 64
##.DIGITISER RES= 22
##SPECTROMETER/DATA SYSTEM= spect
##.PULSE SEQUENCE= noesygpps1d.comp
##.SOLVENT NAME= COFFEE_meoh
##.SHIFT REFERENCE= INTERNAL, COFFEE_meoh, 1, 14.96054
##AUDIT TRAIL= $$ (NUMBER, WHEN, WHO, WHERE, PROCESS, VERSION, WHAT)
$$ ##TITLE= Audit trail, TOPSPIN		Version 2.1
$$ ##JCAMPDX= 5.01
$$ ##ORIGIN= Bruker BioSpin GmbH
$$ ##OWNER= Administrator
$$ $$ E:\/data/COFFEE/nmr/AC1771_BRADRY_9683836_JopLPTxuFu/12/pdata/1/auditp.txt
$$ ##AUDIT TRAIL=  $$ (NUMBER, WHEN, WHO, WHERE, PROCESS, VERSION, WHAT)
(   1,<2016-04-16 19:26:11.548 -0700>,<Administrator>,<X>,<go>,<TOPSPIN 2.1>,
      <created by zg
	started at 2016-04-16 19:14:41.970 -0700,
	POWCHK enabled, PULCHK disabled,
       configuration hash MD5:
       21 0F 79 D6 B3 7B B4 F6 88 20 88 DB 03 48 BD 9F
       data hash MD5: 64K
       8D 2A 52 46 D3 41 B9 43 98 5E BB D4 48 2C F0 9D>)
(   2,<2016-04-16 19:26:14.704 -0700>,<Administrator>,<X>,<proc1d>,<TOPSPIN 2.1>,
      <Start of raw data processing
       efp LB = 0.3 FT_mod = 6 PKNL = 1 PHC0 = 0 PHC1 = 0 SI = 128K 
       data hash MD5: 128K
       A4 0F 4A 52 1F A6 6B 1A C1 08 9E 36 12 E2 A3 A2>)
(   3,<2016-04-16 19:26:15.564 -0700>,<Administrator>,<X>,<proc1d>,<TOPSPIN 2.1>,
      <pk PHC0 = 269.7089 PHC1 = 0 
       data hash MD5: 128K
       9C 20 BF A5 8F E9 54 C5 F2 00 F6 BA 5F 0B 15 32>)
(   4,<2016-04-16 19:26:15.954 -0700>,<Administrator>,<X>,<proc1d>,<TOPSPIN 2.1>,
      <abs ABSG = 1 
       data hash MD5: 128K
       C0 28 A4 CD 81 C2 A2 8F BC EF A2 95 95 AB 18 AB>)
(   5,<2016-04-16 19:26:16.064 -0700>,<Administrator>,<X>,<proc1d>,<TOPSPIN 2.1>,
      <abs ABSG = 2 
       data hash MD5: 128K
       BC 6B A3 EE 68 D0 6A EC 26 D0 16 13 98 1F AA DF>)
(   6,<2016-04-16 19:26:16.158 -0700>,<Administrator>,<X>,<proc1d>,<TOPSPIN 2.1>,
      <abs ABSG = 3 
       data hash MD5: 128K
       0B 10 53 7E DE 47 5B 8C 8A 3D B8 DD BD E0 CE B4>)
(   7,<2016-04-16 19:26:16.236 -0700>,<Administrator>,<X>,<proc1d>,<TOPSPIN 2.1>,
      <abs ABSG = 4 
       data hash MD5: 128K
       A7 12 9F AC E4 50 A1 27 01 93 76 9B EF 7F A5 BC>)
(   8,<2016-04-16 19:26:16.376 -0700>,<Administrator>,<X>,<proc1d>,<TOPSPIN 2.1>,
      <abs ABSG = 5 
       data hash MD5: 128K
       62 32 B2 BB 5D A8 A2 47 0F CE F3 71 85 13 19 3C>)
$$ ##END=
$$ 
$$ $$ hash MD5
$$ $$ D3 61 01 39 AF B7 08 7A 9A 45 EE 78 F5 73 DE E3
##$RELAX= 
##$RELAX= 
##$RELAX= 
##$RELAX= 
##$RELAX= 
##$RELAX= 
##$RELAX= 
##$RELAX= 
$$ Bruker specific parameters
$$ --------------------------
##$DU= <E:\>
##$EXPNO= 12
$$ [...]
##$TP07= 0
##$TPNAME0= <>
##$TPNAME1= <>
##$TPNAME2= <>
##$TPNAME3= <>
##$TPNAME4= <>
##$TPNAME5= <>
##$TPNAME6= <>
##$TPNAME7= <>
##$TPOAL= (0..7)
0.5 0.5 0.5 0.5 0.5 0.5 0.5 0.5
##$TPOFFS= (0..7)
0 0 0 0 0 0 0 0
##$TUNHIN= 0
##$TUNHOUT= 0
##$TUNXOUT= 0
##$USERA1= <user>
##$USERA2= <user>
##$USERA3= <user>
##$USERA4= <user>
##$USERA5= <user>
##$V9= 5
##$VALIST= <valist>
##$VCLIST= <CCCCCCCCCCCCCCC>
##$VD= 0
##$VDLIST= <DDDDDDDDDDDDDDD>
##$VPLIST= <PPPPPPPPPPPPPPP>
##$VTLIST= <TTTTTTTTTTTTTTT>
##$WBST= 2048
##$WBSW= 25
##$XGAIN= (0..3)
0 0 0 0
##$XL= 0
##$YL= 0
##$YMAX_a= 6954449
##$YMIN_a= -12275181
##$ZGOPTNS= <>
##$ZL1= 120
##$ZL2= 120
##$ZL3= 120
##$ZL4= 120
##$ABSF1= 14.96054
##$ABSF2= -5.597642
##$ABSG= 5
##$ABSL= 3
##$ALPHA= 0
##$AQORDER= 0
##$ASSFAC= 0
##$ASSFACI= 0
##$ASSFACX= 0
##$ASSWID= 0
##$AUNMP= <proc_prof1d_extract.lims>
##$AXLEFT= 0
##$AXNAME= <>
##$AXNUC= <1H>
##$AXRIGHT= 0
##$AXTYPE= 0
##$AXUNIT= <>
##$AZFE= 0.1
##$AZFW= 0.1
##$BCFW= 0
##$BC_mod= 0
##$BYTORDP= 0
##$COROFFS= 0
##$CY= 15
##$DATMOD= 1
##$DC= 0
##$DFILT= <>
##$DTYPP= 0
##$F1P= 0
##$F2P= 0
##$FCOR= 0.5
##$FTSIZE= 131072
##$FT_mod= 6
##$GAMMA= 0
##$GB= 0
##$INTBC= 1
##$INTSCL= 1
##$ISEN= 128
##$LB= 0.3
##$LEV0= 0
##$LPBIN= 0
##$MAXI= 10000
##$MC2= 0
##$MEAN= 0
##$ME_mod= 0
##$MI= 0
##$NCOEF= 0
##$NC_proc= -2
##$NLEV= 6
##$NOISF1= 0
##$NOISF2= 0
##$NSP= 0
##$NTH_PI= 0
##$NZP= 0
##$OFFSET= 14.96054
##$PC= 1
##$PHC0= 269.7089
##$PHC1= 0
##$PH_mod= 1
##$PKNL= yes
##$PPARMOD= 0
##$PPDIAG= 0
##$PPIPTYP= 0
##$PPMPNUM= 2147483647
##$PPRESOL= 1
##$PSCAL= 4
##$PSIGN= 0
##$PYNMP= <proc.py>
##$REVERSE= no
##$SF= 400.020009822999
##$SI= 131072
##$SIGF1= 0
##$SIGF2= 0
##$SINO= 400
##$SIOLD= 131072
##$SPECTYP= <>
##$SREGLST= <1H.CDCl3>
##$SSB= 0
##$STSI= 131072
##$STSR= 0
##$SW_p= 8223.68421052631
##$SYMM= 0
##$S_DEV= 0
##$TDeff= 65536
##$TDoff= 0
##$TI= <>
##$TILT= no
##$TM1= 0
##$TM2= 0
##$TOPLEV= 0
##$USERP1= <user>
##$USERP2= <user>
##$USERP3= <user>
##$USERP4= <user>
##$USERP5= <user>
##$WDW= 1
##$XDIM= 131072
##$YMAX_p= 339565645
##$YMIN_p= -14896
##$CURPLOT= <Network HP LaserJet P1505>
##$CURPRIN= <$Network HP LaserJet P1505>
##$DFORMAT= <normdp>
##$LAYOUT= <+/1D_H.xwp>
##$LFORMAT= <normlp>
##$PFORMAT= <normpl>
##$SURQMSG= 1
$$ End of Bruker specific parameters
$$ ---------------------------------
##NTUPLES= NMR SPECTRUM
##VAR_NAME=  FREQUENCY,     SPECTRUM/REAL,   SPECTRUM/IMAG
##SYMBOL=    X,             R,               I
##VAR_TYPE=  INDEPENDENT,   DEPENDENT,       DEPENDENT
##VAR_FORM=  AFFN,          ASDF,            ASDF
##VAR_DIM=   131072,        131072,          131072
##UNITS=     HZ,            ARBITRARY UNITS, ARBITRARY UNITS
##FACTOR=    0.0627417313425164, 1,          1
##FIRST=     8223.62146879497, -1853,        -73096
##LAST=      0,             1840,            -73871
##MIN=       0,             -14896,          0
##MAX=       8223.62146879497, 339565645,    0
$$ Real data points
##PAGE= N=1
##DATA TABLE= (X++(R..R)), XYDATA
$$ [...]
61664D36984O40R47J502J679J544J578J924K494L320M289M966N140N167N395N720
$$ 436984 437624 438571 440073 441752 443296 444874 446798 449292 452612 456901 461867 467007 472174 477569 483289
61649D83289O129O972Q215R022Q827Q252Q108Q056P238N888N063M863M150K308
$$ 483289 489418 496390 504605 513627 522454 530706 538814 546870 554108 559996 565059 569922 574072 576380
61635E76380J69j232k000k866m096n462o749p609p390n891m037l053l009k826
$$ 576380 576549 575317 573317 570451 566355 560893 554144 546535 539145 533254 529217 526164 523155 520329
61621E20329j823n71L7OJ9L68N92K43o18j746l163m966o887q417r291r694r972
$$ 520329 518506 517935 517972 517978 517997 518365 518957 519200 518582 516836 513673 508707 501820 493403 484112 474418 464446
61604D64446j0363j0845j1039j0438r003p435o507o190n914n441m963m424l499
$$ 464446 454083 443238 432199 421761 412758 405323 398816 392626 386712 381271 376308 371884 368385
61591C68385k437k116k880l923m325m081l692l267k735k387k479k613k225j479
$$ 368385 365948 363832 360952 357029 352704 348623 344931 341664 338929 336542 334063 331450 329225 327746
61577C27746r83q97r91j271j811k198k013j716k072k816k918k228j708j824j832
$$ 327746 326763 325866 324875 323604 321793 319595 317582 315866 313794 310978 308060 305832 304124 302300 300468
61562C00468j148l00R4L41Q75J262R41L33K35N76P43P86J303K227K688K222J381
$$ 300468 299320 299020 299114 299455 300330 301592 302533 302866 303101 303677 304420 305206 306509 308736 311424 313646 315027
61545C15027R78J298K108K939L268K956K536K649L185L502L440L501L887M071
$$ 315027 316005 317303 319411 322350 325618 328574 331110 333759 336944 340446 343886 347387 351274 355345
61531C55345L516K374J139K0j029j977k761l398l883m177m383m668m852m486l451
$$ 355345 358861 361235 362374 362394 361365 359388 356627 353229 349346 345169 340786 336118 331266 326780 323329
61516C23329k192j133k98K54J75n59j226j109m94k74o75j009p53k47p5k71m88
$$ 323329 321137 320004 319706 319960 320135 319576 318350 317241 316747 316473 315798 314789 314036 313789 313714 313443 312955
61499C12955o07p59q75o71j16M01M88J62k98o72r36j081j099j021r13p23l09L50
$$ 312955 312348 311589 310714 310043 309927 310328 310816 310978 310680 310008 309072 307991 306892 305871 304958 304235 303926 304276
61481C04276J033J454J484J215R17R12J302J744J690J039K85p3l4K01O19J039
$$ 304276 305309 306763 308247 309462 310379 311291 312593 314337 316027 317066 317351 317278 317244 317445 318064 319103
61465C19103P51o68k326k690j493j76k3o44q63l73K80Q39J427J830J694J415J844
$$ 319103 319854 319186 316860 314170 312677 312501 312478 311834 310971 310598 310878 311717 313144 314974 316668 318083 319927
61448C19927K918L533L098K426K538L360M114M507M782N026N053M908M882N079
$$ 319927 322845 326378 329476 331902 334440 337800 341914 346421 351203 356229 361282 366190 371072 376151
61434C76151N328N436N275M735L917L172K718K457K352K580L019L079K578K283
$$ 376151 381479 386915 392190 396925 400842 404014 406732 409189 411541 414121 417140 420219 422797 425080
61420D25080K852L693L776L283L276L781L511J888J36m04j89o96k308l986m860
$$ 425080 427932 431625 435401 438684 441960 445741 449252 451140 451276 450872 450683 449987 447679 443693 438833
61405D38833n205n705o470p009o872o101n271n022n390n697n292m225k991j867
$$ 438833 433628 427923 421453 414444 407572 401471 396200 391178 385788 380091 374799 370574 367583 365716
61391C65716q97l04l13o73p96m92j10J30M96J276K220K759K603J994J518J656
$$ 365716 364819 364515 364202 363529 362733 362241 362131 362261 362757 364033 366253 369012 371615 373609 375127 376783
61375C76783K403L260L744L851L816L583K893J900J282J522K354L107L445L544
$$ 376783 379186 382446 386190 390041 393857 397440 400333 402233 403515 405037 407391 410498 413943 417487
61361D17487L775M323N070N706O058O315O831P704Q729R767J0925J2246J3497
$$ 417487 421262 425585 430655 436361 442419 448734 455565 463269 471998 481765 492690 504936 518433
61348E18433J4425J4993J5215J4960J4201J3331J2881J2903J2870J2336J1429
$$ 518433 532858 547851 563066 578026 592227 605558 618439 631342 644212 656548 667977
61337F67977J0541R654Q354O525M640L063J331j297m597p318q624r055r652j0576
$$ 667977 678518 688172 696526 703051 707691 710754 712085 710788 706191 698873 690249 681194 671542 660966
61323F60966j1204j1242j0988j0545r580q024o419n315m757m548m473m098k917
$$ 660966 649762 638520 627532 616987 607407 599383 592964 587649 582892 578344 573871 569773 566856
61310E66856j061O00J428J766K252K917L369L545L632L466K612J005r75l010m991
$$ 566856 565795 566395 567823 569589 571841 574758 578127 581672 585304 588770 591382 592387 591412 588402 583411
61295E83411o627p469p433o956o502o172n863n487m900l894k456q88M52J462K339
$$ 583411 576784 569315 561882 554926 548424 542252 536389 530902 526002 522108 519652 518764 519216 520678 523017
61280E23017L362M581N656O158O195O516P692R405J0846J1695J2209J2493J2295
$$ 523017 526379 530960 536616 542774 548969 555485 563177 572582 583428 595123 607332 619825 632120
61267F32120J1675J1275J1606J2452J3309J4093J5046J6228J7460J8642J9736
$$ 632120 643795 655070 666676 679128 692437 706530 721576 737804 755264 773906 793642
61256G93642K0546K0836K0574J9790J8311J5986J3079J0109P273M316R71k756
$$ 793642 814188 835024 855598 875388 893699 909685 922764 932873 940146 944462 945433 942677
61244I42677o745j0820j4563j7387j9069j9877k0122j9820j9078j8352j7933j7456
$$ 942677 935932 925112 910549 893162 874093 854216 834094 814274 795196 776844 758911 741455
61232G41455j6375j4805j3336j2101j0620q732p041o086n606n098m722m976n650
$$ 741455 725080 710275 696939 684838 674218 665486 658445 652359 646753 641655 636933 631957 626307
61219F26307n823n015l773k887k459k036j387q08o95j068j486j420q00j44n2m92
$$ 626307 620484 615469 611696 608809 606350 604314 602927 602119 601424 600356 598870 597450 596650 596506 596454 595962
61203E95962p63j55J526M023O856R467J1492J3144J5026J7326J9458K0670K0767
$$ 595962 595199 595044 596570 600593 607449 616916 628408 641552 656578 673904 693362 714032 734799
61190G34799J9992J8508J6456J4339J2858J2198J1799J0946R514Q014P030O610
$$ 734799 754791 773299 789755 804094 816952 829150 840949 851895 861409 869423 876453 883063
61178H83063O211N300L964K818K206J842J295N55j43q39j871l455n441p392q801
$$ 883063 889274 894574 898538 901356 903562 905404 906699 907254 907111 906272 904401 900946 895505 888113 879312
61163H79312r470r824j0619j2054j3466j4212j4467j4709j4758j3943j2161j0088
$$ 879312 869842 860018 849399 837345 823879 809667 795200 780491 765733 751790 739629 729541
61151G29541q313o827n493m445l855l741m146n205o843q764j0755j2656j4010
$$ 729541 721228 714401 708908 704463 700608 696867 692721 687516 680673 671909 661154 648498 634488
61138F34488j4287j3575j2527j1448j0000q041o114m707l534k057k79J502L299
$$ 634488 620201 606626 594099 582651 572651 564610 558496 553789 550255 548198 547919 549421 552720
61125E52720N186O835P929Q921J0616J3049J5410J7086J8221J9162J9958K0587
$$ 552720 557906 564741 572670 581591 592207 605256 620666 637752 655973 675135 695093 715680
61113G15680K1154K1667K1989K2261K2856K3633K3677K2263J9854J7643J6172
$$ 715680 736834 758501 780490 802751 825607 849240 872917 895180 915034 932677 948849
61102I48849J4866J2915J0207P169M019N06l562p798j1462j4137j6060j7672j9030
$$ 948849 963715 976630 986837 994006 998025 998531 994969 987171 975709 961572 945512 927840 908810
61089I08810j9785j9746j9200j8635j8329j8282j8364j8348j7923j6937j5662
$$ 908810 889025 869279 850079 831444 813115 794833 776469 758121 740198 723261 707599
61078G07599j4591j3920j3306j2325j0984r668q611p667o630n588m807m338l906
$$ 707599 693008 679088 665782 653457 642473 632805 624194 616527 609897 604309 599502 595164 591258
61065E91258l176k071q52M8L52K26K61R81K377L986N433O736Q108R642J1211J2586
$$ 591258 588082 586011 585159 585207 585559 585785 586046 587027 589404 593390 598823 605559 613667 623309 634520 647106
61049F47106J3579J4269J5043J6256J7777J9132K0176K1352K3003K4771K6050
$$ 647106 660685 674954 689997 706253 724030 743162 763338 784690 807693 832464 858514
61038H58514K6879K7901K9320L0510L0950L1213L2392L4653L6880L8012L8280
$$ 858514 885393 913294 942614 973124 1004074 1035287 1067679 1102332 1139212 1177224 1215504
61027A215504L8806M0242M2287M4396M6412M8371N0251N2276N5147N9555O5609
$$ 1215504 1254310 1294552 1336839 1381235 1427647 1476018 1526269 1578545 1633692 1693247 1758856
61016A758856P3039Q1852R2471J05393J21184J40819J65633J96860K35439K82184
$$ 1758856 1831895 1913747 2006218 2111611 2232795 2373614 2539247 2736107 2971546 3253730
61006C253730L37797M02730M77548N63509O62718P77741R11135J064284J234775
$$ 3253730 3591527 3994257 4471805 5035314 5698032 6475773 7386908 8451192 9685967
60997I685967J413623J584762J726787J814390J819853J719132J504414J195888
$$ 9685967 11099590 12684352 14411139 16225529 18045382 19764514 21268928 22464816
60989B2464816Q41731N03102K32626N7831k5278m9602o7435j34710k91610n46427
$$ 22464816 23306547 23809649 24042275 24100106 24074828 24025226 23957791 23823081 23531471 22985044
60979B2985044q71077j211719j509219j718724j819995j817292j732446j594960
$$ 22985044 22113967 20902248 19393029 17674305 15854310 14037018 12304572 10709612
60971A0709612j432011j261981j094168r33363p84137o51239n37583m43175l66121
$$ 10709612 9277601 8015620 6921452 5988089 5203952 4552713 4015130 3571955 3205834
60962C205834l04031k54554k15402j84474j60013j40530j24690j11300r9408q8433
$$ 3205834 2901803 2647249 2431847 2247373 2087360 1946830 1822140 1710840 1611432 1522999
60952A522999p8261o9140o1359n5001n0018m6310m3589m1256l8792l6339l4613
$$ 1522999 1444738 1375598 1314239 1259238 1209220 1162910 1119321 1078065 1039273 1002934 968321
60941I68321l4013l3996l3529l2088k9937k7535k5071k2673k0638j9113j7815
$$ 968321 934308 900312 866783 834695 804758 777223 752152 729479 708841 689728 671913
60930F71913j6448j5236j4582j4214j3276j1426r339p859p028o321n531m922m640
$$ 671913 655465 640229 625647 611433 598157 586731 577392 569533 562505 556184 550653 545731 541091
60917E41091m423l971l340k889k886l203l359l054k606k628l146l489l199k636
$$ 541091 536668 532697 529357 526468 523582 520379 517020 513966 511360 508732 505586 502097 498898 496262
60903D96262k323k200j958j718j754j894j785j640j947k655l316l908m647n043
$$ 496262 493939 491739 489781 488063 486309 484415 482630 480990 479043 476388 473072 469164 464517 459474
60889D59474m181k219o72p26j923k985l269k874k079j332j252j870k191j312K63
$$ 459474 455293 453074 452402 451676 449753 446768 443499 440625 438546 437214 435962 434092 431901 430589 430852
60874D30852J202J062P11J055K053L133L928M390M628M863N290N796O063O040
$$ 430852 432054 433116 433827 434882 436935 440068 443996 448386 453014 457877 463167 468963 475026 481066
60860D81066N998O121O266O239O062N853N669N485N235M833M365M126M249M298
$$ 481066 487064 493185 499451 505690 511752 517605 523274 528759 533994 538827 543192 547318 551567 555865
60846E55865L626K166N62n75j264j836k314k433k196k088k565l409l805l212k007
$$ 555865 559491 561657 562219 561644 560380 558544 556230 553797 551601 549513 546948 543539 539734 536522 534515
60831E34515j013m39L37J810L549M683M920M710M634N065O213P984R790J0991
$$ 534515 533502 533063 533400 535210 538759 543442 548362 553072 557706 562771 568984 576968 586758 597749
60817E97749J1615J2292J3398J4682J5768J6590J7197J7559J7781J8097J8436
$$ 597749 609364 621656 635054 649736 665504 682094 699291 716850 734631 752728 771164
60806G71164J8342J7642J6817J6394J6153J5391J3762J1491Q896O117L351Q84
$$ 771164 789506 807148 823965 840359 856512 871903 885665 897156 906052 912169 915520 916404
60794I16404j218l249n517q024j0505j2655j4222j5050j5290j5399j5739j6203
$$ 916404 915186 911937 906420 898396 887891 875236 861014 845964 830674 815275 799536 783333
60782G83333j6419j6349j6400j6729j6747j5779j4159j3109j3290j3902j3668
$$ 783333 766914 750565 734165 717436 700689 684910 670751 657642 644352 630450 616782
60771F16782j2436j1209j0749j0736j0448r702q814q043p452p114p023o921o536
$$ 616782 604346 593137 582388 571652 561204 551502 542688 534645 527193 520079 513056 506135 499599
60758D99599o022n894o455p374p918p598o577n413m456l642k902k525k790l386
$$ 499599 493577 487683 481228 473854 465936 458338 451761 446348 441892 438250 435348 432823 430033 426647
60744D26647l630l283k807k725l079l561l848l682l031k312k045k171k131j711
$$ 426647 423017 419734 416927 414202 411123 407562 403714 400032 397001 394689 392644 390473 388342 386631
60730C86631j293j030n21L32Q44O00K68N75J030O91k03n90l74n37j348j855j608
$$ 386631 385338 384308 383787 384119 384963 385563 385831 386406 387436 388127 387924 387334 386960 386423 385075 383220 381612
60713C81612j586k628m008m578m445m456m548l962k740j833j677j713j508j397
$$ 381612 380026 377398 373390 368812 364367 359911 355363 351401 348661 346828 345151 343438 341930 340533
60699C40533j677k008j991j770j600j382j000p27q42j167j317j168q28l63Q4K65
$$ 340533 338856 336848 334857 333087 331487 330105 329105 328378 327536 326369 325052 323884 323056 322693 322777 323042
60683C23042J78K25P08J412J937K209K355K334K098J862J801J648J097M78M53
$$ 323042 323220 323445 324153 325565 327502 329711 332066 334400 336498 338360 340161 341809 342906 343384 343837
60668C43837J056J555J493J276J468J880J872J409J256J989L152L736L411K884
$$ 343837 344893 346448 347941 349217 350685 352565 354437 355846 357102 359091 362243 365979 369390 372274
60654C72274K967L600M095M129M011M024M036L941L936M000L570K179K32j426
$$ 372274 375241 378841 382936 387065 391076 395100 399136 403077 407013 411013 414583 416762 416994 415568
60640D15568k528l427m266m690m500m061l895m089m342m301l800l012k374k165
$$ 415568 413040 409613 405347 400657 396157 392096 388201 384112 379770 375469 371669 368657 366283 364118
60626C64118k216k277k459k863k975k132o37L53K22m24p57p44p56p50n03j79j23
$$ 364118 361902 359625 357166 354303 351328 349196 348559 348912 349134 348710 347953 347209 346453 345703 345200 345021 344898
60609C44898l02m46n23o40o58l77J22O24J080J360J083J97o00n09L94J347J871
$$ 344898 344596 344150 343627 342987 342329 341952 342074 342698 343778 345138 346221 346418 345818 345309 345703 347050 348921
60592C48921K052K054J877J523R56J19o80p53K8P76P67N99J195K104K087J275
$$ 348921 350973 353027 354904 356427 357383 357502 356822 356069 356097 356873 357640 358239 359434 361538 363625 364900
60576C64900J216K519L899M208M031M435N278N890O499P750R320J0279J0471J0458
$$ 364900 366116 368635 372534 376742 380773 385208 390486 396376 402875 410625 419945 430224 440695 451153
60562D51153J0296R451P854O077M376K511N17j159k450l736m988n622n393m646
$$ 451153 461449 470900 478754 484831 489207 491718 492235 491076 488626 484890 479902 474280 468887 464241
60548D64241l501j606R22L123M355N199O552Q270R408R595R477R875J0923J2043
$$ 464241 460740 459134 460056 463179 467534 472733 479285 487555 496963 506558 516035 525910 536833 548876
60534E48876J2423J1568R625P215M821K536L93j406k905m550o516q064q175o776
$$ 548876 561299 572867 582492 589707 594528 597064 597457 596051 593146 588596 582080 574016 565841 559065
60520E59065m885l490k739k276j957j850j821j486o44M17J253J820K585L916N546
$$ 559065 554180 550690 547951 545675 543718 541868 540047 538561 537917 538334 539587 541407 543992 547908 553454
60505E53454O923Q149J0091J3308J7224K0754K3578K6300K9486L3042L6547L9694
$$ 553454 560377 568526 578617 591925 609149 629903 653481 679781 709267 742309 778856 818550
60493H18550M2163M3522M3558M2431M0233L6683L1474K4645J6333O492m604j5794
$$ 818550 860713 904235 947793 990224 1030457 1067140 1098614 1123259 1139592 1146084 1141480 1125686
60481A125686k5598l3413l9697m4853m8513n0178n0067m8774m6435m2830l8273
$$ 1125686 1100088 1066675 1026978 982125 933612 883434 833367 784593 738158 695328 657055
60470F57055l3748k9915k6456k2773j9026j6065j4382j3550j2789j1740j0496
$$ 657055 623307 593392 566936 544163 525137 509072 494690 481140 468351 456611 446115
60459D46115r106p517n954m960m792m918m537l526k601k413k774k996k727k213
$$ 446115 437009 429492 423538 418578 413786 408868 404331 400805 398204 395791 393017 390021 387294 385081
60445C85081j823j685j742j862j839j599j424j676k214k389j818q88k40m5l8n8
$$ 385081 383258 381573 379831 377969 376130 374531 373107 371431 369217 366828 365010 364122 363882 363837 363799 363741
60429C63741j52k56j69J37M95P72Q65N26l47j211j184j17J051J369R93Q39J268
$$ 363741 363589 363333 363164 363301 363796 364568 365433 365959 365612 364401 363217 363100 364151 365520 366513 367352 368620
60412C68620J707J562J067R07J313J794J768J174N25L72Q02J335J384Q82M01N45
$$ 368620 370327 371889 372956 373863 375176 376970 378738 379912 380437 380809 381611 382946 384330 385212 385613 386158
60396C86158J259J925K130K095K182K295K079J620J472J912K525K718K332J530
$$ 386158 387417 389342 391472 393567 395749 398044 400123 401743 403215 405127 407652 410370 412702 414232
60382D14232M45n69p17N41K478L484K735J137K06L98R31J053Q75R23J335J817
$$ 414232 414677 414108 413391 413932 416410 419894 422629 423766 423972 424370 425301 426354 427229 428152 429487 431304
60366D31304K089K069J677Q58j01n77j67P50J349J274R73J016J361J693K123L015
$$ 431304 433393 435462 437139 437997 437896 437319 437152 437902 439251 440525 441498 442514 443875 445568 447691 450706
60350D50706M194M913M861M643M916N482N671N274M623L901K944J642J10j452
$$ 450706 454900 459813 464674 469317 474233 479715 485386 490660 495283 499184 502128 503770 503880 502428
60336E02428k758l384l313l289m058n205n529m723l849l738l772k993j792j435
$$ 502428 499670 496286 492973 489684 485626 480421 474892 470169 466320 462582 458810 455817 454025 452590
60322D52590k148k775k433j568j015q34o25l84l15j01Q55K498M021M862N316O042
$$ 452590 450442 447667 445234 443666 442651 441817 441192 440808 440493 440392 441247 443745 447766 452628 457944 463986
60306D63986P279Q814J0426J2015J3463J4610J5373J5659J5173J3550J0770P348
$$ 463986 471265 480079 490505 502520 515983 530593 545966 561625 576798 590348 601118 608466
60294F08466L977R92j761m570p421r872j1380j1774j1475j1136j1024j0824j0172
$$ 608466 612443 613435 611674 607104 599683 589811 578431 566657 555182 544046 533022 522198 512026
60281E12026r195q353p779p113o082m936m126l749l578l503l630m000m417m636
$$ 512026 502831 494478 486699 479586 473504 468568 464442 460693 457115 453612 449982 445982 441565 436929
60267D36929m537m135l552k942k292j416l36M47M66k1k66oK10j40q49j367j504
$$ 436929 432392 428257 424705 421763 419471 418055 417719 418166 418632 418611 418345 418339 418549 418409 417560 416193 414689
60250D14689j369r76l56J39J40j87l02KL95N00K56j45m00j74N84J441J882J918
$$ 414689 413320 412344 411988 412127 412267 412080 411778 411780 412175 412675 412931 412786 412386 412212 412796 414237 416119 418037
60232D18037J973K248K584K972L647M578N329N655N797N954N846N162M090L064
$$ 418037 420010 422258 424842 427814 431461 436039 441368 447023 452820 458774 464620 469782 473872 476936
60218D76936K265J726J677K320L360M196M573M695M828N032N349N831O395O798
$$ 476936 479201 480927 482604 484924 488284 492480 497053 501748 506576 511608 516957 522788 529183 535981
60204E35981O858O577O062N452M880M342L758L180K861K817K583J671K31j057
$$ 535981 542839 549416 555478 560930 565810 570152 573910 577090 579951 582768 585351 587022 587253 586196
60190E86196j681j691j444j279j400j808k331k900l680m713n566n741n321m806
$$ 586196 584515 582824 581380 580101 578701 576893 574562 571662 567982 563269 557703 551962 546641 541835
60176E41835m349l651k696k050k147k669k956k695k048j317p77n57m60j24L95
$$ 541835 537486 533835 531139 529089 526942 524273 521317 518622 516574 515257 514480 513923 513463 513339 513734
60161E13734N38J9o11o16nO43J103J622K145K192J722J516K203L282L686L138
$$ 513734 514272 514291 513680 513064 513059 513702 514805 516427 518572 520764 522486 524002 526205 529487 533173 536311
60145E36311K467K522L299M203M765M883M676M447M548N034N435N280M713M281
$$ 536311 538778 541300 544599 548802 553567 558450 563126 567573 572121 577155 582590 587870 592583 596864
60131E96864M100L680K748J758J253J041M81m69j022n50N35J200R86N82J066K605
$$ 596864 600964 604644 607392 609150 610403 611444 611925 611456 610434 609884 610419 611619 612605 613187 614253 616858
60115F16858M088M172K650N58j053k016k561k575j985j472j977l320m136l528
$$ 616858 620946 625118 627768 628326 627273 625257 622696 620121 618136 616664 614687 611367 607231 603703
60101F03703k224j629k149k966l170k545j382j66N55M59p4j70O58J985L000L365
$$ 603703 601479 599850 597701 594735 591565 589020 587638 587472 588027 588486 588412 588242 588900 590885 593885 597250
60085E97250L369L313L119K584J821J210R64Q86N96j02j115k185l024l523l967
$$ 597250 600619 603932 607051 609635 611456 612666 613630 614516 615112 615010 613895 611710 608686 605163 601196
60070F01196m868o303p502p503o276m848m190m335m751n217n877o562o631n667
$$ 601196 596328 590025 582523 575020 568744 563896 559706 555371 550620 545403 539526 532964 526333 520666
60056E20666m092k846k473k628k501j620k16J125J992K319K301K341K914M108
$$ 520666 516574 513728 511255 508627 506126 504506 504290 505415 507407 509726 512027 514368 517282 521390
60042E21390N337N859N608N210N155N269N076M320K958J096q79k395l267l859
$$ 521390 526727 532586 538194 543404 548559 553828 558904 563224 566182 567278 566399 564004 560737 556878
60028E56878m497n069n482o078p107q160q635q574q453q315p739o689n763n402
$$ 556878 552381 547312 541830 535752 528645 520485 511850 503276 494823 486508 478769 472080 466317 460915
60014D60915n381n250m922m495l873k845j487k68K86K8o11r27n72J25O44Q81J060
$$ 460915 455534 450284 445362 440867 436994 434149 432662 432394 432680 432708 432097 431170 430598 430723 431367 432248 433308
59997D33308J234J285J302J538J996K446K892L585M521N387O016O503O765O562
$$ 433308 434542 435827 437129 438667 440663 443109 446001 449586 454107 459494 465510 472013 478778 485340
59983D85340O045N756N749N334M050K459J442J084Q14L85P2k4k32p55j335j584
$$ 485340 491385 497141 502890 508224 512274 514733 516175 517259 518073 518458 518530 518506 518274 517519 516184 514600
59967E14600j397r48m46l6K64N35P91R63J083J337J641J498O27m17p39k04M19
$$ 514600 513203 512255 511809 511773 512037 512572 513363 514326 515409 516746 518387 519885 520512 520095 519356 519152 519571
59950E19571M40j12q77j730k576l107l133k980l129l541l672l177k340j794j926
$$ 519571 520011 519899 519022 517292 514716 511609 508476 505496 502367 498826 495154 491977 489637 487843 485917
59935D85917k648l542m139m119l356j967l61Q77J385J366J302J399J534J730K309
$$ 485917 483269 479727 475588 471469 468113 466146 465785 466662 468047 469413 470715 472114 473648 475378 477687
59920D77687L356M351M742M671M738N168N573N560N132M467L687L012K808L161
$$ 477687 481043 485394 490136 494807 499545 504713 510286 515846 520978 525445 529132 532144 534952 538113
59906E38113L654L874L841L688L130J701m42k388l336l371l244l459l754l472
$$ 538113 541767 545641 549482 553170 556300 558001 557559 555171 551835 548464 545220 541761 538007 534535
59892E34535k392j097l90l44k00O60J936K886L344L733M233M518M408M227M190
$$ 534535 532143 531046 530656 530312 530112 530772 532708 535594 538938 542671 546904 551422 555830 560057 564247
59877E64247M041L634L386L603L727K922J258l50j321j907k424k710k585k417
$$ 564247 568288 571922 575308 578911 582638 585560 586818 586468 585147 583240 580816 578106 575521 573104
59863E73104k734l547m389m803m628l951l069k329j773j123k62M83P97R18J398
$$ 573104 570370 566823 562434 557631 553003 549052 545983 543654 541881 540758 540496 540979 541776 542694 544092
59848E44092K435L830N427P184Q751R454Q948P557N812L922J967L17o14r12j046
$$ 544092 546527 550357 555784 562968 571719 581173 590121 597678 603490 607412 609379 609696 609082 608170 607124
59833F07124j162r35k81K43j5j083k553m136n638o647o868o698o814p107o775
$$ 607124 605962 605027 604746 604989 604974 603891 601338 597202 591564 584917 578049 571351 564537 557430 550655
59818E50655n631m576m271m131l349k380k327l183l736l366k833k958l303k906
$$ 550655 545024 540448 536177 532046 528697 526317 523990 520807 517071 513705 510872 507914 504611 501705
59804E01705j702n96l52q71j528j789j624j486j833k570l199l502l659l623l042
$$ 501705 500003 499407 499055 498184 496656 494867 493243 491757 489924 487354 484155 480653 476994 473371 470329
59789D70329k067j587k117k906k872k022j268j066j039q64p13p13o43l63NM79
$$ 470329 468262 466675 464558 461652 458780 456758 455490 454424 453385 452521 451808 451095 450452 450089 450094 450573
59773D50573J224K005K272K036K106L037M356N183N223M666L643K387J621J933
$$ 450573 451797 453802 456074 458110 460216 463253 467609 472792 478015 482681 486324 488711 490332 492265
59759D92265K831L124K479J953K635M219N382N338M560M028M145M505M459L726
$$ 492265 495096 498220 500699 502652 505287 509506 514888 520226 524786 528814 532959 537464 541923 545649
59745E45649K596J733J732K569L471L490K384Q69j43m73o40r81j184q43k03P0
$$ 545649 548245 549978 551710 554279 557750 561240 563624 564493 564350 563877 563237 562256 561072 560229 560026 560096
59729E60096k59p36q20m82j4L69N48L54j82n36n5J257K638L362L447L408L578
$$ 560096 559837 559101 558281 557799 557785 558154 558702 559056 558874 558338 558283 559540 562178 565540 568987 572395 575973
59712E75973L880M123M279M529N153O203P219P536P081O569O581O775O507N891
$$ 575973 579853 583976 588255 592784 597937 604140 611359 618895 625976 632545 639126 645901 652408 658299
59698F58299N544N381M598L028J660J324J546J281K79r39k081l216m141m380l884
$$ 658299 663843 669224 673822 676850 678510 679834 681380 682661 682940 682001 679920 676704 672563 668183 664299
59683F64299l228k980l276l895m445m519m171m065m677n473n532m880m446m633
$$ 664299 661071 658091 654815 650920 646475 641956 637785 633720 629043 623570 618038 613158 608712 604079
59669F04079m758m299l783l863m171l831k771j732j148o97J0Q91J658K213K589
$$ 604079 599321 595022 591239 587376 583205 579374 576603 574871 573723 573026 573036 573927 575585 577798 580387
59654E80387K834L073L397L629L465K922K374J949J189m21k736n005o616p439
$$ 580387 583221 586294 589691 593320 596785 599707 602081 604030 605219 604798 602062 597057 590441 583002
59640E83002p574p104o331n822n870o002n515m444l526l150k872k292j801j928
$$ 583002 575428 568324 561993 556171 550301 544299 538784 534340 530814 527664 524792 522500 520699 518771
59626E18771k414k646k724l261m113m310l528k746k927l679l892l288k563k211
$$ 518771 516357 513711 510987 507726 503613 499303 495775 493029 490102 486423 482531 479243 476680 474469
59612D74469j979j536j065q42o20J01J281K114J863Q42K12N98J231R83J2l81L89
$$ 474469 472490 470954 469889 469047 468427 468528 469809 471923 473786 474628 474840 475438 476669 477652 477664 477283 477672
59595D77672J275J050m4o84j00J304K612L123K651J776J454J849J825M13j621
$$ 477672 478947 479997 479953 479269 479169 480473 483085 486208 488859 490635 492089 493938 495763 496176 494555
59580D94555k600k273k103l090m434m918m625m465m687m786m510m067l509k646
$$ 494555 491955 489682 487579 484489 480055 475137 470512 466047 461360 456574 452064 447997 444488 441842
59566D41842j573p24l55l86p27j286j658j344l73O44J225J392J310R39L38j6M53
$$ 441842 440269 439545 439190 438804 438077 436791 435133 433789 433416 434060 435285 436677 437987 438926 439264 439248 439701
59549D39701J782L403M628N152N136N012N226O064P537R400J1241J2722J3803
$$ 439701 441483 444886 449514 454666 459802 464814 470040 476104 483641 493041 504282 517004 530807
59536E30807J4708J5586J6255J6250J5134J2772R569O441M343L549L560L803M245
$$ 530807 545515 561101 577356 593606 608740 621512 631081 637522 641865 645414 648974 652777 657022
59523F57022N036N861O082N477M374L014J280q63l125n368p843j0527j2660j3512
$$ 657022 662058 667919 674001 679478 683852 686866 688146 687283 684158 678790 670947 660420 647760 634248
59509F34248j3398j3313j3614j3682j3020j2024j1324j0838r973q510o821n358
$$ 634248 620850 607537 593923 580241 567221 555197 543873 533035 523062 514552 507731 502373
59497E02373m323l727l391k884j901p26J9J53J86O20J387K105K581K827K868K855
$$ 502373 498050 494323 490932 488048 486147 485421 485440 485593 485779 486399 487786 489891 492472 495299 498167 501022
59481E01022L150L968M990N617N536M929M262M014M360M865M689L470J826O33
$$ 501022 504172 508140 513130 518747 524283 529212 533474 537488 541848 546713 551402 554872 556698 557331
59467E57331jn51j010p59L67J597K177K351K930M233N923P559Q877R606R653R412
$$ 557331 557330 556779 555769 555010 555377 556974 559151 561502 564432 568665 574588 582147 591024 600630 610283 619695
59451F19695R485R960J0298J0031R224Q095O506M210J423j213l373n431p848j0279
$$ 619695 629180 639140 649438 659469 668693 676788 683294 687504 688927 687714 684341 678910 671062 660783
59437F60783j1709j1646j0796j0166r744q732p024n694n595o096n823m315k262
$$ 660783 649074 637428 626632 616466 606722 597990 590966 585272 579677 573581 567758 563443 561181
59424E61181l31J515L497N508P388R156J0816J2214J3390J4659J6150J7509J8194
$$ 561181 560850 562365 565862 571370 578758 587914 598730 610944 624334 638993 655143 672652 690846
59411F90846J7903J6566J4251J1119P218K327l488r035j2379j2530j0361p529
$$ 690846 708749 725315 739566 750685 757903 760230 756742 747707 735328 722798 712437 704908
59399G04908m927k664r66l05q48k493n368r493j3955j7241j8638j8700j8148j6948
$$ 704908 699981 697317 696351 696046 695198 692705 687337 677844 663889 646648 628010 609310 591162 574214
59385E74214j4931j2585j0649r157p550n586l678k335j615j190p06n9N58R41J295
$$ 574214 559283 546698 536049 526892 519342 513756 510078 507743 506128 504938 504232 504173 504731 505672 506967
59370E06967K111L487M768N214M748L850K920K192K093K972M470N702O344P021
$$ 506967 509078 512565 517333 522547 527295 531145 534065 536257 538350 541322 545792 551494 557838 564859
59356E64859Q408J0281J1874J2803J3290J3703J4373J5647J7560J9430K0352K0260
$$ 564859 573267 583548 595422 608225 621515 635218 649591 665238 682798 702228 722580 742840
59344G42840K0054K0346K0509J9426J6947J4066J1699R791P742N205K226j000
$$ 742840 762894 783240 803749 823175 840122 854188 865887 875678 883420 888625 890851 889851
59332H89851m097o519q055r189j0564j2143j3373j4063j4553j4932j4694j3539
$$ 889851 885754 879235 871180 861991 851427 839284 825911 811848 797295 782363 767669 754130
59320G54130j2001j0841j0184r736r523r801j0267j0091q895p242n935n148m455
$$ 754130 742129 731288 721104 711368 701845 692044 681777 671686 662791 655549 649614 644466 640011
59307F40011l416j951l00J157K256L233M497O152P907R515J0949J2156J2933J3153
$$ 640011 636595 634644 634344 635501 637757 640990 645487 651639 659546 669061 680010 692166 705099 718252
59293G18252J2805J1683R387N867J626k731o764r795j0831r571p188n344m421
$$ 718252 731057 742740 752127 757994 759620 756889 750125 740330 729499 719928 712740 707396 702975
59280G02975l365j308J269L326M622N819P461R301J0666J1191J1087J0762J0240
$$ 702975 699610 698302 699571 702897 707519 713338 720799 730100 740766 751957 763044 773806 784046
59267G84046R075O986M406K144M36j279l512o024q204r869j1287j2555j3374j3518
$$ 784046 793121 800107 804513 806657 807093 805814 802302 796278 788074 778205 766918 754363 740989 727471
59253G27471j3161j2626j2036j1345j0624j0026r494q642p115n066l141j816q23
$$ 727471 714310 701684 689648 678303 667679 657653 648159 639517 632402 627336 624195 622379 621556
59240F21556M56K056L185L205K538K181K472K763K413J592Q30J49q87k425m073
$$ 621556 622012 624068 627253 630458 632996 635177 637649 640412 642825 644417 645247 645396 644509 642084 638011
59225F38011n446o584p657q549q963q773q092p152o259n717n473m994l825k309
$$ 638011 632565 625981 618324 609775 600812 592039 583947 576795 570536 564819 559346 554352 550527 548218
59211E48218j291j068j000l68P42J753K394K761K817K472K117K434L513M634N203
$$ 548218 546927 545859 544859 544491 545233 546986 549380 552141 554958 557430 559547 561981 565494 570128 575331
59196E75331N399N644N856N697N264M956M859M777M816N357O394P309P522P021
$$ 575331 580730 586374 592230 597927 603191 608147 613006 617783 622599 627956 634350 641659 649181 656202
59182F56202O211N548N392N790O250O068N137M057L307K706K015J593K006L201
$$ 656202 662413 667961 673353 679143 685393 691461 696598 700655 703962 706668 708683 710276 712282 715483
59168G15483M589N745O582O977O780O147N390M466L169J763Q71N31K8j084k346
$$ 715483 720072 725817 732399 739376 746156 752303 757693 762159 765328 767091 767962 768493 768521 767437 765091
59153G65091l215l938n118o736q222r166r372q491o465m277l374m075n183n507
$$ 765091 761876 757938 752820 746084 737862 728696 719324 710833 704368 700091 696717 692642 687459 681952
59139F81952n115m679m202l159j571j43P35J500K686M184N543O614P576Q435R010
$$ 681952 676837 672158 667956 664797 663226 663083 663818 665318 668004 672188 677731 684345 691921 700356 709366
59124G09366R334R791J0650J1726J2712J3653J4815J6104J7026J7352J7515J7988
$$ 709366 718700 728491 739141 750867 763579 777232 792047 808151 825177 842529 860044 878032
59112H78032J8549J8544J7871J7265J7380J8002J8373J8055J7237J6325J5519
$$ 878032 896581 915125 932996 950261 967641 985643 1004016 1022071 1039308 1055633 1071152
59101A071152J4700J3532J1755R501P235N175L027N63j758l134l406l266l427
$$ 1071152 1085852 1099384 1111139 1120640 1127875 1133050 1136077 1136640 1134882 1131748 1128342 1125076 1121649
59088A121649l992m738n657o876q323r799j1262j2827j4506j6174j7705j8981
$$ 1121649 1117657 1112919 1107262 1100386 1092063 1082264 1071002 1058175 1043669 1027495 1009790 990809
59076I90809j9864k0321k0493k0466k0104j9342j8511j8052j7842j7215j5809
$$ 990809 970945 950624 930131 909665 889561 870219 851708 833656 815814 798599 782790
59065G82790j4080j2750j1983j1464j1012j0704j0386r586q120o480n306m728
$$ 782790 768710 755960 743977 732513 721501 710797 700411 690825 682705 676225 670919 666191
59053F66191m491m461m593m529l754k300q81r4J77L73N98P51J001J684K752L810
$$ 666191 661700 657239 652646 648117 644363 642063 641182 641088 641265 641638 642236 642987 643988 645672 648424 652234
59037F52234M691N634O812Q058R205J0350J1556J2620J3434J4281J5551J7260
$$ 652234 656925 662559 669371 677429 686634 696984 708540 721160 734594 748875 764426 781686
59025G81686J9150K1060K2884K4352K5232K5648K5838K5552K4166K1497J8118
$$ 781686 800836 821896 844780 869132 894364 920012 945850 971402 995568 1017065 1035183
59014A035183J4711J1432Q112M753J561j259l401m326l673j770N76K772M670O187
$$ 1035183 1049894 1061326 1069438 1074191 1075752 1074493 1071092 1066766 1063093 1061323 1061899 1064671 1069341 1075528
59000A075528P095P253O733N586L705J032k309o157j0298j4225j7310j9426k1117
$$ 1075528 1082623 1089876 1096609 1102195 1105900 1106932 1104623 1098466 1088168 1073943 1056633 1037207 1016090
58987A016090k2837k4324k5002k4790k4051k2919k1175j8807j6232j3846j1707
$$ 1016090 993253 968929 943927 919137 895086 872167 850992 832185 815953 802107 790400
58976G90400r753q010o357m472k214K6J669K539L025L692M792O039O801O682N931
$$ 790400 780647 772637 766280 761808 759594 759620 761289 763828 766853 770545 775337 781376 788177 794859 800790
58961H00790N130M527L879K927J688K37j456l327n169o850q298r155q962p904
$$ 800790 805920 810447 814326 817253 818941 819178 817722 814395 809226 802376 794078 784923 775961 768057
58947G68057o909o537o254n307l887k791k244j755r95p7R55K092K742K040P0j917
$$ 768057 761148 754611 748357 743050 739163 736372 734128 732373 731378 731301 732256 734348 737090 739130 739200 737283
58931G37283k898l109l234l323l047k643k694l248l742l777l385k601j411j12
$$ 737283 734385 731276 728042 724719 721672 719029 716335 713087 709345 705568 702183 699582 698171 698059
58917F98059Q22J417K203L461M898O298P897R817J1519J2349J2358J2116J1866
$$ 698059 698881 700298 702501 705962 710860 717158 725055 734872 746391 758740 771098 783214 795080
58904G95080J1375J0669J0289J0542J0823J0143Q217N777L843K897K801L192L800
$$ 795080 806455 817124 827413 837955 848778 858921 867138 872915 876758 879655 882456 885648 889448
58891H89448M507N333O312P374Q337R157J0029J1133J2207J2581J1710R658P039
$$ 889448 893955 899288 905600 912974 921311 930468 940497 951630 963837 976418 988128 997786 1004825
58878A004825M481K173r3k518n013p379r575j1604j3162j3779j3483j3059j3321
$$ 1004825 1009306 1011479 1011386 1008868 1003855 996476 986901 975297 962135 948356 934873 921814 908493
58865I08493j4277j5324j6121j6837j7541j7858j7465j6538j5507j4545j3591
$$ 908493 894216 878892 862771 845934 828393 810535 793070 776532 761025 746480 732889
58854G32889j2660j1881j1288j0774j0122r042p430n754m881n133n779n855n361
$$ 732889 720229 708348 697060 686286 676164 667122 659692 653938 649057 643924 638145 632290 626929
58841F26929n137n592o126o039n445m939m621m005k803j417m73j11J35P96J889
$$ 626929 621792 616200 610074 604035 598590 593651 589030 585025 582222 580805 580332 580221 580356 581152 583041
58826E83041K808K857J937P08PJ00O03J044J284J342J065K92o93j188p94QJ80
$$ 583041 585849 588706 590643 591351 591358 591458 592061 593105 594389 595731 596796 597088 596395 595207 594413 594421 594601
58809E94601q61k619l895l861k735j489q88q79r18p28n47o45q97j003r49r75j117
$$ 594601 593740 591121 587226 583365 580630 579141 578253 577374 576456 575728 575181 574536 573639 572636 571687 570712 569595
58792E69595j090p14j93K11O72J617L039M198M282L400K721L400N363P280P854
$$ 569595 568505 567791 567598 567809 568481 570098 573137 577335 581617 585017 587738 591138 596501 603781 611635
58777F11635P035N842N101M592L510J618l60j548j966k451l530m701n113m670
$$ 611635 618670 624512 629613 634205 637715 639333 638973 637425 635459 633008 629478 624777 619664 614994
58763F14994m033l695l617l771m315m951m811l562k050j259j007m14O74J580J948
$$ 614994 610961 607266 603649 599878 595563 590612 585801 582239 580189 578930 577923 577509 578183 579763 581711
58748E81711K140K463K827L344M383N845P109Q066R332J1117J2599J3036J2710
$$ 581711 583851 586314 589141 592485 596868 602713 609822 617888 627220 638337 650936 663972 676682
58735F76682J2229J1648J0977J0800J1357J1536J0025P244N001M170L697K239
$$ 676682 688911 700559 711536 722336 733693 745229 755254 762498 767499 771669 775366 777605
58723G77605j89k561m114m809n015n185n551n839n561m715l872l434l207k933
$$ 777605 777416 774855 770741 765932 760917 755732 750181 744342 738781 734066 730194 726760 723553 720620
58709G20620k795l148m056n365o905q405r529j0298j1185j2542j4028j4881j4637
$$ 720620 717825 714677 710621 705256 698351 689946 680417 670119 658934 646392 632364 617483 602846
58696F02846j3492j2101j1139j0818j0698j0145r044p814o764n821m973m484m388
$$ 602846 589354 577253 566114 555296 544598 534453 525409 517595 510831 505010 500037 495553 491165
58683D91165m270l811l238k841k455j822j151p85n52pQ73J732K561L723N226O524
$$ 491165 486895 483084 479846 477005 474550 472728 471577 470792 470240 470233 471106 472838 475399 479122 484348 490872
58667D90872P228P567P912Q206Q167P792P303O768O035M928L395J563j91j393
$$ 490872 498100 505667 513579 521785 529952 537744 545047 551815 557850 562778 566173 567736 567545 566152
58653E66152j943k352l227m539n614n863n401m796m444m322m257m179m081l922
$$ 566152 564209 561857 558630 554091 548477 542614 537213 532417 527973 523651 519394 515215 511134 507212
58639E07212l677l335k763j721k09J284K143K292K270K537K960L117K919K625
$$ 507212 503535 500200 497437 495716 495507 496791 498934 501226 503496 506033 508993 512110 515029 517654
58625E17654K363J999J521J220J314J586J691J703K061K930L876M388M523M754
$$ 517654 520017 522016 523537 524757 526071 527657 529348 531051 533112 536042 539918 544306 548829 553583
58611E53583N267N686N590N000M170L172J971P40k92j222k275l187l267k312j060
$$ 553583 558850 564536 570126 575126 579296 582468 584439 585179 584887 583665 581390 578203 574936 572624 571564
58596E71564l54j68J19O96J172J441K032L288M708N602O119P060Q681J0266J1027
$$ 571564 571210 571042 571161 571857 573029 574470 576502 579790 584498 590100 596219 603279 611960 622226 633253
58581F33253J1062J1048J1247J1238J0579R369Q063O986O190N655N488N956P368
$$ 633253 644315 655363 666610 677848 688427 697796 705859 712845 719035 724690 730178 736134 743502
58568G43502R791J2839J5887J8611K1179K3805K6237K7905K8532K8461K8265K8052
$$ 743502 753293 766132 782019 800630 821809 845614 871851 899756 928288 956749 985014 1013066
58556A013066K7233K5032K1260J6566J1854P549L541k59l677o638r373j2054j4493
$$ 1013066 1040299 1065331 1086591 1103157 1115011 1122560 1126101 1125842 1122165 1115527 1106154 1094100 1079607
58543A079607j6454j8098j9761k1523k3252k4911k6418k7350k7185k5959k4324
$$ 1079607 1063153 1045055 1025294 1003771 980519 955608 929190 901840 874655 848696 824372
58532H24372k2841k1489j9920j7929j5643j3385j1424r695p801n592l618k632
$$ 824372 801531 780042 760122 742193 726550 713165 701741 692046 684245 678653 675035 672403
58520F72403k584k562j819m84Q24J672J863J365N02m7O7L81J86n67j260j430j208
$$ 672403 669819 667257 665438 664954 665778 667450 669313 670678 671180 671133 671200 671581 671767 671200 669940 668510 667302
58503F67302j011j107j496j903j914j383p04m06m36j69P18J781K478L010M117
$$ 667302 666291 665184 663688 661785 659871 658488 657784 657378 656942 656773 657491 659272 661750 664760 668877
58488F68877O022Q013R307J0085J1315J3558J6298J8565J9951K0753K1283K1463
$$ 668877 674899 682912 692219 702304 713619 727177 743475 762040 781991 802744 824027 845490
58476H45490K1106K0159J8562J6060J2468Q034L404p44m007o348p981r045r380
$$ 845490 866596 886755 905317 921377 933845 941879 945283 944539 940532 934184 926203 917158 907778
58463I07778q738p339n960n267n092m578l050o50J800L469M061L852L281K490
$$ 907778 899040 891701 885741 880474 875382 870804 867754 867104 868904 872373 876434 880286 883567 886057
58449H86057J268n81k976n615q196j0420j1992j2767j2939j2814j2368j1147q822
$$ 886057 887325 886744 883768 878153 869957 859537 847545 834778 821839 809025 796657 785510 776688
58436G76688n764k867p18Q95K504M204N701P011Q613J0723J2874J4490J5585J6481
$$ 776688 770924 768057 767339 768234 770738 774942 780643 787654 796267 806990 819864 834354 849939 866420
58422H66420J7032J6616J4820J1741P793L563k04l090n419p745r851j0906j0720
$$ 866420 883452 900068 914888 926629 934422 937985 937781 934691 929272 921527 911676 900770 890050
58409H90050j0155r967r826r057p812o823o151n017k941m63J621L285N071O983
$$ 890050 879895 869928 860102 851045 843233 836410 830259 825242 822301 821838 823459 826744 831815 838798
58395H38798Q195Q082P172O567O487N982M310K001J06j108k063k739k669k078
$$ 838798 846993 855075 862247 868814 875301 881283 885593 887594 887700 886592 884529 881790 879121 877043
58381H77043k026k978l883l411j691j39K62l3M2Q29J704K039K102K733M179N683
$$ 877043 875017 872039 868156 864745 863054 862915 863177 863144 863186 864015 865719 867758 869860 872593 876772 882455
58365H82455O511O945P762R026J0087J0617J0893J1045J0829J0323R963R654Q631
$$ 882455 888966 895911 903673 912699 922786 933403 944296 955341 966170 976493 986456 996110 1004741
58352A004741O625M413K796J735J041J075K114L623M921O044P283Q386R008R521
$$ 1004741 1011366 1015779 1018575 1020310 1021351 1022426 1024540 1028163 1033084 1039128 1046411 1054797 1063805 1073326
58338A073326J0616J2296J4015J5432J6378J6490J5636J4431J3493J2509J0819
$$ 1073326 1083942 1096238 1110253 1125685 1142063 1158553 1174189 1188620 1202113 1214622 1225441
58327A225441Q630O795N498M170K613J333O62L87L27N54J033J697K925N137P868
$$ 1225441 1234071 1240866 1246364 1250534 1253147 1254480 1255142 1255529 1255856 1256410 1257443 1259140 1262065 1267202 1275070
58312A275070R995J1058J1622J2284J3070J3973J5249J6844J8190J8872J8948
$$ 1275070 1285065 1296123 1307745 1320029 1333099 1347072 1362321 1379165 1397355 1416227 1435175
58301A435175J8454J7314J5973J5343J5635J5878J5123J3648J2498J2206J2450
$$ 1435175 1453629 1470943 1486916 1502259 1517894 1533772 1548895 1562543 1575041 1587247 1599697
58290A599697J2757J3076J3750J5123J7172J9430K1445K3222K4916K6263K6803
$$ 1599697 1612454 1625530 1639280 1654403 1671575 1691005 1712450 1735672 1760588 1786851 1813654
58279A813654K6724K6936K8114L0002L1822L3027L3738L4698L6791M0084M3514
$$ 1813654 1840378 1867314 1895428 1925430 1957252 1990279 2024017 2058715 2095506 2135590 2179104
58268B179104M5995M7791N0070N3221N6365N8653O0195O1382O2126O2217O1887
$$ 2179104 2225099 2272890 2322960 2376181 2432546 2491199 2551394 2612776 2674902 2737119 2799006
58257B799006O1468O0887N9914N8683N7684N7492N8581O1065O4501O8353P2643
$$ 2799006 2860474 2921361 2981275 3039958 3097642 3155134 3213715 3274780 3339281 3407634 3480277
58246C480277P7748Q3610Q9761R6162J03305J11274J19411J27147J34674J42527
$$ 3480277 3558025 3641635 3731396 3827558 3930863 4042137 4161548 4288695 4423369 4565896
58236D565896J51076J60610J71322J82923J94870K07170K20523K35455K51879
$$ 4565896 4716972 4877582 5048904 5231827 5426697 5633867 5854390 6089845 6341724
58227F341724K69654K88966L10004L32854L57862L85594M16394M50609M89177
$$ 6341724 6611378 6900344 7210348 7543202 7901064 8286658 8703052 9153661 9642838
58218I642838N33177N82899O38383P00996P73414Q57862R55567J068437J200340
$$ 9642838 10176015 10758914 11397297 12098293 12871707 13729569 14685136 15753573 16953913
58209A6953913J356633J543968J771637K052770K404114K845310L397197M077391
$$ 16953913 18310546 19854514 21626151 23678921 26083035 28928345 32325542 36402933
58201C6402933M895131N851430O945902Q184106R580702J1161202J2963491J5029790
$$ 36402933 41298064 47149494 54095396 62279502 71860204 83021406 95984897 111014687
58193A11014687J7377962J9956967K2608374K5053805K6910155K7722943K7018620
$$ 111014687 128392649 148349616 170957990 196011795 222921950 250644893 277663513
58186B77663513K4394376J9655380J2960740M891636l630754j1566118j8021378
$$ 277663513 302057889 321713269 334674009 339565645 335934891 324368773 306347395
58179C06347395k2457933k4781594k5301075k4568548k3157989k1482901j9740582
$$ 306347395 283889462 259107868 233806793 209238245 186080256 164597355 144856773
58172A44856773j7979358j6201950j4425049j2685844j1030075r502440q136623
$$ 144856773 126877415 110675465 96250416 83564572 72534497 63032057 54895434
58165E4895434o945147n918967n038439m284603l642632l100270k646282k269465
$$ 54895434 47950287 42031320 36992881 32708278 29065646 25965376 23319094 21049629
58157B1049629j957856j699462j484082j303832j152219j023857r14826q22069
$$ 21049629 19091773 17392311 15908229 14604397 13452178 12428321 11513495 10691426
58149A0691426p42300o72446o10880n56952n09353m66038m25764l88524l54315
$$ 10691426 9949126 9276680 8665800 8108848 7599495 7133457 6707693 6319169 5964854
58140E964854l22555k93009k66351k43315k23890k07505j93484j81230j70508
$$ 5964854 5642299 5349290 5082939 4839624 4615734 4408229 4214745 4033515 3863007
58131C863007j61625j54732j48883j42517j34953j26842j19012j11573j04363
$$ 3863007 3701382 3546650 3397767 3255250 3120297 2993455 2874443 2762870 2658507
58122B658507r7622r1706q6517q1652p6945p2508o8398o4514o0851n7615n4965
$$ 2658507 2560885 2469179 2382662 2301010 2224065 2151557 2083159 2018645 1957794 1900179 1845214
58111A845214n2672n0176m7161m4020m1551m0113l9258l8301l7031l5752l4877
$$ 1845214 1792542 1742366 1695205 1651185 1609634 1569521 1530263 1491962 1454931 1419179 1384302
58100A384302l4574l4643l4670l4454l4196l3951l3053l0639k6852k2873j9588
$$ 1384302 1349728 1315085 1280415 1245961 1211765 1177814 1144761 1114122 1087270 1064397 1044809
58089A044809j6826j4204j2007j0687j0028r473r003r122j0128j1841j3923j5995
$$ 1044809 1027983 1013779 1001772 991085 981057 971584 962581 953459 943331 931490 917567 901572
58077I01572j7647j8695j9325j9729j9793j9388j8662j7807j6835j5822j4958
$$ 901572 883925 865230 845905 826176 806383 786995 768333 750526 733691 717869 702911
58066G02911j4101j2808j1168j0026r821r752q836p345o404o439o872p195p534
$$ 702911 688810 676002 664834 654808 644987 635235 626399 619054 612650 606211 599339 592144 584610
58053E84610q017q335q136p397o294n080m123l662l513l378l325l572l940m077
$$ 584610 576593 568258 560122 552725 546431 541351 537228 533566 530053 526675 523350 519778 515838 511761
58039E11761m168m776n934o914p068o465n594m864m529m769n559o636p624q198
$$ 511761 507593 502817 496883 489969 482901 476436 470842 465978 461449 456680 451121 444485 436861 428663
58025D28663q181p694p123o639n939m736l327k272j692j249p64m15m33q60j588
$$ 428663 420482 412788 405665 399026 393087 388351 385024 382752 381060 379811 379047 378632 378199 377339 375751
58010C75751k217k121j121J00P80J126J872K929L322K597J523J006J010R86Q78
$$ 375751 373534 371413 370292 370392 371172 372298 374170 377099 380421 383018 384541 385547 386557 387543 388421
57995C88421J041J498J852J867J715J568J297P20j3m85n65p79j825l612n108n475
$$ 388421 389462 390960 392812 394679 396394 397962 399259 399979 399966 399481 398916 398137 396312 392700 387592 382117
57979C82117n083m915n174n134m364l364k743k390j905j409j308j524j499r77
$$ 382117 377034 372119 366945 361811 357447 354083 351340 348950 347045 345636 344328 342804 341305 340328
57965C40328l54o4qK00O18Q97Q41P94J200J990K638K867K917L063L201L157L089
$$ 340328 339974 339910 339902 340102 340720 341617 342458 343252 344452 346442 349080 351947 354864 357927 361128 364285 367374
57948C67374L228L480L649L850M334M990N492N825O243O738P049P205P610Q431
$$ 367374 370602 374082 377731 381581 385915 390905 396397 402222 408465 415203 422252 429457 437067 445498
57934D45498R259R473Q723P009M667K314M27j113k726m413n761o740p906r529
$$ 445498 454757 464230 472953 479962 484629 486943 487370 486257 483531 479118 473357 466617 458711 449182
57920D49182j0995j1532j1222j0819j0721j0556r810q460o892n461m320l514k992
$$ 449182 438187 426655 415433 404614 393893 383337 373527 365067 358175 352714 348394 344880 341888
57907C41888k447j456L6J478K257K442K630L032L179K741K086J688J471J255J417
$$ 341888 339441 337985 338021 339499 341756 344198 346828 349860 353039 355780 357866 359554 361025 362280 363697
57892C63697K286L193L026J749N06O8J0l10p44q99j072j889l350m741n485n616
$$ 363697 365983 369176 372202 373951 374457 374525 374535 374225 373481 372582 371510 369621 366271 361530 356045 350429
57876C50429n502n414n397n383n365n418n440n001l775k100p25K1M50Q57J237
$$ 350429 344927 339513 334116 328733 323368 317950 312510 307509 303734 301634 300909 300930 301380 302237 303474
57861C03474J742K786M300N406N462N083N540P162Q919R529Q644O925N305M328
$$ 303474 305216 308002 312302 317708 323170 328253 333793 340955 349874 359403 368047 374972 380277 384605
57847C84605L983L881L555K620R30j181k932l741l892m196m969n667n632m788
$$ 384605 388588 392469 396024 398644 399574 398393 395461 391720 387828 383632 378663 372996 367364 362576
57833C62576l437j878m61L74N55N38P28J062J433K085L114L978M033L312K278
$$ 362576 359139 357261 356800 357174 357729 358267 358995 360057 361490 363575 366689 370667 374700 378012 380290
57818C80290J071l47j550j932j701j837k810l899m189l771l551m079m989n613
$$ 380290 381361 381014 379464 377532 375831 373994 371184 367285 363096 359325 355774 351695 346706 341093
57804C41093n784n899o210o314n567m020k579j938j652p98N99J446J045R9j24
$$ 341093 335309 329410 323200 316886 311319 307299 304720 302782 301130 300332 300931 302377 303422 303521 303397
57789C03397O45J578K013K244K859L822M671N429O642Q351R586R431Q269P322
$$ 303397 304042 305620 307633 309877 312736 316558 321229 326658 333300 341651 351237 360668 368937 376259
57775C76259O978O363M764K749J298L68q85k770m707o222p462q609r481j0018
$$ 376259 383237 389600 394364 397113 398411 398779 397894 395124 390417 384195 376733 368124 358643 348625
57761C48625j0572j1193j1167r875p879o526o411o776o488n224l521k011r84m73
$$ 348625 338053 326860 315693 305818 297939 291413 285002 278226 271738 266514 262993 260982 259998 259525
57747B59525l74m77n30m44l13j88J13P89J675K168J751O03m70q41o93o88j111
$$ 259525 259151 258674 258144 257700 257387 257199 257312 258101 259776 261944 263695 264298 263828 262987 262294 261606 260495
57730B60495j613j793j652j309o28M30J378J591J110N98M51M53L68L29L54Mj007
$$ 260495 258882 257089 255437 254128 253500 253930 255308 256899 258009 258607 259058 259511 259879 260208 260562 260566 259559
57713B59559k159k664k423k050j976k044j917j551j147r61j098j304j068k03Q03
$$ 259559 257400 254736 252313 250263 248287 246243 244326 242775 241628 240667 239569 238265 237197 236994 237797
57698B37797J396J673K070K538K642K421K400K637K474J558M80J1J38L35M55Q92
$$ 237797 239193 240866 242936 245474 248116 250537 252937 255574 258048 259606 260086 260097 260235 260570 261025 261917
57682B61917K029L908O373R228J2340J5725J9491K3685K8394L3870M0157M6567
$$ 261917 263946 267854 274227 283455 295795 311520 331011 354696 383090 416960 457117 503684
57670E03684N1910N5440N7108N6767N3615M6683L5483K0128J499j8187l5693m8470
$$ 503684 555594 611034 668142 724909 778524 825207 860690 880818 882317 864130 828437 779967
57658G79967n6016n9264n9084n5996n0873m4977l9104l3300k7546k2236j7826
$$ 779967 723951 664687 605603 549607 498734 453757 414653 381353 353807 331571 313745
57647C13745j4403j1766r685q016o713n799n184m595l819k926k079j292o24l24
$$ 313745 299342 287576 277891 269875 263162 257363 252179 247584 243765 240839 238760 237468 236844 236520
57633B36520n00p84p37m70m96r88j523j601j217q75j151k138l213l503k779j706
$$ 236520 236020 235236 234499 234029 233533 232545 231022 229421 228204 227329 226178 224040 220827 217324 214545 212839
57617B12839j111j235j867k739l468l493k643j553r93j002j076j004j002j105
$$ 212839 211728 210493 208626 205887 202419 198926 196283 194730 193737 192735 191659 190655 189653 188548
57603A88548j072q58o37l63J24N46L41m95j208j236q81p93j107j416j413j299
$$ 188548 187476 186618 185981 185618 185742 186288 186629 186134 184926 183690 182809 182016 180909 179493 178080 176781
57587A76781j481k044k541k401j612q12o44j148j871k322k152j353m85l79j181
$$ 176781 175300 173256 170715 168314 166702 165890 165246 164098 162227 159905 157753 156400 155915 155536 154355
57572A54355k061k249j976j899k044j981j693j486j314r30n58n62o13r7O93P75
$$ 154355 152294 150045 148069 146170 144126 142145 140452 138966 137652 136722 136164 135602 134989 134892 135585 136360
57556A36360lo64m49L39J107J688J987J762J203R73J273J520J285Q22L61k76r22
$$ 136360 136357 135693 135244 135583 136690 138378 140365 142127 143330 144303 145576 147096 148381 149203 149564 149288 148366
57539A48366q50J25J066J142O52K69kl13k75M10J162J325J130J046P79l8p38l85
$$ 148366 147516 147641 148707 149849 150501 150770 150768 150455 150180 150590 151752 153077 154207 155253 156032 155994 155256 154871
57521A54871O80J316J328J471J864J730Q66Q9j45l08o33m50N89J625J718J132
$$ 154871 155551 156867 158195 159666 161530 163260 164126 164215 164070 163762 163129 162679 163268 164893 166611 167743
57505A67743P10M99j38j311k329k591k251j911j968k291k372j893j164q16j039
$$ 167743 168453 168952 168814 167503 165174 162583 160332 158421 156453 154162 151790 149897 148733 147917 146878
57490A46878j427j608j646j648j461r99n09k01K6K81L82J80r1j83k53o36j350
$$ 146878 145451 143843 142197 140549 139088 138089 137580 137379 137405 137686 138068 138248 138157 137974 137721 137085 135735
57473A35735k142k805l204l207k834k319j782j109l42J84L65N78J017J174N98
$$ 135735 133593 130788 127584 124377 121543 119224 117442 116333 115991 116175 116540 117118 118135 119309 119907
57458A19907k34m06J70P35Q36Q07R78J078P66K13j93l50l43j57K26O26Q73R71
$$ 119907 119673 119267 119437 120172 121008 121815 122793 123871 124637 124850 124657 124307 123964 123807 124033 124659 125532 126503
57440A26503R28O73K90N6N7P1mN9L58N02J36m53p18n55k69J2L54O36O85P15J050
$$ 126503 127431 128104 128394 128450 128507 128578 128574 128633 128991 129493 129629 129176 128458 127903 127634 127646 128000 128636 129321 130036 131086
57419A31086J340P70p06j945j858p12K56K87k75o07k47O19J319J164P4j206j782
$$ 131086 132426 133196 132490 130545 128687 127975 128231 128518 128243 127636 127389 128008 129327 130491 130565 129359 127577
57402A27577j420o32k0J92R9o6n5J81L20K2n34p42l21L51Q23J194J820K570K829
$$ 127577 126157 125525 125505 125697 125796 125730 125675 125856 126176 126198 125664 124922 124601 124952 125775 126969 128789 131359 134188
57383A34188K274J359P50N48K24o32j745k396k190j491j078j429k292k993l082
$$ 134188 136462 137821 138571 139119 139343 138711 136966 134570 132380 130889 129811 128382 126090 123097 120015
57368A20015k614j829p61N81J739K025J319M58M15J302K457L324L825L930L487
$$ 120015 117401 115572 114811 115392 117131 119156 120475 120933 121348 122650 125107 128431 132256 136186 139673
57353A39673K596J741J267J093J086J286J535J340N68o9K06J143J664J148Q7n83
$$ 139673 142269 144010 145277 146370 147456 148742 150277 151617 152185 152116 152322 153465 155129 156277 156364 155781
57337A55781m90o4Kn62j341j714j548j231r47l95N15J160R64K82j18j50k84m69
$$ 155781 155291 155227 155229 154667 153326 151612 150064 148833 147886 147491 148006 149166 150130 150412 150294 150144 149860 149391
57319A49391j23P72J426J415J256J471J704J389O64Q6j91l52l97k63k19n06p46
$$ 149391 149268 150040 151466 152881 154137 155608 157312 158701 159365 159451 159260 158908 158511 158248 158029 157523 156777
57302A56777l55N07J045R47P99J163J737J871J534J291J401J495J279J151J673
$$ 156777 156422 156929 157974 158921 159720 160883 162620 164491 166025 167316 168717 170212 171491 172642 174315
57287A74315K644L151K743K092K161K995L765L901L654L433L148K469J454N19
$$ 174315 176959 180110 182853 184945 187106 190101 193866 197767 201421 204854 208002 210471 211925 212444
57273B12444k4k18k77l50m10k80R8M44L54j84o40m32N47J865K846L001K424J789
$$ 212444 212420 212202 211925 211575 211165 210885 210983 211427 211781 211597 210957 210525 211072 212937 215783 218784 221208 222997
57255B22997J725K162K591K883L384M102M367L665K469J759J912K462K825K885
$$ 222997 224722 226884 229475 232358 235742 239844 244211 247876 250345 252104 254016 256478 259303 262188
57241B62188K851K881K986L251L860M830N728N928N301M427L882L586L205K980
$$ 262188 265039 267920 270906 274157 278017 282847 288575 294503 299804 304231 308113 311699 314904 317884
57227C17884L424M329M843M736M819N750P075P897Q021P904P957Q385R348J0684
$$ 317884 321308 325637 330480 335216 340035 345785 352860 360757 368778 376682 384639 393024 402372 413056
57213D13056J1782J2217J2259J2264J2047J1430J1048J1743J3276J4516J4926
$$ 413056 424838 437055 449314 461578 473625 485055 496103 507846 521122 535638 550564
57202E50564J5114J5793J6945J8250J9656K1086K2162K2697K3137K4024K5235
$$ 550564 565678 581471 598416 616666 636322 657408 679570 702267 725404 749428 774663
57191G74663K6190K6658K6987K7537K8280K8948K9320K9275K8851K8409K8472
$$ 774663 800853 827511 854498 882035 910315 939263 968583 997858 1026709 1055118 1083590
57180A083590K9246L0390L1503L2644L4114L5817L7362L8816M0813M3611M6467
$$ 1083590 1112836 1143226 1174729 1207373 1241487 1277304 1314666 1353482 1394295 1437906 1484373
57169A484373M8496M9782N1106N2790N4467N5941N7499N9255O0824O1936O2878
$$ 1484373 1532869 1582651 1633757 1686547 1741014 1796955 1854454 1913709 1974533 2036469 2099347
57158B099347O4023O5341O6636O7864O8872O9195O8457O6761O4391O1292N7135
$$ 2099347 2163370 2228711 2295347 2363211 2432083 2501278 2569735 2636496 2700887 2762179 2819314
57147B819314N1870M6051M0594L6194L2954L0786L0293L2710L8655M7174N6480
$$ 2819314 2871184 2917235 2957829 2994023 3026977 3057763 3088056 3120766 3159421 3206595 3263075
57136C263075O5250P2713P8026Q0483Q0120P7427P2809O7169O2474O0560O1546
$$ 3263075 3328325 3401038 3479064 3559547 3639667 3717094 3789903 3857072 3919546 3980106 4041652
57125D041652O4488O9032P4947Q0517Q3466Q3697Q3377Q4256Q6695R1448R9972
$$ 4041652 4106140 4175172 4250119 4330636 4414102 4497799 4581176 4665432 4752127 4843575 4943547
57114D943547J12255J26310J40632J55322J70553J86512K05725K32682K69762
$$ 4943547 5055802 5182112 5322744 5478066 5648619 5835131 6040856 6273538 6543300
57105F543300L16020L71347M39273N24653O32055P67992R40330J151927J397845
$$ 6543300 6859320 7230667 7669940 8194593 8826648 9594640 10534970 11686897 13084742
57096A3084742J671686J971170K294712K637471K994938L364785L739900M106663
$$ 13084742 14756428 16727598 19022310 21659781 24654719 28019504 31759404 35866067
57088C5866067M455968M778774N022327N049495M678544L805896K507625J019730
$$ 35866067 40322035 45100809 50123136 55172631 59851175 63657071 66164696 67184426
57080F7184426l85336j519697k322397k830189l122871l276803l342346l348082
$$ 67184426 66799090 65279393 62956996 60126807 57003936 53727133 50384787 47036705
57072D7036705l316686l269792l218687l158964l079201k972074k835670k669848
$$ 47036705 43720019 40450227 37231540 34072576 30993375 28021301 25185631 22515783
57064B2515783k476694k262905k038245j812154j593214j389395j205908j043484
$$ 22515783 20039089 17776184 15737939 13925785 12332571 10943176 9737268 8693784
57056H693784r00582p76437o70787n82218n08597m48250l99210l58384l22982
$$ 8693784 7793202 7016765 6345978 5763760 5255163 4806913 4407703 4049319 3726337
57047C726337k92006k65105k40948k18016j96237j76329j58143j40963j24951
$$ 3726337 3434331 3169226 2928278 2710262 2514025 2337696 2179553 2038590 1913639
57038A913639j10959r9075q8406p8164o8200n8689m9943m2294l5543k8790k1252
$$ 1913639 1802680 1703605 1615199 1537035 1468835 1410146 1360203 1317909 1282366 1253576 1232324
57027A232324j3036m730L263J0667J7091K2279K5978K7057K3371J3226l074k3114
$$ 1232324 1219288 1214558 1217821 1228488 1245579 1267858 1293836 1320893 1344264 1357490 1354416 1331302
57015A331302m3245n9652o9718p3253p2034o7920o1909n4922m8170m2178l6429
$$ 1331302 1288057 1228405 1158687 1085434 1013400 945480 883571 828649 780479 738301 701872
57004G01872l0718k5862k2361j9439j6367j3809j2700j2594j2379j1973j2015
$$ 701872 671154 645292 622931 603492 587125 573316 560616 548022 535643 523670 511655
56993E11655j2276j1815j0511r180q160o923n199l470k218j572j801l194n313
$$ 511655 499379 487564 477053 467873 459713 452790 447591 444121 441903 440331 438530 435336 430023
56980D30023p237q815j0742j3116j4793j4688j3143j1384j0151r306q388o960
$$ 430023 422786 413971 403229 390113 375320 360632 347489 336105 325954 316648 308260 301300
56968C01300m745j876J039L458N388P131Q737J0064J1208J2411J3466J3590J2121
$$ 301300 296555 294679 295718 299176 304564 311695 320432 330496 341704 354115 367581 381171 393292
56955C93292R151N296R74l751q598j2766j5472j6605j6556j5619j3872j1514q833
$$ 393292 402443 407739 408713 404962 396364 383598 368126 351521 334965 319346 305474 293960 285127
56942B85127n858k488R98M064O652R320J2371J5324J7548J8979J9766J9530J7543
$$ 285127 279269 276781 277779 281843 288495 297815 310186 325510 343058 362037 381803 401333 418876
56929D18876J3547Q063J893m363j0363j5832k0346k3294k4237k3412k1672j9761
$$ 418876 432423 440486 442379 438016 427653 411821 391475 368181 343944 320532 298860 279099
56917B79099j7918j6194j4760j3602j2318j0586q643o977n679m459l150j950j180
$$ 279099 261181 244987 230227 216625 204307 193721 185078 178101 172422 167963 164813 162863 161683
56904A61683r81j163j278r63k77N30J534L013M808O335P401Q444R696J0724J1245
$$ 161683 160702 159539 158261 157298 157021 157551 159085 162098 166906 173241 180642 189086 198782 209506 220751
56889B20751J1748J2775J3961J4463J3886J2151Q928M128j173n234p289q023q360
$$ 220751 232499 245274 259235 273698 287584 299735 308663 312791 311618 306384 299095 291072 282712
56876B82712q442p947o820n205l049j44L459P310J0834J3744J6274J8852K1565
$$ 282712 274270 266323 259503 254298 251249 251105 254564 261874 272708 286452 302726 321578 343143
56863C43143K4079K6174K7934K9107K8748K5975K0834J3952N753l318j2010j8645
$$ 343143 367222 393396 421330 450437 479185 505160 525994 539946 545699 542381 530371 511726
56851E11726k2417k3745k3217k0884j6797j1617o195q60M533J0070J5598K0934
$$ 511726 489309 465564 442347 421463 404666 393049 386854 385994 390527 400597 416195 437129
56839D37129K6087L1271L6680M2039M6413M8591M7687M3178L4664K2119O531j0018
$$ 437129 463216 494487 531167 573206 619619 668210 715897 759075 793739 815858 822389 812371
56827H12371k5139l6992m4647m8081m7943m5101m0262l4036k7076j9907j2783
$$ 812371 787232 750240 705593 657512 609569 564468 524206 490170 463094 443187 430404
56816D30404n950K44N908J1823J8500K5167L0415L3621L5044L4600L1515K5353
$$ 430404 424454 424698 430606 442429 460929 486096 516511 550132 585176 619776 651291 676644
56804F76644J6563N812o313j8552k8877l5829l9490m0642l9556l6271l1512k6446
$$ 676644 693207 699019 692706 674154 645277 609448 569958 529316 489760 453489 421977 395531
56792C95531k1661j6966j2106p183k465J812N507Q765J1945J5008J7206J7723
$$ 395531 373870 356904 344798 337615 335150 336962 342469 351234 363179 378187 395393 413116
56780D13116J6360J3222Q169J231o579j3619j8835k2293k4501k5750k6093k5490
$$ 413116 429476 442698 450867 452098 445519 431900 413065 390772 366271 340521 314428 288938
56768B88938k3830k1129j7769j4295j1046q307o590o237o742p087o792o144n346
$$ 288938 265108 243979 226210 211915 200869 192562 185972 179735 172993 165906 159114 152970 147624
56755A47624m166k678j631j556j968k014j583j174r48n54R3M89J95n69j162j153
$$ 147624 143458 140780 139149 137593 135625 133611 132028 130854 129906 129352 129445 129934 130129 129560 128398 127245
56739A27245o45j91l95j280k100k001r86J15O69Q82J202J508J325O75K13M62J192
$$ 127245 126600 126409 126014 124734 122634 120633 119647 119762 120431 121313 122515 124023 125348 126023 126236 126698 127890
56722A27890J699J544R62O05Q94J572J967J818J551J651J910J803J356J125J286
$$ 127890 129589 131133 132095 132700 133594 135166 137133 138951 140502 142153 144063 145866 147222 148347 149633
56707A49633J344J031Q34J231J793J691Q58P2r8J03J60p1m18p68j134j481j674
$$ 149633 150977 152008 152842 154073 155866 157557 158415 158487 158389 158492 158652 158581 158163 157395 156261 154780 153106
56690A53106j545j093o22n63r32j147p48q9N4m72j052j165q66l83J49M48J67m25
$$ 153106 151561 150468 149846 149283 148351 147204 146456 146367 146421 145949 144897 143732 142866 142483 142632 143080 143247 142822
56672A42822m95J98Q07N69m2q3M08N65J19k91k57j35k47k83R4O23R24J140J588
$$ 142822 142327 142525 143332 143901 143859 143776 144184 144749 144868 144577 144320 144185 143938 143655 143749 144372 145296 146436 148024
56653A48024K152K499K573K523K351K077K041K483K967K775J881J083J031J502
$$ 148024 150176 152675 155248 157771 160122 162199 164240 166723 169690 172465 174346 175429 176460 177962
56639A77962J751J330M55k31j78M94J011O79l16j191j537j645j809j841j520j079
$$ 177962 179713 181043 181498 181267 181089 181583 182594 183273 182957 181766 180229 178584 176775 174934 173414 172335
56623A72335q37p43o08n70q40j201j243j047j092j481j714j417q57n16n08o43
$$ 172335 171498 170755 170147 169577 168737 167536 166293 165246 164154 162673 160959 159542 158685 158169 157661 157018
56607A57018q51j171j467j462j095o36l47j78J01N52R60J130J120J081R54O02
$$ 157018 156167 154996 153529 152067 150972 150336 149989 149811 149912 150464 151424 152554 153674 154755 155709 156311
56591A56311K17K66Q55J442J459J030P16P71R53J058J123J176J139J081J220J534
$$ 156311 156528 156794 157649 159091 160550 161580 162296 163067 164020 165078 166201 167377 168516 169597 170817 172351
56575A72351J687J452J002P37R93J884L096L980M252M590N904P969R451R597R213
$$ 172351 174038 175490 176492 177229 178222 180106 183202 187182 191434 196024 201928 209897 219348 228945 238158
56560B38158R515J0531J1241J0899R572P629N447L534K357J870J600J213O91J2
$$ 238158 247673 258204 269445 280344 289916 297545 302992 306526 308883 310753 312353 313566 314257 314269
56546C14269q91j850k474k588k458k494k864l404l747l689l475l581m125m703
$$ 314269 313378 311528 309054 306466 304008 301514 298650 295246 291499 287810 284335 280754 276629 271926
56532B71926n048n405n991o429o186n313m303l476k981l034l566l890l483k883
$$ 271926 266878 261473 255482 249053 242867 237554 233251 229775 226794 223760 220194 216304 212821 209938
56518B09938l016l722l946l317k595k279j866j000l46n52j070r67l67j84o33j009
$$ 209938 206922 203200 199254 195937 193342 191063 189197 188197 187851 187299 186229 185262 184895 184711 184078 183069
56502A83069q65n99o16o00o1Q12J251Q18r5p08o61l08j79l36m57m07l60l13M1
$$ 183069 182204 181605 180989 180389 180328 181140 182391 183209 183114 182406 181745 181437 181258 180922 180465 180058 179698 179385 179426
56483A79426P19J233J301J387K010K748K601J333j42q61p91n15l10m2K96M38L09
$$ 179426 180145 181378 182679 184066 186076 188824 191425 192758 192616 191755 190964 190449 190139 190097 190393 190831 191140
56466A91140K57N72R95R74L75l52p25o92m42m6M51P99Q02P06Q83J156R37J88k10
$$ 191140 191397 191969 192964 193938 194313 193961 193236 192544 192102 192056 192507 193306 194108 194814 195697 196853 197790 197978 197768
56447A97768N44K031K960K565J313K01l13m87n95n07r1L18K15l43p56p39o60p59
$$ 197768 198312 200343 203303 205868 207181 207382 207069 206582 205987 205480 205389 205707 205922 205579 204823 204084 203424 202665
56429B02665n70L04J226J157J59n65k86M24O93N23M36N62O41N82M93L52J21RK02
$$ 202665 202095 202399 203625 204782 204941 204376 204090 204514 205207 205730 206166 206728 207369 207951 208444 208796 208917 208926 209128
56410B09128M86N34M57O42J111J409J137M18k04k28L91J167J585J642J692J786
$$ 209128 209614 210148 210605 211247 212358 213767 214904 215322 215118 214890 215281 216448 218033 219675 221367 223153
56394B23153J581J037O34O47O91L99Q5J89N13N96N46Q60J565K186K400K192J422
$$ 223153 224734 225771 226405 227052 227743 228142 228227 228416 228929 229525 230071 230931 232496 234682 237082 239274 240696
56377B40696O0j267j634r54j22J46M7J0o5m45r09r77o17k36p9K6L25P75J118J181
$$ 240696 240756 239489 237855 236901 236779 236925 236972 236982 236917 236472 235563 234586 233969 233733 233654 233680 234005 234780 235898 237079
56357B37079J070J036J135J127Q40N08N37R31J255J197R31P68P20N57K34K2K16
$$ 237079 238149 239185 240320 241447 242287 242795 243332 244263 245518 246715 247646 248414 249134 249691 249925 249947 250163
56340B50163P67J272J356J082Q56Q73R23Q65J015J680K482K686K195J707J672
$$ 250163 250930 252202 253558 254640 255496 256369 257292 258157 259172 260852 263334 266020 268215 269922 271594
56325B71594J688J222N76N32J190J714J408N99J46K79L53k26j170j632j169o5
$$ 271594 273282 274504 275080 275612 276802 278516 279924 280523 280669 280948 281301 281075 279905 278273 277104 277039
56309B77039J128K040K431K130J341P24P91J389J960K225K323K352K178J725J188
$$ 277039 278167 280207 282638 284768 286109 286833 287624 289013 290973 293198 295521 297873 300051 301776 302964
56294C02964Q22O74O58P53R79J207J201R10O93R97J780K392K326J838J589J792
$$ 302964 303786 304460 305118 305871 306850 308057 309258 310168 310861 311858 313638 316030 318356 320194 321783 323575
56278C23575K063K093J976J915K055K676L861M849M537L013J860K290L640M458
$$ 323575 325638 327731 329707 331622 333677 336353 340214 345063 349600 352613 354473 356763 360403 364861
56264C64861M504M665N294N841O084O582P588Q515Q952R466J0825J2912J4919
$$ 364861 369365 374030 379324 385165 391249 397831 405419 413934 422886 432352 443177 456089 471008
56251D71008J6288J7089J7745J8683K0045K1472K2401K2670K2543K2078K0973
$$ 471008 487296 504385 522130 540813 560858 582330 604731 627401 649944 672022 692995
56240F92995J9234J7497J6283J5284J3793J1580R008O470M110J929j85k431m801
$$ 692995 712229 729726 746009 761293 775086 786666 795674 802144 806254 808183 807998 805567 800766
56227H00766o877q203q894r554j0619j1951j3089j3737j3875j3628j3174j2802
$$ 800766 793889 785686 776792 767238 756619 744668 731579 717842 703967 690339 677165 664363
56215F64363j2774j2993j2926j2183j1100j0445j0428j0419r836q899q097p366
$$ 664363 651589 638596 625670 613487 602387 591942 581514 571095 561259 552360 544263 536897
56203E36897o337n180m476m359m377m210l959l649l112k461k125k118j870j013
$$ 536897 530560 525380 520904 516545 512168 507958 503999 500350 497238 494777 492652 490534 488664 487651
56189D87651K2N56M61J47J02O29J694K791L259K993K605K680L124L407L248K846
$$ 487651 487673 488229 488690 488837 488939 489568 491262 494053 497312 500305 502910 505590 508714 512121 515369 518215
56173E18215K649K994L845M842N694O458P111P265O762O404P267R283J1279J2472
$$ 518215 520864 523858 527703 532545 538239 544697 551808 559073 565835 572239 579506 588789 600068 612540
56159F12540J3209J4068J5084J6252J7941K0292K2834K5285K8099L1816L6461
$$ 612540 625749 639817 654901 671153 689094 709386 732220 757505 785604 817420 853881
56148H53881M2042M8923N7103O5825P4662Q4326R5499J07383J18412J27896J35790
$$ 853881 895923 944846 1001949 1067774 1142436 1226762 1322261 1429644 1548056 1675952 1811742
56137A811742J41103J41900J37275J28415J17396J05567R3406Q1244O9606N9052
$$ 1811742 1952845 2094745 2232020 2360435 2477831 2583398 2676804 2758048 2827654 2886706
56127B886706M9868M1654L3253K3463J2037k24j2299k3630l4231m4582n5445o7367
$$ 2886706 2936574 2978228 3011481 3034944 3046981 3046757 3034458 3010828 2976597 2932015 2876570 2809203
56115B809203q0299r3852j07542j20383j30601j36519j37735j34918j28592j18916
$$ 2809203 2728904 2635052 2527510 2407127 2276526 2140007 2002272 1867354 1738762 1619846
56105A619846j06611r3270q0331o8299n7232m7416l9145l2305k6484k1338j6655
$$ 1619846 1513235 1419965 1339634 1271335 1214103 1166687 1127542 1095237 1068753 1047415 1030760
56094A030760j2406q900o514n151m240l460k976k811k492j703q17l27m3O01J680
$$ 1030760 1018354 1009454 1002940 997789 993549 990089 987113 984302 981810 980107 979290 978963 978920 979521 981201
56079I81201K756L630M580N740O736P232P524Q246R582J1039J2033J2503J2853
$$ 981201 983957 987587 992167 997907 1004643 1011875 1019399 1027645 1037227 1048266 1060299 1072802 1085655
56066A085655J3492J4534J5815J6976J7677J7901J8032J8352J8591J8289J7550
$$ 1085655 1099147 1113681 1129496 1146472 1164149 1182050 1200082 1218434 1237025 1255314 1272864
56055A272864J6943J6589J5940J4709J3496J3026J3212J3543J3999J4893J6100
$$ 1272864 1289807 1306396 1322336 1337045 1350541 1363567 1376779 1390322 1404321 1419214 1435314
56044A435314J7151J8083J9411K1177K2644K3252K3236K3146K3215K3548K4421
$$ 1435314 1452465 1470548 1489959 1511136 1533780 1557032 1580268 1603414 1626629 1650177 1674598
56033A674598K5877K7429K8633K9814L1689L4295L6818L8572L9731M0904M2327
$$ 1674598 1700475 1727904 1756537 1786351 1818040 1852335 1889153 1927725 1967456 2008360 2050687
56022B050687M3862M5586M7801N0403N2721N4394N6031N8562O2032O5574O8517
$$ 2050687 2094549 2140135 2187936 2238339 2291060 2345454 2401485 2460047 2522079 2587653 2656170
56011B656170P1103P4021P7653Q1911Q6389R0573R4294R8118J02858J08527J14316
$$ 2656170 2727273 2801294 2878947 2960858 3047247 3137820 3232114 3330232 3433090 3541617 3655933
56000C655933J19736J25233J31452J38466J46146J54622J63932J73761J84122
$$ 3655933 3775669 3900902 4032354 4170820 4316966 4471588 4635520 4809281 4993403
55991D993403J95785K09331K24259K39761K55984K73777K93497L14914L38244
$$ 4993403 5189188 5398519 5622778 5862539 6118523 6392300 6685797 7000711 7338955
55982G338955L64364L93986M27223M64124N05137N50961O02495O61089P28531
$$ 7338955 7703319 8097305 8524528 8988652 9493789 10044750 10647245 11308334 12036865
55973A2036865Q06653Q97182J002082J124229J268219J440936J651542J911623
$$ 12036865 12843518 13740700 14742782 15867011 17135230 18576166 20227708 22139331
55965B2139331K236392K645529L160729L800142M574314N487539O542914P747100
$$ 22139331 24375723 27021252 30181981 33982123 38556437 44043976 50586890 58333990
55957E8333990R113482J0664743J2433450J4454342J6740868J9246527K1827323
$$ 58333990 67447472 78112215 90545665 105000007 121740875 140987402 162814725
55950A62814725K4228726K6102359K7031353K6553063K4215735J9719550J3115030
$$ 162814725 187043451 213145810 240177163 266730226 290945961 310665511 323780541
55943C23780541M929258l903095j2290758j9279377k4255359k7023109k7775656
$$ 323780541 328709799 324806704 312515946 293236569 268981210 241958101 214182445
55936B14182445k6974296k5165200k2809879k0213736j7561226j4984851j2597562
$$ 214182445 187208149 162042949 139233070 119019334 101458108 86473257 73875695
55929G3875695j0483069q680374p185522n966540m980084m183679l540904l020739
$$ 73875695 63392626 54712252 47526730 41560190 36580106 32396427 28855523 25834784
55921B5834784k596406k246667j956392j713925j508701j332395j180513j050584
$$ 25834784 23238378 20991711 19035319 17321394 15812693 14480298 13299785 12249201
55913A2249201r39179q41911p55664o79245o12061n53220n01692m56454m16501
$$ 12249201 11310022 10468111 9712447 9033202 8421141 7867921 7366229 6909775 6493274
55904F493274l81070l49655l21566k96028k72810k52083k33443k15995j99567
$$ 6493274 6112204 5762549 5440983 5144955 4872145 4620062 4386619 4170624 3971057
55895C971057j84816j71778j59486j47536j36789j27774j19613j11445j03776
$$ 3971057 3786241 3614463 3454977 3307441 3170652 3042878 2923265 2811820 2708044
55886B708044r7271r1223q4481p7271p0735o5200o0145n5565n2142n0185m9450
$$ 2708044 2610773 2519550 2435069 2357798 2287063 2221863 2161718 2106153 2054011 2003826 1954376
55875A954376m9844n1346n3353n4971n5928n6337n5872n4050n1329m8803m6771
$$ 1954376 1904532 1853186 1799833 1744862 1688934 1632597 1576725 1522675 1471346 1422543 1375772
55864A375772m4440m1257l7715l4588l2122l0316k9415k9624l0642l1735l2139
$$ 1375772 1331332 1290075 1252360 1217772 1185650 1155334 1125919 1096295 1065653 1033918 1001779
55853A001779l1394k9642k7588k5892k4606k3437k2334k1396k0384j8972j7430
$$ 1001779 970385 940743 913155 887263 862657 839220 816886 795490 775106 756134 738704
55842G38704j6399j5966j5548j4774j3939j3332j2721j1759j0508r269q271p666
$$ 738704 722305 706339 690791 676017 662078 648746 636025 624266 613758 604489 596218 588552
55830E88552p492p422o983o183n619n682o086o406o691p134p556p670p622p797
$$ 588552 581060 573638 566655 560472 554853 549171 543085 536679 529988 522854 515298 507628 500006 492209
55816D92209q195q441q314p864p012n577l795k364j679j275l57J208K787L806
$$ 492209 484014 475573 467259 459395 452383 446806 443011 440647 438968 437693 437336 438544 441331 445137
55802D45137M368M839N090M549L117J546O45K61m60j915l561m769n632o496p142
$$ 445137 449505 454344 459434 463983 467100 468646 469291 469552 469092 467177 463616 458847 453215 446719 439577
55787D39577p012o165n309m812m302l547l198l993n526o502o206n176m248l482
$$ 439577 432565 426400 421091 416279 411977 408430 405232 401239 395713 389211 383005 377829 373581 370099
55773C70099k333n17J737M101O328P922Q115O398L093q23m401p191r124j0201
$$ 370099 367766 367249 368986 373087 379415 387337 395452 401850 404943 404120 399719 392528 383404 373203
55759C73203j0530j0546j0785j1244j1261j0358q965p939p473p025o254n522n251
$$ 373203 362673 352127 341342 330098 318837 308479 299514 291575 284102 277077 270823 265301 260050
55746B60050n328n450n616n932o212o154n724n095m370l615k930k276j535r16
$$ 260050 254722 249272 243656 237724 231512 225358 219634 214539 210169 206554 203624 201348 199813 198897
55732A98897q37j218j370j018q62j505k363k411j712j297j672k309k577k400j880
$$ 198897 198060 196842 195472 194454 193592 192087 189724 187313 185601 184304 182632 180323 177746 175346 173466
55717A73466j060k63J03J93O14J436K025K036J912K144K536K544J873N70r54j905
$$ 173466 172406 172143 172246 172439 173053 174489 176514 178550 180462 182606 185142 187686 189559 190129 189175 187270
55701A87270j765j108j105k017k914l101k967l043l095k782k399k289k152j659
$$ 187270 185505 184397 183292 181275 178361 175260 172293 169250 166155 163373 160974 158685 156533 154874
55687A54874j098p24q9J137K308K695K771L490M618M935M028K758J931J448J057
$$ 154874 153776 153052 152963 154100 156408 159103 161874 165364 169982 174917 178945 181703 183634 185082 186139
55672A86139R05R51N81n59j827k178j366j52N67O81Q59J623K538K634J730Q62
$$ 186139 187044 187995 188576 188017 186190 184012 182646 182494 183061 183742 184601 186224 188762 191396 193126 193988
55656A93988J005J799K134J599P01j25r39j766k366k593k528k299k259l003m566
$$ 193988 194993 196792 198926 200525 201226 201101 200162 198396 196030 193437 190909 188610 186351 183348 178782
55641A78782n802n520m137l234l460l893l651l023k571k185j689j485j824k148
$$ 178782 172980 167460 163323 160089 156629 152736 149085 146062 143491 141306 139617 138132 136308 134160
55627A34160j922j503j397j280o31J23J43m08m98J92P81M71m75j300j685j704
$$ 134160 132238 130735 129338 128058 127427 127550 127693 127285 126787 126979 127760 128231 127756 126456 124771 123067
55611A23067j401q50l88l43o13q14p98p93j020j345j504j484j478j390p84L92
$$ 123067 121666 120816 120428 120085 119472 118658 117860 117067 116047 114702 113198 111714 110236 108846 108062 108454
55595A08454J291R59m09j520j496p86l23k54m2N48J112J176P27J71J5N05J329
$$ 108454 109745 110704 110295 108775 107279 106493 106170 105916 105874 106422 107534 108710 109437 109608 109623 110128 111457
55578A11457J902K117K507L417M350M649M462M469M816N020M875M719M642M120
$$ 111457 113359 115476 117983 121400 125750 130399 134861 139330 144146 149166 154041 158760 163402 167522
55564A67522K741Q30j003k485l588m172m185l944l867m005m099l963l549k864
$$ 167522 170263 171093 170090 167605 164017 159845 155660 151716 147849 143844 139745 135782 132233 129369
55550A29369k061j553j595j891j864j380q38m99q5P28J694K180J919J273P22L30
$$ 129369 127308 125755 124160 122269 120405 119025 118187 117688 117603 118331 120025 122205 124124 125397 126119 126449
55534A26449j17n75p20l98J02M15M95M23L9q39j934k619k683k551k537k335j612
$$ 126449 126332 125757 125037 124639 124741 125156 125651 126074 126113 125274 123340 120721 118038 115487 112950 110615 109003
55517A09003q22q60j862k951l293k941k405j888j359j017j091j312j146o14l37
$$ 109003 108181 107321 105459 102508 99215 96274 93869 91981 90622 89605 88514 87202 86056 85442 85105
55502H5105o51j128j185p76k09L64R11J277J373J354J289Q99P2o15n05J17K76
$$ 85105 84454 83326 82141 81365 81156 81520 82431 83708 85081 86435 87724 88623 88695 88080 87575 87692 87968
55485H7968l38r90j012o39m27l48n7M07P32Q86R70P41j09j247j828j521q52m66
$$ 87968 87630 86640 85628 84989 84562 84214 84157 84564 85296 86182 87152 87893 87784 86537 84709 83188 82336 81870
55467H1870m30m41l30q7K65N81N70J44l65n51l60RL95O68O29L17K18P50J517J595
$$ 81870 81440 80999 80669 80582 80847 81428 81998 82142 81777 81226 80866 80875 81270 81938 82567 82884 83102 83852 85369 86964
55447H6964P15k83m99j18j3m58q07n44o0o3n88j021q86k47N53J130J145N63r3
$$ 86964 87679 87396 86897 86779 86766 86308 85501 84957 84897 84834 84246 83225 82339 82092 82645 83775 84920 85483 85390
55428H5390j86K47N22K71p4K4L85M41J11k15l48m15l05L49J434K126J805Q92K78
$$ 85390 85204 85451 85973 86244 86170 86194 86579 87020 87131 86916 86568 86153 85848 86197 87631 89757 91562 92454 92732
55409I2732J77J8n69j204j387j168q64m71J53O66M40m93j189q39K61J143J303
$$ 92732 92909 92927 92358 91154 89767 88599 87735 87264 87417 88083 88523 88030 86841 86002 86263 87406 88709
55392H8709R42L06o22j596j957j348k53N41Q42J014J260J283P69j28q69r97n15
$$ 88709 89651 89957 89335 87739 85782 84434 84181 84722 85564 86578 87838 89121 89890 89762 88893 87896 87381
55375H7381J37M99M86L39J81j11n27p42n41k24k49o20r53j007q61n96k05K79P54
$$ 87381 87518 88017 88503 88842 89023 88912 88385 87643 87102 86878 86629 86009 85056 84049 83188 82592 82387 82666 83420
55356H3420J149J322R57r1j344k018j773r05J47J060J489J174L62l07m86l69j66
$$ 83420 84569 85891 86848 86757 85413 83395 81622 80717 80864 81924 83413 84587 84949 84642 84156 83787 83621
55339H3621J99O29O47lq95j388j288p46O7Q43J095O93J78L8L8k46n51l52Q6n4
$$ 83621 83820 84449 85096 85093 84198 82810 81522 80776 80843 81686 82781 83474 83652 83690 83728 83482 82931 82579 82665 82611
55319H2611q25j270p55J89O93N90K63l7j86R7R31J849K147J618O64j50m48j49
$$ 82611 81786 80516 79761 79950 80643 81233 81496 81459 81273 81370 82301 84150 86297 87915 88579 88429 87981 87832
55301H7832M42Q16P34M42K33J03N5K89P17O50l64j630j940j081l0M20M87O50Q22
$$ 87832 88274 89090 89824 90266 90499 90602 90657 90946 91663 92313 91949 90319 88379 87298 87268 87688 88175 88825 89647
55282H9647P60P18J024J309Q23m57j623j841j196l99l0j90o38j012j014n99n0
$$ 89647 90407 91125 92149 93458 94281 93824 92201 90360 89164 88765 88735 88545 87907 86895 85881 85282 85232
55265H5232K79K88K06L11O60J045J247J231J127J050R74P15N7r39j703j514l59
$$ 85232 85511 85799 86005 86316 86976 88021 89268 90499 91626 92676 93650 94365 94422 93483 91780 90266 89907
55248H9907P99R66K86k00O1N31N20J81P1K14J89r9l27l81m65n63m14j54l96j275
$$ 89907 90706 91672 91958 91758 91819 92350 92870 93051 93122 93336 93525 93426 93099 92718 92253 91690 91276 91122 90726 89451
55228H9451j914j387M1J129J081K99k45m5O34J135R24%r94j209l81Q33J460J139
$$ 89451 87537 86150 86191 87320 88401 88700 88455 88410 89044 90179 91103 91103 90109 88900 88519 89352 90812 91951
55210I1951L13m13p96q03l27N70J344J352O25j13l28k32k65m12m11l55n22p77
$$ 91951 92264 91851 91055 90252 89925 90495 91839 93191 93816 93703 93375 93143 92878 92466 92055 91700 91178 90401
55192I0401o94l26k75p83j273j151o53m23n27l85L52J332J967K016J614J036N72
$$ 90401 89707 89381 89106 88323 87050 85899 85246 84823 84296 83911 84263 85595 87562 89578 91192 92228 92800
55175I2800L83L68L03J86K46M99O51N09K97K26J00l04o09j95Q05J428J102M66
$$ 92800 93183 93551 93854 94040 94286 94785 95436 95945 96242 96468 96568 96264 95655 95460 96265 97693 98795 99261
55157I9261N17J212J616J229O07M19M91J63p51j742k206j973j345q06o46o47l12
$$ 99261 99778 100990 102606 103835 104442 104861 105352 105515 104764 103022 100816 98843 97498 96692 96046 95399 95087
55140I5087M40J060J053O37L75M16M93N17O52Q50Q30N42K17j47q13j693k181j836
$$ 95087 95527 96587 97640 98277 98652 99068 99561 100078 100730 101580 102410 102952 103169 103022 102209 100516 98335 96499
55122I6499q65K38J149J593J264K96n80p03k30J82J83p6l81o46q17q57p79n32
$$ 96499 95634 95872 97021 98614 99878 100174 99594 98891 98661 98843 99026 98950 98569 97923 97106 96249 95470 94938
55104I4938m7M50N29K06J18N80R35M71l40l92L92Q57K58p39j090o27J09P35J080
$$ 94938 94891 95341 95870 96076 96194 96774 97709 98180 97840 97448 97840 98697 98955 98216 97126 96499 96608 97343 98423
55085I8423R31L26j44L2N33O08J27l57n05n23n52l66P4L26R9k08k8N52R44Q58
$$ 98423 99354 99680 99536 99568 100101 100709 100836 100479 99974 99451 98899 98533 98607 98933 99032 98824 98796 99348 100292 101150
55065A01150N14J29l28p42p55k24M48P74P39O24N09L26K15L95O18L17n53j200
$$ 101150 101664 101793 101465 100723 99968 99744 100192 100966 101705 102329 102838 103164 103379 103774 104392 104709 104156 102956
55047A02956r21m3M60J58m29o49m87l70m97n89k77M52J209J538J317P67J83k81
$$ 102956 102035 101992 102452 102610 102181 101532 101045 100675 100178 99589 99312 99764 100973 102511 103828 104595 104778 104497
55029A04497n50n47l84l72n97n81J69J301J790J140K8n71n38m91p54r83q39m81
$$ 104497 103947 103400 103016 102644 102047 101466 101635 102936 104726 105866 105894 105323 104785 104294 103540 102557 101718 101237
55011A01237k28o6J81N07P97J055J286J299R67N67N09P47Q84Q26Q58R78P59J98
$$ 101237 101009 100943 101124 101631 102428 103483 104769 106068 107035 107602 108111 108858 109742 110568 111426 112404 113163 113361
54993A13361P6Q90J854J765O87j34l8K93J55q3K03P10P41M67O62J350J596Q54
$$ 113361 113437 114327 116181 117946 118633 118499 118461 118754 118909 118826 119029 119739 120480 120947 121609 122959 124555 125409
54975A25409k59q55q40p13p09o11k41K78O36N61Qo91r92n94K49R50J085O93J87
$$ 125409 125150 124295 123455 122742 122033 121422 121181 121459 122095 122656 122664 121973 120981 120387 120636 121586 122671 123364 123551
54956A23551k5R6K37J86J09K71N67O76N16K95P6k94q02j175j244j163j027o58
$$ 123551 123526 123622 123859 124045 124154 124425 124992 125668 126184 126479 126555 126261 125459 124284 123040 121877 120850 120192
54938A20192J31J166K012K285J907J205P85J006J567J888J891J959K200K348K477
$$ 120192 120323 121489 123501 125786 127693 128898 129683 130689 132256 134144 136035 137994 140194 142542 145019
54923A45019L156M493N657N928N698N791O154N989M997L702K510J221l43j887
$$ 145019 148175 152668 158325 164253 169951 175742 181896 187885 192882 196584 199094 200315 199972 198085
54909A98085l136m291n599o810p393p204o580n872n076l961k517j186n47o46q53
$$ 198085 194949 190658 185059 178249 170856 163652 157072 151200 146124 142163 139646 138460 137913 137267 136414
54894A36414o32k72m34j075j356o90N20J414J593J333J248J838L059M164M357
$$ 136414 135782 135510 135076 134001 132645 131955 132475 133889 135482 136815 138063 139901 142960 147124 151481
54879A51481L836L746M748O109O671O304N769N432M850L633J963J62j616l167
$$ 151481 155317 159063 163811 169920 176591 182895 188664 194096 198946 202579 204542 204704 203088 199921
54865A99921m250n075o116p234p621o992o139n749n323m147k780k444l127l420
$$ 199921 195671 190596 184480 177246 169625 162633 156494 150745 145422 141275 138495 136051 132924 129504
54851A29504k479j109m61n55p69r84j405j738j435o19p3k90j085j982k493k100
$$ 129504 127025 125916 125455 124900 124131 123147 121742 120004 118569 117950 117877 117587 116502 114520 112027 109927
54835A09927o90J010J985J980J543J085N48k2l49m81p75j100q45l1M18M4l70k1
$$ 109927 109237 110247 112232 114212 115755 116840 117388 117366 117017 116536 115761 114661 113816 113785 114203 114247 113877 113856
54817A13856N92N08j62n54n07n87p67l74N68J075P46M55R55J619J396M26k54j94
$$ 113856 114448 114956 114794 114240 113733 113146 112379 112005 112573 113648 114394 114849 115804 117423 118819 119245 118991 118797
54799A18797O2k8l49n27m06K9O98J268J377J073P43N24J86l07n80l29K36P47J181
$$ 118797 118859 118831 118482 117955 117549 117578 118276 119544 120921 121994 122737 123261 123447 123140 122560 122231 122467 123214 124395
54780A24395J692K175K322K063J693J555J779K306K935L447L868M511N504O370
$$ 124395 126087 128262 130584 132647 134340 135895 137674 139980 142915 146362 150230 154741 160245 166615
54766A66615O441N753N134N177N567N679N431N051M299K617N6k480m193n134n764
$$ 166615 173056 178809 183943 189120 194687 200366 205797 210848 215147 217764 217820 215340 211147 206013 200249
54751B00249o238o446o410o198n611m495l258k594k602k596j997j100o20p46r86
$$ 200249 194011 187565 181155 174957 169346 164851 161593 158999 156397 153801 151804 150704 150084 149338 148352
54736A48352r24p27o90n33L73K027L441L590K623J709J747K601L670M701N671
$$ 148352 147428 146701 146011 145478 145851 147878 151319 154909 157532 159241 160988 163589 167259 171960 177631
54721A77631O274O071N125M053L350K927K384J414o8j979m015n716o673o758o191
$$ 177631 183905 189976 195101 199154 202504 205431 207815 209229 209161 207182 203167 197451 190778 184020 177829
54706A77829n450m972m786m503l834l010k524k521k761k951k864k227r82L45R93
$$ 177829 172379 167407 162621 158118 154284 151274 148750 146229 143468 140517 137653 135426 134444 134789 135782
54691A35782P90K76p0k72m21l44n6q0p78j668j898j294n00j70l62p37r17o59q2
$$ 135782 136572 136848 136778 136506 136085 135741 135685 135605 134827 133159 131261 129967 129467 129297 128935 128198 127281 126622 126540
54672A26540K52j79j128j674j233k30M27L80J08K21O69Q18K64n31o50J61J119
$$ 126540 126792 126613 125485 123811 122578 122348 122775 123155 123263 123484 124153 124971 125235 124704 124054 124215 125334
54655A25334J335Q97N46N07K83l17o52j63O76R15M26mJ78N82N39Rm73m46L0N40
$$ 125334 126669 127566 128112 128619 128902 128585 127933 127770 128446 129361 129787 129783 129961 130543 131082 131091 130618 130172 130202 130742
54635A30742P19N61L99M82O02L47l04q55q90n11q2K04L01J58j49k93k9M80Q68
$$ 130742 131461 132022 132421 132903 133505 133852 133548 132693 131803 131292 131210 131414 131715 131873 131724 131431 131402 131882 132750
54616A32750R88Q37L83j92l17L48J206J313O69K86P16J220Q05m74j688k178j897
$$ 132750 133738 134575 134958 134766 134449 134797 136003 137316 137985 138271 138987 140207 141012 140538 138850 136672 134775
54599A34775j060n2N14K97j62j4P56J278R96L30r4k92n71q04n50K37J095J596
$$ 134775 133715 133663 134177 134474 134312 134298 135054 136332 137328 137658 137564 137272 136701 135897 135347 135584 136679 138275
54581A38275J624J185L92k99k48O22J510J503O75O4M15J287J660J249P40P31R16
$$ 138275 139899 141084 141476 141177 140929 141551 143061 144564 145239 145303 145718 147005 148665 149914 150654 151385 152301
54564A52301O23k08r86j300j362j521j679j366l82Q50J622J639J303J208J425
$$ 152301 152924 152716 151730 150430 149068 147547 145868 144502 144120 144970 146592 148231 149534 150742 152167
54549A52167J536J303R31O15K91K7K72J187K124K259J569P62L75M64R39J612K023
$$ 152167 153703 155006 155937 156552 156843 156870 157142 158329 160453 162712 164281 165043 165418 165882 166821 168433 170456
54532A70456J794J202Q41P60N57K46K45M39J08q67j606j455r34q16r69p99k93
$$ 170456 172250 173452 174293 175053 175610 175856 176101 176540 176648 175781 174175 172720 171786 170970 170001 169202 168909
54515A68909J08L48O39Q30N64l3n31r00j400j904k002j704j294o60M89J699J962
$$ 168909 169017 169365 170004 170834 171398 171365 170834 169934 168534 166630 164628 162924 161630 160970 161459 163158 165120
54498A65120J141L34M22R41R09K25m29o34n09j53M96J230J548J277Q43P79J168
$$ 165120 166261 166595 167017 167958 168867 169092 168663 168029 167520 167367 167863 169093 170641 171918 172761 173540 174708
54481A74708J703K036J985J519P95J63k4L33J031J804K462K795K570J882J324
$$ 174708 176411 178447 180432 181951 182746 182909 182885 183218 184249 186053 188515 191310 193880 195762 197086
54466A97086J390J731J505O30Q3N15J179Q89k25q77m36L38N40K78J14P2j37l98
$$ 197086 198476 200207 201712 202342 202425 202940 204119 205008 204783 203906 203470 203808 204348 204626 204740 204812 204675 204277
54448B04277l44k5J67P1j29l13n36q29j175j547j738j393n81k8l12j077j575j766
$$ 204277 203933 203908 204075 204146 204017 203704 203168 202339 201164 199617 197879 196486 195905 195877 195565 194488 192913 191147
54430A91147k107k474k129r98n3M4r8L96J253J429O66j79l01J48M97L63j48p06
$$ 191147 189040 186566 184437 183439 183386 183430 183332 183728 184981 186410 187076 186897 186596 186744 187241 187604 187456 186750
54412A86750j019j074j188j494j480n05J112K107J664M30l97n08m76n34j89P89
$$ 186750 185731 184657 183469 181975 180495 179990 181102 183209 184873 185303 184906 184398 183922 183388 183199 183988
54396A83988J732J851J211N26K30K14L19N64Q99J099J060R11O65R7q62j781k057
$$ 183988 185720 187571 188782 189308 189538 189752 190071 190635 191534 192633 193693 194604 195269 195366 194504 192723 190666
54379A90666j537o11K22O93P44M07j77p85j244j437j189l33R15J852J837R98J73
$$ 190666 189129 188518 188740 189433 190177 190584 190407 189622 188378 186941 185752 185419 186334 188186 190023 191021 191194
54362A91194O8O10J236J576J617J389P97p8q37j130j049r58j020j075r99r41j103
$$ 191194 191262 191872 193108 194684 196301 197690 198487 198409 197572 196442 195393 194435 193415 192340 191341 190400 189297
54345A89297j447j728j790j657j375r91o49n58p18p89m58J33M83L18j22m11m44
$$ 189297 187850 186122 184332 182675 181300 180309 179660 179102 178384 177595 177137 177270 177753 178071 177949 177538 177094
54328A77094m57o79j088j448j504j174o51k60j15n3N9R7r3l14j86L81J006J179
$$ 177094 176637 175958 174870 173422 171918 170744 170093 169833 169718 169665 169724 169821 169728 169414 169228 169609 170615 171794
54310A71794P03j44p70o92l2N29N09J89J25K97K42k2R9P69J239Q18j00n58k66
$$ 171794 172497 172353 171583 170891 170859 171388 171897 172086 172211 172508 172750 172728 172827 173596 174835 175653 175553 174995 174729
54291A74729J99K74m0m79q32r09o25k57k98q80j491j480p21K85Q20N07l38r62
$$ 174729 174928 175202 175162 174683 173851 172942 172317 172060 171762 170882 169391 167911 167190 167475 168295 168802 168464 167502
54273A67502q51k49J89J58j30l96n73n90k91K71P09P63O65P49R49Q67L60k26m01
$$ 167502 166651 166402 166591 166749 166619 166223 165650 165060 164769 165040 165749 166512 167177 167926 168875 169742 170102 169876 169475
54254A69475J06J152K187K439J477k19j497j578q23k67m92j172j642j604j169
$$ 169475 169581 170733 172920 175359 176836 176617 175120 173542 172719 172452 171960 170788 169146 167542 166373
54239A66373o11k41k36l10J00R67J350N23q44j397q42j26J65N01J086J030k53
$$ 166373 165762 165521 165285 164975 165075 166042 167392 167915 167071 165674 164832 164706 164871 165372 166458 167488 167235
54222A67235j626j545k85M01k07r75q40k59j83n65p73p47q66r97o32J08L97j53
$$ 167235 165609 164064 163779 164180 163973 162998 162158 161899 161716 161151 160378 159631 158765 157768 157136 157244 157641 157488
54204A57488q36o44M83J518J486N68j33P7O42N66k40r33j014q80r13p00K63J560
$$ 157488 156652 156008 156491 158009 159495 160063 159930 160007 160649 161215 160975 160042 159028 158148 157235 156535 156798 158358
54186A58358K212J818Q71L5m04m48k10L8j0l78p39p14k29L02K47o09j562j613
$$ 158358 160570 162388 163259 163294 162890 162442 162232 162270 162260 161882 161143 160429 160200 160502 160749 160140 158578 156965
54168A56965p31r7o02j632j839q65L92J052J067P60K85k42n96p26p79p29l29L23
$$ 156965 156234 156137 155535 153903 152064 151199 151591 152643 153710 154470 154755 154513 153917 153191 152412 151683 151354 151677
54150A51677P17N96L31L37N31O41O75O91M87m8n35n91m26m31l84K30J139J358
$$ 151677 152394 152990 153321 153658 154189 154830 155505 156196 156683 156635 156100 155509 155083 154652 154268 154498 155637 156995
54132A56995N99j39Q2P39O21l23p42K63J911K705K205J195M67J39M6J53L48L49
$$ 156995 157594 157455 157537 158276 158897 158574 157832 158095 160006 162711 164916 166111 166578 166717 166763 166916 167264 167613
54114A67613J26M5K70L81m2o96q80m27J66M52M79M45L24L6l16n82p52q80q95o63
$$ 167613 167739 167784 168054 168435 168393 167697 166817 166390 166556 167008 167487 167932 168256 168292 167976 167394 166642 165762 164867 164204
54094A64204j90L40O33N27J71m6M6J66K2j61N4N63P73N06K75M34O29M69K74N69
$$ 164204 164014 164354 164987 165514 165685 165639 165685 165851 165873 165712 165766 166329 167102 167608 167883 168317 168946 169415 169689 170258
54074A70258J118J260R81R41J343J569J132M02k9j83l44l70P9P56R54M44k16m36
$$ 170258 171376 172636 173617 174558 175901 177470 178602 179004 178975 178792 178448 178078 178157 178913 179867 180311 180095 179659
54056A79659k18R5L54O07Q62J076J253J379J401J474K002L186M584N364N085M189
$$ 179659 179441 179536 179890 180497 181359 182435 183688 185067 186468 187942 189944 193130 197714 203078 208163 212352
54040B12352L688M297N760P105P678P890Q581R767J0519J0307R833J0010J0594
$$ 212352 216040 220337 226097 233202 240880 248770 257351 267118 277637 287944 297777 307787 318381
54027C18381J0513R329P594N811L917J888R8j346k916m799o296o630o029n381
$$ 318381 328894 338223 345817 351628 355545 357433 357531 356185 353269 348470 342174 335544 329515 324134
54013C24134n167n252n445n661n709n515n455n822o121n590m445l765m013m410
$$ 324134 318967 313715 308270 302609 296900 291385 285930 280108 273987 268397 263952 260187 256174 251764
53999B51764m177l645l535l714l462k625j838j544j514j436j462j886k513k710
$$ 251764 247587 243942 240407 236693 233231 230606 228768 227224 225710 224274 222812 220926 218413 215703
53985B15703k081r59j67k07p63j122j063r92j197j367j192r54j061j284j099o03
$$ 215703 213622 212663 212496 212289 211526 210404 209341 208349 207152 205785 204593 203639 202578 201294 200195 199592
53969A99592m24o75p29k37L11L72J57K04O16J197J877K443K260J044l36o11L48
$$ 199592 199168 198493 197764 197527 197838 198210 198367 198571 199187 200384 202261 204704 206964 208008 207672 207061 207409
53952B07409J499K104K436K837K981K622K330K807L864M732N046N023M849M560
$$ 207409 208908 211012 213448 216285 219266 221888 224218 227025 230889 235621 240667 245690 250539 255099
53938B55099M333M360M526M672M962N430N368L998J788K51K30J056J781K414L417
$$ 255099 259432 263792 268318 272990 277952 283382 288750 292748 294536 294787 295017 296073 297854 300268 303685
53923C03685M512M873M330L653L623M252N050N669O088O378O530O508O472O722
$$ 303685 308197 313070 317400 321053 324676 328928 333978 339647 345735 352113 358643 365151 371623 378345
53909C78345P264P562P026N764M433L294J946K43j139j609j636k131l059l456
$$ 378345 385609 393171 400197 405961 410394 413688 415634 415877 414738 413129 411493 409362 406303 402847
53895D02847k880k080j988k623l399m016m561m937m808m158l485l236l305l351
$$ 402847 399967 397887 395899 393276 389877 385861 381300 376363 371555 367397 363912 360676 357371 354020
53881C54020l430l896m698n157m740l750k922k488k115j613j108m89O18K094L170
$$ 354020 350590 346694 341996 336839 332099 328349 325427 322939 320824 319211 318103 317614 318232 320326 323496
53866C23496L499L678M167M209K715j04k941n137p236r589j1364j1542j0324q960
$$ 323496 326995 330673 334840 339049 341764 341660 338719 333582 326346 316757 305393 293851 283527 274567
53852B74567q359q343q099p069n404l808k891k602k420k001j500j174j054j046
$$ 274567 266208 257865 249766 242697 237293 233485 230594 227992 225572 223571 222071 220897 219843 218797
53838B18797j049q67l27L53O32L20j23j89O9L30N42P93Q32K76p14j378j195m56
$$ 218797 217748 216881 216554 216907 217539 217859 217736 217547 217616 217946 218488 219281 220113 220389 219675 218297 217102 216646
53820B16646J95N65J013J770K505K710K386K007J857J684J244Q92J264K419L679
$$ 216646 216841 217406 218419 220189 222694 225404 227790 229797 231654 233338 234582 235474 236738 239157 242836
53805B42836M313M177L662L271L358L971M839N569N901N750N124M267L711L760
$$ 242836 247149 251326 254988 258259 261617 265588 270427 275996 281897 287647 292771 297038 300749 304509
53791C04509M036L923L457L199L152K550J015o18j240q35m36q56j993l230m038
$$ 304509 308545 312468 315925 319124 322276 324826 325841 325223 323983 323148 322712 321856 319863 316633 312595
53776C12595m234m057m054m552n232n466n042m293l559k941k546k600l026l264
$$ 312595 308361 304304 300250 295698 290466 285000 279958 275665 272106 269165 266619 264019 260993 257729
53762B57729k784j757r43r53j725k706l406l694l632l233k474j483n86j10j37
$$ 257729 254945 253188 252245 251292 249567 246861 243455 239761 236129 232896 230422 228939 228353 228243 228106
53747B28106m51o66n38k07o9k53m22k55L1k3l85n34j99L26P38J124J572J858J836
$$ 228106 227655 226989 226451 226244 226175 225922 225500 225245 225276 225253 224868 224334 224135 224461 225199 226323 227895 229753 231589
53728B31589J833K170K605K635K279J988J878J586J038Q29J463K476K788J965
$$ 231589 233422 235592 238197 240832 243111 245099 246977 248563 249601 250430 251893 254369 257157 259122
53714B59122P96N01J486L163M717N751O073N439L909K231J336J451K077K761L433
$$ 259122 259918 260419 261905 265068 269785 275536 281609 287048 290957 293188 294524 295975 298052 300813 304246
53699C04246L991M118L761L323L132L071K912K665K361J933J504J458J828K044
$$ 304246 308237 312355 316116 319439 322571 325642 328554 331219 333580 335513 337017 338475 340303 342347
53685C42347J594O68j90p41r99r22o23n26q37j116q14q3M87O51O00M03m5o59j207
$$ 342347 343941 344609 344419 343678 342679 341757 341134 340608 339771 338655 337841 337758 338245 338896 339496 339899 339854 339195 337988
53666C37988j625j878j780j357j198j743k446k340j382n09k99l51k06r4m65j225
$$ 337988 336363 334485 332705 331348 330150 328407 325961 323621 322239 321730 321431 321080 320874 320780 320315 319090
53650C19090j926k276k162j469l16P96J285R53J08n68l35J026K826L966L921L012
$$ 319090 317164 314888 312726 311257 310941 311737 313022 313975 314083 313515 313180 314206 317032 320998 324919 327931
53634C27931J845Q41L06L81Q07J193J615K462L597M257M034L426L111L160L273
$$ 327931 329776 330617 330923 331304 332111 333304 334919 337381 340978 345235 349269 352695 355806 358966 362239
53619C62239L343L395L344L204L254L653M149M444M506M374M030L720L941M742
$$ 362239 365582 368977 372321 375525 378779 382432 386581 391025 395531 399905 403935 407655 411596 416338
53605D16338N509N803N871N881N322L907K522K285K901K965J911O97L47O84R23
$$ 416338 421847 427650 433521 439402 444724 448631 451153 453438 456339 459304 461215 461912 462259 462943 463866
53590D63866P75M19m6o11j060j249j443j905k353k276j753j477j852k458k641
$$ 463866 464641 465060 465014 464403 463343 462094 460651 458746 456393 454117 452364 450887 449035 446577 443936
53575D43936k261j649j013l00L69N98J96m14o21k87K27O25R45J245J383J238Q54
$$ 443936 441675 440026 439013 438713 439082 439680 439876 439462 438841 438554 438781 439406 440351 441596 442979 444217 445071
53558D45071K33o93j692k176j846j137p11o88p42o98o05l28L52J202J688J779
$$ 445071 445304 444611 442919 440743 438897 437760 437049 436361 435619 434921 434316 433988 434340 435542 437230 439009
53542D39009K106L043M116M739N113N879P091Q117Q542Q655Q958R654J0728J2076
$$ 439009 441115 444158 448274 453013 458126 464005 471096 479213 487755 496410 505368 515022 525750 537826
53528E37826J3334J3969J3946J3996J4822J6275J7737J9028K0405K1788K2759
$$ 537826 551160 565129 579075 593071 607893 624168 641905 660933 681338 703126 725885
53517G25885K3436K4533K6227K7639K8019K7977K8776L0664L2573L3435L3224
$$ 725885 749321 773854 800081 827720 855739 883716 912492 943156 975729 1009164 1042388
53506A042388L2692L2601L3210L4120L4604L4405L4105L4318L4767L4728L4184
$$ 1042388 1075080 1107681 1140891 1175011 1209615 1244020 1278125 1312443 1347210 1381938 1416122
53495A416122L3782L3659L3246L2337L1439L0692K9343K6904K4099K2004K0853
$$ 1416122 1449904 1483563 1516809 1549146 1580585 1611277 1640620 1667524 1691623 1713627 1734480
53484A734480K0311K0374K1129K2056K2451K2289K1928K1204J9629J7389J5222
$$ 1734480 1754791 1775165 1796294 1818350 1840801 1863090 1885018 1906222 1925851 1943240 1958462
53473A958462J3341J1182Q422N435K557m30l833p591j1518j5501j9119k1628k2693
$$ 1958462 1971803 1982985 1991407 1996842 1999399 1998969 1995136 1987545 1976027 1960526 1941407 1919779 1897086
53460A897086k2900k3285k4460k6384k8601l0595l2153l3522l4958l6078l6123
$$ 1897086 1874186 1850901 1826441 1800057 1771456 1740861 1708708 1675186 1640228 1604150 1568027
53449A568027l4971l3502l2624l2366l2124l1477l0361k8822k6940k4882k2731
$$ 1568027 1533056 1499554 1466930 1434564 1402440 1370963 1340602 1311780 1284840 1259958 1237227
53438A237227k0386j7820j5270j2933j0735q490o145l630q84J799L848N182O567
$$ 1237227 1216841 1199021 1183751 1170818 1160083 1151593 1145448 1141818 1140934 1142733 1146581 1151763 1158330
53425A158330Q789J1695J4497J6807J8856K0901K2945K4977K6983K8752L0085
$$ 1158330 1167119 1178814 1193311 1210118 1228974 1249875 1272820 1297797 1324780 1353532 1383617
53414A383617L1275L2821L4745L6710L8816M1587M4985M8150N0571N2895N6017
$$ 1383617 1414892 1447713 1482458 1519168 1557984 1599571 1644556 1692706 1743277 1796172 1852189
53403A852189N9799O3312O6028O8149O9954P1557P3237P5308P7513P9212Q0312
$$ 1852189 1911988 1975300 2041328 2109477 2179431 2250988 2324225 2399533 2477046 2556258 2636570
53392B636570Q1376Q2569Q3177Q2565Q1103P9492P7618P4853P1274O7804O5078
$$ 2636570 2717946 2800515 2883692 2966257 3047360 3126852 3204470 3279323 3350597 3418401 3483479
53381C483479O2789O0303N7420N4279N1003M7651M4222M0389L5559K9439K2339
$$ 3483479 3546268 3606571 3663991 3718270 3769273 3816924 3861146 3901535 3937094 3966533 3988872
53370C988872J4703O519k602j3019k4748l7268m9476o0141o8710p5444q0710q4532
$$ 3988872 4003575 4010094 4007492 3994473 3969725 3932457 3882981 3822840 3754130 3678686 3597976 3513444
53358C513444q7054q8847r0273r0956r0449q9039q7400q5699q3806q2046q0965
$$ 3513444 3426390 3337543 3247270 3156314 3065865 2976826 2889426 2803727 2719921 2637875 2556910
53347B556910q0407p9687p8644p7664p6578p4558p1395o7946o4775o1297n6987
$$ 2556910 2476503 2396816 2318172 2240508 2163930 2089372 2017977 1950031 1885256 1823959 1766972
53336A766972n2600m9157m6301m2803l8410l4068l0384k7000k3696k0996j9193
$$ 1766972 1714372 1665215 1618914 1576111 1537701 1503633 1473249 1446249 1422553 1401557 1382364
53325A382364j7645j5703j3757j2584j2084j1410j0134q583p035n266l118j002
$$ 1382364 1364719 1349016 1335259 1322675 1310591 1299181 1289047 1280464 1273429 1268163 1265045 1264043
53313A264043M94J338K134L511N505P614R415J1082J3102J5485J7585J8995K0287
$$ 1264043 1264537 1265875 1268009 1271520 1277025 1284639 1294054 1305136 1318238 1333723 1351308 1370303 1390590
53300A390590K2349K5173K7876K9923L1641L3340L4671L5407L6209L7846L9835
$$ 1390590 1412939 1438112 1465988 1495911 1527552 1560892 1595563 1630970 1667179 1705025 1744860
53289A744860M0810M0282L9239L8733L8494L7516L5531L3274L1461L0006K8288
$$ 1744860 1785670 1825952 1865191 1903924 1942418 1979934 2015465 2048739 2080200 2110206 2138494
53278B138494K5805K2509J8703J4807J1010P149K987j498o144j0881j5729k0567
$$ 2138494 2164299 2186808 2205511 2220318 2231328 2238477 2241464 2239966 2233822 2222941 2207212 2186645
53266B186645k5159k9415l3518l7680m1786m5320m7704m8834m9271m9719n0246
$$ 2186645 2161486 2132071 2098553 2060873 2019087 1973767 1926063 1877229 1827958 1778239 1727993
53255A727993n0270m9422m8134m7034m6064m4705m2933m1501m1037m1355m1822
$$ 1727993 1677723 1628301 1580167 1533133 1487069 1442364 1399431 1357930 1316893 1275538 1233716
53244A233716m2125m2334m2441m2175m1350m0148l8939l7788l6250l3790l0480
$$ 1233716 1191591 1149257 1106816 1064641 1023291 983143 944204 906416 870166 836376 805896
53233H05896k7060k4188k1802j9449j7051j4982j3479j2478j1965j2024j2359
$$ 805896 778836 754648 732846 713397 696346 681364 667885 655407 643442 631418 619059
53222F19059j2382j1970j1745j2175j2832j2953j2396j1583j0762r979r595j0038
$$ 619059 606677 594707 582962 570787 557955 545002 532606 521023 510261 500282 490687 480649
53210D80649j0954j1247j0314q757p554o921o425n878n525n500n606n736o025
$$ 480649 469695 458448 448134 439377 431823 424902 418477 412599 407074 401574 395968 390232 384207
53197C84207o471o767o711o477o213n669m642l630l449m179m930m895m263l683
$$ 384207 377736 370969 364258 357781 351568 345899 341257 337627 334178 329999 325069 320174 315911 312228
53183C12228l235k491j505j076j707k722k949k084r79n91r87j509j623j312p94
$$ 312228 308993 306502 304997 303921 302214 299492 296543 294459 293480 292889 291902 290393 288770 287458 286664
53168B86664k03L88Q05Q37M66r1n79q96j045j006p26k88N6R8o9j13J38M14K54
$$ 286664 286461 286849 287654 288491 288957 288866 288287 287391 286346 285340 284614 284326 284382 284480 284411 284298 284436 284850 285104
53149B85104m59j308j842k059k225k336k040j178j18N82O44J80m78q99p72k54
$$ 285104 284645 283337 281495 279436 277211 274875 272835 271657 271539 272121 272765 272945 272467 271568 270796 270542
53133B70542P1j08m07k68K83P49R45J185J654K038J967J422O37j90p82q37m21
$$ 270542 270613 270505 270098 269830 270113 270862 271807 272992 274646 276684 278651 280073 280710 280520 279738 278901 278480
53116B78480q5k63p39j027j056j132j324j366j201j155j420j720j731j610j719
$$ 278480 278395 278132 277393 276366 275310 274178 272854 271488 270287 269132 267712 265992 264261 262651 260932
53101B60932k036k189k067j969k041j916j216k21L84L06p3k30j6M31R04J125Q27
$$ 260932 258896 256707 254640 252671 250630 248714 247498 247277 247661 247967 247894 247664 247648 248079 248983 250108 250935
53084B50935J29m32m73k23j28j48J53Q86J592J841J733J656J683J495Q44m8o15
$$ 250935 251064 250632 250159 249936 249808 249660 249813 250699 252291 254132 255865 257521 259204 260699 261543 261495 260880
53067B60880n23KM48O15O78P30N52N0m69o83p02p77q48p31n59n60n62k55K29M65
$$ 260880 260357 260359 260807 261422 262100 262830 263382 263432 262963 262280 261578 260801 259953 259222 258663 258103 257541 257286 257515 257980
53047B57980M38M83N69K38n44j183j296j241j416j612j429r93p65r21j284j634
$$ 257980 258418 258901 259470 259708 259164 257981 256685 255444 254028 252416 250987 249994 249229 248308 247024 245390
53031B45390j773j471p27Q8N96P78Q13P40N06J11m06r04r91k80R69J841J708Q49
$$ 245390 243617 242146 241419 241507 242103 242881 243694 244434 244940 245051 244645 243741 242750 242470 243439 245280 246988 247837
53013B47837q3p47r83n06O44J717J967J526J063P90L94j76n31n10l68k39J14Q01
$$ 247837 247754 247007 246024 245518 246162 247879 249846 251372 252435 253225 253619 253443 252912 252402 252034 251795 251909 252710
52995B52710J423J423O08o64j627j556m27R37J627J540J185Q34L77p5p6N44J447
$$ 252710 254133 255556 256164 255500 253873 252317 251890 252827 254454 255994 257179 258013 258390 258315 258239 258783 260230
52978B60230K264K902L249L043K247J224L76j03q8M75J265J753J872K051K376
$$ 260230 262494 265396 268645 271688 273935 275159 275535 275432 275344 275819 277084 278837 280709 282760 285136
52963B85136K258J296N1n93n71n61q93j155r76o49o67r73j088q84q52j420k265
$$ 285136 287394 288690 288741 288148 287577 287016 286123 284968 283992 283343 282676 281703 280615 279731 278879 277459 275194
52946B75194k585k040j133n87o17r62j413j931k351k362j870j142n05n7K08K19
$$ 275194 272609 270569 269436 268849 268232 267270 265857 263926 261575 259213 257343 256201 255696 255639 255847 256066
52930B56066j10o68j145j231q42j86L95O74O14K97j51m70m05K6M84O70N39J98
$$ 256066 255956 255288 254143 252912 252070 251884 252279 252953 253567 253864 253713 253243 252838 252864 253348 254018 254557 254755
52912B54755k03m26l50k96p37j491j742j097j32M57P44J088J384J410J418J564
$$ 254755 254552 254126 253776 253480 252743 251252 249510 248413 248281 248738 249482 250570 251954 253364 254782 256346
52896B56346J310K40q33p89R1N12J28k11j49l32q19n99N85J277L16j315j822j012
$$ 256346 257656 257896 257063 256274 256365 256877 257005 256794 256645 256313 255494 254895 255480 256757 257073 255758 253936 252924
52878B52924j04J93J58q8p56j486j426m77M58P10N69N84Q70J298J759K022J821
$$ 252924 252820 253013 253171 253083 252327 250841 249415 248938 249396 250106 250675 251259 252129 253427 255186 257208 259029
52861B59029J344J153J438J729J560R89L34k67p73j061j056r39j066j707k818
$$ 259029 260373 261526 262964 264693 266253 267242 267576 267309 266536 265475 264419 263480 262414 260707 257889
52846B57889l913m350l912l036k230j532q44m77p95j445j614j102n77o35j071
$$ 257889 253976 249626 245714 242678 240448 238916 238072 237595 236800 235355 233741 232639 232062 231427 230356
52831B30356j263r53l82O2J60K2k1K03M19K46k79p57q63n17K10R90J260Q62M28
$$ 230356 229093 228140 227758 227820 227980 228002 227981 228184 228603 228849 228570 227813 226950 226433 226643 227633 228893 229755 230183
52812B30183N88J015R66N67O96J493J996J591R46R54J417J452P06m47j538k275
$$ 230183 230771 231786 232752 233319 234015 235508 237504 239095 240041 240995 242412 243864 244570 244123 242585 240310
52796B40310k491k285k035j872j443n85J35J01m54p60n07p5R3j61p44j264j171
$$ 240310 237819 235534 233499 231627 230184 229599 229734 229835 229381 228621 228114 228039 228132 227971 227227 225963 224792
52779B24792m05K80J79l58l67M33J379J844J800J442R23N60O30Q07L41q72j991
$$ 224792 224387 224667 224846 224488 224121 224554 225933 227777 229577 231019 231942 232502 233132 233939 234280 233408 231417
52762B31417k220j674r84m81r1K99P43J215J439J043Q7q25j245j255j004l32P26
$$ 231417 229197 227523 226539 226058 225967 226266 227009 228224 229663 230706 230793 229968 228723 227468 226464 226132 226858
52745B26858J548J574J103Q64J031J162J022Q41Q25R35J149J510J818J806J620
$$ 226858 228406 229980 231083 231947 232978 234140 235162 236003 236828 237763 238912 240422 242240 244046 245666
52730B45666J670J904J793J183O06M42L84N2k51%O02P44N3r24j348r37j03M63
$$ 245666 247336 249240 251033 252216 252822 253264 253648 253700 253449 253449 254051 254795 254848 253924 252576 251639 251536 251999
52712B51999L86j50o65r56j222j591j786j562j151r14p45l06K46L29k11q07q85
$$ 251999 252385 252235 251570 250614 249392 247801 246015 244453 243302 242388 241643 241337 241583 241912 241701 240894 240009
52695B40009m42K74J159J996K247J600N47m5J09O01J028J365J610J524J024M87
$$ 240009 239567 239841 241000 242996 245243 246843 247390 247345 247454 248055 249083 250448 252058 253582 254606 255093
52679B55093L38N15N95M01J75J31J26o0l60n31n27n17n63n16l16j85l29o01n96
$$ 255093 255431 255946 256541 256942 257117 257248 257374 257314 256954 256423 255896 255379 254816 254300 253984 253799 253470 252869 252273
52660B52273j06O92J392J637J332P17K08Km9j21j03J65N26O19L39j00n53j033
$$ 252273 252167 252859 254251 255888 257220 257937 258145 258147 258098 257977 257874 258039 258565 259184 259523 259423 258870 257837
52642B57837j433j472j085n34m0M04P29O58J26l85k89M63J346J819J691J117M66
$$ 257837 256404 254932 253847 253313 253273 253677 254406 255064 255190 254805 254516 254979 256325 258144 259835 260952 261418
52625B61418J37K97P45J093J043M92m25j334j848j895j713j494j258j067j039
$$ 261418 261555 261852 262597 263690 264733 265225 264800 263466 261618 259723 258010 256516 255258 254191 253152
52610B53152j039p33j26L76O52J141K017K604K138R05q5l33j74M4L71P44P25Q9
$$ 253152 252113 251380 251254 251630 252282 253423 255440 258044 260182 261087 261002 260669 260495 260539 260910 261654 262379 262468
52592B62468p23j049o78Q7Q18J253J379J373J347J196Q29M26J89j9l73n24J20
$$ 262468 261745 260696 260018 260105 260923 262176 263555 264928 266275 267471 268300 268726 268915 268896 268523 267999 268119
52575B68119J471K581K605J567J38r71j291p96j21j29r36j696j600q39k04r4l26
$$ 268119 269590 272171 274776 276343 276481 275510 274219 273423 273302 273173 272237 270541 268941 268102 267898 267804 267478
52558B67478o54j012j259j185p72k50J24J94j09o69j138j204q91n27l79m19l72
$$ 267478 266824 265812 264553 263368 262596 262346 262470 262664 262555 261886 260748 259544 258653 258126 257747 257328 256956
52541B56956K4O93J157R89L91M2L18Q17Q85L67k78m63L2Q16J139O42o9j8Q00J280
$$ 256956 256980 257673 258830 259819 260210 260252 260570 261387 262272 262639 262361 261898 261930 262746 263885 264527 264458 264440 265240 266520
52521B66520O77k81l84M08J019Q60N50Q48J529J756J327J022J638K945L808L412
$$ 266520 267197 266916 266532 266940 267959 268819 269369 270217 271746 273502 274829 275851 277489 280434 284242 287654
52505B87654K130R68L75l8o46j279j733k171k655k815k487k238k520k747k011
$$ 287654 289784 290752 291127 291089 290443 289164 287431 285260 282605 279790 277303 275065 272545 269798 267787
52490B67787n26N22N69K41K19L77L87L77M90L89j84p81p72k10L54P75J388K248
$$ 267787 267261 267783 268352 268593 268812 269189 269576 269953 270443 270832 270648 269867 269095 268885 269239 270014 271402 273650
52472B73650K882K907K558K277K061J543P00J35M25J362K158K412K465K633K544
$$ 273650 276532 279439 281997 284274 286335 287878 288578 288713 289138 290500 292658 295070 297535 300168 302712
52457C02712J711L87o96j334j943k652l000k748k350k290k401k235j758j336j277
$$ 302712 304423 304810 304114 302780 300837 298185 295185 292437 290087 287797 285396 283161 281403 280067 278790
52442B78790j686k403k860k412j168j31o3n17n20J04P12R06R58J117J152Q46M42
$$ 278790 277104 274701 271841 269429 268261 268130 268067 267550 267030 267134 267846 268752 269710 270827 271979 272825 273267
52425B73267L34M71M38ro03q70p15o03r59j380q71Q69K799L587L137K543K674
$$ 273267 273601 274072 274510 274501 273898 273028 272313 271710 270751 269371 268500 269369 272168 275755 278892 281435 284109
52408B84109L400M236N108O114O994P291O956O431O085N668M481K168p57l289
$$ 284109 287509 291745 296853 302967 309961 317252 324208 330639 336724 342392 346873 349041 348284 344995
52394C44995m861n629n834n381m358l506l440l719l370k297j362r98n55N38J738
$$ 344995 340134 334505 328671 323290 318932 315426 311986 308267 304897 302600 301238 300240 299685 300223 301961
52379C01961K113J670J320J697K540L218L395L173K892K893L219L602L805L849
$$ 301961 304074 305744 307064 308761 311301 314519 317914 321087 323979 326872 330091 333693 337498 341347
52365C41347L761L290K166O09p10j302j317j311j600j904j634o30N29J126J088
$$ 341347 345108 348398 350564 351173 350463 349161 347844 346533 344933 343029 341395 340765 341294 342420 343508
52350C43508Q98Q77R70J248J933K799L109K594K014K224L024L498L255K782K711
$$ 343508 344406 345283 346253 347501 349434 352233 355342 357936 359950 362174 365198 368696 371951 374733 377444
52335C77444L276M377N706O889P844Q872J0100J1071J1443J1720J2629J3860J4333
$$ 377444 380720 385097 390803 397692 405536 414408 424508 435579 447022 458742 471371 485231 499564
52322D99564J3747J3105J3392J4473J5588J6259J6292J5542J4247J3252J3235
$$ 499564 513311 526416 539808 554281 569869 586128 602420 617962 632209 645461 658696
52311F58696J3969J4715J5147J5422J5616J5564J5238J4785J4211J3369J2347
$$ 658696 672665 687380 702527 717949 733565 749129 764367 779152 793363 806732 819079
52300H19079J1554J1284J1251J0694R070O667M422K894J615j60k268l780m331
$$ 819079 830633 841917 853168 863862 872932 879599 884021 886915 888530 888370 886102 882322 877991
52287H77991m617n312o195o745o912o756n942m371k792k016j771j142P1J288K278
$$ 877991 873374 868062 861867 855122 848210 841454 835512 831141 828349 826333 824562 823420 823491 824779 827057
52272H27057L487N117O690P751Q380Q837R296J0012J1140J2242J2603J2291J2127
$$ 827057 830544 835661 842351 850102 858482 867319 876615 886627 897767 910009 922612 934903 947030
52259I47030J2474J2687J2255J1699J1767J2252J2288J1476J0139Q754P576O615
$$ 947030 959504 972191 984446 996145 1007912 1020164 1032452 1043928 1054067 1062821 1070397 1077012
52247A077012N449L474P65j617k768l080l608m661n727o621p685q821r243q619
$$ 1077012 1082461 1085935 1086700 1085083 1082315 1079235 1075627 1070966 1065239 1058618 1050933 1042112 1032869 1024250
52233A024250p673p202p076o734o199n949o057o058n633m896m015l004j951j102
$$ 1024250 1016577 1009375 1002299 995565 989366 983417 977360 971302 965669 960773 956758 953754 951803 950701
52219I50701n49j55J61L37M86J006K097L370M250M639M914N301N661N895O148
$$ 950701 950152 949997 950158 950495 950981 951987 954084 957454 961704 966343 971257 976558 982219 988114 994262
52204I94262O389O189N363M547M598N427N987N627M989N137O149P055P120O647
$$ 994262 1000651 1006840 1012203 1016750 1021348 1026775 1032762 1038389 1043378 1048515 1054664 1061719 1068839 1075486
52190A075486O391O457O184M967L004J054m02j530k672l741m345m475m604n113
$$ 1075486 1081877 1088334 1094518 1099485 1102489 1103543 1103141 1101611 1098939 1095198 1090853 1086378 1081774 1076661
52176A076661n895o720p543q205q201p263n932n034m655m131l062j805p57J74
$$ 1076661 1070766 1064046 1056503 1048298 1040097 1032834 1026902 1021868 1017213 1013082 1010020 1008215 1007458 1007632
52162A007632J192K087K552K668K644K328J428J48q62j250j231j189j279j505
$$ 1007632 1008824 1010911 1013463 1016131 1018775 1021103 1022531 1022679 1021817 1020567 1019336 1018147 1016868 1015363
52148A015363j779j788j173LJ140J703J672J345R54O93Q18J330J791J875J916
$$ 1015363 1013584 1011796 1010623 1010626 1011766 1013469 1015141 1016486 1017440 1018133 1018951 1020281 1022072 1023947 1025863
52133A025863K525L732N007O143P608R780J2321J4546J6107J7033J7506J7948
$$ 1025863 1028388 1032120 1037127 1043270 1050878 1060658 1072979 1087525 1103632 1120665 1138171 1156119
52121A156119J9007K0849K2633K3214K2447K1278K0527K0005J9068J7562J5823
$$ 1156119 1175126 1195975 1218608 1241822 1264269 1285547 1306074 1326079 1345147 1362709 1378532
52110A378532J4005J1906R486P249N870N508N658N724N623N683N964N977N205
$$ 1378532 1392537 1404443 1413929 1421178 1427048 1432556 1438214 1443938 1449561 1455244 1461208 1467185 1472390
52097A472390L707J987L75j220l003m985o927q472r472j0336j1763j3781j5335
$$ 1472390 1476097 1478084 1478459 1477239 1474236 1469251 1462324 1453852 1444380 1434044 1422281 1408500 1393165
52084A393165j5337j3961j2383j1248j0124q505o575m672k659m34J540K761L469
$$ 1393165 1377828 1363867 1351484 1340236 1330112 1321607 1315032 1310360 1307701 1307267 1308807 1311568 1315037
52071A315037M323N543O902Q346R981J1542J2458J2588J2376J2210J2000J1524
$$ 1315037 1319360 1324903 1331805 1340151 1350132 1361674 1374132 1386720 1399096 1411306 1423306 1434830
52059A434830J0849J0205R671R143Q552P956P464O974O019M086J269j603l789
$$ 1434830 1445679 1455884 1465555 1474698 1483250 1491206 1498670 1505644 1511663 1515749 1517018 1515415 1511626
52046A511626n370p002q999j1078j2851j4211j5217j5909j6312j6437j6241j5793
$$ 1511626 1506256 1499254 1490255 1479177 1466326 1452115 1436898 1420989 1404677 1388240 1371999 1356206
52034A356206j5330j4945j4349j3291j2051j1160j0687j0208r501q847q586q707
$$ 1356206 1340876 1325931 1311582 1298291 1286240 1275080 1264393 1254185 1244684 1235837 1227251 1218544
52022A218544q996r275r420r314q902q153p126o216o083o903p927q255p965p873
$$ 1218544 1209548 1200273 1190853 1181539 1172637 1164484 1157358 1151142 1145059 1138156 1130229 1121974 1114009 1106136
52008A106136q369r149j0110j1636j3745j5737j7041j7832j8344j8336j7715j7078
$$ 1106136 1097767 1088618 1078508 1066872 1053127 1037390 1020349 1002517 984173 965837 948122 931044
51996I31044j6865j6514j5267j3495j2295j1934j1635j0974j0548j0953j1812
$$ 931044 914179 897665 882398 868903 856608 844674 833039 822065 811517 800564 788752
51985G88752j2398j2694j3261j4251j5067j5038j4137j2959j2144j1838j1728
$$ 788752 776354 763660 750399 736148 721081 706043 691906 678947 666803 654965 643237
51974F43237j1480j1049j0448r471p908n987m172k467m09K044M026M661M229L873
$$ 643237 631757 620708 610260 600789 592881 586894 582722 580255 579846 581890 585916 590577 594806 598679
51960E98679M201M642M367L359K209J202J17j198k460l266l474l170k447j409
$$ 598679 602880 607522 611889 615248 617457 618659 618776 617578 615118 611852 608378 605208 602761 601352
51946F01352k24R32J966K882L812M978O493Q129R495J0333J0494R740P968N705
$$ 601352 601128 602060 604026 606908 610720 615698 622191 630320 639815 650148 660642 670382 678350 684055
51932F84055L832K568J134j236m328p336r853j2000j3829j5116j5664j5524j4909
$$ 684055 687887 690455 691589 690353 686025 678689 668836 656836 643007 627891 612227 596703 581794
51919E81794j4244j3892j3612j2672j0947r367q633p990o295l934k390j997j417
$$ 581794 567550 553658 540046 527374 516427 507060 498427 490437 484142 480208 477818 475821 474404
51906D74404L00K354L590M125M767N612O115O045N564M659L320J918P85l20j709
$$ 474404 474704 477058 480648 484773 489540 495152 501267 507312 512876 517535 520855 522773 523558 523238 521529
51891E21529l055l783l873l601k818j231Q43K775M492O215P468P236N335K900
$$ 521529 518474 514691 510818 507217 504399 503168 504011 506786 511278 517493 524961 532197 537532 540432
51877E40432J275Q52J185J628J683J104K9j205k366l328l914m177m633n642o666
$$ 540432 541707 542559 543744 545372 547055 548159 548188 546983 544617 541289 537375 533198 528565 522923 516257
51862E16257o769n847m744m089l668l124k545k061j432n27K40M12J41j09k74p07
$$ 516257 509488 503641 498897 494808 491140 488016 485471 483410 481978 481451 481691 482103 482244 482135 481861 481154
51846D81154j556k563l459m277n177o040o454o167n447m784m225l351k080r95
$$ 481154 479598 477035 473576 469299 464122 458082 451628 445461 440014 435230 431005 427654 425574 424579
51832D24579m54P0J118K103J986R09J18J83L11k57j152j724k062k459k532j753
$$ 424579 424125 424195 425313 427416 429402 430311 430429 430612 430923 430666 429514 427790 425728 423269 420737 418984
51816D18984m53N00P69O41L28j41m52j49P34J657K161K073J298m2j313j735j232
$$ 418984 418531 419031 419800 420441 420769 420628 420176 420027 420761 422418 424579 426652 427950 427908 426595 424860 423628
51799D23628n02j85k96m72m18j25J36l3o74j293j461j454j870k650l035k532j545
$$ 423628 423126 422941 422645 422173 421755 421630 421766 421733 421059 419766 418305 416851 414981 412331 409296 406764 405219
51782D05219p98n75o10m73O9Q57J353J168O25M77J026J812K376K870L748N086
$$ 405219 404421 403846 403236 402763 402832 403689 405042 406210 406835 407312 408338 410150 412526 415396 419144 424230
51766D24230O564P819Q535Q383P280N674M150K768J099j007l027m385n201o069
$$ 424230 430794 438613 447148 455531 462811 468485 472635 475403 476502 475495 472468 468083 462882 456813
51752D56813p096p627p138o150n696n931n861m657k785j295l39Q55K596M101M597
$$ 456813 449717 442090 434952 428802 423106 417175 411314 406657 403872 402577 402238 403093 405689 409790 414387
51737D14387M462M687N547O403O792P028P544Q021P684O317M684L747L708L941
$$ 414387 418849 423536 429083 435486 442278 449306 456850 464871 472555 478872 483556 487303 491011 494952
51723D94952L819L319K699J855L97j643l549m606m834m788m822m926n139n646
$$ 494952 498771 502090 504789 506644 507041 505398 501849 497243 492409 487621 482799 477873 472734 467088
51709D67088o295o467n787m697l910l426k584j147K60R68J181J569K210K405J571
$$ 467088 460793 454326 448539 443842 439932 436506 433922 432775 433035 434003 435184 436753 438963 441368 442939
51694D42939Qj319j564o17P39J346O71o40j547j923k601l949n048m795l410k171
$$ 442939 442947 441628 440064 439447 440186 441532 442203 441563 440016 438093 435492 431543 426495 421700 418290 416119
51678D16119j827j891j544o15N32J600K543L398M216M946N314N113M705M876N846
$$ 416119 414292 412401 410857 410242 410774 412374 414917 418315 422531 427477 432791 437904 442609 447485 453331
51663D53331O817O860N993M864L624J799o75k999m438n234n978o435n681l495
$$ 453331 460148 467008 473001 477865 481489 483288 482613 479614 475176 469942 463964 457529 451848 448353
51649D48353r57O98J382J785K005J246r03l538n330o021o458p185p651p112n791
$$ 448353 447396 448094 449476 451261 453266 454512 453609 450071 444741 438720 432262 425077 417426 410314 404523
51634D04523m592l955l528l020k689k794k905k334j010M17J379J939K471L051
$$ 404523 399931 395976 392448 389428 386739 383945 381040 378706 377696 378113 379492 381431 383902 386953
51620C86953L367L127K378J451O68J28k82o22q42r71j244j817k403k514k068j512
$$ 386953 390320 393447 395825 397276 397944 398072 397790 397168 396326 395355 394111 392294 389891 387377 385309 383797
51604C83797j264j266j254j089o76K29J740L534N083O155O879P446Q007Q695R395
$$ 383797 382533 381267 380013 378924 378248 378477 380217 383751 388834 394989 401868 409314 417321 426016 435411
51589D35411R571Q712O925M756K567M87j060j512r46j53L85J069K370M069N797
$$ 435411 444982 453694 460619 465375 467942 468429 467369 465857 464911 464758 465143 466212 468582 472651 478448
51574D78448P821J0488J3192J4800J5239J5745J7269J9311K0815K1697K2797K4535
$$ 478448 486269 496757 509949 524749 539988 555733 573002 592313 613128 634825 657622 682157
51562F82157K6350K7551K8134K8519K8839K8925K8758K8417K7485K4948K0066
$$ 682157 708507 736058 764192 792711 821550 850475 879233 907650 935135 960083 980149
51551I80149J3130N164l055j1254j9136k6052l1411l5090l7253l8098l7980l7362
$$ 980149 993279 998443 995388 984134 964998 938946 907535 872445 835192 797094 759114 721752
51539G21752l6281l4129l0534k6263k2672k0218j8059j5348j2366j0053q797q134
$$ 721752 685471 651342 620808 594545 571873 551655 533596 518248 505882 495829 487032 478898
51527D78898p521o860o262n680m951m093l357l014l065l160k805j866q28m60j170
$$ 478898 471377 464517 458255 452575 447624 443531 440174 437160 434095 430935 428130 426264 425436 424976 423806
51512D23806k623m021m649m284l262k268j889k164k554k504k013j538j355j240
$$ 423806 421183 417162 412513 408229 404967 402699 400810 398646 396092 393588 391575 390037 388682 387442
51498C87442q59k55K76O22R13J220J476J708K055K476K700K553K265K200K455
$$ 387442 386583 386328 386604 387226 388139 389359 390835 392543 394598 397074 399774 402327 404592 406792 409247
51483D09247K769K794K416J840J389J063M72o61j946k664k704k719l251m124m901
$$ 409247 412016 414810 417226 419066 420455 421518 421990 421329 419383 416719 414015 411296 408045 403921 399020
51468C99020n498n926n863n073m038l550l696l817l479k987k758k681k371j756
$$ 399020 393522 387596 381733 376660 372622 369072 365376 361559 358080 355093 352335 349654 347283 345527
51454C45527j105o23k33L04J202K507M031N477O597P243P482P684Q330R419J0354
$$ 345527 344422 343799 343566 343870 345072 347579 351610 357087 363684 370927 378409 386093 394423 403842 414196
51439D14196J0667J0591J0416R627P421M103J170k76n22m45m16n42j262k869m782
$$ 414196 424863 435454 445870 455497 462918 467021 468191 467915 467393 466948 466532 465990 464728 461859 457077
51424D57077o034o418o460o370n758m536l394k987l122l171k954k764k657k254
$$ 457077 451043 444625 438165 431795 426037 421501 418107 415120 411998 408827 405873 403109 400452 398198
51410C98198j366m38n7j87j85L86J245J829K027K150K383K627K845L160L546L839
$$ 398198 396832 396394 396337 396150 395965 396351 397596 399425 401452 403602 405985 408612 411457 414617 418163 422002
51394D22002M184N016O404P806Q852R924J1602J3874J6434J9395K3056K7070L0693
$$ 422002 426186 431202 437606 445412 454264 464188 475790 489664 506098 525493 548549 575619 606312
51381F06312L3811L7107M0951M4719M7522M9087M9554M8797M6413M2091L5693
$$ 606312 640123 677230 718181 762900 810422 859509 909063 957860 1004273 1046364 1082057
51370A082057K7164J6804N451n957j6847k6816l5185m1306m5309m8084n0298n1685
$$ 1082057 1109221 1126025 1131476 1125519 1108672 1081856 1046671 1005365 960056 911972 861674 809989
51358H09989n1440m9152m5260m0677l6152l1893k7772k3760k0119j7095j4620
$$ 809989 758549 709397 664137 623460 587308 555415 527643 503883 483764 466669 452049
51347D52049j2455j0530q960p807p001o426n883n051l765k320j280r26j052j319
$$ 452049 439594 429064 420104 412297 405296 398870 392987 387936 384171 381851 380571 379645 378593 377274
51333C77274j520j502j130n15JJ90J17j63p60j613k234k184j633j134r28p33k36
$$ 377274 375754 374252 373122 372607 372608 372798 372915 372752 371992 370379 368145 365961 364328 363194 362266 361533 361297
51316C61297N25J233J520J106M5j127j706j438p00q4J04r4m36o72o89o28o89q43
$$ 361297 361822 363055 364575 365681 365726 364599 362893 361455 360755 360671 360775 360681 360245 359573 358884 358256 357567 356724
51298C56724q89q16q11r34j030j058j208j500j541r49K07J552K800L816M499M854
$$ 356724 355835 355019 354208 353274 352244 351186 349978 348478 346937 345988 346195 347747 350547 354363 358862 363716
51282C63716N036N104M907M479M265M558M890M481L218J756N68n22j740k740k999
$$ 363716 368752 373856 378763 383242 387507 392065 396955 401436 404654 406410 406978 406456 404716 401976 398977
51267C98977k568j990j584j169n35R4K29l10j154j738j849j752j798k051k360
$$ 398977 396409 394419 392835 391666 391131 391225 391454 391144 389990 388252 386403 384651 382853 380802 378442
51252C78442k644k895l037k998k878k810k638j975p24O94J678J929J540P97P2
$$ 378442 375798 372903 369866 366868 363990 361180 358542 356567 355843 356537 358215 360144 361684 362481 362553
51237C62553k55PO15J002P30jm31%R23J328P52j11k66L52R53J055J030J356J888
$$ 362553 362298 362305 362920 363922 364652 364651 364220 364220 365143 366471 367223 367112 366846 367198 368151 369206 370236 371592 373480
51218C73480K133J948J625J458J491J594J594J382J016O44L21N1ML45P85P05J2
$$ 373480 375613 377561 379186 380644 382135 383729 385323 386705 387721 388365 388686 388737 388741 389086 389871 390576 390588
51201C90588m63J22J477K381K018P82k90n63j67L56N27J96l89p64n91oM43L77
$$ 390588 390125 390247 391724 394105 396123 396905 396615 396052 395885 396241 396768 396964 396575 395811 395220 395214 395657 396034
51183C96034L0l7K51K70m47j416j684j026k10J3l52r14j506k038k184j679p78
$$ 396034 396064 396027 396278 396548 396101 394685 393001 391975 391765 391778 391426 390512 389006 386968 384784 383105 382327
51166C82327k5L36M76O51R95J561K260K862L226L362L129K173M96j132j794j360
$$ 382327 382302 382638 383114 383765 384760 386321 388581 391443 394669 398031 401160 403333 403829 402697 400903 399543
51150C99543m59L12P80Q98N98M9m08o92j012j413j632j547j394j373j325j042
$$ 399543 399084 399396 400176 401074 401672 401721 401313 400621 399609 398196 396564 395017 393623 392250 390925 389883
51134C89883o77n10m74j98M88J302J834J972J971K146K599L218L804M091L745
$$ 389883 389206 388696 388222 388024 388512 389814 391648 393620 395591 397737 400336 403554 407358 411449 415194
51119D15194K620J141J32R8P06J237J349J245J249J527K049K560K614J994J076
$$ 415194 417814 418955 419087 419185 419891 421128 422477 423722 424971 426498 428547 431107 433721 435715 436791
51104D36791N31O62J247J905K348K383K094J929K197K499K171J290P40J016J492
$$ 436791 437322 437984 439231 441136 443484 445867 447961 449890 452087 454586 456757 458047 458787 459803 461295
51089D61295J228J97p32q01n3Q31J129N66m77j328j687j795j910j902j600j197
$$ 461295 462523 462720 461988 461187 461134 461965 463094 463660 463183 461855 460168 458373 456463 454561 452961 451764
51073D51764r85q41m23K26P57J140J821K998M177M790N054N794P368R154J0274
$$ 451764 450779 449938 449515 449741 450498 451638 453459 456457 460634 465424 470478 476272 483640 492794 503068
51058E03068J0539J0405J0169R706R011Q499Q412Q374P940P436P630Q696R970
$$ 503068 513607 524012 534181 543887 552898 561397 569809 578183 586123 593559 601189 609885 619855
51045F19855J0773J0942J0460R184P225N103L115R49j586l864n022n186n440o615
$$ 619855 630628 641570 652030 661214 668439 673542 676657 677606 676020 672156 667134 661948 656508 649893
51031F49893q545j0587j2350j3707j4470j4458j3694j2310j0360p978n623l875
$$ 649893 641348 630761 618411 604704 590234 575776 562082 549772 539412 531434 525811 521936
51019E21936k856k063q89P30K349L603M564N421O069O293O300O626P412Q056P892
$$ 521936 519080 517017 516128 516858 519207 522810 527374 532795 538864 545157 551457 558083 565495 573551 581443
51004E81443P059O396O525P257P943Q191Q142Q184Q551R171R853J0528J1263J2094
$$ 581443 588502 594898 601423 608680 616623 624814 632956 641140 649691 658862 668715 679243 690506 702600
50990G02600J2912J3544J3853J3713J3074J2115J1204J0588J0183R852R740J0103
$$ 702600 715512 729056 742909 756622 769696 781811 793015 803603 813786 823638 833378 843481
50978H43481J0811J1313J1295J1105J1271J1736J1975J1886J2225J3803J6560
$$ 843481 854292 865605 876900 888005 899276 911012 922987 934873 947098 960901 977461
50967I77461J9825K3314K7292L1693L5750L8839M1259M3665M6059M7836M8669
$$ 977461 997286 1020600 1047892 1079585 1115335 1154174 1195433 1239098 1285157 1332993 1381662
50956A381662M8776M8372M7426M5920M3809M0746L6429L1449K7122K4140K1897
$$ 1381662 1430438 1478810 1526236 1572156 1615965 1656711 1693140 1724589 1751711 1775851 1797748
50945A797748J9467J6804J4512J2869J1608J0489R494Q517P278N580L338M76k912
$$ 1797748 1817215 1834019 1848531 1861400 1873008 1883497 1892991 1901508 1908786 1914366 1917704 1918180 1915268
50932A915268o420r637j2621j5695j8916k2085k5227k8647l2380l5982l9029m1573
$$ 1915268 1908848 1899211 1886590 1870895 1851979 1829894 1804667 1776020 1743640 1707658 1668629 1627056
50920A627056m3873m5846m7017m7027m6090m4781m3385m1584l9001l5923l3127
$$ 1627056 1583183 1537337 1490320 1443293 1397203 1352422 1309037 1267453 1228452 1192529 1159402
50909A159402l0967k8971k6619k4081k1845j9924j7904j5689j3661j2126j0996
$$ 1159402 1128435 1099464 1072845 1048764 1026919 1006995 989091 973402 959741 947615 936619
50898I36619j0117r564r373r206q517p083n333m026l456l082k246j186q54j472
$$ 936619 926502 916938 907565 898359 889842 882759 877426 873400 869944 866862 864616 863430 862576 861104
50884H61104j994j393N3J394K437L635M888N580N770O287P350Q102P991P799Q555
$$ 861104 859110 857717 857770 859164 861601 865236 870124 875704 881474 887761 895111 903213 911204 919003 927558
50869I27558J0126J1607J2599J3377J4141J4943J6182J8375K1423K4717K7965
$$ 927558 937684 949291 961890 975267 989408 1004351 1020533 1038908 1060331 1085048 1113013
50858A113013L1329L4752L7863M0818M4584M9957N6610O3474O9845P5766Q1559
$$ 1113013 1144342 1179094 1216957 1257775 1302359 1352316 1408926 1472400 1542245 1618011 1699570
50847A699570Q7409R3361R9377J05169J10195J13920J16105J16746J15796J13009
$$ 1699570 1786979 1880340 1979717 2084886 2195081 2309001 2425106 2541852 2657648 2770657
50837B770657J08140J01276R2851Q3227P2347O0012M6560L3130K1136J1398L804
$$ 2770657 2878797 2980073 3072924 3156151 3228498 3288510 3335070 3368200 3389336 3400734 3404538
50826C404538k215o907r908j0675r068n550r36L836P788J0012R935P390K422m877
$$ 3404538 3402323 3395416 3385508 3374833 3365765 3360215 3359279 3363115 3370903 3380915 3390850 3398240 3400662 3395785
50812C395785j4211k4923l6199m7539n8900p0323q1455r1383r9011j03646j05401
$$ 3395785 3381574 3356651 3320452 3272913 3214013 3143690 3062235 2970852 2871841 2768195 2662794
50801B662794j04943j02724r8492r1721q2508p1840o0845m9984l9181k8507j8277
$$ 2662794 2557851 2455127 2356635 2264914 2182406 2110566 2049721 1999737 1960556 1932049 1913772
50790A913772q547R93J0300J8521K4709K8833L1502L2793L2026K9010K4860K0958
$$ 1913772 1905225 1906218 1916518 1935039 1959748 1988581 2020083 2052876 2084902 2113912 2138772 2159730
50778B159730J7396J3141P677J791l452p932j2304j6999k1922k6867l1768l6489
$$ 2159730 2177126 2190267 2197944 2199735 2196283 2188351 2176047 2159048 2137126 2110259 2078491 2042002
50766B042002m0819m4768m8573n2255n5405n7588n8695n8712n7346n4322n0023
$$ 2042002 2001183 1956415 1907842 1855587 1800182 1742594 1683899 1625187 1567841 1513519 1463496
50755A463496m5441m1289l7417l3286k8766k4182j9784j5585j1651q066m615r06
$$ 1463496 1418055 1376766 1339349 1306063 1277297 1253115 1233331 1217746 1206095 1198029 1193414 1192508
50743A192508L071O940J0666J4733J9365K4022K8209L2338L7173M2634M7811N2200
$$ 1192508 1195579 1202519 1213185 1227918 1247283 1271305 1299514 1331852 1369025 1411659 1459470 1511670
50731A511670N6264O0579O4901O8371P0383P1117P1239P1168P0496O8283O4116
$$ 1511670 1567934 1628513 1693414 1761785 1832168 1903285 1974524 2045692 2116188 2184471 2248587
50720B248587N8707N2963M6753L9203L0166K0566J1146J688p974j6849k3465k7279
$$ 2248587 2307294 2360257 2407010 2446213 2476379 2496945 2508091 2509779 2501805 2484956 2461491 2434212
50708B434212k8765k8298k5801k1517j6437j1528o927k296K201N669P212O653
$$ 2434212 2405447 2377149 2351348 2329831 2313394 2301866 2294939 2292643 2294844 2300513 2307725 2314378
50696B314378M318K83n681j3331k1522k8987l5445m1339m6551m9932n0408m8042
$$ 2314378 2318696 2318979 2313298 2299967 2278445 2249458 2214013 2172674 2126123 2076191 2025783 1977741
50684A977741m3631l7688l0249k1478j1893j947Q310J9084L0530M2508N4499O5853
$$ 1977741 1934110 1896422 1866173 1844695 1832802 1830855 1839165 1858249 1888779 1931287 1985786 2051639
50672B051639P6198Q5515R3708J00352J04994J07400J07278J04150R7943Q9455
$$ 2051639 2127837 2213352 2307060 2407412 2512406 2619806 2727084 2831234 2929177 3018632
50662C018632P9880O9906N9698M9585M0178L1718K3740J5716P753M39n994j2159
$$ 3018632 3098512 3168418 3228116 3277701 3317879 3349597 3373337 3389053 3396806 3397245 3391251 3379092
50650C379092j9046k6934l4843m1284m5532m7874m8676m7788m5085m1008l6049
$$ 3379092 3360046 3333112 3298269 3256985 3211453 3163579 3114903 3067115 3022030 2981022 2944973
50639B944973l0113k3041j5487q597k924J756N595Q382J0149J1386J2406J2962
$$ 2944973 2914860 2891819 2876332 2867735 2864811 2866567 2872162 2880544 2890693 2902079 2914485 2927447
50627B927447J2677J1410R032N259q9p039j5712k5962l6495m4977m9532m9917
$$ 2927447 2940124 2951534 2960566 2965825 2965736 2958697 2942985 2917023 2880528 2835551 2786019 2736102
50615B736102m7008m1690l4653k6802j9031j1705m927P37M335N354M047R19l665
$$ 2736102 2689094 2647404 2612751 2585949 2566918 2555213 2550286 2551023 2555358 2560712 2564759 2565678 2562013
50602B562013r329j5685k2773l1047m0541n0245n8717o5235o9995p3322p5162
$$ 2562013 2552684 2536999 2514226 2483179 2442638 2392393 2333676 2268441 2198446 2125124 2049962
50591B049962p5466p4543p2635o9509o4992n9741n4846n0542m5945m0406l4567
$$ 2049962 1974496 1899953 1827318 1757809 1692817 1633076 1578230 1527688 1481743 1441337 1406770
50580A406770k9578k5638k2016j8301j4883j2119r682p069m327j867J91K177M476
$$ 1406770 1377192 1351554 1329538 1311237 1296354 1284235 1274553 1267484 1263157 1261290 1261481 1263658 1268134
50567A268134P149R888J2316J4505J7121K0804K5372L0045L4505L9288M4954N1298
$$ 1268134 1275283 1285171 1297487 1311992 1329113 1349917 1375289 1405334 1439839 1479127 1524081 1575379
50555A575379N7715O4005P0300P6393Q1598Q5345Q7483Q8010Q6824Q3989Q0015
$$ 1575379 1633094 1697099 1767399 1843792 1925390 2010735 2098218 2186228 2273052 2357041 2437056
50544B437056P5597P1124O6582O2098N8319N6050N5445N5840N6456N7012N7469
$$ 2437056 2512653 2583777 2650359 2712457 2770776 2826826 2882271 2938111 2994567 3051579 3109048
50533C109048N7609N7317N7077N7596N8961O0607O2177O3988O6529O9968P4119
$$ 3109048 3166657 3223974 3281051 3338647 3397608 3458215 3520392 3584380 3650909 3720877 3794996
50522C794996P8409Q1749Q3051Q2130P9620P5775O9858O1046M9384L5467J9765
$$ 3794996 3873405 3955154 4038205 4120335 4199955 4275730 4345588 4406634 4456018 4491485 4511250
50511D511250K727j4873l2272m9113o5053p9377r1457j01179j08306j11884j11061
$$ 4511250 4513977 4499104 4466832 4417719 4352666 4273289 4181832 4080653 3972347 3860463 3749402
50500C749402j06190r8339q7996p5032n9877m3731k7599j2004K199J3672K1547
$$ 3749402 3643212 3544873 3456877 3381845 3321968 3278237 3250638 3238634 3240833 3254505 3276052
50489C276052K5805K6362K2554J4083J849j2745k8817m5817o2775p8429r1919
$$ 3276052 3301857 3328219 3350773 3364856 3366705 3353960 3325143 3279326 3216551 3138122 3046203
50478C046203j02867j11008j16229j18860j19449j18274j15405j11092j05683
$$ 3046203 2943336 2832328 2716099 2597239 2477790 2359516 2244111 2133019 2027336
50469B027336r9329r2222q5016p8447p2543o6647o0419n4338m9004m4323l9731
$$ 2027336 1928007 1835785 1750769 1672322 1599779 1533132 1472713 1418375 1369371 1325048 1285317
50458A285317l4991l0369k6136k2258j8613j5274j2389r954p915o326n168m078
$$ 1285317 1250326 1219957 1193821 1171563 1152950 1137676 1125287 1115333 1107418 1101092 1095924 1091846
50446A091846k517l65J902L795N435P314R579J1788J3424J4389J4983J5678J6962
$$ 1091846 1089329 1088964 1090866 1094661 1100096 1107410 1116989 1128777 1142201 1156590 1171573 1187251 1204213
50433A204213J9144K2068K5087K7545K9302L0726L2260L4011L5735L7145L8227
$$ 1204213 1223357 1245425 1270512 1298057 1327359 1358085 1390345 1424356 1460091 1497236 1535463
50422A535463L9221M0299M1377M2335M3327M4626M6240M7928M9681N1860N4746
$$ 1535463 1574684 1614983 1656360 1698695 1742022 1786648 1832888 1880816 1930497 1982357 2037103
50411B037103N8049O1042O3095O3989O3815O2658O0433N7050N2702M7835M2670
$$ 2037103 2095152 2156194 2219289 2283278 2347093 2409751 2470184 2527234 2579936 2627771 2670441
50400B670441L6910L0124K2333J3963N303l741j3340k3453l3861m4183n3830o2135
$$ 2670441 2707351 2737475 2759808 2773771 2779074 2775333 2761993 2738540 2704679 2660496 2606666 2544531
50388B544531o8625p3053p5236p5114p2886o8743o2663n4871m6285l7906k9731
$$ 2544531 2475906 2402853 2327617 2252503 2179617 2110874 2048211 1993340 1947055 1909149 1879418
50377A879418k1043j1933l755K235N971P850P693N162O87m895j1278j8500k6071
$$ 1879418 1858375 1846442 1842687 1844922 1850893 1858743 1866436 1871598 1872285 1867390 1856112 1837612 1811541
50364A811541l3133l9336m4737m8911n1101n1369n0763n0045m8971m7162m4971
$$ 1811541 1778408 1739072 1694335 1645424 1594323 1542954 1492191 1442146 1393175 1346013 1301042
50353A301042m2987m1217l9323l7340l5576l4011l2246k9971k7229k4291k1527
$$ 1301042 1258055 1216838 1177515 1140175 1104599 1070588 1038342 1008371 981142 956851 935324
50342I35324j9208j7240j5228j3052j1137r889r040p881o143m299l063k676k716
$$ 935324 916116 898876 883648 870596 859459 849570 840530 832649 826506 822207 819144 816468 813752
50329H13752k454j450L7J321J970K212K617L647N504Q087J0887J3254J5076J6905
$$ 813752 811298 809848 809885 811206 813176 815388 818005 821652 827156 835243 846130 859384 874460 891365
50315H91365J9132K1336K2864K3753K4488K4976K4481K2672K0117J7461J4715
$$ 891365 910497 931833 954697 978450 1002938 1027914 1052395 1075067 1095184 1112645 1127360
50304A127360J1678Q694O403M904L706K483J438Q50O41O54J074K220L898N259
$$ 1127360 1139038 1147732 1154135 1159039 1162745 1165228 1166666 1167516 1168157 1168811 1169885 1172105 1176003 1181262
50290A181262N448M425L061K446L103M760O791Q744J0490J1904J2448J1226P574
$$ 1181262 1186710 1191135 1194196 1196642 1199745 1204505 1211296 1220040 1230530 1242434 1254882 1266108 1273682
50277A273682J612n785j3436k0101k4545k5950k4583k1724j8613j5633j2749j0314
$$ 1273682 1275294 1269509 1256073 1235972 1211427 1185477 1160894 1139170 1120557 1104924 1092175 1081861
50265A081861q724p568n922l739k060j515j233M5K250M136M876M807M641M720
$$ 1081861 1073137 1065569 1059647 1055908 1053848 1052333 1051100 1051145 1053395 1057531 1062407 1067214 1071855 1076575
50251A076575N090N629N917N625N220N651O986Q137Q470Q984J1025J4336J7401
$$ 1076575 1081665 1087294 1093211 1098836 1104056 1109707 1116693 1124830 1133300 1142284 1153309 1167645 1185046
50238A185046J9616K2021K5631L0005L4077L7707M1693M6622N2405N8839O5974
$$ 1185046 1204662 1226683 1252314 1282319 1316396 1354103 1395796 1442418 1494823 1553662 1619636
50227A619636P3779Q1845Q9600R6617J02597J07188J09910J10171J07501J01961
$$ 1619636 1693415 1775260 1864860 1961477 2064074 2171262 2281172 2391343 2498844 2600805
50217B600805R4328Q5712P6925O8307O0017N2160M4537L6489K7209J6109K810
$$ 2600805 2695133 2780845 2857770 2926077 2986094 3038254 3082791 3119280 3146489 3162598 3165408
50206C165408j3049l1627n2355p3722r3795j11044j24584j33818j38211j37669
$$ 3165408 3152359 3120732 3068377 2994655 2900860 2789816 2665232 2531414 2393203 2255534
50196B255534j32899j25078j15227j04143r2723q1870p2023o3272n6008n0887
$$ 2255534 2122635 1997557 1882330 1778187 1685464 1603594 1531571 1468299 1412291 1361404
50186A361404m7878m5940m4024m1950l9854l7355l4084l0658k8060k6129k3632
$$ 1361404 1313526 1267586 1223562 1181612 1141758 1104403 1070319 1039661 1011601 985472 961840
50175I61840k0154j6853j4885j3825j2453j0482q711p645o966o333n933n927n895
$$ 961840 941686 924833 909948 896123 883670 873188 864477 856832 849866 843533 837600 831673 825778
50162H25778n262l976k450r74N07K043L435M482N292O160P114P887Q434R177J0378
$$ 825778 820516 816540 814090 813116 813623 815666 819101 823583 828875 835035 842149 850036 858470 867647 878025
50147H78025J1407J1230R715Q018P352P668P964P585O881O606P144Q324R692J0934
$$ 878025 889432 900662 910377 918395 925747 933415 941379 948964 955845 962451 969595 977919 987611 998545
50133I98545J2118J3612J5626J7947K0134K1891K3163K4195K5536K7714L0634
$$ 998545 1010663 1024275 1039901 1057848 1077982 1099873 1123036 1147231 1172767 1200481 1231115
50122A231115L3643L6533M0051M5028N1312N8223O5754P4535Q4723R5805J07632
$$ 1231115 1264758 1301291 1341342 1386370 1437682 1495905 1561659 1636194 1720917 1816722 1924354
50111A924354J20738J35286J50450J65322J79690J93301K04935K13011K16815
$$ 1924354 2045092 2180378 2330828 2496150 2675840 2869141 3074076 3287087 3503902
50102C503902K16416K11765K02810J90550J77090J64232J52388J40869J28599
$$ 3503902 3720318 3932083 4134893 4325443 4502533 4666765 4819153 4960022 5088621
50093E088621J14308R6626P4614M8100J7357j7202n4640r3033j29835j62747j90226
$$ 5088621 5202929 5299555 5374169 5422269 5439626 5422424 5367784 5274751 5144916 4982169 4791943
50082D791943k11461k26247k34892k37917k35780k28940k18158k04527j89199
$$ 4791943 4580482 4354235 4119343 3881426 3645646 3416706 3198548 2994021 2804822
50073B804822j73130j56932j40879j25187j10454r7554q6830p7654o9186o1486
$$ 2804822 2631692 2474760 2333881 2208694 2098240 2000686 1913856 1836202 1767016 1705530
50063A705530n5263n0542m6298m1778l7507l4318l1941k9384k6516k4275k3120
$$ 1705530 1650267 1599725 1553427 1511649 1474142 1439824 1407883 1378499 1351983 1327708 1304588
50052A304588k2264k0898j9392j8481j7841j6391j3932j1521j0035r054p549n218
$$ 1304588 1282324 1261426 1242034 1223553 1205712 1189321 1175389 1163868 1153833 1144779 1137230 1132012
50040A132012k693p30N00J404K522L961N202N613N229M766M765N001M963M542
$$ 1132012 1129319 1128589 1129089 1130493 1133015 1136976 1142178 1147791 1153020 1157786 1162551 1167552 1172515 1177057
50026A177057L958L229K206J015N2m81p28r17j213j874l152m857o288o831o578
$$ 1177057 1181015 1184244 1186450 1187465 1187517 1187036 1186308 1185391 1184178 1182304 1179152 1174295 1168007 1161176 1154598
50011A154598o115n774n274m138k370n26R75K462M775Q373J2932J7847K2874K8137
$$ 1154598 1148483 1142709 1137435 1133297 1130927 1130401 1131376 1133838 1138613 1146986 1159918 1177765 1200639 1228776
49997A228776L3735L9704M6223N3519O1593P0139P8753Q7044R4798J02237J09832
$$ 1228776 1262511 1302215 1348438 1401957 1463550 1533689 1612442 1699486 1794284 1896521 2006353
49986B006353J17492J24040J27975J28655J26275J20886J12274J01033Q8951P7779
$$ 2006353 2123845 2247885 2375860 2504515 2630790 2751676 2863950 2964983 3053934 3131713
49976C131713O7996N9199N1178M3738L5735K5130J0379q572l0705n4873q0076
$$ 3131713 3199709 3258908 3310086 3353824 3389559 3414689 3425068 3416496 3385791 3330918 3250842
49965C250842j05098j28223j47390j60764j67458j67866j63292j55156j44530
$$ 3250842 3145744 3017521 2870131 2709367 2541909 2374043 2210751 2055595 1911065
49956A911065j32120j18456j04079q9757p6432o4707n4445m5219l7080l0567k5891
$$ 1911065 1778945 1660489 1556410 1466653 1390221 1325514 1271069 1225850 1188770 1158203 1132312
49945A132312k2512j9761j7510j5944j4938j4023j2954j2020j1747j2429j3891
$$ 1132312 1109800 1090039 1072529 1056585 1041647 1027624 1014670 1002650 990903 978474 964583
49934I64583j5645j7251j8613j9845k0894k1495k1558k1303k0834j9847j8023
$$ 964583 948938 931687 913074 893229 872335 850840 829282 807979 787145 767298 749275
49923G49275j5593j3129j0927q900p025n475m256l145k078j296q66m44J99P33
$$ 749275 733682 720553 709626 700726 693701 688226 683970 680825 678747 677451 676585 676141 676340 677073
49909F77073P75O97J444L404N812P481P986P914Q086Q747R497R856R756R476R166
$$ 677073 677848 678545 679989 683393 689205 696686 704672 712586 720672 729419 738916 748772 758528 768004 777170
49894G77170Q580P306N269K869N74j501l539n650p708r568j1198j2481j3132j3047
$$ 777170 785750 793056 798325 801194 801768 800267 796728 791078 783370 773802 762604 750123 736991 723944
49880G23944j2676j2665j3077j3220j2476j1051r638q596p755o924o107n200l944
$$ 723944 711268 698603 685526 672306 659830 648779 639141 630545 622790 615866 609759 604559 600615
49867F00615k374r65r1M39J050J956L200M797O515P768Q248Q483R260J0600J1793
$$ 600615 598241 597276 597185 597624 598674 600630 603830 608627 615142 622910 631158 639641 648901 659501 671294
$$ [...]
##END NTUPLES=NMR SPECTRUM
##END=
