##TITLE=AC1772_HONWASH_9683924_HdDlBBrSZe
##JCAMPDX= 6.0         $$ Bruker NMR JCAMP-DX V2.0
##DATA TYPE= NMR SPECTRUM
##DATA CLASS= NTUPLES
##ORIGIN= BRUKER
##OWNER= Administrator
$$ 1.72 TOPSPIN		Version 2.1
$$ 2016-04-16 19:45:14.392 -0700  Administrator@X
$$ Compression mode = diff/dup
##.OBSERVE FREQUENCY= 400.02188249412
##.OBSERVE NUCLEUS= ^1H
##.ACQUISITION MODE= SIMULTANEOUS (DQD)
##.ACQUISITION SCHEME= undefined
##.AVERAGES= 8
##.DIGITISER RES= 22
##SPECTROMETER/DATA SYSTEM= spect
##.PULSE SEQUENCE= zg30
##.SOLVENT NAME= COFFEE_meoh
##.SHIFT REFERENCE= INTERNAL, COFFEE_meoh, 1, 14.98509
##AUDIT TRAIL= $$ (NUMBER, WHEN, WHO, WHERE, PROCESS, VERSION, WHAT)
$$ ##TITLE= Audit trail, TOPSPIN		Version 2.1
$$ ##JCAMPDX= 5.01
$$ ##ORIGIN= Bruker BioSpin GmbH
$$ ##OWNER= Administrator
$$ $$ E:\/data/COFFEE/nmr/AC1772_HONWASH_9683924_HdDlBBrSZe/10/pdata/1/auditp.txt
$$ ##AUDIT TRAIL=  $$ (NUMBER, WHEN, WHO, WHERE, PROCESS, VERSION, WHAT)
(   1,<2016-04-16 19:45:07.314 -0700>,<Administrator>,<X>,<go>,<TOPSPIN 2.1>,
      <created by zg
	started at 2016-04-16 19:44:01.470 -0700,
	POWCHK enabled, PULCHK disabled,
       configuration hash MD5:
       21 0F 79 D6 B3 7B B4 F6 88 20 88 DB 03 48 BD 9F
       data hash MD5: 64K
       DE D0 77 A9 B8 9E 02 6E FE 2E FB B9 61 C7 9F 78>)
(   2,<2016-04-16 19:45:10.408 -0700>,<Administrator>,<X>,<proc1d>,<TOPSPIN 2.1>,
      <Start of raw data processing
       efp LB = 0 FT_mod = 6 PKNL = 1 PHC0 = 0 PHC1 = 0 SI = 32K 
       data hash MD5: 32K
       D0 56 98 7F D3 86 5B 50 D8 CD AA FF FB 05 41 2B>)
(   3,<2016-04-16 19:45:10.689 -0700>,<Administrator>,<X>,<proc1d>,<TOPSPIN 2.1>,
      <pk PHC0 = 86.81396 PHC1 = 0 
       data hash MD5: 32K
       97 9F 34 D0 F0 95 7C 3E F5 8C 73 0E A4 74 07 E8>)
(   4,<2016-04-16 19:45:10.798 -0700>,<Administrator>,<X>,<proc1d>,<TOPSPIN 2.1>,
      <abs ABSG = 1 
       data hash MD5: 32K
       A7 7B 4F 2C C2 42 22 C5 7F AA 0B 4C 0C 28 79 BE>)
(   5,<2016-04-16 19:45:10.861 -0700>,<Administrator>,<X>,<proc1d>,<TOPSPIN 2.1>,
      <abs ABSG = 2 
       data hash MD5: 32K
       08 51 4A DF D4 97 2F 7F 5E 5E 52 DA 91 7C 8D 47>)
(   6,<2016-04-16 19:45:10.923 -0700>,<Administrator>,<X>,<proc1d>,<TOPSPIN 2.1>,
      <abs ABSG = 3 
       data hash MD5: 32K
       E6 49 A8 26 1D 26 FE B0 75 1E 4D E4 56 D9 B1 FD>)
(   7,<2016-04-16 19:45:10.986 -0700>,<Administrator>,<X>,<proc1d>,<TOPSPIN 2.1>,
      <abs ABSG = 4 
       data hash MD5: 32K
       5C 17 35 ED 13 F9 08 58 DA 43 B1 2B 6A 50 0D 98>)
(   8,<2016-04-16 19:45:11.048 -0700>,<Administrator>,<X>,<proc1d>,<TOPSPIN 2.1>,
      <abs ABSG = 5 
       data hash MD5: 32K
       A2 71 9B 2B D1 2D 0D BB DE 06 CD 81 6A 31 A3 A5>)
$$ ##END=
$$ 
$$ $$ hash MD5
$$ $$ 55 7D 03 F8 95 24 58 1A 35 E3 E1 88 F7 24 C2 51
##$RELAX= 
##$RELAX= 
##$RELAX= 
##$RELAX= 
##$RELAX= 
##$RELAX= 
##$RELAX= 
$$ Bruker specific parameters
$$ --------------------------
##$DU= <E:\>
##$EXPNO= 10
##$NAME= <AC1772_HONWASH_9683924_HdDlBBrSZe>
##$PROCNO= 1
$$ [...]
##$TP= (0..7)
150 150 150 150 150 150 150 150
##$TP07= 0
##$TPNAME0= <>
##$TPNAME1= <>
##$TPNAME2= <>
##$TPNAME3= <>
##$TPNAME4= <>
##$TPNAME5= <>
##$TPNAME6= <>
##$TPNAME7= <>
##$TPOAL= (0..7)
0.5 0.5 0.5 0.5 0.5 0.5 0.5 0.5
##$TPOFFS= (0..7)
0 0 0 0 0 0 0 0
##$TUNHIN= 0
##$TUNHOUT= 0
##$TUNXOUT= 0
##$USERA1= <user>
##$USERA2= <user>
##$USERA3= <user>
##$USERA4= <user>
##$USERA5= <user>
##$V9= 5
##$VALIST= <valist>
##$VCLIST= <CCCCCCCCCCCCCCC>
##$VD= 0
##$VDLIST= <DDDDDDDDDDDDDDD>
##$VPLIST= <PPPPPPPPPPPPPPP>
##$VTLIST= <TTTTTTTTTTTTTTT>
##$WBST= 2048
##$WBSW= 25
##$XGAIN= (0..3)
0 0 0 0
##$XL= 0
##$YL= 0
##$YMAX_a= 553533
##$YMIN_a= -490038
##$ZGOPTNS= <>
##$ZL1= 120
##$ZL2= 120
##$ZL3= 120
##$ZL4= 120
##$ABSF1= 14.98509
##$ABSF2= -5.573092
##$ABSG= 5
##$ABSL= 3
##$ALPHA= 0
##$AQORDER= 0
##$ASSFAC= 0
##$ASSFACI= 0
##$ASSFACX= 0
##$ASSWID= 0
##$AUNMP= <proc_prof1d_extract_pilot.lims>
##$AXLEFT= 0
##$AXNAME= <>
##$AXNUC= <1H>
##$AXRIGHT= 0
##$AXTYPE= 0
##$AXUNIT= <>
##$AZFE= 0.1
##$AZFW= 0.1
##$BCFW= 0
##$BC_mod= 0
##$BYTORDP= 0
##$COROFFS= 0
##$CY= 15
##$DATMOD= 1
##$DC= 0
##$DFILT= <>
##$DTYPP= 0
##$F1P= 0
##$F2P= 0
##$FCOR= 0.5
##$FTSIZE= 32768
##$FT_mod= 6
##$GAMMA= 0
##$GB= 0
##$INTBC= 1
##$INTSCL= 1
##$ISEN= 128
##$LB= 0
##$LEV0= 0
##$LPBIN= 0
##$MAXI= 10000
##$MC2= 0
##$MEAN= 0
##$ME_mod= 0
##$MI= 0
##$NCOEF= 0
##$NC_proc= -8
##$NLEV= 6
##$NOISF1= 0
##$NOISF2= 0
##$NSP= 0
##$NTH_PI= 0
##$NZP= 0
##$OFFSET= 14.98509
##$PC= 1
##$PHC0= 86.81396
##$PHC1= 0
##$PH_mod= 1
##$PKNL= yes
##$PPARMOD= 0
##$PPDIAG= 0
##$PPIPTYP= 0
##$PPMPNUM= 2147483647
##$PPRESOL= 1
##$PSCAL= 4
##$PSIGN= 0
##$PYNMP= <proc.py>
##$REVERSE= no
##$SF= 400.02
##$SI= 32768
##$SIGF1= 0
##$SIGF2= 0
##$SINO= 400
##$SIOLD= 32768
##$SPECTYP= <>
##$SREGLST= <1H.CDCl3>
##$SSB= 0
##$STSI= 32768
##$STSR= 0
##$SW_p= 8223.68421052631
##$SYMM= 0
##$S_DEV= 0
##$TDeff= 65536
##$TDoff= 0
##$TI= <>
##$TILT= no
##$TM1= 0
##$TM2= 0
##$TOPLEV= 0
##$USERP1= <user>
##$USERP2= <user>
##$USERP3= <user>
##$USERP4= <user>
##$USERP5= <user>
##$WDW= 1
##$XDIM= 32768
##$YMAX_p= 442993942
##$YMIN_p= -693341
##$CURPLOT= <Network HP LaserJet P1505>
##$CURPRIN= <$Network HP LaserJet P1505>
##$DFORMAT= <normdp>
##$LAYOUT= <+/1D_H.xwp>
##$LFORMAT= <normlp>
##$PFORMAT= <normpl>
##$SURQMSG= 1
$$ End of Bruker specific parameters
$$ ---------------------------------
##NTUPLES= NMR SPECTRUM
##VAR_NAME=  FREQUENCY,     SPECTRUM/REAL,   SPECTRUM/IMAG
##SYMBOL=    X,             R,               I
##VAR_TYPE=  INDEPENDENT,   DEPENDENT,       DEPENDENT
##VAR_FORM=  AFFN,          ASDF,            ASDF
##VAR_DIM=   32768,         32768,           32768
##UNITS=     HZ,            ARBITRARY UNITS, ARBITRARY UNITS
##FACTOR=    0.250966925370066, 1,           1
##FIRST=     8223.43324360094, 296389,       -16669
##LAST=      0,             -134644,         34906
##MIN=       0,             -693341,         0
##MAX=       8223.43324360094, 442993942,    0
$$ Real data points
##PAGE= N=1
##DATA TABLE= (X++(R..R)), XYDATA
$$ [...]
19623b64328A08130E92b87677Q2687B02396h3833g497C7907b65700j98810n9021
19612e23531H2974J47944a14159k75103e546A67837K9133c17274a27947a7288
19601C4198h11G7921h0695o8814e0275J5528H3624b22297j50960A26870B7048
19589H2978a99567B59022C0912c01124q0653J42708J10946m431L9754A24226b08958
19577a6116A44597R2013E8478a71663e8506I2251l9469Q2258b58932A55164a01971
19565g8738A50294l2703e59946d5278k15195B07009b4257l82247a74373H3730
19554C714h8811M3955k14271A2734f8106n1429c3308I8456a19273K090A42476
19542A16481m3499J28189B5302c50389a54295A15288a97907j17066L3509g1300
$$ y = [-264328, 108130, 592, -287677, -204990, 202396, -83833, -7497, 37907, -265700, -464510, -523531, 82974, 230918, -114159, -389262, -5546, 167837, 196970, -317274, -127947, -17288, 34198, -811, 77921, -80695, -149509, -50275, -34747, 83624, -222297, -373257, 126870, 27048, 82978, -199567, 259022, 30912, -301124, -381777, -239069, -128123, -132554, -92800, 124226, -208958, -16116, 144597, 236610, 58478, -171663, -58506, 92251, 52782, 135040, -258932, 155164, -101971, -78738, 150294, 117591, -559946, -45278, -260473, 207009, -24257, -406504, -174373, 83730, 3714, -88811, -44856, -259127, 12734, -68106, -119535, -33308, 98456, -119273, -117183, 142476, 116481, 72982, 201171, 25302, -350389, -154295, 115288, -197907, -314973, -281464, -71300]
19531g7890B21187C8115J5436A1832J17695A880a01434B00120a79414J4736A05953
19519c1107l16905E4941a17677A42842c03161a37498A2066C542a71852f218j85804
19508a92022Q2596A14785e3977B68925G0273M2110e7825A13165D163b47519I7210
19496c6585k5267l24797C6413d08946I3605a90635b4324q2730E3961A8401b61342
19484f5530k7452a1213m3906l2849F6945h898j15800N6212B0056K51040a98701
19472B41833B3129e7949B40626j15305b27911C52823A45424a57448Q872q3196
19462b31772f8008H577K11163q9368a31186J5706d0986j95234O2283f2501A24777
19450D4538b4127j6870A69399c16064E7582a90259j93628f3141j59947L9533I1058
$$ y = [-77890, 221187, 38115, 53551, 11832, 129527, 1880, -101434, 200120, -179414, -164678, 105953, -31107, -348012, 54941, -117677, 142842, -303161, -137498, 12066, 3542, -171852, -6218, -192022, -109426, 114785, -53977, 268925, 70273, 112383, -57825, 113165, 4163, -247519, 97210, -36585, -61852, -386649, 36413, -408946, 93605, -190635, -24324, -107054, 53961, 18401, -261342, -65530, -92982, -11213, -55119, -87968, 66945, -8898, -124698, -68486, 20056, 271096, -198701, 241833, 23129, -57949, 240626, 125321, -227911, 352823, 145424, -157448, -148576, -231772, -68008, 8577, 219740, 130372, -131186, -115480, -40986, -236220, -173937, -62501, 124777, 44538, -24127, -40997, 169399, -316064, 57582, -190259, -383887, -63141, -223088, -183555, 91058]
19438A3485K2339a44774J3530C61606E7599Q4167p722n1753a61013c1402A32272
19426g4885B18878b30479J07207A54606b12661j12731A70726a3181k48884c8540
19415h2251k77010I1610J51044a93219G4455P5429J45221c33627J47124P7568
19405a08935H3958h1099B96293a23185A26122c31069A2162b15094i933D9923a59701
19393b02125n8458a01017l16115a15861j95472k4149E1311a79147k314K6908j49400
19382c03953B36224j16857b7096j12844A2529b20031E5477a39539C9737a59398
19371E7981d9843p8271k49449a01927K9205E1877c069j43225B9771Q1673l2605
19360G8839h675F8468a56817A53777b6649j33943A26140b08301c1258k18035B30995
$$ y = [13485, 35824, -144774, -131244, 361606, 57599, 141766, 134044, 82291, -161013, -31402, 132272, -74885, 218878, -230479, -123272, 154606, -212661, -325392, 170726, -13181, -262065, -38540, -82251, -359261, 91610, 242654, -193219, 74455, 149884, 295105, -333627, -186503, -108935, 83958, -81099, 296293, -123185, 126122, -331069, 12162, -215094, -9933, 49923, -159701, -202125, -260583, -101017, -417132, -115861, -311333, -335482, 51311, -179147, -181461, -154553, -303953, 236224, 119367, -27096, -139940, 12529, -220031, 55477, -139539, 39737, -159398, 57981, -49843, -128114, -377563, -101927, -72722, 51877, -3069, -146294, 29771, 111444, 78839, -8675, 68468, -156817, 153777, -26649, -160592, 126140, -208301, -31258, -249293, 230995]
19348a80566B4348a39611B06334a96421C0305c67393f0281p0634A10995h1400
19337A51676b27837l30078d4209A20252a11194K5564k51187h9000D8056E670e0627
19325B339a66791A63430d63750J43049c5850A45183M9928a62196j41374d7284
19314g4803A35305f5471o1406k35135g9219n4084C16823b16017J3903L7071c9009
19302b64889P7756f8535p8498G8379e108j3321A18269m715a30568a3938A55715
19290a1682k30381R7758a2304k3622l47319B3905a50103j0341q8575j0273E1286
19278D1819g9092j09505B70571A11228i1439a6298B15541r1337D820g1413G7135
19266g9633j5169A1437J19739b63042E5952K1839d4032j09900b5644n3337B35674
$$ y = [-180566, 24348, -139611, 206334, -196421, 30305, -367393, -60281, -130915, 110995, -81400, 151676, -227837, -557915, -44209, 120252, -111194, -85630, -336817, -89000, 48056, 5670, -50627, 2339, -166791, 163430, -463750, -320701, -35850, 145183, 195111, -162196, -303570, -47284, -74803, 135305, -65471, -126877, -362012, -79219, -133303, 316823, -216017, -202114, -165043, -39009, -264889, -187133, -68535, -147033, 78379, -5108, -18429, 118269, 113554, -130568, -13938, 155715, -11682, -242063, -144305, -12304, -35926, -383245, 23905, -150103, -160444, -249019, -259292, 51286, 41819, -79092, -188597, 270571, 111228, -91439, -16298, 215541, 124204, 4820, -71413, 77135, -79633, -94802, 11437, 131176, -263042, 55952, 77791, -44032, -153932, -25644, -78981, 235674]
19254b33586D8933j4907a27515A92755l5374a96313G2789F248i2521Q852A5213
19242F0545c02085M9761J11530M4791J4583B50506a37079n29066b1088G4736d8614
19230d2488H6288J25092J66625I6907a06122l30430a17641A3137M5153N9207b77962
19218c07471D9444J95441I485b67763r2747b4931I1973a53261M9598j4809A04273
19206b44024q5935A34790a60813e195k02499B48571E6318N3472c4387A84876B9618
19194C09720b45984D242K11697N9309b59862g5030H7918h2645m980p3676l7126
19183a98427A28535d2452j11784B0001a15491D6578g5362I5657a28013G4247a37841
19171a48590C1026b47741g3095k03476G4371b09224d4936A99861a47184k46540
$$ y = [-233586, 48933, 34026, -127515, 192755, 157381, -196313, 72789, 6248, -92521, -83669, 15213, 60545, -302085, -252324, -140794, -96003, -81420, 250506, -137079, -666145, -21088, 74736, -48614, -42488, 86288, 211380, 378005, 96907, -106122, -436552, -117641, 13137, 58290, 117497, -277962, -307471, 49444, 244885, 9485, -267763, -360510, -24931, 91973, -153261, -103663, -118472, 104273, -244024, -329959, 134790, -160813, -5195, -207694, 248571, 56318, 109790, -34387, 184876, 29618, 309720, -245984, 4242, 215939, 275248, -259862, -75030, 87918, -82645, -87625, -161301, -198427, 128535, -42452, -154236, 20001, -115491, 46578, -75362, 95657, -128013, 74247, -137841, -148590, 31026, -247741, -73095, -276571, 74371, -209224, -44936, 199861, -147184, -393724]
19161c93724A1024a12090B74662a62242A32872D4979c6357j56504N7418j13163
19151b48606a08154m0178n5190m9826B6709O2308b8667p3784a6215k91477f0847
19139d28511b2062p9042B9762O2753k8054J59121A6184b8722F5291i6449b1853
19127B5193j866e343A32391f6651l55844b02966h0528g628l19024A24316A6885
19115a50085F5095a7467k86880A83533R1543j25241C5452K84948B0980d13291
19104a66514d337j26629o9998A16316a12738B9123J61174c96277A60908p2882
19094H8026J87627b48646H7746O0320c59363h8793C22154A04527a08676G738c2694
19082a65341B06494r6353d6536k53004J19021A0406c27460A32126e9081A69942
$$ y = [-393724, 11024, -112090, 274662, -162242, 132872, 44979, -36357, -192861, -135443, -248606, -108154, -148332, -203522, -253348, 26709, 89017, -28667, -102451, -16215, -307692, -60847, -428511, -22062, -101104, 29762, 92515, 64461, 223582, 16184, -28722, 65291, -96449, -21853, 25193, 23327, -5343, 132391, -66651, -422495, -202966, -80528, -7628, -326652, 124316, 16885, -150085, 65095, -17467, -304347, 183533, 275076, 149835, 35452, 320400, 20980, -413291, -166514, -4337, -130966, -200964, 116316, -112738, 29123, 190297, -396277, 160908, 88026, 275653, -248646, 87746, 148066, -359363, -88793, 322154, 104527, -108676, 7738, -32694, -165341, 206494, 110141, -46536, -299540, -180519, 10406, -327460, 132126, -59081, 169942]
19071a56708p4888d1259b286I2900d4747J0851n828C2628b8750l27663H1629a7682
19058F9334J65474b55605c6407A39040h3800J6833j54945E5747P3995c45054c5356
19046A25936b07656B8749c14298C7429d4728E1459f8804k2272b5334R910r831
19035b5255D7943b1630p2334I9690a45584b5107j64006A09763d68206C44922a3009
19023A3133a94855G1883c01178A5183O9920J72233F2873j3628J46316n6422b75039
19011a98491A61363K8987a44331M8425Q990A93712E2632a56397B6058M7040c39411
18999d5224C11487C7990P1889N1893e8884j33759A28022a69412e8538j82479d0483
18987f6803k19169O7353f4684r2463l00346a68147a0568j0222k66406J19324g0555
$$ y = [-156708, -231596, -41259, -2286, 92900, -44747, -33896, -39724, 32628, -28750, -356413, 81629, -17682, 69334, 234808, -255605, -36407, 139040, -83800, -66967, -221912, 55747, 129742, -345054, -35356, 125936, -207656, 28749, -314298, 37429, -44728, 51459, -68804, -91076, -25334, -15424, -25255, 47943, -21630, -93964, 99690, -145584, -25107, -189113, 109763, -468206, 344922, -13009, 13133, -194855, 71883, -301178, 15183, 85103, 257336, 62873, 49245, 195561, 139139, -275039, -198491, 161363, 190350, -144331, -95906, -86916, 193712, 52632, -156397, 26058, 73098, -339411, -45224, 311487, 37990, 109879, 161772, -58884, -192643, 128022, -169412, -58538, -241017, -40483, -66803, -285972, -218619, -64684, -157147, -457493, -168147, -10568, -20790, -287196, -167872, -70555]
18975A08771C7577b6392k19187d575m7510B49559a56975j76766I6016J35325a68132
18963a40858E163J18938a95729j14270f7412E9372b10858i1870M0360j63692l8953
18952b54155K9672Q166F8344a4747j55996D3894M5956j1509b96494d6360j17262
18941a63622g4430K8277J6268j42944B01129b40943d7583p9762B87554I4470c30276
18929B3750R549L08915c70602P81C2292a27221D1841b58305f0887k22322J06243
18918a76966A83387a27356F7797O9451k6542A8110J07970E4945O5323l3227B047
18906A30316a94879l5209M3770R689A36723a59125l7160E6517d0815l0548j42290
18895b13653P4181b4850j18837A73679n6052a25179b3959p637H6455g8794k33537
$$ y = [108771, 37577, -26392, -245579, -4575, -52085, 249559, -156975, -333741, 96016, 231341, -168132, -140858, 5163, 124101, -195729, -309999, -67412, 59372, -210858, -91870, -51510, -215202, -254155, -224483, -216317, 68344, -14747, -170743, 43894, 89850, 78341, -296494, -46360, -163622, -74430, -46153, -29885, -172829, 201129, -240943, -47583, -127345, 287554, 94470, -330276, 23750, 33299, 342214, -370602, -369821, 32292, -127221, 41841, -258305, -60887, -283209, -176966, 183387, -127356, 67797, 137248, 110706, 18110, 126080, 54945, 120268, 87041, 2047, 130316, -194879, -230088, -186318, -176629, 136723, -159125, -196285, 56517, -40815, -71363, -213653, -139472, -24850, -143687, 173679, 117627, -125179, -23959, -31596, 86455, -78794, -312331]
18884c12331I3833c78355a29366i603I6637i7658a7084B77686b15676H271N6073
18873F4344i4702L3424G723L805g7730C7596a50628l4459A1910a97404k6378a01963
18860b67580J21075A77750B8901O8985f17448b12290F0460p173a70007B14579
18849C2536f3212E6250a80499A71381b96335P2509A12189a74741A2297b3074A63801
18837A38063c48126J70402C0109M1600a57380g0852b1882m2760r7247n6610A43081
18825C6186a82780k40907G3829j5920K22482D8367J33018a85640k8662E6796a96424
18813a2047H6914M9390g4535A67046a09362J8885E6445J69273b42740j0381B39814
18801a44325B81002b81140N6428E2654a04766M1622D1506C643b06651o1671h4227
$$ y = [-312331, 93833, -378355, -129366, -9603, 96637, -97658, -17084, 277686, -215676, 8271, 64344, -94702, -61278, 7723, 11528, -77730, 37596, -150628, -185087, 11910, -197404, -223782, -101963, -267580, -146505, 177750, 28901, 97886, -617448, -212290, 60460, 53287, -170007, 214579, 32536, -63212, 56250, -180499, 171381, -296335, -223826, 112189, -174741, 12297, -23074, 163801, 138063, -348126, -177724, 30109, 71709, -157380, -70852, -21882, -64642, -161889, -218499, 143081, 36186, -182780, -423687, 73829, 57909, 280391, 48367, 181385, -185640, -214302, 56796, -196424, -12047, 86914, 136304, -74535, 167046, -109362, -90477, 56445, 225718, -242740, -253121, 239814, -144325, 281002, -281140, -224712, 52654, -104766, -63144, 41506, 3643, -206651, -268322, -84227]
18789b9262j95492A5707K4309K8635J43602a8247j23466O7998A96979L6273a11908
18777g9662C7243a53877B80353m0545a01837B5868b9228A72309c9966A94576a25623
18765H3971L9722k9499c24082B99059a8905A77463a20984B06682h3801A31945
18754B8595o332L03251q3582a32959L6865L0791n1923j34620B12345a69817j49257
18743c19074D0345h6772p0386l9742K3977a0347j26762H0551a09392B916J18698
18732A21614g7560l45820a68631F8178P1078F191a65881G5011M6827b67245F832
18720c89926h6028d0418j92368J05451I8686a02175J860A07989M7129B9479B865
18708E2381A4138a23541A9053O0620a74108N4105A14598Q7610b34820a15405L8340
$$ y = [-29262, -224754, 15707, 40016, 68651, 212253, -18247, -141713, -73715, 196979, 233252, -111908, -79662, 37243, -153877, 280353, 239808, -101837, 25868, -29228, 172309, -39966, 194576, -125623, 83971, 123693, 94194, -324082, 299059, -18905, 177463, -120984, 206682, -83801, 131945, 28595, 22263, 325514, 241932, -132959, -96094, -65303, -117226, -251846, 212345, -169817, -319074, 40345, -86772, -157158, -196900, -172923, -10347, -137109, 80551, -109392, 2916, 121614, -77560, -423380, -168631, 68178, 139256, 6191, -165881, 75011, 121838, -267245, 6832, -389926, -86028, -40418, -232786, -127335, 98686, -102175, -100315, 107989, 155118, 29479, 2865, 52381, 14138, -123541, 19053, 79673, -174108, -120003, 114598, 202208, -234820, -115405, -77065]
18697g7065E0594a29845n4346G7072c37773l691i8902k66986E7766i6341A41519
18685a87863H5566R6245b44888j33646J40508k06307i6661F4243a86738c1935
18674H2108N2713e9073j0530m5155R831B0459a34992j11567C612c8703C37441
18662c20r618l43000i1809j92180J3765R2919A8949b52798H8813b40616A47397
18650a02855B7838b97537d7468k33169O3717p3827c9771m05405a61813B4089J30088
18639A54177b14079B1543R1231c11169A15363a51579A37479b9543A25282b40456
18628F9726J14989b99115G110b43437F0932g8763l03314d2171q0132A67666a3759
18616C697K69427F1314j5553h1170L0546A2977K05243a87614Q6149Q264A45102
$$ y = [-77065, 50594, -129845, -184191, 77072, -337773, -341464, -98902, -365888, 57766, -96341, 141519, -187863, 85566, 181811, -244888, -378534, -238026, -444333, -96661, 64243, -186738, -31935, 82108, 134821, -59073, -69603, -114758, -104927, 20459, -134992, -246559, 3612, -38703, 337441, -320, -9938, -352938, -91809, -283989, -270224, -177305, 18949, -252798, 88813, -240616, 147397, -102855, 27838, -297537, -47468, -280637, -216920, -290747, -39771, -445176, -161813, 24089, 154177, -214079, 21543, 112774, -311169, 115363, -151579, 137479, -29543, 125282, -240456, 69726, 184715, -299115, 7110, -243437, 60932, -78763, -382077, -42171, -122303, 167666, -13759, 3697, 273124, 61314, 45761, -81170, -50624, 12977, 218220, -187614, -101465, -93201, 145102]
18604b84596A2415a99167C17771c6870P775j90166c3311a3892j84656Q9840A53285
18592E1212f8589P857C5308J6411J69717G0462i3464L6577J1153j25799J7329
18581a54204R024F95P1860h5145k60367a62758D3840b27667L6876A06991Q228
18570A15219g6677b0006a995j27890O2991a6275A14153a90058P8258o750C13002
18558a43781a3427A14997a88173a5661B5509b1670L106o44C0172d4441K1604A87743
18545C61072a57094K9588q7206j71075A09469Q6251r0496D4355N7735b96345a35834
18533B01463b8138k37326A10021h6695k37697a16173A27401f0905l7704j65041
18523b63650J30286G7145J06961a05043j75654K5469f6721A72798m4284P2842
$$ y = [-284596, 12415, -199167, 317771, -36870, -29095, -219261, -33311, -13892, -198548, -108708, 153285, 51212, -68589, -60732, 35308, 51719, 221436, 70462, -93464, -56887, -45734, -171533, -154204, -145180, 695, 72555, -85145, -345512, -162758, 43840, -227667, -190791, 106991, 115219, -76677, -20006, -1995, -129885, -66894, -16275, 114153, -190058, -111800, -118550, 313002, -143781, -13427, 114997, -188173, -15661, 25509, -21670, -18564, -19208, 30172, -44441, -22837, 187743, 361072, -157094, -127506, -214712, -385787, 109469, 195720, 105224, 44355, 102090, -296345, -135834, 201463, -28138, -265464, 110021, -86695, -324392, -116173, 127401, -60905, -98609, -263650, -133364, 77145, 184106, -105043, -280697, -255228, -66721, 172798, 128514, 201356]
18513B01356r6623d9215o9255j54579A13779l3345a192j87898a7174r3614D740
18501i4006j33703A38908a81392p5130A41693b03434o9694M7680C7408a80011
18490g1857c042j05819m97O508H6486b15024c7836k2527j8218f276A71127c5626
18477A00784B0808a25053B13058f1760A4250b48715n8558c5838A06922D7412c3353
18465A00680b83055a02306A453a47027L5891J2470L1873R172o0826k60673a76640
18453e5461C62110j49016O0643a96378G0726d35023a78342j89B56379G6690b09509
18441h4845G467n92L71197a8232l8640C8922J2602i120A7498p244J5380a22539
18428B0794a14766j21912A02876c38401H3454f2216K8265j8842I2928d3516I8593
$$ y = [201356, 104733, -49215, -118470, -273049, 113779, 80434, -1192, -189090, -17174, -110788, 4740, -94006, -227709, 138908, -181392, -256522, 141693, -203434, -273128, -225448, 37408, -180011, -71857, -3042, -108861, -109358, -102850, 86486, -215024, -37836, -60363, -78581, -6276, 171127, -35626, 100784, 20808, -125053, 213058, -61760, 14250, -248715, -307273, -35838, 106922, 47412, -33353, 100680, -283055, -102306, 1453, -147027, -111136, -98666, -66793, -57621, -118447, -379120, -176640, -55461, 362110, 213094, 273737, -196378, 70726, -435023, -178342, -178531, 256379, 76690, -209509, -84845, 7467, 6875, 378072, -18232, -56872, 38922, 51524, -9120, 17498, 10254, 25634, -122539, 20794, -114766, -236678, 102876, -338401, 83454, -62216, -33951, -52793, 92928, -43516, 98593]
18416C8646r583b4304A18572m5750a33343K1424A01763c4456j87731B05276j7830
18405A87446b51868A63695a20845e778C52585a12232o1639d9654j5925A54868
18394a80211p7126b563k31813R2058o948n7554A97117a91154A12116d68523a94455
18382a17458D7247a0360o626l2331j29964E713K20992O3072D2197c58997a22977
18370F5776b35296j3815G2340K2703A7396f4791E3942a72999A27158D7651e2110
18358E5616b22260b0790a150m22365J92054A26770J7784a24144e959A7307K48319
18347B65626B4966b86526f9797A52637M20c0992D2848a46092B21744h0782A22205
18335c23804O2216R3678H7630a25043j37874B84551C3164e9656q9791K9794G8015
$$ y = [38646, 29063, -24304, 118572, 72822, -133343, -111919, 101763, -34456, -222187, 205276, 187446, -251868, 163695, -120845, -5778, 352585, -112232, -173871, -49654, -65579, 154868, -180211, -257337, -2563, -234376, -142318, -149266, -206820, 197117, -191154, 112116, -468523, -194455, -117458, 47247, -10360, -16986, -49317, -179281, 5713, 226705, 289777, 42197, -358997, -122977, 65776, -235296, -249111, 72340, 95043, 17396, -64791, 53942, -172999, 127158, 47651, -52110, 55616, -222260, -20790, -1150, -423515, -231461, 126770, 144554, -124144, -5959, 17307, 265626, 24966, -286526, -69797, 152637, 153057, -30992, 42848, -146092, 221744, -80782, 122205, -323804, -261588, -167910, 87630, -125043, -262917, 284551, 33164, -59656, -149447, -119653, 78015]
18323e4131k09226A29762b21608j29851k514A3763J73347b23150A27747f0317
18312h9635M3724A27289h0521D38416f0371C7364a55589M6522F0099a0408A02488
18300H406O6213b31535E9261N4820h2884A761a17218j95872e1878k39192h6389
18288a39926A52540C1185d3636A03418a18226o8776k2371G7541c80251I7154c9059
18276b0593m2236F6905R1023b03403e4250j28212A31326j6497L21838a01073p1006
18265a72079A69977d0446m2322L302J0332m3663I2486c85463L1252a21698A34440
18253B805R2942O0638b32227M8095F9593J42623a40853I8239a19531p368A12800
18241d5027E0693a25094b6163j00686F6569b33824A33297A7477c34733N6633f8276
$$ y = [-54131, -263357, 129762, -221608, -351459, -353973, 13763, 187110, -223150, 127747, -60317, -89635, -45911, 127289, -80521, 438416, -60371, 37364, -155589, -109067, 60099, -10408, 102488, 8406, 74619, -231535, 59261, 114081, -82884, 1761, -117218, -313090, -51878, -291070, -86389, -139926, 152540, 31185, -43636, 103418, -118226, -187002, -209373, 77541, -380251, 97154, -39059, -20593, -62829, 66905, 157928, -203403, -54250, -182462, 131326, 114829, 436667, -101073, -172079, 169977, -40446, -82768, -79466, -69134, -112797, 92486, -385463, -354211, -121698, 134440, 2805, 95747, 156385, -232227, -184132, 69593, 212216, -140853, 98239, -119531, -126899, 112800, -45027, 50693, -125094, -26163, -126849, 66569, -233824, 133297, 17477, -334733, -278100, -68276]
18229a08000B6249h9664j25756h0948A38743h2764D4161B1885c63717D2796a80965
18217a28399M5945b3356l4641j64736B70074d7024p7606A14074d6140b0271B08938
18205D4485N7222a12102F4297a97112C9073J42526C6077h5548A7771L249a42567
18193d5115p0960a1539C8399K47560E694K21145a49683A33511e0804A41900c3274
18181G608J8114b92814A17977b33373f8708k80272B84448a27593B66516b9109
18170c35681B5707a05583A64309a75742B35217b3892j87460b1667B0548i3267
18159B68739b74404J23034C26891a00264a6351l2129j38895j5170L8353a6063
18148E4444b93997C5640d81212b30257d2847k05003B78076a92160e0866K5397
$$ y = [-108000, 26249, -89664, -215420, -80948, 138743, -82764, 44161, 21885, -363717, 42796, -180965, -128399, -82454, -23356, -57997, -222733, 270074, -47024, -124630, 114074, -46140, -20271, 208938, 44485, 101707, -112102, 64297, -197112, 39073, 181599, 36077, -85548, 17771, 21020, -142567, -45115, -116075, -11539, 38399, 285959, 5694, 226839, -149683, 133511, -50804, 141900, -33274, 7608, 25722, -292814, 117977, -233373, -68708, -348980, 284448, -127593, 266516, -29109, -335681, 25707, -105583, 164309, -175742, 235217, -23892, -211352, -21667, 20548, -93267, 268739, -274404, -151370, 326891, -100264, -16351, -48480, -187375, -202545, -164192, -16063, 54444, -293997, 35640, -481212, -230257, -42847, -247850, 278076, -192160, -50866, -25469]
18138b5469G8257K13354F0248c7868l7077B87447f0514k5016A64185h8132A26438
18126A05642F895J2423L32733N0274D3866b3983k20172H4384C5482O3429b14272
18114a9603j83926J3256E4380A3252d4701l53367b2563j37681A3241i2691A66655
18102a78585B4096J49160b47044j86222J26947a46019N2298L3343R705K0736o2328
18091i2265B10348K15257A7796O4804J86767a63227B08043C4891b41982a20417
18080e3068A12164J46273p0322h3549E8336J35656Q5566j25209K85185h4884l9746
18069a24630j32188b3617D4861g8107B37495g2978h417p8424j21698i345F4103
18057h0332j7128k63899J33426C78010c4572m8773c2601k29228I6899c19847H915
$$ y = [-25469, 78257, 291611, 60248, -37868, -74945, 287447, -60514, -85530, 164185, -88132, 126438, 105642, 6895, 19318, 352051, 402325, 43866, -23983, -244155, 84384, 35482, 98911, -214272, -19603, -203529, -190273, 54380, 13252, -44701, -398068, -22563, -160244, 13241, -92691, 166655, -178585, 24096, 173256, -247044, -433266, -306319, -146019, -93721, -60378, -50673, -29937, -92265, 210348, 425605, 17796, 82600, 269367, -163227, 208043, 34891, -241982, -120417, -53068, 112164, 258437, 188115, -83549, 58336, 193992, 279558, 154349, 439534, -84884, -124630, -256818, -23617, 44861, -78107, 237495, -72978, -8417, -86841, -208539, -9345, 64103, -80332, -97460, -361359, -227933, 378010, -34572, -83345, -32601, -261829, 96899, -319847, 8915]
18045b44388g4911C46826n2313A29143i4719L0669k17124g2540n1910p2170G2360
18033a75590k49516H6618b25515b9470l24507e9045o2659A31571f148j06843F7515
18021E7814e81154K57914c300l4767I9339a84440B53364a60947G6764a96547q6039
18010b82586D20501A55809N6e8176k7393p4794M6247C293J74197a69836Q4215
17999h5621A16836f1540E0675a62013C3670J73399H118k903O6974B6402H606J55668
17987A64274J78882D2770O9558K18020K335j61012d2389A8222c2423A7031h1393
17975g7397A44485J14961f7545J8031b50B886e6954H6903c3800k18077E6202J20987
17963A77189a6197k1615I92i5384l3849C247d9876B4465P8124m9041b9804A61145
$$ y = [-244388, -74911, 346826, 294513, 129143, -94719, -64050, -281174, -72540, -124450, -196620, 72360, -175590, -425106, 86618, -225515, -29470, -353977, -59045, -121704, 131571, -6148, -112991, 67515, 57814, -581154, -323240, -3300, -38067, 99339, -184440, 253364, -160947, 76764, -196547, -282586, 420501, 155809, 155865, -58176, -85569, -160363, -114116, 3293, 177490, -169836, -85621, 116836, -61540, 50675, -162013, 33670, 207069, 8118, 5215, 72189, 26402, 8606, 164274, 343156, 42770, 112328, 330348, 332683, 171671, -42389, 18222, -32423, 17031, -81393, -77397, 144485, 259446, -67545, -49514, -250, 2886, -56954, 86903, -33800, -251877, 56202, 177189, -16197, -37812, 992, -95384, -129233, 3247, -49876, 24465, 102589, 53548, -29804, 161145]
17950B02546a11246r3866A13824J43201f6426B64400I6180c3704l24702F888P2833
17939G9721a48967A89003b09106B27879f269B68852a39804B23079c04529c0513
17928F9486b10248Q7609B16082F9455j9016b63785A2468h8700A59980b21052K6510
17917a94542f2279I6240i8900j16373A27079h0428K1736A65150a91729k4755j2535
17906b29019C99872A5056a15252D2270c44954A46538h2520F1459a15573A32419
17895a81353B99677r0471c9342A7845a40379G8469a32698A19483b33547A42575
17884a40476B3217P0957c1302j24165j71222h340J906A90782b66868Q3264j9148
17873b02752e8511o85D840M1026h3724B35778B6539h2129A04581e4028n8853A6762
$$ y = [202546, -111246, -205112, 113824, 257025, -66426, 264400, 96180, -33704, -358406, 6888, 79721, -148967, 189003, -209106, 227879, -6269, 268852, -139804, 223079, -304529, -30513, 69486, -210248, -122639, 216082, 69455, 50439, -263785, 12468, -88700, 159980, -221052, -194542, -62279, 96240, -98900, -215273, 127079, -80428, -58692, 165150, -191729, -216484, -229019, 399872, 15056, -115252, 42270, -344954, 146538, -82520, 61459, -115573, 132419, -181353, 299677, 209206, -39342, 17845, -140379, 78469, -132698, 119483, -233547, 142575, -140476, 23217, 94174, -31302, -155467, -326689, -8340, -6434, 190782, -266868, -183604, -202752, -58511, -59196, 4840, 45866, -83724, 235778, 26539, -82129, 104581, -54028, -112881, 16762]
17860G5928a17212D23249A74455a4594q9135I6248h4701H7427K576e02834A9327
17848b25962d5140j1537A07075D123P5570c1624j76402M334D7327b92056A4744
17836C224a81720A12760i8879b3473k31874M3795N7586a0688H61K20143a27082
17824b9817a0695b186F0545L6165D0068c9749J2326A87350l1029a18805C4908
17812b02061j46811J39981a1523j72175J0141L8332j61933I4612J63066a03555
17801A43854A2580N7583Q9192b30644b8547A14956b22299A91520N4713m3372b5005
17789b82530B7258M9355b5536k31836J28224A35789J233n6313d9455k57703B1980
17777C2268a23582L0935I9957J85943c008F6155c26173f785m5791c496A10458
$$ y = [75928, -117212, 423249, 174455, -14594, -103729, 96248, -84701, 87427, 90003, -502834, 19327, -225962, -45140, -56677, 107075, 4123, 79693, -31624, -208026, -203692, 47327, -292056, 14744, 3224, -181720, 112760, -98879, -23473, -255347, -211552, -153966, -10688, 861, 221004, -127082, -29817, -10695, -2186, 60545, 96710, 40068, -39749, -27423, 187350, 156321, -118805, 34908, -202061, -348872, -208891, -11523, -183698, -173557, -135225, -297158, 94612, 257678, -103555, 143854, 12580, 70163, 159355, -230644, -28547, 114956, -222299, 191520, 246233, 202861, -25005, -282530, 27258, 76613, -25536, -257372, -129148, 135789, 137022, 80709, -49455, -307158, 21980, 32268, -123582, -92647, 99957, 285900, -3008, 66155, -326173, -6785, -52576, -3496, 110458]
17765G1527a03413D2411a75502B04416F4554b90336J6254g4905A29973h5143j16396
17754b01539A40312J37318R6327c072l4299H612a57200C02851C7525d1105J9689
17743b1416r9847p358A19615a18977A3083J43868j0100i9739A19693g6892O084
17732g0808j23566A0615f804B8228O4974C2271j2961a84004E4347b08173c6091
17720I45c00438m7142c6249B85302B5696h557E0040Q9507k6777L62739c5321F3661
17707C333a1605A43799F3816a46097F9620f8374A63411b21776D0336D537L4339
17696C8876O2653a95943J4840A0856i5371H1464a42417j86319B07422b6117A53375
17684A98162o6767a01464F0723b20026E2199i0208M2645n4721A11859a43758B60069
$$ y = [71527, -103413, 42411, -175502, 204416, 64554, -290336, -274082, -74905, 129973, -85143, -201539, 140312, 277630, 373957, -3072, -37371, 8612, -157200, 302851, 37525, -41105, -21416, -121263, -128621, 119615, -118977, 13083, 156951, 146851, -99739, 119693, -76892, -70808, -194374, 10615, -6804, 28228, 93202, 32271, 19310, -184004, 54347, -208173, -36091, 945, -300438, -347580, -36249, 285302, 25696, -8557, 50040, 139547, 112770, 475509, -35321, 63661, 3333, -11605, 143799, 63816, -146097, 69620, -68374, 163411, -221776, 40336, 4537, 38876, 101529, -195943, -181103, 10856, -95371, 81464, -142417, -328736, 207422, -26117, 153375, 198162, 131395, -101464, 60723, -220026, 52199, -90208, -47563, -102284, 111859, -143758, 260069]
17672g174E0200J01619O1864h1382I2500D6183b2346A231a82800F983J2039i0447
17659E9288b11903N2945G44d11D8715a15727B02043e4561l56844a84300A64515
17647B94972F6030d7097j41885B1658K07710a40744L3367k56187I3464J03955
17637A97419a42272F8386l849a27923d7783A12908a54872H5245k6205b31334I7746
17625g9989A75905G7176b01514r6736B5905d65739A79205m1873K74921P7592A07746
17613B22108C5880c06392J28338c0255B33870a28987A99818b9281m5543A72362
17602b4843k9418D7347K73146b31844A09522A3564m671d4456C3598b37120O204
17591b30916B05785D3438M8387j2249A4559K6319j4967b03587A00238c8502j478
$$ y = [-7174, 50200, 151819, 213683, -81382, 92500, 46183, -22346, 1231, -182800, 6983, 19022, -90447, 59288, -211903, -158958, 744, -411, 48715, -115727, 202043, -54561, -411405, -184300, 164515, 294972, 66030, -47097, -188982, 21658, 229368, -140744, -107377, -363564, 93464, 197419, -142272, 68386, 64537, -127923, -47783, 112908, -154872, 85245, 59040, -231334, 97746, -79989, 175905, 77176, -201514, -298250, 25905, -465739, 179205, 137332, 412253, 489845, 107746, 222108, 35880, -306392, -178054, -30255, 233870, -128987, 199818, -29281, -74824, 172362, -24843, -54261, 47347, 320493, -231844, 109522, 13564, 8893, -44456, 33598, -237120, -230916, 205785, 43438, 91825, 79576, 14559, 40878, 25911, -203587, 100238, -38502, -39980]
17580c9980p3370i553j51350C06503b65369C42320j24790o1702M1252i7724A3131
17568g748k41653G9178J05353r1366d2080B02791a08065I820a1820m0480j73492
17557b25792B28356a55662B63134a79453n7352A52176m135N3605c361j43267D25264
17545C04056j02157b7027B38966c3406A9184M06501a39957b7588I899L4796M8291
17534I2986a67489b2407C85983a6684F7964C0278J53093n6604b2812A50261K4520
17523A74781a47152D09348A83710J01714k0201C5648P069J68333b34477B84445
17512a43439B69571i4323A11416a4728n9561a8368C24214a51714M7085A02981
17501B5034R5859d7405D21267j67218c3551k9560A39410l8128a1110B15475C4099
$$ y = [-39980, -113350, -9553, -160903, 306503, -265369, 342320, 217530, 155828, 197080, -97724, 13131, -7748, -249401, 79178, 184531, 93165, -42080, 202791, -108065, 9820, -11820, -52300, -225792, 228356, -155662, 263134, -179453, -236805, 152176, 148041, 201646, -3361, -146628, 425264, 304056, 201899, -27027, 238966, -33406, 19184, 425685, -139957, -27588, 9899, 44695, 92986, -167489, -22407, 385983, -16684, 67964, 30278, 183371, 126767, -22812, 150261, 174781, -147152, 409348, 183710, 285424, 265223, 35648, 42717, 211050, -234477, 284445, -143439, 269571, -94323, 111416, -14728, -74289, -18368, 324214, -151714, -104629, 102981, 25034, 120893, -47405, 421267, 254049, -33551, -63111, 139410, 101282, -11110, 215475, 34099]
17489A50432k0867A9673O9098a4255B41250a50085D5312L26382a55407D4366e4915
17477d0668B76333j37933M4564a75380B04185K65432A42823o1716M2435j8971
17467A04571K52384j69802a00141c4233q8247l1132j34008B75453j36618M5578
17457A84413P8850F1679B9140J90404J57372m6378b4927B49313O8607K07699k14024
17446C11595j14102l8711D3811K87455J21395j93168l1273q9923J9965G4640B7812
17434D62287A48488n675K86006a12673C80876p7394j23429j6115a46655C15767
17423B85768O2080J58071A43526J8521a55465D01630J18304l0484p1533R4116
17413E12033A83112k3321Q2338B8425n795J64084l3198a30272A25445E0026M706
$$ y = [150432, 129565, 19673, 88771, -14255, 241250, -150085, 45312, 371694, -155407, 44366, -54915, -40668, 276333, 138400, 182964, -175380, 204185, 469617, 142823, 81107, 123542, 104571, 356955, 187153, -100141, -34233, -122480, -153612, -287620, 275453, 138835, 184413, 263263, 61679, 29140, 219544, 376916, 330538, -24927, 249313, 317920, 525619, 311595, 197493, 158782, 43811, 331266, 452661, 259493, 228220, 138297, 158262, 74640, 27812, 462287, 148488, 142813, 428819, -112673, 380876, 303482, 180053, 163938, -146655, 315767, 285768, 347848, 505919, 143526, 162047, -155465, 401630, 519934, 489450, 417917, 512033, 183112, 159791, 242129, 28425, 22630, 186714, 153516, -130272, 125445, 50026, 54732]
17402E4732J72800a22875B38809J84738k03957k3230j2772o0636c1978Q836B4420
17390C3305O963J05833f319n4337C65082E147J08570Q860L7981J06757i8280C1183
17377E29480a7593B66330G4108M01190a08458A13618h4046B03591K5564M1920
17367B71075a22561D6790M78016A21940M2084D8569k3734J59812b1777o2571C32603
17355I7524M3255C5920i9855e124A75066F4296a05558C9059a59170B23357J2907
17344B36264n2826c6922r6106J3644B6401L48714g4637C25920F8608J1976P15084
17333G95668A89133d9790C76435C5167J63781l2359J68260j3220c8454B21844
17322A88934J11841F0042L53712j6335j22976A13965M40380k75498o2448C3786
$$ y = [54732, 227532, -122875, 238809, 423547, 219590, 196360, 183588, 122952, -31978, -23142, 24420, 33305, 40268, 146101, -6319, -60656, 365082, 5147, 113717, 122577, 160558, 267315, -98280, 31183, 529480, -17593, 266330, 74108, 475298, -108458, 113618, -84046, 203591, 229155, 271075, -122561, 46790, 524806, 121940, 164024, 48569, 24835, 184647, -21777, -84348, 332603, 97524, 140779, 35920, -99855, -5124, 175066, 64296, -105558, 39059, -159170, 223357, 236264, 183438, -36922, -133028, -119384, 26401, 375115, -74637, 325920, 68608, 80584, 795668, 189133, -49790, 376435, 35167, 198948, 166589, 334849, 321629, -38454, 221844, 188934, 300775, 60042, 413754, 397419, 274443, 113965, 554345, 278847, 216399, 33786]
17311C6937J18981h632B85345H399O9501k6275J24395K0250H9290L1713O6743
17300A87746f0061C542O317J5408p437J37768n1858L59841a02533E4493b1225
17288b58148P7974N6749B35907A8092a79746B67403A10481C3475b7686D12577
17277H5153L5666o0185J90286J59254j13772H2711J51068l3711M3327G2898J83013
17266B55911k8666c51691C35077q9485m0734m1891K358m8697a29348A01381J20366
17255B21747J6200A03590J39721B2584K98066D3968K51163J03106B7232L5856
17245F3088A3946J63567F6922K22720h0434I5114B6952L04474A12356i3818D10006
17233B18772N1756D0001c47327A16988K7568R2021J01964A48736J98993f730D10050
$$ y = [36937, 155918, -8632, 285345, 8399, 77900, 51625, 176020, 196270, 89290, 121003, 187746, -60061, 3542, 9859, 25267, 17830, 155598, 103740, 463581, -102533, 54493, -21225, -258148, -180174, -123425, 235907, 18092, -179746, 267403, 110481, 33475, -27686, 412577, 85153, 120819, 60634, 250920, 410174, 296402, 82711, 233779, 200068, 243395, 72898, 255911, 227245, -351691, 335077, 245592, 204858, 162967, 165325, 116628, -129348, 101381, 221747, 237947, 103590, 243311, 22584, 320650, 43968, 295131, 398237, 27232, 63088, 13946, 177513, 66922, 289642, -80434, 95114, 26952, 331426, 112356, -93818, 410006, 218772, 270528, 40001, -347327, 116988, 144556, 236577, 338541, 148736, 347729, -6730, 410050]
17221C03810j38566D4060R4635a8886A95117r1778l5091c42216C66355A28851
17210B63501E7978i5713A47729j9759J47600R8732j40130m9873J20681C9275f3013
17198B71481b11617E61816c94805i2235F44869B32385N681r4083G1561L9350O0693
17187A71604J94380j60987Q0082B4838M44438j97945Q3801j25442J64458j87541
17177B06607E8330J55685j3951K6699B8062M09282j89109b1227C09591j11781
17167A97810m2609Q6863K0462p844B4737K31145g7081B71142O2131A57803Q2044
17156B39847d8346D8705K00152m289j17842K68483J09074j72230b457B14121a92207
17144A93561J31415j36599q1458K71717n7860a09439B92555J6952q0144L4869
$$ y = [303810, 165244, 44060, 138695, -18886, 195117, 103339, 68248, -342216, 366355, 128851, 263501, 57978, -95713, 147729, 127970, 275570, 374302, 234172, 184299, 304980, 39275, -63013, 271481, -211617, 561816, -394805, -92235, 644869, 232385, 238066, 143983, 71561, 110911, 171604, 365984, 204997, 285079, 24838, 469276, 271331, 355132, 229690, 394148, 206607, 58330, 214015, 200064, 226763, 28062, 437344, 248235, -21227, 309591, 197810, 155201, 242064, 262526, 254682, 24737, 255882, -77081, 271142, 333273, 157803, 239847, -48346, 48705, 248857, 244568, 126726, 395209, 504283, 332053, -2457, 214121, -192207, 193561, 324976, 188377, 106919, 378636, 320776, -109439, 292555, 309507, 229363, 264232]
17134B64232p1424b08994E6445J86351o9608K18674J8608M143A53764M52915j22391
17123D84288k37329M8632O8942Q2459A91383m2075J19555N4827I5099M77238B04533
17111E46621o0942N2122B27560J78837K8389J3355j03767J45483J4343A39212
17100D22084l7999j6996j61964J4897K95768j98008r7837K97336P4983j45676
17090D46588K42840B43567K0811J40180j57627J56175A17914K74584L19584C06385
17079A80856J24403J32431Q2008k10002J24593r5805N4035M9936K69535k44221
17069D67769m863L95210C91545r7101K44660j49222r408K34630J26846l34244
17059D07706l2473R3001p4749j43813L149M22702j64583j29508M4754k1480J0988
$$ y = [264232, 192808, -208994, 56445, 242796, 173188, 391862, 410470, 414613, 153764, 606679, 484288, 246959, 295591, 364533, 446992, 191383, 149308, 268863, 323690, 95099, 572337, 204533, 546621, 485679, 537801, 227560, 406397, 434786, 448141, 344374, 489857, 504200, 139212, 422084, 384085, 367089, 205125, 220022, 515790, 317782, 219945, 517281, 592264, 446588, 689428, 243567, 264378, 404558, 246931, 403106, 117914, 392498, 712082, 306385, 180856, 305259, 437690, 519698, 309696, 434289, 338484, 392519, 442455, 711990, 467769, 462906, 858116, 391545, 294444, 539104, 389882, 380474, 615104, 741950, 407706, 375233, 468234, 393485, 249672, 252821, 675523, 510940, 381432, 426186, 404706, 415694]
17048D15694j20844K37596j23094O034J04251O660j82328J30248m1626p9245J12161
17037D65507O5774Q127A65116L19739j45064N9633Q2852J09927j08796l2289J97593
17026F48711j51495B09887K98972J96748k85228J39806K2911K3193o0817j27672
17016D17800L09164j04970K13089l23555j20380Q4324J79777P9662J339p0751
17006F65499J36700l13804J04791N1025O0245J75724q7174k70660K24707k40884
16996E06169J87239j81822J64957P924j49122J5367K41087k44667q1910K13492
16986F78714k78256K62053P1121r6460Q394M5219j34787r709L78784j29236j89189
16975F06648J18028j54608k84665N03710C04070N74098N8714o3943l7783k26340
$$ y = [415694, 294850, 532446, 409352, 415386, 519637, 526297, 343969, 474217, 432591, 353346, 465507, 531281, 539408, 165116, 484855, 339791, 399424, 482276, 592203, 483407, 451118, 648711, 497216, 209887, 508859, 705607, 420379, 560185, 583096, 606289, 545472, 417800, 726964, 621994, 835083, 511528, 391148, 475472, 655249, 734911, 736250, 665499, 802199, 488395, 593186, 644211, 704456, 880180, 793006, 522346, 747053, 506169, 693408, 511586, 676543, 684467, 535345, 550712, 791799, 547132, 465222, 678714, 400458, 662511, 733632, 637172, 645566, 690785, 555998, 546289, 925073, 795837, 606648, 724676, 570068, 285403, 789113, 304070, 878168, 936882, 872939, 835156, 608816]
16965F08816N16551m53589K26082j74687P5424j5143K6143J60483J56608m62445
16955F64243L3469K38160L1734k7820j94356Q545m0120L34754r1379j61503k2969
16944G72758j2838K40660j79773K13729k14474L04949k91913K50248K801Q63m367
16933A082643j85139O1759M4150m5508M9316J51967J93732l75846N0939j3411
16923A014602L28020m14603L55299q3115K30179j99264Q3538j00230J4074J69629
16913A398129l88409P3854L1388K95083R6632k2204l81519J43368O7454K49834
16903A563610j13157o9191l9671L12271j54330L1222j47789M68358l16228k61186
16893A273909K82088R8409j66464M3564l5135K28684L9528j21090k3518J27164
$$ y = [608816, 1125367, 671778, 897860, 723173, 798597, 783454, 809597, 970080, 1126688, 664243, 697712, 935872, 967606, 939786, 745430, 753975, 713855, 1048609, 957230, 795727, 772758, 759920, 1000580, 820807, 1034536, 820062, 1125011, 833098, 1083346, 1086147, 1087010, 1082643, 897504, 959263, 1003413, 957905, 1007221, 1159188, 1352920, 977074, 1028013, 1014602, 1342622, 928019, 1283318, 1200203, 1430382, 1231118, 1314656, 1214426, 1228500, 1398129, 1009720, 1083574, 1114962, 1410045, 1506677, 1484473, 1102954, 1246322, 1313776, 1563610, 1450453, 1381262, 1341591, 1653862, 1499532, 1530754, 1382965, 1851323, 1535095, 1273909, 1555997, 1654406, 1487942, 1531506, 1496371, 1725055, 1764583, 1643493, 1619975, 1747139]
16883A747139L0850J48737k39308j23765Q794N55341m65088J82349K9798J50306
16873B025153J5187k04309M75691l11499L14873k86994J30358l9124L97815m76623
16863B040528L8313J72038J18366n9045r2666Q3463N2022J00440R2130J33312
16853B678901j18793K25897j73386J90729j65361J13949K8544j31313J4150J31534
16843B794851L14488K2961J21019q1962q330P8240J84826J65888j38058L1122
16833C485045k7330j15643J48609J99658m5624J78849j26574K78515K01010r2112
16823D084403l4729r8623K04845L7378J84315n3315K02612P1545K14351j26718
16813D686064L621L08496J33980J40055R7271L72231j75190K65484K82632p3903
$$ y = [1747139, 1777989, 1926726, 1687418, 1563653, 1572447, 2127788, 1662700, 1845049, 1874847, 2025153, 2040340, 1836031, 2311722, 2000223, 2315096, 2028102, 2158460, 2119336, 2517151, 2040528, 2078841, 2250879, 2369245, 2310200, 2217534, 2300997, 2353019, 2453459, 2545589, 2678901, 2560108, 2786005, 2612619, 2803348, 2637987, 2751936, 2780480, 2649167, 2663317, 2794851, 3109339, 3132300, 3253319, 3171357, 3163027, 3241267, 3426093, 3591981, 3453923, 3485045, 3457715, 3342072, 3490681, 3690339, 3644715, 3823564, 3696990, 3975505, 4176515, 4084403, 4049674, 3951051, 4155896, 4193274, 4377589, 4324274, 4526886, 4598431, 4812782, 4686064, 4689685, 4998181, 5132161, 5272216, 5369487, 5741718, 5566528, 5832012, 6114644, 6040741]
16803F040741M778L75589K7554K48753R3306l7166M13841k3941N48638r3697J72089
16792G770485L00400J23842L98841K86154k63102O27744J74809K11058J06991
16783I737222K62723M80157L04938K71244L60723L48943L40829L62653J50525
16774A2619957O09143K08068N27380Q66375j23974R84155Q04432K17167P95601
16765A7508304P67449L35290Q31045O10495J029275P81279Q13880J069557J282882
16756B5029456M36695J312650J149215J667756J308080J483128J662901J762081
16748C5811962J809665K253748J756298K453459K210746K550745L201058K853749
16740E4901430L184208L657614L531357M395759M003503N147428N164132N256651
$$ y = [6040741, 6045519, 6421108, 6448662, 6697415, 6790721, 6753555, 7167396, 7143455, 7692093, 7598396, 7770485, 8070885, 8194727, 8593568, 8879722, 8616620, 9244364, 9419173, 9630231, 9737222, 9999945, 10480102, 10785040, 11056284, 11417007, 11765950, 12106779, 12469432, 12619957, 13229100, 13437168, 13964548, 14830923, 14706949, 15691104, 16495536, 16712703, 17508304, 18275753, 18611043, 19442088, 20052583, 21081858, 21863137, 22677017, 23746574, 25029456, 25466151, 26778801, 27928016, 29595772, 30903852, 32386980, 34049881, 35811962, 37621627, 39875375, 41631673, 44085132, 46295878, 48846623, 52047681, 54901430, 58085638, 61743252, 65274609, 69670368, 73673871, 78821299, 83985431, 89242082]
16732H9242082O097190O010894O421677O842448P290868P672360P743189P572938
16724A44893646P578251P275681P054295O008484N479375L872597K784630J452620
16716A86399579J33537j698530k507595m240068n293439o195168o924479p564586
16708A52109251p321975p719098p831037p886997p321132p512494o112004o566301
16700I3838213o264501n368513n254766m624350m543207m550152l552250l491542
16692E6188932l309215k962593l048990k514936k282700k198891k341466k078169
16684C5451972j564182j892456j318807j468749j585872p07768j522522j315344
16676B4076272p05392j343875j001255q07173r92933k81981j061059o49801n96079
$$ y = [89242082, 95339272, 101350166, 107771843, 114614291, 121905159, 129577519, 137320708, 144893646, 152471897, 159747578, 166801873, 172810357, 178289732, 182162329, 184946959, 186399579, 186533116, 184834586, 182326991, 178086923, 172793484, 166598316, 159673837, 152109251, 144787276, 137068178, 129237141, 121350144, 114029012, 106516518, 100404514, 93838213, 87573712, 82205199, 76950433, 72326083, 67782876, 63232724, 59680474, 56188932, 52879717, 49917124, 46868134, 44353198, 42070498, 39871607, 37530141, 35451972, 33887790, 31995334, 30676527, 29207778, 27621906, 26914138, 25391616, 24076272, 23370880, 22027005, 21025750, 20218577, 19225644, 18943663, 17882604, 17232803, 16636724]
16667A6636724n82072n07482q20047m27552m69833n48879n27133m80410m14938
16658A1858378r5039k83316o19768l37001k60290m92602k36571n58647J35115
16649I110259k99576m23117J24674q36855J44570l74620p5285j82160j52858j49815
16639F885217m64740q716k93097k52016K86093p5612l44593l57038m03588L23064
16629E294974N8339n09688J56243m98947M19465k13978k50355m6376O9437Q8966
16619D568080n97772J07161m99628K22817K2857m04339L7561o6121J05662m0671
16609C455607k91121K15671m52755J32832n3856r4213M1518k46202K98042l47763
16599B657760M2790K5325l51206K69534R0622k51324l2300K02449K39696l53906
$$ y = [16636724, 16054652, 15547170, 14727123, 14299571, 13829738, 13280859, 12753726, 12273316, 11858378, 11763339, 11480023, 10860255, 10523254, 10262964, 9770362, 9533791, 8975144, 9110259, 8810683, 8387566, 8512240, 7675385, 7819955, 7445335, 7370050, 7187890, 7035032, 6885217, 6420477, 6411761, 6118664, 5866648, 6152741, 6077129, 5732536, 5375498, 4971910, 5294974, 5353313, 4843625, 4999868, 4500921, 4920386, 4706408, 4456053, 4409677, 4479114, 4568080, 3970308, 4077469, 3577841, 3800658, 3823515, 3419176, 3456737, 3390616, 3496278, 3455607, 3164486, 3380157, 2927402, 3060234, 3006378, 2912165, 2953683, 2707481, 3005523, 2657760, 2700550, 2725875, 2374669, 2644203, 2734825, 2483501, 2451201, 2653650, 2893346, 2539440]
16589B539440k09074m2526J43566p8760k7718j58513j13366K5290O3681J23523
16579B265543k74600P368l43002O3510J84157p4154j24496J55357O444l637l40393
16568A522097J95591j81286r7411J38765O8007k31958j81143M39711l67456J55279
16558A460196n5836k26842N40970k52760J5186K2713j86245j08956m1404K43161
16548A410183j76703j3061p5175L42602l34398K88900n97710J24937r4598R7631
16538I72608L30473j49184K17118j13303M220r9497m23039J80785J99560j38114
16528I81627l46384L00068j98776L01839k02606J36459o1972j11724j6871K55840
16518A037500M4532m98727K70693M1379K03652l11004j13675j40871J29101L26395
$$ y = [2539440, 2330366, 2287840, 2431406, 2352646, 2324928, 2166415, 2053049, 2078339, 2142020, 2265543, 1990943, 1998311, 1655309, 1718819, 1902976, 1828822, 1704326, 1859683, 1866127, 1862490, 1522097, 1717688, 1536402, 1438991, 1577756, 1645763, 1413805, 1232662, 1672373, 1304917, 1460196, 1404360, 1177518, 1718488, 1465728, 1480914, 1503627, 1317382, 1208426, 1167022, 1410183, 1233480, 1220419, 1145244, 1487846, 1153448, 1442348, 844638, 969575, 874977, 972608, 1303081, 1153897, 1371015, 1257712, 1261932, 1162435, 739396, 920181, 1119741, 981627, 635243, 935311, 736535, 1038374, 835768, 972227, 910255, 798531, 781660, 1037500, 1082032, 583305, 853998, 895377, 1099029, 788025, 674350, 533479, 662580, 988975]
16508I88975l28251l8069j51358L85941j84570j49585j49927L29285L86837C29385
16497E68183j79968L47883j2336J86059m07211J67915Q3732R2501j88947J28205
16487G86016j48018r8596J01953r2659o6720K24243B03713M91375k7575j71666
16477D95847O8260j06012P0967B00277J09772J56391k15428J07852j5122j02338
16467B41404J1719N46370k00144B08753L87188J28419k73339p9276o3004O4317
16457C73058M908J5188O6145A95524N91324C33370O8428j12036L45212j09158
16447E25816j4626J08274j53980L3419A62600K82642c872I7138J90701r9738K28497
16436D16598o2762q0726A22207Q4029J70619Q4394o3574N0577h2920F25719B81409
$$ y = [988975, 660724, 622655, 471297, 857238, 672668, 523083, 373156, 702441, 1089278, 329385, 568183, 388215, 736098, 723762, 909821, 502610, 670525, 754257, 846758, 657811, 786016, 637998, 539402, 641355, 548696, 481976, 706219, 203713, 695088, 667513, 495847, 564107, 458095, 529062, 200277, 310049, 466440, 251012, 358864, 343742, 241404, 253123, 799493, 599349, 208753, 595941, 724360, 451021, 371745, 308741, 373058, 377966, 393154, 459299, 195524, 786848, 333370, 401798, 289762, 634974, 525816, 511190, 619464, 465484, 498903, 162600, 445242, -3872, 97138, 287839, 188101, 416598, 353836, 273110, 122207, 206236, 376855, 461249, 397675, 448252, -82920, 625719, 281409]
16424D82757A56398J41198L7326f6195B38289J3878p7307M7210j10473L22240
16414D33837r1614H9760M1121R1333K32184j80431K07413j09476L91065B49425
16403b8163B20271O9575m8144M5369P9746J95935E2707R0940D1422L10575A72692
16391I9157K05568J0014H4N65905A7242K18805A02429L57330O768a07362B62524
16379A22509L58595j23506A42249C3929M53446B19649m1560N2639m3989Q0011
16369B66750A27482a68077B74749j13357p3655p111J46121l4317L65576H3894
16358A14260K08601j52822b30619F9950d4330A92755a83368B10138P2693j00732
16348A82099p3987l3978J41236Q4933j40347J3511J89986A27748j6501J49294
$$ y = [482757, 156398, 297596, 334922, -66195, 238289, 252167, 174860, 222070, 111597, 433837, 342223, 89760, 130881, 222214, 454398, 273967, 481380, 371904, 762969, 249425, -28163, 220271, 289846, 241702, 287071, 366817, 562752, 52707, 143647, 41422, 351997, 172692, 99157, 304725, 314739, 84, 565989, 17242, 236047, 102429, 459759, 466527, -107362, 262524, 122509, 481104, 357598, 142249, 33929, 487375, 219649, 178089, 230728, 186739, 266750, 127482, -168077, 274749, 161392, 87737, 80626, 226747, 192430, 558006, 83894, 114260, 322861, 170039, -230619, 69950, -44330, 192755, -183368, 210138, 282831, 182099, 108112, 74134, 215370, 300303, 159956, 173467, 363453, 127748, 111247, 260541]
16338B60541q2086e1225A71606a21483B87304F8214N5932k7120e3816B79858E2122
16326B09598N5960d0860C42308G2916J08552B5904b0666A3849L92804I8808l4115
16315F4693e6489D8409b22729A54565m5429g9035k26158A66129l6095p363Q9008
16304B11679a03474p6592A32077K24732G9649R1284J34248q6325A3091N1185J49851
16293B14127a15115B24507N5021c64060C9251I441Q4666e1941m3941B10388n0449
16282A59939H753K02354G4901J6714c1074j10317I2965b08446I9677d5675H3660
16270A49797b9632A79938Q6383d6533j77075A68238e1375A32925K5075A6783b2489
16258a0625l5706k33769A99184a27343d1270B54883D6908J54351K7401l8577A5033
$$ y = [260541, 178455, -51225, 171606, -121483, 287304, 68214, 124146, 97026, -53816, 279858, 52122, 209598, 265558, -40860, 342308, 72916, 181468, 25904, -20666, 13849, 406653, 98808, 64693, -56489, 48409, -222729, 154565, 109136, -79035, -305193, 166129, 130034, 122671, 211679, -103474, -180066, 132077, 356809, 79649, 170933, 305181, 218856, 13091, 64276, 214127, -115115, 224507, 279528, -364060, 39251, 9441, 94107, -51941, -95882, 210388, 159939, 8753, 211107, 74901, 91615, -31074, -141391, 92965, -208446, 99677, -45675, 83660, 149797, -29632, 179938, 266321, -46533, -223608, 168238, -51375, 132925, 158000, 16783, -22489, -10625, -46331, -280100, 199184, -127343, -41270, 254883, 46908, 201259, 228660, 190083, 15033]
16246A02059J56310B6755J12441N2800o1881E6720L47699A5078a26024A68099
16235D22122D8459d2083p924j1156m4007L155A33717r001J63884a78085B22622
16223a76332E2011e0884J8639C97495A22589J45281b79400i807A85396f6236B293
16211a64039A42629q095L1575a31783I5206h4459c6306A40012P3268a21935G0244
16199b9773A13964c878l9618F4358N2156K42403b84749J08145c0427H5818a30053
16187a05907L2000B3848g1033G2456L37727j09069b57646a08417l3944K5470A34441
16175a81468L8234d0060r5382g759A01552k7127J95176b02192A39083h4074l941
16164h8015A03889f0524A8657J04210d0461A18439D1822a06637F0123B3323J20839
$$ y = [102059, 258369, 26755, 139196, 191996, 130115, 56720, 404419, 15078, -126024, 168099, 422122, 48459, -42083, -50007, -61163, -105170, -102015, 133717, 124716, 288600, -178085, 222622, -176332, 52011, -50884, -32245, 397495, 122589, 267870, -279400, -9807, 185396, -66236, 2293, -164039, 142629, 134534, 166109, -131783, 95206, -84459, -36306, 140012, 213280, -121935, 70244, -29773, 113964, -3878, -43496, 64358, 116514, 358917, -284749, -176604, -30427, 85818, -130053, -105907, -73907, 23848, -71033, 72456, 410183, 301114, -257646, -108417, -142361, -116891, 134441, -181468, -143234, -40060, -135442, -7759, 101552, 74425, 269601, -202192, 139083, -84074, -88015, 103889, -60524, 18657, 122867, -40461, 118439, 41822, -106637, 60123, 23323, 144162]
16153A44162L4467C1349c6773k67168L3333A8509f9618p2787A00345P924d4745
16141g0701o9600e4111J6203j27895G4674A0955Q0527e4458h824B53624G6030
16129h4046j04495R3097j37175C08744p8854J01433a74906M9030H4076c0319m5687
16118g6006G3389b3578A95048a86251A82549p1330b31510C2069B099L27464a78019
16106d12821L7508a64673e0683H5881J862e3950K671l6040I6831O2019a75610
16094A83976b6653k58165a12759D6603M192M2474A1753a52275A01131m4147Q912
16083F5896b25054B47147E7615c4662k68279k6438f0393a3005m6782j62210a8380
16071H6579j7447k9876K6989a71465a8160c598k47039J06789C7510J02894a17239
$$ y = [144162, 178629, 31349, -36773, -303941, -270608, 18509, -69618, -142405, 100345, 108269, -44745, -70701, -140301, -54111, -37908, -165803, 74674, 10955, 91482, -54458, -8824, 253624, 76030, -84046, -188541, -95444, -232619, 308744, 229890, 331323, -174906, -125876, 84076, -30319, -76006, 73389, -23578, 195048, -186251, 182549, 111219, -231510, 32069, 2099, 329563, -178019, -412821, -375313, -164673, -50683, 85881, 87743, -53950, -51279, -87319, 96831, 158850, -175610, 183976, -26653, -284818, -112759, 46603, 50795, 93269, 11753, -152275, 101131, 56984, 65896, -225054, 247147, 57615, -34662, -302941, -329379, -60393, -13005, -59787, -221997, -18380, 86579, 69132, 39256, 66245, -171465, -18160, -3598, -250637, -143848, 37510, 140404, -117239]
16059a3539o5903K9633A98091h1441A20499c5831l73590D3340f1605m20288a3683
16047E937R3873B9165f9296A68180q3404A077g5372B1608O7898f3072B3064b24168
16034d9742o9059G5084h9135L7152A3881Q5496K6008R2565a47925B06788E4504
16022A00855c67265M5575G7950J77598f2081D7001J41977c14232h9455j8117C06473
16010B2860i4080k459B11877b27791D7741a46036E2278A1552c05896h4357r8381
15999a82738b5029j07750B5639c06186C6883b5130j64217N3188F2390a8288j21559
15988a39847B40876p7463i2103k15328I724N8836L33214H9992K5689J94190H6026
15976A24602C6376b54340F2548a71437k36025A78192b09999n100A93722a07817
$$ y = [-13539, -79442, -49809, 198091, -81441, 120499, -35831, -409421, 43340, -61605, -481893, -13683, 5937, 99810, 29165, -69296, 168180, 84776, 1077, -75372, 21608, 89506, -63072, 23064, -224168, -49742, -118801, 75084, -89135, -51983, 13881, 99377, 125385, 217950, -147925, 206788, 54504, 100855, -367265, -321690, 77950, 255548, -62081, 47001, 188978, -314232, -89455, -107572, 306473, 22860, -94080, -96539, 211877, -227791, 47741, -146036, 52278, 11552, -305896, -84357, -182738, -25029, -132779, 25639, -306186, 36883, -25130, -189347, -136159, 62390, -18288, -139847, 240876, 163413, -92103, -307431, 9724, 68560, 401774, 89992, 115681, 309871, 86026, 124602, 36376, -254340, 62548, -171437, -407462, 178192, -209999, -215099, 193722, -107817]
15965b96083A90663d3955A88413a6747F452J76786k0334b15915D73450A47224
15954A29926M4621i2523j00823J1805A49193h3447H988b83147a21651k01257Q8999
15943b33909J10150D375O91J11574h412C6917J3910g9098l2532A80954n5624g8530
15930a390m02304K6346a1198j02412j68421D3462b1684j56189J3360B41809E9635
15918A38875a67939k599c3518H7727P6413m7425e1431a5088E15382i4869m2884
15907a37753G9747M077g9341F7453a00982e868n4554A47516k70d9833k27829B5649
15894c26615N5937E0585c75127J56776d0530I7789l8536i5158A27519P9624a82388
15882a67460e7746J7753j00605F3149J94553c4603j730G8524J92037l2615J51843
$$ y = [-296083, 190663, -43955, 188413, -16747, 6452, 183238, 162904, -215915, 473450, 147224, 129926, 174547, -92523, -193346, -181541, 149193, -83447, 8988, -283147, -121651, -322908, -233909, -123759, 4375, 5066, 116640, -8412, 36917, 50827, -79098, -111630, 180954, 125330, -78530, -1390, -403694, -377348, -11198, -113610, -282031, 43462, -21684, -177873, -164513, 241809, 59635, 138875, -167939, -170538, -33518, 87727, 164140, 116715, -51431, -15088, 515382, -94869, -137753, 79747, 83824, -79341, 67453, -100982, -5868, -60422, 147516, 147246, -49833, -277662, 25649, -326615, -270678, 50585, -375127, -218351, -40530, 97789, 59253, -95158, 127519, 207143, -182388, -167460, -57746, -39993, -140598, 63149, 257702, -34603, -36333, 78524, 270561, 237946, 389789]
15871C89789a54009N2654A17588d02402J67837N8450B8442f6453D170h4592B02041
15859a47199A11923e9445C7586b37871K8096A30477A5537L36165b27887J6413
15849b11474E0143b36565h6384F1201J43618F6451a90466H8610L293B5027K4494
15838D9521a65317B284J96256q7735a43452b8774r623l60879a16609o8187b7260
15826d05261A700M1566a54563N5556r1013A30411e1910n3750K088L1867j69187
15815b40892c726p534l19095f1147K2530r9811B46368b06132B20961a45547E6003
15803a14596E2601b8942A24037O1318D6351b44950P0385c1273k69159A64810h1805
15791a06517o7379o711C43379e5407k80075C7026J92591E8569a34657G4304i6420
$$ y = [389789, -154009, -101355, 117588, -402402, -234565, -176115, 28442, -66453, 4170, -84592, 202041, -147199, 111923, -59445, 37586, -237871, -209775, 130477, 15537, 351702, -227887, -211474, 50143, -236565, -86384, 61201, 204819, 66451, -190466, 88610, 91903, 25027, 49521, -165317, 2284, 198540, 110805, -143452, -28774, -38397, -399276, -116609, -184796, -27260, -405261, 1700, 43266, -154563, -99007, -190020, 130411, -51910, -105660, -103572, -71705, -240892, -3726, -11260, -330355, -61147, -38617, -138428, 246368, -206132, 220961, -145547, 56003, -114596, 52601, -28942, 124037, 185355, 46351, -244950, -174565, -31273, -300432, 164810, -81805, -106517, -173896, -180607, 343379, -55407, -335482, 37026, 229617, 58569, -134657, 74304, -96420]
15779A05563L3762D2715a39371k14063A39170a91335P8139A16703Q406d38695
15768a8388o7533j35032o5579d9164j0598k08866b9949j26586a4181E6958a0690
15756g1694C3269O3250d5754j79289B36842c79934a6217p5853A88939b95120a10996
15744a09103D571J82615q9515a35626H8101P260D7213a75405d8112k22974e5570
15732A39551K5693a14077n9583j41361g3327B59873A28319k8404d23280A20248
15721A30450O1812E7858L16922c09081B61740A16930e9425L500F2311g6257I0126
15709a35571A68782G0407J78043E1505a37267G1902b94647N6548A9935P4120D1919
15697e1608A36546C5011N5963b38078a9644b49p0599A32258Q740a19548K4302
$$ y = [105563, 139325, 42715, -139371, -353434, 139170, -191335, -113196, 116703, 125109, -438695, -18388, -85921, -220953, -286532, -49164, -59762, -268628, -29949, -156535, -14181, 56958, -10690, -71694, 33269, 96519, -45754, -225043, 236842, -379934, -16217, -92070, 188939, -295120, -110996, -109103, 4571, 187186, 97671, -135626, 88101, 95361, 47213, -175405, -48112, -271086, -55570, 139551, 165244, -114077, -173660, -315021, -73327, 259873, 128319, 99915, -423280, 120248, 130450, 192262, 57858, 374780, -309081, 261740, 116930, -59425, -55925, 62311, -76257, 90126, -135571, 168782, 70407, 248450, 51505, -137267, 71902, -294647, -238099, 19935, 94055, 41919, -51608, 136546, 35011, 90974, -238078, -19644, -249, -70848, 132258, 140998, -119548, -95246]
15686i5246B6901e5637q999H6347b21417C599J03759a21366b7679A16037h8700
15674A73285a38101e1299B63869F5357K52049C2588G215J22774a6388E3889I116
15662G8307J42961i952o1296p3657A01462L138m4726J15572E2079K0770b17224
15650E4700K90283B1136a90871B5302a04843m017E7940e2492j92036Q0563A60933
15638a73478I593a57086e2821A7259R9746J42925a71918C8423L7530a16414A65912
15626C88511c9900N834A90517G8689h1918c7255C2788d4582l1859m1310A29329
15614a76780C0439J83405O3934b75294e6866A14702D494K6629K51962b67417f8720
15602c47647B47472a46086L58A07061M7455e2784j48952O3502l7148D2482B1109
$$ y = [-95246, 26901, -55637, -64636, 86347, -221417, 3599, 107358, -121366, -27679, 116037, -88700, 173285, -138101, -51299, 263869, 65357, 317406, 32588, 7215, 129989, -16388, 53889, 9116, 78307, 221268, -9952, -71248, -144905, 101462, 104600, 59874, 175446, 52079, 72849, -217224, 54700, 344983, 21136, -190871, 25302, -104843, -108860, 57940, -52492, -244528, -163965, 160933, -173478, 9593, -157086, -52821, 17259, 117005, 259930, -171918, 38423, 75953, -116414, 165912, 388511, -39900, -34066, 190517, 78689, -81918, -37255, 32788, -44582, -76441, -117751, 129329, -176780, 30439, 213844, 277778, -275294, -56866, 114702, 4494, 31123, 283085, -267417, -68720, -347647, 247472, -146086, -145728, 107061, 154516, -52784, -201736, -138234, -175382, 42482, 21109]
15590C92507A60891g1728C10994A24977H440K99319e8676D1366D602a78196k7373
15579b05569B3263c62221e8465r0519K9312r9228E7505j8785P5795a73692M3238
15568a30454A29433b03414o4775a8083A23160b33194a8987G3526f6698B32787
15557a52575j02896A81195A2929a07409j50165d349j89289i210j9361j93455A30577
15545a44486B18740f6417B5818O6773e6419j8967K8773H7450P9630d6203C31427
15533A28241b90174H7883K36423b01963O524C0089K82483A03279a30510B11010
15522B3776M257J21104b70581A20445B3136J97997n6676a3058A54601a79058A79644
15510C1627a86543a5560k18961E311J7985g2424q819L9158o4501E9820P7145b5045
$$ y = [392507, 160891, -71728, 310994, 124977, 8440, 307759, -58676, 41366, 4602, -178196, -205569, 23263, -362221, -58465, -148984, -119672, -218900, 57505, 38720, 114515, -173692, -130454, 129433, -203414, -268189, -18083, 123160, -233194, -18987, 73526, -66698, 232787, -152575, -255471, 181195, 12929, -107409, -257574, -4349, -193638, -9210, -28571, -222026, 130577, -144486, 218740, -66417, 25818, 92591, -56419, -75386, -46613, 87450, 167080, -46203, 331427, 128241, -290174, 87883, 324306, -201963, -195439, 30089, 312572, 103279, -130510, 211010, 23776, 28033, 149137, -270581, 120445, 23136, 221133, 164457, -13058, 154601, -179058, 179644, 31627, -186543, -15560, -234521, 5311, 23296, -72424, -81243, -42085, -106586, 59820, 136965, -25045]
15497G4578a77207b6006B21683c64100A90893a07008A51771b72215D9558d096
15486a10478B18954c07037A78334d4272B18699b04239k47721G7256o105j9015
15476E2136J65616E4427J91342c8534o806B37194i3637A77962m7787d7667M210
15465d3457K0070A70174m5281h9235F5714Q8572a23955B45416a9512B09493D5501
15453B8257b0036A3161O1179a63637E6105K3227b81836n2022P2030b7262A15651
15441C08814a46095K904n5039A52148o737b6154B2932P2361b61833A11640N9485
15430A71125p3980J40130G8339a26224A69459r821b242k30465J0070e9711k4814
15419h4525j30225K3163A43520C3983d8129H383J14168K5261a26609B72781j15742
$$ y = [74578, -177207, -26006, 221683, -364100, 190893, -107008, 151771, -272215, 49558, -4096, -110478, 218954, -307037, 178334, -44272, 218699, -204239, -451960, 77256, 71151, 52136, 217752, 54427, 245769, -38534, -45340, 237194, -93637, 177962, 130175, -47667, -43457, -23387, 170174, 124893, -89235, 65714, 154286, -123955, 245416, -19512, 209493, 45501, 28257, -20036, 13161, 74340, -163637, 56105, 79332, -281836, -333858, -261828, -27262, 115651, 308814, -146095, -143191, -198230, 152148, 145411, -26154, 22932, 95293, -261833, 111640, 171125, 97145, 237275, 78339, -126224, 169459, 159638, -2242, -232707, -222637, -59711, -84525, -214750, -191587, 143520, 33983, -48129, 8383, 122551, 147812, -126609, 272781, 157039]
15408A57039p6801f8629A08518M1442L5240E1358J1489d9611A9988a49330M7108
15397a02222r9939k16983a72233k08342b2351A7830K7085J22908B3934a51157
15386a93072D79944b03653o6103B35658O6699a41253r3616A22757b06466A09461
15375D34835a43375D4480b57333a3707A85946k3085J28689d4770q604A66411E7544
15363c23830A56344e9512j2799A51037a17565d0965n0371C19525B4338c53235
15352f7074c791k19511A04476d9134l9155C71735i4896A16769a66829B11519G3887
15340b91827M4415A37818n5711N5748E8083K56077k8682J09279H050b99928B5759
15328H959O1014b52879e8115C7552a25283d8262m0288n3264g0878b8334r8813
$$ y = [157039, 80238, -68629, 108518, 149960, 185200, 51358, 62847, -49611, 19988, -149330, -102222, -202161, -419144, -172233, -380575, -22351, 17830, 44915, 167823, 23934, -151157, -193072, 479944, -203653, -269756, 235658, 302357, -141253, -234869, 122757, -206466, 109461, 434835, -143375, 44480, -257333, -13707, 185946, 162861, 291550, -44770, -53374, 166411, 57544, -323830, 156344, -59512, -72311, 151037, -117565, -40965, -91336, 319525, 24338, -353235, -67074, -3791, -223302, 104476, -49134, -88289, 371735, -94896, 116769, -166829, 211519, 73887, -291827, -247412, 137818, 82107, 137855, 58083, 314160, 285478, 394757, 8050, -299928, 25759, 8959, 69973, -252879, -58115, 37552, -125283, -48262, -88550, -141814, -70878, -28334, -127147]
15317a27147e0563D4883a91274O9309a0563j90076b8847m3578c3405A19927q800
15306A11127a62177A10700Q8622A4535J3682N5557C4132a68695k8469f5988C15900
15294a54943A02393J98524i5722I9689L9519M2929k7819b11566N9073E2434A4692
15282c658G1997i2750A5188L90M492d8598A16316l7898a82974B21220a30474O0545
15270f9929n8091A11888J35768g5898k2j87635A76910b51444B858J74604c5810
15258A91610J34139e2248I5423A4670a56632A94356C8002K27178Q7434K81911
15248F34525P78526L05518m15102J52378n54986A00333A5975i8411g748B94273
15237G5857a52192E6909J00433b21833B02291J65768h5025j32374i8228a2685
$$ y = [-127147, -50563, 44883, -191274, -121965, -10563, -200639, -28847, -72425, -33405, 119927, 111127, -162177, 110700, 199322, 14535, 28217, 83774, 34132, -168695, -197164, -65988, 315900, -154943, 102393, 300917, -95722, 99689, 139208, 182137, 154318, -211566, -152493, 52434, 14692, -3658, 71997, -92750, 15188, 15578, 20070, -48598, 116316, 78418, -182974, 221220, -130474, -69929, -128020, 111888, 247656, -75898, -75920, -263555, 176910, -251444, 2858, 177462, -35810, 191610, 325749, -52248, 95423, 14670, -156632, 194356, 38002, 265180, 352614, 634525, 1413051, 1718569, 1303467, 1455845, 900859, 100333, 15975, -98411, -7748, 294273, 75857, -152192, 56909, 157342, -221833, 202291, 368059, -85025, -217399, -98228, -12685]
15226A48381a91555A46942a5157j84578K9909A387N9786j1283J42492b2806q2662
15215a05468C23092C8785K28557m3903G1461a30508B72943b54084G776M483a9246
15203b5960k2997A37092J84141b81266a36056L2542k0537b3886A13454f1122B87587
15191D04466A62867J78520j57956j3615g4000A55295G2826g9441A76567a02568
15180c55546H2645A7976M502N6453L60595A71057c27739A30270b35623d4580E0109
15168A98478M747a28382l2531A3166K1972K142Q7074K1096a61649C54862c07887
15156H5546c96796F4122k2416g3398j94922A75294F0474Q722K32166G5216n679
15145F9537c8318a2185A3157a6458A9530a07201C84348D8884J00091b54068e2588
$$ y = [148381, -191555, 146942, -15157, -199735, -169826, 1387, 61173, 49890, 192382, -22806, -105468, 323092, 38785, 267342, 223439, 71461, -130508, 272943, -254084, 7776, 12259, -19246, -25960, -48957, 137092, 321233, -281266, -136056, -103514, -124051, -23886, 113454, -61122, 287587, 404466, 162867, 341387, 183431, 169816, -74000, 155295, 72826, -79441, 176567, -102568, -355546, 82645, 17976, 22478, 78931, 439526, 171057, -327739, 130270, -235623, -44580, 50109, 198478, 203225, -128382, -160913, 13166, 35138, 37280, 124354, 145450, -161649, 354862, -307887, 85546, -396796, 64122, 41706, -73398, -268320, 175294, 60474, 69196, 301362, 75216, 69537, -38318, -12185, 13157, -16458, 19530, -107201, 384348, 48884, 148975, -254068, -52588]
15133B800K13536a85856k7940B27472J85345E2753J14024o5516J24198A11204
15122F6746O2735L7331J86165j71878F283K43216a47226F1608b7743C4675j47
15111C4528A1345L7449J67427E4522M28386j37708E1018J03887J78844l3085j27229
15100A73435b39332a14531L1742H5138J9489b73793B42337F6216d6474H2588b59377
15088C97244j35035o2197a60037B37690a07938C5466R2011e3468A69952p9956
15078H9996K51728h8552C80294F2505R7561O9988K6479A03695m7900g4984j13479
15067a88463A56100j3571A1686i353B07265L8189g6057I3722J84383F6837K0738
15056H7575a0339B19705N779J6678B4333J23328J49584a17340B85218J15286D7544
$$ y = [2800, 216336, -185856, -213796, 227472, 412817, 52753, 166777, 101261, 225459, 111204, 66746, 129481, 166812, 352977, 181099, 6283, 249499, -147226, 61608, -27743, 34675, 34528, 11345, 48794, 216221, 54522, 482908, 345200, 51018, 154905, 333749, 300664, 173435, -239332, -114531, -82789, 85138, 104627, -273793, 242337, 66216, -46474, 82588, -259377, 397244, 262209, 200012, -160037, 237690, -107938, 35466, 127477, -53468, 169952, 89996, 341724, -88552, 380294, 62505, 160066, 230054, 256533, 103695, 55795, -74984, -188463, 156100, 142529, 11686, -9353, 207265, 245454, -76057, 93722, 278105, 66837, 87575, -10339, 219705, 225484, 242162, 24333, 147661, 297245, -117340, 285218, 400504, 47544]
15044b17077H4681g0196D5489h514I2789Q0308H1154P0021Q9082a5510D4922K2892
15032F7814J08471R0116J17034j46609L2602L366j09057D2761K99903K39297c2779
15020E39168e7654A18630R4262o5057a08709B31209m1833n7578a94820e9860H0979
15008A21242J48185m6710E1369K9590M2141N3788P8785P9961E8811J81894a18311
14996A42858F1938j5112J73033M5430r0008J80687L0799j29774a2556B58861R471
14985B68332M2463J83657j93699j35028R7737L3120I2144J0114J95465j15431
14975A82292p0798a25914G5689M52453k39396o1279b373B70797R6206j29106B6060
14963b9399B3201K57836l283q3504b8884a1131A9705K59065j27159b0914j5679
$$ y = [-217077, 84681, -70196, 45489, -8514, 92789, 173097, 81154, 151175, 240257, -15510, 44922, 67814, 176285, 266401, 383435, 236826, 269428, 272794, 163737, 42761, 342664, 581961, -32779, 539168, -57654, 118630, 212892, 147835, -108709, 231209, 189376, 131798, -194820, -59860, 80979, 121242, 269427, 222717, 51369, 80959, 123100, 176888, 255673, 335634, 58811, 240705, -118311, 142858, 61938, 46826, 219859, 265289, 175281, 355968, 386767, 256993, -12556, 258861, 268332, 310795, 494452, 300753, 165725, 263462, 296582, 92144, 102258, 297723, 182292, 111494, -125914, 75689, 528142, 288746, 227467, -2373, 270797, 367003, 237897, 26060, -29399, 23201, 281037, 277754, 194250, -28884, -11131, 19705, 278770, 151611, -20914, -36593]
14952c6593B20950k0498J19607p4550N6721A50544K66789A13259K67212P6033
14942D56504k21840q5171M33194k28134r7468K46157d69170D66091B14457b74513
14931B17513J70274j54367K66768a37658A62155c47218E9963K59071E9948J52225
14921B12173o2179J63437A39444K37362M407G9133M58679k46238o8781L22369
14911E45162j51714j4834H8296K7808J10985a57947e894E49376A80636J06224
14901B86860F0218c6683B00535L4485J45361A54197J5325K24315j34437o61J77715
14890D36454j99859J268M9455K4318p8918N3235J51506m345r5200a91238A64047
14878B80721m4279m2745J50161n5709J15460j20552A3187K22924P5487q5436K80655
$$ y = [-36593, 220950, 200452, 320059, 245509, 302230, 150544, 417333, 113259, 380471, 456504, 234664, 149493, 582687, 354553, 257085, 503242, -469170, 466091, 214457, -274513, 217513, 387787, 233420, 500188, -137658, 162155, -347218, 59963, 319034, 59948, 212173, 149994, 313431, 139444, 376806, 381213, 79133, 537812, 291574, 222793, 545162, 393448, 378614, 88296, 116104, 227089, -157947, -5894, 549376, 180636, 286860, 60218, -36683, 200535, 235020, 380381, 154197, 169522, 393837, 259400, 258739, 436454, 236595, 237863, 287318, 311636, 232718, 285953, 437459, 433114, 337914, -191238, 164047, 280721, 236442, 193697, 343858, 288149, 403609, 283057, 13187, 236111, 311598, 226162, 506817]
14867E06817j97251L19130A83890P1550G6075J65506J67981E5866Q3780L39255
14857D78901H6250K20790J1169M2126Q301J26604A46540L59412J72273k04918
14847D73307N4857j65954p9076O7087d4487A26462K62878K40915B34037J68150
14837D02187J90798B95590N9697j3675l0274J97975J68984j77314B40456J36181
14827C76637Q2010J29311J0914B52460K67435L8576k09123R0374N5916l0647J00882
14816E65873j38700l7767N2746I4923N03115j9985A96644M38431j02040B04161
14805E44430j80982K41430B68884K94443Q1531j46793K573k9367P2330L3264J46807
14794G23672j31022k09211m8972L1516j46803P7264R0248j59583L07938J26554
$$ y = [506817, 309566, 628696, 183890, 255440, 76075, 241581, 409562, 55866, 139646, 478901, 86250, 307040, 318209, 360335, 368636, 495240, 146540, 505952, 678225, 473307, 528164, 362210, 283134, 350221, -44487, 126462, 389340, 630255, 234037, 402187, 592985, 295590, 355287, 341612, 311338, 509313, 678297, 500983, 240456, 376637, 458647, 587958, 598872, 252460, 519895, 558471, 349348, 439722, 495638, 464991, 565873, 427173, 389406, 442152, 94923, 598038, 578053, 196644, 635075, 533035, 204161, 544430, 363448, 604878, 268884, 563327, 644858, 498065, 500638, 471271, 543601, 576865, 723672, 592650, 383439, 334467, 365983, 219180, 296444, 386692, 227109, 535047, 661601]
14784F61601Q5301k09091m1620K1700k9569L2897j64495J43021k6937N5519j93377
14773C34950J59312A88327J1089J82194r7000K89986n2585l3238K41871l30979
14763C99665L29767k72196o6428J50361k67848J53446j99576M53131B68813J91980
14753D60793K29371N2104j01293O1115j66842K0344J7949o4952j7150n6447L28334
14742G63326k62576J65855L4842j01716A54407M98165J93851N1320j35646C47265
14731C93128M03146j65815k07879K84688o1230o1781Q9097k13311K05952N0244
14721G16239l17420M58174C63553N19671k43897K48316m08459K44420p2766K73619
14711I24457D61114o9721L73845C74046Q5997j1951J38420n962r5467Q5362L42177
$$ y = [661601, 746902, 537811, 496191, 517891, 488322, 521219, 356724, 499745, 472808, 528327, 334950, 494262, 188327, 199416, 381610, 284610, 574596, 522011, 488773, 730644, 399665, 729432, 457236, 390808, 541169, 273321, 426767, 227191, 680322, 268813, 460793, 690164, 742268, 640975, 702090, 535248, 555592, 573541, 508589, 491439, 434992, 763326, 500750, 666605, 701447, 599731, 154407, 652572, 846423, 897743, 762097, 347265, 393128, 796274, 630459, 422580, 707268, 646038, 584257, 673354, 460043, 665995, 716239, 398819, 856993, 363553, 883224, 639327, 887643, 479184, 723604, 650838, 924457, 461114, 391393, 765238, 374046, 460043, 448092, 586512, 580550, 485083, 570445, 912622]
14700I12622B63359J67814K75788l6766l8640R053L1648N94195E66602j32512
14690D34090M96540l24638j84829M04526j33478J34338l01478L91877m00506L57806
14680H74248l40876M00922j93425J32240K88918m90708L43235K97761k72848l76110
14670F63357L46941L9169k35871r3822M2280j7718L00490l19547K20452K23113
14660A168844k84035J03342r1463p5835J68342l3392O5853k6301L81l8427J58196
14649A115505k57848p3547L51151m34509K04146J27102R694J7457Q0119j38525
14639A000745r3589k15843M79847K3856k51256J31334o9757q7895O3533J46745
14629A127720o0448J20143k51362J55753j54973K8679K31137k0798q5860N3270
$$ y = [912622, 263359, 431173, 706961, 670195, 631555, 640608, 672256, 1266451, 566602, 434090, 930630, 605992, 421163, 825689, 692211, 826549, 525071, 916948, 516442, 874248, 533372, 934294, 740869, 873109, 1162027, 671319, 1014554, 1312315, 1039467, 663357, 1010298, 1049467, 813596, 719774, 762054, 744336, 1044826, 725279, 945731, 1168844, 884809, 988151, 896688, 820853, 989195, 955803, 1021656, 995355, 995736, 957309, 1115505, 857657, 784110, 1135261, 700752, 904898, 1032000, 1041694, 1059151, 1139270, 1000745, 907156, 691313, 1171160, 1195016, 943760, 1075094, 1005337, 917442, 980975, 1127720, 1067272, 1187415, 936053, 1091806, 936833, 965512, 1196649, 1175851, 1089991, 1143261]
14619A143261k13810K58912P5914j2967l0105L4921J08342M5646k77056J70070
14609A303128K45079k65564J21949j13510J39529k18189L32619l90946J79687
14600A333782R3031K58976m16462L93461j2546m95546K61138M15175n70124Q8670
14590A349555J17628n8927K43692q2733k72188L31840L6469l2240P4221J55475
14580A862792k94110M618M57176m52154J1240J70331p3638n7089L01426k33585
14570A697007L29198j05816J70474l83073K99099N2626j82100M34352l20302L63371
14560B354836o7213J32302J8500L7670J85537k2297N08246K29277L88378K54950
14550D020186J216609K582130M268348R790288J6566202k883185A6276479G998938
$$ y = [1143261, 929451, 1188363, 1264277, 1251310, 1221205, 1256126, 1364468, 1410114, 1133058, 1303128, 1548207, 1282643, 1404592, 1291082, 1430611, 1212422, 1545041, 1154095, 1333782, 1426813, 1685789, 1269327, 1662788, 1650242, 1154696, 1415834, 1831009, 1260885, 1349555, 1467183, 1408256, 1651948, 1569215, 1297027, 1628867, 1665336, 1633096, 1707317, 1862792, 1568682, 1573300, 2030476, 1578322, 1589562, 1759893, 1686255, 1629166, 1930592, 1697007, 2026205, 1920389, 2090863, 1707790, 2006889, 2059515, 1877415, 2311767, 1991465, 2354836, 2287623, 2419925, 2438425, 2476095, 2661632, 2639335, 3147581, 3376858, 3765236, 4020186, 5236795, 7818925, 12087273, 21877561, 38443763, 35560578, 16276479, 7998938]
14541D320417j713654n27545j85241k86142K67131o12886M69804J2083n9618o2866
14531A621483K12750k64353J79237m67030O02422K03916j3859j05233k71522N26099
14521B223910j18662r9030l3756K82723j68671r7515L36792k25652J36598k01297
14511B035440K38670K08770m27052L89496l0398q8608J9013O12308k35412j22628
14501B599599k10602M09329L76323l40369j96855n0600q209J66028J07385k62471
14491B589558K65727k35669K96431N4988J54989m0318r1474J26735K80370N787
14481C407124j46859j29616m8410K84657r7149J57385N9612j24231K73625L7608
14471C673746j79763L15110k9835m8634J09781J23084m27585M42018O6407P61
$$ y = [4320417, 2606763, 2079218, 1893977, 1607835, 1874966, 1262080, 1731884, 1743967, 1684349, 1621483, 1834233, 1569880, 1749117, 1282087, 1884509, 2088425, 2074566, 1969333, 1697811, 2223910, 2105248, 2006218, 1972462, 2255185, 2086514, 1988999, 2325791, 2100139, 2236737, 2035440, 2274110, 2482880, 2055828, 2445324, 2414926, 2326318, 2345331, 2957639, 2722227, 2599599, 2388997, 2798326, 3174649, 2834280, 2637425, 2586825, 2578616, 2744644, 2852029, 2589558, 2855285, 2619616, 2916047, 2971035, 3126024, 3085706, 2994232, 3120967, 3401337, 3407124, 3260265, 3130649, 3082239, 3366896, 3269747, 3427132, 3486744, 3362513, 3636138, 3673746, 3493983, 3809093, 3779258, 3730624, 3840405, 3963489, 3535904, 3977922, 4044329, 4045090]
14461D045090J568k55193o6489K68582p2122K80869p8202J74226j45492N88884
14451D741721n80003L68269L35809l54315j09915M80422K51864j23122J8633k68681
14441D760682L04067P0899p9865j92562K86288J98786J36369J45231J63764J25032
14431E918691N2047j20688P4120J52499J8681j91576L57916L7622K37329k15581
14421F321060J96051M30368j21329J72018J098n7827J29343J66854J48100K97272
14411G683008k0057N157K03345P0695k1848L62963p6083l4131K23128N35054l70079
14400H561152M12717n1223K17004K4309K76503K17284K68673J21975J85527L20932
14390A0554853j46805K26451R279K30933M81213M3426O5268L84148M25539L21310
$$ y = [4045090, 4046658, 3791465, 3724976, 3993558, 3921436, 4202305, 4124103, 4298329, 4152837, 4741721, 4161718, 4529987, 4865796, 4511481, 4401566, 4881988, 5133852, 5010730, 5029363, 4760682, 5064749, 5135648, 5055783, 4863221, 5149509, 5348295, 5484664, 5629895, 5793659, 5918691, 5970738, 5850050, 5924170, 6076669, 6095350, 5903774, 6261690, 6299312, 6536641, 6321060, 6517111, 6947479, 6826150, 6998168, 6999266, 6941439, 7070782, 7237636, 7385736, 7683008, 7662951, 7668108, 7871453, 7942148, 7920300, 8283263, 8207180, 8173049, 8396177, 8931231, 8561152, 8973869, 8922646, 9139650, 9163959, 9440462, 9657746, 9926419, 10048394, 10233921, 10554853, 10408048, 10634499, 10643778, 10874711, 11355924, 11399350, 11464618, 11848766, 12274305, 12595615]
14380A2595615J54685K31341k26624K28552M00297K69771N81084l44908O61567
14371A4551380M25368K24612J37717L68561N01725K72036K74179M39010K96676
14362A7491264L72521K13427O27536L17960O27633K64670M25505P13364N79023
14353B1632903J23981N71942N66952J020495K74584R99193M32728O88745N28415
14344B6839938Q20256L80175J233539M45783Q73691R36966O92015R72045J064130
14335C4258538J453739R04681Q98171J069437J651719P66604J297517J493475
14327D3793881J698747J389429J475211J640161J931958J705977J920747K072571
14319E7628682K237474K052148K787401K073402L050194K689178L039203L036442
$$ y = [12595615, 12750300, 12981641, 12755017, 12983569, 13383866, 13653637, 14234721, 13889813, 14551380, 14976748, 15201360, 15339077, 15707638, 16209363, 16481399, 16755578, 17194588, 17491264, 17863785, 18077212, 18704748, 19022708, 19650341, 19915011, 20340516, 21053880, 21632903, 21756884, 22328826, 22895778, 23916273, 24190857, 25190050, 25622778, 26311523, 26839938, 27660194, 28040369, 29273908, 29719691, 30593382, 31530348, 32222363, 33194408, 34258538, 35712277, 36616958, 37515129, 38584566, 40236285, 41002889, 42300406, 43793881, 45492628, 46882057, 48357268, 49997429, 51929387, 53635364, 55556111, 57628682, 59866156, 61918304, 64705705, 66779107, 69829301, 72518479, 75557682, 78594124]
14311G8594124L350139M062580L289691M181920M233835M366916M802486M918614
14303A11800305N536067N690037O144075O758308O784566P562619P841463Q642883
14295A66760323R193376R427326J0510239J0668879J1214686J2416732J2560077
14288B42751638J3691609J3622046J4640679J5207032J5317298J5558749J5988696
14281C46777747J5193429J5298911J4237703J3537690J2534625J0680474R002760
14274D37263339N730603j09085j342739j529791k033861k649199p404591q857470
14266D19067206r000153j0615622j2690181j3829759j5251041j6131331j6315747
14259C25233372j6361475j5868640j5073290j5135507j3693092j2352218j2745570
$$ y = [78594124, 81944263, 86006843, 89296534, 93478454, 97712289, 102079205, 106881691, 111800305, 117336372, 123026409, 129170484, 135928792, 142713358, 150275977, 158117440, 166760323, 175953699, 185381025, 195891264, 206560143, 217774829, 230191561, 242751638, 256443247, 270065293, 284705972, 299913004, 315230302, 330789051, 346777747, 361971176, 377270087, 391507790, 405045480, 417580105, 428260579, 437263339, 442993942, 442884857, 441542118, 440012327, 437978466, 435329267, 427924676, 419067206, 410067053, 399451431, 386761250, 372931491, 357680450, 341549119, 325233372, 308871897, 293003257, 277929967, 262794460, 249101368, 236749150, 224003580]
14252B24003580j2020336j1653547j0520461j0031070r337727q819557q165351
14245A53455531p574256p158552o458834o703220n827001n765525n336132m427080
14237A04204931m543038m705300m091605l898538l561827l578037l120317k768109
14229G3938160l396856k477404k680084k683318j729945k848738j795833j987327
14221E4338655j972067j823222j877890j509819j448142j448190j217233j785983
14213D1256109o70090j797938j066157j418698r08116o44827o50429j010559j180430
14204C1908865q91714j209455n00417n04815o66827r45878q07562q21934m10398
14195B5149865p63620l24040o30478p89115n68287n46806o68753j72055m42788
$$ y = [224003580, 211983244, 200329697, 189809236, 179778166, 170440439, 161620882, 153455531, 145881275, 138722723, 132263889, 125560669, 119733668, 113968143, 108632011, 104204931, 99661893, 94956593, 90864988, 86966450, 83404623, 79826586, 76706269, 73938160, 70541304, 68063900, 65383816, 62700498, 60970553, 58121815, 56325982, 54338655, 52366588, 50543366, 48665476, 47155657, 45707515, 44259325, 43042092, 41256109, 40586019, 38788081, 37721924, 36303226, 35395110, 34750283, 34099854, 33089295, 31908865, 31017151, 29807696, 29307279, 28802464, 28135637, 27189759, 26382197, 25560263, 25149865, 24386245, 24062205, 23431727, 22642612, 22074325, 21527519, 20858766, 20686711, 20243923]
14186B0243923o46207k02989o73119l00134n17876k39779m08692l61268n9767
14177A6834092o21333l13253k39352n72227j99113N1294p22633k534k68914k57849
14167A3688178n38179j4230l9898l53536n17599j17547J5389k86053j97299j90118
14157A1449108k46096j64301l35446P4057p37191O6078J71810n57200J10610j21400
14147I710029k71284J59060o96043j16987M0516L5375k23547o7659l46435j07394
14137H115631k91279O8820l30044L32703j9455p61301L93813p1992n664l45655
14127G085577l10036l3489j94943J66554k73513Q5728j06245j56973K70950n75405
14117E958205m8650O2292l25105M33960j59975k83835j70856K45790l47752L9269
$$ y = [20243923, 19597716, 19394727, 18721608, 18421474, 17903598, 17663819, 17255127, 16893859, 16834092, 16212759, 15899506, 15660154, 15087927, 14888814, 14940108, 14217475, 14214941, 13946027, 13688178, 13149999, 13135769, 13095871, 12742335, 12224736, 12107189, 12122578, 11836525, 11639226, 11449108, 11203012, 11038711, 10703265, 10777322, 10040131, 10106209, 10278019, 9720819, 9831429, 9710029, 9438745, 9597805, 8901762, 8784775, 8825291, 8860666, 8637119, 8569460, 8223025, 8115631, 7824352, 7893172, 7563128, 7895831, 7876376, 7115075, 7508888, 7436896, 7431232, 7085577, 6775541, 6742052, 6547109, 6713663, 6440150, 6525878, 6419633, 6262660, 6533610, 5958205, 5909555, 5971847, 5646742, 6080702, 5920727, 5636892, 5466036, 5711826, 5364074, 5403343]
14107E403343P1309k57390r3345L74443k37848m86928Q5470J59131k11800p1587
14097D734798J29904k15386j26036K21221l17657K45982j28956K86l21047k44857
14087C978252M87138l28408K15129k29178k26041J28205k9782j88959J50403M879
14077C961638k95135p8144M82603k95306j61398L10826j91086j87977j3809j46579
14067C385633j10445Q4883n5787j65597K7576j55989L04071Q7411l30248r5552
14057B975956J62683J44126l00101J25640k9044j58520k26479L52670M17896m28996
14047C035831j59587J19037k28367j37820J52420n4390m0208J57881j54460N113
14037B695450j56912J54589K34384m24067J42478J6973j58363j68125K56554K75002
$$ y = [5403343, 5474652, 5217262, 5123917, 5498360, 5260512, 4773584, 4859054, 5018185, 4806385, 4734798, 4864702, 4649316, 4523280, 4744501, 4426844, 4672826, 4543870, 4544156, 4223109, 3978252, 4465390, 4136982, 4352111, 4122933, 3896892, 4025097, 3995315, 3806356, 3956759, 3961638, 3666503, 3588359, 4070962, 3775656, 3614258, 3925084, 3733998, 3546021, 3532212, 3385633, 3275188, 3360071, 3304284, 3138687, 3166263, 3010274, 3314345, 3401756, 3071508, 2975956, 3138639, 3282765, 2982664, 3108304, 3079260, 2920740, 2694261, 3046931, 3464827, 3035831, 2876244, 2995281, 2766914, 2629094, 2781514, 2727124, 2686916, 2844797, 2690337, 2695450, 2538538, 2693127, 2927511, 2503444, 2645922, 2662895, 2504532, 2336407, 2592961, 2867963]
14027B867963k62772p2165n7171j18255k01014K94548j51646Q007k36223L26125
14017B397397l72022J08568j83187m4621L05223j40647j74933M9402M8416J44804
14007B138400k2106l07161K9569L085k582l7952q4048J7431J74610j95299J30300
13996A844247J29767N8008k66858O0835K02522M3869L12553J995187K949115Q097225
13986A5426470J7726773N496685A8859419q420394m155646j576601r93696k25236
13978C487846o77904j22800R3859j97727k84546q9856L09787m7619m86006J88618
13968B173652j22640J27476m93685p5843K30709Q5403L5431k33991j24407j70177
13958A431928O5632L31234j36711P1255j95346J22235j89914K11080L5966j34255
$$ y = [2867963, 2605191, 2533026, 2475855, 2357600, 2156586, 2451134, 2299488, 2307495, 2071272, 2397397, 2025375, 2133943, 1950756, 1906135, 2211358, 2070711, 1895778, 1945180, 1993596, 2138400, 2116294, 1809133, 1838702, 1841787, 1839205, 1801253, 1717205, 1734636, 1909246, 1713947, 1844247, 1974014, 2032022, 1765164, 1825999, 2028521, 2072390, 2384943, 4380130, 7329245, 15426470, 33153243, 38649928, 18859419, 10439025, 6283379, 4706778, 3713082, 3487846, 2809942, 2687142, 2781001, 2583274, 2298728, 2208872, 2518659, 2471040, 1985034, 2173652, 2051012, 2178488, 1684803, 1608960, 1839669, 1925072, 1960503, 1726512, 1602105, 1431928, 1497560, 1828794, 1692083, 1763338, 1567992, 1690227, 1500313, 1711393, 1747359, 1613104]
13948A613104K3974L3976j13066k26294L92305l61868J7373l2106Q6945n7908
13938A376435m2879j530j72946L34337J19551l13635J09744j16973J83015J465
13928A476584Q3448k07960k12915K59550J0758j24314j5858j73585J86629l1095
13918A251242M11762l90853k59184K38263j41712K88708j2824l29458M02599k21023
13908A237520k91149k17928N17056k3374K7532j63671m9657J36511j16690k41527
13898H14623o2971K02892J98375j34143J84046l57356m8927M19036k84460J30081
13888A061196k30265K7457O7285K23879j91894k7598K33615k09866j01452K8013
13878H80370M93677E61881N32736R9887N4106l72769j76898P6902R9198l8261
$$ y = [1613104, 1637078, 1671054, 1557988, 1331694, 1723999, 1362131, 1379504, 1347398, 1434343, 1376435, 1333556, 1332026, 1159080, 1493417, 1612968, 1299333, 1409077, 1292104, 1475119, 1476584, 1560032, 1352072, 1139157, 1398707, 1409465, 1285151, 1269293, 1095708, 1282337, 1251242, 1663004, 1272151, 1012967, 1251230, 1109518, 1398226, 1385402, 1055944, 1458543, 1237520, 946371, 728443, 1245499, 1222125, 1249657, 1085986, 1036329, 1172840, 1056150, 814623, 751652, 954544, 1152919, 1018776, 1202822, 845466, 796539, 1215575, 931115, 1061196, 830931, 858388, 925673, 1149552, 957658, 930060, 1163675, 953809, 852357, 880370, 1374047, 561881, 1094617, 1194504, 1248610, 875841, 698943, 775845, 875043, 836782]
13868H36782J86447J19200l92011K13222m41931q2390L14930J72327m23138M43607
13858I47045N8657m00738J86089P7490O1213L3243k21939K38266k40894K50676
13848I89108k06161r6631J3837K1133k5875P7003J49421K3309k99329J27255k1324
13837G51746r9408J79738j34023j81731L10592k7940J54276k84073J28508o3384
13827G34301O4715j08187J92110j17537J61715j98037k82930j6497L35838J7810
13817G83301j50433J82128j76306O5461J56932l04599O986k61199N03038K28150
13807A033459m88995K18761k4712j3588O1986j23622N7994M4239J4323k90599
13797D89246l6935J79348K51900l61458K05495l13201K49461q6584J11039j94259
$$ y = [836782, 1023229, 1142429, 750418, 963640, 521709, 439319, 754249, 926576, 503438, 947045, 1005702, 604964, 791053, 868543, 929756, 962999, 741060, 979326, 738432, 989108, 782947, 686316, 700153, 721286, 695411, 772414, 921835, 945144, 645815, 773070, 751746, 652338, 832076, 698053, 516322, 826914, 798974, 953250, 669177, 797685, 734301, 799016, 690829, 882939, 765402, 927117, 729080, 446150, 429653, 765491, 783301, 632868, 814996, 638690, 704151, 861083, 556484, 563470, 302271, 805309, 1033459, 544464, 763225, 738513, 724925, 786911, 663289, 721283, 765522, 779845, 489246, 452311, 631659, 883559, 522101, 727596, 414395, 663856, 577272, 688311, 494052]
13787D94052k317k8430J52469P1550j83712K68646k60424Q8981R954O3621k87769
13776C86621P4101J81134O5290j31407j75296q2260M76525j96758k387p2378j8841
13765E04344O178m8171R511L92823m00560j7152m827N2400j20204N11891j99475
13754F86758o9109k06199j42720P3052J03134k0740n783j32060r9663K12158q1555
13743C17273K46799J86536r6011B48664k2288N07972B58929K00827L39959k94703
13733E05012A42524M71241N6064k76553O7791O4077l9622j41664J41351j76414
13723C08795M61854l85165j28399n4314K47843K02435C13218j26104L33410l5342
13713D85182K28019B70899K79021B53574J57547r7192O4405O7244P7089j00066
$$ y = [494052, 491735, 463305, 615774, 687324, 503612, 772258, 511834, 600815, 610769, 674390, 386621, 460722, 641856, 707146, 575739, 400443, 318183, 794708, 597950, 595563, 523185, 504344, 510522, 462351, 471862, 864685, 464125, 446973, 442146, 494546, 374342, 886233, 686758, 617649, 411450, 268730, 341782, 444916, 424176, 418393, 286333, 186670, 398828, 317273, 564072, 750608, 654597, 248664, 226376, 734348, 258929, 459756, 799715, 505012, 142524, 613765, 669829, 393276, 461067, 525144, 485522, 343858, 485209, 308795, 770649, 385484, 257085, 202771, 450614, 653049, 313218, 187114, 520524, 485182, 713201, 270899, 549920, 253574, 411121, 313929, 378334, 445578, 522667, 422601]
13703D22601J5675m8128j04105A30055L00799J91821j28447J03694A52837p0717
13693H2120M24830p1934j74492K62066K6823A32395L02218O5394J3033A59707
13682E44012J49A68713J6539N06325k46410j93203l8243q5488K10721L28028A65144
13670I3685P4102Q5425J21921j08763J68545k9198J97486k12573K49580k47612
13660C92598P0756Q8913J18480J12461A52442A6085K82985F2192M00504l1809
13650D30887j13820P8677R1737A10646n2584K79255l3999J24051j73207A1003
13639D00233K10396o3839C8380K39593a40255A52580L0265K08377L56831l33161
13629D14892H4067K32845I8900M25534B51533K22813l9985j92711K04913J7960
$$ y = [422601, 438276, 390148, 286043, 130055, 430854, 622675, 494228, 597922, 152837, 82120, 506950, 435016, 260524, 522590, 549413, 132395, 434613, 500007, 513040, 159707, 544012, 544161, 168713, 185252, 691577, 445167, 251964, 213721, 128233, 338954, 666982, 165144, 93685, 167787, 253212, 375133, 266370, 434915, 405717, 603203, 390630, 640210, 392598, 463354, 552267, 670747, 783208, 152442, 16085, 299070, 62192, 462696, 430887, 317067, 395744, 487481, 110646, 58062, 337317, 303318, 427369, 254162, 11003, 400233, 610629, 546790, 38380, 277973, -140255, 152580, 182845, 391222, 748053, 414892, 84067, 316912, 98900, 524434, 251533, 474346, 434361, 241650, 446563, 464523]
13619D64523N1672A47618J69164j42052l3984J13592Q1255m3718J71757j83431
13609B80201N5467J36575m7474H0257L08079A33520K03846A58472J69850J83142
13599E11464Q623A35287O993J11614N3228N8382P2310k18088J68342p3581M0945
13588C55432A73959J27936J27732j75661L226J031o8257J46000N470j57170J70011
13577C54277j11528m3194K47614j23985j3183j40665M54786k86064j31990K46946
13567D53014A43999J89106A26536J48479P9712a02132B55945P7880m1570H0058
13556B45935r3651J91337j66622R1449H8821L18421m9271p5320J29171G4114K7569
13545A01683m2893k6698K58674A04805L02267L6810j62577J47447D2230a53197
$$ y = [464523, 516195, 147618, 316782, 174730, 140746, 254338, 335593, 291875, 463632, 280201, 335668, 472243, 424769, 80257, 388336, 133520, 337366, 158472, 328322, 511464, 520087, 135287, 142280, 253894, 307122, 365504, 437814, 219726, 388068, 314487, 355432, 173959, 301895, 429627, 253966, 257192, 258223, 189966, 335966, 341436, 184266, 354277, 242749, 199555, 447169, 323184, 310001, 169336, 624122, 338058, 206068, 453014, 143999, 333105, 126536, 275015, 354727, -102132, 255945, 333825, 292255, 80058, 245935, 152284, 343621, 176999, 268448, 88821, 407242, 357971, 282651, 411822, 74114, 101683, 58790, 32092, 290766, 104805, 407072, 443882, 281305, 428752, 42230, -153197]
13534b06417A47667K63075l7302A01080K64261b5904C83921J6203d410B27984
13523B31700E1380q166H928K10405I6957L54009A11138C8241J12900O143L39260
13512D96544j12497A91629J9161P4589H4324J528B8212K69530L8986j44530J17898
13501C10096E5439J99119r909O1683L1631O9151k1894A79200K35433B4355K94625
13490C18980N1949A04289P5002C1479K50016o0312K85265A1256J34124I953N9048
13479F9001N6250J30880r5790a20478B34155o4299c1595D57512j41486r0502E4586
13467C59466A61654J90378j61267O9826P7355N0981A59768N9684C1898L52142
13457C84040j28370O3064C6186K19382c2291D8086K23106L30341k37175D4045
$$ y = [-206417, 147667, 410742, 373440, 101080, 365341, -25904, 383921, 400124, -4410, 227984, 231700, 51380, 43214, 8928, 219333, 96957, 450966, 111138, 38241, 151141, 157284, 496544, 384047, 191629, 210790, 285379, 84324, 85852, 28212, 297742, 336728, 192198, 310096, 55439, 254558, 244649, 306332, 337963, 407114, 385220, 179200, 414633, 24355, 318980, 370929, 104289, 179291, 31479, 281495, 221183, 506448, 11256, 145380, 9953, 69001, 125251, 256131, 160341, -120478, 234155, 169856, -31595, 457512, 316026, 225524, 54586, 359466, 161654, 352032, 190765, 260591, 337946, 388927, 159768, 219452, 31898, 384040, 255670, 318734, 36186, 255568, -32291, 48086, 271192, 601533, 364358, 44045]
13446C15721J87b04863E075K03420q0536N9365L8850j5791J79148j22397q2452
13435A84682a5977g942B27912K2608k5785J09627c3974C78887I4834K70864D366
13423C20864A58643K09965G1756J0071d835j94680A20587D3759R9814d8065C12127
13411B20482J3695J43948a91858C46796i7522q2704C12009q7454P5015d9388B05230
13399A52536a10965C49297M83645H0735J30989K50966e2337A68511i0222o8822
13389a59044B51860b06719b7580B86528K17067k11243b81078a352A64303n6104
13379A08199b22929A64197J30579k7944L8918q9748j359M7366C2949J37789L6100
13368B06838j8389f1645D28191A44786N559R3871I4304N44387H3534N6156F7730
$$ y = [315721, 315908, -204863, 5075, 208495, 127959, 187324, 226174, 210383, 389531, 267134, 184682, -15977, -7942, 227912, 250520, 224735, 334362, -33974, 378887, 94834, 365698, 4366, 320864, 158643, 368608, 71756, 81827, -4835, -199515, 120587, 43759, 143573, -48065, 312127, 220482, 234177, 378125, -191858, 346796, -97522, -180226, 312009, 224555, 299570, -49388, 205230, 152536, -110965, 349297, 832942, 80735, 211724, 462690, -52337, 168511, -90222, -159044, 251860, -206719, -27580, 286528, 503595, 292352, -281078, -1352, 164303, 108199, -222929, 164197, 294776, 266832, 305750, 216002, 214643, 262009, 32949, 170738, 206838, 188449, -61645, 428191, 144786, 150345, 244216, 94304, 638691, 83534, 139690, 67730]
13356A60302K7074p7702D6299L21075A48977F4606K8594K19087j52158K63574
13346D23703M5163k04587k4163p8142E1533K39425j15218K0212M52091A28789
13335F5273q802M86051k38526A11257K39072E2958M2956K25975H3368K12860A10696
13323A75457J48785A58453B5323L871P8499B1871L15443j0074j30197E0996K13222
13312B64218m6367F1113a10537d4458n5851B73943l5067H5972k4543a23277A0677
13300c66968I3268a22780A84956J56961A31368K27581j59130p2285J16077a54965
13289A58027J66894A27618d3034l8094J2517H8000B784J27716l3975D3544P7880
13278A21424a25269k8478d9332A58892G4592J40230c0679m11669F7145J00607
$$ y = [160302, 187376, 109674, 46299, 367374, 148977, 64606, 93200, 312287, 160129, 423703, 468866, 264279, 240116, 161974, 51533, 290958, 175740, 195952, 648043, 128789, 65273, 56471, 542522, 303996, 111257, 350329, 52958, 95914, 321889, 83368, 296228, 110696, 175457, 324242, 158453, 25323, 29194, 107693, 21871, 337314, 327240, 197043, 50996, 264218, 217851, 61113, -110537, -44458, -100309, 273943, 238876, 85972, 61429, -123277, 10677, -366968, 93268, -122780, 184956, 341917, 131368, 358949, 199819, 127534, 243611, -154965, 158027, 324921, 127618, -43034, -81128, -68611, 88000, 2784, 130500, 96525, 43544, 121424, -125269, -153747, -49332, 158892, 74592, 214822, -30679, -442348, 67145, 167752]
13268A67752A8538J4208d8825A79395n8429J50831A31959c0938C11677N4593a57724
13256h0502F2906L4803j0423K2998B4155c246F3568K10702k3403d03A38888D5073
13243A50904a19000b1175C3108g1433A55138D6974a18750A26577J17135a87939
13232A16444J68358b60045A86957o0809b5948E431a68418g4303k4860C12958N806
13221C18764j11574e4339D1468L31067A77145b82514B31021a21354A39600m983
13211A34617P4743h312C5700K93836G6932e4628l7407I4923G30a34211A40233
13199B18822A05896K41224a7903A81023o7038R6218c2247A27980a95007D77822
13188A794a66012A05771b82605b5333H117J83122p0729J07156m1644a36334b6551
$$ y = [167752, 18538, 32746, -48825, 179395, 120966, 271797, 131959, -30938, 311677, 366270, -157724, -80502, 62906, 97709, 87286, 110284, 24155, -3246, 63568, 274270, 250867, -403, 138888, 45073, 150904, -119000, -21175, 33108, -71433, 155138, 46974, -118750, 126577, 243712, -187939, 116444, 284802, -260045, 186957, 126148, -25948, 5431, -168418, -74303, -99163, 312958, 318764, 207190, -54339, 41468, 372535, 177145, -282514, 231021, -121354, 139600, 134617, 209360, -8312, 35700, 329536, 76932, -54628, -92035, 94923, 730, -134211, 140233, 218822, 105896, 347120, -17903, 181023, 113985, 210203, -32247, 127980, -195007, 477822, 1794, -166012, 105771, -282605, -25333, 8117, 191239, 120510, 227666, 186022, -136334, -26551]
13176d8013J1383B41649r2460A4333i4633j14415B97539g7732A66131g5831o1842
13165a37673L7261B5752f7082A23086m8887J81982A8796r147J73882b7452j52930
13154a80382N8851I911r29J23981f8768B46829G5691K15288a3669C13996g8551
13142A32398C0416j0755b13228h0426D3378a55712C01341l3145g9046A64127o2566
13131A01561k9257i9227D17013g2144j89591A07372N0225a68919f5305q1620H6427
13119a8408I4074O4915b16351B15392b7298l7474C10550A33607c4904B08952g1782
13107a38541B50701A0405K50600I6239a13795e418o063p8110B40849G3179k8643
13096D4536J63402i3846H3734L46745b11840A56245a8583j6138B75852b51904
$$ y = [-48013, -36630, 241649, 149189, 14333, -94633, -209048, 297539, -77732, 166131, -75831, -137673, -100412, 25752, -67082, 123086, 74199, 256181, 18796, 9649, 183531, -27452, -180382, -121531, 9911, 8982, 132963, -68768, 246829, 75691, 290979, -13669, 313996, -78551, 132398, 30416, 19661, -213228, -80426, 43378, -155712, 301341, 268196, -79046, 164127, 101561, 72304, -99227, 417013, -72144, -261735, 107372, 157597, -168919, -65305, -146925, 86427, -18408, 94074, 158989, -216351, 215392, -27298, -64772, 310550, 133607, -34904, 208952, -71782, -138541, 250701, 10405, 261005, 96239, -113795, -5418, -11481, -89591, 240849, 73179, 44536, 207938, -93846, 83734, 430479, -211840, 156245, -18583, -34721, 275852, -251904]
13085B9405d994C33941A39306J91960b2536n3900E6330R7096J00733Q1418O6814
13074D02391o1470D5586c0119A02576l0658B2432g5287E5284J47940J26965r1253
13063B38936F3917a04042D05M4144i3709B46046q2387e598B70695B5955J94299
13052B20254b11324C409J49316o9489a24975F3275k7254J61288O7497c78305A03689
13040a97656B2323Q6528c3878G3692J0221J2069K10864g2776A68575a6841A33014
13028F4661K9627K17536Q9094b9268f125B42883d155A66194a29084E6617h8337
13016A49376E5602P0733c6090A05766i8119B42002H4068C3739K06844i6451C42071
13004G7885N5462J67143a15808B73626A35093A9889J15890l1206b64010g5917
$$ y = [29405, -4994, 333941, 139306, 331266, -22536, -76436, 56330, 153426, 254159, 335577, 402391, 340921, 45586, -30119, 102576, 71918, 22432, -75287, 55284, 203224, 330189, 238936, 63917, -104042, 405, 44549, -93709, 246046, 163659, -5598, 270695, 25955, 220254, -211324, 3409, 152725, 83236, -124975, 63275, 36021, 197309, 264806, -378305, 103689, -197656, 22323, 108851, -33878, 73692, 83913, 95982, 306846, -72776, 168575, -16841, 133014, 64661, 94288, 311824, 400918, -29268, -6125, 242883, -4155, 166194, -129084, 56617, -88337, 149376, 55602, 126335, -36090, 105766, -98119, 242002, 84068, 33739, 240583, -96451, 342071, 77885, 133347, 300490, -115808, 273626, 135093, 19889, 135779, 104573, -264010, -75917]
12993A14323K93922A71476m6268a39352B6153J04427M4937C1647J14062E4351
12982C31429A62983l318C5829b39145A07829o334a52144b7673A08727a33640B6609
12970A02057k6286a00874K5659j17984A0006L1280a22552o122j1190l5921p2262
12959b48047R8624m930c7577D3633a23032A82663n8655N6566J9922a25022A29246
12947f4887L083K1974k8646A0743a73535F8072B7370a70752A06575K03590a11939
12935B19648h095D7413P7245K03545a13666j39186B83947g2210A33720m7808j3339
12924G2573J23538L4968K88832d2r3637A32328i460A61308b05123c1087o0274
12913i1361B171K7950e2034j5308k4185A44107F2451d3365q3755L9613C7973a0009
$$ y = [114323, 408245, 171476, 125208, -139352, 26153, 130580, 175517, 31647, 145709, 54351, 331429, 162983, 159665, 35829, -239145, 107829, 101495, -152144, -27673, 108727, -133640, 26609, 102057, 75771, -100874, -75215, -193199, 10006, 41286, -122552, -128674, -139864, -175785, -248047, -149423, -154353, -37577, 43633, -123032, 182663, 124008, 180574, 200496, -125022, 129246, -64887, -61804, -39830, -68476, 10743, -173535, 68072, 27370, -170752, 106575, 310165, -111939, 219648, -8095, 47413, 124658, 328203, -113666, -252852, 283947, -72210, 133720, 85912, 72573, 196111, 231079, 519911, -42, -93679, 132328, -9460, 161308, -205123, -31087, -91361, 2171, 30121, -52034, -67342, -91527, 144107, 62451, -43365, -127120, -87507, 37973, -10009]
12900b3022B06465a00383C0885M8377m26f7144q152A47839G0794J1954a71155
12888h9248C34428A32450E6398k6493b44402B15707I173a65794B07515b11214
12877A81437H3834c24439f7008B11930e1433o1070E6251f543j00221J9157k7409
12866a15016l17516J26886D4260a59190b3697B56205o1163a89297A229a64709
12855F4226b75575N8428j97371g9919m0946d4221A91691h6534k4359A33422d1661
12843a12434m0967M6738B2301c191A94844a963A24377Q6480O0918b1819m6807
12832f8626o299r0936P235j2276A0379L21219a11777b5527j37083A99070b94490
12820c6425j68405j9507A17293P9027q7510e1295A65604a88261N9101a6239j33411
$$ y = [-23022, 206465, -100383, 30885, 79262, 78836, -67144, -75296, 147839, 70794, 82748, -171155, -89248, 334428, 132450, 56398, 29905, -244402, 215707, 9173, -165794, 207515, -211214, 181437, 83834, -324439, -67008, 211930, -51433, -112503, 56251, -6543, -106764, -87607, -115016, -432532, -305646, 44260, -159190, -23697, 256205, 195042, -189297, 1229, -164709, 64226, -275575, -217147, -414518, -79919, -120865, -44221, 191691, -86534, -110893, 133422, -41661, -112434, -153401, -106663, 22301, -3191, 194844, -1963, 124377, 210857, 271775, -21819, -68626, -74925, -165861, -158626, -170902, 10379, 331598, -111777, -25527, -162610, 199070, -294490, -36425, -204830, -224337, 117293, 196320, 108810, -51295, 165604, -188261, -129160, -16239, -149650]
12809a49650C4386K09099C0485i2790k20956J22812R2989J394A26125D708J961
12798F669J0318f6563l36691G8937M9612M4456j660c386I28J17556k0787b6005
12785A88078k5762K32152b73323a17688B8564f0489k48840B63401d21695A40626
12774a13830P675e0819j22079f2146m6705F1079e632p2883a1336j46802I6149
12762B14732F6784J71914g0247A00421K104a7880A45945e8861C1213R1487K62614
12751C85314F2470b9989A41432a60092I1533J90316n7797n0331p1258g1324C72963
12739a08889A05363K36181C0135K51154D9362a20799d2690k641j61834A74960
12728E8701e58651b39278B37141c39083c8499P901C1254N5273g6211A4686K67094
$$ y = [-149650, 34386, 243485, 30485, -92790, -313746, -190934, -97945, -96551, 126125, 4708, 6669, 16987, -66563, -403254, 78937, 128549, 173005, 171345, -3386, 928, 118484, 97697, -26005, 188078, 162316, 394468, -273323, -117688, 28564, -60489, -309329, 263401, -421695, 140626, -113830, -106155, -50819, -172898, -62146, -108851, 61079, -5632, -78515, -11336, -158138, 96149, 214732, 66784, 238698, -70247, 100421, 102525, -17880, 145945, -58861, 31213, 122700, 385314, 62470, -29989, 141432, -160092, 91533, 281849, 224052, 173721, 102463, -71324, 372963, -108889, 105363, 341544, 30135, 281289, 49362, -120799, -42690, -45331, -207165, 174960, 58701, -558651, -239278, 237141, -339083, -38499, -30598, 31254, 86527, -76211, 14686, 281780]
12717B81780a36292C76448a27156G9951c3559k0575r536A9202Q1391P0577A4823
12705a39855B89575B9705J91331j3792D742L03520b17295g6674A19266g0477B04672
12693C19056p1128H9398f700k67091A56697a25168k22654c7715k86303B64812
12682i7949j14541C5326K12793L7777H1521a46719j17754C65829D4305J19744
12672A64049c6550A84984P4287C2131a47238A6164M38573A30115R1578c21445
12661B1126J55005A5657L10372B5258c11029C9812M9853L21089B6693a75137B41555
12649A11450C3228J35492l4379m361a06694A38166i7345C4269P2524a7024A07315
12637b94537B63266b437j52294E9344M7292D9561a70183B3218K25909j01949k1
$$ y = [281780, -136292, 376448, -127156, 79951, -33559, -54134, -63670, 19202, 100593, 171170, 14823, -139855, 289575, 29705, 221036, 207244, 4742, 308262, -217295, -76674, 119266, -70477, 204672, 319056, 247928, 89398, -6700, -273791, 156697, -125168, -347822, -37715, -324018, 264812, -97949, -212490, 35326, 248119, 285896, 81521, -146719, -264473, 365829, 44305, 164049, -36550, 184984, 259271, 32131, -147238, 16164, 454737, 130115, 221693, -321445, 21126, 176131, 15657, 326029, 25258, -311029, 39812, 89665, 410754, 26693, -175137, 241555, 111450, 33228, 168720, 134341, 129980, -106694, 138166, -97345, 34269, 106793, -17024, 107315, -294537, 263266, -2437, -154731, 59344, 106636, 49561, -170183, 23218, 249127, 147178, 147157]
12626A47157R8781p8594K21920I1830K6490L8106j7009B0269R6878l1884b7629
12614D49350A53768a3222A18700a03164d7409J7093C95J78185a90342B64544K5948
12603B90492A37002p213A1909L43800a73785A28882J4635O5540m2814i6262E3649
12591A49802j7177K7505R0265f5085k55909J12203C7884K710a1642l4284E494
12579G6253a22298A1263K83081A45682J08342j3990a49480H3963f593n4063B58988
12567A10934a4824j8772j17873m0148j0850I3631m4636a41463A27010D640b70342
12555a75840c7047l564H11Q6514k7908J87136g0799A75116h0131J6100H4156O0148
12543A44304J90909p9077b19394b6570O370k14226b1989H3289c7910D1450q912
$$ y = [147157, 245938, 167344, 389264, 91830, 118320, 156426, 139417, 20269, 117147, 85263, -27629, 449350, 153768, -13222, 118700, -103164, -47409, -30316, 395, 178580, -190342, 264544, 290492, 137002, 129789, 11909, 355709, -173785, 128882, 143517, 209057, 166243, -96262, 53649, 149802, 132625, 160130, 250395, -65085, -320994, -208791, 37884, 40594, -11642, -45926, 5494, 76253, -122298, 11263, 294344, 145682, 254024, 240034, -149480, 83963, -6593, -60656, 258988, 110934, -14824, -33596, -151469, -191617, -202467, 93631, 48995, -141463, 127010, 4640, -270342, -175840, -37047, -40611, 811, 87325, 59417, 246553, -70799, 175116, -80131, -64031, 84156, 144304, 335213, 256136, -219394, -26570, -20200, -234426, -21989, 83289, -37910, 41450, 32538]
12532C2538L80207E8422f3242C58302A40043K77349B05482B4075d9225A40568
12521a06743j19418R2655e3700j23427D9765N1162K83658d0652p1404D7670r27
12510D6743Q4148a14112K0121j6903A64932h7788A33556n1838d8935B01383c5297
12498B78539I8499f1285A63065E2785J52830J072D1976J25347a28801A83831c6028
12486a91119E9390J41321b0854k08349J12799n4302m5505i0280a7290B51325j01604
12475A49721b4555E477b6286B20310a49399M9046j47763h5619a6457A21067J29122
12464B50189E5305a1031G4789L15862I1551a86704j01352R0212L2338D08211a59415
12452e1625C5745c1542l599k26371a21999j88917d2680Q612m69442A06880N933
$$ y = [32538, 412745, 58422, -63242, 358302, 140043, 417392, 205482, 24075, -49225, 140568, -106743, -226161, -133506, -53700, -177127, 49765, 100927, 384585, -40652, -112056, 47670, 46743, 130891, -114112, -93991, -110894, 164932, -87788, 133556, 81718, -48935, 201383, -35297, 278539, 98499, -61285, 163065, 52785, 205615, 206687, 41976, 167323, -128801, 183831, -36028, -191119, 59390, 200711, -20854, -229203, -116404, -170706, -216211, -90280, -17290, 251325, 149721, -24555, 5477, -26286, 220310, -149399, -100353, -248116, -85619, -16457, 121067, 250189, 55305, -11031, 74789, 390651, 91551, -186704, -288056, -197844, -165506, 408211, -159415, -51625, 35745, -31542, -35141, -261512, -121999, -310916, -42680, -34068, -503510, 106880, 112813]
12441A12813j0582R4467e8209B87286H5233a73909I1216K3275K8073n1806O7922
12430A58680c91310a4337j02964A59462b18227j77790A62306b27374N8584f4638
12419d1032j10264R137D414d3311C49219a17442j14200H3009A3238f5870B65517
12407a47976A12151b59183A7214G172J56962E1810i0503L3014j2365j9674B64685
12395B28237b03800C09516a30547G8336k4017f1089k86740A38601E3049i7088
12384D10615f5999B3842M2708a22270J4295B39900R1649m7744F7946J5965d5723
12372B68792h5684k9166L9707j46090M4532f4061J1704r237A70382a18256F4176
12360a9209A41557h1318G8262b9023b254H2475J06577J3600a00851K6544E2192
$$ y = [112813, 102231, 196698, -58209, 287286, 85233, -173909, 91216, 114491, 142564, 90758, 158680, -391310, -14337, -117301, 159462, -218227, -396017, 162306, -227374, -168790, -64638, -41032, -151296, -142159, 4414, -43311, 349219, -117442, -231642, 83009, 13238, -65870, 265517, -147976, 112151, -259183, 17214, 7172, 164134, 51810, -90503, -57489, -69854, -89528, 264685, 228237, -203800, 309516, -130547, 78336, 54319, -61089, -347829, 138601, 53049, -97088, 410615, -65999, 23842, 66550, -122270, -107975, 239900, 331549, 283805, 67946, 83911, -45723, 268792, -85684, -114850, -75143, -221233, -176701, -64061, -52357, -61594, 170382, -118256, 64176, -19209, 141557, -81318, 78262, -29023, -2254, 82475, 189052, 202652, -100851, -74307, 52192]
12348C41341A17538J8472a51525B89902e0853l53327B67154c1211B02705N8993
12338B61698a9319n3117C44523A23467a41729A37321J35876B1979J74762c8q5270
12327h5308D0569e256A58809a83737B55611B2032J32746A2424a18203c2618q8253
12316a20871B65127a65458j21229j39212A93708f0307C98964h675C4613f9229
12305D0463i5612k00371J31577F6666h6089C80618c36912H7028J44775b34082
12294A71177C0237c03211G7395e0762A53636K7609n7554C3824L9189R1522d9229
12282B582K92139h123A16955L1084A405L41014b12356C21075j00474F432K33014
12271B39446F7191b12210C91665J43087A56281J3544o6921a59212f0764A334a24136
$$ y = [341341, 117538, 136010, -151525, 289902, -50853, -404180, 267154, -31211, 202705, 261698, -19319, -72436, 344523, 123467, -141729, 137321, 273197, 21979, 196741, -38, -85308, 40569, -5256, 158809, -183737, 255611, 22032, 154778, 12424, -118203, -32618, -120871, 265127, -165458, -286687, -425899, 193708, -60307, 398964, -8675, 34613, -69229, 40463, -95612, -295983, -164406, 66666, -86089, 380618, -336912, 87028, 231803, -234082, 171177, 30237, -303211, 77395, -50762, 153636, 181245, 123691, 33824, 73013, 164535, -49229, 2582, 294721, -8123, 116955, 148039, 1405, 342419, -212356, 321075, 220601, 6432, 239446, 67191, -212210, 391665, 534752, 156281, 169825, 102904, -159212, -60764, 1334, -124136]
12259a052j26633A62339J1793J0011a60975P9302G306e6464J997B15178J49315
12248C64493A53854G3637a2258B325J59178c4909A21971L306A6495a33536B13045
12236B30482c95576c3597B27352i3523l9919E441J83296a79605A49544K835L9267
12225A91646f6137A79286K81591o0578a64840C86881j70446L15213A92280K00284
12215C92564j79157F8803K66326B784J72578a40440D3997e322I6270K29450j04940
12204B20780H9655f2675B55707J28145k4136c1998C31771N2668A67217M8134L3394
12193B48745R8493k1060A23231J37485m4446I6678J5041B4683L73840J42762B65740
12181b13670B27369K4085G7186J58206M3389A4868L23007p7782J27841F2176O0255
$$ y = [-1052, -127685, 162339, 174132, 184143, -160975, -81673, 7306, -56464, -54467, 215178, 364493, 153854, 73637, -12258, 2325, 161503, -34909, 121971, 125277, 16495, -133536, 213045, 230482, -395576, -33597, 227352, -93523, -133442, 5441, 188737, -179605, 149544, 152379, 191646, -66137, 179286, 460877, 400299, -164840, 386881, 216435, 531648, 192280, 392564, 213407, 68803, 335129, 2784, 175362, -140440, 43997, -5322, 96270, 325720, 220780, 89655, -62675, 255707, 383852, 359716, -31998, 331771, 384439, 167217, 215351, 248745, 347238, 326178, 123231, 260716, 216270, 96678, 111719, 24683, 398523, 541285, 265740, -213670, 227369, 251454, 77186, 235392, 278781, 14868, 337875, 260093, 387934, 62176, 122431]
12170A22431L70816G0561a12030c1650B78060p0888M95m2271J35690m9820P6773
12159C28039j14169q7767a03952k12707A87892c14754E2841b1569A18722d70B44664
12147A59537J34236j31919j1358a21878A44692n2573D5206K6522e272k29525k1653
12136b56450a0120j13850F6659N002l5564K91943E6248c69654J57726C32201C6337
12124b17473a04454H4283L1291J16191q2724a02192C4117c60549B21800J4024
12114B35824a66591L0417r5952P5538A3885d1376C2050a02891A05991a5111C1532
12102A62829a65387j03520a3861B904M8698h2602q6249H976J11421E5339c53094
12090a40934E50688a90441F2843Q5884L90296a73687k27463J61729F7413h4517
$$ y = [122431, 493247, 70561, -112030, -31650, 278060, 207172, 207667, 165396, 301086, 251266, 328039, 213870, 126103, -103952, -316659, 187892, -314754, 52841, -21569, 118722, -470, 244664, 159537, 293773, 161854, 150496, -121878, 144692, 92119, 45206, 71728, -5272, -234797, -256450, -10120, -123970, 66659, 71661, 36097, 328040, 56248, -369654, -211928, 332201, 36337, -217473, -104454, 84283, 115574, 231765, 149041, -102192, 34117, -360549, 221800, 235824, -166591, -136174, -232126, -156588, 13885, -41376, 32050, -102891, 105991, -15111, 31532, 162829, -165387, -268907, -13861, 2904, 51602, -82602, -168851, 8976, 120397, 55339, -353094, -140934, 550688, -190441, 62843, 148727, 539023, -173687, -401150, -239421, 67413, -84517]
12079A12800a83627E03149J61286J079592q04374l40162j54803I1004a52698O2638
12069i0060a9331C17110B6983r833R0363d1568k8304j17527m2762p2679c5052
12057a11209j88865a07A70880c01758B26511b21132C5694b33934B66787b65903
12046i3311j02743I4097f3298E3610d49403e5763j8432b1924k88410H941a40596
12034C49132H3903b33575i8051F8074K15787A39399g3137A4384a26872D1178J7818
12023E8996b98748g6503F1570B0589b3153l904E3214J44822b00239P4211p4572
12012b00600A82221J46678h5855j04736h1838A4488h6961E3737a18317B31342
12001H175M3816L9956J69273n6807D6190b59441B3817h934G2293c6240j10403
$$ y = [112800, -183627, 503149, 664435, 1744027, 939653, 599491, 444688, 91004, -152698, -90060, -19331, 317110, 26983, 17150, 107513, -41568, -69872, -187399, -230161, -302840, -35052, -111209, -300074, -107, 170880, -301758, 226511, -221132, 35694, -233934, 266787, -265903, -93311, -196054, 94097, -63298, 53610, -449403, -55763, -74195, -21924, -310334, 8941, -140596, 349132, 83903, -233575, -98051, 68074, 283861, 139399, -73137, 14384, -126872, 41178, 58996, -298748, -76503, 61570, 20589, -23153, -27057, 53214, 198036, -200239, -126028, -200600, 182221, 328899, -85855, -190591, -81838, 14488, -86961, 53737, -118317, 231342, 8175, 51991, 91947, 261220, 204413, 46190, -259441, 23817, -8934, 72293, -36240, -146643]
11990a46643i135j5865p161A12677e4005A06432h1794a5244A21290m3941b03919
11978G0527c28499A53607L0262i5639a8657G5624a7572E0412K06564r4481i7749
11966c9115C06629a05196A56400a43283l4756k08998C200J5864b18775A45033
11955B21124a56912k01684a71354J9269A4465f6900r7127A27151I41b57810A07985
11943F3271L1088h4485C96324b09715g0371m2838c3633D5876A839b119j63592
11932a65711D61615d3608p412b766I3078b67561A86735g8516A48670a85179A7846
11920h6561j53947A18076a3157A38529D0630Q467C876O9711P8866a46356r2097
11909b38453j6073A87321h5899A66383i3437R629A72333p4980J9693J20989r7389
$$ y = [-146643, -9135, -25000, -32161, 112677, -54005, 106432, -81794, -15244, 121290, 77349, -203919, 70527, -328499, 153607, 183869, -95639, -18657, 75624, -17572, 50412, 256976, 162495, -97749, -39115, 306629, -105196, 156400, -143283, -178039, -387037, 3200, 19064, -218775, 145033, 221124, -156912, -358596, -171354, -152085, 14465, -66900, -164027, 127151, 941, -257810, 107985, 63271, 94359, -84485, 396324, -209715, -70371, -113209, -33633, 45876, 1839, -2119, -165711, 461615, -43608, -51020, -2766, 93078, -267561, 186735, -78516, 148670, -185179, 17846, -86561, -240508, 118076, -13157, 138529, 40630, 49097, 3876, 73587, 152453, -146356, -238453, -254526, 187321, -85899, 166383, -93437, -83808, 172333, 97353, 117046, 238035, 140646]
11898A40646d4250F8356A8395a582n832A83519b8482B512d2584Q879j44444D4220
11885b51224A55687j4973J2529b84383H2831k1629b62486F9958K9509c9259G548
11873i604B01874h0206j8231b0851k8319k8857K4521r2954o4422a5737A45082
11861A89717D8968K15593a08577I8428a01477b8267j42517j2551C08526E1801
11850e5767l7856b4694B66825f8745A33207D3116A2765L6083J23935C0454b2012
11838A29260m8946J34631j9875a30758d8718r403A27634B617d7886C17431g2148
11826E9479a99449G2396c34258B93907c8940B06494b29674J9184d0746A15745
11815A50518b08686j72179A67916g0791o1742B96581b35472J12909a4590A39718
$$ y = [140646, -44250, 68356, 18395, -1582, -7414, 183519, -28482, 2512, -42584, -33705, -178149, 44220, -251224, 155687, 140714, 153243, -284383, 82831, 61202, -262486, 69958, 99467, -39259, 7548, -9604, 201874, -80206, -98437, -20851, -49170, -78027, -53506, -146460, -210882, -15737, 145082, 189717, 48968, 264561, -108577, 98428, -101477, -28267, -170784, -183335, 308526, 51801, -55767, -93623, -24694, 266825, -68745, 133207, 43116, 12765, 48848, 172783, 30454, -22012, 129260, 80314, 214945, 195070, -130758, -48718, -58121, 127634, 2617, -47886, 317431, -72148, 59479, -199449, 72396, -334258, 293907, -38940, 206494, -229674, -210490, -40746, 115745, 150518, -208686, -380865, 167916, -70791, -132533, 296581, -235472, -122563, -14590, 139718]
11804A52512a34662M145M5447B4596a10769m8676q8358R3650p6426a3241A03471
11792a46118k4129n642c9712B20302j0691b43012K8478A47604a3372C09425j10109
11781A99316b18037j7056O2744O0337p5311e2821J0713H3596B4343J27539b29566
11769b69008a22268o7107c7378F6521a62186A06383a03851C62146f1015m0913
11759a01928B3856h9913A8702a87335I5637A9743a40987C5920P4905k423B2713
11747B44010a30779a7834C9038a9651G3940a95955D7461A4184K69240f2872b1432
11735a57841b2450C1145J83553r5236a50297K8974A2297L1802i385E9514i6846
11723a28469I0876A4562J56862P9347D3885J48716a59267G558K63602H7228b37086
$$ y = [152512, -134662, -130517, -85070, 24596, -110769, -159445, -247803, -154153, -230579, -13241, 103471, -146118, -170247, -175889, -39712, 220302, 209611, -243012, -214534, 147604, -13372, 309425, 199316, -218037, -235093, -172349, -112012, -187323, -52821, -42108, 83596, 24343, 151882, -229566, -269008, -122268, -189375, -37378, 66521, -162186, 106383, -103851, 362146, -61015, -101928, 23856, -89913, 18702, -187335, 95637, 19743, -140987, 35920, 110825, 108402, 22713, 244010, -130779, -17834, 39038, -19651, 73940, -195955, 47461, 14184, 283424, -62872, -21432, -157841, -22450, 31145, 214698, 119462, -150297, -121323, 12297, 44099, -9385, 59514, -96846, -128469, 90876, 14562, 171424, 250771, 43885, 192601, -159267, 7558, 271160, 87228, -237086]
11711a36580A13073R0943a5000m9217B37691m9065J97194b30968I8652j5257a29397
11699d2169k79494B30749r4254K59a33638B23344p8691a46296e198l72666a18222
11687g7820B06431q6571K12620H6043O8260D7012A3332a2172B9934b51567a04181
11675b2739n8870A16371E5782M10714b06351L9587f5218I3656N0366e0720H6641
11663A97375k7705a39793c5857A5716J40834E8538L9241i2082C33815A05671a26502
11651b83870a24175q9998f7104F7722P2105i0525a624q1900B17980l5500J24564
11640C07044b65514D5963b94482E1049J57763I8399b1376D1091b66178I6691D7583
11628A75389p7814A1965d63830A61133a07257D6391B661K53385a57576l9627a4607
$$ y = [-136580, 113073, 204016, -15000, -64217, 237691, 188626, 385820, -230968, 98652, 83395, -129397, -42169, -321663, 230749, 136495, 136754, -133638, 223344, 144653, -146296, -5198, -377864, -118222, -77820, 206431, 119860, 332480, 86043, 154303, 47012, 13332, -12172, 29934, -251567, -104181, -22739, -81609, 116371, 55782, 466496, -206351, -166764, -65218, 93656, 144022, -50720, 86641, 197375, 169670, -139793, -35857, 15716, 156550, 58538, 97779, -92082, 333815, 105671, -126502, -283870, -124175, -214173, -67104, 67722, 139827, -90525, -1624, -83524, 217980, 182480, 307044, -265514, 45963, -294482, 51049, 208812, 98399, -21376, 41091, -266178, 96691, 47583, 175389, 97575, 11965, -463830, 161133, -107257, 46391, 2661, 256046, -157576, -197203, -14607]
11616c17309R5343f4886B55897a54276D9068J02962c236m4048B51251j02369b3409
11604i5585b8578D7357c0717P383G8915J22606a8946A90254C0833K91542A32481
11592B4241J72755d0774R444C3565J3765a98177A37957g4276M874r441B93856
11580a83319A03336J61461L5406b8421k11282F8949c158A98857p5755M8389L4695
11569B06186J7577a32004m4462K3115N4359B10943r3834d0970C15145A51203G0489
11557f5232j35822B49680r3329b02065A06273d0417m7220l4993r8900b4029F7625
11545A53650l2664C6218K2831k9523M4363A3772K84189A02245c5368B56768F0630
11533C2595L08395F1072h3893j4680D7204a47839A73496C7017d2377G9412A3938
$$ y = [-317309, -221966, -64886, 255897, -154276, 49068, 152030, -3236, -47284, 251251, 148882, -23409, -95585, -28578, 47357, -30717, -23334, 78915, 201521, -18946, 190254, 30833, 322375, 132481, 24241, 196996, -40774, -31330, 33565, 47330, -198177, 137957, -74276, -69402, -78843, 293856, -183319, 103336, 264797, 300203, -28421, -239703, 68949, -3158, 198857, 123102, 171491, 206186, 223763, -132004, -176466, -153351, -98992, 210943, 117109, -40970, 315145, 151203, 70489, -65232, -201054, 249680, 156351, -202065, 106273, -40417, -87637, -122630, -221530, -24029, 67625, 153650, 120986, 36218, 59049, 29526, 73889, 13772, 297961, 102245, -35368, 256768, 60630, 32595, 340990, 61072, -83893, -98573, 47204, -147839, 173496, 37017, -42377, 79412, 13938]
11521A59227J32492C927h8542B07848n0113K32179A01805O2169j9446Q7345P2077
11510C03950q6521C6893j3695e2024A37185n6080c78715C09650J79933i9748d6724
11498F4000J06727J54403p421h737l5517B78785A02992J43460F306a29747G6963
11486B96862k0837c368A04751l4489L0956P8918Q6875J53066A82544D8329K71817
11475C20146H0149J71401k3324k135r2449d2278A80958o2063K52670A29395J15173
11464B44568B994L32468h094C38890A10210L01042D3935J6312K6249Q1275e800
11452D6379O8115l396B4364L71041A92700O4417j24194a81106g4679B4659b880
11440C34603i0052A42118p779K69616h6855p648C27820D4120R8611j5122N1010
$$ y = [159227, 291719, 3927, -88542, 207848, 157735, 389914, 101805, 163974, 144528, 231873, 303950, 217429, 36893, 23198, -52024, 137185, 81105, -378715, 309650, 489583, -99748, -46724, 64000, 170727, 325130, 317709, -8737, -44254, 278785, 102992, 246452, 6306, -129747, 76963, 296862, 276025, -3368, 104751, 70262, 101218, 180136, 267011, 420077, 182544, 48329, 320146, 80149, 251550, 228226, 226091, 133642, -42278, 180958, 118895, 371565, 129395, 244568, 2994, 335462, -8094, 338890, 110210, 411252, 43935, 60247, 86496, 167771, -5800, 46379, 114494, 111098, 24364, 395405, 192700, 257117, 132923, -181106, -74679, 24659, -2880, 334603, -90052, 142118, 134339, 403955, -86855, -94503, 327820, 44120, 142731, 127609, 178619]
11429A78619a78330g7729C17O7073g4086G4526b1268N869H2489k9863h3869A63187
11416C6608b61293G018J95760B2435c59965B20742d9409k05073D32059h6970A41954
11404A24377B9376a17750B19556q4333a53367I2043l2722H395M560R8048M5203
11393A56206C2087J63388e9770j70810d6898B04578a44469a3388j77755B59326
11382a22737C3815J92928K7995f567F319h3805C38211i5031F9878a71969B94757
11370A34158F99a5630E4138K04669d8709j0602j52699G2855B7117J11419d7947
11358e1642j00000H8687c91059a35508C118b7259j89893P8875f2389k56943H7922
11346c85587J46769j54858A04709e3118C3075L0448P9180F6882M7149a1839l4906
$$ y = [178619, -178330, -77729, 317, 67390, -74086, 74526, -21268, -15399, 82489, 52626, -83869, 163187, 36608, -261293, 7018, 202778, 22435, -359965, 220742, -49409, -254482, 432059, -86970, 141954, 124377, 29376, -117750, 219556, 135223, -153367, 92043, 59321, 8395, 12955, 111003, 156206, 32087, 195475, -59770, -230580, -46898, 204578, -144469, -13388, -191143, 259326, -122737, 33815, 226743, 254738, -6567, 6319, -83805, 338211, -95031, 69878, -171969, 294757, 134158, 699, -15630, 54138, 258807, -48709, -59311, -212010, 72855, 27117, 138536, -47947, -51642, -151642, 88687, -391059, -135508, 3118, -27259, -217152, -138277, -62389, -319332, 87922, -385587, -238818, -393676, 104709, -53118, 33075, 63523, 142703, 66882, 114031, -11839, -46745]
11335d6745A9640E46a34378A3524n498M2032a42375j26182J27631C07146b4448
11323a98559H3662a19860A03636a38475m2799A53542c35213R9643a6134H6164
11312b85834B09355F7258a20111A10950a39275f3532A747J34459C5974J17105
11302A53079c19682f0349n1201j39994A61713b66463B69937A4029b03823A6228
11291b93293A1185K41195b27270C73308l0135a02973d0527k21007A08415n0569
11281E7846a9306A644O2539B3962b3366o3478G3489h3908j42587B29707a31658
11269D7669a45569n9960b239j85383A25867a00565A15085b23553j39679A30726
11258b7981l7724q5372G2606i7730h365F76J45789a07855q6802Q099F4200a96502
$$ y = [-46745, 19640, 546, -134378, 13524, 8026, 50058, -142375, -268557, -140926, 307146, -24448, -198559, 83662, -119860, 103636, -138475, -181274, 153542, -335213, -235570, -16134, 86164, -285834, 209355, 67258, -120111, 110950, -139275, -63532, 1747, 136206, 35974, 153079, -319682, -60349, -111550, -251544, 161713, -266463, 269937, 14029, -203823, 16228, -293293, 11185, 252380, -227270, 373308, 343173, -102973, -40527, -261534, 108415, 57846, -19306, 1644, 64183, 23962, -23366, -86844, 73489, -83908, -226495, 229707, -131658, 47669, -145569, -205529, -2239, -187622, 125867, -100565, 115085, -223553, -363232, 130726, -27981, -65705, -151077, 72606, -97730, -8365, 676, 146465, -107855, -194657, -186558, 64200, -196502]
11245h3843j88418B3411J76827D7563b00925J7506o0131F3947e0291q3147d0205
11233c7113j53378C02426A26157D2899b25946j91730a40330q8759n5207a28839
11222A24142a32481I6772J5919R0816E3020d6814k7819n6427j13185i0982n4790
11211a45772B43565B0102b09353C4340a02407K021A96935c8640q517A21587a8268
11199b91673g4743D0579a34834K0306I4877a4674j42586B29635j06425e9924G4894
11187c2484A691c64137a73290j43248G0551c03372R5887k3936I2319f0597B8456
11175c82488h966m16898a03735I0680a291E1725b06767j68792A8310O7699K8225
11164A14234b7734m6119A4361h1988C09347a15321A52890p5060a89501m653B54353
$$ y = [-83843, -272261, 23411, 200238, 47563, -200925, -183419, -243550, 63947, -50291, -133438, -40205, -37113, -190491, 302426, 126157, 42899, -225946, -417676, -140330, -229089, -284296, -128839, 124142, -132481, 96772, 112691, 203507, 53020, -46814, -74633, -131060, -244245, -90982, -145772, 243565, 20102, -209353, 34340, -102407, -100386, 196935, -38640, -47157, 121587, -18268, -291673, -74743, 40579, -134834, -114528, 94877, -14674, -157260, 229635, 123210, -59924, 74894, -32484, 1691, -364137, -173290, -316538, 70551, -303372, -207485, -231421, 92319, -60597, 28456, -382488, -8966, -425864, -103735, 90680, -1291, 51725, -206767, -375559, 18310, 86009, 114234, -27734, -73853, 14361, -81988, 309347, -115321, 152890, 77830, -189501, -194154, 254353]
11152A37464e7717C4527J50704c2204j15407B24388B2243J77148B0168K03453
11142B23621E2704b52842j41793a65248e1659I5154Q2778g6470B07548b87030
11131E16783B4150g440A656b00268B17463M6655j02748b7150j52048F2517J8841
11120H1358P5078C264L39048I0649L09465B2806f3478A61779n2251j1203e2278
11108G5945k3909L76114j47185C579J4203J64655h387E3365J18211J87702M3255
11097D02533j24745N9785I1944J14212g2631B48655I5139K07093l6624e9537B64263
11085C1633L38534j73143J46845f0037A26769K44398A14714O7728L08019p9905
11075D10556b4341C83959A87744O9898A17802M9845K55325G7703K78213K20210
$$ y = [137464, -57717, 34527, 185231, -32204, -147611, 224388, 22243, 199391, 20168, 223621, 52704, -252842, -394635, -165248, -51659, 95154, 177932, -76470, 207548, -287030, 516783, 24150, -7440, 1656, -200268, 217463, 264118, 161370, -27150, -179198, 62517, 81358, 156436, 3264, 342312, 90649, 400114, 22806, -63478, 161779, 109528, 98325, -52278, 75945, 52036, 428150, 280965, 3579, 17782, 182437, -8387, 53365, 171576, 359278, 402533, 277788, 337573, 91944, 206156, -72631, 248655, 95139, 302232, 265608, -59537, 264263, 31633, 370167, 197024, 343869, -60037, 126769, 371167, 114714, 182442, 490461, 410556, -24341, 383959, 187744, 257642, 117802, 167647, 422972, 77703, 355916, 576126]
11065E76126B48161P0169K86217k94471J57517J95711m6756m0886J25356k38166
11055D62852L35050j47933n0797L4342j19512M62568D49440K18004O7711r3611
11045F41544M39527k19029L6375m32807K64764j19520K88320K54625n15466K13427
11035H51760k13977O8914J99315P0795j2789l12001j0273K98548l73543L02343
11025H69092k3611j12487K29015l37372M56698m29537J72043k65622n3890p9765
11015D24564K87597o9091J39173j7643o8569l4821J92317l20461k06107M17515
11005G44474j31273j3467J51997K59837l44905j43996q3623J51708M5619J48558
10995G84929l3232o3838r0700n3070l0414J79360k47211L31578n7869l935J02681
$$ y = [576126, 248161, 318330, 604547, 310076, 467593, 663304, 616548, 575662, 701018, 462852, 797902, 649969, 599172, 633514, 514002, 976570, 449440, 667444, 735155, 641544, 1081071, 862042, 898417, 465610, 730374, 610854, 899174, 1153799, 638333, 851760, 637783, 706697, 906012, 976807, 964018, 652017, 641744, 940292, 566749, 869092, 845481, 732994, 962009, 624637, 1081335, 651798, 823841, 558219, 504329, 424564, 712161, 643070, 782243, 764600, 696031, 661210, 853527, 533066, 326959, 744474, 613201, 599734, 751731, 1011568, 666663, 522667, 439044, 590752, 636371, 784929, 751697, 687859, 597159, 544089, 513675, 693035, 445824, 777402, 719533, 715598, 818279]
10984H18279M67935j85825o5352j91777M54849M35075J2492L02448J13305L65572
10974B527001K11297n8854M79656K45219p3695J33620o10572l55722k09365l48566
10964A940019l50482j14393L02476k67670j97973J67294K40069o1076r5842k40196
10954A322226r9881j17869l1491k52168k72372J24738C21893M4256N0672j29734
10944B87087M5502K76856F8482L9947k6012i5115E6652L1845j1049q165d321C53722
10931A3014K36853h9880A07768P8073r2802J13168B9835g0331B49271C8036M44954
10920D82990A28871a8628A85305C4216g276j38402D3558J4788P692K79305c19171
10908h4327A35486i8906b6218F3320M0281a48622p9117O8132N3288J7737m6155
$$ y = [818279, 1286214, 1100389, 1035037, 843260, 1298109, 1733184, 1745676, 2048124, 2161429, 2527001, 2738298, 2679444, 3159100, 3404319, 3330624, 3464244, 2853672, 2497950, 2288585, 1940019, 1589537, 1475144, 1777620, 1509950, 1311977, 1479271, 1719340, 1658264, 1562422, 1322226, 1222345, 1104476, 1072985, 820817, 548445, 673183, 321893, 366149, 416821, 287087, 332589, 609445, 68482, 108429, 82417, -95115, 56652, 88497, 77448, 69283, -4321, 353722, 13014, 249867, -89880, 107768, 185841, 93039, 206207, 29835, -70331, 249271, 38036, 482990, 128871, -18628, 185305, 34216, -7276, -145678, 43558, 58346, 66038, 345343, -319171, -84327, 135486, -98906, -26218, 63320, 103601, -148622, -227739, -159607, -106319, -88582, -134737]
10897a34737G529g9228l22727I5661L6722l4321d2744A01952l4095K8721b86065
10885d4433j43135B5195a0055j03191A05078J0119n3874b83976I5653a5265l00485
10874c15750e7153B8405F501c66180a62684e9013C4540J44860H1167R6480c5555
10862H9089a72228k00812J66457B51997a41035K3696E2759J8612J27614b99595
10851g5457J4559j13761j19662M326J39632A99350a28284M8740m0582I6954K91205
10840C88159i686C229d9586a1035j1702A17746j973m7281a71376A34503h3277
10828A18087i0593j23854L1429r5477b2671j33070J403B09198J7207b43862A8826
10816B9849g3592p9750A64056E522b23255g8043A47713h4120j70397l145F7350
$$ y = [-134737, 7529, -79228, -401955, 95661, 132383, 98062, -42744, 101952, 67857, 96578, -286065, -44433, -187568, 25195, -10055, -113246, 105078, 115197, 61323, -283976, 95653, -15265, -315750, -57153, 28405, 6501, -366180, -162684, -59013, 34540, 179400, 81167, 177647, -35555, 89089, -172228, -373040, -206583, 251997, -141035, -117339, 52759, 71371, 198985, -299595, -75457, -60898, -174659, -294321, -289995, -150363, 199350, -128284, -79544, -120126, 96954, 388159, -9686, 3229, -49586, -11035, -22737, 117746, 115773, 68492, -171376, 134503, -83277, 118087, -90593, -214447, -183018, -278495, -22671, -155741, -154338, 209198, 226405, -243862, 18826, 29849, -73592, -153342, 164056, 5522, -223255, -78043, 147713, -84120, -254517, -257662, 67350]
10804a08427B04744a41084M9081b0399G3966R1706a33235B07961c69906J11314
10794b58592D4430a83766A85820a69487D3665K3629c28126A01780c9307C3753
10783F6575f103n0980B18522J49784i1616c731A3269f5771J9741k0218A09025
10771a61853D89053G4969J87070A17710j8941J15964D4825J5966a23256m2652
10761a65908b0802I4114b5228G3795b73862C24756H317M6861g2814k89863I9143
10749f5562j06604A6417a72283M5424A51090b3500j17191j56251J11592a0769
10738a98846G8036b60896O068J07730e2579A0443b6688j73441A9193K34387J21575
10727C75155d21437a85655k00004f668l49558h2097m6139B42574A5056a8410j8798
$$ y = [-108427, 204744, -141084, -92003, -20399, 73966, 165672, -133235, 207961, -369906, -258592, 44430, -183766, 185820, -169487, 43665, 67294, -328126, 101780, -39307, 33753, 66575, -6103, -57083, 218522, 368306, -91616, -3731, 13269, -65771, -46030, -66248, 109025, -161853, 489053, 74969, 262039, 117710, 98769, 214733, 44825, 60791, -123256, -165908, -20802, 94114, -25228, 73795, -273862, 324756, 8317, 55178, -72814, -362677, 99143, -65562, -172166, 16417, -172283, -126859, 151090, -23500, -140691, -296942, -185350, -10769, -198846, 78036, -260896, -254828, -147098, -52579, 10443, -26688, -200129, 19193, 253580, 375155, -421437, -185655, -385659, -6668, -356226, -82097, -128236, 242574, 15056, -18410, -37208]
10716c7208A08884b37376I2185b14409G908a62128H8468N7717d4461p620D9836
10704A17895h1515q6313k9488j16528A15963b3000j31995B6022J8097A4186J30531
10693A44717d4716l6144A29280l4761K34346a19713B37457k3060a1947k4758k19475
10682b56180B43865c4232I2402l6156K08786G4394M6791m2853K09605E6421h4768
10670a74184A40522d2107E1715b28973A03109C7378O7653a84463C3013b62789
10659i7609j31238E4248a09810j64409g8732K9840l2066G84b23893B73774D4936
10647c13244i6693D25521e3074c455A20132C3416A6477d63005h8447d3272a1483
10635a8001n0935A17924A1441J65215a5899A91404a42604N2437A28720a92149
$$ y = [-37208, 108884, -237376, 92185, -214409, 7908, -162128, 88468, 146185, -44461, -52081, 49836, 117895, -81515, -167828, -197316, -313844, 115963, -23000, -154995, 26022, 44119, 14186, 144717, -44716, -80860, 129280, 94519, 328865, -119713, 237457, 214397, -11947, -36705, -256180, 243865, -34232, 92402, 56246, 265032, 74394, 121185, 78332, 287937, 56421, -84768, -174184, 140522, -42107, 51715, -228973, 103109, 37378, 105031, -184463, 33013, -262789, -97609, -228847, 54248, -109810, -274219, -78732, -48892, -80958, 784, -223893, 273774, 44936, -313244, -96693, 425521, -53074, -3455, 120132, 33416, 16477, -463005, -88447, -43272, -11483, -18001, -68936, 117924, 11441, 176656, -15899, 191404, -142604, -90167, 128720, -192149]
10624a61193d9653I484Q0084c24306B75119b11694E6582K14843A06123a2755A00335
10612b7577B6899J28932b98735F3601d0508j22716j02952B19097m8906b86666
10601f1404A11256c38732P5359M0520A86097a18235A42765b27932D4773a19245
10590g5656G1041e5769l12635G1096N16809a36117C37725B3696K0783a57862k431
10579a60293G2252j779c9105H4314h3028j01418j51852J6300g3925j5563c9338
10567a20717C30924r3946h21B97024a67151g2680a7022A97985a18957H1449c23431
10555A64030a62169g7447j20097r9274J18652c312E2657N0210M4269e925k64875
10544b70800b1454A15174C2524O5494a9504o8198j06905I7099d3263j35910M4179
$$ y = [-161193, -49653, 9484, 89568, -324306, 275119, -211694, 56582, 271425, 106123, -12755, 100335, -27577, 26899, 155831, -298735, 63601, -40508, -163224, -266176, 219097, 170191, -286666, -61404, 111256, -338732, -263373, -222853, 186097, -118235, 142765, -227932, 44773, -119245, -75656, 71041, -55769, -368404, 71096, 587905, -136117, 337725, 23696, 44479, -157862, -160293, 72252, 70473, -39105, 84314, -83028, -184446, -336298, -319998, -73925, -89488, -39338, -120717, 330924, 236978, -821, 297024, -167151, -72680, -17022, 197985, -118957, 81449, -323431, 164030, -162169, -77447, -197544, -296818, -178166, -3312, 52657, 102867, 147136, -5925, -270800, -21454, 115174, 32524, 98018, -19504, -87702, -194607, 97099, -43263, -179173, -134994]
10533a34994B76732a60883f1359k89205J59417d613l2867k75227A89197a91678
10522D763d41394a36897e2747j92373A49891E109K62591A09082i5460A63160n6006
10511A07154b79688p4740J59290A44477O9186a87135e7967A01590h3915l69924
10501d53839N9443d6119l4538F3892J1048a7626h796m5379B34053b45684j88141
10490d33825a25140A07811J81927j40611a96354P4770j452H5600J33412J08548
10480C27560A44799P5805j09412c0486G1868Q2878m1586f2496g769B1020K1341
10469D2361J06931i9841H7468J49712A3553K94229b1658r9486o3173h6907k13715
10458c00622J14811a5204j96880L1933n2545d2993k3118k3143A18222a80625q0226
$$ y = [-134994, 276732, -160883, -61359, -350564, -191147, -4613, -37480, -312707, 189197, -191678, 4763, -441394, -136897, -52747, -245120, 149891, 5109, 267700, 109082, -95460, 163160, 107154, -279688, -354428, -195138, 144477, 213663, -187135, -57967, 101590, -83915, -453839, -394396, -46119, -80657, 63892, 74940, -17626, -8796, -54175, 234053, -245684, -433825, -125140, 107811, 289738, 149127, -196354, -121584, -123036, 85600, 219012, 327560, 144799, 220604, 111192, -30486, 71868, 154746, 113160, -62496, -7769, 21020, 42361, 149292, -99841, 87468, 237180, 13553, 307782, -21658, -121144, -184317, -86907, -300622, -185811, -15204, -212084, -180151, -232696, -42993, -66111, -89254, 118222, -180625, -260851]
10447b60851I2257N1260c52939E4853a9974o3625A86687a90092B32135a03393
10436D3251A0562a40574e9246n299J3158A695J04635O2846a20763g60k0006B59930
10423C03836e9990b8214o9490d0803p4257B7593J87912f1586j11618E0597L1474
10412H2071a9618o4110l2892q1415A22330J51109c67874C61204a16026F2100J28575
10401A90675I1908a57653A27325g4007C5031d701k2977B5547K84659j52242A5728
10389D54339A67622G7775d929B40026D0871N8909F187R1573K37078F5557J75502
10378B41059N5485k8608r2424K71771F1042J59489M29696A63617J76604o394R6693
10367D30520O6480j14671A14272E3833M18263A65933r995J66494A51930o1134
$$ y = [-260851, 92257, 143517, -352939, 54853, -19974, -83599, 186687, -190092, 232135, -103393, 43251, 10562, -140574, -59246, -64545, -51387, 1695, 106330, 169176, -120763, -760, -20766, 259930, 303836, -59990, -28214, -97704, -40803, -115060, 27593, 215505, -61586, -173204, 50597, 82071, -19618, -83728, -116620, -198035, 122330, 273439, -367874, 361204, -116026, 62100, 190675, 91908, -157653, 127325, -74007, 35031, -4701, -27678, 25547, 310206, 157964, 15728, 454339, 167622, 77775, -4929, 240026, 40871, 99780, 6187, 97760, 334838, 65557, 241059, 296544, 267936, 175512, 447283, 61042, 220531, 650227, 163617, 340221, 333827, 430520, 497000, 382329, 114272, 53833, 472096, 165933, 155938, 322432, 151930, 90796]
10357I0796L21382R5017j56816g961B32605M36372j39695k27947o0370L24250
10347E65215O8003l05511j15178n3054D1754M2707f5417A35985j7690P909O895
10336A33099b5954F6090a56441g4510E0829J12402a40920L4923E1121L9042L74187
10325D64350B23512D2164K07632L00909E6522K57388j9770e3631D40142a79279
10314B79L75431o4819J26202A14542J26618A04420i3214k04968g404A12051J37455
10303B49506c9074k19986M9796A81066a38923D7710i8949n0372A86871c7051q519
10292d5570B2259c00632J09383f8999n4312I4362b16219B09664A1417L17116b43470
10280B94381a57340j23952a19661N8203m94443a12830j99960A03135J64273A3624
$$ y = [90796, 412178, 507195, 350379, -7961, 232605, 668977, 529282, 301335, 240965, 565215, 633218, 327707, 212529, 159475, 41754, 84461, -65417, 135985, 118295, 126204, 133099, -25954, 66090, -156441, -74510, 50829, 163231, -140920, -105997, 51121, 90163, 464350, 223512, 42164, 249796, 550705, 56522, 313910, 294140, -53631, 440142, -179279, 279, 375710, 310891, 437093, 114542, 241160, 104420, -93214, -298182, -7404, 112051, 249506, -39074, -259060, -209264, 181066, -138923, 47710, -98949, -149321, 186871, -37051, -45570, 22259, -300632, -191249, -68999, -123311, 94362, -216219, 209664, 11417, 328533, -243470, 294381, -157340, -281292, -119661, -61458, -555901, -112830, -312790, 103135, 267408, 13624]
10269B81704m6470a05258K2242j69755a19408m774a9002l5357B76223J40791B06263
10257F33242H9338a1106A32461d8263k05008Q8522A24240a66469J8348K7876A2197
10245b4239j04799L0275H5603L5715n6844K76998A38314o2112a63660F5859B4294
10233a83685J365j18575A3280d0942l37545H1054c06479h1282l8372M1169A95132
10221B8176a64734B28856d338l20380h694k72280a4782q0850j13116A87382o3288
10210A24094d06360B9405N2845A7500b21631A73801c29853K8850A93527c4890
10199d8152n9043k28231I178a02427A41199g6490D96368G0958O140b88816A19791
10187a01406D7662c1829j0271A5811a92266P5640B8516a10786C870i343m48776
$$ y = [281704, 235234, -105258, -83016, -252771, -119408, -124182, -19002, -54359, 276223, 417014, 206263, 633242, 89338, -11106, 132461, -48263, -253271, -164749, 124240, -166469, -148121, -120245, 12197, -24239, -129038, -98763, 85603, 121318, 64474, 341472, 138314, 76202, -163660, 65859, 24294, -183685, -182320, -300895, 13280, -40942, -378487, 81054, -306479, -81282, -119654, -78485, 195132, 28176, -164734, 228856, -4338, -324718, -8694, -280974, -14782, -95632, -208748, 187382, 124094, -406360, 29405, 82250, 17500, -221631, 173801, -329853, -301003, 193527, -34890, -48152, -107195, -335426, 9178, -102427, 141199, -76490, 496368, 70958, 77098, -288816, 119791, -101406, 47662, -31829, -42100, 15811, -192266, -116626, 28516, -110786, 3870, -9343, -458119]
10176d58119a50201O6303r6804j3758A39107d02750A29955a75546l4153N1243
10166a58456B19671A05028b28910A29520C7062Q1851E6387a41895k7030g6714
10155A14885m0599b58936e6628b3284j33931J6277O6690L5045l16136a51250I9277
10143e8656A77372Q3982c17288M0725J07958l39784A54649J10495c35444A8819
10132a56739b7479l5856K1461H0821a32084A44274d3829B7538b33879n6495B03343
10120a75364A6018a22563D6521b80595d1188j40167J9008c5613k28475j1629A661
10108a86200n803M7921A9595O0841B1589d1507n9295q8582g2884j90892a23521
10096B62871D1921i616j65112k81455b02766i6081a9811j34769l6481p378k38929
$$ y = [-458119, -150201, -83898, -180702, -194460, 139107, -402750, 129955, -175546, -209699, -158456, 219671, 105028, -228910, 129520, 37062, 118913, 56387, -141895, -168925, -76714, 114885, 74286, -258936, -56628, -23284, -157215, -140938, -74248, -39203, -355339, -151250, 99277, -58656, 177372, 261354, -317288, -276563, -168605, -508389, 154649, 265144, -335444, 18819, -156739, -27479, -63335, -41874, 80821, -132084, 144274, -43829, 27538, -233879, -290374, 203343, -175364, 16018, -122563, 46521, -280595, -41188, -181355, -162347, -35613, -264088, -275717, 1661, -186200, -192003, -144082, 19595, 80436, 21589, -41507, -100802, -189384, -72884, -263776, -123521, 262871, 41921, -9616, -174728, -456183, -202766, -96081, -19811, -154580, -191061, -198439, -437368]
10085d37368H2481E220a78495E951K2819c17049d8428k80221C1278a68736q2636
10074b51372d7887B25039b14373a8476n6463A23503M7258a57446A9993b47916
10063a19015B75433a9331l2253k10486M288f8457m2029H9464d3861l1939b8277
10051c6996E3991c04439a34720D5539a60138l9256d8338j03780H0324d0667L070
10040c7597j31324c4899j2369F0794a11688A02519a84612A95311d47367J53462
10030b93905i5488a9524l4606j22144A00795a93171C27749e1960o5512C4346a51188
10018B23583c8500A35427c290B5254M5796c13497C37511c1556E0699e3351k50800
10007c04151a4446p6887q3008p2725C5387b0267G7143h4523A1332A900L98606
$$ y = [-437368, 82481, 5220, -178495, 5951, 28770, -317049, -48428, -328649, 31278, -168736, -251372, -47887, 225039, -214373, -18476, -74939, 123503, 170761, -157446, 19993, -247916, -119015, 275433, -19331, -51584, -262070, -257782, -68457, -110486, 89464, -43861, -75800, -28277, -36996, 53991, -304439, -134720, 45539, -160138, -199394, -48338, -152118, 80324, -40667, -37597, -168921, -34899, -47268, 60794, -111688, 102519, -184612, 195311, -447367, -293905, -95488, -19524, -54130, -176274, 100795, -193171, 327749, -51960, -117472, 34346, -151188, 223583, -38500, 135427, -3290, 25254, 71050, -313497, 337511, -31556, 50699, -53351, -304151, -14446, -91333, -174341, -247066, 35387, -20267, 77143, -84523, 11332, 1900, 400506]
9996D00506h4522M1442j9436F6738J4853b0088n2163R984A16563e3695B11104
9984A23254i7699A67758a20837H0529b47581o829n296m9357E41J54098j1463a78266
9971b00921I5254a05185r0084E8440a86350F9070g9487l13736f3608o1801G5153
9959a21696q0232j13147J57155g8702l9301B2328b40970g6173l978D9305b92541
9947b9435j93473i6653K8744A28812a8652D7110c67718J57263J9727A63993a98174
9935I8328f4879q2998B57724a16773c2603k10242a18508a9418A13337B5400b03101
9923a28043K7723E3732a13853A57219a01639k35078B13796c97270A57866b7559
9912h7089B84190a70357j80898C0973c8215l4794j0844j5380G4861l2234h0716
$$ y = [400506, -84522, -43080, -62516, 66738, 81591, -20088, -72251, -62267, 116563, -53695, 211104, 123254, -97699, 167758, -120837, 80529, -247581, -254410, -259706, -309063, 541, 154639, 143176, -178266, -200921, 95254, -105185, -195269, 58440, -186350, 69070, -79487, -393223, -63608, -125409, 75153, -121696, -201928, -315075, -157920, -78702, -118003, 22328, -240970, -76173, -80151, 49305, -292541, -29435, -222908, -96653, -67909, 128812, -18652, 47110, -367718, -210455, -190728, 163993, -198174, 98328, -64879, -147877, 257724, -116773, -32603, -242845, -118508, -19418, 113337, 25400, -203101, -128043, -100320, 53732, -113853, 157219, -101639, -336717, 213796, -397270, 157866, -27559, -87089, 284190, -170357, -351255, 30973, -38215, -73009, -83853, -99233, 74861, 42627, -80716]
9900g9783l8615k9423A23315a36103A37629b22263j49387a29698I5809a34380
9889g4832j91846A58681m1390a27898p8086j9356A08645K67311a74133N8783B41707
9877c72585B88800a33325k0295A78382a43034A28328g1643q0831M7723E0614a96016
9865c6141j94786O8173l17575a17192I678c05922e6800J4516r8946B43830a15419
9853E3586b31086L6494K5580f42j12117i866o9827B59188a25584j61635B35552
9841i0949B04994c2197A96601a95344I3612R0790a91246m9183A27357F0585a34186
9829g0343j31777J984A2723J4220i2489A96216r7729a97464A64540d4116j75631
9818b19747G75c55451a50891A71148l544b06181P3008j32933l267E6777b6197
$$ y = [-79783, -118398, -147821, 123315, -136103, 137629, -222263, -371650, -129698, 95809, -134380, -74832, -266678, 158681, 117291, -127898, -205984, -225340, 108645, 375956, -174133, -115350, 241707, -372585, 288800, -133325, -153620, 178382, -143034, 128328, -71643, -152474, -104751, 50614, -196016, -36141, -230927, -162754, -480329, -117192, 9678, -305922, -56800, -42284, -141230, 243830, -115419, 53586, -231086, -194592, -169012, -642, -112759, -9866, -79693, 259188, -125584, -287219, 235552, -90949, 204994, -32197, 196601, -195344, 93612, 184402, -191246, -240429, 127357, 60585, -134186, -70343, -202120, -200136, 12723, 26943, -92489, 196216, 98487, -197464, 164540, -44116, -219747, 775, -355451, -150891, 171148, 167604, -206181, -133173, -266106, -269373, 56777, -26197]
9806g5714e182j97994p796j8931f1905B13651F7964L1299B1206d4824Q79j71626
9794b15571j9371A29057g6134F6324b75991f1246E0900e9074o0894D581d72478
9782c4083G1482M4736b2987l98734a42621J6264A8063a27548j23912g9706d039
9770b01699B03412b64587B41273b13787I58O2609c02296J08566j24077J43609
9760a74198I5574j26d1210k0554O620J4476B2598M5559a53864C5116l430i3762
9747c10227I2069M0050C3801b52874A6709b58399a060D9801K2192B0893b0238
9735B4657J2673a28045n3485K4651j3616N2627D6993P2760A2935K8896f2475A21262
9722c5236D3326a01938k8760b7207A70384J16984g8182a4526A30889b41305A13921
$$ y = [-75714, -5182, -203176, -210972, -229903, -61905, 213651, 67964, 99263, 21206, -44824, -43945, -215571, -234942, 129057, -76134, 66324, -275991, -61246, 50900, -59074, -119968, 4581, -472478, -34083, 71482, 116218, -22987, -421721, -142621, -126357, 18063, -127548, -251460, -79706, -4039, -201699, 203412, -264587, 241273, -213787, 958, 63567, -302296, -193730, -317807, -174198, 95574, 95448, -41210, -61764, -55144, -40668, 22598, 68157, -153864, 35116, 31686, -93762, -310227, 92069, 132119, 33801, -252874, 16709, -258399, -1060, 49801, 71993, 20893, -20238, 24657, 37330, -128045, -181530, -156879, -170495, -117868, 46993, 119753, 12935, 41831, -62475, 121262, -35236, 43326, -101938, -130698, -27207, 170384, 287368, -78182, -14526, 130889, -241305, 113921]
9710A5917P3871l1896a3668r0337m8539B11471l5817f296A15359m6955f6150A29849
9697b47689H5834c71627D910b1309G1757a80674H1528h367r4079A25558l6165
9686H9393L20386b45354p857P8517C42239H9309a1862G9544J1858i1229p5653
9675a66882G7834k4955a96556A19473g473k88433A32017g9810c3321j00532G7283
9663b01165g6015n2009k0220n7830d6149B87847a27549D8775a31059n7442Q8224
9652a00277L5906a7924r8154A23075a17603B6063e1921j44525F8775h7173k4551
9641a11724b5827H5183a50413D0740J0409b23790A2098R8797a04058g350D9117
9629I8511g204A19300a50285A53329k5529h5857k24453a6906j79724j6081e1184
$$ y = [15917, 89788, 57892, -13668, -104005, -152544, 211471, 175654, -6296, 115359, 68404, -66150, 129849, -247689, 85834, -371627, 4910, -21309, 71757, -180674, 81528, -8367, -102446, 125558, 89393, 409779, -245354, -253211, -174694, 342239, 89309, -11862, 79544, 91402, -91229, -166882, 77834, 52879, -196556, 119473, -7473, -295906, 132017, -79810, -33321, -133853, 77283, -201165, -76015, -128024, -148244, -206074, -46149, 287847, -127549, 48775, -131059, -188501, -100277, -64371, -17924, -116078, 123075, -117603, 26063, -51921, -196446, 68775, -87173, -111724, -25827, 85183, -150413, 40740, 51149, -223790, 12098, 110895, -104058, -7350, 49117, 98511, -7204, 119300, -150285, 153329, 127800, -85857, -310310, -16906, -196630, -212711, -51184]
9617A22510c04801a43540A7279M4138K4844B5646A2331f5360k8969d3534E2833
9605b24680A41827a09441H6008d04692B00513D9871J4211a64383A18813a09183
9594b56059P3383B3693b21790j15324B85675a08810C01201H7738j7849g0235J8317
9583e1918j03864p7178J04653m7859O9220F1976j8818i1831j7667I0290d6224
9571b8211B1558f9909C42441a24951M2833C4156h7254A39409a04040m61736B0233
9559b72595a13994I6270b0537B9822b61732A85393b15623B23272h1950j05459
9549a87409b491l69j38565j24083B13772b05615d0349k20169d1649H541a42006
9537a0647B34987B5642M1115e4702J6558G7429a24024D6548p868a90631B09580
$$ y = [122510, -304801, -143540, 17279, 61417, 86261, 25646, 12331, -65360, -94329, -43534, 52833, -224680, 141827, -109441, 86008, -404692, 200513, 49871, 64082, -164383, 118813, -109183, -256059, -182676, 23693, -221790, -337114, 285675, -108810, 301201, 87738, 69889, -70235, -51918, -155782, -232960, -128307, -176166, -106946, 61976, 43158, -91831, -109498, 90290, -46224, -28211, 21558, -69909, 342441, -124951, -82118, 34156, -87254, 139409, -104040, -565776, 20233, -272595, -113994, 96270, -20537, 29822, -261732, 185393, -215623, 223272, -81950, -187409, -2491, -2860, -141425, -265508, 213772, -205615, -40349, -260518, -41649, 8541, -142006, -10647, 234987, 25642, 66757, -54702, -38144, 77429, -124024, 46548, 38680, -190631, 209580]
9525c80827d3280k66378G1150L5904a70402N8182k56766a07750d6926l7193b5791
9513A74509a44091C26181c8956o1393j24089j14924a18822I4795a83993j16568
9503c00561f786o0637C4594e9607b1331j56100E963a33344f4065b9759j30949
9492a60708a4943j04754B5336b80411a03647j31188B6727b62328B33725H731b68245
9480e8273j6113j47775l35421J68774B65408f2180l7341j39092C4137J044P6470
9469A11651D601b14676i0617j24230d821j37896j51934D882b4615E411K34137
9458B39548b03737D1425b99819E0875j6032N2984a57186j39342j47438A9509a99565
9446a28766E9001Q0501J8823c3733j8858k76369b2755m350k21400a728l07348
$$ y = [-380827, -43280, -309658, 71150, 107054, -170402, -112220, -368986, -107750, -46926, -84119, -25791, 174509, -144091, 326181, -38956, -100349, -224438, -339362, -118822, 94795, -183993, -300561, -6786, -67423, 34594, -59607, -21331, -177431, 5963, -133344, -64065, -29759, -160708, -14943, -119697, 25336, -280411, -103647, -234835, 26727, -262328, 233725, 8731, -268245, -58273, -74386, -222161, -557582, -388808, 265408, -62180, -99521, -238613, 34137, 35181, 111651, 4601, -214676, -90617, -214847, -4821, -142717, -294651, 4882, -24615, 5411, 239548, -203737, 41425, -299819, 50875, 34843, 87827, -157186, -296528, -443966, 19509, -199565, -128766, 59001, 139502, 158325, -33733, -52591, -328960, -22755, -27105, -248505, -1728, -309076]
9435c09076e1798n735J6078m7698k12002B70670a94471d6575J6269A39677d2756
9423b76910a29644A22067b3557j08110A7163P9158f3026H323e5571B04141a60718
9411B45362A10251R9874b15946B7407N7709L9049g1439n6214A89415c89273a91031
9399a02959L3664K8281m1118k30216g4019p5455R280H2658b57809A03922f9950
9387A0718a20309L7394p5940a9724B3442L1043b25994N47F197a13095I6761a75557
9374A08742K2630c7294C33679B3060g1718a2882k73061b0848D177a63267L614
9363a59653j03382D35726A51329i3063j25419b5022j02162d1151D8478N5442J09491
9352B13411D9381P0158l0536k1387R5010g2197D26781a43226M7700D4969g6444
$$ y = [-309076, -51798, -57533, -41455, -89153, -301155, 270670, -194471, -46575, -30306, 139677, -42756, -276910, -129644, 122067, -23557, -131667, 17163, 96321, -63026, 8323, -55571, 204141, -160718, 245362, 110251, 210125, -215946, 27407, 85116, 124165, -71439, -127653, 189415, -389273, -191031, -102959, -69295, -41014, -82132, -312348, -74019, -149474, -140194, 82658, -257809, 103922, -69950, 10718, -120309, -82915, -158855, -19724, 23442, 54485, -225994, -225447, 6197, -113095, 96761, -175557, 108742, 131372, -37294, 333679, 23060, -71718, -12882, -285943, -20848, 4177, -163267, -159653, -263035, 435726, 151329, -93063, -218482, -25022, -127184, -41151, 48478, 103920, 213411, 49381, 119539, 89003, 67616, 162626, -72197, 426781, -143226, -95526, 44969, -76444]
9340a80759d9201B89346b25292M5392A38049J6163a88622O5367b4438p4441j36058
9329b34937e2858k1460l72849b12993J8559P2062A30887D577K3563P9556b43824
9317a22720N6968A00481C7245h9480H6934j4061a37527O2813A0869K64049d2110
9305c17962a46049D4480d6882j84003B96629A3795j599L5647g9326D1441e3012
9293b0817B15479a36446n3613O0437n049b9068j73868E4475a23313B57199g3354
9281b10535d3003G1115a53236K6862A70401g705k31257d2701F8371b76661A18411
9269e0726k05704a28187c0262k34771a03149d451m6282j38159A18873b31008f8474
9257a5919k24900O8601k6815A88074h6201k8027G1282a15836d6988A32871D1b78699
$$ y = [-180759, -49201, 289346, -225292, -179900, 138049, 154212, -188622, -123255, -24438, -98879, -234937, -52858, -74318, -447167, -212993, -194434, -122372, 130887, 4577, 28140, 107696, -243824, -122720, -65752, 100481, 37245, -89480, 86934, 72873, -137527, -74714, 10869, 274918, -42110, -317962, -146049, 44480, -46882, -230885, 296629, 13795, 12196, 47843, -79326, 41441, -53012, -20817, 215479, -136446, -190059, -129622, -134671, -29068, -202936, 54475, -123313, 257199, -73354, -210535, -43003, 71115, -153236, -126374, 170401, -7705, -238962, -42701, 68371, -276661, 118411, -50726, -256430, -128187, -30262, -265033, -103149, -4451, -50733, -188892, 118873, -231008, -68474, -15919, -240819, -172218, -199033, 188074, -86201, -114228, 71282, -115836, -46988, 132871, 41, -278699]
9244b14045h2172C8548a73775j8663N2561B5907a8931H9537a33776O6131j78369
9233b46014j19540j24063B0222b73894a24273N3365B20252A09868J9770b99689
9222A02155B0213d02840A2270b1706o0475m16061b34868A73031c5536k35789B06795
9210i3363j80847a4652j91133j1844o6978R3105O7830j53164l3554A20892c03411
9198G5015a26522o7520O6446B2419a1344j25834f7088j45994g79k56822h6457
9186A15750a0033j20700N6590c756H462h9181o7975C1211h5555d1866n8572j58461
9174b58899N0318h3004K5146m4455H7805C194b17770h2317j4368a7689m6643m1248
9162a05580C3823d8152j36167b4696j17046B94955F953J07939E0617M3627c20087
$$ y = [-214045, -82172, 38548, -173775, -192438, -139877, 25907, -18931, 89537, -133776, -67645, -246014, -365554, -489617, 20222, -273894, -124273, -70908, 220252, 109868, 129638, -299689, 102155, 20213, -402840, 12270, -21706, -82181, -498242, -234868, 173031, -35536, -271325, 206795, -93363, -274210, -14652, -205785, -217629, -284607, -191502, -123672, -276836, -310390, 120892, -303411, 75015, -126522, -194042, -127596, 22419, -11344, -137178, -67088, -213082, -779, -257601, -86457, 115750, -10033, -130733, -74143, -3756, 8462, -89181, -157156, 31211, -85555, -41866, -100438, -258899, -208581, -83004, -57858, -102313, 87805, 3194, -217770, -82317, -96685, -17689, -64332, -105580, 33823, -48152, -184319, -24696, -141742, 294955, 6953, 114892, 50617, 94244, -320087]
9150a18731k7729M1772B29689H7909b3474j47499d6698j82114H4413a8190q5275
9139a03465F7803g1688L072G1919r80J20139b45239I1293b35568A3992R9597E437
9126A24609J18395B0081b13070A879h6170m99k1169A55721a92659g3984j34510
9115b08494o9641i0504B03413h6033A18130g2427n4419L0992K8b7978A38802J86098
9103C24900e9636A30330h9408j38104j38652a41202F5250J37015p7289a12017
9092A10927j3253b9786i873G957a18915A33660n4192b6158r6239N5941r7185h0044
9079a18208I3409i7965j28552l9922k5702e966j6511H6674a38134C9724L059J02565
9067A45348K26460A0817J66382c1513m28438h4533e940k62734B33672b79297B2067
$$ y = [-118731, -146460, -104688, 229689, 87909, -23474, -170973, -46698, -228812, 84413, -18190, -103465, 67803, -71688, -68616, 71919, 70939, 191078, -245239, 91293, -235568, 13992, 113589, 5437, 124609, 243004, 20081, -213070, 1879, -86170, -86669, -107838, 155721, -192659, -73984, -208494, -278135, -90504, 203413, -86033, 118130, -72427, -126846, -95854, -95826, -27978, 138802, 324900, -59636, 130330, -89408, -227512, -366164, -141202, 65250, 202265, 124976, -112017, 110927, 97674, -29786, -9873, 7957, -118915, 133660, 79468, -26158, -122397, -66456, -163641, -80044, -118208, 93409, -97965, -226517, -266439, -292141, -5966, -22477, 86674, -138134, 39724, 42783, 145348, 371808, 10817, 177199, -31513, -459951, -84533, -5940, -268674, 233672, -279297, 22067]
9055h5992k04607A2290J02623h8000k3854e0718j87024B32028a14524C02227b45796
9043a23545D3742b60960g2089D0835L4276N1665d86755A66083a18245c6401B72219
9031b36409A02025d1756B12978J2017b44879F2970a28460A43691P7546a21064
9020c3449A00313A4796J84054b50469c9936k31372f2642B6672a18252K8575k31909
9009c21586a58898C1128L3714b59931A14957a8742A25845b6464J0154A49509h0113
8997C8917a25095E1646a47679m7469I4509a09447l7795j86663k1308a66336H7305
8985a41550l7155A62002a39363J3877B48051b29531R9547e6342G9172M05573b25657
8973a35367j31306F7864a12116m6122f4931H8916A460b81555L2524b3297D6499
$$ y = [-85992, -290599, 12290, 114913, -88000, -111854, -50718, -237742, 232028, -114524, 302227, -245796, -123545, 43742, -260960, -72089, 40835, 75111, 126776, -486755, 166083, -118245, -36401, 272219, -236409, 102025, -41756, 212978, 224995, -244879, 62970, -128460, 143691, 221237, -121064, -33449, 100313, 14796, 198850, -250469, -39936, -271308, -62642, 26672, -118252, -89677, -321586, -158898, 31128, 64842, -259931, 114957, -18742, 125845, -26464, -16310, 149509, -80113, 38917, -125095, 51646, -147679, -195148, 94509, -109447, -147242, -333905, -355213, -166336, 87305, -141550, -178705, 162002, -139363, -125486, 248051, -229531, -129984, -56342, 79172, 484745, -225657, -135367, -266673, 67864, -112116, -158238, -64931, 88916, 1460, -281555, -249031, -23297, 46499]
8961d227n10113b14403H2745j2801c47993A75226a45693j12657i8770B11116p6017
8950A35099f6592A23499n8376Q669R9173G5887J59694r4308C0726b05141J7233
8939a87908A35152i7337p638K8087D97254d1195B07402k9325M6079q5840K4788
8928A63104b3965B55781M58790J18624J243027L538992J0274346o604838B682362
8918A286685F25316r0109B54106K68392F9907c4084j81540f3549E4765L5472N16698
8907F06935d23460F8806b28206B02985C9296a29054A7926L29576I9969b02855
8896b72481J07731K2703C5877h174m22180a14935C3943N1381c06338A6219f9389
8884d8993f129k00756B28813d98739A89323A2144K31643I1417Q8346a21868M0206
$$ y = [-4227, -514340, -214403, 82745, 69944, -347993, 175226, -145693, -258350, -98770, 211116, 135099, -66592, 123499, 65123, 73792, 172965, 75887, 235581, 141273, 30726, -205141, -187908, 135152, -97337, -104975, -76888, 497254, -41195, 207402, 178077, 224156, 138316, 163104, -23965, 255781, 714571, 833195, 2076222, 5615214, 15889560, 9284722, 2682362, 1286685, 625316, 535207, 254106, 522498, 69907, -34084, -215624, -63549, 54765, 90237, 606935, -423460, 68806, -228206, 202985, 39296, -129054, 17926, 347502, 99969, -202855, -272481, -164750, -142047, 35877, -8174, -430354, -114935, 33943, 85324, -306338, 16219, -69389, -48993, -6129, -206885, 228813, -498739, 189323, 12144, 243787, 91417, 179763, -121868, -81662]
8873h1662D3549b78140k3961l713C0177f5656K9556k50859C92533A9515K92449
8862C11964c76547J45223j08020J57175N517A47955J84926c3203j86682N5716
8852a64169p429e1364j04263A13377a03404B9186R4335a22698j4917c2351A53123
8840H2833K5448e0830j44949C56678e7135l4522l4632K4061j55833m8537B83340
$$ y = [-81662, 43549, -278140, -302101, -305814, 30177, -65656, -36100, -286959, 392533, 19515, 311964, -376547, -231324, -339344, -182169, -176652, 147955, 332881, -33203, -219885, -164169, -171598, -51364, -155627, 113377, -103404, 29186, 123521, -122698, -137615, -32351, 153123, 82833, 108281, -50830, -195779, 356678, -57135, -91657, -126289, -102228, -258061, -306598, 283340]
$$ [...]
##END NTUPLES=NMR SPECTRUM
##END=
