##TITLE=AC1773_VIETDRY_9683792_yMcy3rT8sS
##JCAMPDX= 6.0         $$ Bruker NMR JCAMP-DX V2.0
##DATA TYPE= NMR SPECTRUM
##DATA CLASS= NTUPLES
##ORIGIN= BRUKER
##OWNER= Administrator
$$ 1.72 TOPSPIN		Version 2.1
$$ 2016-04-16 23:43:57.486 -0700  Administrator@X
$$ Compression mode = diff/dup
##.OBSERVE FREQUENCY= 400.02188249412
##.OBSERVE NUCLEUS= ^1H
##.ACQUISITION MODE= SIMULTANEOUS (DQD)
##.ACQUISITION SCHEME= undefined
##.AVERAGES= 64
##.DIGITISER RES= 22
##SPECTROMETER/DATA SYSTEM= spect
##.PULSE SEQUENCE= noesygpps1d.comp
##.SOLVENT NAME= COFFEE_meoh
##.SHIFT REFERENCE= INTERNAL, COFFEE_meoh, 1, 14.96097
##AUDIT TRAIL= $$ (NUMBER, WHEN, WHO, WHERE, PROCESS, VERSION, WHAT)
$$ ##TITLE= Audit trail, TOPSPIN		Version 2.1
$$ ##JCAMPDX= 5.01
$$ ##ORIGIN= Bruker BioSpin GmbH
$$ ##OWNER= Administrator
$$ $$ E:\/data/COFFEE/nmr/AC1773_VIETDRY_9683792_yMcy3rT8sS/12/pdata/1/auditp.txt
$$ ##AUDIT TRAIL=  $$ (NUMBER, WHEN, WHO, WHERE, PROCESS, VERSION, WHAT)
(   1,<2016-04-16 23:43:52.267 -0700>,<Administrator>,<X>,<go>,<TOPSPIN 2.1>,
      <created by zg
	started at 2016-04-16 23:32:22.736 -0700,
	POWCHK enabled, PULCHK disabled,
       configuration hash MD5:
       21 0F 79 D6 B3 7B B4 F6 88 20 88 DB 03 48 BD 9F
       data hash MD5: 64K
       93 83 32 61 19 F2 0F 6A 51 24 C5 26 00 81 89 67>)
(   2,<2016-04-16 23:43:55.423 -0700>,<Administrator>,<X>,<proc1d>,<TOPSPIN 2.1>,
      <Start of raw data processing
       efp LB = 0.3 FT_mod = 6 PKNL = 1 PHC0 = 0 PHC1 = 0 SI = 128K 
       data hash MD5: 128K
       B0 8D C9 F6 E9 B3 DB 01 5E 0B 01 33 86 C3 EE AD>)
(   3,<2016-04-16 23:43:56.283 -0700>,<Administrator>,<X>,<proc1d>,<TOPSPIN 2.1>,
      <pk PHC0 = -87.47314 PHC1 = 0 
       data hash MD5: 128K
       A4 52 F5 EC E3 1E 17 0D 96 86 76 FB 0E 24 96 37>)
(   4,<2016-04-16 23:43:56.658 -0700>,<Administrator>,<X>,<proc1d>,<TOPSPIN 2.1>,
      <abs ABSG = 1 
       data hash MD5: 128K
       17 ED F5 E4 AB 8A 6B BB E0 3E 42 AD 43 E3 76 C7>)
(   5,<2016-04-16 23:43:56.767 -0700>,<Administrator>,<X>,<proc1d>,<TOPSPIN 2.1>,
      <abs ABSG = 2 
       data hash MD5: 128K
       C8 4F CF 77 1F 12 58 FF 38 A7 8E A1 9F BC 83 7C>)
(   6,<2016-04-16 23:43:56.845 -0700>,<Administrator>,<X>,<proc1d>,<TOPSPIN 2.1>,
      <abs ABSG = 3 
       data hash MD5: 128K
       B0 02 0F 33 73 6B 61 36 E3 70 96 E2 65 A4 CE BB>)
(   7,<2016-04-16 23:43:56.939 -0700>,<Administrator>,<X>,<proc1d>,<TOPSPIN 2.1>,
      <abs ABSG = 4 
       data hash MD5: 128K
       69 2D 81 50 8C 6B 73 18 D3 C4 D6 09 B5 F5 F6 74>)
(   8,<2016-04-16 23:43:57.017 -0700>,<Administrator>,<X>,<proc1d>,<TOPSPIN 2.1>,
      <abs ABSG = 5 
       data hash MD5: 128K
       0B A1 35 BB 94 0C D6 48 37 CB 06 2F B1 9D 15 F7>)
$$ ##END=
$$ 
$$ $$ hash MD5
$$ $$ F1 E4 9F 2C 59 74 E5 61 96 01 6E 7A 0D BF 66 7F
##$RELAX= 
##$RELAX= 
##$RELAX= 
##$RELAX= 
##$RELAX= 
##$RELAX= 
##$RELAX= 
##$RELAX= 
$$ Bruker specific parameters
$$ --------------------------
##$DU= <E:\>
##$EXPNO= 12
$$ [...]
##$TP07= 0
##$TPNAME0= <>
##$TPNAME1= <>
##$TPNAME2= <>
##$TPNAME3= <>
##$TPNAME4= <>
##$TPNAME5= <>
##$TPNAME6= <>
##$TPNAME7= <>
##$TPOAL= (0..7)
0.5 0.5 0.5 0.5 0.5 0.5 0.5 0.5
##$TPOFFS= (0..7)
0 0 0 0 0 0 0 0
##$TUNHIN= 0
##$TUNHOUT= 0
##$TUNXOUT= 0
##$USERA1= <user>
##$USERA2= <user>
##$USERA3= <user>
##$USERA4= <user>
##$USERA5= <user>
##$V9= 5
##$VALIST= <valist>
##$VCLIST= <CCCCCCCCCCCCCCC>
##$VD= 0
##$VDLIST= <DDDDDDDDDDDDDDD>
##$VPLIST= <PPPPPPPPPPPPPPP>
##$VTLIST= <TTTTTTTTTTTTTTT>
##$WBST= 2048
##$WBSW= 25
##$XGAIN= (0..3)
0 0 0 0
##$XL= 0
##$YL= 0
##$YMAX_a= 5977138
##$YMIN_a= -10657115
##$ZGOPTNS= <>
##$ZL1= 120
##$ZL2= 120
##$ZL3= 120
##$ZL4= 120
##$ABSF1= 14.96097
##$ABSF2= -5.597212
##$ABSG= 5
##$ABSL= 3
##$ALPHA= 0
##$AQORDER= 0
##$ASSFAC= 0
##$ASSFACI= 0
##$ASSFACX= 0
##$ASSWID= 0
##$AUNMP= <proc_prof1d_extract.lims>
##$AXLEFT= 0
##$AXNAME= <>
##$AXNUC= <1H>
##$AXRIGHT= 0
##$AXTYPE= 0
##$AXUNIT= <>
##$AZFE= 0.1
##$AZFW= 0.1
##$BCFW= 0
##$BC_mod= 0
##$BYTORDP= 0
##$COROFFS= 0
##$CY= 15
##$DATMOD= 1
##$DC= 0
##$DFILT= <>
##$DTYPP= 0
##$F1P= 0
##$F2P= 0
##$FCOR= 0.5
##$FTSIZE= 131072
##$FT_mod= 6
##$GAMMA= 0
##$GB= 0
##$INTBC= 1
##$INTSCL= 1
##$ISEN= 128
##$LB= 0.3
##$LEV0= 0
##$LPBIN= 0
##$MAXI= 10000
##$MC2= 0
##$MEAN= 0
##$ME_mod= 0
##$MI= 0
##$NCOEF= 0
##$NC_proc= -2
##$NLEV= 6
##$NOISF1= 0
##$NOISF2= 0
##$NSP= 0
##$NTH_PI= 0
##$NZP= 0
##$OFFSET= 14.96097
##$PC= 1
##$PHC0= -87.47314
##$PHC1= 0
##$PH_mod= 1
##$PKNL= yes
##$PPARMOD= 0
##$PPDIAG= 0
##$PPIPTYP= 0
##$PPMPNUM= 2147483647
##$PPRESOL= 1
##$PSCAL= 4
##$PSIGN= 0
##$PYNMP= <proc.py>
##$REVERSE= no
##$SF= 400.020009647028
##$SI= 131072
##$SIGF1= 0
##$SIGF2= 0
##$SINO= 400
##$SIOLD= 131072
##$SPECTYP= <>
##$SREGLST= <1H.CDCl3>
##$SSB= 0
##$STSI= 131072
##$STSR= 0
##$SW_p= 8223.68421052631
##$SYMM= 0
##$S_DEV= 0
##$TDeff= 65536
##$TDoff= 0
##$TI= <>
##$TILT= no
##$TM1= 0
##$TM2= 0
##$TOPLEV= 0
##$USERP1= <user>
##$USERP2= <user>
##$USERP3= <user>
##$USERP4= <user>
##$USERP5= <user>
##$WDW= 1
##$XDIM= 131072
##$YMAX_p= 313158775
##$YMIN_p= -10686
##$CURPLOT= <Network HP LaserJet P1505>
##$CURPRIN= <$Network HP LaserJet P1505>
##$DFORMAT= <normdp>
##$LAYOUT= <+/1D_H.xwp>
##$LFORMAT= <normlp>
##$PFORMAT= <normpl>
##$SURQMSG= 1
$$ End of Bruker specific parameters
$$ ---------------------------------
##NTUPLES= NMR SPECTRUM
##VAR_NAME=  FREQUENCY,     SPECTRUM/REAL,   SPECTRUM/IMAG
##SYMBOL=    X,             R,               I
##VAR_TYPE=  INDEPENDENT,   DEPENDENT,       DEPENDENT
##VAR_FORM=  AFFN,          ASDF,            ASDF
##VAR_DIM=   131072,        131072,          131072
##UNITS=     HZ,            ARBITRARY UNITS, ARBITRARY UNITS
##FACTOR=    0.0627417313425164, 1,          1
##FIRST=     8223.62146879497, 1506,         -50751
##LAST=      0,             2509,            -50572
##MIN=       0,             -10686,          0
##MAX=       8223.62146879497, 313158775,    0
$$ Real data points
##PAGE= N=1
##DATA TABLE= (X++(R..R)), XYDATA
$$ [...]
63940A455545J39060J53971J68491J82114J94732K06229K15897K22586K25497
63931C164122K24666K20472K12750K00683J83621J61857J36390J08107P7385M4590
63921D734643J0692k2954n5443q6642j16479j44168j68394j88214k03390k13906
63911C545745k19646k20842k18510k13920k07585j99054j87851j74428j60024
63902A743885j45697j31754j18139j05138r3375q3104p3862o5052n6710m9363
63892H21691m3323l8436l4469l1282k8562k5854k3079k0592j8548j6584j4467
63881E26495j2594j1387j0543r410p955o717n856m833l130r39J091K484L281M008
63867D63995N344P476R878J1889J3455J4923J6335J7478J8568K0193K2367K4352
$$ plain form
63940 1455545 1594605 1748576 1917067 2099181 2293913 2500142 2716039 2938625 3164122
63931 3164122 3388788 3609260 3822010 4022693 4206314 4368171 4504561 4612668 4690053 4734643
63921 4734643 4745335 4722381 4666938 4580296 4463817 4319649 4151255 3963041 3759651 3545745
63911 3545745 3326099 3105257 2886747 2672827 2465242 2266188 2078337 1903909 1743885
63902 1743885 1598188 1466434 1348295 1243157 1149782 1066678 992816 927764 871054 821691
63892 821691 778368 739932 705463 674181 645619 619765 596686 576094 557546 540962 526495
63881 526495 513901 502514 491971 482561 474606 467889 462033 457200 454070 453131 454222 456706 459987 463995
63867 463995 469339 476815 486693 498582 512037 526960 543295 560773 579341 599534 621901 646253
63855F46253K5701K6932K8712L0754L2054L1970L0690K8786K6722K4619K2286
63844I55479J9489J6315J3087R833O160J962k197n709q654j1554j4684j7934k1100
63831I40493k3923k6079k7600k8927l0218l0940l0688l0043k9841k9920k9456
63820F22858k8445k7790k7780k7451k5926k3571k1255j9148j6955j4799j3127
63809C76611j1981j1016j0086r269q465p478o446n628m889l918k979k773l452
63796B88231m258m474m245m129m203m091l681l374l489l774l676k975k035j375
63782B38452j158j171j242j484k001k537k655k213j457o87r3J32j24o55j028j054
63766B19025r26q12o22k86N7L89Q95J468J464M78q86j596j420j027r02p39j09
$$ plain form
63855 646253 671954 698886 727598 758352 790406 822376 853066 881852 908574 933193 955479
63844 955479 974968 991283 1004370 1014203 1020363 1022325 1020128 1014419 1005765 994211 979527 961593 940493
63831 940493 916570 890491 862891 833964 803746 772806 742118 712075 682234 652314 622858
63820 622858 594413 566623 538843 511392 485466 461895 440640 421492 404537 389738 376611
63809 376611 364630 353614 343528 334259 325794 318316 311870 306242 301353 297435 294456 291683 288231
63796 288231 283973 279499 275254 271125 266922 262831 259150 255776 252287 248513 244837 241862 239827 238452
63782 238452 237294 236123 234881 233397 231396 228859 226204 223991 222534 221847 221754 221886 221762 221107 220079 219025
63766 219025 218099 217287 216665 216379 216436 216825 217720 219188 220652 221130 220244 218648 217228 216201 215299 214560 214451
63749B14451P99J413J373P33k01r48j087n92K23J128K075K800K865K312J788J747
63733B30879J962K121K413K985L355L041K462K419K938L416L786M604N852O585
63719B78818O204N363N011N127M938M085K931J843P71m29j628k538l026l212l303
63704C00955l369l298l088k958l028k985k411j396m06M29J417K542L107K552J262
63689B89325K33O9N50R93Q67K34k96k07L46Q33J152J626K173K199J634J308J845
63672C04884K779L317L494L806M172M086L584L213L146L051K785K466J893O66
63658C47342r93k278k865l271l916m474m526m268m134m097l814l224k639k328
63644C00515k260k120j523m28O60J157J153J256J700K068K086K131K595L231L588
$$ plain form
63749 214451 215250 216663 218036 218769 218568 217620 216533 215941 216164 217292 219367 222167 225032 227344 229132 230879
63733 230879 232841 234962 237375 240360 243715 246756 249218 251637 254575 257991 261777 266381 272233 278818
63719 278818 285022 290385 295396 300523 305461 309546 312477 314320 315091 314662 313034 310496 307470 304258 300955
63704 300955 297586 294288 291200 288242 285214 282229 279818 278422 278016 278445 279862 282404 285511 288063 289325
63689 289325 289558 289627 290177 291170 292037 292271 291975 291768 292114 292947 294099 295725 297898 300097 301731 303039 304884
63672 304884 307663 310980 314474 318280 322452 326538 330122 333335 336481 339532 342317 344783 346676 347342
63658 347342 346349 344071 341206 337935 334019 329545 325019 320751 316617 312520 308706 305482 302843 300515
63644 300515 298255 296135 294612 294184 294844 296001 297154 298410 300110 302178 304264 306395 308990 312221 315809
63629C15809L723M023M522M929N126N320N670O141O654P163P679Q391R533J0929
63615D05612J1974J2430J2959J4374J6544J8544J9918K1130K2713K4487K5880
63604F06565K6584K6516K5489K3322K0294J7029J3919J0858P651M448J634o13
63592G83696k449m057n421o526p596q943j0615j2346j3834j4875j5328j5150j4625
63579F51931j4279j4398j4677j4452j3180j0755p595m512k216p64K88J148J536
63566E58075J419J494K403L742M436M122L598L777M737N963P100Q130R098R979
63552F28073J0777J1576J2654J4558J7675K1591K5270K8117L0355L2062L2360
63541H65068L0326K6451K2309J8764J5204J0804N791J100k616n201o666p293p713
$$ plain form
63629 315809 319532 323555 328077 333006 338132 343452 349122 355263 361917 369080 376759 385150 394683 405612
63615 405612 417586 430016 442975 457349 473893 492437 512355 533485 556198 580685 606565
63604 606565 633149 659665 685154 708476 728770 745799 759718 770576 778227 782675 784309 783696
63592 783696 781247 777190 771769 765243 757647 748704 738089 725743 711909 697034 681706 666556 651931
63579 651931 637652 623254 608577 594125 580945 570190 562595 558083 555867 555103 555391 556539 558075
63566 558075 559494 560988 563391 567133 571569 575691 579289 583066 587803 593766 600866 608996 618094 628073
63552 628073 638850 650426 663080 677638 695313 716904 742174 770291 800646 832708 865068
63541 865068 895394 921845 944154 962918 978122 988926 994717 995817 993201 988000 981334 974041 966328
63528I66328q400r277j0262j1818j4345j7277j9536k0869k2015k3502k4959k5805
63516G58263k5897k5251k3752k1672j9890j9045j8753j8074j6499j4173j1503
63505E43754r060p538p158p239o818n671m398l619l503l915m521m824m534l917
63491D67039l423l127k878k797l044l242k817j901j193q40j81J136K512L282L592
63476D52118L881M007L583K807K293K157J933J329N24m09j720l380m691m993m569
63461D54870m442n176o211o587o074n291m808m568m269l881l454k788j784q45
63447C94692l77pJ030K698M037M429M369M643N383O378P800J0007J2937J6208
63433D74227J9574K2680K4704K4912K3633K2000K0681J9362J7557J5337J3062
$$ plain form
63528 966328 957928 948651 938389 926571 912226 894949 875413 854544 832529 809027 784068 758263
63516 758263 732366 707115 683363 661691 641801 622756 604003 585929 569430 555257 543754
63505 543754 534694 527156 519998 512759 505941 500270 495872 492253 488750 484835 480314 475490 470956 467039
63491 467039 463616 460489 457611 454814 451770 448528 445711 443810 442617 441777 441596 442732 445244 448526 452118
63476 452118 455999 460006 463589 466396 468689 470846 472779 474108 474632 474223 472503 469123 464432 459439 454870
63461 454870 450428 445252 439041 432454 426380 421089 416281 411713 407444 403563 400109 397321 395537 394692
63447 394692 394315 394308 395338 398036 402073 406502 410871 415514 420897 427275 435075 445082 458019 474227
63433 474227 493801 516481 541185 566097 589730 611730 632411 651773 669330 684667 697729
63422F97729J0934R188Q348Q847J0555J2947J5603J8305K0871K3140K4923K5770
63410H87160K4992K2341J8567J4783J1328P715L730j2k971n492q150j0629j2097
63397I51265j2654j3513j5471j7875j9576k0359k0881k1561k2231k2628k2614
63386G41902k1911k0292j8136j6231j4865j3514j1618r291p032n125l484j936
63374E98467l71J201K661L974N330O855Q245R055R359R715J0515J1720J3258J5126
63360G05110J6976J8247J8955J9875K1611K3916K6165K7958K8922K8484K6447
63349I62666K3420K0213J7016J3585R873O034K159j537m575o764q594j0601j2662
63336A010233j4403j5918j7447j8753j9618k0606k2363k4317k5119k4515k3660
$$ plain form
63422 697729 708663 717851 726199 735046 745601 758548 774151 792456 813327 836467 861390 887160
63410 887160 912152 934493 953060 967843 979171 986886 990616 990604 987633 982141 973991 963362 951265
63397 951265 938611 925098 909627 891752 872176 851817 830936 809375 787144 764516 741902
63386 741902 719991 699699 681563 665332 650467 636953 625335 616044 609012 603887 600403 598467
63374 598467 598096 599297 601958 605932 611262 618117 626362 635417 644776 654491 665006 676726 689984 705110
63360 705110 722086 740333 759288 779163 800774 824690 850855 878813 907735 936219 962666
63349 962666 986086 1006299 1023315 1036900 1046773 1052807 1054966 1053429 1048854 1042090 1033496 1022895 1010233
63336 1010233 995830 979912 962465 943712 924094 903488 881125 856808 831689 807174 783514
63325G83514k3265k2443k0021j6235j2379r303p021n467m820n053n688o126o094
63312F39599n834o112p709j0518j3277j4609j4368j3580j3087j2619j1437r532
63300E06917p750o806o554o451o374o596p048p168o673o048n845n869n567n000
63286D17168m808n187n563n411m884m364l823l076k325k015k248k628k676k227
63272C65933j534j123j370k091k662k756k665k780l007l036k938l013l143k840
63258C30975j986j129p86q04o81k83J12K89K69R0k43n26m69j28P8o5k61j81P0
63239C24341K08K57L93N60N92O22Q95J279J467J542J785J925J385M19J87J185
63223C39042K324K283J320Q65J607K844L664L930L910L639L048K381K030K055
$$ plain form
63325 783514 760249 737806 717785 701550 689171 679868 672847 667380 662560 657507 651819 645693 639599
63312 639599 633765 627653 619944 609426 596149 581540 567172 553592 540505 527886 516449 506917
63300 506917 499167 492361 485807 479356 472982 466386 459338 452170 445497 439449 433604 427735 422168 417168
63286 417168 412360 407173 401610 396199 391315 386951 383128 380052 377727 375712 373464 370836 368160 365933
63272 365933 364399 363276 361906 359815 357153 354397 351732 348952 345945 342909 339971 336958 333815 330975
63258 330975 328989 327860 327074 326270 325589 325306 325418 325707 325976 326066 325823 325297 324828 324700 324778 324713 324452 324271 324341
63239 324341 324549 324806 325199 325759 326351 326973 327868 329147 330614 332156 333941 335866 337251 337670 337857 339042
63223 339042 341366 343649 344969 345834 347441 350285 353949 357879 361789 365428 368476 370857 372887 374942
63209C74942K052J608Q63N90J384K779L519L009J987J372J031L83k44N5J170J828
63193C98328J428R78J667L233M464M869N027N535O380P363Q540R919J1062J1403
63179D80196J0990J0606J0973J1871J2362J1946J1090J0460J0045R500Q909Q541
63167F07489Q123P131N786M824M223L009O73k024m114n639p224r074j0960j2730
63153E89493j4202j4926j4755j4290j4141j3945j2940j1311j0116r754r310p791
63141D42012n515l750l222l400l226k267j045l18k83n00m82n8P83J984L207L895
63125D27815L861L596L705M210M724N111N556O046O228N881N279M935N115N619
63111D97681N940N691N048M648M886N367N345M624L791L382L183K577J523P86
$$ plain form
63209 374942 376994 378602 379465 380055 381439 384218 387737 390746 392733 394105 395136 395519 395275 395330 396500 398328
63193 398328 399756 400734 402401 405634 410098 414967 419994 425529 431909 439272 447812 457731 468793 480196
63179 480196 491186 501792 512765 524636 536998 548944 560034 570494 580539 590039 598948 607489
63167 607489 615612 622743 628529 633353 637576 640585 641258 639234 635120 629481 622257 613183 602223 589493
63153 589493 575291 560365 545610 531320 517179 503234 490294 478983 468867 459113 449803 442012
63141 442012 436497 432747 429525 426125 422899 420632 419587 419269 418986 418486 418004 417946 418729 420713 423920 427815
63125 427815 431676 435272 438977 443187 447911 453022 458578 464624 470852 476733 482012 486947 492062 497681
63111 497681 503621 509312 514360 519008 523894 529261 534606 539230 543021 546403 549586 552163 553686 554472
63097E54472J073K136L029L273L364L939M827N336N249N037N064N152M990M543
63083F11484L782K526Q06r08k155k980l817n006o485p757q180p653o994p076p588
63068E51999p366o173n183n198n302m200k226q53n14k02P80J892K589L371M905
63053E28319O739P747P585P023O874P177P560P945Q588R558J0480J0937J0931
63040F37463J0794J0709J0570J0348J0231J0197R784Q662P243O307O068N953N367
63027G49696M282K967J452l62k249l660m378m952o153p982r498r906r460q978
63013F90819q689q106o969n625m357k969j271N98K570M796P091Q878J0066J1271
62999F98103J2743J3816J4107J4519J6065J8230J9533J9392J8463J7454J6647
$$ plain form
63097 554472 555545 557681 560710 563983 567347 571286 576113 581449 586698 591735 596799 601951 606941 611484
63083 611484 615266 617792 618598 617690 615535 612555 608738 603732 597247 589490 581310 573657 566663 559587 551999
63068 551999 544633 538460 533277 528079 522777 518577 516351 515498 514984 514782 515562 517454 520043 523414 528319
63053 528319 535058 542805 550390 557413 564287 571464 579024 586969 595557 605115 615595 626532 637463
63040 637463 648257 658966 669536 679884 690115 700312 710096 718758 726001 732308 738376 744329 749696
63027 749696 753978 756945 758397 758035 755786 752126 747748 742796 736643 728661 719163 709257 699797 690819
63013 690819 682130 674024 667055 661430 657073 654104 652833 653431 656001 660797 667888 676766 686832 698103
62999 698103 710846 724662 738769 753288 769353 787583 807116 826508 844971 862425 879072
62988H79072J6371J6742J6961J6003J4142J2685J1987J0899Q570N633K961L23
62976A012349k935o689j0400j4054j7827k1268k3641k4863k5410k5536k5217k4641
62964G89868k4056k3287k2010k0419j9053j7978j6734j5171j3801j3186j3314
62953E90859j3727j3919j3494j2312j0786r809j0024j1047j1714j1321j0443j0160
62941D52103j0497j0247q659o687n839o136o167n114l780l277l611m066m301m378
62927C69344m222l728l105k622k258k007k142k649k804k003p71k10n57r76q03
62912C38487l20j38l49n83n44k07K94P79J080J104Q82O71R43J980L370M257M330
62895C56036M188M450M884M922M649M627M969N243N269N284N317M956M003K851
$$ plain form
62988 879072 895443 912185 929146 945149 959291 971976 983963 994862 1003432 1009065 1012026 1012349
62976 1012349 1009414 1002725 992325 978271 960444 939176 915535 890672 865262 839726 814509 789868
62964 789868 765812 742525 720515 700096 681043 663065 646331 631160 617359 604173 590859
62953 590859 577132 563213 549719 537407 526621 516812 506788 495741 484027 472706 462263 452103
62941 452103 441606 431359 422700 416013 410174 404038 397871 392757 388977 385700 382089 378023 373722 369344
62927 369344 365122 361394 358289 355667 353409 351402 349260 346611 343807 341804 341033 340823 340266 339290 338487
62912 338487 338167 338029 337680 337097 336553 336346 336640 337419 338499 339603 340485 341156 342099 344079 347449 351706 356036
62895 356036 360224 364674 369558 374480 379129 383756 388725 393968 399237 404521 409838 414794 418797 421648
62881D21648K019J611J388J017J95j102k425l226l487l671m013m301m404m519
62867C96730m774m973m969m884m815m678m527m572m667m290l328k423k146k210
62853C39474j964j292n62K5N13P70O22K69P0ok21m12r6O41J031O51Q8J59R04J686
62833C42350K016J850J287M86k02m65l47m9M84J348K100J992R81k5k65m8j95q48
62815C52450j367j262p25k72k75q21j635k090j776j090q34j111j150m32N62J115
62799C39287J286J552J809J451L84o52r22m10L88R76J103P88L77L14O90J276J995
62782C51692L094M639O145P009P108O830O617O726P263Q140Q982R272Q708P443
62768D49668N999M962M591M634M528L820K433N86j264k543k964l009l599m988
$$ plain form
62881 421648 423667 425278 426666 427683 427878 426776 424351 421125 417638 413967 409954 405653 401249 396730
62867 396730 391956 386983 382014 377130 372315 367637 363110 358538 353871 349581 346253 343830 341684 339474
62853 339474 337510 336218 335656 335681 336194 336964 337586 337855 337925 337919 337698 337286 337190 337831 338862 339513 339601 339760 340664 342350
62833 342350 344366 346216 347503 347989 347787 347322 346975 346926 347410 348758 350858 352850 353831 353806 353541 353493 353298 352450
62815 352450 351083 349821 349096 348824 348549 347728 346093 344003 342227 341137 340303 339192 338042 337610 338172 339287
62799 339287 340573 342125 343934 345385 345769 345117 344195 343785 344173 345149 346252 347040 347417 347731 348421 349697 351692
62782 351692 354786 359425 365570 372579 379687 386517 393134 399860 407123 415263 424245 433517 442225 449668
62768 449668 455667 460629 465220 469854 474382 478202 480635 481221 479957 477414 474450 471441 467842 462854
62754D62854o280o446n674n167n686o800p725q262q583q583q056p255o692o393
62740C65252n945n294m905m941m777l805k303j094o10p22j206j808k020j409k63
62725C24150O31R74J222J728K201K295K202K261K389K382K474L059M061N079N984
62710C63092O948P938Q768R508J0424J1497J2522J3662J5327J7423J9344K0857
62698E17310K2402K4196K5682K6350K6677K7583K9214L0779L1513L1299L0434
62687H23439K9254K7940K6279K3566J9239J3669P937K690k313p432j2441j6949
62675I34878k1057k5075k8746l1297l2297l2062l1176k9937k8487k7120k6218
62664F21406k5813k5422k4386k2441k0039j7981j6657j5635j4224j2298j0367
$$ plain form
62754 462854 456574 450128 444454 439287 433601 426801 419076 410814 402231 393648 385592 378337 371645 365252
62740 365252 359307 354013 349108 344167 339390 335585 333282 332188 331578 330856 329650 327842 325822 324413 324150
62725 324150 324781 325755 326977 328705 330906 333201 335403 337664 340053 342435 344909 347968 352029 357108 363092
62710 363092 370040 377978 386746 396254 406678 418175 430697 444359 459686 477109 496453 517310
62698 517310 539712 563908 589590 615940 642617 670200 699414 730193 761706 793005 823439
62687 823439 852693 880633 906912 930478 949717 963386 971323 974013 971700 964268 951827 934878
62675 934878 913821 888746 860000 828703 796406 764344 733168 703231 674744 647624 621406
62664 621406 595593 570171 545785 523344 503305 485324 468667 453032 438808 426510 416143
62653D16143q904p905p157o591o195n912n749n761n728n186m054k926k358k072
62639C39645j413m09J89km67n56l41l49p44j163j248j058q80q80r60r16p78q43
62621C26827j331j995k297j936j055N9J103J653J375N24j01k8L22K13m28r32p18
62604C21255N4O76O69K90K15P11J271J394J383J922K941L596L444K998K819K822
62588C48460K844L167L897M390M087L423L079K808J911N91k29m54r85k196l203
62573C71590l229k845l125m098m709m216l091k463k907l830m130l465k658k550
62559C24274k845k611j720r71q30q92q34r77j448j561p24M98R73L79n15q07k96
62542C09093N18R53P93N69R50J839K454K445K202J949J349N04M12J561K830K888
$$ plain form
62653 416143 407239 399334 392177 385586 379391 373479 367730 361969 356241 351055 347001 344075 341717 339645
62639 339645 338232 337823 338012 338010 337543 336987 336646 336297 335553 334390 333142 332084 331204 330324 329364 328448 327670 326827
62621 326827 325496 323501 321204 319268 318213 318272 319375 321028 322403 322927 322826 322798 323120 323333 322905 321973 321255
62604 321255 321309 321985 322654 322944 323159 323870 325141 326535 327918 329840 332781 336377 339821 342819 345638 348460
62588 348460 351304 354471 358368 362758 366845 370268 373347 376155 378066 378657 378428 377974 376989 374793 371590
62573 371590 368361 365516 362391 358293 353584 349368 346277 343814 340907 337077 332947 329482 326824 324274
62559 324274 321429 318818 317098 316127 315297 314405 313571 312594 311146 309585 308861 309359 310332 310711 310196 309389 309093
62542 309093 309611 310564 311357 311926 312876 314715 317169 319614 321816 323765 325114 325618 326030 327591 330421 333309
62526C33309K172K264L533M682M842M769N537P000Q256Q972R570J0441J1547J2709
62512D29603J3851J5100J6680J8557K0133K0759K0596K0546K1022K1270K0265
62501F38382J7993J5396J3238J1389R215O409L432J132p6o01j033j249n59J256
62487G14324L521N538P408R700J2640J5940J9106K1611K2948K2948K1925K0293
62475H97902J8168J5521J2444Q949M777k59n859j1436j6583k1096k4837k7883
62463H49808l0607l3164l5049l5593l4839l3493l2104l0667k8994k6967k4452
62452E03879k1416j8223j5451j3320j1647j0329r407q586p350n769m603m279m250
62439C69249l838l227l040l209k998k067q90o8K57K23m9l72n51o91j086j634j763
$$ plain form
62526 333309 335481 337745 341278 345960 350802 355571 361108 368108 376364 385336 394906 405347 416894 429603
62512 429603 443454 458554 475234 493791 513924 534683 555279 575825 596847 618117 638382
62501 638382 656375 671771 685009 696398 705613 712022 715454 716586 716510 715909 714876 713627 713068 714324
62487 714324 717845 723383 730791 740491 753131 769071 788177 809788 832736 855684 877609 897902
62475 897902 916070 931591 944035 952984 957761 957502 951643 940207 923624 902528 877691 849808
62463 849808 819201 786037 750988 715395 680556 647063 614959 584292 555298 528331 503879
62452 503879 482463 464240 448789 435469 423822 413493 404086 395500 388150 382381 377778 373499 369249
62439 369249 365411 362184 359144 355935 352937 350870 349980 349912 350169 350392 350343 349971 349420 348729 347643 346009 344246
62422C44246j239n92l86m02p3N46Q68P13N45O57P79O42M49M19L60P5k51m47p48
62403C46161j259j431p70J67L99N6L22J653L024L441L305L508L915L762L187L170
62387C72610L951M624M623M646N537O929P746P704P612Q183R190R918J0094J0095
62373D73462J0397J1017J1540J1693J1748J2284J3520J5123J6670J8216K0243
62362F25913K3117K6660L0248L3371L6165L9235M2862M6524M9408N1227N2169
62351A056899N2150N0743M7851M3941L9359L3931K7519K0501J3318N945j714r203
62339A381240j5800k1239k5681k9183l1731l3627l5239l6390l6607l6007l5370
62328A044366l5071l4564l3210l1278k9641k8748k8230k7507k6429k5237k4107
$$ plain form
62422 344246 343007 342415 342029 341627 341554 342100 342968 343681 344226 344883 345662 346304 346753 347172 347532 347607 347356 346909 346161
62403 346161 344902 343471 342701 342868 343267 343323 343645 345298 348322 351763 355068 358576 362491 366253 369440 372610
62387 372610 376561 381185 385808 390454 395991 402920 410666 418370 425982 434165 443355 453273 463367 473462
62373 473462 483859 494876 506416 518109 529857 542141 555661 570784 587454 605670 625913
62362 625913 649030 675690 705938 739309 775474 814709 857571 904095 953503 1004730 1056899
62351 1056899 1109049 1159792 1207643 1251584 1290943 1324874 1352393 1372894 1386212 1392157 1390443 1381240
62339 1381240 1365440 1344201 1318520 1289337 1257606 1223979 1188740 1152350 1115743 1079736 1044366
62328 1044366 1009295 974731 941521 910243 880602 851854 823624 796117 769688 744451 720344
62317G20344k2879k1393j9908j8952j8593j8178j7066j5422j3929j2862j1914
62306E29248j0819r680q597p450o174m925l859l025k488k181j691o57N67J205
62292D69474J167J259J962K665K550J812J315J434J833K208K602L036L331L435
62278E00083L486L593L796M263N053N832O198O312O771P731Q706R410J0353J2169
62264E93756J4704J7257J9658K2542K6412L0830L4923L8472M2031M5928M9627
62253I36140N2303N3621N3656N2359M9660M5880M1353L5760K8471J9724J0721
62242A379648K291n811j3908k1378k7405l2200l6615m0744m3745m5088m5288m5092
62230A024665m4535m3143m0810l8119l5761l3732l1278k7845k4015k1109j9635
$$ plain form
62317 720344 697465 676072 656164 637212 618619 600441 583375 567953 554024 541162 529248
62306 529248 518429 508749 500152 492702 486528 481603 477744 474719 472231 470050 468359 467702 468269 469474
62292 469474 470641 471900 473862 476527 479077 480889 482204 483638 485471 487679 490281 493317 496648 500083
62278 500083 503569 507162 510958 515221 520274 526106 532304 538616 545387 553118 561824 571234 581587 593756
62264 593756 608460 625717 645375 667917 694329 725159 760082 798554 840585 886513 936140
62253 936140 988443 1042064 1095720 1148079 1197739 1243619 1284972 1320732 1349203 1368927 1379648
62242 1379648 1381939 1376128 1362220 1340842 1313437 1281237 1244622 1203878 1160133 1115045 1069757 1024665
62230 1024665 980130 936987 896177 858058 822297 788565 757287 729442 705427 684318 664683
62219F64683j8694j7221j5271j3549j2164j0688r232q420q268p929o870n572m769
62206E26036m472m223l820l396k996k447j594m81O45J490K012K480L074L634M081
62191E20023M803O117P593Q485Q798R226J0044J0813J1215J1433J1484J0997J0011
62178F41042R241R110R135Q754Q204Q043Q336Q901R975J1970J4810J8077K1587
62165G87185K5383K9268L2775L5410L6762L6662L5518L4043L2341K9661K5499
62154A140507K0394J5154R763L761k661q735j4075j8841k3033k6305k8518k9929
62142A037482l0807l1227l1198l0593k9074k6574k3629k0820j8100j5192j2316
62131G67952r882p768n682l990l285l209k681j436m05l85j120j945k475k368j351
$$ plain form
62219 664683 645989 628768 613497 599948 587784 577096 567864 559444 551176 543247 536377 530805 526036
62206 526036 521564 517341 513521 510125 507129 504682 503088 502607 503252 504742 506754 509234 512308 515942 520023
62191 520023 524826 530943 538536 547021 555819 565045 575089 585902 597117 608550 620034 631031 641042
62178 641042 650283 659393 668528 677282 685486 693529 701865 710766 720741 732711 747521 765598 787185
62165 787185 812568 841836 874611 910021 946783 983445 1018963 1053006 1085347 1115008 1140507
62154 1140507 1160901 1176055 1185818 1189579 1186918 1178183 1164108 1145267 1122234 1095929 1067411 1037482
62142 1037482 1006675 975448 944250 913657 884583 858009 834380 813560 795460 780268 767952
62131 767952 758070 750302 744620 740630 737345 734136 731455 730019 729614 729229 728109 726164 723689 721321 719970
62116G19970M4O09M3l35Q13L130N195O409P265Q060Q290P519O097M748L865L411
62100G85133L225L147L012K664K010J155M24L9k63r68k081k999l321l302l202
62085G84673k566p21K264N601Q649J1319J3702J5799J7665J9417K1043K2462K3680
62072I42987K4693K5333K5581K5871K6651K7676K8239K8093K7650K7283K6938
62061A236995K6535K6122K5390K3638K0624J7015J3532R993N750Q15m027q214
62049A394168j1996j5930k0168k4328k7908l0667l2721l4327l5517l6068l5932
62038A088606l5428l4773l3665l1738k9264k6907k4801k2465j9744j7252j5529
62027G97040j4299j3004j1685j0756j0193r525q607p810p476p529p768q088q296
$$ plain form
62116 719970 720014 720623 720666 720331 721144 724274 729469 735878 743143 751203 759493 767012 773109 777857 781722 785133
62100 785133 788358 791505 794517 797181 799191 800346 800770 800809 800546 799578 797497 794498 791177 787875 784673
62085 784673 782107 781386 783650 789251 797900 809219 822921 838720 856385 875802 896845 919307 942987
62072 942987 967680 993013 1018594 1044465 1071116 1098792 1127031 1155124 1182774 1210057 1236995
62061 1236995 1263530 1289652 1315042 1338680 1359304 1376319 1389851 1399844 1405594 1406409 1402382 1394168
62049 1394168 1382172 1366242 1346074 1321746 1293838 1263171 1230450 1196123 1160606 1124538 1088606
62038 1088606 1053178 1018405 984740 953002 923738 896831 872030 849565 829821 812569 797040
62027 797040 782741 769737 758052 747296 737103 727578 718971 711161 703685 696156 688388 680300 672004
62014F72004q076p344o464n937n966o286o248n213l188r82N96J684K978M489N398
61999F31445N311M877M760M623L781K416J362Q56K55j034k916m908o630p933q952
61984F27313r996j1067j1599j1146j0156r504r348r093q491q001p845p506o609
61971E06952n583m968m593m043l491l331l289k696j586p45n89n89l2J112K358
61956D74887L275L691L641L404L390L737M257M890N888P309Q702R681J0620J2149
61942E59521J4108J5599J6228J6729J8001J9967K1812K3015K3655K3901K3771
61931G76307K3355K2782K1872K0286J8106J5822J3619J1119Q017M552J115k138
61919I34814m979o892p679p918q265q585q218o936n070k850k38K747O023R634
$$ plain form
62014 672004 663928 656584 650120 644183 638217 631931 625683 620470 617282 616300 616896 618580 621558 626047 631445
61999 631445 636756 641633 646393 651016 654797 657213 658575 659431 659686 658652 655736 650828 644198 636265 627313
61984 627313 617317 606250 594651 583505 573349 563845 554497 545404 536913 528912 521067 513561 506952
61971 506952 501369 496401 491808 487765 484274 480943 477654 474958 473372 472627 472038 471449 471417 472529 474887
61956 474887 478162 481853 485494 488898 492288 496025 500282 505172 511060 518369 527071 536752 547372 559521
61942 559521 573629 589228 605456 622185 640186 660153 681965 704980 728635 752536 776307
61931 776307 799662 822444 844316 864602 882708 898530 912149 923268 931285 935837 936952 934814
61919 934814 929835 922943 915264 907346 899081 890496 882278 875342 870272 867422 867184 869931 875954 885588
61905H85588J3341J6150J7028J6144J4621J2944J0440O597K086k084n706r015
61893I78134j1775j3606j4899j6543j8631k0158k0189j8965j7614j7032j7202
61882G91520j7482j7388j7067j6950j7088j7005j6266j4964j3599j2684j2372
61871F18655j2142j0975q351n188l106k526k128o01J801M040N891P941J0447J3108
61857F16866J5752J8341K0478K1860K3218K5769K9605L3477L6411L8631M0541
61846I20949M1772M1755M0555L8508L5606L1872K7741K3411J8324J2061N469K4
61834A238047l831o982j0270j3381j5102j4337j0885n802q92K665N246P875J0531
61821A182882J2101J1976J0820R248O631J977m350j0698j5925k0406k5077k9943
$$ plain form
61905 885588 898929 915079 932107 948251 962872 975816 986256 992853 994939 992855 987149 978134
61893 978134 966359 952753 937854 921311 902680 882522 862333 843368 825754 808722 791520
61882 791520 774038 756650 739583 722633 705545 688540 672274 657310 643711 631027 618655
61871 618655 606513 595538 587187 581999 578893 576367 574239 573638 575439 579479 585370 593311 603758 616866
61857 616866 632618 650959 671437 693297 716515 742284 771889 805366 841777 880408 920949
61846 920949 962721 1004476 1045031 1083539 1119145 1151017 1178758 1202169 1220493 1232554 1238023 1238047
61834 1238047 1234216 1227234 1216964 1203583 1188481 1174144 1163259 1157457 1156565 1159230 1164476 1172351 1182882
61821 1182882 1194983 1206959 1217779 1227027 1233658 1235635 1231285 1220587 1204662 1184256 1159179 1129236
61809A129236l4039l6581l7798l8473l8983l8958l7841l5547l2527k9388k6607
61798G42494k4479k2996k1799k0462j8874j7171j5348j3286j1191r630q926q786
61786E49546q711q554q379q048p277o018m560l324k704k839l333l410k720j771
61772D77898j247j125q79l76M9K83O32J230J882K505L221L843L959L794M228N562
61756E05459O867P146O633O248O174N768M670L250J959R58M27N79J160J455J057
61741E59810K70l36n68o15p28r67j085o93K21J097J434J449J651K027K257K521
61725E67745L302M304M548L742K747K295K109J805J773K333K715J967M39o28q97
61710F00299j255k340l661m496m848n109n357n476n574n896o411o753o472n306
$$ plain form
61809 1129236 1095197 1058616 1020818 982345 943362 904404 866563 831016 798489 769101 742494
61798 742494 718015 695019 673220 652758 633884 616713 601365 588079 576888 567258 558332 549546
61786 549546 540835 532281 523902 515854 508577 502559 497999 494675 491971 489132 485799 482389 479669 477898
61772 477898 476651 475526 474647 474271 474320 474603 475235 476465 478347 480852 484073 487916 491875 495669 499897 505459
61756 505459 512326 519472 526105 532353 538527 544295 548965 552215 554174 555132 555559 556138 557298 558753 559810
61741 559810 560080 559744 559176 558561 557833 556866 555781 555088 555309 556406 557840 559289 560940 562967 565224 567745
61725 567745 571047 575351 579899 583641 586388 588683 590792 592597 594370 596703 599418 601385 601824 601196 600299
61710 600299 599044 596704 593043 588547 583699 578590 573233 567757 562183 556287 549876 543123 536651 531345
61696E31345l550k101j746k246k549k125j628j897k784l445l535l416l334l000
61682D93989k244j556j543k053k314j869j102p31r65j345j269o09J85M86P6n85
61666D76551p65k40M87Q32Q80J147J803K462K788K837K735K481K308K771M027
61651E03104N358N843N429M873M734M878M963M975N121N458N772N705N063M088
61637E75364L320K934K421J228m35j856k739l344l805l940l837l973m465m764
61623E52109m448l852l469l189k664k110k068k464k604k195j803k086k960l852
61609E12345m489n065n753o367o644o621o588o706o808o639o214n848n816o060
61595D26727o187n795m888l955l548l638l631l102k387k084k232k343k191k008
$$ plain form
61696 531345 527795 525694 523948 521702 519153 517028 515400 513503 510719 507274 503739 500323 496989 493989
61682 493989 491745 490189 488646 486593 484279 482410 481308 480577 479612 478267 476998 476389 476574 477060 477136 476551
61666 476551 475786 475546 476033 476865 477745 478892 480695 483157 485945 488782 491517 493998 496306 499077 503104
61651 503104 508462 514305 519734 524607 529341 534219 539182 544157 549278 554736 560508 566213 571276 575364
61637 575364 578684 581618 584039 585267 584832 582976 580237 576893 573088 569148 565311 561338 556873 552109
61623 552109 547661 543809 540340 537151 534487 532377 530309 527845 525241 523046 521243 519157 516197 512345
61609 512345 507856 502791 497038 490671 484027 477406 470818 464112 457304 450665 444451 438603 432787 426727
61595 426727 420540 414745 409857 405902 402354 398716 395085 391983 389596 387512 385280 382937 380746 378738
61581C78738j896j597j105r52j522k396k819k584k081j749j868k549l450l722
61567C48448k828j365n28p75j510k005k039j624q09OK26j39l04K21Q98R38L86
61550C37197j15k97l96m66k65J85M64L54J49K70Q32J640K318K418J804J053J116
61533C48261K269L672M166L404K005Q07J77LK8Q3O3j86p82j538j998j897j550
61516C56987j515j938k460k714k686k585k577k666k620k040q28M41J002P64L04
61501C34869M4j82n38q18q04o19m51l67n87j352k246k298j287l36m93j214j151
61484C20170m4J056J323R83N75K82J43K55M62M29J97J04J20j07m40k62N25J165
61466C26936J062N10Q7n6L9M27Q91Q37R8o33p22m20l32m89n32m42m82o41o29k82
$$ plain form
61581 378738 376842 375245 374140 373188 371666 369270 366451 363867 361786 360037 358169 355620 352170 348448
61567 348448 345620 344255 343727 342952 341442 339437 337398 335774 334965 334971 335197 335058 334754 334975 335873 336811 337197
61550 337197 337082 336785 336389 335923 335658 335843 336307 336661 336810 337080 337912 339552 341870 344288 346092 347145 348261
61533 348261 350530 354202 358368 361772 363777 364584 364761 364764 364792 364875 364938 364752 363970 362432 360434 358537 356987
61516 356987 355472 353534 351074 348360 345674 343089 340512 337846 335226 333186 332358 332799 333801 334565 334869
61501 334869 334913 334731 334193 333375 332571 331952 331501 331134 330547 329195 326949 324651 323364 323028 322535 321321 320170
61484 320170 320126 321182 322505 323488 324063 324345 324488 324743 325205 325634 325831 325935 326055 325948 325508 325246 325771 326936
61466 326936 327998 328508 328595 328539 328578 329005 329896 330733 330831 330198 329476 329056 328724 328235 327703 327261 326779 326138 325509 325227
61446C25227M07J295J883J577N61q7L21J250J901K435L369M385M706M330L893
61431C57453L524K905K263K247K758K930K442J831J378P90K06M18J546K497K424
61416C87612J865J762K064K119J811J416Q09k47j295j588j209j017j482k179k510
61401C87931k411k171k038k104k274k256j840j208p61o68p83q93q14m00K36O37
61385C68183N28K92N12J084J288Q01J90J75P69J369J462J030M42J74M65J060J431
61368C81255J425J471J935K439K253J320M77M24R21J256J290J508K182L011L713
61353D06880M493N584O696P313P425P573Q215R286J0374J1062J1153J0812J0454
61340E17320J0344J0357J0197R697Q702O981M651K402Q47k36j452k759l538l713
$$ plain form
61446 325227 325634 326929 328812 330389 330950 330863 331184 332434 334335 336770 340139 344524 349230 353560 357453
61431 357453 360977 363882 366145 368392 371150 374080 376522 378353 379731 380521 380727 381145 382691 385188 387612
61416 387612 389477 391239 393303 395422 397233 398649 399458 399211 397916 396328 395119 394102 392620 390441 387931
61401 387931 385520 383349 381311 379207 376933 374677 372837 371629 370868 370200 369417 368524 367710 367310 367546 368183
61385 368183 368711 369003 369515 370599 371887 372688 372878 373053 373822 375191 376653 377683 378125 378299 378764 379824 381255
61368 381255 382680 384151 386086 388525 390778 392098 392575 392999 393920 395176 396466 397974 400156 403167 406880
61353 406880 411373 416957 423653 430966 438391 445964 454179 463465 473839 484901 496054 506866 517320
61340 517320 527664 538021 548218 557915 566617 573598 578249 580651 581498 581262 579810 577051 573513 569800
61326E69800m023m935n940o310o050n623n172m563l899l517l536l740l791l384
61312E05317k422j292o85q20j058o00O54K226L761N175O367P217P751P954P544
61297E47089O382M962L943L242K079P3k226m028n142n870o378o510o053n009l685
61282E22869k579k041j878j460l91J011K073K563L011M075N742P266P956P874
61268E56091P673P849Q354Q910R333R541R514R475R853J0851J2161J3358J4382
61255F87345J5382J6245J6584J6177J5081J3366J1024Q174N129K178n53l030n272
61242G97830p378r331j0815j1463j1308j0718r932q922p800o939o473o024n241
61229F85486m372l943m024m207m241m183l918l050j578k62J87n7k85l70q84k054
$$ plain form
61326 569800 565777 560842 554902 548592 542542 536919 531747 527184 523285 519768 516232 512492 508701 505317
61312 505317 502895 501603 500918 500098 499040 498440 499094 501320 505081 510256 516623 523840 531591 539545 547089
61297 547089 553471 558433 562376 565618 567697 567770 565544 561516 556374 550504 544126 537616 531563 526554 522869
61282 522869 520290 518249 516371 514911 514520 515531 517604 520167 523178 527253 532995 540261 548217 556091
61268 556091 563764 571613 579967 588877 598210 607751 617265 626740 636593 647444 659605 672963 687345
61255 687345 702727 718972 735556 751733 766814 780180 791204 799378 804507 806685 806132 803102 797830
61242 797830 790452 781121 770306 758843 747535 736817 726885 717963 710163 703224 696751 690727 685486
61229 685486 681114 677171 673147 668940 664699 660516 656598 653548 651970 651708 651895 651838 651553 651183 650299 648245
61213F48245l202l514k997k329k034k108k284k279j897j187n04j54j29k57l70
61198F23000j13J091L396O084Q199R583J0868J2566J4595J6616J8257J9077J8846
61185G62065J7967J7095J6322J5230J3736J2252J0893R294P451O062N619N703
61173H99689N512M620K925M77k140l900m402m501n286o858q611j0270j1859j3021
61159H42375j3229j2651j2102j2034j2165j2051j1503j0407q732o892n585n024
61147G20000m614l608j873O1J523K147J956J124k72k091l883n182o143p382q904
61132F82859r751r150p578o034m633k737k92J848L070L808M894O604Q560J0298
61118F81766J1705J3070J4734J6555J7866J8288J8361J8934K0045K0916K0990
$$ plain form
61213 648245 645043 641529 638532 636203 634169 632061 629777 627498 625601 624414 623910 623756 623627 623370 623000
61198 623000 622887 623978 627374 633458 641657 651240 662108 674674 689269 705885 724142 743219 762065
61185 762065 780032 797127 813449 828679 842415 854667 865560 874854 882305 888367 893986 899689
61173 899689 905201 909821 912746 913223 911083 907183 902781 898280 892994 886136 877525 867255 855396 842375
61159 842375 829146 816495 804393 792359 780194 768143 756640 746233 737501 730609 725024 720000
61147 720000 715386 711778 709905 709966 711489 713636 715592 716716 716444 714353 710470 705288 699145 691763 682859
61132 682859 673108 663958 656380 650346 645713 642976 642684 644532 647602 651410 656304 662908 671468 681766
61118 681766 693471 706541 721275 737830 755696 773984 792345 811279 831324 852240 873230
61107H73230K0447J9626J8583J7366J6269J5493J4806J3713J1849R204O164L307
61095A040057Q53j571m370p347j0020j2392j4782j7004j8405j8806j8784j8864
61083H98565j8945j8809j8541j8137j7235j5710j4168j3305j2990j2452j1249
61072G27024r652q082o569m922l158j606o11k40k58l27j70L52J186K155L146M212
61056G02480N277N939N920N705O225P765R669J1301J2694J3983J4923J5448J6139
61043H33468J7454J9017K0357K1802K3778K5746K6807K7083K7510K8413K9310
61032A100745L0004L0805L1632L1979L1945L2273L3219L4340L5578L7564M0507
61021A470591M3729M6680M9518N2314N4635N6411N8442O1544O5828P1190P7708
$$ plain form
61107 873230 893677 913303 931886 949252 965521 981014 995820 1009533 1021382 1030586 1036750 1040057
61095 1040057 1040910 1039339 1034969 1027622 1017602 1005210 990428 973424 955019 936213 917429 898565
61083 898565 879620 860811 842270 824133 806898 791188 777020 763715 750725 738273 727024
61072 727024 717372 709290 702721 697799 694641 693035 692424 692184 691926 691599 691429 691781 692967 695122 698268 702480
61056 702480 707757 713696 719616 725321 731546 739311 748980 760281 772975 786958 801881 817329 833468
61043 833468 850922 869939 890296 912098 935876 961622 988429 1015512 1043022 1071435 1100745
61032 1100745 1130749 1161554 1193186 1225165 1257110 1289383 1322602 1356942 1392520 1430084 1470591
61021 1470591 1514320 1561000 1610518 1662832 1717467 1773878 1832320 1893864 1959692 2030882 2108590
61010B108590Q5249R3515J02838J14033J27078J41035J55899J73555J96214K24886
61000C522892K60123L03316L56439M21741N02993O06406P39367R09073J123207
60991H745557J388755J703119K039623K339978K527736K544287K387982K123669
60983B5800706J844836J612254J422468J234967J025297Q03767N84155L50804
60975C4679254P3107k48986n70616q45030j076589j318774j614611j943317k228896
60966B4905542k397669k424978k334278k165876j953388j721282j489840j274745
60958I143486j084061r19223p78824o60596n61508m78496m09489l52977l06833
60949C591479k68418k35734k07891j84405j64546j47337j32051j18636j07677
$$ plain form
61010 2108590 2193839 2287354 2390192 2504225 2631303 2772338 2928237 3101792 3298006 3522892
61000 3522892 3783015 4086331 4442770 4864511 5367504 5973910 6713277 7622350 8745557
60991 8745557 10134312 11837431 13877054 16217032 18744768 21289055 23677037 25800706
60983 25800706 27645542 29257796 30680264 31915231 32940528 33744295 34328450 34679254
60975 34679254 34752361 34503375 33932759 33087729 32011140 30692366 29077755 27134438 24905542
60966 24905542 22507873 20082895 17748617 15582741 13629353 11908071 10418231 9143486
60958 9143486 8059425 7140202 6361378 5700782 5139274 4660778 4251289 3898312 3591479
60949 3591479 3323061 3087327 2879436 2695031 2530485 2383148 2251097 2132461 2024784
60940B024784r9554r3517q8015q2185p6710p2783p0487o8604o5891o2189n8230
60929A186619n4670n1460m8088m4246m0088l5970l2098k8571k5546k3187k1586
60918G81109k0722k0229j9236j6941j3638j0700r115q457p692o517n241l856k086
60905F36679k75O66L19p66j744k141j988j764k126l183m240m753n142n938o558
60890E97046o059m888m617n791p284q060q377q702q669p999p417p711q477q778
60876D94217q515q265q155p822p241o698o136n221m045l075k443j884j382j165
60862D22170j010k00J547L521M713M894M748N108O119P198P656P377O751O106
60848D86698N424M632L875L366L217L493M112M525L919K043l32k057k579k240
$$ plain form
60940 2024784 1925230 1831713 1743698 1661513 1584803 1512020 1441533 1372929 1307038 1244849 1186619
60929 1186619 1131949 1080489 1032401 988155 948067 912097 879999 851428 825882 802695 781109
60918 781109 760387 740158 720922 703981 690343 679643 670528 662071 654379 647862 642621 638765 636679
60905 636679 636404 637070 637389 636623 634879 632738 630750 628986 626860 623677 619437 614684 609542 603604 597046
60890 597046 590987 586099 581482 575691 568407 560347 551970 543268 534599 526600 519183 511472 502995 494217
60876 494217 485702 477437 469282 461460 454219 447521 441385 436164 432119 429044 426601 424717 423335 422170
60862 422170 421160 420960 422507 426028 430741 435635 440383 445491 451610 458808 466464 473841 480592 486698
60848 486698 492122 496754 500629 503995 507212 510705 514817 519342 523261 525304 524972 522915 520336 518096
60834E18096j829j996k821l783m316m487m742n011m660l598k812l187m235m630
60820D65989l909l000l034m070n225n782n915o233o763o765n790m506l945m117
60806C96935m174l852l744l988l784k756j769j564j452m57R69J584J252R64J122
60791C75286J160Q66Q65J462K080K294K452K864L159L054L037L639M577N197N323
60776D17315N157M726M065L589L627L772L367K589K432L425M855N554N235M675
60762D74383M636M885M569L449K369K207K738L017K671K202J947J534O60j75l22
60747E10770J1P3k97m75n3N76Q04N59J56l33j075j975k525k360j710j028k80R71
60729E01809K748M290M937N078N769P435R377J0699J1266J1610J2235J3288J4652
$$ plain form
60834 518096 516267 514271 511450 507667 503351 498864 494122 489111 484451 480853 478041 474854 470619 465989
60820 465989 462080 459080 456046 451976 446751 440969 435054 428821 422058 415293 409503 404997 401052 396935
60806 396935 392761 388909 385165 381177 377393 374637 372868 371304 369852 369395 370364 371948 373200 374164 375286
60791 375286 376446 377312 378177 379639 381719 384013 386465 389329 392488 395542 398579 402218 406795 411992 417315
60776 417315 422472 427198 431263 434852 438479 442251 445618 448207 450639 454064 458919 464473 469708 474383
60762 474383 479019 483904 488473 491922 494291 496498 499236 502253 504924 507126 509073 510607 511267 511092 510770
60747 510770 510781 510854 510557 510082 510029 510605 511409 511968 512124 511791 510716 508741 506216 503856 502146 501118 500838 501809
60729 501809 504557 508847 513784 518862 524631 532066 541443 552142 563408 575018 587253 600541 615193
60716F15193J6027J7082J7728J8170J8522J8600J8193J7379J6347J5077J3454
60705H01772J1475R170O516L679J061j230l685o776j0110j2747j4296j5300j6447
60692G53082j7857j9234k0232k0525j9898j8549j7043j5770j4671j3626j2777
60681E62900j2152j1398j0288r135q370p852p145o309n846n890n967n644m936
60668D61968m038l147k660k963l739m042l471k756k729l182l378l267l343l472
60654D15781k827j199N26J474J746J793J589R92M61O12J315J936K305K725L061
60639D32290K742J805J191J516K156K168J608J245J240R86L10k6N60J487J687
60624D52965R51ro82j263j966k471k437k142k157k509k666k304j767j614k013
$$ plain form
60716 615193 631220 648302 666030 684200 702722 721322 739515 756894 773241 788318 801772
60705 801772 813247 822417 828933 832612 833673 832443 828758 821982 811872 799125 784829 769529 753082
60692 753082 735225 715991 695759 675234 655336 636787 619744 603974 589303 575677 562900
60681 562900 550748 539350 529062 519927 511557 503705 496560 490251 484405 478515 472548 466904 461968
60668 461968 457930 454783 452123 449160 445421 441379 437908 435152 432423 429241 425863 422596 419253 415781
60654 415781 412954 411755 412281 413755 415501 417294 418883 419875 420336 420948 422263 424199 426504 429229 432290
60639 432290 435032 436837 438028 439544 441700 443868 445476 446721 447961 448947 449257 449231 449791 451278 452965
60624 452965 453916 453907 453225 451962 449996 447525 445088 442946 440789 438280 435614 433310 431543 429929 427916
60609D27916k620k883k388j189Q1O17J72p16j349j521j448j296j086r03q96j011
60593D09480j024q87p95q15o60m3Q72J568J721J476J181J012R26Q93J003J297
60577D17205J688K109K636L325M010M530N113O239P948R657J0925J2182J4225
60564E01792J6979J9349K0508K0899K1510K2374K2329K0375J6821J2888R432O310
60552G11566K946q10m413p118q601r058q734p475n031j691J740M823Q042J2096
60538F88282J6821K1321K5058K8323L1405L3796L4580L3298L0123K5430J9635
60527I88072J3327P119J367l806q234j1750j4329j5975j6533j5973j4755j3523
60515H95007j2431j1156r543p884o517n482m646l814k655r10J308L797O823J0798
$$ plain form
60609 427916 425296 422413 420025 418836 418917 419534 419706 418990 417641 416120 414672 413376 412290 411387 410491 409480
60593 409480 408456 407569 406774 405959 405299 405256 406128 407696 409417 410893 412074 413086 414012 414905 415908 417205
60577 417205 418893 421002 423638 426963 430973 435503 440616 446855 454803 464460 475385 487567 501792
60564 501792 518771 538120 558628 579527 601037 623411 645740 666115 682936 695824 705256 711566
60552 711566 714512 713702 709289 702171 693570 684512 675778 668303 663272 661581 663321 668144 676186 688282
60538 688282 705103 726424 751482 779805 811210 845006 879586 912884 943007 968437 988072
60527 988072 1001399 1008518 1009885 1006079 997845 986095 971766 955791 939258 923285 908530 895007
60515 895007 882576 871420 861877 853993 847476 841994 837348 833534 830879 829969 831277 835074 841897 852695
60501H52695J5322J9325K2582K6439L2403M0421M9214N7907O6555P5190Q3194
60490A341247Q9697R4056R5873R5102R2183Q7483Q0503P0181N6231L9673K1834
60479B164063L362j5454l3986n1363o6927q0151r0443r7488j01517j02821j01295
60468A425980r7028r1031q4635p8223p1291o3813n6743n0788m5460l9897l4250
60457G12821k9543k6323k4032k1745j9074j6316j4050j2653j1968j1397j0433
60446E15287r108p699o227m656l406l061l490l779l273k252j307n87o5o0q32j925
60430D63560k518k410k143k140k279k321k310k361k494k777l282l789l868l373
60416D25495k592j765q85r1K51R7q6nm3n71j159j042k15N63Q11Q48J073J295J040
$$ plain form
60501 852695 868017 887342 909924 936363 968766 1009187 1058401 1116308 1182863 1258053 1341247
60490 1341247 1430944 1525000 1620873 1715975 1808158 1895641 1976144 2046325 2102556 2142229 2164063
60479 2164063 2167425 2151971 2117985 2066622 1999695 1919544 1829101 1731613 1630096 1527275 1425980
60468 1425980 1328952 1237921 1153286 1075063 1003772 939959 883216 832428 786968 747071 712821
60457 712821 683278 656955 632923 611178 592104 575788 561738 549085 537117 525720 515287
60446 515287 506179 498480 492253 487597 484191 481130 477640 473861 470588 468336 467029 466442 466377 466317 465485 463560
60430 463560 461042 458632 456489 454349 452070 449749 447439 445078 442584 439807 436525 432736 428868 425495
60416 425495 422903 421138 420253 420162 420413 420510 420424 420419 420376 419805 418646 417604 417389 417952 418763 419611 420684 421979 423019
60397D23019K98m04n76k21K60M92M79N11P22Q43N46J7p7O72J831K469K105J136
60379D34122L48P7K2k06n59o40j66P69J768K310K011J015Q0j2P46J589J845J535
60361D46654J084O95K97j23l90l27J17Q42J557J816J325K47q78j539j556j056
60345D48765k16Q64K034K872K886K135J384J341J851K216K174K056J984J625R23
60330D74894M08M26N95M49J35n7l14q43j178p23K74J044J487K158L111L627L354
60313D88847K900K921L310L740M474N925P784R329J0534J2307J5418J9573K3688
60300F10750K6880K8954L0046L0008K8335K4659J9224J2812O269J09n609j1181
60288H01256j6825k2102k5894k7285k6453k4385k1828j8946j5937j3440j2016
$$ plain form
60397 423019 423317 422913 422337 422116 422376 422868 423347 423858 424580 425423 425969 425986 425909 426581 428412 430881 432986 434122
60379 434122 434470 434547 434569 434363 433804 433164 432998 433767 435535 437845 439856 440871 440951 440939 441685 443274 445119 446654
60361 446654 447738 448433 448730 448607 448217 447890 448007 448849 450406 452222 453547 453794 452916 451377 449821 448765
60345 448765 448549 449413 451447 454319 457205 459340 460724 462065 463916 466132 468306 470362 472346 473971 474894
60330 474894 475302 475728 476323 476772 476907 476850 476536 475693 474515 473792 474066 475110 476597 478755 481866 485493 488847
60313 488847 491747 494668 497978 501718 506192 512117 519901 529230 539764 552071 567489 587062 610750
60300 610750 637630 666584 696630 726638 754973 779632 798856 811668 817937 818046 812437 801256
60288 801256 784431 762329 736435 709150 682697 658312 636484 617538 601601 588161 576145
60277E76145j1561j1463j1153j0370r203q056p306o775n872m443l146k635k659
60264D81503k448j716q61k67K8qn03j274j750j584j046o13l98k60j47j05j17k32
60246D68202o65j356j699j096J46J013R30K78l35p76j084r50r6J109J991K373
60230D67985K575K660K360J784J569J975K460K497K388K721L377L666L310K754
60216E04081K493K531K647K742K789K757K738K932L318L564L448L192L152L250
60202E45634L050K389J728J634K078K418K109J225K94k40l02j77l38j034j903
60187E58565k293k135k143k746l296k950k013j584j940k271k069j785j752j438
60173E28150n08K61m8j113j841j840j531j135m31N19J212J373J192R13O96Q32
$$ plain form
60277 576145 564584 553121 541968 531598 522395 514339 507033 500258 494386 489943 486797 484162 481503
60264 481503 479055 477339 476478 476211 476239 476231 475728 474454 472704 471120 470074 469461 469063 468803 468656 468551 468434 468202
60246 468202 467537 466181 464482 463386 463532 464545 465475 465753 465418 464642 463558 462608 462512 463621 465612 467985
60230 467985 470560 473220 475580 477364 478933 480908 483368 485865 488253 490974 494351 498017 501327 504081
60216 504081 506574 509105 511752 514494 517283 520040 522778 525710 529028 532592 536040 539232 542384 545634
60202 545634 548684 551073 552801 554435 556513 558931 561040 562265 562559 562319 562017 561840 561502 560468 558565
60187 558565 556272 554137 551994 549248 545952 543002 540989 539405 537465 535194 533125 531340 529588 528150
60173 528150 527642 527903 527855 526742 524901 523061 521530 520395 519964 520483 521695 523068 524260 525173 525869 526701
60157E26701J562K646L547L999M056L810L525L707M490N213N248M885M693M389
60143E82471L308J791R41J018J223J227J695K927M079M385M206M206M315M168
60129F21960L872L600K979J685J76q48j323j594j705j532j305j312j364j076m57
60114F21756K52J064K013K750K901K630K392K392K669L380M431N156M964M133
60100F62883L329K610J526Q7j100j695j977k252k477k575k665k749k551j857q36
60085F47701Q7N47M88K38K20M61M96np91j367j570j544j463j574k195l283m336
60068F32110n081n870o933p658p338o265n315m689l934l147l162m327n841o671
60054E55879o554n855m954m118l488k982k436j993j905j953j594p74l0L95R52
$$ plain form
60157 526701 528263 530909 534456 538455 542511 546321 549846 553553 558043 563256 568504 573389 578082 582471
60143 582471 585779 587570 588511 589529 590752 591979 593674 596601 600680 605065 609271 613477 617792 621960
60129 621960 625832 629432 632411 634096 634272 633424 632101 630507 628802 627270 625965 624653 623289 622213 621756
60114 621756 622008 623072 625085 627835 630736 633366 635758 638150 640819 644199 648630 653786 658750 662883
60100 662883 666212 668822 670348 670435 669335 667640 665663 663411 660934 658359 655694 652945 650394 648537 647701
60085 647701 647788 648335 648823 649061 649281 649742 650238 650233 649442 648075 646505 644961 643498 641924 639729 636446 632110
60068 632110 627029 621159 614226 606568 599230 592965 587650 582961 579027 575880 572718 568391 562550 555879
60054 555879 549325 543470 538516 534398 530910 527928 525492 523499 521594 519641 518047 517273 517243 517638 518590
60039E18590J959K984L388L117K548J917J292P58K70l75j178j837k263k759l420
60024E24991l821l737l691m272n215n817n915n835n528m568l010j621j060j295
60010D69606j850k139j596j34J380J766R76L02P31J712K137K039K474L860N379
59995D86643O113O055N631M940M010L324L404L935M023L383K733K761L117K915
59981E42987J957R66N30L05m15j640k622k832k630k648k882k791k159j489j344
59966E23293j659j893j655r61j01N74Q64R20J082J417J655J729K019K727L332
59951E33343L168K292J275L89m13q20l23Q28J603J363M85m83j539k681l330l003
59935E32154k143j652j765k046k245k593l204l718l657k867j623n25j12k92l44
$$ plain form
60039 518590 520549 523533 526921 530038 532586 534503 535795 536553 536823 536448 535270 533433 531170 528411 524991
60024 524991 521170 517433 513742 509470 504255 498438 492523 486688 481160 476592 473582 471961 470901 469606
60010 469606 467756 465617 464021 463887 465267 467033 468009 468311 469042 470754 472891 474930 477404 481264 486643
59995 486643 492756 498811 504442 509382 513392 516716 520120 524055 528078 531461 534194 536955 540072 542987
59981 542987 544944 545910 546440 546745 546330 544690 542068 539236 536606 533958 531076 528285 526126 524637 523293
59966 523293 521634 519741 518086 517125 517024 517598 518462 519382 520464 521881 523536 525265 527284 530011 533343
59951 533343 536511 538803 540078 540467 540054 539234 538911 539739 541342 542705 543190 542707 541168 538487 535157 532154
59935 532154 530011 528359 526594 524548 522303 519710 516506 512788 509131 506264 504641 504116 504004 503712 503368
59920E03368K81J316K165K682L056L205K964K686K952L591L723K994K168K093
59906E39244K540K610K020J438J516J996K061J371N38M30J266K505L527M107M260
59891E71429M021L582L274L168K942K425J944J878K104K267K297K248J887J031
59877F06497J33q3M27R72J058Q12M37j63j019j845k431k928l407l549l101k442
59861E89368k238k606k961k748k094j564j405j243o12L47J043J160R51P90Q38
59846E77026J316K491M061N059M965M630N379P357R395J0427J0376R722Q896Q205
59832F69305P736P063N649L707K105J235N12p81k666m737o698q295r311j0053
59818F54771j1368j3520j5478j5897j4639j2800j1314j0206r181q286p696p225
$$ plain form
59920 503368 503649 504965 507130 509812 512868 516073 519037 521723 524675 528266 531989 534983 537151 539244
59906 539244 541784 544394 546414 547852 549368 551364 553425 554796 555334 555764 557030 559535 563062 567169 571429
59891 571429 575450 579032 582306 585474 588416 590841 592785 594663 596767 599034 601331 603579 605466 606497
59877 606497 606630 606547 606974 607946 609004 609816 610253 610090 609071 607226 604795 601867 598460 594911 591810 589368
59861 589368 587130 584524 581563 578815 576721 575157 573752 572509 571897 572244 573287 574447 575398 576188 577026
59846 577026 578342 580833 584894 589953 594918 599548 604927 612284 621679 632106 642482 652204 661100 669305
59832 669305 677041 684104 689753 693460 695565 696800 697312 696531 693865 689128 682430 674135 664824 654771
59818 654771 643403 629883 614405 598508 583869 571069 559755 549549 540368 532082 524386 517161
59806E17161o483n451m562m145l942l443k617k041k068k250j913j143o86q52j122
59791D74443r62n45l37l90m53n43r40j746k721l465l602k967j976j566k293l458
59775D46479l646k368q05m85j404k017j216K66R27N33K44P56J263Q18j22k92O63
59758D39594K013L179M238N182N588N343M896M554M100L421K903K851K999K997
59744D93858K856K652K221J518Q45L92j9m54o41n46o29j073j330j007o66j046
59728D96931j865k194j792j239q62l81K80N74R5p37j110p23lM35L90K38M86J167
59710D89690J822K147K434L141M185N000N175M772M112L601L582M133M990N904
59696E44688O837P625P737O794N213L814K933K265J530P67M1o78j228j324j047
$$ plain form
59806 517161 510678 505227 500665 496520 492578 489135 486518 484477 482409 480159 478246 477103 476417 475565 474443
59791 474443 473481 472936 472599 472209 471756 471213 470273 468527 465806 462341 458739 455772 453796 452230 449937 446479
59775 446479 442833 440465 439660 439175 437771 435754 434538 434804 435731 436264 436508 437264 438527 439345 439223 438931 439594
59758 439594 441607 444786 449024 454206 459794 465137 470033 474587 478687 482108 485011 487862 490861 493858
59744 493858 496714 499366 501587 503105 503950 504342 504323 503869 503228 502682 502053 500980 499650 498643 497977 496931
59728 496931 495066 492872 491080 489841 488979 488598 488878 489452 489547 488810 487700 486977 486974 487409 487799 488037 488523 489690
59710 489690 491512 493659 496093 499234 503419 508419 513594 518366 522478 526079 529661 533794 538784 544688
59696 544688 551525 559150 566887 573681 578894 582708 585641 587906 589436 590203 590244 589566 588338 587014 585967
59681E85967q31q56q16n04k37m52j144j938k556k958l179l258l240l095k732k217
59665E55954j781j591j577j597j548j265n43M32J024Q69N75J130K573L747L673
59650E60075K761K166K196K050J122j10q60j121j503k275l217m163n136n885n919
59635E40181n128l987l004k358k152k459k936k893k088j157q82j297j770j776
59621E06294j296p28o36j273k106k179j287m25n79j461k021j975k072k773l450
59606D82033l195k025q29l12l52l40O1O38R67R10O96N85N84N45L96J69KM9L13
59587D80895M63J62m34p19l85J08J8q91k199l209l436k947k413k499l073l353
59571D56088k999k581k685l017k882k172j334o62j74M5l0j7M97J278J636J347
$$ plain form
59681 585967 585136 584280 583464 582960 582723 582271 581127 579189 576633 573675 570496 567238 563998 560903 558171 555954
59665 555954 554173 552582 551005 549408 547860 546595 546052 546484 547508 548377 548952 550082 552655 556402 560075
59650 560075 562836 565002 567198 569248 570370 570260 569400 568279 566776 564501 561284 557121 551985 546100 540181
59635 540181 535053 531066 528062 525704 523552 521093 518157 515264 513176 512019 511137 509840 508070 506294
59621 506294 504998 504270 503634 502361 500255 498076 496789 496364 495785 494324 492303 490328 488256 485483 482033
59606 482033 478838 476813 475984 475672 475320 474980 475041 475679 476646 477556 478252 478837 479421 479966 480362 480531 480533 480582 480895
59587 480895 481358 481520 481086 480367 479982 480090 480108 479217 477018 473809 470373 467426 465013 462514 459441 456088
59571 456088 453089 450508 447823 444806 441924 439752 438418 437756 437582 437627 437597 437580 438077 439355 440991 442338
59555D42338Q28M79L45M08O68Q91Q18O95J081J925K514K536K685L759N562P241
59539D74773Q431R584J1125J2748J3639J3229J1679R732Q150P185O474N475M001
59526E96225K373J116N18N05Q53J373J824J865J406Q71O92N68k42j767l095l630
59510F01455l975m941o205o753o480o431p349q710r447r085p844o191m619l533
59496E09892k938k422j736j196j268j868k354k213j483n12N16J623K687L323L348
59481E03399L225L721M998O423P394P969Q411Q546P994O816N446M167L103K425
59467E84037K113J633M89r80j933k117j920j386lK331M775O449P376Q143R060
59452F18067J0139J1472J3101J4622J5355J4967J3669J1936J0119Q211N852K710
$$ plain form
59555 442338 443166 443645 443990 444398 445066 445957 446775 447470 448551 450476 452990 455526 458211 461970 467532 474773
59539 474773 483204 492788 503913 516661 530300 543529 555208 564940 573090 580275 586749 592224 596225
59526 596225 598598 599714 600232 600737 601590 602963 604787 606652 608058 608929 609621 610189 609947 608180 605085 601455
59510 601455 597480 592539 586334 579581 573101 566670 559321 550611 541164 532079 524235 518044 513425 509892
59496 509892 506954 504532 502796 501600 500332 498464 496110 493897 492414 491902 492418 494041 496728 500051 503399
59481 503399 506624 510345 515343 521766 529160 537129 545540 554086 562080 568896 574342 578509 581612 584037
59467 584037 586150 587783 588272 587292 585359 583242 581322 579936 579933 582264 587039 593488 600864 609007 618067
59452 618067 628206 639678 652779 667401 682756 697723 711392 723328 733447 741658 747510 750220
59440G50220r76m406o939q595r808j0905j1964j2942j3650j3799j3323j2520j1696
59427F18697j0799r573p911n892l659j454L84J821L364N617Q507J1211J3055J4373
59413F37741J6143J8680K0801K0694J7745J3238R046N812K835n60m065o755p831
59400G43524o873m087p68J116N46j492l163l975n240q265j2672j6818j9444k0504
59386F41885k0601k0142j9098j7258j4624j1691r306p934p067n710l663j913j401
59373E01477j766j816j026L7P50J195J705K195K326J953J184L41K4P30K143L266
59357E14718L606L734M325N251O150P299R095J1061J2279J2708J3283J4632J6423
59344F34564J8012J9068J9411J8947J8016J7262J6840J6132J4476J1880Q858N907
$$ plain form
59440 750220 749244 744838 737899 729304 719496 708591 696627 683685 670035 656236 642913 630393 618697
59427 618697 607898 598325 590414 584522 580863 579409 579793 581614 584978 590595 599102 610313 623368 637741
59413 637741 653884 672564 693365 714059 731804 745042 754088 759900 762735 762175 758110 751355 743524
59400 743524 736651 732564 731796 732912 733458 731966 728803 724828 719588 711323 698651 681833 662389 641885
59386 641885 621284 601142 582044 564786 550162 538471 529165 521231 514164 508454 504791 502878 501477
59373 501477 499711 497895 496869 496906 497656 498851 500556 502751 505077 507030 508214 508555 508579 509309 511452 514718
59357 514718 518324 522058 526383 531634 537784 545083 554178 565239 577518 590226 603509 618141 634564
59344 634564 652576 671644 691055 710002 728018 745280 762120 778252 792728 804608 813466 819373
59332H19373L244P91j672m135o164p383q012q524q896q747q140p680p707p935
59318G38413p976p695o964n670m194l297l284l671l916l993m064m055l876l700
59304F72058l642l513l072k331j431n05K58P17J044J532K209L015M295O488R320
59289F86442J2009J4369J6919J9587K1153K0521J7983J4661J1274P961M807J802
59277H49488j308m456o815p512o604m849k774m96J783L749N332O504O870O074
59263H44986M565L273K391J137j075l818o343q661j1221j3757j5155j4784j3541
59250G67997j3034j3826j4928j5138j4325j3140j1911j0425q603o750n165l922
59238F36830k999k203j096M86J897K346K023J862K079J820N02j244k447k983l355
$$ plain form
59332 819373 822617 823408 821736 817601 811437 804054 796042 787518 778622 769875 761735 754055 746348 738413
59318 738413 730437 722742 715778 710108 705914 702617 699333 695662 691746 687753 683689 679634 675758 672058
59304 672058 668416 664903 661831 659500 658069 657564 657822 658539 659583 661115 663324 666339 670634 677122 686442
59289 686442 698451 712820 729739 749326 770479 791000 808983 823644 834918 842879 847686 849488
59277 849488 848180 843724 836909 829397 822793 817944 815170 814674 816457 820206 825538 832042 838912 844986
59263 844986 849551 852824 855215 856352 855277 851459 845116 836455 825234 811477 796322 781538 767997
59250 767997 754963 741137 726209 711071 696746 683606 671695 661270 652667 645917 640752 636830
59238 636830 633831 631628 630532 631018 632915 635261 637284 639146 641225 643045 643547 642303 639856 636873 633518
59223F33518l857m527n480o728p878q466q386p739o616n401m832n227n968o145
59209E46268n508m410l199k116j436j183r59m49J08L62M40P01J133J536J968K580
59193E35836L232L769M392N248N915N921N636N898O811P562P569P173O969O978
59179F18909O810O324N702N045M224L215K396K287L012M160N255O211P156Q020
59165F88726Q624R078R600J0060J0118R816R469Q908P479N031K345K67j105k130
59151G76286l116m361o121q115r504r874r732r719r762r424q634p597o445n358
59137F68524m621m101l212j796n21R5L96Q84J464K080L276N222O895P354P367
59122F89306Q473J0710J2611J3409J3907J4919J6048J6625J6774J6900J6813J6093
$$ plain form
59223 633518 629661 625134 619654 612926 605048 596582 588196 580457 573841 568440 563608 558381 552413 546268
59209 546268 540760 536350 533151 531035 529599 528416 527457 527008 527116 527478 527918 528619 529752 531288 533256 535836
59193 535836 539068 542837 547229 552477 558392 564313 569949 575847 582658 590220 597789 604962 611931 618909
59179 618909 625719 632043 637745 642790 647014 650229 652625 654912 657924 662084 667339 673550 680706 688726
59165 688726 697350 706428 716028 726088 736206 746022 755491 764399 771878 776909 779254 779521 778416 776286
59151 776286 773170 768809 762688 754573 745069 735195 725463 715744 705982 696558 687924 680327 673882 668524
59137 668524 663903 659802 656590 654794 654273 654368 654764 655648 657112 659192 662468 667690 674585 681939 689306
59122 689306 697779 708489 721100 734509 748416 763335 779383 796008 812782 829682 846495 862588
59110H62588J4932J3919J3206J2424J1307R962Q537O959N124L165J329l64k121
59097I60967l943n407o194o603p111p619p655p311p239p659q125q485r209j0361
59083H58046j1143j1017j0587j0682j1277j1972j2774j3655j4050j3702j3373
59072G23814j3673j3835j2801j1033r971r955r923r070p678o302n175m531m471
59059F05396m491l915k839j911j339r66j088k024l079l073k009j056p92o52k37
59044E75925M7JR8N64R63J140J486J948J831J128R13J753K792L190L518M747O602
59027F08646P999Q653R289J0409J1680J2500J2650J2362J2111J2190J2269J1574
59015G42332R767P372N142L301J671J12j311k350k554j688k68P71J214J793L061
$$ plain form
59110 862588 877520 891439 904645 917069 928376 938338 946875 953834 958958 962123 963452 963088 960967
59097 960967 957024 951617 945423 938820 931709 924090 916435 909124 901885 894226 886101 877616 868407 858046
59083 858046 846903 835886 825299 814617 803340 791368 778594 764939 750889 737187 723814
59072 723814 710141 696306 683505 672472 662501 652546 642623 633553 625875 619573 614398 609867 605396
59059 605396 600905 596990 594151 592240 590901 589935 588847 586823 583744 580671 578662 577606 576814 576162 575925
59044 575925 575972 575973 576071 576635 577598 578738 580224 582172 584003 585131 586044 587797 590589 593779 597297 602044 608646
59027 608646 616645 625298 634587 644996 656676 669176 681826 694188 706299 718489 730758 742332
59015 742332 752099 759471 764613 767914 769585 769697 768386 766036 763482 761794 761526 762297 763511 765304 768365
59000G68365M470N037M536L600K879K494K160J573O28n97k008l577n135o379p306
58985G70740q315r508j0276j0150r674r678r972r624q373o840n404l835k121o34
58971F66336P06K396M290N545N989O567P954R626J0782J1342J1445J0769R042
58958G62789O674M305K134Q2j888l972o423q941j0779j1762j2517j3355j3730
58945F92617j3200j2182j1161j0014q634p472o727n749m047k307j546j772k195
58932F05611k398k574k893l337l869m235l950l007k262k491l407m131m293m082
58918E58682l557k578j307j81N60R98J308J627K023K350K511K914M216O402Q622
58903E84590J0176J1109J1651J1716J1390J1223J1551J2027J2293J2567J3092
$$ plain form
59000 768365 772835 777872 782408 786008 788887 791381 793541 795114 795742 795145 793137 789560 784425 778046 770740
58985 770740 762425 752917 742641 732491 722817 713139 703167 693543 685170 678330 672926 669091 666970 666336
58971 666336 667042 669438 673728 679273 685262 691829 699783 709409 720191 731533 742978 753747 762789
58958 762789 769463 773768 775902 775984 774096 770124 763701 754760 743981 732219 719702 706347 692617
58945 692617 679417 667235 656074 646060 637426 629954 623227 617478 613431 611124 609578 607806 605611
58932 605611 603213 600639 597746 594409 590540 586305 582355 579348 577086 574595 571188 567057 562764 558682
58918 558682 555125 552547 551240 551059 551619 552617 553925 555552 557575 559925 562436 565350 569566 575968 584590
58903 584590 594766 605875 617526 629242 640632 651855 663406 675433 687726 700293 713385
58892G13385J3578J3711J3747J4152J4999J6110J7312J8211J8319J7720J6944
58881H88188J5936J3903J0638P136M306J873q26l782o694r574j2138j3470j3192
58868H82304j2352j2165j2506j2542j2230j2118j2176j1906j1392j1186j1413
58857G50318j1778j2196j2666j2867j2637j2419j2475j2213j1141r904r386r299
58845F11337q799q024p758p862p406o250n305n120n319n461n440m993l818k350
58831E27432j487j435j636j862k463l388l896l512k500j237J21J215J524J100
58817E07976N91L68K00q0j78J56P55J319J697J756J437R42N30K09pJ56P63J284
58799E19874J212Q32O94P15N52M50Q09J181P79j12l72L16J115J519K079L245M446
$$ plain form
58892 713385 726963 740674 754421 768573 783572 799682 816994 835205 853524 871244 888188
58881 888188 904124 918027 928665 935801 940107 941980 941154 937372 930678 921104 908966 895496 882304
58868 882304 869952 857787 845281 832739 820509 808391 796215 784309 772917 761731 750318
58857 750318 738540 726344 713678 700811 688174 675755 663280 651067 639926 630022 620636 611337
58845 611337 602538 594514 586756 578894 571488 565238 559933 554813 549494 544033 538593 533600 529782 527432
58831 527432 525945 524510 522874 521012 518549 515161 511265 507753 505253 504016 504137 505352 506876 507976
58817 507976 508567 508935 509135 509055 508877 509033 509788 511107 512804 514560 515997 516939 517469 517678 517671 517827 518590 519874
58799 519874 521086 521918 522612 523327 523879 524329 525138 526319 527098 526986 526614 526930 528045 529564 531643 534888 539334
58782E39334M925M783M702N032N604O120O314N966M985L510J920P55L10J74m26
58767E94008j603k638l170l811m890n501m720l184k287k239k152j703j345j084
58753E53681l74O36J128J039J317K420L744M758N643O430O648O355O522P758R396
58738F17101J0377J0532J0453J0653J1236J1986J2528J2653J2530J2241J1345
58727G43635R553P497O065N204M326L613L807M741N414N479N536N781N757N602
58713H22010O099P042O968N169K706O95j214l833o976r901j2325j4223j5429j6240
58699G70548j7519j9465k1052k1433k1073k0661j9893j8256j6233j4616j3255
58688E67092j1558r710q391p696p297p206p394p136n839m170l262l046k558j703
$$ plain form
58782 539334 544259 549042 553744 558776 564380 570500 576814 582780 587765 591275 593195 593950 594260 594434 594008
58767 594008 592405 589767 586597 582786 577896 572395 567675 564491 562204 559965 557813 556110 554765 553681
58753 553681 553307 553943 555071 556110 557427 559847 563591 568349 573992 580422 587070 593425 599947 607705 617101
58738 617101 627478 638010 648463 659116 670352 682338 694866 707519 720049 732290 743635
58727 743635 753188 760685 766750 771954 776280 779893 783700 788441 793855 799334 804870 810651 816408 822010
58713 822010 828109 835151 842119 847288 849994 850689 849475 845642 838666 828765 816440 802217 786788 770548
58699 770548 753029 733564 712512 691079 670006 649345 629452 611196 594963 580347 567092
58688 567092 555534 545824 537433 529737 522440 515234 507840 500704 494865 490695 487433 484387 481829 480126
58674D80126j414j907k086j123M11J606K559L961N821P402Q209Q424Q369Q066
58660E28424P460O669N789M674L164J444j28j388k380l079l505l986m787n459
58646E32912n249m341l842m186m415l736k835k649k679j847n18m4n72q44k98K15
58630D95072J28O2N14Q98O67K16k0l50r61j259q25j72L00J196L068N217O484O759
58612E16994O747O724O414N790N160M560L743K644J464M28k09k94j27k55p02r20
58596E58161p49p27j015q98J64J658K821L694M714N870O982Q237R676J0670J0703
58581F19961J0264J0158J0308R992Q976P640O251M911M074M345N694P435Q999
58568G19008J0373J1791J3420J5254J7016J8270J8884J9219J9644K0062K0059
$$ plain form
58674 480126 478712 476805 474719 473596 474007 475613 478172 482133 487954 495356 503565 511989 520358 528424
58660 528424 535884 542553 548342 553016 556180 557624 557496 556108 553728 550649 547144 543158 538371 532912
58646 532912 527663 523322 519480 515294 510879 507143 504308 501659 498980 497133 496615 496571 495999 495155 494857 495072
58630 495072 495200 495262 495776 496674 497341 497557 497537 497187 496226 494967 494142 493970 494270 495466 498534 503751 510235 516994
58612 516994 523741 530465 536879 542669 547829 552389 556132 558776 560240 560668 560459 560165 560038 559783 559081 558161
58596 558161 557412 556685 555670 554772 554936 556594 559415 563109 567823 573693 580675 588912 598588 609258 619961
58581 619961 630225 640383 650691 660683 669659 677299 683550 688461 692535 696880 702574 710009 719008
58568 719008 729381 741172 754592 769846 786862 805132 824016 843235 862879 882941 903000
58557I03000J9271J7492J4773J1564Q405N380K252q55l521n790q168j0626j2445
58544I40732j3367j4106j5294j6579j7325j7542j7572j7518j7468j7727j8243
58533G57991j8328j7473j5979j4385j2763j1025r329p770o202m749l812l272k410
58520F30494j114k73l90o62j91O59R33M92j05n40p56m93L66J341J882K041K124
58503F35808K122J976J869J761J256L77k14k51l68r11j157m86N05R41J017J503
58487F45748K494L545M482N325N958O600P861R593J0584J0273R879J0701J2092
58474G45135J2353J0952Q577N699K488l18k003l161n008p479r211r437q769p996
58460G31822p169o010m411k418l16J327K257K917L679M130L851L354L343L453
$$ plain form
58557 903000 922271 939763 954536 966100 974505 979885 982137 981282 977761 971971 963803 953177 940732
58544 940732 927365 913259 897965 881386 864061 846519 828947 811429 793961 776234 757991
58533 757991 739663 722190 706211 691826 679063 668038 658709 650939 644737 639988 636176 632904 630494
58520 630494 629380 629107 628717 628055 627864 628523 629456 629948 629843 629303 628547 628054 628420 629761 631643 633684 635808
58503 635808 637930 639906 641775 643536 644792 645169 644955 644704 644336 643425 642268 641782 642287 643228 644245 645748
58487 645748 648242 651787 656269 661594 667552 674152 682013 691606 702190 712463 722342 733043 745135
58474 745135 757488 768440 777017 782716 785204 784886 782883 779722 774714 767235 758024 748587 739818 731822
58460 731822 724653 718643 714232 711814 711498 712825 715082 717999 721678 725808 729659 733013 736356 739809
58446G39809K697Q99j203k976m146m456l973l408l248k964j963q34n50p76j30
58431G12778J919M488O464P444P617P581Q073R169R997R881R287Q899Q386P107
58417H19090N445M297L652K765J400j66j877l601m582m395l981m495n538n798
58403H02216n097m398m098l766l332l097k656j244Q22K279K655K619K688K651
58389G88242K379J986J252l6j214j251j77J000J605J627J067J33k47O55K118K894
58373H02033L074L721M914N700N902O408P521Q492Q883R138R578R977J0299J0706
58359I06346J0896J0500J0074J0417J1079J0837R618Q504P831O783N078L652L294
58346A014909L772M622N710O808P612Q335R378J0477J1104J1508J2329J3374J3916
$$ plain form
58446 739809 742506 743405 742202 739226 735080 730624 726651 723243 719995 717031 715068 714234 713684 712908 712778
58431 712778 714697 719185 725649 733093 740710 748291 756364 765533 775530 785411 794698 803597 811983 819090
58417 819090 824535 828832 832484 835249 836649 836483 834606 831005 826423 822028 818047 813552 808014 802216
58403 802216 797119 792721 788623 784857 781525 778428 775772 774528 775350 777629 780284 782903 785591 788242
58389 788242 790621 792607 793859 793823 792609 791358 791181 792181 793786 795413 796480 796613 796366 797021 799139 802033
58373 802033 805107 808828 813742 819442 825344 831752 839273 847765 856648 865786 875364 885341 895640 906346
58359 906346 917242 927742 937816 948233 959312 970149 979767 988271 996102 1002885 1007963 1011615 1014909
58346 1014909 1018681 1023303 1029013 1035821 1043433 1051768 1061146 1071623 1082727 1094235 1106564 1119938 1133854
58333A133854J3975J4121J4305J4092J3740J3732J3623J2683J1329J0451R757
58322A275662Q421O922O536P255P927Q248Q777R260Q899Q154Q409R768J1022J1771
58308A397031J2722J3962J4824J5466J6619J7791J7743J6784J6505J7161J7373
58297A573981J6694J6301J6860J7655J8175J8719J9259J9467J9973K1648K3748
58286A782480K4749K4913K5823K7550K8653K8937K9653L0968L1893L2755L4943
58275B103317L7946L9595L9598M0060M1934M3932M5505M7890N1439N4752N7378
58264B603346O0573O4546O7706O9418P0764P1957P1971P1398P2426P5074P6727
58253C375906P6499P6748P9021Q1902Q4271Q7461R2471R8117J03557J09773J17089
$$ plain form
58333 1133854 1147829 1161950 1176255 1190347 1204087 1217819 1231442 1244125 1255454 1265905 1275662
58322 1275662 1284083 1291005 1297541 1304796 1312723 1320971 1329748 1339008 1347907 1356061 1364470 1374238 1385260 1397031
58308 1397031 1409753 1423715 1438539 1454005 1470624 1488415 1506158 1522942 1539447 1556608 1573981
58297 1573981 1590675 1606976 1623836 1641491 1659666 1678385 1697644 1717111 1737084 1758732 1782480
58286 1782480 1807229 1832142 1857965 1885515 1914168 1943105 1972758 2003726 2035619 2068374 2103317
58275 2103317 2141263 2180858 2220456 2260516 2302450 2346382 2391887 2439777 2491216 2545968 2603346
58264 2603346 2663919 2728465 2796171 2865589 2936353 3008310 3080281 3151679 3224105 3299179 3375906
58253 3375906 3452405 3529153 3608174 3690076 3774347 3861808 3954279 4052396 4155953 4265726 4382815
58242D382815J24105J30453J37716J46379J54901J62861J71825J82085J92067
58233E785207K02014K14411K29619K45058K60040K77142K97378L18459L39459
58224H168787L62634L88923M16507M45696M80102N20824N64796O11239O64101
58215A2623609P25590P93252Q66615R50669J049453J162435J290981J441959J621144
58206B2525707J830182K074950K370295K732248L173354L710959M372067N185618
58198D7975380O182294P412129Q952754J0887079J3272614J6120627J9351637
58191A30154514K2700077K5635783K7429938K7412401K5302597K1390438J6393586
58184B96419334J1032924N629300P7217n759834j1615483j6791925k0558249k2568011
$$ plain form
58242 4382815 4506920 4637373 4775089 4921468 5076369 5239230 5411055 5593140 5785207
58233 5785207 5987221 6201632 6431251 6676309 6936349 7213491 7510869 7829328 8168787
58224 8168787 8531421 8920344 9336851 9782547 10262649 10783473 11348269 11959508 12623609
58215 12623609 13349199 14142451 15009066 15959735 17009188 18171623 19462604 20904563 22525707
58206 22525707 24355889 26430839 28801134 31533382 34706736 38417695 42789762 47975380
58198 47975380 54157674 61569803 70522557 81409636 94682250 110802877 130154514
58191 130154514 152854591 178490374 205920312 233332713 258635310 280025748 296419334
58184 296419334 307452258 313081558 313158775 307398941 295783458 278991533 258433284 235865273
58176B35865273k2937791k2030749k0228728j7851634j5171445j2434167r874246
58169A15336513p715987o130298n155844m665185m441099m321244m288681m424231
58161G4193944m764402n204835n547970n643639n476286n126229m678335m183274
58153C3568974l677551l197969k768022k390575k062161j782774j548779j349557
58145A4791586j177352j031802r11298q08742p19485o45242n86155n36281m90705
58136G884524m50537m17135l87326l57944l29764l03682k77975k52297k29697
58127D878167k11794j96232j81417j69309j61068j54278j47142j41298j37832
58118C377797j34363j28814j22447j16758j10671j03345r6454r1289q6543q1092
$$ plain form
58176 235865273 212927482 190896733 170668005 152816371 137644926 125210759 115336513
58169 115336513 107620526 101490228 96334384 91669199 87228100 82906856 78618175 74193944
58161 74193944 69429542 64224707 58676737 53033098 47556812 42430583 37752248 33568974
58153 33568974 29891423 26693454 23925432 21534857 19472696 17689922 16141143 14791586
58145 14791586 13614234 12582432 11671134 10862392 10142907 9497665 8911510 8375229 7884524
58136 7884524 7433987 7016852 6629526 6271582 5941818 5638136 5360161 5107864 4878167
58127 4878167 4666373 4470141 4288724 4119415 3958347 3804069 3656927 3515629 3377797
58118 3377797 3243434 3114620 2992173 2875415 2764744 2661399 2564945 2473656 2387113 2306021
58108B306021p6114p2417o8702o4334o0853n8774n6082n1916m8620m7897m7835
58097A652477m6152m3642m1905m0291l7635l4770l2804l0857k7915k5055k3652
58086A267799k3036k1925k0580j9685j8815j7794j7820j9417k0981k1140k0876
58075A045730k1516k2390k2246k1467k0948k0291j8931j7643j7164j6694j5458
58064H30982j4387j4426j4552j3275j1076r565r186r349r822j0514j0738j0134
58052F93958r483r397r258q524p920q027q014p141o280o420o821o287n231m847
58038E90308n064m963m570m678n349n882n955n786n616n794o728q057q701q392
58024E04773q122q346q075o693n314n039n248m929m532m855n197m373k827k038
$$ plain form
58108 2306021 2229907 2157490 2088788 2024454 1963601 1904827 1848745 1796829 1748209 1700312 1652477
58097 1652477 1606325 1562683 1520778 1480487 1442852 1408082 1375278 1344421 1316506 1291451 1267799
58086 1267799 1244763 1222838 1202258 1182573 1163758 1145964 1128144 1108727 1087746 1066606 1045730
58075 1045730 1024214 1001824 979578 958111 937163 916872 897941 880298 863134 846440 830982
58064 830982 816595 802169 787617 774342 763266 753701 744515 735166 725344 714830 704092 693958
58052 693958 684475 675078 665820 657296 649376 641349 633335 626194 619914 613494 606673 600386 595155 590308
58038 590308 585244 580281 575711 571033 565684 559802 553847 548061 542445 536651 529923 521866 513165 504773
58024 504773 496651 488305 480230 473537 468223 463184 457936 453007 448475 443620 438423 434050 431223 429185
58010D29185k329k810l083l439l687l173j978r56n86o22o98n74k4Q48J498J681
57994D09253J795K144K422K459K588K853K764K347K355K837K656J283j54n39k80
57979D36783k44l09k12m98j428k027j553r03j147j754j729j446j744k113j611
57964D18065q14j019k072k741k810l006l291l063k744l304m299m312l394l179
57950C78017m220m998m197k523j465j425j806k109k154j768q46N53K271L974N209
57935C62513N949O793Q015Q841Q500P605P480Q342R123Q973Q025O697N261M106
57921D66223L509L065K079N13j124k688m379o001p135q010r254j0740j1568j1313
57907D03177j0541r960r773r827r835r407q522p827p824p991p491o501n841n524
$$ plain form
58010 429185 426856 424046 420963 417524 413837 410664 408686 407730 407144 406522 405824 405250 405226 406074 407572 409253
57994 409253 411048 413192 415614 418073 420661 423514 426278 428625 430980 433817 436473 437756 437602 437063 436783
57979 436783 436539 436230 436018 435520 434092 432065 430512 429609 428462 426708 424979 423533 421789 419676 418065
57964 418065 417251 416232 414160 411419 408609 405603 402312 399249 396505 393201 388902 384590 381196 378017
57950 378017 373797 368799 364602 362079 360614 359189 357383 355274 353120 351352 350506 351059 353330 357304 362513
57935 362513 368462 375255 383270 392111 400611 408216 415696 424038 433161 442134 450159 456856 462117 466223
57921 466223 469732 472797 474876 475389 474265 471577 467198 461197 454062 446052 436798 426058 414490 403177
57907 403177 392636 382676 372903 363076 353241 343834 335312 327485 319661 311670 304179 297678 291837 286313
57893B86313m729l280k028j573j565j492j300r42j38R97J845K127K262K601K936
57878B82034K983K822K540J989J209O01L68J87l36j130j843k263k447k591k773
57863B81350k773k281j454q42n09K74J906L557M168L992M186N107N984O284O428
57848C15377O891P421P493P041O419N976N809N640M979L724K398J395L26j305
57834C79584l093m173m496m785n329n731n846o029o300o114n273m312l634k981
57820C11488k077j169n54j26K49M50N08Q46J620K306K328J827J405J282J128O42
57804C22153m0o23j184k176l718n107n465m889m421m590m689l953k874k587l302
57789B72535m146m384m069l602l327l449l749l512k342q59K1L06P30J622K701
$$ plain form
57893 286313 281584 278304 276276 274703 273138 271646 270346 269404 269266 270263 272108 274235 276497 279098 282034
57878 282034 285017 287839 290379 292368 293577 294178 294546 294733 294397 293267 291424 289161 286714 284123 281350
57863 281350 278577 276296 274842 274000 273491 273765 275671 279228 283396 287388 291574 296681 302665 308949 315377
57848 315377 322268 329689 337182 344223 350642 356618 362427 368067 373046 376770 379168 380563 380889 379584
57834 379584 376491 372318 367822 363037 357708 351977 346131 340102 333802 327688 322415 318103 314469 311488
57820 311488 309411 308242 307688 307562 307811 308261 308769 309615 311235 313541 315869 317696 319101 320383 321511 322153
57804 322153 322113 321490 320306 318130 314412 309305 303840 298951 294530 289940 285251 281298 278424 275837 272535
57789 272535 268389 264005 259936 256334 253007 249558 245809 242297 239955 239096 239117 239423 240153 241775 244476
57774B44476L737M651N058M711M217M422N122N327M784M177L792L088J807M73
57760B99842n88j764l300m759n764o451o851o584n626m713m443m616m772m766
57746B34845m529l859k834j832r55p6M51Q5p39p95P6M73m88j703j660o33q9m40
57728B15298p29k96M04P92R61J191J332J086N64K36M61J114J655J597R82L20k2
57711B26946j18k33m81q17j049q44p4Q71J486J857K464L289L731L507L031K741
57695B46307K709L039L884M742M578L145J464M77r3r16j791k033j632j108m90
57680B62282P20K651M893P279J0287J4502K0038K6569L3814M1932N1357O1753
57668E38077P1018P5886P4132O6086N3908L9814K5162J0477m383j9775l5257m9071
$$ plain form
57774 244476 248213 252864 257922 262633 266850 271272 276394 281721 286505 290682 294474 297562 299369 299842
57760 299842 299254 297490 294190 289431 283667 277216 270365 263781 258155 253442 248999 244383 239611 234845
57746 234845 230316 226457 223623 221791 220836 220760 221211 221296 220557 219762 219838 220311 219823 218120 216460 215827 215738 215298
57728 215298 214569 214273 214677 215469 216430 217621 218953 220039 220603 220839 221300 222414 224069 225666 226648 226968 226946
57711 226946 226828 226595 226114 225297 224248 223404 223330 224201 225687 227544 230008 233297 237028 240535 243566 246307
57695 246307 249016 252055 255939 260681 265259 268404 269868 270345 270252 269336 267545 265512 263880 262772 262282
57680 262282 263002 265653 270546 277825 288112 302614 322652 349221 383035 424967 476324 538077
57668 538077 609095 684981 759113 825199 879107 918921 944083 954560 950177 930402 895145 846074
57656H46074n9033o3915o3920o0295n4829m9126m3757l8310l2642k7590k3937
57645C28720k1214j8261j4667j1037q109o261n616n785n738m715l248k489k614
57632B18966k670k100j499j508j758j441n07K91L04m45j510k465l068l207k870
57617A94513k200j539j187j063p95k87M7j77p56j163j192j030q47o54n11n09n41
57600A80109l61N2L56J47o44j552j898j439p45o01j043j374j211j012j229j579
57584A65976j584j396j509j886j985j579j017p13o94p39o58n73q55j600k142j629
57568A45417k96N22P2p94q93l10P2J00L65R53J241R54M81J41q5n0M65J132J345
57549A50832J231J514K241K539J961J214J094J476J849K157K513K679K418K026
$$ plain form
57656 846074 787041 723126 659206 598911 544082 494956 451199 412889 380247 352657 328720
57645 328720 307506 289245 274578 263541 255432 249171 243555 237770 232032 227317 224069 221580 218966
57632 218966 216296 214196 212697 211189 209431 207990 207483 207774 208078 207633 206123 203658 200590 197383 194513
57617 194513 192313 190774 189587 188524 187729 187442 187489 187312 186556 185393 184201 183171 182324 181670 181159 180650 180109
57600 180109 179748 179800 180156 180303 179659 178107 176209 174770 174025 173424 172381 171007 169796 168784 167555 165976
57584 165976 164392 162996 161487 159601 157616 156037 155020 154307 153613 152874 152216 151643 150788 149188 147046 145417
57568 145417 145121 145643 145715 144921 144028 143718 143790 143890 144255 145208 146449 147403 147884 148025 147940 147890 148355 149487 150832
57549 150832 152063 153577 155818 158357 160318 161532 162626 164102 165951 168108 170621 173300 175718 177744
57535A77744J844J644J011J56k23J84R24J242P45k65r45o27M56J342J395Q58K98
57518A87783j9nM89J340J945J832J284R77J179J612J940J995J741J276Q37M99
57502B06705P4n01r01p96l23J11K46Rn75j175j220n89J11L44M35Q73J229O02q45
57483B03814j718j092L06J069P93K01k6L2k3k33k89O1P31J411J817J805J352N37
57465B10548k90o03j73N60R35Q65Q86J270J536J155M06J41O91J498J859J675J303
57448B24262R34M68j08n31n29j19M93J141J693J879J441N62l2K21J024J509J317
57431B35625R82J101J495J658J684K071K666K635J705P52O15R29P72J21k40l5
57415B54536J79J03K18Q44J416J238M84j45l61k90O2O94J139Q67J48j78J62N86
$$ plain form
57535 177744 179588 181232 182243 182399 182176 182360 183284 184526 185271 185006 184061 183434 183890 185232 186627 187485 187783
57518 187783 187764 187759 188248 189588 191533 193365 194649 195626 196805 198417 200357 202352 204093 205369 206206 206705
57502 206705 206779 206278 205377 204581 204258 204369 204615 204624 204049 202874 201654 201065 201176 201520 201955 202828 204057 204659 203814
57483 203814 202096 201004 201310 202379 203172 203373 203347 203379 203356 203123 202834 202895 203626 205037 206854 208659 210011 210548
57465 210548 210258 209655 209482 210042 210977 211842 212728 213998 215534 216689 217095 217236 217927 219425 221284 222959 224262
57448 224262 225196 225664 225556 225025 224496 224377 224870 226011 227704 229583 231024 231586 231554 231775 232799 234308 235625
57431 235625 236607 237708 239203 240861 242545 244616 247282 249917 251622 252374 252989 253918 254690 254811 254571 254536
57415 254536 254715 254818 255036 255880 257296 258534 259018 258873 258512 258222 258284 258978 260117 260984 261132 260954 261116 261702
57397B61702O51O78J055J511J505R64K32l99o76k36R81K323K980K931K754K684
57381B81640K393J844J618K002K344J924J048O20P49N87m02j687k486k752k876
57366B86566k833k279j322n74l58l07O0P23J281J498J539J728K173K570K479J899
57350B94843J440J642K302K833L158L665M282M275L303K065J400J223R69P13J054
57335C29167J941K489K177J642J758K429K768K387J881J934K335K296J569Q11
57321C57584P15J153J511J581J667J830J674J113P49J042J530J417P91N55J127
57306C76039J821J781J064M87N81J105J511J612J659J923K353K643K575K186J718
57291D01058J444J504J674J456O61q4J10J207K067J755O69j0K26Q57J213J180
$$ plain form
57397 261702 262353 263031 264086 265597 267102 268066 268298 267899 267223 266987 267968 270291 273271 276202 278956 281640
57381 281640 284033 285877 287495 289497 291841 293765 294813 295433 296182 296769 296367 294680 292194 289442 286566
57366 286566 283733 281454 280132 279558 279200 278893 278953 279676 280957 282455 283994 285722 287895 290465 292944 294843
57350 294843 296283 297925 300227 303060 306218 309883 314165 318440 321743 323808 325208 326431 327400 328113 329167
57335 329167 331108 333597 335774 337416 339174 341603 344371 346758 348639 350573 352908 355204 356773 357584
57321 357584 358299 359452 360963 362544 364211 366041 367715 368828 369577 370619 372149 373566 374357 374912 376039
57306 376039 377860 379641 380705 381192 381773 382878 384389 386001 387660 389583 391936 394579 397154 399340 401058
57291 401058 402502 404006 405680 407136 407797 407713 407823 409030 411097 412852 413521 413511 413737 414594 415807 416987
57275D16987J035J046J318J755K118K352K742L464M086M026L386K837K665K471
57261D52288J942J415J321J566J781J821J713J388Q64N04O77J267J801J990J880
57246D74218J565J036L65k05l81J0R26K032K793K810K150J289P63Q72J640K833
57230D94716M009M626M322L215J984J441J852K638K961K586K053K001K482K982
57216E33868K970K378J677J499K022K708K809K189J418J086J263J706K278K930
57202E62801L456L647L660M033N185O967Q695R664R727R417R440J0047J0937J1767
57188F69443J2541J3490J4674J5849J6716J7234J7721J8552J9732K0817K1431
57177H58200K1760K2298K3173K4070K4824K5793K7424K9640L1882L3590L4464
$$ plain form
57275 416987 418022 419068 420386 422141 424259 426611 429353 432817 436903 440929 444315 447152 449817 452288
57261 452288 454230 455645 456966 458532 460313 462134 463847 465235 466099 466603 467280 468547 470348 472338 474218
57246 474218 475783 476819 477184 476979 476598 476608 477534 479566 482359 485169 487319 488608 489371 490243 491883 494716
57230 494716 498725 503351 507673 510888 512872 514313 516165 518803 521764 524350 526403 528404 530886 533868
57216 533868 536838 539216 540893 542392 544414 547122 549931 552120 553538 554624 555887 557593 559871 562801
57202 562801 566257 569904 573564 577597 582782 589749 598444 608108 617835 627252 636692 646739 657676 669443
57188 669443 681984 695474 710148 725997 742713 759947 777668 796220 815952 836769 858200
57177 858200 879960 902258 925431 949501 974325 1000118 1027542 1057182 1089064 1122654 1157118
57166A157118L4473L3907L3294L2994L2831L2399L1765L1553L2124L2923L2930
57155A518311L1709K9663K7218K4201K0398J6426J3622J3024J4816J8705K4247
57144A752340L0679L6964M2520M7720N3311N9380O5135O9498P1700P1519O9348
57133B370114O5992O2198N8452N5418N4115N5373N9222O5142P2680Q1547R1526
57122C091779J02596J14530J25599J32303J31657J24068J13169J02629R3730Q5967
57112D218027P8897P2850O8553O6679O7510P0722P5954Q3773R5730J13317J37545
57101E149557J69739K12033K66520L34235M15134N08339O11965P23349Q40302
57092I231173R61855J087243J214053J337313J449787J542730J606726J632933
$$ plain form
57166 1157118 1191591 1225498 1258792 1291786 1324617 1357016 1388781 1420334 1452458 1485381 1518311
57155 1518311 1550020 1579683 1606901 1631102 1651500 1667926 1681548 1694572 1709388 1728093 1752340
57144 1752340 1783019 1819983 1862503 1910223 1963534 2022914 2088049 2157547 2229247 2300766 2370114
57133 2370114 2436106 2498304 2556756 2612174 2666289 2721662 2780884 2846026 2918706 3000253 3091779
57122 3091779 3194375 3308905 3434504 3566807 3698464 3822532 3935701 4038330 4132060 4218027
57112 4218027 4296924 4369774 4438327 4505006 4572516 4643238 4719192 4802965 4898695 5012012 5149557
57101 5149557 5319296 5531329 5797849 6132084 6547218 7055557 7667522 8390871 9231173
57092 9231173 10193028 11280271 12494324 13831637 15281424 16824154 18430880 20063813
57084B0063813J615950J559754J484136J422618J404548J429439J455122J413719
57076C1849099J245267R25389M72962n9466o04248j099930j507696j814689k024350
57067B7382338k144637k183674k151294k059900j923298j756326j575075j394773
57059A2193361j226042j073592r38482q20613p19172o32396n58222m94962m41026
57050E288854l94567l53939l18072k86056k56747k29322k03962j81530j62671
57041B901988j47314j34862j24440j15247j07015r9955r3983q8329q2363p6518
57031A831962p1651o7587o3121n7624n1823m6599m1715l6452l0806k5200j9327
57020A320057j2272l620O537J8708L3795N1069O7129P7844Q1185P7945P0080N8776
$$ plain form
57084 20063813 21679763 23239517 24723653 26146271 27550819 28980258 30435380 31849099
57076 31849099 33094366 34019755 34492717 34433251 33829003 32729073 31221377 29406688 27382338
57067 27382338 25237701 23054027 20902733 18842833 16919535 15163209 13588134 12193361
57059 12193361 10967319 9893727 8955245 8134632 7415460 6783064 6224842 5729880 5288854
57050 5288854 4894287 4540348 4222276 3936220 3679473 3450151 3246189 3064659 2901988
57041 2901988 2754674 2619812 2495372 2380125 2273110 2173155 2079172 1990843 1908480 1831962
57031 1831962 1760311 1692724 1629603 1571979 1520156 1473557 1431842 1395390 1364584 1339384 1320057
57020 1320057 1307785 1304165 1310702 1329410 1363205 1414274 1481403 1559247 1640432 1718377 1788457 1847233
57008A847233M3660K3347k759l2608o1488q4589r9602j06966j08281j05209r9303
56997A213435r1697q2793p2897o3065n4583m7640m1288l4873k8757k3428j8769
56986F53645j4566j1092q670p194o446o543p590r279j1176j3050j4610j5337j5010
56973E13082j4066j3062j2017j0777r569q677p795o305m088j559R88L464N516
56960D35135O593O725O628O745O520N066K324q38l652o151q742j1354j3371j4322
56946D17306j4356j3883j3044j1755j0056q016n409k017J738N010P583J0090J2865
56933C76056J5085J5671J4706J3107J1117P989L373j749o058r277j2036j4618
56921D13366j6536j7288j7035j6356j5649j4935j4097j3108j2087j1152j0223
$$ plain form
57008 1847233 1890893 1914240 1911481 1878873 1817385 1732796 1633194 1526228 1417947 1312738 1213435
56997 1213435 1121738 1038945 966048 902983 848400 800760 759472 724599 695842 672414 653645
56986 653645 639079 627987 619317 612123 605677 599134 591544 582265 571089 558039 543429 528092 513082
56973 513082 499016 485954 473937 463160 453591 444914 437119 430814 426726 425167 426155 429619 435135
56960 435135 441728 448453 455081 461826 468346 473412 475736 474898 471246 465095 456353 444999 431628 417306
56946 417306 402950 389067 376023 364268 354212 346196 340787 338770 340508 345518 353101 363191 376056
56933 376056 391141 406812 421518 434625 445742 453731 457104 455355 449297 440020 427984 413366
56921 413366 396830 379542 362507 346151 330502 315567 301470 288362 276275 265123 254900
56910B54900q966p163n097l434k585k402k477k562k524k193j509p14p1N82J648
56895B15433L113M420N148N572O287P427Q533R105R059Q612P872O688M934K888
56881C05091J167O3q65k255m011n287n486m813l736k345n80J360L306N528Q381
56866B95518J1718J5125J8489K1814K4552K5769K4995K2571J9145J5241J1177
56855E06114O887J903l882r412j3168j4741j5015j4652j3291j0636p425m479j434
56842D06769K749Q302J4506K0846K7331L3616L8547M0963M0414L7010L1087K3394
56830G25534J5092O998j017r509j8265k5981l1238l3618l3743l2383k9797k5953
56818E06120k1152j6041j1026n961n23N274J1149J6831K1994K5924K7591K6319
$$ plain form
56910 254900 245934 238771 233674 230240 227655 225253 222776 220214 217690 215497 213988 213274 213203 213785 215433
56895 215433 218546 222966 228114 233686 239973 247400 255933 265038 274097 282709 290581 297269 302203 305091
56881 305091 306258 306321 305456 303201 299190 293903 288417 283604 279868 277523 276943 278303 281609 287137 295518
56866 295518 307236 322361 340850 362664 387216 412985 437980 460551 479696 494937 506114
56855 506114 513001 514904 511022 501610 488442 473701 458686 444034 430743 420107 412682 408203 406769
56842 406769 409518 417820 432326 453172 480503 514119 552666 593629 634043 671053 702140 725534
56830 725534 740626 747624 746607 737098 718833 692852 661614 627996 594253 561870 532073 506120
56818 506120 484968 468927 457901 451940 451417 456691 467840 484671 506665 532589 560180 586499
56806E86499K2349J6696J0373L779l174j0391j7204k2704k6412k8388k8824k7872
56794D74727k5913k3567k1212j8597j5249j1177o942l102K89L552O836R704J1312
56781C80661J1065R163O339L155k90l962p598j0902j3814j6359j8332j9378j9305
56768C00443j8285j6792j5348j4134j2848j1184r427q206p553o714n214l679l049
56755A68010l320l643l539l344l369l283k737k064j809j866j647j092q24j089
56741A34384j178m05O93Q62j71j295j477r57n50l78m8L55L35j02l71j96J55N18
56723A30174J019J459J336O84J50Kk32p05p36R6J114J498J447J525J464O14p10
56706A40199j391r70o8O15R55R85O78K80K04M18M76L16L47O80P69K33n57r42o98
$$ plain form
56806 586499 608848 625544 635917 639696 636522 626131 608927 586223 559811 531423 502599 474727
56794 474727 448814 425247 404035 385438 370189 359012 352070 348968 349257 352809 359645 369349 380661
56781 380661 391726 400889 407228 410383 410093 406131 398533 387631 373817 357458 339126 319748 300443
56768 300443 282158 265366 250018 235884 223036 211852 202425 194219 186666 179952 174738 171059 168010
56755 168010 164690 161047 157508 154164 150795 147512 144775 142711 140902 139036 137389 136297 135473 134384
56741 134384 133206 132801 133494 134356 134185 132890 131413 130456 129906 129528 129480 129835 130170 130068 129697 129501 129656 130174
56723 130174 131193 132652 133988 134672 134822 134824 134592 133887 133151 133247 134361 135859 137306 138831 140295 140909 140199
56706 140199 138808 137838 137770 138385 139340 140325 141003 141283 141487 141905 142381 142697 143044 143724 144493 144726 144169 143227 142529
56687A42529p9M68N34M1n20n63j93o3l13l20K53P75N69J1P2R51J778J712Q75O4
56667A48581r2L62Q58Q65L76j58l80l89m48n17l26J96Q09J292J642J870J813J362
56649A57716P61M30M60N42M74N35R83J473J396P64K87L95P00P17O06P96J216J461
56631A71712J451J416J304Q29R6l57k15K63O36O78M00J2j44Q2L59K72p3k43j95
56612A78283k88n31m49J04N57L87j03k42P5L21R2m24p43o72m68m47n17k83L21
56593A74973P69N95N8j77Q2M64O73P80Q44P35M48J79l3l17o02n85k20K10O06J194
56573A80676J964K468K420K155K153K445K793L149L666M336M955N406N788O329
56559B30703P169Q117Q656Q383P453O418N716N410N264M778L438J425j65l60N06
$$ plain form
56687 142529 142450 142918 143452 143493 142973 142410 142217 142154 141841 141521 141774 142549 143118 143129 143201 144152 145930 147642 148517 148581
56667 148581 148489 148851 149709 150574 150950 150792 150412 150023 149575 149058 148732 148928 149737 151029 152671 154541 156354 157716
56649 157716 158477 158907 159367 159909 160383 160918 161901 163374 164770 165534 165821 166216 166916 167633 168239 169035 170251 171712
56631 171712 173163 174579 175883 176712 176808 176451 176236 176499 177135 177813 178213 178225 178081 178163 178522 178794 178721 178478 178283
56612 178283 177995 177464 177015 177119 177676 178063 177960 177718 177793 178114 178206 177782 177039 176367 175899 175452 174935 174652 174973
56593 174973 175742 176337 176395 176218 176300 176764 177437 178217 179061 179796 180244 180423 180390 180073 179471 178886 178666 178876 179482 180676
56573 180676 182640 185108 187528 189683 191836 194281 197074 200223 203889 208225 213180 218586 224374 230703
56559 230703 237872 245989 254645 263028 270481 276899 282615 288025 293289 298067 301505 302930 302765 302405 302911
56544C02911J190J048M89K3l76q30j299j908k889l929m277l834l468l843m554
56529B74454m775m296l583l230l598m425m690l577j743q64j558k652k922k560
56515B29981k324k206j891j668j920k222j990j575j712k213k257j682j111q47
56501B04363n87j72J04qn13j324k070k088j200k52m8j15N41J768K352J819J044
56484B03614Q49R54O65r1p75q61k04P95J271O77n06j194q71P7J060J718J764J084
56466B10026N0p70j159j079k78J207K405K254J139N94J302K324K554J991J244
56451B23804O16K73M46R63J164Q94R22J741K537K128O55m43j22J126J900J299
56435B39903k47j433j341l65L23J24m42o36l85o3J98N14Q05P28J13p01j017l82
$$ plain form
56544 302911 304101 305149 305638 305661 305285 304455 303156 301248 298359 294430 290153 286319 282851 279008 274454
56529 274454 269679 265383 261800 258570 254972 250547 245857 242280 240537 239673 238115 235463 232541 229981
56515 229981 227657 225451 223560 221892 219972 217750 215760 214185 212473 210260 208003 206321 205210 204363
56501 204363 203776 203604 203708 203700 203187 201863 199793 197705 196505 196253 196205 196090 196631 198399 200751 202570 203614
56484 203614 204463 205417 206082 205991 205216 204355 204151 204946 206217 206894 206388 205194 204323 204400 205460 207178 208942 210026
56466 210026 210076 209306 208147 207068 206790 207997 210402 212656 213795 214389 215691 218015 220569 222560 223804
56451 223804 224420 224693 225139 226102 227266 228160 229082 230823 233360 235488 236143 235700 235578 236704 238604 239903
56435 239903 239656 238223 236882 236517 236840 236964 236522 235886 235501 235438 235636 236150 236955 237683 237796 237095 236078 235696
56417B35696Q41J622J295K82n03p92r90j208j031l68J96K05k1N8M36P23P57O86
56399B37884P07R26J259J351Q74L5n27m78m5M79J059J576J707J432J184J195J121
56382B51739O63J74J80O27J062J367J798K355K622K306J666J188R96P86L93J32
56366B70054L05N14L3j000j431n62P28J065L23m59o43n47n15m41l01l55n47m62
56348B65759m3L30N80J016J527J555J095Q44J076J276J226J492K281K827K538
56333B85379J967J814J826J493J129J270J579J388R19R41J445J697J557J695K384
56318C08483K881K387J085m9k08O03J658K168J954J468J133R10O21M09O19J384
56302C27506K492L434L685L259K921L270L677K923R96o61j059p78o87n47J74J002
$$ plain form
56417 235696 236537 238159 239454 239736 239233 238441 237451 236243 235212 234844 235040 235245 235224 235282 235718 236441 237198 237884
56399 237884 238591 239517 240776 242127 243001 243036 242509 242031 241986 242465 243524 245100 246807 248239 249423 250618 251739
56382 251739 252402 252576 252756 253383 254445 255812 257610 259965 262587 264893 266559 267747 268743 269529 269922 270054
56366 270054 270359 270873 270906 269906 268475 267913 268641 269706 270029 269570 268927 268380 267865 267424 267123 266768 266221 265759
56348 265759 265716 266046 266626 267642 269169 270724 271819 272663 273739 275015 276241 277733 280014 282841 285379
56333 285379 287346 289160 290986 292479 293608 294878 296457 297845 298764 299705 301150 302847 304404 306099 308483
56318 308483 311364 313751 314836 314787 314579 315182 316840 319008 320962 322430 323563 324473 325094 325503 326122 327506
56302 327506 329998 333432 337117 340376 343297 346567 350244 353167 354163 353502 352443 351665 350978 350431 350605 351607
56286C51607J081N97M56P91Q59L65m2K36R96J601J698J498J543K138K872L043
56270C71339K711K733L441M016L777L295L441M021M279M296M764N647O182O102
56256D30044N910N961O153O528P429Q891J0513J1938J3008J3630J4135J5358J7607
56243E67105J9732K0220J9083J7754J7159J6875J6277J5441J4569J3435J1831
56232G49481R981Q106O049L639R89j703m309o582q311r659j0951j2068j2543j2325
56218F99794j1941j1786j1722j1495j1179j0975j0866j0573r729q268o727n871
56206E78662n787n770n418n198n446n491m626l320k496k045j248l32k31q52r43
56191E29459j6Q68P02n3k94K95J250K091K564K579K408K541K980L095K513J749
$$ plain form
56286 351607 352688 353285 353741 354532 355391 355756 355714 355950 356946 358547 360245 361743 363286 365424 368296 371339
56270 371339 374050 376783 380224 384240 388017 391312 394753 398774 403053 407349 412113 417760 423942 430044
56256 430044 435954 441915 448068 454596 462025 470916 481429 493367 506375 520005 534140 549498 567105
56243 567105 586837 607057 626140 643894 661053 677928 694205 709646 724215 737650 749481
56232 749481 759462 767568 773617 777256 778245 776542 772233 765651 757340 747681 736730 724662 712119 699794
56218 699794 687853 676067 664345 652850 641671 630696 619830 609257 599528 591260 584533 578662
56206 578662 572875 567105 561687 556489 551043 545552 540926 537606 535110 533065 531817 531485 531254 530402 529459
56191 529459 529443 530311 531013 530960 530666 530961 532211 534302 536866 539445 541853 544394 547374 550469 552982 554731
56175E54731J516J781J900J573J244J580K668L821M302M206M343N138O070O459
56161F01332O390O398O666P077P660Q432R104R527J0068J1003J1944J2525J3198
56148G21324J4584J6395J7882J9025K0466K2542K5166K8432L2503L7238M2635
56137I98192M9266N7493O6751P6380Q6519R7052J06430J12899J16391J17820J17092
56126B002285J13458J07449J00606R3382Q4997P5296O4992N4145M2431L1035K2133
56115B792209J5878R844K149o713j5903k6088l7965n0494o2063p2360q1932r0757
56103B375805r8270j04036j07526j07975j05184r9840r2604q3695p3659o3534
56093A439482n3879m4716l6617l0485k5852k1003j5450j0761q086o401m246j729
$$ plain form
56175 554731 556247 558028 559928 561501 562745 564325 566993 570814 575116 579322 583665 588803 594873 601332
56161 601332 607722 614120 620786 627863 635523 643955 653059 662586 672654 683657 695601 708126 721324
56148 721324 735908 752303 770185 789210 809676 832218 857384 885816 918319 955557 998192
56137 998192 1047458 1104951 1171702 1248082 1334601 1431653 1538083 1650982 1767373 1885193 2002285
56126 2002285 2115743 2223192 2323798 2417180 2502177 2577473 2642465 2696610 2739041 2770076 2792209
56115 2792209 2808087 2817931 2820080 2813367 2797464 2771376 2733411 2682917 2620854 2548494 2466562 2375805
56103 2375805 2277535 2173499 2065973 1957998 1852814 1752974 1660370 1576675 1503016 1439482
56093 1439482 1385603 1340887 1304270 1273785 1247933 1226930 1211480 1200719 1192633 1186232 1181986 1180257
56081A180257L25J972L564M660M853M844N504O576P307P671Q081Q610R308J0571
56067A264103J2341J3849J4811J6039J8014J9878K0635K0431J9881J9118J8311
56056A457411J8105J8560J8629J7609J6273J5691J5850J6287J7101J8443J9833
56045A649792K0841K1701K2578K3109K3279K3748K4795K5982K7279K9227L1550
56034A923881L3151L4015L5451L7759L9494L9997M0717M2906M5736M8004M9962
56023B371073N2141N4069N5489N7271N9809O2149O3917O6303O9849P3242P5701
56012C061013P8488Q2459Q6354Q9270R2714R8068J04145J09423J14653J20988
56002D037575J27518J33072J38656J45686J53566J61325J69842J79994J90568
$$ plain form
56081 1180257 1180582 1182554 1186118 1190778 1195631 1200475 1205979 1212555 1219862 1227533 1235614 1244224 1253532 1264103
56067 1264103 1276444 1290293 1305104 1321143 1339157 1359035 1379670 1400101 1419982 1439100 1457411
56056 1457411 1475516 1494076 1512705 1530314 1546587 1562278 1578128 1594415 1611516 1629959 1649792
56045 1649792 1670633 1692334 1714912 1738021 1761300 1785048 1809843 1835825 1863104 1892331 1923881
56034 1923881 1957032 1991047 2026498 2064257 2103751 2143748 2184465 2227371 2273107 2321111 2371073
56023 2371073 2423214 2477283 2532772 2590043 2649852 2712001 2775918 2842221 2912070 2985312 3061013
56012 3061013 3139501 3221960 3308314 3397584 3490298 3588366 3692511 3801934 3916587 4037575
56002 4037575 4165093 4298165 4436821 4582507 4736073 4897398 5067240 5247234 5437802
55993E437802K00536K11436K24825K39401K53383K67772K84386L02700L21607
55984G743848L42310L66399L93152M21737M53949M91574N33415N78223O28078
55975A1952685O85408P49444Q19445Q98590R90676J096245J216516J357797J527143
55966B1293949J727387J962327K243556K586494L003997L510923M131201M893862
55958D5353696N829205O981163Q420162J0230177J2478386J5190515J8314091
55951A22797395K1634723K4684447K6763879K7159618K5478812K1884806J7030803
55944B87434483J1679812O266128P65577m990061j0850327j6206228k0316285
55937B53783099k2758780k3590116k3160117k1861659k0027116j7933604j5801519
$$ plain form
55993 5437802 5638338 5849774 6074599 6314000 6567383 6835155 7119541 7422241 7743848
55984 7743848 8086158 8452557 8845709 9267446 9721395 10212969 10746384 11324607 11952685
55975 11952685 12638093 13387537 14206982 15105572 16096248 17192493 18409009 19766806 21293949
55966 21293949 23021336 24983663 27227219 29813713 32817710 36328633 40459834 45353696
55958 45353696 51182901 58164064 66584226 76814403 89292789 104483304 122797395
55951 122797395 144432118 169116565 195880444 223040062 248518874 270403680 287434483
55944 287434483 299114295 305380423 306146000 301155939 290305612 274099384 253783099
55937 253783099 231024319 207434203 184274086 162412427 142385311 124451707 108650188
55930A08650188j3774576j1926687j0289864q868275p641910o581825n667244
55923D3899807m883994m214466l639953l148687k732625k379734k076985j817525
55915A9005838j597873j411070j249129j109217r91015q90365q01322p22346o54666
55906I578835n96369n43457m95279m53846m18714l87070l57867l31817l08091
55897E686325k84910k62731k43359k26527k10416j94793j80693j67813j54950
55888C760133j42303j30712j19415j06950r3441p9824o5888n1237l6922k3962
55878B909479j1609N46J0220J4761J4688J2267P757l34j2226k6750m3359o1494
55866B813946p8608r1620j00176j06199j10635j12818j12554j10458j06425r9972
$$ plain form
55930 108650188 94875612 82948925 72659061 63790786 56148876 49567051 43899807
55923 43899807 39015813 34801347 31161394 28012707 25280082 22900348 20823363 19005838
55915 19005838 17407965 15996895 14747766 13638549 12647534 11757169 10955847 10233501 9578835
55906 9578835 8982466 8439009 7943730 7489884 7071170 6684100 6326233 5994416 5686325
55897 5686325 5401415 5138684 4895325 4668798 4458382 4263589 4082896 3915083 3760133
55888 3760133 3617830 3487118 3367703 3260753 3167312 3087488 3021600 2970363 2933441 2909479
55878 2909479 2897870 2898416 2908636 2923397 2938085 2950352 2958109 2957775 2945549 2918799 2875440 2813946
55866 2813946 2735338 2643718 2543542 2437343 2326708 2213890 2101336 1990878 1884453 1784481
55856A784481r1972q4130p6922o9898o3582n9018n5702n1975m7441m3194l9762
55845A100885l6628l3661l1307k9327k6999k4561k2911k1946k0734j9170j7987
55834H15654j7187j6008j4463j3397j2999j2587j1990j1789j2115j2424j2549
55823F68146j2873j3378j3551j3303j3062j2974j2741j2129j0951r030o775n220
55811E32159m663m023k483q33k5O35K319M563N982O502P108P856P843O964N944
55796E75848M879L286J434K8j266l347n866p519q004q136q156p664p122p591q815
55781E11989r395r068r015r611r798r111q421p965o538l516j24K329M013N356
55767D41125N734M579K658R82o98l151o261r303j1930j3864j4355j3165j1562
$$ plain form
55856 1784481 1692509 1608379 1531457 1461559 1397977 1338959 1283257 1231282 1183841 1140647 1100885
55845 1100885 1064257 1030596 999289 969962 942963 918402 895491 873545 852811 833641 815654
55834 815654 798467 782459 767996 754599 741600 729013 717023 705234 693119 680695 668146
55823 668146 655273 641895 628344 615041 601979 589005 576264 564135 553184 544154 537379 532159
55811 532159 527496 523473 520990 520157 520132 520767 523086 527649 533631 540133 547241 555097 562940 569904 575848
55796 575848 580727 584013 585447 585475 584209 580862 574996 567477 559473 551337 543181 535517 528395 520804 511989
55781 511989 502594 493526 484511 474900 465102 455991 447570 439605 433067 429551 429427 431756 435769 441125
55767 441125 446859 451438 454096 455078 454380 451229 444968 435665 423735 409871 395516 382351 370789
55754C70789j1104j1679j1795j0699r248q580q735q902q502p699p070o950p135
55741B52691p135o649n741m720l982l759l755l310k287j506j773k749l380l221
55727A98724k686k148j633j302j427j789j793j437j351j789k156j867j048k34
55713A76064K02J75o0NN78J166J229R97J009J020L09j019j997k192k208k602l141
55696A69535l441l467l175k433j611j421j853k053j611j117j055j047p17m52o27
55681A43455p89m03J68K53m2q2K30M24K97Q1j45n95j318j980k239k041j567j069
55663A32638o88l15L10J217K153K941L657M281M477M028L352L231L974M994N320
55648A75570M568L329K424J851Q52q62k495l184l187l403m078m675m880m948n019
$$ plain form
55754 370789 359685 348006 336211 325512 316264 307684 298949 290047 281545 273846 266776 259826 252691
55741 252691 245556 238907 233166 228446 224464 220705 216950 213640 211353 209847 208074 205325 201945 198724
55727 198724 196038 193890 192257 190955 189528 187739 185946 184509 183158 181369 179213 177346 176298 176064
55713 176064 176266 176441 176381 176386 176964 178130 179359 180356 181365 182385 182694 181675 179678 177486 175278 172676 169535
55696 169535 166094 162627 159452 157019 155408 153987 152134 150081 148470 147353 146298 145251 144534 144082 143455
55681 143455 142666 142263 142431 142684 142642 142560 142790 143214 143511 143592 143447 142852 141534 139554 137315 135274 133707 132638
55663 132638 131950 131635 131945 133162 135315 138256 141913 146194 150671 154699 158051 161282 165256 170250 175570
55648 175570 180138 183467 185891 187742 188594 187732 185237 182053 178866 175463 171385 166710 161830 156882 151863
55633A51863m850m382l959l768l596l271k879k465j976j629j727k028j863j046
55619A12424j45L55O05Q36Q51L67m35j087j361j393j399j413j246p92l95n86j259
55602A03927j591j149n73n68p60l81L89P66O84O75O58J18n66l65O31J048K61o81
55584A02523p20j87J36L33Q43J515K077K867M262N840O850P142P074O937O951
55569A54443P331P865P970P575P351P586P475O156L761R19k129n185p530q628
55555A94960q940r213r334q698p437o432o179o374o470o155n356m293l418k881
55541A03780k347j668j318j680k262k282j708j126q24n96k72J00M94Q32Q39L86
55525I0348k06n35o41p79r34r16p02m21k21l75r99j569j295k82L77N9o52j092
$$ plain form
55633 151863 147013 142631 138672 134904 131308 128037 125158 122693 120717 119088 117361 115333 113470 112424
55619 112424 112279 112634 113239 114075 114926 115293 114858 113771 112410 111017 109618 108205 106959 106167 105772 105186 103927
55602 103927 102336 101187 100614 100046 99286 98905 99294 100060 100744 101419 102077 102195 101629 101264 101895 102943 103204 102523
55584 102523 101803 101616 101752 102085 102928 104443 106520 109387 113649 119489 126339 133481 140555 147492 154443
55569 154443 161774 169639 177609 185184 192535 200121 207596 213752 217513 218432 216303 211118 203588 194960
55555 194960 186020 176807 167473 158775 151338 144906 138727 132353 125883 119728 114372 110079 106661 103780
55541 103780 101433 99765 98447 96767 94505 92223 90515 89389 88565 87969 87697 87797 88291 89123 89962 90348
55525 90348 90142 89607 88966 88187 87253 86337 85635 85214 84993 84618 83619 82050 80755 80473 80850 80909 80257 79165
55507G9165j447j847j623m73N21L22l26p4P52O71m09j022n86k72q39j304o13N90
55489G1186R75M60N3K72O75P40M12j03n65p51o30l76m8M81J110J371R81K32l84
55470G6091o51n03J15R41J277P24k14o54l89n9l03j057j696j662r07J21Q69J066
55452G3109P97K52l93q83r36n34J0L89O28Q72J045Q96L95j34l47k69k08l33m32
55433G3924k06L02P14Q11Q53J213J785J918J143j54r53o45L43J076J195J046R43
55416H5308P59M95M94P57O48n4m12M35J747J981R58k7k82n26j274j796j459r49
55398H6803j119j500j133k39R1n08j325j692j491q47p0L04J31J02P65J475J165
55381H0912l0r66j096q50n69j03L66K24m94q89m55J64J31n17j140j344j138o92
$$ plain form
55507 79165 77718 75871 74248 73775 74296 74618 74292 74218 74970 75641 75232 74210 73624 73352 72513 71209 70596 71186
55489 71186 72161 72621 72674 72946 73621 74361 74773 74670 74105 73354 72724 72348 72300 72781 73891 75262 76243 76475 76091
55470 76091 75440 74937 75052 75993 77270 77994 77780 77126 76737 76678 76375 75318 73622 71960 71053 71174 72043 73109
55452 73109 73906 74158 73765 72882 71946 71412 71422 71811 72439 73311 74356 75252 75647 75513 75166 74897 74689 74356 73924
55433 73924 73718 74020 74734 75545 76398 77611 79396 81314 82457 82303 81350 80705 81048 82124 83319 84365 85308
55416 85308 86067 86562 87056 87813 88461 88407 87995 88430 90177 92158 93116 93089 92807 92281 91007 89211 87752 86803
55398 86803 85684 84184 83051 82812 82903 82395 81070 79378 77887 77040 76970 77274 77405 77507 78272 79747 80912
55381 80912 80882 79916 78820 77970 77401 77298 77664 77888 77394 76505 76050 76214 76345 75828 74688 73344 72206 71514
55363G1514k46K4K13N04P57O89M54N04Q44R84P11L35O3k39n41n04q5K49J72j45
55343G6257m44o33m60L75J458J741Q26l42n78J35Q30Q51M78L88Q85J552J590O66
55325H5575n68j084o91k42m61j119j517j363r04n17l61k36L46J493K410K097P00
55308H3558n51r44j045j462j716j084J45J016J188J035P88L86J7K3K60K52J2N6
55290H1934M89P20L40j92j44N59J288J467J090N40J17j63l79m96m45l43l53l35
55272H5694J8N85P17O0q59j191p30J5N38P04N20L4m39m70n9K89K53J49L95P69
55252H6992O22j58q36p39j65K6m10p85m26M51J059R61L89r0K6P75J452J074m10
55233H9808j709j611n40Q5k15o00m72k37k08K18J458K694K809J886Q42L9q10j527
$$ plain form
55363 71514 71268 71292 71505 72009 72766 73455 73909 74413 75257 76241 76952 77287 77350 77111 76570 76066 75981 76230 76402 76257
55343 76257 75813 75180 74720 75095 76553 78294 79120 78778 78200 78335 79165 80016 80494 80882 81767 83319 84909 85575
55325 85575 85007 83923 83232 82990 82529 81410 79893 78530 77626 77109 76748 76512 76858 78351 80761 82858 83558
55308 83558 83007 82063 81018 79556 77840 76756 76901 77917 79105 80140 80928 81314 81331 81354 81614 81866 81878 81934
55290 81934 82423 83143 83483 83291 83147 83706 84994 86461 87551 88091 88208 88045 87666 87170 86725 86382 86029 85694
55272 85694 85712 86297 87014 87074 86215 85024 84294 84309 84847 85551 86071 86105 85666 85196 85137 85426 85679 85828 86223 86992
55252 86992 87614 87456 86620 85881 85716 85742 85332 84547 84121 84572 85631 86592 86981 86891 86917 87692 89144 90218 89808
55233 89808 88099 86488 85948 86033 85818 85218 84746 84509 84301 84519 85977 88671 91480 93366 94208 94247 93437 91910
55215I1910j435n70L4k80q96q13J0P83J017R14P79N81J71l48o73n81j27L82N92
55196I1450M43K23K21K58j55j085j841j646n97L68M94n3n73o17k36K69N92O09
55178H8124N50P89J291J549J315J013J008Q95J00j061j686j537j201j069q37k40
55162H9003M58R34J167J097N54j72l66J23N47L53PJ84O76P74L39j51l94m43k83
55143I4407J18L98Q3p11j308j260p50j52L31N93N31K32k5l5J35L12M25N25O51
55124I4500O90M22j26n04k62M00P98O25K44Qj96n32p49n80j63K18N24P22N71J05
55104I6715r5M15J208J514J159N29j20p51j138j005m56J95Q84J559J699Q09o20
55087A02501j404r98k4O65Q56P91N97K39k29o82j026j219j296j316j223r20o28
$$ plain form
55215 91910 90475 89905 89939 89659 88763 87950 87960 88743 89760 90674 91453 92034 92205 91857 91184 90603 90476 90858 91450
55196 91450 91893 92116 92337 92595 92440 91355 89514 87868 87271 87639 88133 88080 87507 86890 86654 86923 87515 88124
55178 88124 88674 89463 90754 92303 93618 94631 95639 96534 96634 95573 93887 92350 91149 90080 89243 89003
55162 89003 89461 90395 91562 92659 93213 93041 92675 92798 93345 93698 93705 93889 94565 95339 95678 95527 95133 94690 94407
55143 94407 94525 94923 95006 94295 92987 91727 90977 90825 91156 91749 92280 92512 92487 92452 92587 92899 93324 93849 94500
55124 94500 95190 95612 95486 94982 94720 95120 95918 96543 96787 96795 96599 96067 95318 94738 94575 94793 95317 96039 96610 96715
55104 96715 96620 97035 98243 99757 100916 101445 101325 100574 99436 98431 97975 98170 99054 100613 102312 103121 102501
55087 102501 101097 100099 100075 100740 101596 102387 102984 103223 102994 102312 101286 100067 98771 97455 96232 95312 94684
55070I4684p68j244j276m47N22O81J97LM02Q92J151J292J106J94j039j500q62
55053I3988K5M52O12O81K49o73j132o02k0l46q30m4J729K592J578j12p84j92O83
55034I7854J078R80O93L88L0n09j192j628j407o44O0L18L39M79P41Q81P83M92
55016I9736R7k57l92l19k63l07j49M46J115J165M79k05j58M00N92Q6m31k25M45
54997A01855O74J80l40j67N76J277J581J497J058L62j91j72L37Q00Q20M35r3m66
54979A10023l66L08J077J179M07n43p83j55P35J210J151R49J006J247J180M98
54963A19123m36r61q64m74n9M69J077J362J101O87O23P86O44K9p00j157j220r19
54945A19111l97M0K37M76J026J510J264L56l66l75o3J8j9K42P75J183J246J051
$$ plain form
55070 94684 93916 92672 91396 90949 91471 92152 92349 92352 92754 93646 94797 96089 97195 97389 96350 94850 93988
55053 93988 94013 94465 95077 95758 96007 95334 94202 93600 93580 93234 92404 92360 94089 96681 98259 98147 97363 97171 97854
55034 97854 98932 99912 100605 100993 101023 100514 99322 97694 96287 95643 95703 96021 96360 96839 97580 98461 99244 99736
55016 99736 99833 99576 99184 98865 98602 98295 98146 98592 99707 100872 101351 101146 100988 101388 101980 102066 101635 101410 101855
54997 101855 102529 102709 102369 102202 102778 104055 105636 107133 108191 108553 108362 108190 108527 109327 110147 110582 110489 110023
54979 110023 109657 109965 111042 112221 112628 112085 111302 111147 111882 113092 114243 115192 116198 117445 118625 119123
54963 119123 118687 117726 116862 116388 116329 116798 117875 119237 120338 121025 121648 122434 123078 123107 122407 121250 120030 119111
54945 119111 118714 118754 118991 119467 120493 122003 123267 123623 123257 122882 122819 122837 122818 123060 123835 125018 126264 127315
54927A27315Q51J072K094L691N045N750O358P397Q419Q687Q412Q270P973O498
54913B07832L848J396Rj104k974n173o428o406n894n474n017m505m351m659m827
54898A56273m315l377k613k119j561q78n06p74j393j694j237j33J106J904K011
54883A40694J744J851K869M584O212P120P263O975O645O575O768O716N797M111
54869B15924K491J388K60j514l580n112o034o850p543p506o684n837n423n014
54855A58966m186l301k960l138l346l270k941k550k319k313k262j913j531j516
54841A21420j576j067k08n0q63j519j057n0L10k05r14j248j059l59M61P41M35
54824A13192L83J009J477R11j48n87m01m01p09p23l30Q0O05J573K400K045O83
$$ plain form
54927 127315 128166 129238 131332 135023 140068 145818 152176 159573 167992 176679 185091 193361 201334 207832
54913 207832 211680 213076 213085 211981 209007 203834 197406 191000 185106 179632 174615 170110 165759 161100 156273
54898 156273 151958 148581 145968 143849 142288 141410 140904 140130 138737 137043 135806 135673 136779 138683 140694
54883 140694 142438 144289 147158 151742 157954 165074 172337 179312 185957 192532 199300 206016 211813 215924
54869 215924 218415 219803 220063 218549 214969 209857 203823 196973 189430 181924 175240 169403 163980 158966
54855 158966 154780 151479 148519 145381 142035 138765 135824 133274 130955 128642 126380 124467 122936 121420
54841 121420 119844 118777 118569 118519 117656 116137 115080 115030 115340 115135 114221 112973 111914 111555 112016 112757 113192
54824 113192 113575 114584 116061 116972 116824 116237 115836 115435 114726 114003 113673 113753 114358 115931 118331 120376 121059
54807A21059k85j98J45J3k16m3J85ml21k29K90Q93J281J118K09q58j049k44M93
54788A22239M39J76M84J083J256R96P33M55l5l74l2P36J128R47Q28J351K414L511
54770A38335M273M714N261O402Q068R525J0095R752Q811P379N579L964L093K797
54756B28048K299J033r38l271n618p572q642q552p552o343n615n438n200m425
54742A62214l429k828k533j879p46J12J90j43l72n38o92l51P52J869K028J395
54726A55049J111J883L359M844N973O669O936O891O630O021M871L279J637K72
54712B15425p51j669k951m813o637p333o683n793n760o240o068m921l621k945
54698A49240k852k974l092l004k462j531n77J78P17Q81M24m24r77r06o50p51j164
$$ plain form
54807 121059 120774 120576 120721 120734 120518 120475 120660 120656 120335 120106 120396 121289 122570 123688 123897 123039 121990 121746 122239
54788 122239 122678 122854 123338 124421 125677 126673 127406 127861 127826 127452 127420 128156 129284 130231 131059 132410 134824 138335
54770 138335 142608 147322 152583 158985 167053 176578 186673 196425 205236 212615 218194 222158 225251 228048
54756 228048 230347 231380 230442 227171 221553 213981 205339 196787 189235 182892 177277 171839 166639 162214
54742 162214 158785 155957 153424 151545 150799 150911 151101 150958 150586 150048 149356 149005 149757 151626 153654 155049
54726 155049 156160 158043 161402 166246 172219 178888 185824 192715 199345 205366 210237 213516 215153 215425
54712 215425 214674 213005 210054 205241 198604 191271 184588 178795 173035 166795 160727 155806 152185 149240
54698 149240 146388 143414 140322 137318 134856 133325 132748 132926 133643 134524 134948 134524 133547 132641 131991 131240 130076
54681A30076j443j360j007n62j77Nm9j86k92m64p92j012o67K68J060Q36l88j613
54663A22233j923j414p56j67N21J002N79n75j172l80R27J319O45n5k22k98n89
54646A19675o72k80R7P1J59J021K190K440J430K71J03O24O53j57q85p56j74J05
54628A25915J70N14Q30L07r04j589j148l59o8J3M49R03O89k5m56l35j0K58L98
54609A25552J96l38o08j65M85O03M03N54Q60N55j75k65M70R21M43j59m8L06J3
54590A29603p09q83k48N22Q71R29J060J335J592J689J619J450J201P99K74j01
54574A41003j59j48l23m51k33o3n85j477j585n58N40P27L65L49O75P07M12L98
54556A39594Q98J456J656J542J221P11K21J48N75J162J604J926K119J900J105
$$ plain form
54681 130076 128633 127273 126266 125704 125527 125532 125483 125297 125005 124541 123749 122737 122070 122338 123398 124234 123846 122233
54663 122233 120310 118896 118140 117973 118494 119496 120075 119500 118328 117948 118875 120194 120839 120784 120562 120264 119675
54646 119675 119003 118723 118820 118891 119050 120071 122261 124701 126131 126402 126505 127129 127782 127625 126740 125984 125810 125915
54628 125915 126085 126599 127429 127736 126832 125243 124095 123736 123668 123681 124130 125033 125722 125697 125241 124906 124896 125154 125552
54609 125552 125748 125410 124802 124637 125122 125725 126128 126682 127542 128097 127922 127657 128127 129048 129491 129332 129284 129590 129603
54590 129603 128894 128011 127763 128285 129156 130085 131145 132480 134072 135761 137380 138830 140031 140830 141104 141003
54574 141003 140844 140696 140373 139922 139689 139626 139041 137564 135979 135421 135961 136688 137053 137402 138077 138784 139196 139594
54556 139594 140492 141948 143604 145146 146367 147078 147299 147447 148022 149184 150788 152714 154833 156733 157838
54541A57838J42k98J9O27R59J012J222J707K019J765J171P71P13P76Q43R95J129
54524A73410J011O38K18k40q28j274j173p28o65j147j433r27j2O04P90P43L50
54507A69337n31j467j836j638j342j007k65Q07J459J167L25k88m02l75n62r19
54491A62463j156j062n99J56J007J611J676J327J116J424J943J989J350N41K09
54476A73995N14J181J875K410K743K846K623J987J188P71R27J179J074R79J475
54461A97767K204K128J025o4k06L63Q92J121J158R67N63K50J21k42j050j740j724
54444B03533j266j057j211j349j332j274j075o08j86k39o67j068j360j596j434
54429A87811n23O87J296J036L91k76r61j407j140k53N40Q34Q48O61k5j122j789
$$ plain form
54541 157838 157980 157682 157701 158328 159287 160299 161521 163228 165247 167012 168183 168954 169667 170443 171286 172281 173410
54524 173410 174421 175059 175277 175037 174209 172935 171762 171034 170369 169222 167789 166862 166850 167454 168244 168987 169337
54507 169337 168806 167339 165503 163865 162523 161516 161251 162058 163517 164684 165009 164721 164319 163944 163382 162463
54491 162463 161307 160245 159646 159802 160809 162420 164096 165423 166539 167963 169906 171895 173245 173786 173995
54476 173995 174509 175690 177565 179975 182718 185564 188187 190174 191362 192133 193060 194239 195313 196292 197767
54461 197767 199971 202099 203124 203060 202854 203217 204109 205230 206388 207355 207918 208168 208289 208047 206997 205257 203533
54444 203533 202267 201210 199999 198650 197318 196044 194969 194361 194175 193936 193269 192201 190841 189245 187811
54429 187811 187288 187975 189271 190307 190698 190422 189461 188054 186914 186661 187201 188035 188883 189544 189519 188397 186608
54412A86608j489p83n82r48j202r67n11j84O9M19P42P34M15L02Q26J620J816J198
54394A88083O01P07J015O57j22l06J99L40l90j054o84K74O75K51l42o68r19j216
54376A87101j291r21k55L56N73K05n65j121r67l25J53J85J07L04P25J029R86O26
54358A86905K15R2L96Q48R16K92q27j882k393k326k039j888j849j704j484j424
54342A71848j493j314p86l80n06q78r25o33n59r61j445j519j158o65k38J18M13
54325A58919O11O55M98J61j76l01k06q8m6M1K68N06N72N25N64P45Q67P45M14O6
54305A65340j40j56l7R8J29K9j03j58j45j88m37r48j543j743j087K61J286R03
54287A61361q54k690l312k636j555p23l4P79J476J579J017K18m03p50q76p39l54
$$ plain form
54412 186608 185119 184336 183754 182806 181604 180637 180126 179942 180011 180430 181172 181906 182321 182623 183449 185069 186885 188083
54394 188083 188684 189391 190406 191063 190941 190635 190834 191174 190784 189730 189046 189320 189995 190246 189904 189236 188317 187101
54376 187101 185810 184889 184634 184990 185563 185768 185203 184082 183115 182790 182943 183128 183235 183539 184264 185293 186279 186905
54358 186905 187120 187212 187608 188456 189372 189664 188837 186955 184562 182236 180197 178309 176460 174756 173272 171848
54342 171848 170355 169041 168255 167875 167369 166491 165566 164933 164374 163413 161968 160449 159291 158626 158388 158506 158919
54325 158919 159530 160185 160683 160844 160668 160367 160161 160073 160027 160068 160336 160842 161414 161939 162503 163248 164115 164860 165274 165340
54305 165340 165200 165044 165007 165105 165234 165263 165160 165002 164857 164669 164232 163284 161741 159998 158911 159172 160458 161361
54287 161361 160507 157817 154505 151869 150314 149591 149557 150336 151812 153391 154408 154626 154223 153473 152597 151858 151504
54270A51504qn4l92m42J22P63O06m01j269j149l51J91K20L70J126K115K567K148
54252A57666J155K15j23K27O87N39k27q56q51o22p67j077q66j18M25L58J02k0
54234A55847m38j506k444k120p06K80n9q66q75j83J46j98m92l50k21k81M7R19
54216A46500J309L62j090j491o94o1m31j104j107n40j60k85o22p88n36J63R29
54199A40354J162P68L44L90P38J001J169J335J282Q38L39K16M07N54N31L05l59
54182A51374j418k123j792q85n20r46j301r56l21k4KJ37L43L24Q8q6p3N7J92J89
54162A42261k7j74J65Q24R65K14n88l58O99J347R90L65L25O58N59j13o88o66l31
54143A46427k91o87j078r81l64M08R71J180J004M28l21o67j69Q10J293P36l13
$$ plain form
54270 151504 151496 151442 151050 150608 150730 151493 152099 151698 150429 149280 148929 149120 149340 149710 150836 152951 155518 157666
54252 157666 158821 159036 158913 159140 159827 160366 160139 159283 158432 157810 157043 155966 155100 154982 155407 155765 155867 155847
54234 155847 155409 153903 151459 149339 148633 148913 148854 147988 147113 146930 147076 146878 146386 146036 145815 145534 145581 146500
54216 146500 147809 148171 147081 145590 144896 144835 144404 143300 142193 141653 141493 141208 140586 139798 139262 139425 140354
54199 140354 141516 142284 142628 143018 143756 144757 145926 147261 148543 149381 149720 149936 150343 150897 151428 151733 151374
54182 151374 149956 147833 146041 145156 144636 143690 142389 141433 141112 141088 141090 141227 141570 141894 141982 141896 141823 141880 142072 142261
54162 142261 142234 142060 142225 143049 144014 144228 143640 143282 143981 145328 146318 146683 147008 147666 148225 148112 147424 146758 146427
54143 146427 146136 145449 144371 143390 143026 143434 144405 145585 146589 147017 146696 146029 145860 146670 147963 148699 148386
54126A48386q93p45m23l86m46k58N6R5k01m60l94o3L39O96R03Q54O54N89P43P93
54106A49839M37j78o61q51q18n67j01K97L34J83K62M72L00k25k99M62J256J161
54088A51303N10L24P08P51M4o60o76l24j97j46K81Q90J049O16K6l48l72J22J175
54069A55076K279K683K184J243L92l7J48Q24J280Q58j54p78o11j79N0L10Q14J130
54051A67512P85Q6k56PN50J005J226J232J249J600K260K761K796K621K590K629
54035A90653K573K603K902L203L222L255L782M661N231N155M656M071L673L677
54021B43317L912L689K616J375J004J536K109K292K364K280J392l48j876k198
54007B63464j575r87r75j468k232k952l295l313l403l533l085j934j035j249k071
$$ plain form
54126 148386 147493 146748 146325 145939 145493 145235 145291 145386 145185 144725 144331 144268 144607 145303 146206 147060 147714 148303 149046 149839
54106 149839 150276 150098 149437 148586 147768 147201 147100 147397 147731 147914 148176 148648 148948 148723 148424 148886 150142 151303
54088 151303 151813 152137 152845 153596 153640 152980 152304 151980 151783 151637 151918 152808 153857 154473 154499 154151 153779 153901 155076
54069 155076 157355 160038 162222 163465 163857 163820 163968 164792 166072 166930 166776 165998 165387 165208 165258 165568 166382 167512
54051 167512 168297 168383 168127 168134 168684 169689 170915 172147 173396 174996 177256 180017 182813 185434 188024 190653
54035 190653 193226 195829 198731 201934 205156 208411 212193 216854 222085 227240 231896 235967 239640 243317
54021 243317 247229 250918 253534 254909 255913 257449 259558 261850 264214 266494 267886 267538 265662 263464
54007 263464 261889 260902 259927 258459 256227 253275 249980 246667 243264 239731 236646 234712 233677 232428 230357
53992B30357k331j777j090n65K50J493K551K963L128L689M670N576N974N691M726
53977B65305L288J762L75r83k460l910n030n728o195o599o830o591n763m694l910
53962B12037l563l214k425j332m11J59N79R10R50O68M22M69N99M83K35K78P34
53945B07578J258J529J653J958K503L046L384L539L519L197K593K122K187K612
53931B42678K744K260J594J365J646J963J914J575J366J582K090K440K428K474
53917B70119L160M411N419N601N255N054N195N400N502N577N633N620N687O039
53903C43672O468O395N498M045K533J255K37o05j390k159k761l018l035l138l408
53888C50589l525l236k903l234m409n677o051n376m466m169m523n068n564n982
$$ plain form
53992 230357 228026 226249 225159 224594 224844 226337 228888 231851 234979 238668 243338 248914 254888 260579 265305
53977 265305 268593 270355 270730 269747 267287 263377 258347 252619 246424 239825 232995 226404 220641 215947 212037
53962 212037 208474 205260 202835 201503 201092 201251 201830 202740 203690 204358 204780 205249 205848 206331 206566 206844 207578
53945 207578 208836 210365 212018 213976 216479 219525 222909 226448 229967 233164 235757 237879 240066 242678
53931 242678 245422 247682 249276 250641 252287 254250 256164 257739 259105 260687 262777 265217 267645 270119
53917 270119 273279 277690 283109 288710 293965 299019 304214 309614 315116 320693 326326 331946 337633 343672
53903 343672 350140 356535 362033 366078 368611 369866 370103 369498 368108 365949 363188 360170 357135 353997 350589
53888 350589 347064 343828 340925 337691 333282 327605 321554 316178 311712 307543 303020 297952 292388 286406
53874B86406o000n248m068l317l182k911k044j243j275j849k231k456l002l536
53860B44044l175j986j210j610k513k892k641k303k073j758j377j219j393j700
53846B16194j877j814j626j611j907k142j765q39p0R6l2j3J06Q5Olj28m90p14
53827B01456l81K79O76O70O03O84Q49J146J674K121J964J281Q73J336K447L637
53811B21315M660N496N985N997N757N569N283M491L233K089J432R52K20n78q39
53796B71062m39O4K22L53J055K229L009K802K044J703K119K604K319J368P25J066
53780B94305J896K153J469M41l42r62j601j923j576j031j188k174l138l349l013
53765B79967k807l020l391l529l302l048l366m391n280n000l751k946l473m499
$$ plain form
53874 286406 280406 275158 271090 267773 264591 261680 259636 258393 257118 255269 253038 250582 247580 244044
53860 244044 240869 238883 237673 236063 233550 230658 228017 225714 223641 221883 220506 219287 217894 216194
53846 216194 214317 212503 210877 209266 207359 205217 203452 202613 202543 202639 202607 202594 202700 202785 202791 202788 202660 202170 201456
53827 201456 201075 201354 202030 202700 203303 203987 204836 205982 207656 209777 211741 213022 213895 215231 217678 221315
53811 221315 225975 231471 237456 243453 249210 254779 260062 264553 267786 269875 271307 272259 272479 271901 271062
53796 271062 270623 270687 270909 271262 272317 274546 277555 280357 282401 284104 286223 288827 291146 292514 293239 294305
53780 294305 296201 298354 299823 300264 299922 298960 297359 295436 293860 292829 291641 289467 286329 282980 279967
53765 279967 277160 274140 270749 267220 263918 260870 257504 253113 247833 242833 239082 236136 232663 228164
53751B28164m576l464k203j567j237o08J46K08p96k141k576j631j65N20J01n98
53735B07577p89n89m89n28m27j88p0j38k26k08L6O32J369J575Q62j66n30r8K99
53716B07904M8n06o46j46O00J100J174J038J060J350J618J579J344J199J125Q96
53700B20737N56M05N82Q97J140J195J009P52R27J824K929L324K802K076J817J903
53684B44875J786J166J08j069j806j598n54N53J051R58O91N26N22O36O56K87l85
53667B48403p86n22O5L52K80K67M29L81r3o05p48p66j204j965k210j460l85l6
53649B39397m65p67m83j86l22l14M28J232R49k73j091q78m00l07j41N64J153P84
53631B38880j56n23J9P74J168J328J512J623J488J116O30K73M24J237K311L062
$$ plain form
53751 228164 223588 220124 217921 216354 215117 214509 214655 214863 214067 211926 209350 207719 207554 208074 208175 207577
53735 207577 206788 206199 205710 205182 204755 204567 204497 204359 204133 203925 203961 204593 205962 207537 208399 208233 207703 207605 207904
53716 207904 207952 207446 206800 206654 207254 208354 209528 210566 211626 212976 214594 216173 217517 218716 219841 220737
53700 220737 221293 221698 222280 223177 224317 225512 226521 227273 228200 230024 232953 236277 239079 241155 242972 244875
53684 244875 246661 247827 247935 246866 245060 243462 242908 243461 244512 245470 246161 246687 247209 247845 248501 248788 248403
53667 248403 247617 247095 247160 247512 247792 248059 248488 248869 248776 248171 247423 246657 245453 243488 241278 239818 239433 239397
53649 239397 238932 238165 237682 237496 237174 236860 237288 238520 239469 239196 238105 237227 236827 236520 236379 236943 238096 238880
53631 238880 238724 238201 238220 238994 240162 241490 243002 244625 246113 247229 247859 248132 248556 249793 252104 255166
53615B55166L379L521L520L153K484J928J716J738J870K075K176J984J695J676
53601B88081J797J509P53K08L52P74Q52O63P66J308J837J885J352M07o42j369
53585C00533j525j273r86p94o01m41n06p86j018j028q85o47k81M8j6m66o74j53
53567B88501O46P68j8r19j156q08m18r4M46J230J854J937J440N47l69p89l87N58
53549B92969J394J782J888J985K158K426K776L083L350L846M633N069M515L459
53535C35333L167M010N036N504N912O857P867Q203Q207Q772R904J0843J1379J1948
53521D42942J2597J2821J2565J2404J2622J2948J3365J4293J5773J7235J8321
53510E97886J9243K0083K0508K0433K0214J9916J9268J8603J8870K0218K1459
$$ plain form
53615 255166 258545 262066 265586 268739 271223 273151 274867 276605 278475 280550 282726 284710 286405 288081
53601 288081 289878 291387 292140 292348 292700 293474 294326 294989 295755 297063 298900 300785 302137 302544 301902 300533
53585 300533 299008 297735 296749 295955 295354 294913 294407 293621 292603 291575 290690 290043 289762 289810 289794 289328 288654 288501
53567 288501 289147 289915 289897 288978 287822 287014 286596 286502 286948 288178 290032 291969 293409 293956 293587 292798 292411 292969
53549 292969 294363 296145 298033 300018 302176 304602 307378 310461 313811 317657 322290 327359 331874 335333
53535 335333 338500 342510 347546 353050 358962 365819 373686 381889 390096 398868 408772 419615 430994 442942
53521 442942 455539 468360 480925 493329 505951 518899 532264 546557 562330 579565 597886
53510 597886 617129 637212 657720 678153 698367 718283 737551 756154 775024 795242 816701
53499H16701K1618K1178K1060K1170K0836K0059J9373J8944J8729J9062K0070
53488A038800K0860K0392J8936J7663J6919J6032J4818J4036J4043J4091J3473
53477A220063J2545J1997J1723J1056R681P817N777L769J891Q0j821l769n566
53464A285243p262r096j1051j2842j4510j6372j8274j9447j9545j9266j9484k0214
53452A097880k0925k1416k1838k2105k1916k1272k0476j9711j8979j8378j7991
53441H72873j7602j6886j5810j4558j3134j1460r726q232o895n383l657k006n46
53428G46978Q77K286L615N163P384R940J1654J1907J1677J2511J4687J7019J8498
53415H74196J9429K0688K2506K4437K6197K7905K9536L0724L1307L1748L2695
$$ plain form
53499 816701 838319 859497 880557 901727 922563 942622 961995 980939 999668 1018730 1038800
53488 1038800 1059660 1080052 1098988 1116651 1133570 1149602 1164420 1178456 1192499 1206590 1220063
53477 1220063 1232608 1244605 1256328 1267384 1277065 1284882 1290659 1294428 1296319 1296399 1294578 1290809 1285243
53464 1285243 1277981 1268885 1257834 1244992 1230482 1214110 1195836 1176389 1156844 1137578 1118094 1097880
53452 1097880 1076955 1055539 1033701 1011596 989680 968408 947932 928221 909242 890864 872873
53441 872873 855271 838385 822575 808017 794883 783423 773697 765465 758570 753187 749530 747524 746978
53428 746978 747855 750141 753756 758919 766303 776243 787897 799804 811481 823992 838679 855698 874196
53415 874196 893625 914313 936819 961256 987453 1015358 1044894 1075618 1106925 1138673 1171368
53404A171368L4322L6340L8418M0321M1862M3084M4430M6233M8071M9134M9380
53393A642963M9731N0794N1924N2109N1423N0869N0865N0658M9418M7277M4951
53382B192982M2792M0631L8213L5315L1724K7625K3832K1099J9102J6632J3014
53371B502961Q866N155J817k179p537j3807j9939k5344l0199l4942l9692m4214
53359B300946m8291n1959n5240n7769n8996n8918n8307n7893n7515n6512n4842
53348A684704n3231n2136n1203n0014m8859m8213m7851m7104m5767m4174m2445
53337A153707m0293l7657l4966l2659l0745k8952k6956k4496k1671j9078j7184
53326H39050j5603j3601j1308r649q839p856n907l696k454k240k001j035M30J970
$$ plain form
53404 1171368 1205690 1242030 1280448 1320769 1362631 1405715 1450145 1496378 1544449 1593583 1642963
53393 1642963 1692694 1743488 1795412 1847521 1898944 1949813 2000678 2051336 2100754 2148031 2192982
53382 2192982 2235774 2276405 2314618 2349933 2381657 2409282 2433114 2454213 2473315 2489947 2502961
53371 2502961 2511827 2516982 2518799 2516620 2509083 2495276 2475337 2449993 2419794 2384852 2345160 2300946
53359 2300946 2252655 2200696 2145456 2087687 2028691 1969773 1911466 1853573 1796058 1739546 1684704
53348 1684704 1631473 1579337 1528134 1478120 1429261 1381048 1333197 1286093 1240326 1196152 1153707
53337 1153707 1113414 1075757 1040791 1008132 977387 948435 921479 896983 875312 856234 839050
53326 839050 823447 809846 798538 788889 780050 772194 766287 762591 760137 757897 755896 754861 755291 757261
53312G57261L489N006O446P776Q989J0026J0994J2194J3572J4485J4675J5025
53300H79938J6489J8600K0060K0761K1939K4067K5902K6290K5846K5965K6822
53289A132679K7427K7142K6256K5259K4329K3555K2850K1744J9817J7316J4810
53278A383184J2380R706O934M699L197J788k57k900n491p449q798j0183j2278
53265A374532j4949j7269j8766k0277k2935k6460k9353l0791l1448l2212l3025
53254A097047l3443l3484l3329l2738l1588l0409k9758k9317k8444k7340k6790
53243G60407k6845k6609k5525k4182k3476k3537k3712k3366k2358k1011j9781
53232E00005j8833j7875j6563j5003j3537j2148j0560q928p845p442p054o166
$$ plain form
53312 757261 760750 765756 772202 779978 788967 798993 809987 822181 835753 850238 864913 879938
53300 879938 896427 915027 935087 955848 977787 1001854 1027756 1054046 1079892 1105857 1132679
53289 1132679 1160106 1187248 1213504 1238763 1263092 1286647 1309497 1331241 1351058 1368374 1383184
53278 1383184 1395564 1405270 1412204 1416903 1420100 1421888 1421631 1418731 1413240 1405791 1396993 1386810 1374532
53265 1374532 1359583 1342314 1323548 1303271 1280336 1253876 1224523 1193732 1162284 1130072 1097047
53254 1097047 1063604 1030120 996791 964053 932465 902056 872298 842981 814537 787197 760407
53243 760407 733562 706953 681428 657246 633770 610233 586521 563155 540797 519786 500005
53232 500005 481172 463297 446734 431731 418194 406046 395486 386558 378713 371271 364217 358051
53220C58051n233n168o123p180p209n844l800k345k238k982l400l079k777l178
53206B97495l819l781l067k470k324k189j831j728k288l134l522l106k111j089
53192B61036p02j255k233k651k207j633j642k039k244k222k244k213j922j759
53178B34070k202k707k102l22J176J218L89l1Q5j53r54j462j147o22o22r08q09
53161B22897l63k09n29q24p12l78q8J51K74n6r32j725j652p08K85N76K37q8J6
53142B16172K65O1p09j381j263n94k93o92j011m75M88Q11K67k66r9M27N70J60
53124B12438l82o17m03J52O70P81N26L92O90J119J115M79m58j144j145m90K31
53107B13954L30k54r31j246j326j424j473j367j209r34j49J169K183J997P46o58
$$ plain form
53220 358051 352818 347650 341527 334347 327138 321294 317494 315149 312911 309929 306529 303450 300673 297495
53206 297495 293676 289895 286828 284358 282034 279845 278014 276286 273998 270864 267342 264236 262125 261036
53192 261036 260334 259079 256846 254195 251988 250355 248713 246674 244430 242208 239964 237751 235829 234070
53178 234070 231868 229161 227059 226737 227913 229131 229520 229489 229574 229421 228467 227005 225858 225236 224614 223706 222897
53161 222897 222534 222325 221796 220972 220260 219882 219794 219945 220219 220163 219231 217506 215854 215146 215431 216007 216244 216156 216172
53142 216172 216437 216498 215789 214408 213145 212551 212258 211566 210555 210080 210568 211379 211646 211380 211281 211708 212278 212438
53124 212438 212056 211439 211036 211188 211858 212639 213165 213557 214247 215366 216481 216960 216502 215358 214213 213723 213954
53107 213954 214284 214030 213099 211853 210527 209103 207630 206263 205054 204120 203971 205140 207323 209320 210066 209408
53091B09408j632k170k221j540l19O97R73O44J00m60r03j040q65o44n85o16o39
53074A98188p31r69j192j055l15Q87J908J986J025j70p39o46l99j87J54M62K90
53057A98497l37q29q33o15m67l60k68l57n71n61j87L70J079K000K646K213Q10
53040B02230l78n62l07l90n63k42K63K38j44j53O4m45j821k864k541j283k50R6
53022A90948J98M58O36L23l17n63l5O26M25o03j287q47N2K95j72o01p30r19j132
53003A86755q38l8M94K84k47n71p02p85o56k80p3l34p42q83q62r60j032p38j63
52984A77629L06N54P96J092J237J080O93K29j24j62J77O49R60J144J481K049K506
52967A92296K422J733Q60L71M41P05P15M84L42L69K67j46o34r04r97j121j303
$$ plain form
53091 209408 207776 205606 203385 201845 201526 202223 203196 203840 203940 203480 202577 201537 200672 200028 199443 198827 198188
53074 198188 197457 196488 195296 194241 193926 194813 196721 198707 199732 199562 198823 198177 197778 197591 197745 198207 198497
53057 198497 198160 197331 196498 195883 195416 195056 194788 194431 193860 193299 193112 193482 194561 196561 199207 201420 202230
53040 202230 201852 201290 200983 200593 200030 199788 200051 200289 200145 199992 200056 199611 197790 194926 192385 191102 190852 190948
53022 190948 191146 191604 192240 192563 192246 191683 191648 192274 192699 192096 190809 189962 190014 190309 190137 189536 188806 187887 186755
53003 186755 185917 185879 186373 186657 186410 185839 185137 184352 183696 183416 183343 183009 182267 181384 180522 179562 178530 177792 177629
52984 177629 177935 178489 179285 180377 181614 182694 183387 183616 183492 183330 183507 184156 185116 186260 187741 189790 192296
52967 192296 194718 196451 197311 197682 198123 198828 199543 200027 200369 200738 201005 200859 200225 199321 198324 197203 195900
52950A95900j418j380j155p28k48m8k98p69j114j233j244j200j066q62o81n55
52934A81901m37l04j41P2L57O40P31L80m83j488j954j562p50j56J74N80Q75L96
52916A78831q39j710j250R6J071J145Q69Q19Q90P10K85l7p4k7k15o47r01n84Q3
52897A78515L88N0l54j62M63P96N77K50K32M04M83M73M75L99O9m69r60j205j163
52878A79261r11n98m18m84o73o29o2Q36J425J227M79j37l23l12j92M55J814L173
52860A83931L562K891J978J512J447J469J496J494J299Q48L98J86Q6j99p54j404
52844B00240j963k304k334k089j806j713j749j648j317j003r86j204j270r44m13
52829A77497k2K18N81J131J553J591J398J224J009O06J87M7P1j71p14j050p96
$$ plain form
52950 195900 194482 193102 191947 191219 190971 190923 190625 189856 188742 187509 186265 185065 183999 183137 182456 181901
52934 181901 181464 181160 181019 181091 181448 182088 182819 183199 182716 181228 179274 177712 176962 176806 176980 177560 178435 178831
52916 178831 177992 176282 175032 175128 176199 177344 178213 179032 179922 180632 180917 180880 180806 180779 180564 179917 179016 178432 178515
52897 178515 178903 178953 178599 178437 178900 179696 180273 180523 180755 181159 181642 182115 182590 182989 183058 182589 181629 180424 179261
52878 179261 178350 177752 177334 176850 176177 175548 175486 176322 177747 178974 179453 179316 178993 178681 178489 178944 180758 183931
52860 183931 187493 190384 192362 193874 195321 196790 198286 199780 201079 201927 202325 202511 202597 202398 201644 200240
52844 200240 198277 195973 193639 191550 189744 188031 186282 184634 183317 182314 181328 180124 178854 177910 177497
52829 177497 177475 177693 178274 179405 180958 182549 183947 185171 186180 186786 186973 187020 187091 186920 186206 185156 184360
52812A84360k18J47J62J34L45P87J277J684J964K095J964J358J99j180k203k596
52796A90279k656k893l415l835l685k801j376J61J264J431N16j011k284k638k102
52781A64955j199l53M09J161J759J950J664J063L88j30l30k25J5K66N47Q06Q45
52764A73591N79K76K43M02M01J38q1N8N19R56R95N04k76q36p88j65O02J068J019
52745A79205O23L24M00O23N62K81L64R82J527J428R60P10O23K20m75r19q41m22
52727A86175K32J075J642J323L20m53n51m23m61m31j76j30n75j044j041q32q88
52710A83762j014p68l88n41j308k107k532k641k481j913r76nP42J222J431J368
52694A71851J193J031P32J63l90m62p0L17M20M31N89Q83J181J408J503J432J230
$$ plain form
52812 184360 184142 184289 184451 184585 184930 185717 186994 188678 190642 192737 194701 196059 196258 195078 192875 190279
52796 190279 187623 184730 181315 177480 173795 170994 169618 169779 171043 172474 172990 171979 169695 167057 164955
52781 164955 163756 163403 163812 164973 166732 168682 170346 171409 171797 171667 171337 171112 171127 171393 171940 172746 173591
52764 173591 174170 174446 174689 175091 175492 175630 175549 175607 176126 177082 178077 178581 178305 177469 176681 176516 177118 178186 179205
52745 179205 179828 180152 180552 181175 181737 182018 182382 183364 184891 186319 187279 187989 188612 188832 188357 187438 186597 186175
52727 186175 186407 187482 189124 190447 190767 190314 189763 189340 188879 188448 188272 188142 187567 186523 185482 184650 183762
52710 183762 182748 181980 181592 181051 179743 177636 175104 172463 169982 168069 167093 167088 167830 169052 170483 171851
52694 171851 173044 174075 174807 174970 174580 174118 174048 174365 174785 175216 175805 176688 177869 179277 180780 182212 183442
52677A83442Q83L36k26l29J71O97O22R1k95m21n93p52n12rJ31j32m7P50J559J671
52657A87037J400J446J780J848J579J399J451J481J461J617J831J629R48L70L32
52642B07609M78J34q65k069k930l150k688j761q25l58n27j062j421j163k67Q33
52626A89968J582J819J765J598J198M97j93n11n66p71j088r68k33M40L43k51m80
52609A94149j77r3o46j183q75M0N64K39m04p13o76o89q90r92o15L02J323J735
52591A90399J210K17m01k97J30L49K93K63M33O26N68K72J54N93J398J882J657
52574A99746J113P98O68L20k10n20n55n93n35O3R92J243L50p73r51k88J28k06
52556B00790o79n95n7L75M19K45O3j86p29j477j804j075M05J448J233K17o20r86
$$ plain form
52677 183442 184325 184661 184435 184106 184277 184974 185596 185687 185392 184971 184378 183626 183114 183105 183236 183104 183057 183807 185366 187037
52657 187037 188437 189883 191663 193511 195090 196489 197940 199421 200882 202499 204330 205959 206907 207277 207609
52642 207609 208087 208221 207356 205287 202357 199207 196519 194758 193933 193575 193048 191986 190565 189402 189135 189968
52626 189968 191550 193369 195134 196732 197930 198427 198234 197723 197157 196386 195298 194330 194097 194537 194880 194629 194149
52609 194149 193972 193879 193233 192050 191175 191215 191779 192018 191614 190901 190225 189536 188646 187654 187039 187341 188664 190399
52591 190399 191609 191826 191425 191128 191258 191607 191900 192163 192596 193222 193790 194062 194216 194809 196207 198089 199746
52574 199746 200859 201657 202325 202645 202435 201915 201360 200767 200232 200295 201287 202530 202880 202107 201156 200868 200996 200790
52556 200790 200111 199516 199459 199834 200253 200498 200561 200375 199646 198169 196365 195290 195695 197143 198376 198593 197973 196987
52538A96987j169j118m82M35P40K20k37M9N55M63L1K10J140J833J467L81m51m96
52520B00558M6O69R82Q95O86P01R48J073J002J215K083L066L174K243J197Q39
52504B21377Q07K89o62j181q73l49k58m29l97l03p03j608k306k232j621j113r57
52487B07481q29l50M16J037J227J112R79Q48N68K34K00N85J039J193J097J046
52471B17883J196J582K221K877K967K134Q65J49M76J359J933J727R53J68k50m37
52455B37803p50j194j398j296j368j861k243j997j537j633k166k296j829j458
52441B14777j547j589j198p78p04o00n6N60O70L59L5l43r69j487j368q23n53o72
52423B03714o69l54p3J13O58J639K338K145J369O92K47j87m37l5R61J791J884
$$ plain form
52538 196987 195818 194700 194218 194653 195393 195613 195376 195425 195980 196443 196474 196684 197824 199657 201124 201505 201054 200558
52520 200558 200604 201273 202255 203150 203836 204537 205485 206558 207560 208775 210858 213924 217098 219341 220538 221377
52504 221377 222184 222473 221811 220630 219757 219408 219150 218721 218324 218021 217318 215710 213404 211172 209551 208438 207481
52487 207481 206652 206302 206718 207755 208982 210094 211073 211921 212489 212723 212923 213508 214547 215740 216837 217883
52471 217883 219079 220661 222882 225759 228726 230860 231725 231874 232350 233709 235642 237369 238322 238490 238240 237803
52455 237803 237053 235859 234461 233165 231797 229936 227693 225696 224159 222526 220360 218064 216235 214777
52441 214777 213230 211641 210443 209665 208961 208361 208305 208865 209535 209894 209929 209586 208617 207130 205762 204939 204386 203714
52423 203714 203045 202691 202618 202731 203389 205028 207366 209511 210880 211572 211819 211632 211195 211160 212121 213912 215796
52406B15796J602J781K722L856M452M384M104L983L936L688L115K207R42n46j815
52391B54207k393k232j709j297j325j868k643l062k675j589l66M42N67P1n79o78
52375B32871J11J311K136K413K608K980L199K899K249J694J405J204Q25J20q11
52360B57214j516j537j005o31q11j072p06K08P87M12n92j338j289o53o2K1l12
52343B47118n51l00L02P26O48L51M47J154K044K542K647K873L470L983L919L516
52327B74889L526M221N086N524N559N582N713N659N137M250L416K975K826K542
52313C36905J936J454J718K702L757M420M826N148N111M438L537L219L760M611
52299C87542N047M858M382M015L839L594L010K159J380Q47M15j1k30r1J17o6o10
$$ plain form
52406 215796 217398 219179 221901 225757 230209 234593 238697 242680 246616 250304 253419 255626 256568 256022 254207
52391 254207 251814 249582 247873 246576 245251 243383 240740 237678 235003 233414 233048 233490 234057 234128 233549 232871
52375 232871 232982 234293 236429 238842 241450 244430 247629 250528 252777 254471 255876 257080 257905 258025 257214
52360 257214 255698 254161 253156 252525 251714 250642 249936 250144 250931 251343 250751 249413 248124 247471 247409 247430 247118
52343 247118 246567 246267 246569 247295 247943 248294 248741 249895 251939 254481 257128 260001 263471 267454 271373 274889
52327 274889 278415 282636 287722 293246 298805 304387 310100 315759 320896 325146 328562 331537 334363 336905
52313 336905 338841 340295 342013 344715 348472 352892 357718 362866 367977 372415 375952 379171 382931 387542
52299 387542 392589 397447 401829 405844 409683 413277 416287 418446 419826 420673 421088 421077 420847 420756 420873 420807 420197
52282D20197r85q53m95l62m28k65L13R76J300J270J180J207J301J488J926K598
52266D30368L226L665M014M154L625K426J574K139L792N039M984M146L443L117
52252D79712L003L130L463L597L337L141L387L600L045J937J210J266J582J614
52238E17024J431J359J495J769K123K507K934L538M251M562M012K924K214K368
52224E54511L015L531L710L714L773L953M030L634K806K249K558L345L683L394
52210F01906L200L564M080M293M345M523M707M755M876N116N018M323L623L668
52196F61997M280M636M448M214M329M542M457M125L848L693L390K696J739J009
52182G13403Q19P84R8j447l036l738l558l240l191l150k950k953l490m229m508
$$ plain form
52282 420197 419212 418359 417864 417502 417074 416809 417122 418098 419398 420668 421848 423055 424356 425844 427770 430368
52266 430368 433594 437259 441273 445427 449052 451478 453052 455191 458983 464022 469006 473152 476595 479712
52252 479712 482715 485845 489308 492905 496242 499383 502770 506370 509415 511352 512562 513828 515410 517024
52238 517024 518455 519814 521309 523078 525201 527708 530642 534180 538431 542993 547005 549929 552143 554511
52224 554511 557526 561057 564767 568481 572254 576207 580237 583871 586677 588926 591484 594829 598512 601906
52210 601906 605106 608670 612750 617043 621388 625911 630618 635373 640249 645365 650383 654706 658329 661997
52196 661997 666277 670913 675361 679575 683904 688446 692903 697028 700876 704569 707959 710655 712394 713403
52182 713403 714222 715006 715104 713657 710621 706883 703325 700085 696894 693744 690794 687841 684351 680122 675614
52167F75614m088l322k566j756o59O34J692K212K282K143J887J572J401J458J425
52152F79929R06O9m95n29k89J58J154K677L834L704K441J077L99M11P10R01P29
52135F97786K09l36o42q20j018r53j34J469L322M862N886O548P218Q219R367R967
52119G50950R606Q779Q251Q032P507O458N221L843J955l11k010k482k267k360
52105H01172k938l330l003k063q70L45J435K265K778L015L088L152L281L268K692
52090H14287J399k29j660k671l315l668l870m193m661m769l937k400j168r88j574
52075G76583k043j910j401r26n42m7O24J207J423J309J221J440J813J867J355
52060G81973O23L58Q68J727K195J943J248N70J51m3k44p74j710k570k679k023
$$ plain form
52167 675614 671526 668204 665638 663882 663223 663857 665549 667761 670043 672186 674073 675645 677046 678504 679929
52152 679929 680835 680904 680409 679880 679591 679749 680903 683580 687414 691118 693559 694636 695035 695446 696156 697057 697786
52135 697786 697995 697659 697017 696197 695179 694226 694092 695561 698883 703745 709631 716179 723397 731616 740983 750950
52119 750950 760556 769335 777586 785618 793125 799583 804804 808647 810602 810291 808281 805799 803532 801172
52105 801172 798234 794904 791901 789838 788968 789313 790748 793013 795791 798806 801894 805046 808327 811595 814287
52090 814287 815686 815457 813797 811126 807811 804143 800273 796080 791419 786650 782713 780313 779145 778157 776583
52075 776583 774540 772630 771229 770303 769761 769714 770338 771545 772968 774277 775498 776938 778751 780618 781973
52060 781973 782596 782954 783822 785549 787744 789687 790935 791505 791656 791613 791369 790595 788885 786315 783636 781613
52044G81613j421j603k395l121l475l607l555l269l007l109l340l006j876n00
52030G44329N40J234J798K209K434K700L270M042M628M647L938K839K280L021
52016G83909M616N659N399M592M345M689M914M743M407L770K313K8k411m501o369
52001H20103q219r901j1309j2656j4072j5230j5713j5527j4966j4275j3584j3017
51989F61634j2608j2197j1612j0914j0406j0373j0771j1134j0903j0041r191q934
51977E32550r069q982q605q455q708q788q132o843n301l567j597K69J568K355
51963D58695L179M444O018P349P826P200N933M908M459L924K536O28o85r43q97
$$ plain form
52044 781613 780192 778589 776194 773073 769598 765991 762436 759167 756160 753051 749711 746705 744829 744329
52030 744329 744869 746103 747901 750110 752544 755244 758514 762556 767184 771831 775769 778608 780888 783909
52016 783909 788525 794184 799583 804175 808520 813209 818123 822866 827273 831043 833356 833384 830973 826472 820103
52001 820103 811884 801983 790674 778018 763946 748716 733003 717476 702510 688235 674651 661634
51989 661634 649026 636829 625217 614303 603897 593524 582753 571619 560716 550675 541484 532550
51977 532550 523481 514499 505894 497439 488731 479943 471811 464968 459667 456100 454503 454772 456340 458695
51963 458695 461874 466318 472336 479685 487511 494711 500644 505552 510011 513935 516471 517099 516414 515471 514574
$$ [...]
##END NTUPLES=NMR SPECTRUM
##END=
