
##TITLE=AC1220_Punto_6074643_tWov9xRRku
##JCAMPDX= 6.0         $$ Bruker NMR JCAMP-DX V2.0
##DATA TYPE= NMR SPECTRUM
##DATA CLASS= NTUPLES
##ORIGIN= BRUKER
##OWNER= Administrator
$$ 1.72 TOPSPIN		Version 2.1
$$ 2012-05-07 20:00:21.890 -0500  Administrator@TOPSPIN
$$ Compression mode = diff/dup
##.OBSERVE FREQUENCY= 400.13188235
##.OBSERVE NUCLEUS= ^1H
##.ACQUISITION MODE= SIMULTANEOUS (DQD)
##.ACQUISITION SCHEME= undefined
##.AVERAGES= 8
##.DIGITISER RES= 22
##SPECTROMETER/DATA SYSTEM= spect
##.PULSE SEQUENCE= zg30
##.SOLVENT NAME= COFFEE_meoh
##.SHIFT REFERENCE= INTERNAL, COFFEE_meoh, 1, 14.98061
##AUDIT TRAIL= $$ (NUMBER, WHEN, WHO, WHERE, PROCESS, VERSION, WHAT)
$$ ##TITLE= Audit trail, TOPSPIN		Version 2.1
$$ ##JCAMPDX= 5.01
$$ ##ORIGIN= Bruker BioSpin GmbH
$$ ##OWNER= Administrator
$$ $$ C:\Bruker\TOPSPIN/data/COFFEE/nmr/AC1220_Punto_6074643_tWov9xRRku/10/pdata/1/auditp.txt
$$ ##AUDIT TRAIL=  $$ (NUMBER, WHEN, WHO, WHERE, PROCESS, VERSION, WHAT)
(   1,<2012-05-07 20:00:14.187 -0500>,<Administrator>,<TOPSPIN>,<go>,<TOPSPIN 2.1>,
      <created by zg
	started at 2012-05-07 19:59:07.546 -0500,
	POWCHK enabled, PULCHK disabled,
       configuration hash MD5:
       AF F2 23 6B 01 CD 40 DD E5 A1 38 A0 06 EA F7 77
       data hash MD5: 64K
       DD CC 65 51 97 C5 A3 E8 F1 AA 15 0B 2A 88 58 81>)
(   2,<2012-05-07 20:00:17.531 -0500>,<Administrator>,<TOPSPIN>,<proc1d>,<TOPSPIN 2.1>,
      <Start of raw data processing
       efp LB = 0 FT_mod = 6 PKNL = 1 PHC0 = 0 PHC1 = 0 SI = 32K 
       data hash MD5: 32K
       EC 19 88 2D 71 A9 B1 EB D7 C5 DB B3 26 56 2D DB>)
(   3,<2012-05-07 20:00:17.921 -0500>,<Administrator>,<TOPSPIN>,<proc1d>,<TOPSPIN 2.1>,
      <pk PHC0 = 209.8004 PHC1 = 0 
       data hash MD5: 32K
       87 A4 0C A1 E3 0B A2 66 92 B1 4E EB D8 29 60 35>)
(   4,<2012-05-07 20:00:18.203 -0500>,<Administrator>,<TOPSPIN>,<proc1d>,<TOPSPIN 2.1>,
      <abs ABSG = 1 
       data hash MD5: 32K
       85 E6 15 E8 A3 4E 23 ED A6 AA 3C 0F 8A 11 FE D3>)
(   5,<2012-05-07 20:00:18.234 -0500>,<Administrator>,<TOPSPIN>,<proc1d>,<TOPSPIN 2.1>,
      <abs ABSG = 2 
       data hash MD5: 32K
       0A 20 5D B5 68 9A F8 63 18 48 0F 6B 3A FE 29 5B>)
(   6,<2012-05-07 20:00:18.265 -0500>,<Administrator>,<TOPSPIN>,<proc1d>,<TOPSPIN 2.1>,
      <abs ABSG = 3 
       data hash MD5: 32K
       9A F2 90 33 EF 5C 2F B7 86 96 DE A7 EF 82 CD FE>)
(   7,<2012-05-07 20:00:18.296 -0500>,<Administrator>,<TOPSPIN>,<proc1d>,<TOPSPIN 2.1>,
      <abs ABSG = 4 
       data hash MD5: 32K
       75 26 41 20 A1 DA 94 09 35 69 C2 B5 7A B0 C8 CF>)
(   8,<2012-05-07 20:00:18.328 -0500>,<Administrator>,<TOPSPIN>,<proc1d>,<TOPSPIN 2.1>,
      <abs ABSG = 5 
       data hash MD5: 32K
       10 84 EC 40 1D 84 94 32 B8 95 95 DF D7 FF 70 F8>)
$$ ##END=
$$ 
$$ $$ hash MD5
$$ $$ 6F 7F 9C 82 63 AE DC F1 64 45 0F 2C 48 D3 9E 33
##$RELAX= 
##$RELAX= 
##$RELAX= 
##$RELAX= 
##$RELAX= 
##$RELAX= 
##$RELAX= 
$$ Bruker specific parameters
$$ --------------------------
$$ [...]
##$TP= (0..7)
150 150 150 150 150 150 150 150
##$TP07= 0
##$TPNAME0= <>
##$TPNAME1= <>
##$TPNAME2= <>
##$TPNAME3= <>
##$TPNAME4= <>
##$TPNAME5= <>
##$TPNAME6= <>
##$TPNAME7= <>
##$TPOAL= (0..7)
0.5 0.5 0.5 0.5 0.5 0.5 0.5 0.5
##$TPOFFS= (0..7)
0 0 0 0 0 0 0 0
##$TUNHIN= 0
##$TUNHOUT= 0
##$TUNXOUT= 0
##$USERA1= <user>
##$USERA2= <user>
##$USERA3= <user>
##$USERA4= <user>
##$USERA5= <user>
##$V9= 5
##$VALIST= <valist>
##$VCLIST= <CCCCCCCCCCCCCCC>
##$VD= 0
##$VDLIST= <DDDDDDDDDDDDDDD>
##$VPLIST= <PPPPPPPPPPPPPPP>
##$VTLIST= <TTTTTTTTTTTTTTT>
##$WBST= 1024
##$WBSW= 4
##$XGAIN= (0..3)
0 0 0 0
##$XL= 0
##$YL= 0
##$YMAX_a= 522153
##$YMIN_a= -632927
##$ZGOPTNS= <>
##$ZL1= 120
##$ZL2= 120
##$ZL3= 120
##$ZL4= 120
##$ABSF1= 14.98061
##$ABSF2= -5.57192
##$ABSG= 5
##$ABSL= 3
##$ALPHA= 0
##$AQORDER= 0
##$ASSFAC= 0
##$ASSFACI= 0
##$ASSFACX= 0
##$ASSWID= 0
##$AUNMP= <proc_prof1d_extract_pilot.lims>
##$AXLEFT= 0
##$AXNAME= <>
##$AXNUC= <1H>
##$AXRIGHT= 0
##$AXTYPE= 0
##$AXUNIT= <>
##$AZFE= 0.1
##$AZFW= 0.1
##$BCFW= 0
##$BC_mod= 0
##$BYTORDP= 0
##$COROFFS= 0
##$CY= 15
##$DATMOD= 1
##$DC= 0
##$DFILT= <>
##$DTYPP= 0
##$F1P= 0
##$F2P= 0
##$FCOR= 0.5
##$FTSIZE= 32768
##$FT_mod= 6
##$GAMMA= 0
##$GB= 0
##$INTBC= 1
##$INTSCL= 1
##$ISEN= 128
##$LB= 0
##$LEV0= 0
##$LPBIN= 0
##$MAXI= 10000
##$MC2= 0
##$MEAN= 0
##$ME_mod= 0
##$MI= 0
##$NCOEF= 0
##$NC_proc= -8
##$NLEV= 6
##$NOISF1= 0
##$NOISF2= 0
##$NSP= 0
##$NTH_PI= 0
##$NZP= 0
##$OFFSET= 14.98061
##$PC= 1
##$PHC0= 209.8004
##$PHC1= 0
##$PH_mod= 1
##$PKNL= yes
##$PPARMOD= 0
##$PPDIAG= 0
##$PPIPTYP= 0
##$PPMPNUM= 2147483647
##$PPRESOL= 1
##$PSCAL= 4
##$PSIGN= 0
##$PYNMP= <proc.py>
##$REVERSE= no
##$SF= 400.13
##$SI= 32768
##$SIGF1= 0
##$SIGF2= 0
##$SINO= 400
##$SIOLD= 32768
##$SPECTYP= <>
##$SREGLST= <1H.CDCl3>
##$SSB= 0
##$STSI= 32768
##$STSR= 0
##$SW_p= 8223.68421052632
##$SYMM= 0
##$S_DEV= 0
##$TDeff= 65536
##$TDoff= 0
##$TI= <>
##$TILT= no
##$TM1= 0
##$TM2= 0
##$TOPLEV= 0
##$USERP1= <user>
##$USERP2= <user>
##$USERP3= <user>
##$USERP4= <user>
##$USERP5= <user>
##$WDW= 1
##$XDIM= 32768
##$YMAX_p= 462004049
##$YMIN_p= -752803
##$CURPLOT= <Network HP LaserJet P1505>
##$CURPRIN= <$Network HP LaserJet P1505>
##$DFORMAT= <normdp>
##$LAYOUT= <+/1D_H.xwp>
##$LFORMAT= <normlp>
##$PFORMAT= <normpl>
##$SURQMSG= 1
$$ End of Bruker specific parameters
$$ ---------------------------------
##NTUPLES= NMR SPECTRUM
##VAR_NAME=  FREQUENCY,     SPECTRUM/REAL,   SPECTRUM/IMAG
##SYMBOL=    X,             R,               I
##VAR_TYPE=  INDEPENDENT,   DEPENDENT,       DEPENDENT
##VAR_FORM=  AFFN,          ASDF,            ASDF
##VAR_DIM=   32768,         32768,           32768
##UNITS=     HZ,            ARBITRARY UNITS, ARBITRARY UNITS
##FACTOR=    0.250966925370066, 1,           1
##FIRST=     8223.43324360095, -8845,        7465
##LAST=      0,             1854,            -8334
##MIN=       0,             -752803,         0
##MAX=       8223.43324360095, 462004049,    0
$$ Real data points
##PAGE= N=1
##DATA TABLE= (X++(R..R)), XYDATA
$$ [...]
19534a29494k896p7894j40011b2985o8496k4511A16263i976j68768j08068J34494
$$ -129494 -132390 -210284 -350295 -22985 -91481 -115992 116263 -9976 -178744 -286812 -152318
19523a52318l23012a51635d0031a8497A59246M92a42567j13671b2741k49888e044
$$ -152318 -475330 -151635 -40031 -18497 159246 159738 -142567 -256238 -22741 -272629 -5044
19511i5904n8734E4668L6994K9985b20323A63502b16352A59875A1283a85000o113
$$ -95904 -154638 54668 91662 121647 -220323 163502 -216352 159875 11283 -185000 -191113
19500a91113c8579I0420k5721f471q5983o1099E2413d725D8017a74488A38344
$$ -191113 -38579 90420 64699 -6471 -92454 -153553 52413 -4725 48017 -174488 138344
19488b0909j42121A83914a5710A53795b69623G9194L1170j4093d0093A95668b26250
$$ -20909 -163030 183914 -15710 153795 -269623 79194 110364 96271 -40093 195668 -226250
19476d8344A42230n6993d5499A9981b0728j52775e6072A00531a73417E315J91683
$$ -48344 142230 85237 -45499 19981 -20728 -173503 -56072 100531 -173417 5315 196998
19465A96998h2829j31255A1649J17715i575H1528g9342o2685a935q5756B346d723
$$ 196998 -82829 -214084 11649 129364 -9575 81528 -79342 -142027 -1935 -87691 2346 -4723
19452f0600A91989g1576k71847i2640A06642n898J70595b25028a00825A1927K8295
$$ -60600 191989 -71576 -343423 -92640 106642 100744 271339 -225028 -100825 11927 40222
19441D0222a94226a8197j52703O2176B35433c41096O2565n4497A70811b02804
$$ 40222 -194226 -18197 -170900 -108724 235433 -341096 -278531 -333028 170811 -202804
19430b09980k09946e0337j94903J18315j10516J7424p2223J23445A3103P2795
$$ -209980 -419926 -50337 -245240 -126925 -237441 -220017 -292240 -168795 13103 85898
19420H5898a06249j18245L8119p850i0468d275k64790b1327A304J00935a07132
$$ 85898 -106249 -224494 -186375 -194225 -90468 -4275 -269065 -21327 1304 102239 -107132
19408c84031c6836j1384B35851f7011b6347l3065j12972e0856A69153B9136b34804
$$ -384031 -36836 -48220 235851 -67011 -26347 -59412 -172384 -50856 169153 29136 -234804
19396a38394C2731P6108D3864c97651J31484a15652p694o1845P3837A76504D9223
$$ -138394 32731 108839 43864 -397651 -266167 -115652 -123346 -185191 -111354 176504 49223
19384B75027C0212b25453D4254a32578O351M6175q4859G861e0193j84690N9450
$$ 275027 30212 -225453 44254 -132578 -126227 -80052 -164911 7861 -50193 -234883 -175433
19373a75433O4286j2100I8237a75893k18757b1889A02640g7268B64667A08363
$$ -175433 -111147 -123247 98237 -175893 -394650 -21889 102640 -77268 264667 108363
19362H4132b7814D6410c167j74433n1510N5763G1785K7870b12913I035K82993
$$ 84132 -27814 46410 -3167 -177600 -229110 -173347 71785 99655 -212913 9035 292028
19351B92028b08466A51539e0983k9008j07991l9121I5071g4073A4700J66864a29146
$$ 292028 -208466 151539 -50983 -79991 -187982 -227103 95071 -74073 14700 181564 -129146
19339F4691O2450R0401b06254b076B88965d6334B55935a33084d2892E7774a23553
$$ 64691 127141 217542 -206254 -2076 288965 -46334 255935 -133084 -42892 57774 -123553
19327A05196c391p8904B96440b7051k14626A43816d01664k206H8625b72667A39215
$$ 105196 -3391 -82295 296440 -27051 -241677 143816 -401664 -403870 88625 -272667 139215
19315h4656C5259R0161b55968p529P5131A6945a76373K9100L85n101k25997a20385
$$ -84656 35259 125420 -255968 -263497 -188366 16945 -176373 -147273 -146888 -151989 -377986 -120385
19302f3391G4044b68500R7358f8562j17147J7463m0630j16999A32504c53614g012
$$ -63391 74044 -268500 -171142 -68562 -185709 -168246 -208876 -325875 132504 -353614 -7012
19290a88287r2751M5023o486i9008k17548a01930A64262c26710p480B42362b03471
$$ -188287 -281038 -236015 -242501 -99008 -316556 -101930 164262 -326710 -334190 242362 -203471
19278H8324b78646K1880P153g4820k00931j6049E9078b7184p4271d4008l66157
$$ 88324 -278646 -256766 -249613 -74820 -275751 -291800 59078 -27184 -101455 -44008 -410165
19267d10165B65359N0190a8893j34529k6075N4767e0564F9035b68964A7673O5975
$$ -410165 265359 315549 -18893 -153422 -179497 -124730 -50564 69035 -268964 17673 83648
19256H3648a70553E3857a97612A51788a08319k45101D3339R3295J23378b96048
$$ 83648 -170553 53857 -197612 151788 -108319 -353420 43339 136634 260012 -296048
19245b31120I307Q6419a8846A26269a50136D3755f2377A25022B2482J06036J56025
$$ -231120 9307 95726 -18846 126269 -150136 43755 -62377 125022 22482 128518 284543
19234B84543n5504a62831L430B0134b16411B80347a01556r682I7326c5627B20366
$$ 284543 229039 -162831 -159401 20134 -216411 280347 -101556 -111238 97326 -35627 220366
19222b15818f9975H216a40992A29265a72781j0459N4510b0165j87623A28979o3890
$$ -215818 -69975 8216 -140992 129265 -172781 -183240 -128730 -20165 -207788 128979 65089
19211F5089d288A68466g7420c5757J2869C94019H4736a86310H9041Q0549a0188
$$ 65089 -4288 168466 -77420 -35757 -22888 394019 84736 -186310 89041 169590 -10188
19199b8315j44879H2183B3703c44295B27956J8039c1859n9992j5393k18460B36800
$$ -28315 -173194 82183 23703 -344295 227956 245995 -31859 -91851 -107244 -325704 236800
19187d5517k32257D04989A925O8918a06462B1069P2531J85266a06760l9057D1254
$$ -45517 -277774 404989 1925 70843 -106462 21069 93600 278866 -106760 -145817 41254
19175a26153k4078I8060j9594L6138d3729J7961q1022A76674b8998n7918A88908
$$ -126153 -150231 98060 78466 114604 -43729 -25768 -106790 176674 -28998 -86916 188908
19163A64950j2348a20793r2318i844A61677b33080B08550e2784B58325b68229
$$ 164950 152602 -120793 -213111 -9844 161677 -233080 208550 -52784 258325 -268229
19152C12553a03979o7333D820b32733b304j45356o0969I3767f9309j83874d8879
$$ 312553 -103979 -171312 4820 -232733 -2304 -147660 -208629 93767 -69309 -253183 -48879
19140a86439e0656p7885B10848B8967J26216N8390a74074B46579G997Q2839A0130
$$ -186439 -50656 -128541 210848 28967 155183 213573 -174074 246579 7997 90836 10130
19128e9187A0267J159c8029j13324H7485C759N57437f8258G4343b71910e451B33232
$$ -59187 10267 11426 -38029 -151353 87485 3759 561196 -68258 74343 -271910 -5451 233232
19115A00066a69543o0399F3730a33329F2396B6446g7543E7542b4478H7907J8526
$$ 100066 -169543 -229942 63730 -133329 62396 26446 -77543 57542 -24478 87907 106433
19104A06433e7996A58274L341G4205h7718A8852J48005e9054k86534K9139d3945
$$ 106433 -57996 158274 161615 74205 -87718 18852 166857 -59054 -345588 -316449 -43945
19092b11735B70670c50218B27038K7322q2481l0458g4141o4585o9050R2451j23486
$$ -211735 270670 -350218 227038 254360 171879 141421 -74141 -138726 -207776 -115325 -238811
19081b38811G6501g6545H830R1877g8188F4561d6194j27670A88148d40794c510
$$ -238811 76501 -76545 8830 100707 -78188 64561 -46194 -173864 188148 -440794 -3510
19069B02125a35514A04743b79088B26980A7683J55733a49483L4277q2884g7852
$$ 202125 -135514 104743 -279088 226980 17683 173416 -149483 -115206 -198090 -77852
19058C42470A7790a31937j41604B0114h5963B53191c28676J25762a2638j81049
$$ 342470 17790 -131937 -273541 20114 -85963 253191 -328676 -202914 -12638 -193687
19048a93687B17616a08745j98865c7612m52357K15283j02736m3236E6504a59601
$$ -193687 217616 -108745 -307610 -37612 -489969 -274686 -377422 -420658 56504 -159601
19037B8318a29474A81279A8083b2674B1138K5777b22374Q456k03267B4236b32530
$$ 28318 -129474 181279 18083 -22674 21138 46915 -222374 -213918 -417185 24236 -232530
19025B7783e4823G8986c5391j3764k83731B64169J22153a57913C17612a49771
$$ 27783 -54823 78986 -35391 -49155 -332886 264169 386322 -157913 317612 -149771
19014i2991a0265H7989k741M5259a27086a3836l3671j12949f6967D4500j0121
$$ -92991 -10265 87989 85248 130507 -127086 -13836 -47507 -160456 -66967 44500 34379
19003C4379a01408r5071k6380A0739a19193N2618K2822F5133j5681a99164e5341
$$ 34379 -101408 -196479 -222859 10739 -119193 -66575 -43753 65133 49452 -199164 -55341
18991F6973c50362d5552R077L943j45502D2258a30132k1005j83743K9952h9482
$$ 66973 -350362 -45552 -36475 -32532 -178034 42258 -130132 -151137 -334880 -304928 -89482
18979a45756I1431R3921c73810G8918l9168h100j0161A707a37064E6133i4858
$$ -145756 91431 185352 -373810 78918 39750 -8100 -18261 1707 -137064 56133 -94858
18967c10409J24335A82566a51026O9642c7330j65979e1083B78081g5109k00956
$$ -310409 -186074 182566 -151026 -81384 -37330 -203309 -51083 278081 -75109 -276065
18957b76065A76109a01073j2506B50875r0971a5798r4278K7609B61871E2227J25468
$$ -276065 176109 -101073 -113579 250875 159904 -15798 -110076 -82467 261871 52227 177695
18946A77695b2334E3676c6021A58202C331g986j7724j18526m0B42563C7694b87425
$$ 177695 -22334 53676 -36021 158202 3331 -7986 -25710 -144236 -144276 242563 37694 -287425
18933c041A4557K22211f8918B21126B0244a65983A46602G623h0827k78030B4969
$$ -3041 14557 236768 -68918 221126 20244 -165983 146602 7623 -80827 -358857 24969
18921B3248a5600j5645A14475a05803j331K1744l24510B12400g3303k24713B09615
$$ 23248 -15600 -31245 114475 -105803 -107134 -85390 -409900 212400 -73303 -298016 209615
18909A35922n3492c14268O8000B1604a00056j17327b94o8769k44098J52094H8468
$$ 135922 82430 -314268 -246268 21604 -100056 -217383 -294 -69063 -313161 -161067 88468
18897B8301a74372E5253M8603g3978F5892O6388e9181j75594A36134a26966j95787
$$ 28301 -174372 55253 103856 -73978 65892 132280 -59181 -234775 136134 -126966 -322753
18886c22753C7603g2373A525b63990A14536P0683b09057n1903J7067E3206N5070
$$ -322753 37603 -72373 1525 -263990 114536 185219 -209057 -260960 -243893 53206 108276
18875A08276b90319i6237L430A64434b01926f135j10683A63611F7907b3198j05782
$$ 108276 -290319 -96237 -92807 164434 -201926 -6135 -116818 163611 67907 -23198 -128980
18864a28980k9011P7089j12831A91078C6557a30934E9434d1921J9603C63569c74802
$$ -128980 -157991 -80902 -193733 191078 36557 -130934 59434 -41921 -22318 363569 -374802
18852a04215A28475m5539N0468E6103a37343e3868G2373m072a44800K035G83Q30
$$ -104215 128475 82936 133404 56103 -137343 -53868 72373 68301 -144800 -142765 783 1613
18840A613g125j82124A25949k4417a82036h8289b414j86775H0924P9973b14306
$$ 1613 -7125 -189249 125949 101532 -182036 -88289 -2414 -189189 80924 160897 -214306
18828B9950K41592K7367d9354j21878e8360q8990F5871b20490d476A24437J32194
$$ 29950 271542 298909 -49354 -171232 -58360 -147350 65871 -220490 -4476 124437 256631
18817B56631c8459l27813a72266k5699Q9869j99272A87300e1051D5484d9075j42446
$$ 256631 -38459 -366272 -172266 -197965 -108096 -307368 187300 -51051 45484 -49075 -191521
18806a91521B10554J53873j52001c3154I9359e6349A29560b6198C8089b11414
$$ -191521 210554 364427 212426 -33154 99359 -56349 129560 -26198 38089 -211414
18795C63432A51923g9953B34836a33551l6162a1875k3602q9259A20670b02835
$$ 363432 151923 -79953 234836 -133551 -169713 -11875 -35477 -124736 120670 -202835
18784C92715b60846D5937b26010C9275i6581a429A07945J63334m2520b8386j16939
$$ 392715 -260846 45937 -226010 39275 -96581 -1429 107945 271279 228759 -28386 -145325
18773a45325K2882j55155E1032b7105n5793l24L0315H104N2734A9157K71379B3698
$$ -145325 -122443 -277598 51032 -27105 -82898 -83222 -52907 8104 60838 19157 290536 23698
18760I9564G685c09219a10362L3599k10417g5871O213A04706c82014J73994c9400
$$ 99564 7685 -309219 -110362 -76763 -287180 -75871 -69658 104706 -382014 -208020 -39400
18748E7142c977G6501a14574A54016b27564H6969a12958j33693A18118M2451I398
$$ 57142 -3977 76501 -114574 154016 -227564 86969 -112958 -246651 118118 160569 9398
18736e5806a1239C52793b53237O0952h150A3859a66032g3505B50161C7497i0312
$$ -55806 -11239 352793 -253237 -192285 -8150 13859 -166032 -73505 250161 37497 -90312
18724i72I2554J07121B4332K10295b48403N1123G1457a51653c4455j17894o2142
$$ -972 92554 199675 24332 234627 -248403 -197280 71457 -151653 -34455 -152349 -214491
18713b14491g0045G1607b14227E815L8824b43832B3998a15199J9090E6074J83716
$$ -214491 -70045 71607 -214227 5815 44639 -243832 23998 -115199 -96109 56074 239790
18702B39790e09078a615D6303L11529A33101a76184j03710P4144D5461a68887
$$ 239790 -509078 -1615 46303 357832 133101 -176184 -279894 -205750 45461 -168887
18691B7354J84114m7996a91434d0621H5581J03268m7918a12990j04674J01859
$$ 27354 211468 163472 -191434 -40621 85581 188849 140931 -112990 -217664 -115805
18681a15805A7361Q6913C8589c7062A21609a52548N1525k8566o6468O1053j13125
$$ -115805 17361 104274 38589 -37062 121609 -152548 -101023 -129589 -196057 -135004 -248129
18670b48129I6680b20967J06047G0725a19374H4339a72518B65704k2240a58410
$$ -248129 96680 -220967 -114920 70725 -119374 84339 -172518 265704 243464 -158410
18659a90990c6870k63350A4538b63546a25617N3542K7976a8863G524b81076g1130
$$ -190990 -36870 -300220 14538 -263546 -125617 -72075 -44099 -18863 7524 -281076 -71130
18647B09293b53689g6683L0009l46797i906n7089i592A87604c1093B2836c8957
$$ 209293 -253689 -76683 -46674 -393471 -9906 -66995 -9592 187604 -31093 22836 -38957
18635A76203c5465C0027a10940j27603K7603A43699d2121C71207c32898f0119
$$ 176203 -35465 30027 -110940 -238543 -210940 143699 -42121 371207 -332898 -60119
18624b207j3352H4584j524J26057a49367B82127f7509k95240A80118e812l50196
$$ -2207 -15559 84584 83060 209117 -149367 282127 -67509 -362749 180118 -5812 -356008
18613c56008R1109a4513A97316d3559D3882d21369h0075q9595D5323b1762R453
$$ -356008 -264899 -14513 197316 -43559 43882 -421369 -80075 -169670 45323 -21762 -12309
18602a2309B65081b20151Q1531j04527M3601k46658A27786c62579J09470H0795
$$ -12309 265081 -220151 -138620 -243147 -199546 -446204 127786 -362579 -253109 80795
18591a62579o6229e1625o5935f230A16997b21387k948N6727H0668a34733c0423
$$ -162579 -228808 -51625 -117560 -6230 116997 -221387 -224335 -167608 80668 -134733 -30423
18579I0488c2004C57559c357k51116C237a92442d2018H2900b9370A52187a15829
$$ 90488 -32004 357559 -3357 -254473 3237 -192442 -42018 82900 -29370 152187 -115829
18567a01199A33150a33945b3447r2255c3386l2605B02126a23494A23910c0825
$$ -101199 133150 -133945 -23447 -115702 -33386 -65991 202126 -123494 123910 -30825
18556A32924B9092a34450A44409h7146J9883A17823i5390p246K9415I6502a10880
$$ 132924 29092 -134450 144409 -87146 -67263 117823 -95390 -102636 -73221 96502 -110880
18544b64130A6325e96082A80740a1622q6837d2447B66852p4697b542l73968g65
$$ -264130 16325 -596082 180740 -11622 -98459 -42447 266852 192155 -2542 -376510 -765
18532c56603J34966f3063j86971m6223Q2925L9248m2176Q0247n0641R2373j53121
$$ -356603 -221637 -63063 -250034 -296257 -213332 -174084 -216260 -136013 -186654 -94281 -247402
18521b47402F3586J8009b83711B36802h8226A04246a93525G9640a92713a7073
$$ -247402 63586 81595 -283711 236802 -88226 104246 -193525 79640 -192713 -17073
18510a7689o5920B60863D9422a78575A13176e6629k43928i5899j92373d6222j8597
$$ -17689 -83609 260863 49422 -178575 113176 -56629 -300557 -95899 -288272 -46222 -64819
18499f4819l63333D8862h1640B20585a78553K3794d7458m9161I3636J12633G8200
$$ -64819 -428152 48862 -81640 220585 -178553 -154759 -47458 -96619 93636 206269 78200
18487F7698l3827b8051k27068a0623j82992h1972B19971H850e0166j96218A08859
$$ 67698 33871 -28051 -255119 -10623 -193615 -81972 219971 8850 -50166 -246384 108859
18475F0338b7090o8125o6488P0320D6370a92042f1409j55181B38123c41462a34408
$$ 60338 -27090 -95215 -161703 -91383 46370 -192042 -61409 -216590 238123 -341462 -134408
18463I5388a57187B63933j00305n3251i1471j69530R1025k429C0494a10061A39843
$$ 95388 -157187 263933 163628 110377 -91471 -261001 -169976 -172405 30494 -110061 139843
18451b0565A13992A3353a1317A21215a15166K4241A31712b09673g0440B22117
$$ -20565 113992 13353 -11317 121215 -115166 -90925 131712 -209673 -70440 222117
18440E9261a5553j81744R3218A87960I0749d5521B77476A25436M8690c77332a33348
$$ 59261 -15553 -197297 -104079 187960 90749 -45521 277476 125436 174126 -377332 -133348
18428a27197I9290J35373h43k08193m8272i3849E9655A5533h9395k33318G9881
$$ -127197 99290 234663 -843 -209036 -257308 -93849 59655 15533 -89395 -322713 79881
18416A21164b62840A80860M5430G3093b40250B0652e4702a8979k68451R7081P9717
$$ 121164 -262840 180860 226290 73093 -240250 20652 -54702 -18979 -287430 -190349 -110632
18405a10632l8302G0941L93782a5306n3326m95029a44941J3039j52063A74843
$$ -110632 -148934 70941 464723 -15306 -68632 -563661 -144941 -131902 -283965 174843
18394b26106J07591B02444H1957O4307b53366Q3645N8482B8138a91233B56239
$$ -226106 -118515 202444 81957 146264 -253366 -169721 -111239 28138 -191233 256239
18383a90243G9335D626g9331L1561k7377k43660a12328H090c77662A30509a85949
$$ -190243 79335 4626 -79331 -47770 -75147 -318807 -112328 8090 -377662 130509 -185949
18371D05416A24653M1314b3728l4370A11369b12520B49709D4584b89719E314K92346
$$ 405416 124653 165967 -23728 -58098 111369 -212520 249709 44584 -289719 5314 297660
18360B97660A29338m4440a8780k67544J02674g0533j32628H4258O2359F135Q4572
$$ 297660 129338 84898 -18780 -286324 -183650 -70533 -203161 84258 146617 6135 90707
18349I0707c13313A44462d31943e6522I09d10059H6P2978b1676h536j59739d5832
$$ 90707 -313313 144462 -431943 -56522 909 -410059 86 73064 -21676 -8536 -168275 -45832
18336a04252F470K38847A5872a21148J6699R370b842p7635A79807e7028p6947
$$ -104252 6470 245317 15872 -121148 -104449 -95079 -2842 -80477 179807 -57028 -133975
18325a33975d580j24349G8961a09041A00680J37388I1069b48409B72288j07224
$$ -133975 -4580 -128929 78961 -109041 100680 238068 91069 -248409 272288 165064
18315A65064b49793C44362a03183c9336E8521A275a75130B70654i6658j30362
$$ 165064 -249793 344362 -103183 -39336 58521 1275 -175130 270654 -96658 -227020
18305b27020d4428r8352J2633A1241b32620B32146b88188G762J52431b64559G0845
$$ -227020 -44428 -142780 -130147 11241 -232620 232146 -288188 7762 160193 -264559 70845
18293b89870e7555k84112A62388h0366j77976J02504j2767B77398K8126a10576
$$ -289870 -57555 -341667 162388 -80366 -258342 -155838 -168605 277398 305524 -110576
18282A33529A9930c373A49337j3903Q2185m9171m4166K5316a30704j53018B2142
$$ 133529 19930 -3373 149337 135434 217619 168448 124282 149598 -130704 -283722 22142
18270H5585R0256C2942e1388A32791l7266N641b54746j34203H3554K0319m6830
$$ 85585 175841 32942 -51388 132791 95525 101166 -254746 -388949 83554 103873 57043
18259E7043K8025i7334O711B88162a22474O0683k98303A19891a57053A46616j8608
$$ 57043 85068 -97334 -90623 288162 -122474 -61791 -360094 119891 -157053 146616 128008
18248A28008K08625j03547m926a528C06596F9259a22130A24092a90300e958A00360
$$ 128008 336633 233086 228160 -1528 306596 69259 -122130 124092 -190300 -5958 100360
18236I494K7034b27342p1082c0979B76112j05917b911C354J51487a76981o6981
$$ 9494 36528 -227342 -298424 -30979 276112 170195 -2911 3354 154841 -176981 -243962
18225b43962g3656F6776a76651K5264k74147J80508D29249I8822d49943b17978
$$ -243962 -73656 66776 -176651 -151387 -425534 -245026 429249 98822 -449943 -217978
18214B11936H0770b11624f2439A19614c567q3430I8100R2925A1260a04012k85710
$$ 211936 80770 -211624 -62439 119614 -3567 -86997 98100 191025 11260 -104012 -389722
18203c89722F2512J34677A0380K52874f5934B7607K5883J09752c9558j20692f6058
$$ -389722 62512 197189 10380 263254 -65934 27607 53490 163242 -39558 -160250 -66058
18191G5062i4692E6500a28671a8491A58017c4591j29522B73001a15097c3354l2539
$$ 75062 -94692 56500 -128671 -18491 158017 -34591 -164113 273001 -115097 -33354 -65893
18180f5893n0013N7770J5275k19129A52055F3576K7865A7635K13599b51835J06885
$$ -65893 -115906 -58136 -42861 -261990 152055 63576 91441 17635 231234 -251835 -144950
18169a44950B1422L7912h5508c1786F0471a17970B32375a58875j3455k65499D1382
$$ -144950 21422 59334 -85508 -31786 60471 -117970 232375 -158875 -172330 -437829 41382
18157c35824K6399G4956K9832f6777b4533A03920a96846b6322j07942m1447g0160
$$ -335824 -309425 74956 104788 -66777 -24533 103920 -196846 -26322 -134264 -175711 -70160
18145d3155B82261E1795h4012O110A82919O220a86707C87406A8324a83786B3513
$$ -43155 282261 51795 -84012 -77902 182919 189139 -186707 387406 18324 -183786 23513
18133F3621J17892o8631a58645M0267I6774b83203B5841c69154a70508h3594k65736
$$ 63621 181513 112882 -158645 -118378 96774 -283203 25841 -369154 -170508 -83594 -349330
18122c49330a03098j88481C6995a09030l0359I600N4409a58115d0547j38280B57364
$$ -349330 -103098 -291579 36995 -109030 -139389 9600 64009 -158115 -40547 -178827 257364
18110B8962J56039a27811A69230p9283l1032b42561J20616J5133j33915O7821
$$ 28962 185001 -127811 169230 89947 58915 -242561 -121945 -106812 -240727 -172906
18100a72906B70450a00572c6466q5173j07438O3800P1135k48524C01824a58440
$$ -172906 270450 -100572 -36466 -121639 -229077 -165277 -94142 -342666 301824 -158440
18089a2562B6189b7846k13236a10489b2790B0960K24230g1365A04442B0600K25199
$$ -12562 26189 -27846 -241082 -110489 -22790 20960 245190 -71365 104442 20600 245799
18078B45799a94975D9966M6174R036c7907I1151a19028q6463m0439O7617A38964
$$ 245799 -194975 49966 96140 105176 -37907 91151 -119028 -205491 -245930 -178313 138964
18066A70846e39509b29321A32806e8748q9589F4899f3447C47280A47539c60225
$$ 170846 -539509 -229321 132806 -58748 -148337 64899 -63447 347280 147539 -360225
18055c31605B1931M8416j3463M0420c8208l3563a2257A16941e8930o9213K0179
$$ -331605 21931 70347 56884 97304 -38208 -71771 -12257 116941 -58930 -128143 -107964
18044a07964b9412k74567C8078g9608a7928A30827b37940a0144o800j853K890
$$ -107964 -29412 -303979 38078 -79608 -17928 130827 -237940 -10144 -16944 -18797 -15907
18033a5907D10977a06995L0340j56223B21563b60400I3753B6800K22755a54124
$$ -15907 410977 -106995 -76655 -232878 221563 -260400 93753 26800 249555 -154124
18022a01429I6224j8319a38974B85371b06279P9708k5710P3365c4973m4286M321
$$ -101429 96224 77905 -138974 285371 -206279 -126571 -152281 -78916 -34973 -79259 -74938
18011g4938j73734j41888a32801M6232p9093a8497h585j40768j04941L6755Q2018
$$ -74938 -248672 -390560 -132801 -86569 -165662 -18497 -8585 -149353 -254294 -217539 -135521
18000a35521l2558f6862k05561a15590D7909a22659L664j07716K7130j8313B05816
$$ -135521 -168079 -66862 -272423 -115590 47909 -122659 -118995 -226711 -199581 -217894 205816
17988c208E9720N4946m1961K03095a56748C42558A04434a97726i6663m7256B72732
$$ -3208 59720 114666 72705 275800 -156748 342558 104434 -197726 -96663 -143919 272732
17976A37952J16420G5839K37822b58482a07160K6102B86188I0760a26999A0472
$$ 137952 254372 75839 313661 -258482 -107160 -81058 286188 90760 -126999 10472
17965G8589a1187j20901f1389A1234A026i1641A13713a40178A46598a69580j30366
$$ 78589 -11187 -132088 -61389 11234 1026 -91641 113713 -140178 146598 -169580 -299946
17954b99946a18986m7977A61146i8955d3666A13510m8367a38065j41174N2885
$$ -299946 -118986 -166963 161146 -98955 -43666 113510 65143 -138065 -279239 -226354
17944b26354A89023J00279f3522C28518I8648b44831M2799G6540L4953D7863c0700
$$ -226354 189023 289302 -63522 328518 98648 -244831 -202032 76540 111493 47863 -30700
17932C40422m5158C3764c80289A96165F2899J66635b02086C76561H7300a47542
$$ 340422 295264 33764 -380289 196165 62899 229534 -202086 376561 87300 -147542
17921E4729J50585r1103a19678k45879a23524C09358b97618P3506E4681P6444
$$ 54729 205314 114211 -119678 -365557 -123524 309358 -297618 -224112 54681 131125
17911A31125l0463a25513j1865B9353b04219d0401A19508c87686i6889o0644O3661
$$ 131125 100662 -125513 -137378 29353 -204219 -40401 119508 -387686 -96889 -157533 -93872
17900i3872k5144j31321J04106n545R834A22799j3107e7285o337D7320J30739
$$ -93872 -119016 -250337 -146231 -151776 -141942 122799 109692 -57285 -63622 47320 178059
17889A78059i4359k7760C6678M8881M9218l1954a9883B58683a28898d6691o774
$$ 178059 -94359 -122119 36678 85559 134777 102823 -19883 258683 -128898 -46691 -53465
17878e3465q5550A4985M3592K22314A5081a19083C10231B5120f6762E2951a84808
$$ -53465 -139015 14985 58577 280891 15081 -119083 310231 25120 -66762 52951 -184808
17866A65889E8918J0947a86765M1554P2339j5212A03273b17114M8476P0448A43154
$$ 165889 58918 69865 -186765 -145211 -72872 -88084 103273 -217114 -168638 -98190 143154
17854a58771L6577j1167c7173q2486H3472a46589j676E4358h4012k21145a44460
$$ -158771 -122194 -133361 -37173 -119659 83472 -146589 -148265 54358 -84012 -305157 -144460
17842A2438M2648K63150e1717a0536D2709L11506A13534D0806a08875b9236I7357
$$ 12438 55086 318236 -51717 -10536 42709 354215 113534 40806 -108875 -29236 97357
17830b00785c4975n5418n4638E6185g0430A19028R9045r395g110B93484B6819
$$ -200785 -34975 -90393 -145031 56185 -70430 119028 218073 208678 -7110 293484 26819
17818B88550a10822A6301L9867F804Q6885h5412b7231C53168e360k99477B96303
$$ 288550 -110822 16301 56168 6804 93689 -85412 -27231 353168 -5360 -304837 296303
17806c59321B32173b0584C51175c65248B95373F0557K32185k2253c31929f385
$$ -359321 232173 -20584 351175 -365248 295373 60557 292742 270489 -331929 -6385
17795g6458D2188L5544O3926a73715Q5259C43140I4636e9720D0037A2578R9827
$$ -76458 42188 77732 141658 -173715 -88456 343140 94636 -59720 40037 12578 112405
17784A12405K3700a91065A93676A8732B770Q2905b0317C67727P08I6360G299b36776
$$ 112405 136105 -191065 193676 18732 2770 85675 -20317 367727 368435 96360 7299 -236776
17771i00A9035K3780a29904A34208a65544A16612C7725a63617n384j18863a33828
$$ -900 19035 42815 -129904 134208 -165544 116612 37725 -163617 -169001 -287864 -133828
17759a82603C0114L5034E559K8705b68581e3353k90704H0824d37165H8367b1455
$$ -182603 30114 65148 5559 34264 -268581 -53353 -344057 80824 -437165 88367 -21455
17747d7226E5736J15775a27183A6921g5649j94853J22344a175p7594A00722J57230
$$ -47226 55736 171511 -127183 16921 -75649 -270502 -148158 -1175 -78769 100722 257952
17736B57952d3016D0826R519b9462o217j41234A34556a83414B9133J9374i5960
$$ 257952 -43016 40826 50345 -29462 -35679 -176913 134556 -183414 29133 48507 -95960
17724A52086p4649a7856B97522a14882A45784M6703E6711J41534g0615B0304K07912
$$ 152086 77437 -17856 297522 -114882 145784 192487 56711 198245 -70615 20304 228216
17713B28216a38062N8668k17536B71336c46840P9002A07515a47174f9861m5031
$$ 228216 -138062 -79394 -296930 271336 -346840 -267838 107515 -147174 -69861 -114892
17703a14892k7194D8638J06429a65637f7240l2312D4084K315e5562A28245a3694
$$ -114892 -142086 48638 155067 -165637 -67240 -99552 44084 46399 -55562 128245 -13694
17691A14976H68i135C8131K54202C9701J50248b49796b8167l4740H7670i1493
$$ 114976 868 -9135 38131 292333 39701 189949 -249796 -28167 -62907 87670 -91493
17679A43936J10803m7750k8196b75280A42842C3267I978a33469d5642B18502a00924
$$ 143936 254739 206989 178793 -275280 142842 33267 9978 -133469 -45642 218502 -100924
17667c06718K9810i0501r5208A18693j0079e8279A0005a78897J9963d4270E1517
$$ -306718 -276908 -90501 -185709 118693 108614 -58279 10005 -178897 -158934 -44270 51517
17655B8494L62078r6979d8431C72509f722C17299f3989F3952B0547a63573D00132
$$ 28494 390572 293593 -48431 372509 -6722 317299 -63989 63952 20547 -163573 400132
17643a2315E2592g5012B7986e7347A65748h2851B96153J28147j88873j03731O6181
$$ -12315 52592 -75012 27986 -57347 165748 -82851 296153 424300 235427 131696 197877
17632A97877E428O8182a14634N0644D43523a65400h0996G1353b79125I5690j3300
$$ 197877 5428 73610 -114634 -63990 443523 -165400 -80996 71353 -279125 95690 82390
17621H2390n165a14016C1509J06335B0329a07145e3191A7723N8790b2387e418
$$ 82390 77225 -114016 31509 137844 20329 -107145 -53191 17723 76513 -22387 -5418
17609A80490i7986A18114b02325A97779L1746c67D4736L76232A40390a28480o6012
$$ 180490 -97986 118114 -202325 197779 229525 -367 44736 420968 140390 -128480 -194492
17598a94492Q4300B40586p7545a21828L49B71209q7560C3209b36595F6092a26834
$$ -194492 -110192 240586 163041 -121828 -121479 271209 183649 33209 -236595 66092 -126834
17586B37209d9813r6503j30298J07109B41719C6723a01397B13652a44147O1746
$$ 237209 -49813 -146316 -276614 -169505 241719 36723 -101397 213652 -144147 -82401
17576h2401L35A05466K7194Q3583c49189A66040a11128G0745J0968k407l6688
$$ -82401 -82066 105466 132660 216243 -349189 166040 -111128 70745 81713 79306 42618
17565D2618A3485P2267b87601A54034a85929e2211j67023A35437K38170j24910
$$ 42618 13485 85752 -287601 154034 -185929 -52211 -219234 135437 373607 248697
17555B48697b86071D7520A6534E750e1943D63312b12525G7311j4030K68829A37029
$$ 248697 -286071 47520 16534 5750 -51943 463312 -212525 77311 63281 332110 137029
17543A984J48610K7663N9773a4199A7497N2358a45314A61121o7325K9602m2997
$$ 1984 150594 178257 238030 -14199 17497 69855 -145314 161121 93796 123398 80401
17532H0401A7191R9620I887J30143e9640B19786D4910J49717d9448A43912O0887
$$ 80401 17191 116811 9887 140030 -59640 219786 44910 194627 -49448 143912 204799
17521B04799a5407k54373D65053c51408D747b2033D08654H5772J53825M9532D3795
$$ 204799 -15407 -269780 465053 -351408 4747 -22033 408654 85772 239597 289129 43795
17509A24325E5396b02623A5792J7508Q8987j5768J56851m4101C2574d4296A85137
$$ 124325 55396 -202623 15792 33300 122287 106519 263370 219269 32574 -44296 185137
17497A46961Q801D0753R005J08388b25227i1021r2776f9176A51521c6959a3636
$$ 146961 155762 40753 49758 158146 -225227 -91021 -183797 -69176 151521 -36959 -13636
17485B902d0401j0389A20712d3137D57757j87824a4306G3825J29392k6382n1935
$$ 2902 -40401 -50790 120712 -43137 457757 269933 -14306 73825 203217 176835 124900
17474A24900C6477c24847C50867c8919D8016J32446H9859J32681i3783K8770A94244
$$ 124900 36477 -324847 350867 -38919 48016 180462 89859 222540 -93783 -65013 194244
17462I1136a69227l18969A65768a05468l33101B42733A19000h1429A91610m7422
$$ 91136 -169227 -488196 165768 -105468 -438569 242733 119000 -81429 191610 144188
17452A44188Q1747K62445B5098K16656o1564H175J38894C8724a90937F4666d8573
$$ 144188 225935 488380 25098 241754 180190 8175 147069 38724 -190937 64666 -48573
17440B0363J96079J70128j46946b8245D93063j37181M8190a2897B76608j08175
$$ 20363 216442 386570 239624 -28245 493063 355882 404072 -12897 276608 168433
17430A68433j6741e4267B83649b9014B99489a6389D2088K17899A21471K69316
$$ 168433 151692 -54267 283649 -29014 299489 -16389 42088 259987 121471 390787
17420C90787F4736K5075O5078a43641I9582a01533B01999J04712H1464K30105
$$ 390787 64736 89811 154889 -143641 99582 -101533 201999 306711 81464 311569
17410C11569R3490A91498m1203K36082j86555p7505R9552r9253M20816i741B33126
$$ 311569 405059 191498 150295 386377 199822 122317 221869 122616 543432 -9741 233126
17398B94941m1163N2178r1396p5075E8795L30787n3067A26469K00481R4746D8279
$$ 294941 253778 305956 214560 139485 58795 389582 336515 126469 326950 421696 48279
17386A59681l642j325L97376D3242J16919a50227B06197l9619L22673e2185A12392
$$ 159681 156039 154714 552090 43242 160161 -150227 206197 166578 489251 -52185 112392
17374I6633N8351K76844b33354A00319g0497n5558B39628K17450i9400A28521
$$ 96633 154984 431828 -233354 100319 -70497 -126055 239628 457078 -99400 128521
17363H8762D1490K58505f635A2429A22g8366D27932A47514K43354j37868p7988
$$ 88762 41490 299995 -6635 12429 122 -78366 427932 147514 390868 253000 175012
17352A75012H6824i1274B53911A21752d9931E890b8799A90005D7583N9936g8620
$$ 175012 86824 -91274 253911 121752 -49931 5890 -28799 190005 47583 107519 -78620
17340B07622h5188D0284d3100a6280C17903J3441p2091a44683A09864h2353A00827
$$ 207622 -85188 40284 -43100 -16280 317903 331344 259253 -144683 109864 -82353 100827
17328C28623G749J35725Q212b1553B22815F7071J82537K65177A21277K50015N4347
$$ 328623 7749 143474 151686 -21553 222815 67071 249608 514785 121277 371292 425639
17317D25639j01201B481L19701j3633b29723E0591M67048k11968N3075A56482
$$ 425639 324438 2481 322182 308549 -229723 50591 517639 305671 358746 156482
17306A8632l387h6336o4716B9277f3579B82012a0616j8751B08732C7478b5126
$$ 18632 15245 -86336 -151052 29277 -63579 282012 -10616 -29367 208732 37478 -25126
17294D01512j03999m1409i3265L1151B98583E1785J75187D6357J60200f3320p950
$$ 401512 297513 256104 -93265 -62114 298583 51785 226972 46357 206557 -63320 -71270
17283g1270B96035j26074J2829A6086J15418n1813O1371J94151a025k8124C10652
$$ -71270 296035 169961 182790 16086 131504 79691 141062 335213 -1025 -29149 310652
17271A62538R0202j21533K00899H0198K75388A03859K53763c1549C86159a9021
$$ 162538 252740 131207 332106 80198 355586 103859 357622 -31549 386159 -19021
17260b0174B3666L8944m7e7163A63209J25855a40679B99106n4435L7112A21014
$$ -20174 23666 62610 62563 -57163 163209 289064 -140679 299106 244671 281783 121014
17248a25501j59671I5652K35069j51284J03463A41436J11899i0404B11598m8091
$$ -125501 -285172 95652 330721 179437 282900 141436 253335 -90404 211598 163507
17238A63507J12809P1979j15800A05156b5529A55730R061N26m0942n5967R9758
$$ 163507 276316 348295 232495 105156 -25529 155730 164791 165317 124375 68408 168166
17227A68166g9141B52632n1192J02515j35392a63231m0410A25131J63296E2897
$$ 168166 -79141 252632 201440 303955 168563 -163231 -203641 125131 288427 52897
17216a76505D67934c2871A69824j9128e8130A19452k213l0075L59931A91236J83032
$$ -176505 467934 -32871 169824 150696 -58130 119452 117239 87164 447095 191236 374268
17205C74268j15776J60323j97499a77393A12288K7165M9471N8400P9264j38996
$$ 374268 258492 418815 221316 -177393 112288 139453 188924 247324 326588 187592
17195A87592L13667A86213J44430G5194K80736J97886p543k56671J14894K59792
$$ 187592 501259 186213 330643 75194 355930 553816 546273 289602 404496 664288
17185F64288B72131a47111A33058K33082p8024p5117j02992Q2037C1800M74949
$$ 664288 272131 -147111 133058 366140 288116 212999 110007 192044 31800 506749
17175E06749A76125p0892J17450J86363a38731D78395j18802A02766J77800J51159
$$ 506749 176125 105233 222683 409046 -138731 478395 359593 102766 280566 431725
17165D31725q0191A62011L06919j82144A1888K39775R5776a8374A50433P8887
$$ 431725 351534 162011 468930 286786 11888 251663 347439 -18374 150433 229320
17155B29320K80143C3004L37514A55101Q3842j7007K29758A82556J90586j35375
$$ 229320 509463 33004 370518 155101 238943 221936 451694 182556 373142 237767
17145B37767l5887J53134j1352o4259o6665J14771A11400j5608J67911G301L03097
$$ 237767 201880 355014 343662 279403 212738 327509 111400 95792 263703 7301 310398
17134C10398n6083l2766Q6125j09740o5391M8138f1854B11602I9217K73035A66421
$$ 310398 254315 221549 307674 197934 132543 180681 -61854 211602 99217 372252 166421
17122C24763q0980K13109E7620J89565A08288J36572K03416P8416q8470A64698
$$ 324763 243783 456892 57620 247185 108288 244860 448276 526692 438222 164698
17111B83073A15207M17329B37517L04147A89299J46214f1815C31221K2621r0424
$$ 283073 115207 532536 237517 541664 189299 335513 -61815 331221 353842 263418
17101B63418J53866M1337K01052A11376J93197J05672p247j59228R5414k443A44065
$$ 263418 417284 458621 659673 111376 304573 410245 402998 243770 339184 336741 144065
17089A11416J59986L9325j1998K16419A27137j1841j3144J30245L92915A62602
$$ 111416 271402 310727 298729 515148 127137 115296 102152 232397 625312 162602
17078F04775k24447j07537m3167K52077K02827p1583o2042B54085J42012l0458
$$ 604775 380328 272791 229624 481701 684528 612945 550903 254085 396097 365639
17068C65639N7095l6463F5644L28904j72164M54097l29379K08450j36290K24037
$$ 365639 422734 386271 65644 394548 222384 676481 347102 555552 419262 643299
17058F43299k0901j32510k11827O0296N9158J83777I6651K82664K87880l06996
$$ 643299 622398 489888 278061 338357 397515 581292 96651 379315 667195 360199
17048C60199j36091K48282k29758K12897L1549M0576o9157l6094J31579q740Q0096
$$ 360199 224108 472390 242632 455529 487078 527654 458497 422403 553982 545242 625338
17037F25338p8797J10303B89623L82260l17037l0541Q1989K3663J78240m8056
$$ 625338 546541 656844 289623 671883 354846 324305 406294 429957 608197 560141
17027E60141q205e48C53419A44247M14180j25615P9042K80093k86682K195k04915
$$ 560141 551936 -548 353419 144247 558427 432812 511854 791947 505265 507460 302545
17016C02545K44325L5197p4294j16105K72293K2940q1489j54688o0600J31393
$$ 302545 546870 582067 507773 391668 663961 686901 605412 450724 390124 521517
17006E21517J29075j16868j70409M43821l27120l7900K60876j75488L69874l52636
$$ 521517 650592 533724 363315 807136 480016 442116 702992 527504 897378 544742
16996E44742o2509L38287k32425j3682J80324n9799M8496j55502L27524R0400
$$ 544742 482233 820520 588095 574413 754737 694938 743434 587932 915456 1005856
16986A005856j30845j49756p2332J02424j91131L92309j70869j96670O221J16910
$$ 1005856 875011 725255 652923 755347 564216 956525 785656 588986 595207 712117
16976G12117J89115j03230C87249L04741k21214J15175J58583k83274J31751Q4550
$$ 712117 901232 798002 387249 691990 470776 585951 744534 461260 593011 677561
16966F77561R7640J38887k07608J8559l5822j2483L01500J45939k24443J4056
$$ 677561 775201 914088 706480 725039 689217 676734 978234 1124173 899730 913786
16956I13786J01108k15353N9573j56196K50035K71801j43445k27997k78568L15638
$$ 913786 1014894 799541 859114 702918 952953 1224754 1081309 853312 574744 890382
16946H90382k04024L9767M30259j25382M6582K58084k34110j70528Q8061J60969
$$ 890382 686358 726125 1156384 1031002 1077584 1335668 1101558 931030 1019091 1180060
16936A180060o192k14131O5523J77505m41008M11507j36531j75809L30359l47058
$$ 1180060 1173868 959737 1025260 1202765 761757 1173264 1036733 860924 1191283 844225
16926H44225J30105J38723j45149J59535L9198j65383L38836Q2733J54165m56471
$$ 844225 974330 1113053 967904 1127439 1166637 1001254 1340090 1422823 1576988 1120517
16916A120517p9021J71399q9175K07627K15551j35101j89208L29122k74450N4633
$$ 1120517 1041496 1212895 1123720 1331347 1546898 1411797 1222589 1551711 1277261 1331894
16906A331894R2373J3939L940m7002J58471j16204R0282q3501Q2750N5664r2542
$$ 1331894 1424267 1438206 1442146 1395144 1553615 1437411 1527693 1444192 1526942 1582606 1490064
16895A490064K91938J00258m90743L96453k33329J01357k22904K67787k36628
$$ 1490064 1782002 1882260 1391517 1787970 1554641 1655998 1433094 1700881 1464253
16886A464253j37401N95134m99639K07498j8571L01169J11751k37618j24425k42
$$ 1464253 1326852 1921986 1422347 1629845 1611274 1912443 2024194 1786576 1662151 1661909
16876A661909L60251j77797K35596K1592j31663J47541l46039N04137l5117n05744
$$ 1661909 2022160 1844363 2079959 2101551 1969888 2117429 1771390 2275527 2240410 1734666
16866A734666R1225L26030K33181j22442l78042k0257N96811l73364L23580j69491
$$ 1734666 1825891 2151921 2385102 2262660 1884618 1864361 2461172 2087808 2411388 2241897
16856B241897J06617J80036Q5922j37723J33375j38932N288K38786n4834j30437
$$ 2241897 2348514 2528550 2614472 2476749 2610124 2471192 2476480 2715266 2660432 2529995
16846B529995J66954l9382o961M54633n06080K03835K96677j08135j16406K71014
$$ 2529995 2696949 2657567 2650606 3105239 2599159 2802994 3099671 2991536 2875130 3146144
16836C146144k12874K72085j22287L25068k11253r4765M22476J99717J72852m54447
$$ 3146144 2933270 3205355 3083068 3408136 3196883 3102118 3524594 3724311 3897163 3442716
16826C442716L35390l17430K04709L04707k88625Q6213L77161m7174j57512L61818
$$ 3442716 3778106 3460676 3665385 3970092 3681467 3767680 4144841 4097667 3940155 4301973
16816D301973K28826J75614k52492L1941L13852n206L47113j55588O4564r5141
$$ 4301973 4530799 4706413 4453921 4485862 4799714 4794508 5141621 4986033 5050597 4955456
16806D955456O40497l57068L91694j40263J58236K16103j61427L32202r546K62611
$$ 4955456 5595953 5238885 5630579 5490316 5648552 5864655 5703228 6035430 6025884 6288495
16796F288495K39865p0045j76427O37915q0568L60686k9247J55121K83989J53618
$$ 6288495 6528360 6458315 6281888 6919803 6839235 7199921 7170674 7325795 7609784 7763402
16786G763402M01399J64345R7687J83073N15703O4220K16847J41698k73304Q23248
$$ 7763402 8164801 8329146 8426833 8609906 9125609 9189829 9406676 9548374 9275070 10098318
16776A0098318M98849N1799L2646O39551K79413l1217R23590k4804L46049N64500
$$ 10098318 10597167 10648966 10681612 11321163 11600576 11569359 12492949 12468145 12814194 13378694
16766A3378694L39799L91268K75691O82427M78884O37537L85160N57187P75702
$$ 13378694 13718493 14109761 14385452 15067879 15546763 16184300 16569460 17126647 17902349
16757A7902349M97350M56070J204322J11890J039333P29904Q22932Q65915P70057
$$ 17902349 18399699 18855769 20060091 20171981 21211314 21941218 22764150 23630065 24400122
16748B4400122J502071O36417J404201J112350J380170R67925J501652J268478
$$ 24400122 25902193 26538610 27942811 29055161 30435331 31403256 32904908 34173386
16740C4173386J883751J131879K224910K140033J927628J985923K517241K297066
$$ 34173386 36057137 37189016 39413926 41553959 43481587 45467510 47984751 50281817
16732E0281817K568058L017838L064463L280778L696177L440948M045308M370260
$$ 50281817 52849875 55867713 58932176 62212954 65909131 69350079 73395387 77765647
16724G7765647M510033M923391N136379N271017N821491O618602N853525O871857
$$ 77765647 82275680 87199071 92335450 97606467 103427958 110046560 115900085 122771942
16716A22771942O349831P582842O730961P228232O737279O879287O518938N637702
$$ 122771942 129121773 136704615 143435576 150663808 157401087 164280374 170799312 176437014
16708A76437014M890865M409396L165148K243436J155850o28321j410437k779457
$$ 176437014 181327879 185737275 188902423 191145859 192301709 191673388 190262951 187483494
16700A87483494l368775m950959n530193n715917p386976o705067p226990p041952
$$ 187483494 184114719 179163760 173633567 167917650 160530674 153825607 146598617 139556665
16692A39556665p388586o903470o992021o888315o019637o462728n697111n185749
$$ 139556665 132168079 125264609 118272588 111384273 105364636 98901908 93204797 88019048
16684H8019048n240489n049260m514090l994032l691649m051934l360707l176911
$$ 88019048 82778559 77729299 73215209 69221177 65529528 61477594 58116887 54939976
16676E4939976l290995k442497k494145k554357k402698j555864k515898j746255
$$ 54939976 51648981 49206484 46712339 44157982 41755284 40199420 37683522 35937267
16668C5937267j533920j796110j375477j728758r36394j192505j306056j150665
$$ 35937267 34403347 32607237 31231760 29503002 28566608 27374103 26068047 24917382
16660B4917382p69924j294777j062806p76427o02438p23971n96504q26646n64078
$$ 24917382 24147458 22852681 21789875 21013448 20411010 19687039 19090535 18263889 17699811
16651A7699811o56766q02028j83166p66329o42187m18017p18037j88389k59840
$$ 17699811 17043045 16241017 16057851 15291522 14649335 14231318 13513281 13324892 13065052
16642A3065052o05653k59099k77684o90588j64171k75570l30215k21443m85401
$$ 13065052 12459399 12200300 11922616 11232028 11067857 10792287 10462072 10240629 9755228
16633I755228j93519l64630j51429l2809o06517m27736K72853K01132p04642j83329
$$ 9755228 9561709 9197079 9045650 9012841 8406324 7978588 8251441 8452573 7747931 7564602
16623G564602j11123m40662j36642J02690k79979j13823j96667q1392k92090j38529
$$ 7564602 7453479 7012817 6876175 6978865 6698886 6585063 6388396 6307004 6014914 5876385
16613E876385j84342q7753M8737k40525L37326n55528k59997M3269r0742j51653
$$ 5876385 5692043 5604290 5653027 5412502 5749828 5194300 4934303 4977572 4886830 4735177
16603D735177K7488m86303j1645j7123K2317N52386j67952o09121l29841N26491
$$ 4735177 4762665 4276362 4264717 4247594 4269911 4822297 4654345 4045224 3715383 4241874
16593D241874j87369k64974l9553K80776n22541P3177J57096k11563J50004k61747
$$ 4241874 4054505 3789531 3749978 4030754 3508213 3581390 3738486 3526923 3676927 3415180
16583C415180k59393J37446j76388J70990r5566j11418K5363K7358N1183k8133
$$ 3415180 3155787 3293233 3116845 3287835 3192269 3080851 3106214 3133572 3184755 3156622
16573C156622m23398K7838k77418J73559R634J149l52868J22086J88926j38792
$$ 3156622 2733224 2761062 2483644 2657203 2666837 2667986 2315118 2437204 2626130 2487338
16563B487338k28939K8237K7855l36287M07457k50414K5196o1372J40134j82669
$$ 2487338 2258399 2286636 2314491 1978204 2385661 2135247 2160443 2099071 2239205 2056536
16553B056536M8841j82587j01347L34774j85762L7889M0662k13229j38387m0413
$$ 2056536 2105377 1922790 1821443 2156217 1970455 2008344 2049006 1835777 1697390 1656977
16543A656977j58458M79708l65940L404Q054p7489L52713k25812k64302L68121
$$ 1656977 1498519 1978227 1612287 1615691 1623745 1546256 1898969 1673157 1408855 1776976
16533A776976k65453J67601k07824k39291L33099l12425M78342j26677m85408
$$ 1776976 1511523 1679124 1471300 1232009 1565108 1252683 1731025 1604348 1118940
16524A118940K64150l77563M04825j12242J95332r4898p2690K4507k19465J47944
$$ 1118940 1383090 1005527 1410352 1298110 1493442 1398544 1325854 1350361 1130896 1278840
16514A278840P233J96197l73129j52532K34170m2054L0327k9300q2040j75780
$$ 1278840 1286073 1482270 1109141 956609 1190779 1148725 1179052 1149752 1067712 891932
16504H91932L90420j2429j80297k48295L46105K276R1318j45854O2944l22513
$$ 891932 1282352 1269923 1089626 841331 1187436 1189712 1281030 1135176 1198120 875607
16494H75607N599J32501K1767P8630j32134K25335m59709L92685m17376K28102
$$ 875607 881206 1013707 1035474 1114104 981970 1207305 747596 1140281 722905 951007
16484I51007l34265M08943j54249k33447m4782P0949O8206j02561J63048J02325
$$ 951007 616742 1025685 871436 637989 593207 664156 732362 629801 792849 895174
16474H95174k29520P3826M72611j73149l07114k18392J17167J96564j47996N2114
$$ 895174 665654 739480 1212091 1038942 731828 513436 630603 827167 679171 731285
16464G31285n8445o2928o9796M99704k54099l19397J58024P7296j19760K44427
$$ 731285 672840 609912 540116 1039820 785721 466324 624348 701644 581884 826311
16454H26311k16808p5294R6061K63993D14271J155K75631j4064j03488J78316
$$ 826311 609503 534209 630270 894263 414271 415426 691057 676993 573505 751821
16444G51821J86433j87181J46796m03838R5963j62963L14730M7439j55164j45302
$$ 751821 938254 751073 897869 494031 589994 427031 741761 789200 634036 488734
16434D88734Q3810K30546j10935j39708K07976Q6374D22342J72820L04763l16994
$$ 488734 572544 803090 692155 552447 760423 846797 422342 595162 899925 582931
16424E82931j06606p0592O4666k00395J89584P2539H7429L61127L20553r5162
$$ 582931 476325 405733 470399 270004 459588 532127 87429 448556 769109 673947
16414F73947B49220M0919N6021J68459j15623R5056N6731j42145L69694k46576
$$ 673947 249220 290139 346160 514619 398996 494052 550783 408638 778332 531756
16404E31756k9966J71762k62581K1507J42826A83662L31783J07535C07494K23585
$$ 531756 501790 673552 410971 432478 575304 183662 515445 622980 307494 531079
16394E31079J61172C22303K44559L1015A83898K66662A81293N1073A01649K84919
$$ 531079 692251 322303 566862 597877 183898 450560 181293 232366 101649 386568
16384C86568L22713k55795k19035J05470K42908k42156K00814j51733K71393C24177
$$ 386568 709281 453486 234451 339921 582829 340673 541487 389754 661147 324177
16373E10716N5070F3473N27901A89656L49660j22221J02719J9618k67386L432
$$ 510716 565786 63473 591374 189656 539316 417095 519814 539432 272046 275478
16363B75478C4309J95944k2958Q4705K37902r6622j64822l810n4808L0727J86380
$$ 275478 34309 230253 207295 292000 529902 433280 268458 264648 209840 240567 426947
16352D26947J42079k29644R5770H2201M05090j42223r7140K66332k7606j99833
$$ 426947 569026 339382 435152 82201 487291 345068 247928 514260 486654 286821
16342B86821C1200K60432A06834B2846A0808L15520J842r3369d0093E54609B19810
$$ 286821 31200 291632 106834 22846 10808 326328 328170 234801 -40093 554609 219810
16330D99734k21182j02623p781p1733L147a07673d5410D96448C3770K91571c3468
$$ 499734 278552 175929 168148 96415 99562 -107673 -45410 496448 33770 325341 -33468
16318E02053j99521f283B69248a04075D82326a18394q104I3556P0284J66532j24037
$$ 502053 302532 -6283 269248 -104075 482326 -118394 -126498 93556 163840 330372 206335
16307B06335K95642k1646K92289G4272K7151a28751I9152L15428A40330J10834
$$ 206335 501977 480331 772620 74272 101423 -128751 99152 414580 140330 251164
16297B51164j09183d9839B95900j04981o8725N07562j54921E3909L7940J38688
$$ 251164 141981 -49839 295900 190919 122194 629756 474835 53909 91849 230537
16287B30537e1742A28289P2121J1139K46177b8214g169B73611J26502f7470B59627
$$ 230537 -51742 128289 200410 211549 457726 -28214 -7169 273611 400113 -67470 259627
16275f9500C81807a37383I1878K48460j36790J59750a2963C93190j56037B5215
$$ -69500 381807 -137383 91878 340338 203548 363298 -12963 393190 237153 25215
16264A57181m9598d1911D74032j80070K64001A53024J17257a09315C29872j45554
$$ 157181 107583 -41911 474032 293962 557963 153024 270281 -109315 329872 184318
16254A84318G7737J21711E4277J05691g1774c1325B39024j07081O9653L18410
$$ 184318 77737 199448 54277 159968 -71774 -31325 239024 131943 201596 520006
16244E20006B8615J21541L07779A74147K255L25042h8517D94931b3695A40194
$$ 520006 28615 150156 457935 174147 176402 501444 -88517 494931 -23695 140194
16233D36350c992o9232C68527j50224a33914G4194J60007a81327I4559J19619
$$ 436350 -3992 -73224 368527 218303 -133914 74194 234201 -181327 94559 214178
16223B14178J83796c7301l528q4990B81738r7732L4769M3264B7601a86538K9714
$$ 214178 397974 -37301 -40829 -125819 281738 184006 218775 262039 27601 -186538 -156824
16212a56824C03063b18905A71693a12343d3734E6524J1077P9659F2376r003J75311
$$ -156824 303063 -218905 171693 -112343 -43734 56524 67601 147260 62376 53373 228684
16201B28684n8203j9440j7310K3940L6955r536f2823A95529i6432A98850a04347
$$ 228684 170481 151041 133731 157671 194626 185090 -62823 195529 -96432 198850 -104347
16189g2295A56371L1167i5902j27071A97100f7339L3065g562o1546k14853C40595
$$ -72295 156371 187538 -95902 -222973 197100 -67339 -34274 -7562 -69108 -283961 340595
16177A98867B6614N7242b3726B30056B2884P1354b26908A14177C6679J99164E0989
$$ 198867 26614 83856 -23726 230056 22884 94238 -226908 114177 36679 235843 50989
16165C03110j19775J46251j40304a57333l04961c8251A81420o904a4235B26358
$$ 303110 183335 329586 189282 -157333 -462294 -38251 181420 174516 -14235 226358
16154A49541a88498g6619H3515a89832E2124M8445C3432f1636C06206j48111N3613
$$ 149541 -188498 -76619 83515 -189832 52124 100569 33432 -61636 306206 158095 211708
16143B11708A7924a7120F0488O0514A3205P2660G527R4940m0426e9030B5676N7809
$$ 211708 17924 -17120 60488 121002 13205 85865 7527 102467 62041 -59030 25676 83485
16131H3485C7511b5378j90026C77257A07723a8617N867j53065A77470J4943d0024
$$ 83485 37511 -25378 -215404 377257 107723 -18617 -12750 -165815 177470 192413 -40024
16119A0455J50380K39846a8269D5044a34514H9816a6791H5446Q0307H0182K13402
$$ 10455 160835 400681 -18269 45044 -134514 89816 -16791 85446 165753 80182 293584
16108B93584C2395d1388k7178F2443a26194p3487A45854b16178a9774k5825C2586
$$ 293584 32395 -41388 -68566 62443 -126194 -199681 145854 -216178 -19774 -45599 32586
16096a8518j90597D62624G5198L3434a92430C5285J48950J02068d9618b0514B39001
$$ -18518 -209115 462624 75198 108632 -192430 35285 184235 286303 -49618 -20514 239001
16084C99002r3237B0607b0392m598p3326A77931j379c18487B01628a03066I3072
$$ 399002 305765 20607 -20392 -24990 -98316 177931 176552 -318487 201628 -103066 93072
16072b72893A44312f563k71122i3571k21239A47941k2674a45882f9926L2203A79809
$$ -272893 144312 -6563 -277685 -93571 -314810 147941 125267 -145882 -69926 -37723 179809
16060a2836o8240A52150g2447B48357h9429B38247i4745I8221b8415A16774C808
$$ -12836 -81076 152150 -72447 248357 -89429 238247 -94745 98221 -28415 116774 3808
16048I5573J82480b09560I6874K0314L209b71118l4256C3547L4222f1924C02572
$$ 95573 278053 -209560 96874 117188 120397 -271118 -305374 33547 67769 -61924 302572
16036B1287J6175K89910A41707D833d51573H1264L5192e0004C47825f5823A53023
$$ 21287 37462 327372 141707 4833 -451573 81264 116456 -50004 347825 -65823 153023
16024b88816N1930l5445H0468e8171G0472b84149J12364A8246a13774j3074m5424
$$ -288816 -236886 -272331 80468 -58171 70472 -284149 -171785 18246 -113774 -126848 -172272
16013a72272B99922c93517B73730j10634g5075E44021b38739P9892A21018j2069
$$ -172272 299922 -393517 273730 163096 -75075 544021 -238739 -158847 121018 108949
16003A08949b8444j90974J5768B8669a81563A67640D7767A0901K06171a64756
$$ 108949 -28444 -219418 -203650 28669 -181563 167640 47767 10901 217072 -164756
15992B0692M44293a22666k9837A1213a09036F2160M4582h3707l2872J0537h094
$$ 20692 464985 -122666 -152503 11213 -109036 62160 106742 -83707 -116579 -106042 -8094
15980h0119A19446J02584f8316l08596a31503A77328a9895A9888f9152C95538
$$ -80119 119446 222030 -68316 -376912 -131503 177328 -19895 19888 -69152 395538
15969h3582A49277d7207l3734A07198c44909B6936K1854J14041b70639D2059K5695
$$ -83582 149277 -47207 -80941 107198 -344909 26936 48790 162831 -270639 42059 67754
15958F7754a1541m64375b28636e8368K4362B38424a63024N3839D0137R2698N8080
$$ 67754 -11541 -475916 -228636 -58368 -34006 238424 -163024 -109185 40137 132835 190915
15947A90915a67030B79382n7679a61800B81004r8929b08102A2104d8084m5337
$$ 190915 -167030 279382 221703 -161800 281004 182075 -208102 12104 -48084 -93421
15937i3421j35288G3504J50470J13726a32721p7635E47809a63225j63845F0262
$$ -93421 -228709 73504 223974 337700 -132721 -210356 547809 -163225 -327070 60262
15926b45626F6765a94181B13433b14779q4318A62738E8485c18261R1065r5429
$$ -245626 66765 -194181 213433 -214779 -299097 162738 58485 -318261 -227196 -322625
15916c22625E0237b88561j42881a52378d0611n11946a31480M3512q5725l38396
$$ -322625 50237 -288561 -431442 -152378 -40611 -552557 -131480 -87968 -173693 -512089
15906e12089H710J0432a50639b557j07258k97178a00279B7714G276h2985j33239
$$ -512089 8710 19142 -150639 -2557 -109815 -406993 -100279 27714 7276 -82985 -216224
15895b16224C5255K5944h0403c5926A5524J32887D2467K20817E6978a13006A10333
$$ -216224 35255 61199 -80403 -35926 15524 148411 42467 263284 56978 -113006 110333
15883I2519g6524j93648f2836D8906c16352e0539k54407J30645e1115j05552J0183
$$ 92519 -76524 -270172 -62836 48906 -316352 -50539 -304946 -174301 -51115 -156667 -146484
15872a46484a0542j70864B90026A10499n4104J8499O4590a07134o3749E3016a01169
$$ -146484 -10542 -181406 290026 110499 56395 74894 139484 -107134 -170883 53016 -101169
15860E7386J21147B7865c11497A31213J52579K40728a02374A2742J92674F509
$$ 57386 178533 27865 -311497 131213 283792 524520 -102374 12742 205416 6509
15849B65760A2198K42508c7528A2004J79417A6030L0103f9413m6755d4013m5619
$$ 265760 12198 254706 -37528 12004 191421 16030 46133 -69413 -116168 -44013 -89632
15838h9632b2977A03172h2021A12983K35919e3739A92079C4455g8237A6228d06403
$$ -89632 -22977 103172 -82021 112983 348902 -53739 192079 34455 -78237 16228 -406403
15826D43405A61994b765B5787c3742l4536a2423k29063C84274a63569c7614l4117
$$ 443405 161994 -2765 25787 -33742 -68278 -12423 -241486 384274 -163569 -37614 -71731
15815g1731j52042a08085j41834B9049K342a36681A07512a05194b5802E8980a36950
$$ -71731 -223773 -108085 -249919 29049 31391 -136681 107512 -105194 -25802 58980 -136950
15803C0142P3211a7141A12017b33151R0163J8145d0414j09799A02492B7626A2664
$$ 30142 103353 -17141 112017 -233151 -142988 -124843 -40414 -150213 102492 27626 12664
15791c39235J48299M8685l5040c8986A41286a65234j6987D2656A4183i1670G095
$$ -339235 -190936 -142251 -177291 -38986 141286 -165234 -182221 42656 14183 -91670 7095
15779a91480k2662B35775D0774a43793O186j42553N1406f8279l02385B76494a40795
$$ -191480 -214142 235775 40774 -143793 -137607 -280160 -228754 -68279 -370664 276494 -140795
15767a87099j4926C328d0682I2063n048a04494B1224c6750j57705L0362P6350
$$ -187099 -202025 3328 -40682 92063 87015 -104494 21224 -36750 -194455 -164093 -87743
15756h7743C09898a41067N4694B19044F9175h0829A28204a2034C02219d0729l17960
$$ -87743 309898 -141067 -86373 219044 69175 -80829 128204 -12034 302219 -40729 -358689
15745c58689A21672B1517a21846B41020a26578A9261f2333B78434b8761k93991
$$ -358689 121672 21517 -121846 241020 -126578 19261 -62333 278434 -28761 -322752
15735c22752g7930F1163k3784J94161J81409b06506k3305g2469L4759j16002a5813
$$ -322752 -77930 61163 37379 231540 412949 -206506 -229811 -72469 -37710 -153712 -15813
15723a89361f2185p923A26239i6861A64175C7852j6158b03660q6443F2643A2587
$$ -189361 -62185 -70108 126239 -96861 164175 37852 21694 -203660 -290103 62643 12587
15711A2240a95158H8005a62819e9850l6436L0444k15563E0619i1757E5078g7551
$$ 12240 -195158 88005 -162819 -59850 -96286 -65842 -281405 50619 -91757 55078 -77551
15699c1530j10119C8326g8751J8728k81541B43857A03260B4071P8741J23341E6670
$$ -31530 -141649 38326 -78751 -60023 -341564 243857 103260 24071 102812 226153 56670
15687i9142K4050j16013P4885p8497d6151F620c02594a14277d8987A27477M9773
$$ -99142 -75092 -191105 -116220 -194717 -46151 6620 -302594 -114277 -48987 127477 177250
15676A77250a53368I1243b9543C5684f3490m7957R999k8176f3085K4904A15078
$$ 177250 -153368 91243 -29543 35684 -63490 -111447 -101448 -129624 -63085 -38181 115078
15664B17404G0884j3507b51715P4880P2258A95203B9084H805O5508a75615O3475
$$ 217404 70884 57377 -251715 -176835 -104577 195203 29084 8805 74313 -175615 -112140
15653a12140e6070j28728B1509b0270k10061D964J97568E0465h948k20576b8558
$$ -112140 -56070 -184798 21509 -20270 -230331 4964 202532 50465 -8948 -229524 -28558
15641a37575e4289B12924i1572m549A7893J61341C5529d7340A13140d5920J3023
$$ -137575 -54289 212924 -91572 -96121 17893 179234 35529 -47340 113140 -45920 -32897
15630c2897A39313c9596A76504i5968o4238N5915k06381c111j5972j44940D516
$$ -32897 139313 -39596 176504 -95968 -160206 -104291 -310672 -3111 -19083 -164023 4516
15618d9423p1414D9570A9901J3455Q3053b09418j251J04028H4792a77272e9490
$$ -49423 -120837 49570 19901 33356 116409 -209418 -210669 -106641 84792 -177272 -59490
15606A18562J09854f8364A96978a18262L1514C57471E1357J01849f4518c144j8402
$$ 118562 228416 -68364 196978 -118262 -86748 357471 51357 153206 -64518 -3144 -21546
15595b1546l857B12109J07295o2325a76118h1322A06022c17057J41259C9945c2428
$$ -21546 -25403 212109 319404 257079 -176118 -81322 106022 -317057 -175798 39945 -32428
15583b72888O3293I3350c85585b2716r7191P931E5210e5381A01639c98493A12227
$$ -272888 -209595 93350 -385585 -22716 -119907 -111976 55210 -55381 101639 -398493 112227
15571C00478h2023c0155i101k30585A4557a72750m2865h5109h186j13052j69557
$$ 300478 -82023 -30155 -9101 -239686 14557 -172750 -215615 -85109 -8186 -121238 -290795
15560b90795C27631e994j61355J7588a3489J884q3935G1053b02515E539J02262
$$ -290795 327631 -5994 -167349 -149761 -13489 -11605 -95540 71053 -202515 5539 107801
15549A07801b68221d4213l1749A80107c7731D4622M8378P2427J25054b3348F4454
$$ 107801 -268221 -44213 -75962 180107 -37731 44622 93000 165427 290481 -23348 64454
15537d5993k03102A35514d2368j3211A24241K74887j87161B6874j556a51788A64523
$$ -45993 -249095 135514 -42368 -55579 124241 399128 211967 26874 25318 -151788 164523
15525A8872a5840A89354B8381K8688J01384c51160O6438B46081i5680A92998D94
$$ 18872 -15840 189354 28381 57069 158453 -351160 -284722 246081 -95680 192998 494
15513b07071a079A5857J85308a1849j11228k3561L7071C35148g516C5062f3321
$$ -207071 -1079 15857 201165 -11849 -123077 -146638 -109567 335148 -7516 35062 -63321
15501H9552O5021c1892D1221J04584J69841b426r3930B77708b18776A90365b24226
$$ 89552 154573 -31892 41221 145805 315646 -2426 -96356 277708 -218776 190365 -224226
15489e6875F8394a82687a052l3838l1976H7212a93539j24838B37631i1164b665
$$ -56875 68394 -182687 -1052 -34890 -66866 87212 -193539 -318377 237631 -91164 -2665
15477i2033J0716k45438c6001m0937A3119M3591R1744O646R0184r9173g5535a2026
$$ -92033 -81317 -326755 -36001 -76938 13119 56710 148454 155100 245284 146111 -75535 -12026
15464E415J44283c7915A80385h8355k67710C19920g8144A88688P5718D7737e1107
$$ 5415 149698 -37915 180385 -88355 -356065 319920 -78144 188688 264406 47737 -51107
15452b36270F4074j9462M1112K70257a10012B8968e5668A23154J4415j8778D6093
$$ -236270 64074 44612 85724 355981 -110012 28968 -55668 123154 137569 118791 46093
15440a7613k9534b3408k9871k5759G547c5019E240d9192A30759a5927A30444a58926
$$ -17613 -47147 -23408 -53279 -79038 7547 -35019 5240 -49192 130759 -15927 130444 -158926
15427b9057D29779b3963m0807d092j4361k21437J09173e1466A00823b7668j41800
$$ -29057 429779 -23963 -64770 -4092 -18453 -239890 -130717 -51466 100823 -27668 -169468
15416a69468D5874c67111C409a4751j68122k4861P7103j69876F2502J1872J8351
$$ -169468 45874 -367111 3409 -14751 -182873 -207734 -130631 -300507 62502 74374 92725
15405I2725d36758C3461P5099J50456g6009B31319a6221B02155a94888B49998
$$ 92725 -436758 33461 108560 259016 -76009 231319 -16221 202155 -194888 249998
15394b13353A42878k347K17443b37506f8569A53771A5049L2504i4943n4929j44434
$$ -213353 142878 140531 357974 -237506 -68569 153771 15049 47553 -94943 -149872 -294306
15383b94306B04991d973B50711I7805J4020g5754B02261E8549M18368j56964j57221
$$ -294306 204991 -4973 250711 97805 111825 -75754 202261 58549 476917 319953 162732
15372A62732a46087D9213a88960c7272k39528J08702A9401b26718O2441P0636
$$ 162732 -146087 49213 -188960 -37272 -276800 -168098 19401 -226718 -164277 -93641
15362i3641C12090H0909a20k83168I852i2439C287K26739d6830j4667D2088K5043
$$ -93641 312090 80909 -120 -283288 9852 -92439 3287 230026 -46830 -61497 42088 67131
15350F7131P1929c33519E6972J06156d01434b1382D3781d6745j55904A96316J3349
$$ 67131 139060 -333519 56972 163128 -401434 -21382 43781 -46745 -202649 196316 209665
15339B09665G8681B480d5194n4822A20383B9916c43785A43628c14207f0895A03956
$$ 209665 78681 2480 -45194 -100016 120383 29916 -343785 143628 -314207 -60895 103956
15327C5488b6403H15a30391H8559e0491A96131b07266d8181r469a8784G6130b33321
$$ 35488 -26403 815 -130391 88559 -50491 196131 -207266 -48181 -57650 -18784 76130 -233321
15314A61578J58280f6017A40688a8938j69210b8996n3237q1505j3784B16812R9216
$$ 161578 319858 -66017 140688 -18938 -188148 -28996 -82233 -163738 -177522 216812 316028
15303C16028d1913k180B8220h00C9378b31359f8914I7709D0994c58979A22547
$$ 316028 -41913 -44093 28220 -800 39378 -231359 -68914 97709 40994 -358979 122547
15291d01955g1586E0864Q5416a30623C83799j07768e7629k1585B65662D3800J23605
$$ -401955 -71586 50864 136280 -130623 383799 276031 -57629 -79214 265662 43800 167405
15280A67405G2982J50600F4100a94106h4761I2730j234a46050B4474d086j31009
$$ 167405 72982 223582 64100 -194106 -84761 92730 91496 -146050 24474 -4086 -135095
15269a35095A48112c4482j08826j03785A01658J64056a2460A59463G990N2129
$$ -135095 148112 -34482 -143308 -247093 101658 265714 -12460 159463 7990 60119
15259F0119A8457J14389L8978C9895e7206B37292b32524B53660G2915A025J76377
$$ 60119 18457 132846 171824 39895 -57206 237292 -232524 253660 72915 1025 177402
15248A77402b91513B88916A30253J20584P6696l4887a623A93314p1324P3812k3366
$$ 177402 -291513 288916 130253 250837 327533 292646 -1623 193314 121990 195802 172436
15237A72436J01930K79121N28215p9815j30322L72297m30191k1522B50835q2650
$$ 172436 274366 553487 1081702 1001887 871565 1243862 813671 792149 250835 168185
15227A68185e93A92444d055D56916j20681b4695A41510b26328A3132K5666a3930
$$ 168185 -593 192444 -4055 456916 336235 -24695 141510 -226328 13132 38798 -13930
15215A9185q92c6436J3919A08188K2332a08770a1167k0314n809A52837e5083B64422
$$ 19185 18293 -36436 -22517 108188 130520 -108770 -11167 -31481 -37290 152837 -55083 264422
15202G0582l2916P1601C2578K37503A27735k553d6479l0274A45484C6583g2635
$$ 70582 37666 109267 32578 270081 127735 125182 -46479 -76753 145484 36583 -72635
15190e4482j58514A5394M8678A3375a9840A53087b24985D3149K59841b84677C4681
$$ -54482 -212996 15394 64072 13375 -19840 153087 -224985 43149 302990 -284677 34681
15178A38049J7125h8911B09150N6667a02940k22856P5958C41380o9992r2779a46345
$$ 138049 155174 -88911 209150 265817 -102940 -325796 -249838 341380 271388 178609 -146345
15166i2059B67798p4299E6805b20341A57406o8896C6257p621J02063m3883L5530
$$ -92059 267798 193499 56805 -220341 157406 88510 36257 28636 130699 86816 122346
15155A22346f0524I2823a3287A61924J77161e4869A64876c9813B15219c8117B3076
$$ 122346 -60524 92823 -13287 161924 339085 -54869 164876 -39813 215219 -38117 23076
15143f206j96690A50826B16c23981A04353j4954J74911K55938e2943A81025B4058
$$ -6206 -202896 150826 216 -323981 104353 89399 264310 520248 -52943 181025 24058
15131A80129a46816C2507K20991B0288J94437a67832B36479J43956n429H4277
$$ 180129 -146816 32507 253498 20288 214725 -167832 236479 380435 375006 84277
15120A97642E416O0933K58385d3122B56312a4802B94847n759N32a32421A48039
$$ 197642 5416 66349 324734 -43122 256312 -14802 294847 289088 289620 -132421 148039
15108c1215A77740l2198k8737J76219E8738p055J85188D9097K16071j10638A317
$$ -31215 177740 145542 116805 293024 58738 51683 236871 49097 265168 154530 1317
15096B49986K33549A89593o6876a47235N4368A44496e7882C22472M3634A54415
$$ 249986 483535 189593 122717 -147235 -92867 144496 -57882 322472 366106 154415
15085B51853K27478A27473b8165B74850A34514J57972G4450K77125j50052b05500
$$ 251853 479331 127473 -28165 274850 134514 292486 74450 351575 201523 -205500
15074B60286H5565J35235c1932A64842L6982j8328M8180F1136K7520O1645J97410
$$ 260286 85565 220800 -31932 164842 201824 183496 231676 61136 88656 150301 347711
15063C47711h9862k1293A70680j6905L31498A37900P4130a2455B27223Q2581a7392
$$ 347711 -89862 -111155 170680 153775 485273 137900 212030 -12455 227223 309804 -17392
15051A1815K92302m7932j26832O0177P1634I1628j1786b6727g9A13208a73437
$$ 11815 304117 256185 129353 189530 261164 91628 79842 -26727 -79 113208 -173437
15039H9114J20421I6678J16166R9175c7655I7569K04886a29888k407A01926O3835
$$ 89114 209535 96678 212844 312019 -37655 97569 302455 -129888 -132295 101926 165761
15028A65761r114K59829p6634H4948g2559a7586A14124c766B87331A10450K6607
$$ 165761 156647 416476 339842 84948 -72559 -17586 114124 -3766 287331 110450 137057
15017A37057L0959l1638J08476A09402k4679K97283g4962j75658c7110B01634
$$ 137057 168016 136378 244854 109402 84723 382006 -74962 -250620 -37110 201634
15006A36850B7929d4112a6429A04286K6085a96038A2020Q5985k9694L69657m8267
$$ 136850 27929 -44112 -16429 104286 130371 -196038 12020 98005 68311 437968 389701
14995C89701A51128N5372J34141A46857h386F3708K18685l4854l6603J81709A63734
$$ 389701 151128 206500 340641 146857 -8386 63708 282393 247539 210936 392645 163734
14983d9356C5301K48718D9154J54552E8415L82926k9124A47528P7983j0777h7810
$$ -49356 35301 284019 49154 203706 58415 441341 412217 147528 225511 214734 -87810
14971C36120k5227K04165A77213K58125j82397K95858k19575l7856o3162K69878
$$ 336120 310893 515058 177213 435338 252941 548799 329224 291368 228206 498084
14961D98084k33325q0152A9107P0854K16734o0548A11583J0257K04017j49068
$$ 498084 264759 184607 19107 89961 306695 246147 111583 121840 325857 176789
14951A76789p2615m9669h6191C56896N5594i2592C05143j19522E2702L80563B04935
$$ 176789 104174 54505 -86191 356896 412490 -92592 305143 185621 52702 433265 204935
14939B54885m2792R2427L65453A03118K5959i6382A60803n2799K51389N0060N5488
$$ 254885 212093 304520 669973 103118 129077 -96382 160803 108004 359393 409453 464941
14928D64941K10816k44061A27574i6D33180I3513L6137J03485J18898n2102q3624
$$ 464941 675757 431696 127574 -96 433180 93513 129650 233135 352033 299931 216307
14917B16307K03598j31588N3856m6616G7638K85214A07867J95449J6788A57077
$$ 216307 419905 288317 342173 295557 77638 362852 107867 303316 320104 157077
14906C69888m5770J2535O5967j38474J00495D4479L91292j3103A20151K97126
$$ 369888 324118 336653 402620 264146 364641 44479 435771 422668 120151 417277
14896D17277j41852q7130J54554J57634A67457o3277J61565J906J0021J39207
$$ 417277 275425 188295 342849 500483 167457 104180 265745 267651 277672 416879
14886D16879R1828j53253K14889A35546O35314C47845Q105r981A05479J81256
$$ 416879 508707 355454 570343 135546 770860 347845 355950 345969 105479 286735
14876B86735n0039J36396K75502B05702R0115L825J20536j26691m2908K76046
$$ 286735 236696 373092 648594 205702 295817 299642 420178 293487 250579 526625
14866E26625j71063A58975J84796q5511Q5482J59385j48360H8565M32357A44333
$$ 526625 355562 158975 343771 258260 343742 503127 354767 88565 520922 144333
14855B81742A05754J48152n0302M39749k04279j13396q3284J93227J32627p6928
$$ 281742 105754 253906 203604 643353 439074 325678 242394 435621 568248 491320
14845D91320N0610B20080K68559j96594R5729j74309M86366k17946J81564j32856
$$ 491320 541930 220080 488639 292045 387774 213465 699831 481885 663449 530593
14835E30593k35583o0565M01755k91184M6981D6626O14280j54649k18459R0448
$$ 530593 295010 234445 636200 345016 391997 46626 660906 506257 287798 378246
14825C78246j67074J46351m4731r7227N38600B95943K93745k53795K31338j57662
$$ 378246 211172 357523 312792 215565 754165 295943 589688 335893 567231 409569
14815D09569J69569k53172K06398J10348A29257L11306A50999n9139M58475j49239
$$ 409569 579138 325966 532364 642712 129257 440563 150999 91860 550335 401096
14805D01096l3633q1613L02947j28093B14325N04535j14333J75046A24446R9844
$$ 401096 367463 285850 588797 460704 214325 718860 604527 779573 124446 224290
14795B24290R83M28505j42791Q6543k67475M09773r5553j42601K43519p2940k60176
$$ 224290 225273 653778 510987 597530 330055 739828 644275 501674 745193 672253 412077
14784D12077J58277B61942j2297J89443O5109J60601j22305j59660p1893q7221
$$ 412077 570354 261942 249645 439088 504197 664798 542493 382833 310940 223719
14774B23719K50119J26070K67548k40785j96975L32998k88230L4563P1476m0752
$$ 223719 473838 599908 867456 626671 429696 762694 474464 509027 580503 539751
14764E39751k03516K34115j15657M41838D47451K0503J27734j9802p9704L34965
$$ 539751 336235 570350 454693 896531 447451 467954 595688 575886 496182 831147
14754H31147l75885j41307O28172k51379j96912J51204l6901N2374l7094L37790
$$ 831147 455262 313955 942127 690748 493836 645040 608139 660513 623419 961209
14744I61209C57833L05061j00713q9228J83255J55476n0535k07519j02293J56174
$$ 961209 357833 662894 562181 472953 656208 811684 761149 553630 451337 607511
14734F07511O8960j8885L40865m9674m23487K38275o932j06525R6562j23062J29067
$$ 607511 676471 657586 998451 948777 525290 763565 756633 650108 746670 623608 752675
14723G52675M8592n4908r2623J7951J9906J93132l41300J50644L8845N0314j39591
$$ 752675 801267 746359 653736 671687 691593 884725 543425 694069 732914 783228 643637
14712F43637J25759J46562j41989M43499m58871K960O0019j29375K7506K26805
$$ 643637 769396 915958 773969 1217468 758597 761557 821576 692201 719707 946512
14702I46512l52874L87176k10348P3113K10191j05599k70022K08091j54391M2630
$$ 946512 593638 980814 770466 843579 1053770 948171 678149 886240 731849 774479
14692G74479J8126l3373N9369m1762K18919l42832q0826O33742m23544l5685L24600
$$ 774479 792605 759232 818601 776839 995758 652926 572100 1205842 782298 746613 1071213
14681A071213j78120K91967E67498M94193m2559P1466j14852l47474r0749M68509
$$ 1071213 893093 1185060 567498 1061691 1019132 1090598 975746 628272 537523 1006032
14671A006032j97430q143q5123M68511l94717p6409L96976n14877N25533m12091
$$ 1006032 808602 800459 715336 1183847 789130 712721 1109697 594820 1120353 708262
14661G08262r5167L32775l7444j99246M11819l97438M44504j15225J14090k46809
$$ 708262 613095 945870 908426 709180 1120999 723561 1168065 1052840 1166930 920121
14651I20121M2131j30297L82137N3769E34698L69171P9999j09370j40332M12171
$$ 920121 962252 831955 1214092 1267861 534698 903869 983868 874498 734166 1146337
14641A146337j94716L77330o8068J37039k57326j19176j07033Q7899J28052j14399
$$ 1146337 951621 1328951 1260883 1397922 1140596 1021420 914387 1002286 1130338 1015939
14631A015939j0789O3522M64217l39855K0944K10705n12066j62485M86149P8557
$$ 1015939 1005150 1068672 1532889 1193034 1213978 1424683 912617 750132 1236281 1314838
14621A314838p4547j33403K40483k07723k39182K70476N85236m96964j28164M07092
$$ 1314838 1240291 1106888 1347371 1139648 900466 1170942 1756178 1259214 1131050 1538142
14611A538142n11208N59169R473l52249p1751J21384R7159K8281K12311j8457
$$ 1538142 1026934 1586103 1595576 1243327 1171576 1292960 1390119 1418400 1630711 1612254
14601A612254j88900k2902N6486q6505J90977j10140q0529j31413L59586j29639
$$ 1612254 1423354 1400452 1456938 1370433 1561410 1451270 1370741 1239328 1598914 1469275
14591A469275m2879J83909j18551J86413R7279k28590k46275L57681J85619j64101
$$ 1469275 1426396 1610305 1491754 1678167 1775446 1546856 1300581 1658262 1843881 1679780
14581A679780j6088K7964M5477k47507K80724K05830k31137O5136P2493J50663
$$ 1679780 1663692 1691656 1737133 1489626 1770350 1976180 1745043 1810179 1882672 2033335
14571B033335l42997K21705j00653J29493j35913j93439K70286M45742l88696
$$ 2033335 1690338 1912043 1811390 1940883 1804970 1611531 1881817 2327559 1938863
14562A938863J06958P2405K36071l89425L5878K86871j40782K53620k62416K37955
$$ 1938863 2045821 2118226 2354297 1964872 2000750 2287621 2146839 2400459 2138043 2375998
14552B375998j15360M18388k61738O6161K10621k97502K37767O7966L51655J55524
$$ 2375998 2260638 2679026 2417288 2483449 2694070 2396568 2634335 2702301 3053956 3209480
14542C209480L9657J75530P19471L90780J07971R65767R33210J690064K261968
$$ 3209480 3249137 3424667 4144138 4534918 4642889 5608656 6541866 8231930 10493898
14533A0493898M662672P135205J0752328n361250j1898525n861563l346971j676115
$$ 10493898 15156570 22291775 33044103 27682853 15784328 9922765 6575794 4899679
14525D899679j009273l83290p12472j98993J52652o78033M97185k2652k41649
$$ 4899679 3890406 3507116 2794644 2595651 2748303 2070270 2567455 2544803 2303154
14516B303154N0902k24463J68478o5694M38332l43089N624m082L8797M9219J71547
$$ 2303154 2354056 2129593 2298071 2232377 2670709 2327620 2333244 2329162 2367959 2417178 2588725
14505B588725l6868k30192N0503K72741j13727n2308L37060j44128M5132M86954
$$ 2588725 2551857 2321665 2372168 2644909 2531182 2478874 2815934 2671806 2716938 3203892
14495C203892m19257j83987M08720J06107k63104r3676J92996p9404K26888K43565
$$ 3203892 2784635 2600648 3009368 3115475 2852371 2758695 2951691 2872287 3099175 3342740
14485C342740m61135L59473j26289j21390J58405J36054j53115L74395m95105
$$ 3342740 2881605 3241078 3114789 2993399 3151804 3287858 3134743 3509138 3014033
14476C014033O70139k37941K3965K19405J67348j27729K7108o8647K24114n26164
$$ 3014033 3684172 3446231 3470196 3689601 3856949 3729220 3756328 3687681 3911795 3385631
14466C385631J19248L18151l39112M57998n1017K48409l03481K89367k43140L52763
$$ 3385631 3504879 3823030 3483918 3941916 3890899 4139308 3835827 4125194 3882054 4234817
14456D234817k49277M09705j98678O4701J31315r6546O5839J19756K22521K31018
$$ 4234817 3985540 4395245 4196567 4261268 4392583 4296037 4361876 4481632 4704153 4935171
14446D935171k58736L74052L4851l25692N89198k33351L52667j71710p2895j33755
$$ 4935171 4676435 5050487 5085338 4759646 5348844 5115493 5468160 5296450 5223555 5089800
14436E089800L14100J04103J71682l52950J82799L96115K52057q7338m56041L38052
$$ 5089800 5403900 5508003 5679685 5326735 5509534 5905649 6157706 6070368 5614327 5952379
14426E952379j52429J95010K68300l63421M69412j78655M60247j34473K15051
$$ 5952379 5799950 5994960 6263260 5899839 6369251 6190596 6650843 6516370 6731421
14417F731421L50030k19104K71070l73475R4626P39389j83433J49407l4213M7777
$$ 6731421 7081451 6862347 7133417 6759942 6854568 7593957 7410524 7559931 7525718 7573495
14407G573495L77074J16765k00983J42138K68712j38949M18415r689J02001j32742
$$ 7573495 7950569 8067334 7866351 8008489 8277201 8138252 8556667 8546978 8648979 8516237
14397H516237K40986N54677m08655L46469j27626M48264J05743m0556K88806J63199
$$ 8516237 8757223 9311900 8903245 9249714 9122088 9570352 9676095 9635539 9924345 10087544
14387A0087544M47224P7142k69464N29677N3916R2244L5328O680Q04940J28639
$$ 10087544 10534768 10611910 10342446 10872123 10926039 11018283 11053611 11060291 11865231 11993870
14377A1993870J48596L31242l974J29466N30946j81971O37137j51726M18223K04595
$$ 11993870 12142466 12473708 12469734 12599200 13130146 12948175 13585312 13433586 13851809 14056404
14367A4056404M82611p7621L7997O79218L66413L05194L68453L60521j08024Q53475
$$ 14056404 14539015 14461394 14499391 15178609 15545022 15850216 16218669 16579190 16471166 17324641
14357A7324641N09632J83069p1442P22580K17899K87986M56302N34658Q28633
$$ 17324641 17834273 18017342 17945900 18668480 18886379 19174365 19630667 20165325 20993958
14348B0993958N64599J84906J34727P91517L00243N02916P91959Q16925O5379
$$ 20993958 21558557 21743463 21878190 22669707 22969950 23472866 24264825 25081750 25147129
14339B5147129Q79448O64942M78034N37133P85543J027770N53199P66107Q91830
$$ 25147129 26026577 26691519 27169553 27706686 28492229 29519999 30073198 30839305 31731135
14330C1731135P82616R04587Q07417R38296Q99475J168526J111409R96653J478361
$$ 31731135 32513751 33418338 34225755 35164051 36063526 37232052 38343461 39340114 40818475
14321D0818475J131208J080436J285684J315084J668719J359507J355781J824100
$$ 40818475 41949683 43030119 44315803 45630887 47299606 48659113 50014894 51838994
14313E1838994J628339J781180J885011J626867K571971J933004K166028K355342
$$ 51838994 53467333 55248513 57133524 58760391 61332362 63265366 65431394 67786736
14305F7786736K548188K372908L021096K800550K971497L410667L169058L833390
$$ 67786736 70334924 72707832 75728928 78529478 81500975 84911642 88080700 91914090
14297I1914090L543610M156001M158966M472331M624700N359221M955357N988926
$$ 91914090 95457700 99613701 103772667 108244998 112869698 118228919 123184276 129173202
14289A29173202N649571O645595O206720P095597P584933P965589Q201385Q821620
$$ 129173202 134822773 141468368 147675088 154770685 162355618 170321207 178522592 187344212
14281A87344212R787860J0106197J0338358J1447591J1502108J2420598J3029474
$$ 187344212 197132072 207238269 217576627 229024218 240526326 252946924 265976398
14274B65976398J3323072J4166686J4035558J5034363J4445668J4639812J4614891
$$ 265976398 279299470 293466156 307501714 322536077 336981745 351621557 366236448
14267C66236448J3853914J2468937J1846135J1187260J0295773R191268Q472333
$$ 366236448 380090362 392559299 404405434 415592694 425888467 435079735 443552068
14260D43552068P123608O112259M315286R00828l42065J34361n492246r461339
$$ 443552068 450675676 456787935 461103221 462004049 461661984 461796345 456304099 446842760
14252D46842760q834297r986729j1443341j0051986j3204539j4308390j3784088
$$ 446842760 438008463 428021734 416578393 406526407 393321868 379013478 365229390
14245C65229390j4207215j4596873j4608173j3896319j3024659j3740387j3443707
$$ 365229390 351022175 336425302 321817129 307920810 294896151 281155764 267712057
14238B67712057j2362493j2488206j1561363j1897986j1120878j1050648j0465427
$$ 267712057 255349564 242861358 231299995 219402009 208281131 197230483 186765056
14231A86765056r558963r074725q480035p381749p601749o707338o771289n957716
$$ 186765056 177206093 168131368 159651333 152269584 144667835 137960497 131189208 125231492
14223A25231492n531279m862390n101108m914789m433585m300715l476806l877360
$$ 125231492 119700213 114837823 109736715 104821926 100388341 96087626 92610820 88733460
14215H8733460l332162m079363k435020l438652k533793k875187k628327k378039
$$ 88733460 85401298 81321935 78886915 75448263 72914470 70039283 67410956 65032917
14207F5032917k149966k116055j923474k004825k128435j725471j638341j270299
$$ 65032917 62882951 60766896 58843422 56838597 54710162 52984691 51346350 50076051
14199E0076051j612012j524389j461557j389951j561609j030445j077544q89367
$$ 50076051 48464039 46939650 45478093 44088142 42526533 41496088 40418544 39529177
14191C9529177j096853j535632j160163p82808p18057p80906p84774q07399p52329
$$ 39529177 38432324 36896692 35736529 34953721 34235664 33454758 32669984 31862585 31110256
14182C1110256j226126m81944n83208r50364n81715o76371r51433l05136q07956
$$ 31110256 29884130 29402186 28818978 27868614 27286899 26610528 25659095 25353959 24546003
14173B4546003n77852j13097o70868q59583m35581l84785n81253k87335m59657
$$ 24546003 23968151 23855054 23184186 22324603 21889022 21504237 20922984 20635649 20175992
14164B0175992l51025m87695k17182m86329l81616p37155p4616l39774q6491n46061
$$ 20175992 19824967 19337272 19120090 18633761 18252145 17514990 17440374 17100600 17014109 16468048
14154A6468048j54202k36030l58417k93298k95784n39817k83628k25103o6546
$$ 16468048 16313846 16077816 15719399 15426101 15130317 14590500 14306872 14081769 14015223
14145A4015223j5032l02041m45434L6892k66593m61545J04525n10929K20644j029031
$$ 14015223 14000191 13698150 13252716 13289608 13023015 12561470 12665995 12155066 12375710 11346679
14135A1346679N51215k02886l86576n1390m35291M1688m49622m4496K3852p8339
$$ 11346679 11897894 11695008 11308432 11257042 10821751 10863439 10413817 10369321 10393173 10314834
14125A0314834j1578m18241j45808j13735m14701K96712n57349J84032j82581
$$ 10314834 10303256 9885015 9739207 9625472 9210771 9507483 8950134 9134166 8951585
14116H951585k91574k8540k71608J47139k01473p5840j17704k22324M1306q6062
$$ 8951585 8660011 8631471 8359863 8507002 8305529 8229689 8111985 7889661 7930967 7844905
14106G844905l82382Q4069k26745O7843o6638m3720n7215k91581J71891l88784
$$ 7844905 7462523 7546592 7319847 7387690 7321052 7277332 7220117 6928536 7100427 6711643
14096F711643k01535J41705K9393n5178n30622J98494p5484J22639l61558L040
$$ 6711643 6510108 6651813 6681206 6626028 6095406 6293900 6218416 6341055 5979497 5982537
14086E982537M0959j07436l05986J27205k30918K00584k74303l1405n380P1418
$$ 5982537 6023496 5916060 5610074 5737279 5506361 5706945 5432642 5401237 5395857 5467275
14076E467275l49285L78882j31052m41972K46900K656n15220J46402j20212j78742
$$ 5467275 5117990 5496872 5365820 4923848 5170748 5173404 4658184 4804586 4684374 4505632
14066D505632L33348n79114M65471j237j57313m7598j32040J59259k74302j75934
$$ 4505632 4838980 4259866 4725337 4724100 4566787 4519189 4387149 4546408 4272106 4096172
14056D096172L44278j6540k21115l78527n9648k26527N17089m5373J30204l66200
$$ 4096172 4440450 4423910 4202795 3824268 3764620 3538093 4055182 4009809 4140013 3773813
14046C773813L05123j87326j449K41446k49690r9706J93209l7679m88522j85523
$$ 3773813 4078936 3891610 3890161 4131607 3881917 3782211 3975420 3937741 3449219 3263696
14036C263696K70162j68070L31232m17489j25778j13338J24309j03778K3270n3113
$$ 3263696 3533858 3365788 3697020 3279531 3153753 3040415 3164724 3060946 3084216 3031103
14026C031103J58150m3276m62866M37816M3251j28538M8032m2915k39641K92823
$$ 3031103 3189253 3145977 2683111 3120927 3164178 3035640 3083672 3040757 2801116 3093939
14016C093939j31102K23828j5992n02222m2763j5757M60954l61678R0366m07338
$$ 3093939 2962837 3186665 3170673 2668451 2625688 2609931 3070885 2709207 2799573 2392235
14006B392235M60403k27263k4750o7232K6755J36019k56191O3793J42994m12046
$$ 2392235 2852638 2625375 2600625 2533393 2560148 2696167 2439976 2503769 2646763 2234717
13996B234717j83099K57785Q6141J423L0395j73732L4243J51625k64323O0575
$$ 2234717 2051618 2309403 2395544 2396967 2427362 2253630 2287873 2439498 2175175 2235750
13986B235750k06075N03508m76223L08195n4365P7469M6467O4057Q19570o010
$$ 2235750 2029675 2533183 2056960 2365155 2310790 2388259 2434726 2498783 3318353 3312343
13976C312343M04278J044321K087967L733671O619251J0877988N24870r939726
$$ 3312343 3716621 4760942 6848909 10582580 17201831 28079819 28604689 18664963
13968A8664963o131423l420216k027158j331815r40202m37920n39254m13774k09539
$$ 18664963 12533540 9113324 7086166 5754351 4814149 4376229 3836975 3423201 3213662
13959C213662j11226l21517O0628K42916l07861k87663j27124k87252K27748j59037
$$ 3213662 3102436 2780919 2841547 3084463 2776602 2488939 2361815 2074563 2302311 2143274
13949B143274O4068J60588k38072k05195K40769j39750M1855n9683O5186j96702
$$ 2143274 2207342 2367930 2129858 1924663 2165432 2025682 2067537 2007854 2073040 1876338
13939A876338J14231J57219j11260k0207j61429p5905L75570o2937l27006Q3299
$$ 1876338 1990569 2147788 2036528 2016321 1854892 1778987 2154557 2091620 1764614 1847913
13929A847913P6758n76183M27381M9174M7962j31181r1935N304n4247Q9775l31490
$$ 1847913 1924671 1348488 1775869 1825043 1873005 1741824 1649889 1655193 1600946 1690721 1359231
13918A359231K59101j34072n7293J09568K9325Q9539j24864m95467K77354J36617
$$ 1359231 1618332 1484260 1426967 1536535 1565860 1655399 1530535 1035068 1312422 1449039
13908A449039K1939J84087K35542m52066O4661j1159k81895K33637l8389j98440
$$ 1449039 1470978 1655065 1890607 1438541 1503202 1492043 1210148 1443785 1405396 1206956
13898A206956K11637K29614k45308L29810n26834K73566j93790M1835L42631L9521
$$ 1206956 1418593 1648207 1402899 1732709 1205875 1479441 1285651 1327486 1670117 1709638
13888A709638j38988N8288j86000k85040L76676m03568L22295R5203m92899L31144
$$ 1709638 1570650 1628938 1442938 1157898 1534574 1131006 1453301 1548504 1055605 1386749
13878A386749l5895P2854k20555n3194Q3741j97907K63627j5217R7033k7727k35916
$$ 1386749 1350854 1423708 1203153 1149959 1233700 1035793 1299420 1284203 1381236 1353509 1117593
13867A117593L83071n38534N32995p2285M8712k38561l95514N68145o19419M97038
$$ 1117593 1500664 962130 1495125 1422840 1471552 1232991 837477 1405622 786203 1283241
13857A283241o2151K02702j39910k27738j58101J43505O5658k13378J41130K47070
$$ 1283241 1221090 1423792 1283882 1056144 898043 1041548 1107206 893828 1034958 1282028
13847A282028n35841M26012J43628l89107K01616L1895m805k00887K27366j64208
$$ 1282028 746187 1172199 1315827 926720 1128336 1160231 1155426 954539 1181905 1017697
13837A017697j55710J02576K49280k11112j0420L4391o6407p7092j2228N5332
$$ 1017697 861987 964563 1213843 1002731 992311 1026702 960295 883203 870975 926307
13827I26307k43320K28932q8769L96206k44564k26646n1291K7264R9528o2078
$$ 926307 682987 911919 823150 1219356 974792 748146 696855 724119 823647 761569
13817G61569K33390l67430L39016k21763K19291l96477L32046J41301l31824L1544
$$ 761569 994959 627529 966545 744782 964073 567596 899642 1040943 709119 740663
13807G40663K54337l3068k15714J96874j37133j94955J42353M17458j83617M1212
$$ 740663 995000 961932 746218 943092 805959 611004 753357 1170815 987198 1028410
13797A028410n3619j70223J10276k27163q8260n105K77704M51305m72770j56590
$$ 1028410 974791 804568 914844 687681 599421 594316 872020 1323325 850555 693965
13787F93965j1188L05289j24962L170l8992k45316L82868m25353O7130o2682K30692
$$ 693965 682777 988066 863104 866274 827282 581966 964834 539481 606611 543929 774621
13776G74621j27088J88010J31976q2738Q2192l21299l1400j51058L66763l27536
$$ 774621 647533 835543 967519 884781 966973 645674 614274 463216 829979 502443
13766E02443Q6370J45993j63896J39669l32285p5835N29427l12287p119K30362
$$ 502443 588813 734806 570910 710579 378294 302459 831886 519599 512480 742842
13756G42842K437J20406j70495M0830j63125J55666M4483m7442j89716k61982
$$ 742842 745279 865685 695190 736020 572895 728561 773044 725602 535886 273904
13746B73904J2664L09181J38352q7190K19650j06762m7415l50277J56325q0504
$$ 273904 286568 595749 734101 646911 866561 759799 712384 362107 518432 437928
13736D37928J22372A46525M52865J13352m5827M876k19280L18349l42829K66907
$$ 437928 560300 146525 599390 712742 666915 671791 452511 770860 428031 694938
13726F94938l34985J92575J03604k82664K90260j20571Q3127q2848l8157K05927
$$ 694938 359953 552528 656132 373468 663728 543157 626284 543436 505279 711206
13716G11206J44936m10132Q3208l9884j8138o393n9989J20689J05638l14206N23053
$$ 711206 856142 446010 529218 489334 471196 464803 404814 525503 631141 316935 839988
13705H39988j92936j30000Q4860O7366j21584L06799C70857J88425m722R5608
$$ 839988 647052 517052 601912 669278 547694 854493 370857 559282 554560 650168
13695F50168C07449M0370K67220K7966l5591N4377B94689L48407R7365r7172j75366
$$ 650168 307449 347819 615039 643005 607414 661791 294689 643096 740461 643289 467923
13684D67923K13708k91983O4833K55954C39829K16513J37248N1160k82114P0629
$$ 467923 681631 389648 454481 710435 339829 556342 693590 744750 462636 533265
13674E33265A24292L21031J05003j57312o9760M9580K26783q1392j87243L30649
$$ 533265 124292 445323 550326 393014 323254 372834 599617 518225 330982 661631
13664F61631N4857l03668B00283J50607M6886n1058b7992E65572k76292N34781
$$ 661631 716488 412820 200283 350890 397776 346718 -27992 565572 289280 824061
13654H24061B91321L42365j69697k10768K22567L656K56953B89038H4123N10500
$$ 824061 291321 633686 463989 253221 475788 479444 736397 289038 84123 594623
13644E94623L55259D31069J7678D5604J85873J35391L2946J41590l5041j40739
$$ 594623 949882 431069 448747 45604 231477 366868 399814 541404 506363 365624
13634C65624J4014A04545M44062j51411J441J21298j94851p7485M79733k86160
$$ 365624 379638 104545 548607 397196 398637 519935 325084 247599 727332 441172
13624D41172k11721M89700B88725R9370M3643F8268M66162A79953J05957K01940
$$ 441172 229451 719151 288725 388095 431738 68268 534430 179953 285910 487850
13614D87850k23076J31084P7299j56328m2384K55756A19343l0761L26730P3330
$$ 487850 264774 395858 473157 316829 274445 530201 119343 88582 415312 488642
13604D88642j68328m2672K86244G7768K81374j66106L9603K61107k26676J29079
$$ 488642 320314 277642 563886 77768 359142 193036 232639 493746 267070 396149
13594C96149Q4704G688J27375K31530k4252K3323j19388M1375n3191L71831A84761
$$ 396149 480853 7688 135063 366593 342341 365664 246276 287651 234460 606291 184761
13582E85602I9710J58593l7507n8299Q7688n3537P4073L5176J32417R0187q0882
$$ 585602 99710 258303 220796 162497 250185 196648 270721 305897 438314 528501 447619
13571D47619B04684Q1300L40102k34278A51798J07735J4344a9084A32024M4411
$$ 447619 204684 285984 626086 391808 151798 259533 273877 -19084 132024 176435
13561A76435j8715J65494p2171a49065F18207B49583J34969K79694C12584J27510
$$ 176435 157720 323214 251043 -149065 618207 249583 384552 664246 312584 440094
13551D40094k9674O7471O4985p4652A04033K91097J89323m6986K2090k25678j09350
$$ 440094 410420 477891 542876 468224 104033 395130 584453 537467 559557 333879 224529
13540B24529J48990m8249K77683l9887A32144J06209J86716A13569L42520j28853
$$ 224529 373519 325270 602953 563066 132144 238353 425069 113569 456089 327236
13530C27236J80536A12117J16291K58758A73273C0693K76447p7171J93957A75681
$$ 327236 507772 112117 228408 487166 173273 30693 307140 229969 423926 175681
13519D88434E6633J66248M4240K6932J46652A27344G32N84339B87940A40906K25602
$$ 488434 56633 222881 267121 294053 440705 127344 732 585071 287940 140906 366508
13508C66508A41451K17568j08705J20548j79329P9765q9298J5503J50159d7940
$$ 366508 141451 359019 250314 370862 191533 271298 182000 197503 347662 -47940
13497C87540k4935j77776J24080G7227C2155J60626B538L71692j7485j74603K30200
$$ 387540 362605 184829 308909 77227 32155 192781 2538 374230 356745 182142 412342
13486D12342j19738E6667K13637L49292A53120M83928A93597J39045D5504K56535
$$ 412342 292604 56667 270304 619596 153120 637048 193597 332642 45504 302039
13476C02039I697L39129A40787r992L30795j30967A20719J8395J68752j20672
$$ 302039 9697 348826 140787 130795 461590 330623 120719 139114 307866 187194
13466A87194a04455B56514A27541N6376J05329C2899K93755j17459M29771B12773
$$ 187194 -104455 256514 127541 183917 289246 32899 326654 209195 638966 212773
13455a01940A80524R9112E4274M2866L69939B22878K3040A04139K90537A36698
$$ -101940 180524 279636 54274 97140 467079 222878 245918 104139 394676 136698
13444B46036J35011j38521j9091r8199P1087K47490C1555i881B10350F1976e7611
$$ 246036 381047 242526 223435 125236 196323 443813 31555 -9881 210350 61976 -57611
13432a11730B90699j27192K04225A06313i958C04656l5065F860a00458M9906B70652
$$ -111730 290699 163507 367732 106313 -9958 304656 269591 6860 -100458 -50552 270652
13420C80503d1649A22751J36718a98997C92282A83039R6991J10214a9786C56560
$$ 380503 -41649 122751 259469 -198997 392282 183039 280030 390244 -19786 356560
13409C53887O160l7116e4356E30830q4777A15292m5895K56585J20125A78551b6530
$$ 353887 360047 322931 -54356 530830 446053 115292 69397 325982 446107 178551 -26530
13397E5835J00871J73035A38876a94258C22299A21496N7121g0345l6785A47404
$$ 55835 156706 329741 138876 -194258 322299 121496 178617 -70345 -107130 147404
13386B29286a28217A72779M9711I3416a16979B21182N1786k4274c947A7422L8008
$$ 229286 -128217 172779 222490 93416 -116979 221182 272968 248694 -3947 17422 55430
13375E5430L22587m972b15225A87649c35878J47815D35382B6307l137N85266A74909
$$ 55430 378017 373045 -215225 187649 -335878 -188063 435382 26307 23170 608436 174909
13363B97541j29569J42758A36982K84855A00311e3944C73116C2541M26648A05426
$$ 297541 167972 310730 136982 421837 100311 -53944 373116 32541 459189 105426
13352E10139j94166q4039l8009e399C77670e0702F9166K01510j13700c84093A06683
$$ 510139 315973 231934 193925 -5399 377670 -50702 69166 270676 156976 -384093 106683
13340A57258i2712E2409K32652J30926A31885J7624Q4178j1913A8221C945N14372
$$ 157258 -92712 52409 285061 415987 131885 149509 233687 221774 18221 3945 518317
13329E18317k33593M6275N5254r7919q6541j8196J7096J10905L1850B5230R3459
$$ 518317 284724 330999 386253 288334 201793 183597 200693 311598 343448 25230 118689
13318A18689J17530O2927B2182J39533B1266L03550n2330q8881P9596M70a48016
$$ 118689 236219 299146 22182 161715 21266 324816 272486 183605 263201 263671 -148016
13306A19769K57185j50878k6894k3257A7077O7214L34605b56657A85491P7050
$$ 119769 376954 226076 199182 175925 17077 84291 418896 -256657 185491 262541
13296B62541p3834J85049j49577p1427b19899I1642J05864L3166F1762J92824
$$ 262541 188707 373756 224179 152752 -219899 91642 197506 230672 61762 254586
13286B54586A21123K11210q7876c10172E6445j4693a85386B35040J43514A31676
$$ 254586 121123 332333 244457 -310172 56445 41752 -185386 235040 378554 131676
13275A80563L282H7070M22625A90469J995i6600D1312N7409J76708K4325j16681
$$ 180563 183845 87070 509695 190469 192464 -96600 41312 98721 275429 299754 183073
13264A83073a58867A97255F1859J77656A12614C1723c3268B3451K05577E5044
$$ 183073 -158867 197255 61859 239515 112614 31723 -33268 23451 229028 55044
13253B07016K58272a69889j1152A70881D0050b497k68995B74507l5510P2909h3520
$$ 207016 465288 -169889 -181041 170881 40050 -2497 -271492 274507 238997 311906 -83520
13241A22797K77985A57071L2330o950K342l6393J2723k5556J1231g0163a6492
$$ 122797 400782 157071 189401 182451 184793 148400 161123 135567 146798 -70163 -16492
13229C17566j36833a62585C74114B1192J76179K10624A38111D0211J78295G3964
$$ 317566 180733 -162585 374114 21192 197371 407995 138111 40211 218506 73964
13218G4566f2295A29694J02676A09627B5232J40668K68410b1427G4147k3491K3082
$$ 74566 -62295 129694 232370 109627 25232 165900 434310 -21427 74147 50656 73738
13207G3738K30533b00787F3342R4566P7853A6976O0437d7935B127d9893A91972
$$ 73738 304271 -200787 63342 157908 235761 16976 77413 -47935 2127 -49893 191972
13195A15872a45847C00830j36989K30091l4296j26561n9314p4573Q9583N4537
$$ 115872 -145847 300830 163841 393932 359636 233075 173761 99188 188771 243308
13185B43308l468c4600A75894a81692A68234J24276f376C21765A02257E0058h0985
$$ 243308 239840 -34600 175894 -181692 168234 292510 -6376 321765 102257 50058 -80985
13173g8562B18123D4194a12184B21808a04337H3918a82166E1488K08146i4080
$$ -78562 218123 44194 -112184 221808 -104337 83918 -182166 51488 259634 -94080
13162a29889A64221d98643A86065F0402i7363A56493G4151l3350K12762A3061
$$ -129889 164221 -498643 186065 60402 -97363 156493 74151 40801 253563 13061
13151A14019a9260F3454P2514b8216I4895K60363L2995A81023J11809d6906B24521
$$ 114019 -19260 63454 135968 -28216 94895 355258 388253 181023 292832 -46906 224521
13139A25421a6728B79521A24102L7748L3993n3526D223f0352B7726a2859r9591
$$ 125421 -16728 279521 124102 161850 195843 142317 4223 -60352 27726 -12859 -112450
13128a12450r4981B26452J87892A42628b54273E7944J45554a12229m5451c3535
$$ -112450 -207431 226452 414344 142628 -254273 57944 203498 -112229 -157680 -33535
13117I2433k2350h9260C1856A4401L03715e3486j5756A41971P1361G2219K29945
$$ 92433 70083 -89260 31856 14401 318116 -53486 -69242 141971 213332 72219 302164
13106C02164j17171E1064N5762b2745A98667o8963b25737A47870C5861a8990g6
$$ 302164 184993 51064 106826 -22745 198667 129704 -225737 147870 35861 -18990 -76
13094A52448l9968g8430j38174A23674B6811J95188l0949a6207A62750d7123B27778
$$ 152448 112480 -78430 -216604 123674 26811 221999 191050 -16207 162750 -47123 227778
13082G8080k9531J08274d0868n6310A37237D0644J8192K97207a69955B7747J9058
$$ 78080 48549 156823 -40868 -97178 137237 40644 58836 356043 -169955 27747 46805
13071D6805b32641a01869A36640R7691a83117D6779Q3264B6523J55373a42023
$$ 46805 -232641 -101869 136640 234331 -183117 46779 130043 26523 181896 -142023
13060B50686b5614G3442k341a74181F4041L1381M5666f5301A52763a42629A3570
$$ 250686 -25614 73442 71101 -174181 64041 95422 141088 -65301 152763 -142629 13570
13048C60684h7879B79192K06475c4395I3866j9347d6934n1296A59940J29011C2326
$$ 360684 -87879 279192 485667 -34395 93866 74519 -46934 -98230 159940 288951 32326
13036A41627J50741A9263K40346H8575a54045A43023F2883K18821j27195a93370
$$ 141627 292368 19263 259609 88575 -154045 143023 62883 281704 154509 -193370
13025b95602b4748p3513a1184I0954J16280q7343c47546A66871O0500a7518B23824
$$ -295602 -24748 -98261 -11184 90954 207234 119891 -347546 166871 227371 -17518 223824
13013D2307J05380a73157b6890A00974J06481K44499F8134K98128F7321j8765
$$ 42307 147687 -173157 -26890 100974 207455 451954 68134 366262 67321 48556
13003D8556J44499d8542l2862A60123G1164O480O5697L893J15954b42848A31450
$$ 48556 193055 -48542 -81404 160123 71164 77644 143341 147234 263188 -242848 131450
12991E4211Q7649J03928r1461D0141a13786A23825a8496m557k8130C61890g2738
$$ 54211 141860 245788 154327 40141 -113786 123825 -18496 -23053 -51183 361890 -72738
12979C28043F051K78274M061F0704d3564A11969l8181K07094g3981A88805d22580
$$ 328043 6051 284325 288386 60704 -43564 111969 73788 280882 -73981 188805 -422580
12967A48056C1505a59521J4582e7316A39276J65416a98103l4251A1864K04964
$$ 148056 31505 -159521 -144939 -57316 139276 304692 -198103 -232354 11864 216828
12957B16828G8231K0993a37118I0517J5688a41075P0456a1691A53875k8667a07720
$$ 216828 78231 99224 -137118 90517 106205 -141075 -70619 -11691 153875 125208 -107720
12945d5559A64797g150j50878A02640M9137N0050c21398H8046a74809B73507b34586
$$ -45559 164797 -7150 -158028 102640 151777 201827 -321398 88046 -174809 273507 -234586
12933A35098D2583J59709K12372A50868l2496b07733G8166h3398j0619A9831Q2973
$$ 135098 42583 202292 414664 150868 118372 -207733 78166 -83398 -94017 19831 102804
12922A02804B5145P4580D8721J32434h5027C0903f076k3308m267j15521e8590
$$ 102804 25145 99725 48721 181155 -85027 30903 -6076 -29384 -33651 -149172 -58590
12910I8216b8056C36748g0113A1188P5057o957i4846r1724L7545I8892d2687C48049
$$ 98216 -28056 336748 -70113 11188 86245 79288 -94846 -186570 -149025 98892 -42687 348049
12897b62275A18895N8446i3249A85149Q8061a24805D3894d2384C32819A41752
$$ -262275 118895 177341 -93249 185149 273210 -124805 43894 -42384 332819 141752
12886b50687g7858o4207A56423b53766a18458B62989j28159C9802a08751A7807
$$ -250687 -77858 -142065 156423 -253766 -118458 262989 134830 39802 -108751 17807
12875F0502a88336k73164f3693k8980A2008M50003F5041K68543E9785O5567a37850
$$ 60502 -188336 -461500 -63693 -92673 12008 462011 65041 333584 59785 125352 -137850
12863d3596E339L10416j45585q4934b72145C6719a47271O0493b059D7927L8244
$$ -43596 5339 315755 170170 85236 -272145 36719 -147271 -86778 -2059 47927 86171
12852H6171K2164b96955I2812K58969f180A33942a09909a890A1059a08627p7533
$$ 86171 108335 -296955 92812 351781 -6180 133942 -109909 -1890 11059 -108627 -186160
12841a86160B84890a73301A5206K35505E4920M71329B06814a28304B1144b3318
$$ -186160 284890 -173301 15206 250711 54920 526249 206814 -128304 21144 -23318
12830B30556A14706d7932B05738a38334j08052L2698A83423a14220D2615b66534
$$ 230556 114706 -47932 205738 -138334 -246386 -213688 183423 -114220 42615 -266534
12819A55203o6084b2601A13071j6654j5375A0800R86d25450e20A01689b19801
$$ 155203 89119 -22601 113071 96417 81042 10800 11786 -425450 -520 101689 -219801
12807d31947B21460N1522F5988A2511J75492o2777F13J0533Q0599P1253a69766
$$ -431947 221460 272982 65988 12511 188003 125226 613 11146 91745 162998 -169766
12795A92659b4271k40823F4660d38k9437A14673J02583d03847B30428a8863I5104
$$ 192659 -24271 -265094 64660 -438 -29875 114673 217256 -403847 230428 -18863 95104
12783a74172L397E9900b6511F7449a5888n4711A93768A9367f0830k0237A02133
$$ -174172 -170775 59900 -26511 67449 -15888 -70599 193768 19367 -60830 -81067 102133
12771b3255H0747c2630A83946A5533J2116J0872J1346I644L51276c5613B15204
$$ -23255 80747 -32630 183946 15533 27649 38521 49867 9644 360920 -35613 215204
12759A40039k6643A0687c0214A11022a01366j40471A83714B6250J54577a53208
$$ 140039 113396 10687 -30214 111022 -101366 -241837 183714 26250 180827 -153208
12748a02833I2135a75599J0960B20788k7479a53992b2780m3250A7474b04423A45638
$$ -102833 92135 -175599 -164639 220788 193309 -153992 -22780 -66030 17474 -204423 145638
12736A33348M58686B45860a54484D30018A47826J91576a74613B9394J28688k7924
$$ 133348 592034 245860 -154484 430018 147826 339402 -174613 29394 158082 130158
12726A30158m4351a13604G2155j5958J10519p1260e0936c826F2810e5130k7406
$$ 130158 85807 -113604 72155 56197 166716 95456 -50936 -3826 62810 -55130 -82536
12715h2536L4486B34769d0155B60480q1686J066d9980j4250B33948a67975D4005
$$ -82536 -48050 234769 -40155 260480 178794 179860 -49980 -64230 233948 -167975 44005
12703h9168A20521K75977c63477i7807A19958E0791c4227a4099B19247c0653B06542
$$ -89168 120521 396498 -363477 -97807 119958 50791 -34227 -14099 219247 -30653 206542
12691A59658J53238r2837P6506j10712a1150C12525G9248e4498A58556p3250a31556
$$ 159658 312896 220059 296565 185853 -11150 312525 79248 -54498 158556 85306 -131556
12679g0494k71556E4990a89911E2851O1573a88953j09879b5560I3371M6879n0885
$$ -70494 -342050 54990 -189911 52851 114424 -188953 -298832 -25560 93371 140250 89365
12668H9365Q7097b20424c1188B3767K6901R3104L05678A06372i6154D67066I9627
$$ 89365 176462 -220424 -31188 23767 50668 143772 449450 106372 -96154 467066 99627
12656B129h6844l5120A9870p873J50484E3477N0110c77670A61314M6761k4370
$$ 2129 -86844 -121964 19870 11997 162481 53477 103587 -377670 161314 208075 183705
12645A83705r514o0546J96879A27102D360a02523C58521a53881J3978j83584J10174
$$ 183705 174191 113645 310524 127102 4360 -102523 358521 -153881 -139903 -323487 -213313
12634b13313A75587B6413K0212K86547A07249m2182B6234J50213D8228a23525
$$ -213313 175587 26413 46625 333172 107249 65067 26234 176447 48228 -123525
12623A85220c49909a20990p464K6868HK59955J36704n8251A60902e6131B47760
$$ 185220 -349909 -120990 -128454 -101586 8 259963 396667 338416 160902 -56131 247760
12611G3905K39157r449J49303A45636l9685K54974a54659m8833G8893J38026a3665
$$ 73905 313062 303613 452916 145636 105951 360925 -154659 -203492 78893 216919 -13665
12599e4685B79896d7226F9973J3398a91750b3720k81016b4872L775A43360o7935
$$ -54685 279896 -47226 69973 83371 -191750 -23720 -304736 -24872 -21097 143360 75425
12588G5425a24008B47838c4520C9749B91J80246A8842c53783A72000F251J42999
$$ 75425 -124008 247838 -34520 39749 291 180537 18842 -353783 172000 6251 149250
12577A49250R6725a4339D3795a57683G4090P0426b83431a11859A34831c574j5211
$$ 149250 245975 -14339 43795 -157683 74090 144516 -283431 -111859 134831 -3574 -18785
12566a8785Q654k69869B77267f4650G8539C06a21976c7438m8734C7311Q2601N406
$$ -18785 -10131 -280000 277267 -64650 78539 306 -121976 -37438 -86172 37311 119912 125318
12554A25318b17051I9771J93261I2387d971B06323r7874J0722R0026m7276J0042
$$ 125318 -217051 99771 293032 92387 -4971 206323 108449 119171 209197 161921 171963
12543A71963k3347j7170a16761N0231k21624c5176k13653J09272A22018a49265
$$ 171963 148616 131446 -116761 -66530 -288154 -35176 -248829 -139557 122018 -149265
12532h4172l1262n9228A70967d2133A24412a6829B86541N2372D7049h3400A10187
$$ -84172 -115434 -174662 170967 -42133 124412 -16829 286541 338913 47049 -83400 110187
12520a86044E7718a39625A21827E4643h6719k99480g182l1588a256n6266B516
$$ -186044 57718 -139625 121827 54643 -86719 -386199 -7182 -38770 -1256 -57522 2516
12508A14918J22447p8547B4576J17767b15457Q7549A34970B5559d6762I0323b5192
$$ 114918 237365 158818 24576 142343 -215457 -127908 134970 25559 -46762 90323 -25192
12496B50845d7098A4147c51958b4061A52624p0888a04356F8270b22267b1086C370
$$ 250845 -47098 14147 -351958 -24061 152624 81736 -104356 68270 -222267 -21086 3370
12484a90828a4581j48385K4151A01699c1884a2342b904C26194b40591A82121b12502
$$ -190828 -14581 -162966 -138815 101699 -31884 -12342 -2904 326194 -240591 182121 -212502
12472A97093a3016A91610b318G2285K03230A12198J03347M0160j06298a04613
$$ 197093 -13016 191610 -2318 72285 275515 112198 215545 255705 149407 -104613
12461B20643a6893j60050B40997c54299E47352A16670k9996B8882a53993B60734
$$ 220643 -16893 -176943 240997 -354299 547352 116670 86674 28882 -153993 260734
12450a56761I5316g5546B6299i8750A07099O6106A7312K40453a4119l69926H5909
$$ -156761 95316 -75546 26299 -98750 107099 173205 17312 257765 -14119 -384045 85909
12438A74161J57883b50674a02962F5771L5121b26166F2429c9754D9762R2329a5807
$$ 174161 332044 -250674 -102962 65771 100892 -226166 62429 -39754 49762 142091 -15807
12426A08243j0883b33908E6831d9081J5905q8541N1110A70511c6530A82275J760
$$ 108243 97360 -233908 56831 -49081 -33176 -121717 -70607 170511 -36530 182275 184035
12415A84035B8031c3070G2312K2413a54869B68852F3119a29223E7736Q6535J40255
$$ 184035 28031 -33070 72312 94725 -154869 268852 63119 -129223 57736 144271 284526
12404B84526H285a37174d8853E8449b3387l26049C07843C0156P1995Q3104c9999
$$ 284526 8285 -137174 -48853 58449 -23387 -349436 307843 30156 102151 185255 -39999
12392A7308a70595B91422c22078J59702E5723b40698g0153q8746N9272A48874
$$ 17308 -170595 291422 -322078 -162376 55723 -240698 -70153 -158899 -99627 148874
12381a14345k67084A3203F075J64821D8660L81686k05537j09803d40705a53457
$$ -114345 -381429 13203 6075 170896 48660 430346 224809 115006 -440705 -153457
12370f9831k54817C69715G6866J30003r0510R7312I5417a64827n0592o6151j8227
$$ -69831 -324648 369715 76866 206869 116359 213671 95417 -164827 -215419 -281570 -299797
12359b99797B01874n9773L3887B0607b07693m1873O9054b1897I7993a32159I0887
$$ -299797 201874 142101 175988 20607 -207693 -249566 -180512 -21897 97993 -132159 90887
12347A82503E9124b98068D12084a13973A69643F6645a08263Q314m3112E8679K5832
$$ 182503 59124 -298068 412084 -113973 169643 66645 -108263 -99949 -143061 58679 84511
12336H4511c09733J6973G4310a86395H9911K5410c5796A66401a5124M359j39450
$$ 84511 -309733 -292760 74310 -186395 89911 115321 -35796 166401 -15124 -10765 -150215
12325a50215l38691b00946B12585f1607C3288b77245a14059k75944a47349B15448
$$ -150215 -488906 -200946 212585 -61607 33288 -277245 -114059 -390003 -147349 215448
12314g2301L120B26341c40831E9283h1991A76913k1943a66626j99069A02489j339
$$ -72301 -69181 226341 -340831 59283 -81991 176913 154970 -166626 -365695 102489 101150
12303A01150J4940H899a94230M7066C88103A71753f5827D58442A6666e9161k16655
$$ 101150 116090 8899 -194230 -147164 388103 171753 -65827 458442 16666 -59161 -275816
12292b75816F0806o784Q1562o6349M4916f5031H5366a47531B12360D8108J43066
$$ -275816 60806 54022 135584 69235 114151 -65031 85366 -147531 212360 48108 191174
12281A91174a10833A77910D9744j9504d3046a8432j20949I2514a18684L1336o3270
$$ 191174 -110833 177910 49744 30240 -43046 -18432 -139381 92514 -118684 -87348 -150618
12270a50618o2629c5431A86233j7312N2283a82433c9390F7191f8085D30057j92939
$$ -150618 -213247 -35431 186233 168921 221204 -182433 -39390 67191 -68085 430057 237118
12259B37118C6088K95223c4666A64138E6393Q2843J19024j18882A2116J48285
$$ 237118 36088 331311 -34666 164138 56393 139236 258260 139378 12116 160401
12249A60401i0592Q461A19917b35053I5485J52983a01255k74912g6033A8222M547
$$ 160401 -90592 -82131 119917 -235053 95485 248468 -101255 -376167 -76033 18222 22769
12238B2769b6572I9838C0364K39649E10L29815a59099B38766d0262k08397a04546
$$ 22769 -26572 99838 30364 270013 510 330325 -159099 238766 -40262 -248659 -104546
12226B72719G6501h8287A59289a65254I0835e2512A08826F634N4772e8636a4203
$$ 272719 76501 -88287 159289 -165254 90835 -52512 108826 6634 61406 -58636 -14203
12214B45691J24656E3420J8845g7293B44705o6874l6699F6598a56915C76183A11478
$$ 245691 370347 53420 72265 -77293 244705 177831 141132 66598 -156915 376183 111478
12202C31109R9705A30795C5934f442B74137A7360R6472b1823D44211A25570m96
$$ 331109 430814 130795 35934 -6442 274137 17360 113832 -21823 444211 125570 125074
12191A25074m1508L20877D3435O7150J49416p3849a21371B2321a47344A82857
$$ 125074 83566 404443 43435 110585 260001 186152 -121371 22321 -147344 182857
12180B73661m7431O4866a9623E69162e9160A13740R3203L1500R049q9330c1948
$$ 273661 226230 291096 -19623 569162 -59160 113740 206943 238443 247492 158162 -31948
12168A6013a74067B1440J19483q286n3648A4165K9406M936h812B47345j08818
$$ 16013 -174067 21440 140923 132637 78989 14165 43571 48507 -8812 247345 138527
12157A38527m9242K13398g0580A49880g5692K6350A04768b5837B28664A11705
$$ 138527 89285 302683 -70580 149880 -75692 -49342 104768 -25837 228664 111705
12146C28882C9599J54032J00105L0660A54010f9014F7489l017a53900A08223a55000
$$ 328882 39599 193631 293736 324396 154010 -69014 67489 64472 -153900 108223 -155000
12134b10796H3440a50586A9370O8454J1337J85154r9509B5495L13880b61693A72363
$$ -210796 83440 -150586 19370 87824 99161 284315 184806 25495 339375 -261693 172363
12122A61259b65265J18072C22619q0132g0644C1330a7529j36380N500C23640A12588
$$ 161259 -265265 -147193 322619 242487 -70644 31330 -17529 -153909 -148409 323640 112588
12110E6983f1985K0014F5477a3612G0232L14795A4104a08403C2712K9139a84535
$$ 56983 -61985 -41971 65477 -13612 70232 385027 14104 -108403 32712 61851 -184535
12098F007K8939K08754d7766k79477i6376R394q103j15532j12939J13536B609
$$ 6007 34946 243700 -47766 -327243 -96376 -86982 -95085 -210617 -323556 -210020 2609
12086a461B97714a42878b1499G169c2197d479k05262A46274F0356K3676a99163
$$ -1461 297714 -142878 -21499 7169 -32197 -4479 -209741 146274 60356 84032 -199163
12074B6001d46225A71717b48437R1604Q091c0483B68158H6130L5040J4569h2342
$$ 26001 -446225 171717 -248437 -156833 -148742 -30483 268158 86130 121170 135739 -82342
12062A17488f0519k1711A36919g9981C18046j20987L11716J73922O00455k19565
$$ 117488 -60519 -82230 136919 -79981 318046 197059 508775 682697 1283152 1063587
12052A063587m14931E8400O4336c37937B82898d4729I53L2715L10411G4847N7941
$$ 1063587 648656 58400 122736 -337937 282898 -44729 953 33668 344079 74847 132788
12041A32788J30435a02085A66313a86322o4279a11291O928E1146R8919b6025G4418
$$ 132788 263223 -102085 166313 -186322 -250601 -111291 -104363 51146 150065 -26025 74418
12029b94322i2634q2204B56258a23894k3140e8610C5567b54742A5844M719J61162
$$ -294322 -92634 -174838 256258 -123894 -147034 -58610 35567 -254742 15844 20563 181725
12018A81725c04690B56874d1474B25584h9608D3292a94551Q9994A09299Q227B7581
$$ 181725 -304690 256874 -41474 225584 -89608 43292 -194551 -104557 109299 117526 27581
12006H3662R9238a17029k6139c1930a3266A631J72141b41178C18034A56541M4160
$$ 83662 182900 -117029 -143168 -31930 -13266 1631 173772 -241178 318034 156541 200701
11995B00701d44937a71863C31487A06729e5668q2920e0112J2627j0958A92996
$$ 200701 -444937 -171863 331487 106729 -55668 -138588 -50112 -37485 -48443 192996
11984A29247J10942c64464a25911p2832E8606A9258b73314b1480B33962c02222
$$ 129247 240189 -364464 -125911 -198743 58606 19258 -273314 -21480 233962 -302222
11973b25345B8641i2866B02603C5038a69758l37831H6053M185d02488J14300B13779
$$ -225345 28641 -92866 202603 35038 -169758 -507589 86053 90238 -402488 -288188 213779
11961A73887c5862l2940m0490H4328c1928G0218i1361J7726A72054a44685A35113
$$ 173887 -35862 -68802 -109292 84328 -31928 70218 -91361 -73635 172054 -144685 135113
11949H960b82884R4511H8266d8102f700B10130G9534c5310j27026b6123P488A55718
$$ 8960 -282884 -188373 88266 -48102 -6700 210130 79534 -35310 -162336 -26123 -18635 155718
11936b84784K8652P5998A07915K4122a02050L8598E8931L18504E1548O4400d4847
$$ -284784 -256132 -180134 107915 132037 -102050 -63452 58931 377435 51548 115948 -44847
11924a29520J0858d329n3599G0960h0924j12296N4711B407e220k08283b5620M303
$$ -129520 -118662 -4329 -57928 70960 -80924 -193220 -138509 2407 -5220 -213503 -25620 -21317
11912b1317R051k4363c978k7814n45031a32353A02595M0012a54670e6486j5208
$$ -21317 -12266 -36629 -3978 -31792 -576823 -132353 102595 142607 -154670 -56486 -71694
11901g1694L901q8965j35124J0791H2634j2835a8993r0580j7986f2892C27104
$$ -71694 -67793 -156758 -291882 -281091 82634 69799 -18993 -109573 -127559 -62892 327104
11889I0242k2347d7951B334f3592D6160J9023h2387D5430a22754k14704f0396
$$ 90242 67895 -47951 2334 -63592 46160 65183 -82387 45430 -122754 -337458 -60396
11877i164A61859a60518k2497h0896A96371A8000f9201Q455F3373r118J2995b14131
$$ -9164 161859 -160518 -183015 -80896 196371 18000 -69201 -60746 63373 54255 67250 -214131
11864a08825B04765h5759A96404B9361J33043l3200a59139J812B24412g1532H9853
$$ -108825 204765 -85759 196404 29361 162404 129204 -159139 -157327 224412 -71532 89853
11852c11405o3918c4659l7992r8506f2921L426j17428A20986b51490P3468A23842
$$ -311405 -375323 -34659 -72651 -171157 -62921 -59495 -176923 120986 -251490 -178022 123842
11840a38788A88987b37050m5118A18045a31929k6480e7528J2126E4824b0983D0193
$$ -138788 188987 -237050 -282168 118045 -131929 -158409 -57528 -45402 54824 -20983 40193
11828e7k47597N9197m4996B08961N17a23447A72865b65511a22160A79187i0199
$$ -57 -247654 -188457 -233453 208961 209478 -123447 172865 -265511 -122160 179187 -90199
11816D6971K87553a31946k80940a8774g356j3059G3836J14007E4074J9366J42065
$$ 46971 334524 -131946 -412886 -18774 -7356 -20415 73836 187843 54074 73440 215505
11805B15505d23548o2558g3164E0661q730a62412g4500j51654E5629J3716J08676
$$ 215505 -423548 -486106 -73164 50661 41931 -162412 -74500 -226154 55629 69345 178021
11794A78021e6724G6118a39834l8826A57856a28946e2793I8087b4246n6361E3953
$$ 178021 -56724 76118 -139834 -178660 157856 -128946 -52793 98087 -24246 -80607 53953
11782f784k8350k01476B00304D5416a02326J3891H2973N1101J2460J32869p2067
$$ -6784 -35134 -236610 200304 45416 -102326 -88435 82973 134074 146534 279403 207336
11771B07336h9234O235D8444e3895E7360J65316G6504a42890B85108A5204N4597
$$ 207336 -89234 -82999 48444 -53895 57360 222676 76504 -142890 285108 15204 69801
11760F9801c67968f5433A31318d2516j64872B02622a34555A50758F9543J36040
$$ 69801 -367968 -65433 131318 -42516 -207388 202622 -134555 150758 69543 205583
11750B05583c47356G366a46314q0718n6752c5951p0104E7864J66413a28554c2222
$$ 205583 -347356 7366 -146314 -227032 -283784 -35951 -106055 57864 224277 -128554 -32222
11738B01869a56696C58016b02094d6240A87665O5936D7111a45630k6160I1620
$$ 201869 -156696 358016 -202094 -46240 187665 253601 47111 -145630 -171790 91620
11727B20851a47690B04406P6000b82513A30533i5435j4247A47761a28947n5682
$$ 220851 -147690 204406 280406 -282513 130533 -95435 -109682 147761 -128947 -184629
11717a84629l9294A35792a53873B3836a02444K381B49095a07804n7695L424D3297
$$ -184629 -223923 135792 -153873 23836 -102444 -100063 249095 -107804 -165499 -162075 43297
11705B4194f669A42880J84451A3385e2901k91718A29130d940B85693q5203a22499
$$ 24194 -6669 142880 327331 13385 -52901 -344619 129130 -4940 285693 200490 -122499
11693B30539a73530B53004f0711F02443A76460J1832n5970J00058a91825C22822
$$ 230539 -173530 253004 -60711 602443 176460 188292 132322 232380 -191825 322822
11682G6516C0467q963c925j35746H0467l7338N7289J37336j06456e0796k39300
$$ 76516 30467 21504 -3925 -139671 80467 43129 100418 237754 131298 -50796 -290096
11671b90096O9551i8537B44778f197D8679K17287A9774O2517b25811C0993J32341
$$ -290096 -220545 -98537 244778 -6197 48679 265966 19774 82291 -225811 30993 163334
11660A63334c6353j68337E05032I6061l6388m519i8748J5624k40456B58890E5435
$$ 163334 -36353 -204690 505032 96061 59673 55154 -98748 -83124 -323580 258890 55435
11648c65263G2484a73991J5078b0360j61245m6854j30303c2928B17770j8820d984
$$ -365263 72484 -173991 -158913 -20360 -181605 -228459 -358762 -32928 217770 198950 -4984
11636B50989D4151J20665d07009a33843j73941k08305b14864e978j70475e6437
$$ 250989 44151 164816 -407009 -133843 -307784 -516089 -214864 -5978 -176453 -56437
11625a50698C360a80396H3776a27305j03367f7808H6006a25569A31482m4265J71306
$$ -150698 3360 -180396 83776 -127305 -230672 -67808 86006 -125569 131482 87217 258523
11614B58523b4147H5714A1008K59738J42339a91019A88756O5278j00913J14607
$$ 258523 -24147 85714 11008 270746 413085 -191019 188756 254034 153121 267728
11604B67728a20509J2469H7143a62466A76J56231E0904P1268c25007I8756L1564
$$ 267728 -120509 -108040 87143 -162466 176 156407 50904 122172 -325007 98756 130320
11593A30320b14859A01418n56m7186K84676b9764F1032J75220n2398C7309J10048
$$ 130320 -214859 101418 100862 53676 338352 -29764 61032 236252 183854 37309 147357
11582A47357K00070j13222b432A05048p477K4856C270J37073b0442B53065e4873
$$ 147357 347427 234205 -2432 105048 97571 122427 3270 140343 -20442 253065 -54873
11570H9837J94224k0543F7091b059m75125C91920G3977h2873b5221B17057c26285
$$ 89837 284061 263518 67091 -2059 -477184 391920 73977 -82873 -25221 217057 -326285
11558A30988L58049A99814f309B61046a20656N7470j42740I2787m2205K60714
$$ 130988 489037 199814 -6309 261046 -120656 -63186 -205926 92787 50582 311296
11548C11296a04250o5164Q0038A87285m1743n4881P2625a50632i370A28857M442
$$ 311296 -104250 -169414 -89376 187285 145542 90661 163286 -150632 -9370 128857 133299
11537A33299J11493a04605q6305h958k343d304B68942A3342l024P4023a2630E6252
$$ 133299 244792 -104605 -190910 -8958 -11301 -4304 268942 13342 10318 84341 -12630 56252
11524A9563J40002D382b06658D2788L85649A00256a55283I5733j5777d7599j72760
$$ 19563 159565 4382 -206658 42788 428437 100256 -155283 95733 79956 -47599 -220359
11513b20359D08763E9578a44571C18827c1786B56404G5679O5839o2847C5983a63617
$$ -220359 408763 59578 -144571 318827 -31786 256404 75679 141518 78671 35983 -163617
11501i091G2218b51291B18809a65563H2162k8012L5461J23996Q1135D54O5746
$$ -9091 72218 -251291 218809 -165563 82162 54150 89611 213607 294742 454 66200
11490F6200O6297K2359c02449A63872A8085f319n1789A12335J808d4727A51311
$$ 66200 132497 154856 -302449 163872 18085 -6319 -58108 112335 114143 -44727 151311
11478E621Q1276a74718d5708A65948k8493e4795C3545J14369a08897E9719J08776
$$ 5621 86897 -174718 -45708 165948 137455 -54795 33545 147914 -108897 59719 168495
11467A68495O105J51891d4852B01422r4543L37618A75616J93422j39655P6827
$$ 168495 174600 326491 -44852 201422 106879 444497 175616 369038 229383 306210
11457C06210o149a34909C78131A15094a54869k2440D6958K65554A5925L8694K9893
$$ 306210 300061 -134909 378131 115094 -154869 -177309 46958 312512 15925 54619 84512
11446H4512q801a94613H7092Q4705C3850J03395b9941q927B70366a90938I5283
$$ 84512 75711 -194613 87092 171797 33850 137245 -29941 -38868 270366 -190938 95283
11434a16581A19544J5926a7285B04078j00427f4196A69050f214k9874l8208A04011
$$ -116581 119544 135470 -17285 204078 103651 -64196 169050 -6214 -36088 -74296 104011
11422B02557J22514G9913J33963l3060c4165I833J35000a05940D93426c8009C0141
$$ 202557 325071 79913 213876 180816 -34165 9833 144833 -105940 493426 -38009 30141
11410B2182K2043a16817c8963F666J25882P0785K1124b20201g5360A73603b34563
$$ 22182 44225 -116817 -38963 6666 132548 203333 224457 -220201 -75360 173603 -234563
11398a23103r5576a00717D5511a30229O481c5439B43614a84203e4233q4114j03367
$$ -123103 -218679 -100717 45511 -130229 -123748 -35439 243614 -184203 -54233 -138347 -241714
11387b41714B47367C6856e7067G5958J42473a16949A22297a18937D8630B1622
$$ -241714 247367 36856 -57067 75958 218431 -116949 122297 -118937 48630 21622
11376a90689A66552L8976a38716B0296a62400D8431K88225b33413H3903e2330
$$ -190689 166552 205528 -138716 20296 -162400 48431 336656 -233413 83903 -52330
11365a91244I745P3922c1325G5356d4972G814K91003P7309b4418j43932g7459
$$ -191244 9745 83667 -31325 75356 -44972 7814 298817 376126 -24418 -168350 -77459
11353a26553N0865n3479A01995a40011A71162J8813b3963F5157K06525f3179A51055
$$ -126553 -75688 -129167 101995 -140011 171162 189975 -23963 65157 271682 -63179 151055
11341e5150A39536D7393c60789b4784n202r5412A19415C2990K19322h3457o7232
$$ -55150 139536 47393 -360789 -24784 -29986 -125398 119415 32990 252312 -83457 -150689
11330a50689f4079k75764a62753A97015A7054J37183J27941E4562K1487e2343
$$ -150689 -64079 -339843 -162753 197015 17054 154237 282178 54562 76049 -52343
11319c33764K2238J30485l1503A59331b38885E2242a92360P3011D5474b49535
$$ -333764 -311526 -181041 -212544 159331 -238885 52242 -192360 -119349 45474 -249535
11308D34073d0082A12236k5803a05530K1606k1068H455N2208N2336c69662B93329
$$ 434073 -40082 112236 86433 -105530 -83924 -104992 8455 60663 112999 -369662 293329
11296F4352d89736B3023N4434K24472G8930M2014a19673A10881E3638N6380O430
$$ 64352 -489736 23023 77457 301929 78930 120944 -119673 110881 53638 110018 116448
11285A16448O996d2642n1060b5343G9871C2653o124b30073k8103N1549F6401k936
$$ 116448 123444 -42642 -93702 -25343 79871 32653 26529 -230073 -258176 -206627 66401 63465
11273F3465P224b88991b9019j28327B5900a45519M1403d9167a566k75199m5762
$$ 63465 70689 -288991 -29019 -157346 25900 -145519 -104116 -49167 -1566 -276765 -322527
11262c22527J9432I9939j2241b49551L3887o0163B3138e4847H8775a14183c6471
$$ -322527 -303095 99939 87698 -249551 -215664 -275827 23138 -54847 88775 -114183 -36471
11250c2202A37191m8821a97752A65872p6981b25040c3085D6833a21055K8370K8651
$$ -32202 137191 88370 -197752 165872 88891 -225040 -33085 46833 -121055 -92685 -64034
11239f4034E9853J25830J7841C8091J36469g3351K0562q2020B6607c35414P9483
$$ -64034 59853 185683 203524 38091 174560 -73351 -52789 -134809 26607 -335414 -255931
11228b55931B308K27963a39816O9859I2463m3139J27013a57406e6368d7A66746
$$ -255931 2308 230271 -139816 -69957 92463 49324 176337 -157406 -56368 -47 166746
11216A492N6966d5802k3691B23987E9862c31279G9631a83099A6944i5054B29283
$$ 1492 58458 -45802 -69493 223987 59862 -331279 79631 -183099 16944 -95054 229283
11204I3620m5222d5713B49471a78521K3552B09960E8663c70123g4763r5442C51733
$$ 93620 48398 -45713 249471 -178521 -154969 209960 58663 -370123 -74763 -170205 351733
11192c46578J56791Q5610A49291J914b46039N1485A9829K61945f575j35400b0037
$$ -346578 -189787 -104177 149291 151205 -246039 -194554 19829 281774 -6575 -141975 -20037
11180a68887c6118r2699O186B9211c7108q6572k70521a56377A07213a02139K3812
$$ -168887 -36118 -128817 -122631 29211 -37108 -123680 -394201 -156377 107213 -102139 -78327
11169g8327E787J64605b02676n4380g6559b1096k59430b8008k8521a7018k63051
$$ -78327 5787 170392 -202676 -257056 -76559 -21096 -280526 -28008 -56529 -17018 -280069
11158b80069J35576q9004G411K43680G1076e4876j42834R0657A32395a25948k4045
$$ -280069 -144493 -233497 7411 251091 71076 -54876 -197710 -107053 132395 -125948 -149993
11147a49993a0944D25745i0531k3247l0140j43514A72482b70312b4354A46313
$$ -149993 -10944 425745 -90531 -113778 -143918 -287432 172482 -270312 -24354 146313
11136i2119L3947D01808A36369g43A67744a10234A24620b04033L8749b0934E6495
$$ -92119 -58172 401808 136369 -743 167744 -110234 124620 -204033 -165284 -20934 56495
11124a26263B2679q460a56606A94885c62110a46634A77606H0004e2792D37159
$$ -126263 22679 14219 -156606 194885 -362110 -146634 177606 80004 -52792 437159
11113C0515b64458E5207J67544o5881d4826A77671b077B19120a2587B2050h9056
$$ 30515 -264458 55207 222751 156870 -44826 177671 -2077 219120 -12587 22050 -89056
11101a10025k2552j46079A48211h8804A38733P3000f041A5308J74636k0609a00231
$$ -110025 -132577 -278656 148211 -88804 138733 211733 -6041 15308 189944 169335 -100231
11089a01011I4253M5687A9639h1575B82062j00736E5837a40993G2234K34590j52915
$$ -101011 94253 139940 19639 -81575 282062 181326 55837 -140993 72234 306824 153909
11078A53909K07942a1099E11503A30750K17255J09645A87598B5948M6978N51790
$$ 153909 361851 -11099 511503 130750 348005 457650 187598 25948 72926 624716
11068F24716B80294J48129A01799L01905j15595E9591d7026A23518Q7399J15437
$$ 624716 280294 428423 101799 403704 288109 59591 -47026 123518 210917 326354
11058C26354M2124j26144K2286k0315p9921J36556J03233j03230A39131M57133
$$ 326354 368478 242334 264620 244305 164384 300940 404173 300943 139131 596264
11048E96264F2115N34620k69851L65283K5679k45313m9906K78049j02402k03494
$$ 596264 62115 596735 326884 692167 717846 472533 422627 700676 598274 394780
11038C94780K9901N16010m22079M34357j29061J15048J79012m01901K7590L1806
$$ 394780 424681 940691 518612 952969 823908 938956 1117968 716067 743657 775463
11028G75463k60911M13235l17787K50735k60j60928n3251J28684j80286J95628
$$ 775463 514552 927787 610000 860735 860475 699547 646296 774980 594694 790322
11018G90322l6938k64809K57692J17996k89199Q8071r2680K24285o9184O5104
$$ 790322 753384 488575 746267 864263 575064 663135 570455 794740 725556 790660
11008G90660k40621j68519N30006C04883N0129J46737M11710Q5057l92795A68245
$$ 790660 550039 381520 911526 304883 355012 501749 913459 998516 605721 168245
10997E66051J18212L37312C51958O1226p5914K90556j44781M2749Q100P812J18704
$$ 566051 684263 1021575 351958 413184 337270 627826 483045 525794 533894 541706 660410
10986F60410j15880K83146j45287J87855m13130J30576J1909k3587O64297E99783
$$ 660410 544530 827676 682389 870244 457114 587690 599599 576012 1240309 599783
10975E73006M96558m4310j60370J17524m78862N65873n5871j48076K27721j03784
$$ 573006 1069564 1025254 864884 982408 503546 1069419 1013548 865472 1093193 989409
10965I89409K91392O1455K38640J18046l06098M79232M04295L69757P3987j69555
$$ 989409 1280801 1342256 1580896 1698942 1392844 1872076 2276371 2646128 2720115 2550560
10955B550560l62792K49290k55934p4744N4197j21068o25375J92910K27198l99847
$$ 2550560 2187768 2437058 2181124 2106380 2160577 2039509 1414134 1607044 1834242 1434395
10945A434395j73668p3167L41983k92396J1709M55677m81413J7106j31841j78491
$$ 1434395 1260727 1187560 1529543 1237147 1248856 1704533 1223120 1240226 1108385 929894
10935I29894l23313j67311J75660j90110p0740P8674k07674B9379J8727J07166
$$ 929894 606581 439270 614930 424820 354080 432754 225080 29379 48106 155272
10925A55272R6230b54460A01330N2906K52073a65328B3224a4913A94610C9648
$$ 155272 251502 -254460 101330 154236 406309 -165328 23224 -14913 194610 39648
10914A07231e4136F3671l420d0814C49232j09763m8702b0096C73882b20050k2187
$$ 107231 -54136 63671 60251 -40814 349232 239469 190767 -20096 373882 -220050 -242237
10903b42237A22360a07466m4675M5499A27387d7252O254A59629b17582A96988
$$ -242237 122360 -107466 -152141 -106642 127387 -47252 -40998 159629 -217582 196988
10892c12243A58720b40894b3122k9765a3850j42806d9974l47299B27714j8657
$$ -312243 158720 -240894 -23122 -52887 -13850 -156656 -49974 -397273 227714 209057
10882B09057R1203f8007j42391d4800P505A625L5427h4258L8894I0821e6461K2375
$$ 209057 300260 -68007 -210398 -44800 -37295 1625 37052 -84258 -45364 90821 -56461 -34086
10870c4086j71469M5687r3018o388J29079C2234J73583b0467p9710o144B071f3469
$$ -34086 -205555 -159868 -252886 -259274 -130195 32234 205817 -20467 -100177 -106321 2071 -63469
10857b91154a645m4155G4606a87307B15692L4356d3407p7032G0541J06859p0402
$$ -291154 -1645 -45800 74606 -187307 215692 250048 -43407 -120439 70541 177400 106998
10846A06998c87241J9077a04344b1818A16691b75882A72267a50128a9485j85579
$$ 106998 -387241 -368164 -104344 -21818 116691 -275882 172267 -150128 -19485 -205064
10836b05064C2266f9164l3034A36660b02884i645k8949j19950B34813d8046j26656
$$ -205064 32266 -69164 -102198 136660 -202884 -9645 -38594 -158544 234813 -48046 -174702
10825a74702h684k25755I5458R2583g499r5921A27307J27816e266m6454k0162
$$ -174702 -8684 -234439 95458 188041 -7499 -103420 127307 255123 -5266 -51720 -71882
10814g1882C2656a81663A82726E9007f7629C66102a98254P4942E7168J03436K196
$$ -71882 32656 -181663 182726 59007 -67629 366102 -198254 -123312 57168 160604 162800
10803A62800c0530l0740j29637B25495d110j01845B95374b58369J00815D11796
$$ 162800 -30530 -61270 -190907 225495 -4110 -105955 295374 -258369 -157554 411796
10792A20422h496B07302b10623B27739b83838G7989c28341A3263a08416A56744
$$ 120422 -8496 207302 -210623 227739 -283838 77989 -328341 13263 -108416 156744
10781a44650J8159k26986J68000h0372k32277h5896O016A38968b47569J09584
$$ -144650 -126491 -353477 -185477 -80372 -312649 -85896 -79880 138968 -247569 -137985
10771a37985r5325d1764B16517j6402F8467c18589A281O705b21252c8345k65884
$$ -137985 -233310 -41764 216517 200115 68467 -318589 1281 7986 -221252 -38345 -304229
10760c04229D0690b11882B6905a81127g0621k6161k30347R5092G7919a03251D290
$$ -304229 40690 -211882 26905 -181127 -70621 -96782 -327129 -232037 77919 -103251 4290
10748a47251C14731b27053g4279q0727d0546j11550f4617j08466b102k5580j01332
$$ -147251 314731 -227053 -74279 -155006 -40546 -152096 -64617 -173083 -2102 -27682 -129014
10737a29014E6165G782J02161f526k94211c1395r6054A30736M1643j8035a60427
$$ -129014 56165 7782 109943 -6526 -300737 -31395 -127449 130736 172379 154344 -160427
10725a75013g6152B8865L8132b22804I8934a45681L2188L7056A95043b46836B7156
$$ -175013 -76152 28865 66997 -222804 98934 -145681 -113493 -76437 195043 -246836 27156
10713a05642A46141L8383n8278b76374J25147A56024h566E2866O3074M7310o005
$$ -105642 146141 184524 126246 -276374 -151227 156024 -8566 52866 115940 163250 157245
10702A57245b19901o6747Q0921q6367E4928P432b07428k29269a36208o3390H258
$$ 157245 -219901 -286648 -205727 -292094 54928 62360 -207428 -436697 -136208 -199598 8258
10690c6649A25215a1912C09164A38520b52556A1418b5606k89795A68962b32898
$$ -36649 125215 -11912 309164 138520 -252556 11418 -25606 -315401 168962 -232898
10679b24027n0493f8705J4715l0721f205r9423j9348A62434n1732a33295D8238
$$ -224027 -274520 -68705 -53990 -84711 -6205 -105628 -124976 162434 110702 -133295 48238
10667a08304H6925a40616f8036D0942c29778G8178G359J45002j9926P8900d6660
$$ -108304 86925 -140616 -68036 40942 -329778 78178 7359 152361 132435 211335 -46660
10655b69875e4546m1416k50225a60378o8541a08322j78444A9218b86284i5900
$$ -269875 -54546 -95962 -346187 -160378 -228919 -108322 -286766 19218 -286284 -95900
10644I464R4283e55I8621e8796r6116N1824L7247I3086O0823c56955A35392i1289
$$ 9464 103747 -555 98621 -58796 -154912 -103088 -65841 93086 153909 -356955 135392 -91289
10631b40361j96690c2782B51893b4397A35568N3097d16862B02621b11348C52298
$$ -240361 -437051 -32782 251893 -24397 135568 188665 -416862 202621 -211348 352298
10620E5990b30195b9262E4539e3053o5344k1708j99805e8572E5746Q1362h934
$$ 55990 -230195 -29262 54539 -53053 -118397 -140105 -339910 -58572 55746 137108 -8934
10608c0291L150j51069I5657h5339d636A05927a3872j00076E7723q878b65587
$$ -30291 -27141 -178210 95657 -85339 -4636 105927 -13872 -113948 57723 48845 -265587
10596B52766c1307A7291J90388J32433a71183C6930J33969D5236a47808c1618
$$ 252766 -31307 17291 207679 340112 -171183 36930 170899 45236 -147808 -31618
10585a24257A29411J23634r6550N5301b61662F9142J13222d68637a9489G7609
$$ -124257 129411 253045 156495 211796 -261662 69142 182364 -468637 -19489 77609
10574b9192G8828a5242j05889B00485a42175E0698c65913A01769f4464L1747j36092
$$ -29192 78828 -15242 -121131 200485 -142175 50698 -365913 101769 -64464 -32717 -168809
10563a68809B9948J20190a75629j0369A38534g4303O201r1971j82524J3963D0287
$$ -168809 29948 150138 -175629 -185998 138534 -74303 -68102 -160073 -342597 -328634 40287
10551c06496h8076a9681k95710H5783a35225b0415F131f4467b3680j1308A72334
$$ -306496 -88076 -19681 -315391 85783 -135225 -20415 6131 -64467 -23680 -34988 172334
10539A54226j6038k103h3535D4148b45697Q8930B16567a08111A21886E5896L3794
$$ 154226 138188 136085 -83535 44148 -245697 -156767 216567 -108111 121886 55896 89690
10528H9690b61336h5109j37011I7228b24322a2932j51855c0083k7697E3188i7910
$$ 89690 -261336 -85109 -222120 97228 -224322 -12932 -164787 -30083 -57780 53188 -97910
10516b7763A11502r171h8263A56957a84405o3384K2487f0585B47539G7916a57623
$$ -27763 111502 102331 -88263 156957 -184405 -247789 -225302 -60585 247539 77916 -157623
10504I4677B4756R0902D3832O4748c47218F7706b30044I2936a86928I9666m9549
$$ 94677 24756 115658 43832 108580 -347218 67706 -230044 92936 -186928 99666 50117
10493E0117M35456B7435i9955a7241j68017B07466e9408n4070E2473h5301E9416
$$ 50117 485573 27435 -99955 -17241 -185258 207466 -59408 -113478 52473 -85301 59416
10481C8298c81965e4352j66560P181A51250G2219a27850d3105H0732a58307B2575
$$ 38298 -381965 -54352 -220912 -213731 151250 72219 -127850 -43105 80732 -158307 22575
10469A53440f9433C56549P3210J55366B11640K2817M3252q3793d4542l84866B06397
$$ 153440 -69433 356549 429759 585125 211640 234457 277709 193916 -44542 -429408 206397
10457H1310J06669a17309B87586j21660D8542K26452a26385l8847E9284g3353
$$ 81310 187979 -117309 287586 165926 48542 274994 -126385 -165232 59284 -73353
10446g629A04754A2765J28335n9486C6832g3934D4707a73444D01367A0706L2906
$$ -7629 104754 12765 141100 81614 36832 -73934 44707 -173444 401367 10706 43612
10435D3612i9003K736r1849f2097B93085A5218P580a30516e2565j13115d8459
$$ 43612 -99003 -96267 -188116 -62097 293085 15218 22798 -130516 -52565 -165680 -48459
10423B58042a64071C4210J07476b1478j17384k38814A70464a19853j0103j11578
$$ 258042 -164071 34210 141686 -21478 -138862 -377676 170464 -119853 -129956 -241534
10413b41534a06581E8128g018j64108J5716A97479j2191h0043j994m2383A0375
$$ -241534 -106581 58128 -7018 -171126 -155410 197479 185288 -80043 -82037 -124420 10375
10401c97067a80114q6319C49528i6579A6190c5400j50047P73i1417a7670M724
$$ -397067 -180114 -266433 349528 -96579 16190 -35400 -185447 -184674 -91417 -17670 -12946
10390a2946r0960d7173C2228b24658B9983g0753F2426a81328a8113A22981J22850
$$ -12946 -103906 -47173 32228 -224658 29983 -70753 62426 -181328 -18113 122981 245831
10379B45831C9620c4891r9659o4494C22350A40394J63034H4213j6990M50218F4653
$$ 245831 39620 -34891 -134550 -199044 322350 140394 303428 84213 67223 517441 64653
10367b8419B43666K26155I5428i3896q709D818a00063C5446Q2949Q9601J83150
$$ -28419 243666 469821 95428 -93896 -102605 4818 -100063 35446 118395 207996 391146
10356C91146A72595F6610L2268N81517l17308D9225J55637N01824l40170M0768
$$ 391146 172595 66610 98878 680395 363087 49225 204862 706686 366516 407284
10346D07284I2877J82309a47763B89008J6808J13418A15465L4632J78526F6041
$$ 407284 92877 275186 -147763 289008 305816 419234 115465 150097 328623 66041
10335D33143p7193n9462K9564r9381P1193O7143K21408j36282l6552J17740H8238
$$ 433143 355950 296488 326052 226671 297864 365007 586415 450133 413581 531321 88238
10323C02108f7002C5076M26861h1229B94555O7933A10063q415J57901p0146n932
$$ 302108 -67002 35076 461937 -81229 294555 362488 110063 101648 259549 189403 183471
10312A83471J38332f3064A76644a25811A61553n9988J71785A25922E8214F958
$$ 183471 321803 -63064 176644 -125811 161553 101565 273350 125922 58214 6958
10301E9993K08205L6691A18241O7686O684d5829I806Q546M2237L3409J62971q6554
$$ 59993 268198 304889 118241 185927 192611 -45829 9806 18352 60589 93998 256969 170415
10289A70415N5834a06034a2609k9050A16892b06846A50928E8257a54551n3378
$$ 170415 226249 -106034 -12609 -41659 116892 -206846 150928 58257 -154551 -207929
10279b07929e7105k8517A76806b03686B74453b61906I4062N3388a46825A12797
$$ -207929 -57105 -85622 176806 -203686 274453 -261906 94062 147450 -146825 112797
10268E5666K71k6879a23370j36368A09033c0059I8398a67807d5020H3763d17624
$$ 55666 55937 29058 -123370 -259738 109033 -30059 98398 -167807 -45020 83763 -417624
10256A86915J67630a94815H0145g8213C02338j28577a55245P3814B09781q0447
$$ 186915 354545 -194815 80145 -78213 302338 173761 -155245 -81431 209781 129334
10246A29334J85431m663A34629A6858M1611a89405e6234a7836D2157a89873r7649
$$ 129334 314765 310102 134629 16858 58469 -189405 -56234 -17836 42157 -189873 -287522
10235b87522A71349J1488a17224j98171A4653c7159B22483c14756J25348A22858
$$ -287522 171349 182837 -117224 -315395 14653 -37159 222483 -314756 -189408 122858
10224E34373G8721b85592h776k86674k06217b21524A19230a54717C11298A37253
$$ 534373 78721 -285592 -8776 -295450 -501667 -221524 119230 -154717 311298 137253
10213E25e8933b2762k50329Q7287N2961L1946I5660k6154d79185B7469a25962
$$ 525 -58933 -22762 -273091 -185804 -132843 -100897 95660 69506 -479185 27469 -125962
10201B5235J23087g796j52127l2427p7576A250h3342J9710I2413J30462i8186
$$ 25235 148322 -7796 -159923 -192350 -269926 1250 -83342 -63632 92413 222875 -98186
10189A58909B3523a37964l7062j23372b6816j05411A76152J33730f7092A95579
$$ 158909 23523 -137964 -175026 -298398 -26816 -132227 176152 309882 -67092 195579
10178a97794M3336M5037j38219G7373Q7978o9994a31117L1641k3285B32271g2628
$$ -197794 -154458 -109421 -247640 77373 165351 95357 -131117 -99476 -122761 232271 -72628
10166a44169j75181C86764a59234k86g6943m8691j42571a25236m3313c0340k76496
$$ -144169 -319350 386764 -159234 -159520 -76943 -125634 -268205 -125236 -168549 -30340 -306836
10155c06836J02054h390k62142G4126g6414j18080R6211G8028a90102L228h7354
$$ -306836 -204782 -8390 -270532 74126 -76414 -194494 -98283 78028 -190102 -186874 -87354
10143b90697C9530a78153j1567B29348B3235e07418e538B13161p7416B9270J83191
$$ -290697 39530 -178153 -189720 229348 23235 -507418 -5538 213161 135745 29270 212461
10132B12461a36217e9103C09427A36979F828g9648D047R2538j1262i1922C1466
$$ 212461 -136217 -59103 309427 136979 6828 -79648 4047 96585 85323 -91922 31466
10120C03844D1503c0004j40401H0221b20529N6797b9030k93681B33872b219k79693
$$ 303844 41503 -30004 -170405 80221 -220529 -163732 -29030 -322711 233872 -2219 -281912
10109b81912d4355l31424A48040J5599J3016a69960e9343J2212m56230h1727G2947
$$ -281912 -44355 -375779 148040 163639 176655 -169960 -59343 -47131 -503361 -81727 72947
10097D7609b72115d0737q7784o7985Q1611j96653A47673d0584C2732a61970A49737
$$ 47609 -272115 -40737 -128521 -196506 -114895 -311548 147673 -40584 32732 -161970 149737
10085B40849D6122o402a40303J8902o6468j82043F663c7421q9116b247H2917R4816
$$ 240849 46122 39720 -140303 -121401 -187869 -369912 6663 -37421 -126537 -2247 82917 177733
10073A77733k5533a23721j75328j28160A37920a82819P0103D3131i3874B8565
$$ 177733 152200 -123721 -299049 -427209 137920 -182819 -112716 43131 -93874 28565
10062b50295j23601j09379g3470l494J6783j00110A44342m8607d7227l06378A40226
$$ -250295 -373896 -483275 -73470 -76964 -60181 -160291 144342 95735 -47227 -353605 140226
10050G7749b71566d5455o1410C1642K6618c62684A53963n3900J12884a72763j19682
$$ 77749 -271566 -45455 -106865 31642 58260 -362684 153963 100063 212947 -172763 -292445
10039b92445d0347m8062E7825B5388d98215a80018k8751D2940i4164d3276I4086
$$ -292445 -40347 -88409 57825 25388 -498215 -180018 -208769 42940 -94164 -43276 94086
10027C58724a83756B6035l420J33939b92583M3314i2629m969d6548p6218P517
$$ 358724 -183756 26035 22615 156554 -292583 -249269 -92629 -97598 -46548 -122766 -115249
10016a15249k34594g0898q7961B38846m7562K68878A0923c0975m32783a254C4329
$$ -115249 -349843 -70898 -158859 238846 191284 460162 10923 -30975 -463758 -1254 34329
10004D3691b78640m340F5401b13494H4679k1833K35067A760b13720A09708J07685
$$ 43691 -278640 -282980 65401 -213494 84679 62846 297913 1760 -213720 109708 217393
9993B17393o3277b97031B1526h3145p4924E8748b36447H5536a17462o220k1243
$$ 217393 154116 -297031 21526 -83145 -158069 58748 -236447 85536 -117462 -123682 -144925
9982a44925G8652i8966J1346m2212a466j54582c4862A65543q708l3947a22311
$$ -144925 78652 -98966 -87620 -129832 -1466 -156048 -34862 165543 156835 122888 -122311
9970H2959a0140l36584A06060i9398k3687m801r3042a7899j34328K2936B04387
$$ 82959 -10140 -346724 106060 -99398 -123085 -127886 -220928 -17899 -152227 -129291 204387
9958A59894a04499M6132A20477h4617m7006J4191B9635J1261j4259a07066D8041
$$ 159894 -104499 -58367 120477 -84617 -131623 -117432 29635 40896 26637 -107066 48041
9946b772A92337i8963G9440d1811B86843f3368j8561B0061a40679j4533b186D0750
$$ -2772 192337 -98963 79440 -41811 286843 -63368 -81929 20061 -140679 -155212 -2186 40750
9933A41406a00203q5302k9704D5171a02012q0831n1902L9715A63259B9453L03120
$$ 141406 -100203 -185505 -215209 45171 -102012 -182843 -234745 -195030 163259 29453 332573
9922C32573g8033A25110M3706E565c58004a10793E3738b82928A64784a48080h90
$$ 332573 -78033 125110 168816 5565 -358004 -110793 53738 -282928 164784 -148080 -890
9910D0787b63207c3316l9958l3888a921k68925K4740D9612J46374H4500M96403
$$ 40787 -263207 -33316 -73274 -107162 -1921 -270846 -246106 49612 195986 84500 580903
9899E80903A36986c9257k2870j0598A73754a13340j23960a4425n8540L5626A27957
$$ 580903 136986 -39257 -62127 -72725 173754 -113340 -237300 -14425 -72965 -37339 127957
9887A03564E0731b69732p499f7514E1802b0448A47243J81214H5318I018P3889
$$ 103564 50731 -269732 -277231 -67514 51802 -20448 147243 328457 85318 9018 82907
9876H2907b67429B13467c49568M3105A5812J78446b11233f6781m0628k16217e419
$$ 82907 -267429 213467 -349568 -306463 15812 194258 -211233 -66781 -107409 -323626 -5419
9864a46954c4626F5233h2122k21631A35898b38365Q578j5205i7512l33360a25593
$$ -146954 -34626 65233 -82122 -303753 135898 -238365 -229787 -244992 -97512 -430872 -125593
9852i1044j43750g7874m6521K8456j94858i196A46107g5176p9543j59193B06285
$$ -91044 -234794 -77874 -124395 -95939 -290797 -9196 146107 -75176 -154719 -313912 206285
9840A69611e7407A3741J64594b50073A26344k0463e09483a38632A69714d5373
$$ 169611 -57407 13741 178335 -250073 126344 105881 -509483 -138632 169714 -45373
9829A48972m6797g6162J1354n4085p0252E1769c4915l62319J02255f3058k1328
$$ 148972 102175 -76162 -64808 -118893 -189145 51769 -34915 -397234 -294979 -63058 -84386
9818h4386A72410L6731B31a08510j66514F2311b9049E1504M1333h0792l53400
$$ -84386 172410 209141 231 -108510 -275024 62311 -29049 51504 92837 -80792 -434192
9807d34192O2207e3627k49514J12844O1376D89493d1714j05566j22677j22243
$$ -434192 -371985 -53627 -303141 -190297 -128921 489493 -41714 -147280 -269957 -392200
9797c92200J92386j37694F0111b13976J3921A68111b40025h6984D3464K12829
$$ -392200 -199814 -337508 60111 -213976 -200055 168111 -240025 -86984 43464 256293
9787B56293A03444B8228d39198I3454b82428L1282g7082L5623A6315a95291A02865
$$ 256293 103444 28228 -439198 93454 -282428 -251146 -77082 -41459 16315 -195291 102865
9775a86592h7838k9533l58117f5896F3341a20216A37347b40591A59463E5640b48715
$$ -186592 -87838 -117371 -475488 -65896 63341 -120216 137347 -240591 159463 55640 -248715
9763c3745a5649D7457a18154m7777r8124j44999I0640O546g2063k0763D3079f1056
$$ -33745 -15649 47457 -118154 -165931 -264055 -409054 90640 97186 -72063 -92826 43079 -61056
9750B52242a9556A85592g6430f020n6481J2149F0679b60728J05255F8L1884M6565
$$ 252242 -19556 185592 -76430 -6020 -62501 -50352 60679 -260728 -155473 68 31952 78517
9738G8517R589c818j00624J3742B32116d00157I5314b50848M7680l0983I5499
$$ 78517 88106 -3818 -104442 -90700 232116 -400157 95314 -250848 -203168 -234151 95499
9726b99409D8260N0679a82583c3863n9966A49443K7449b65089J6564j19494B56547
$$ -299409 48260 98939 -182583 -33863 -93829 149443 176892 -265089 -248525 -368019 256547
9714a27642b0981D8944a89885O7522A58694a42116A81481a39256G9857c8988l06704
$$ -127642 -20981 48944 -189885 -122363 158694 -142116 181481 -139256 79857 -38988 -345692
9703c45692A5399i3492k58713f7790A80511D4057J909J95561d89571G4149a15376
$$ -345692 15399 -93492 -352205 -67790 180511 44057 45966 241527 -489571 74149 -115376
9691d33406M5609I1222e42908a61784b4028j16492n7007C8020N6451c0802o5076
$$ -433406 -387797 91222 -542908 -161784 -24028 -140520 -197527 38020 94471 -30802 -95878
9680i5878F2480N8778d52762E5214Q7073o6690a06069A14374l3896f9437a1274
$$ -95878 62480 121258 -452762 55214 142287 75597 -106069 114374 80478 -69437 -11274
9668b24825h5876A4001Q2251b07219N4386c3423l92503A25853b2871D8540d37430
$$ -224825 -85876 14001 96252 -207219 -152833 -33423 -425926 125853 -22871 48540 -437430
9656a25627A9656J97497g4644A44815o9984b72309A67627a31661k45799e1518
$$ -125627 19656 217153 -74644 144815 74831 -272309 167627 -131661 -377460 -51518
9645G8144A7462a34822G4783c5216B92626a4528j05575a3251j50828j1139B90130
$$ 78144 17462 -134822 74783 -35216 292626 -14528 -120103 -13251 -164079 -175218 290130
9633a43265r6182N5720q7116H6061b71487r782C0330e017E3896b13390L3901D02511
$$ -143265 -239447 -183727 -270843 86061 -271487 -281269 30330 -5017 53896 -213390 -179489 402511
9620g7906n8915A1223b52591i0538K9465F9844b1601l99929a59239B13644b25346
$$ -77906 -136821 11223 -252591 -90538 -61073 69844 -21601 -421530 -159239 213644 -225346
9608a21425e3901C88018H4352J18220m068a77306n7039A23588A3319c6411f588
$$ -121425 -53901 388018 84352 202572 198504 -177306 -234345 123588 13319 -36411 -6588
9596b43127F3946b02316H4471a04718l5874c7187j84595g0535j31348d388G775
$$ -243127 63946 -202316 84471 -104718 -140592 -37187 -221782 -70535 -201883 -4388 7775
9584a87794h554k2302A9625a19198B0876J7459a69978M6408A51015d5160j41839
$$ -187794 -8554 -30856 19625 -119198 20876 38335 -169978 -123570 151015 -45160 -186999
9573a86999A11162K1431a31276J6217A4671b57674h6310F6775P7393m2417M735
$$ -186999 111162 132593 -131276 -115059 14671 -257674 -86310 66775 144168 101751 106486
9562A06486k0651C6676d55401F313g9811B4866J16547g2188A62853a61967H0044
$$ 106486 85835 36676 -455401 6313 -79811 24866 141413 -72188 162853 -161967 80044
9550a10149l08249a07891a203j57606k9869j6415b9285k61633A34694i5580j71449
$$ -110149 -418398 -107891 -1203 -158809 -188678 -205093 -29285 -290918 134694 -95580 -267029
9539b67029A23988K063c40892R7356L2881E9916e3151A11169l5749J0796a1772
$$ -267029 123988 126051 -340892 -243536 -210655 59916 -53151 111169 75420 86216 -11772
9527a06950j11560B2480a71955L8032j12012J21315n9370Q9034A29384d57064
$$ -106950 -218510 22480 -171955 -133923 -245935 -124620 -183990 -94956 129384 -457064
9516a70667k39047A30615a53545K0527j63245a23998C39679b12662G7142a81826
$$ -170667 -409714 130615 -153545 -133018 -296263 -123998 339679 -212662 77142 -181826
9505a56769N7379d6416A19939a27885J9058k44082B06383b11175C3014a47047
$$ -156769 -99390 -46416 119939 -127885 -108827 -352909 206383 -211175 33014 -147047
9494H9938c74877e8042D8675e6815k23319H921i1348n5432A08420d6260k75158
$$ 89938 -374877 -58042 48675 -56815 -280134 8921 -91348 -146780 108420 -46260 -321418
9483c21418P4488J0322j84950A33553b8887k47500h070D4012d3169l2705B8911
$$ -321418 -246930 -236608 -421558 133553 -28887 -276387 -8070 44012 -43169 -75874 28911
9471g6268A57923f3300j20709l7158k0242c8836I5074a23730A93705l3888M839
$$ -76268 157923 -63300 -184009 -221167 -241409 -38836 95074 -123730 193705 159817 164656
9460A64656J25102a03817B1775M485c8087l38073A54968j0085g4313k4694K3056
$$ 164656 289758 -103817 21775 26260 -38087 -376160 154968 144883 -74313 -99007 -75951
9449g5951A8685b41653C48i6115M3216C47954j08825a28697k39297b628j56885
$$ -75951 18685 -241653 348 -96115 -52899 347954 239129 -128697 -367994 -2628 -159513
9438a59513A18089j8312d4673M691A92074b74360j81288J90179D0955e3896l02579
$$ -159513 118089 99777 -44673 -39982 192074 -274360 -455648 -265469 40955 -53896 -356475
9427c56475a02156n2920A02487D8969J25665c0020j52791a0411k42909R7997N2510
$$ -356475 -102156 -155076 102487 48969 174634 -30020 -182811 -10411 -253320 -155323 -102813
9416a02813q5078n8532j03874F1249e7110p3550F9618A2715Q831a1389D3914a7557
$$ -102813 -187891 -246423 -350297 61249 -57110 -130660 69618 12715 21546 -11389 43914 -17557
9403C0900P6955h6646j47615f7518B12737F3797J55290A2200g3495A8610a5723
$$ 30900 107855 -86646 -234261 -67518 212737 63797 219087 12200 -73495 18610 -15723
9391a94088f1670j9084D7176Q0504c6416p7524d950j08669j18080b2267k11757
$$ -194088 -61670 -80754 47176 127680 -36416 -113940 -4950 -113619 -231699 -22267 -234024
9380b34024B0612k229Q1453a08974p4852N0716A24322A9061a10126A4514K89037
$$ -234024 20612 18383 99836 -108974 -183826 -133110 124322 19061 -110126 14514 303551
9369C03551F2003o477O7636a22124K3463b9673j47996j17443A61195a13250H6849
$$ 303551 62003 55526 123162 -122124 -98661 -29673 -177669 -295112 161195 -113250 86849
9357b44235J08545l5067B00617D3870c11441A78685l0915n9554b58695A86961
$$ -244235 -135690 -170757 200617 43870 -311441 178685 147770 88216 -258695 186961
9346a38414k64971A824b54308a12405C9718a26412C1653M9651a14829J4524k81595
$$ -138414 -403385 1824 -254308 -112405 39718 -126412 31653 81304 -114829 -100305 -381900
9335c81900R8837J13818M0819M9517A24711a49162C9842A3476K4049b89814c844
$$ -381900 -283063 -169245 -128426 -78909 124711 -149162 39842 13476 37525 -289814 -3844
9323b13964c4379A78555k3149g4205j56694Q1087k55433a9074m6898j46538a956
$$ -213964 -34379 178555 155406 -74205 -230899 -149812 -405245 -19074 -65972 -212510 -1956
9311D2135d6789b2424E49066f1689m08430A240a45606a4259D4387a03031O778
$$ 42135 -46789 -22424 549066 -61689 -470119 1240 -145606 -14259 44387 -103031 -96253
9300i6253b7885n1062G7181a99236F0402e7574A16538b3652j60914E9990f8541
$$ -96253 -27885 -78947 77181 -199236 60402 -57574 116538 -23652 -184566 59990 -68541
9288b17758B21952b20346A83297B7056a83133C530K8207b93639f6983G9599K6351
$$ -217758 221952 -220346 183297 27056 -183133 3530 31737 -293639 -66983 79599 105950
9277A05950P0023F7665b26592e56A43599a20094b2643j58309P6336I7267b36126
$$ 105950 175973 67665 -226592 -556 143599 -120094 -22643 -180952 -104616 97267 -236126
9265a15746N0889G0431a29118C9600d7856l09642g0257p9488A64601l1409d8873
$$ -115746 -64857 70431 -129118 39600 -47856 -357498 -70257 -149745 164601 133192 -48873
9253A04500c96985b3578j79234C7303K07456i1177B01239Q4401j30155A2478b04466
$$ 104500 -396985 -23578 -202812 37303 244759 -91177 201239 285640 155485 12478 -204466
9241A27624d28006a7838H3065e7938E1242g9118J0161k46993a27B61458A3727
$$ 127624 -428006 -17838 83065 -57938 51242 -79118 -68957 -315950 -127 261458 13727
9229b15435c525j51284A17879e1379j64269j7688A66505G918M7776K50762b0125
$$ -215435 -3525 -154809 117879 -51379 -215648 -233336 166505 7918 55694 306456 -20125
9217d0580j18954B13323C0312c87853J37841F555J29062b28310b3716C94968a42752
$$ -40580 -159534 213323 30312 -387853 -250012 6555 135617 -228310 -23716 394968 -142752
9205C9979b3940A05915e32685J05947b2432A5845g9708k9096A698f757B68331
$$ 39979 -23940 105915 -532685 -426738 -22432 15845 -79708 -108804 1698 -6757 268331
9193C59732j36740B1911j0428f9809k12504J2070c4472D7042c9924A76728J1258
$$ 359732 222992 21911 11483 -69809 -282313 -270243 -34472 47042 -39924 176728 187986
9182A87986e2723K25A25302b10587I7804b86265A798c7712e35j24726j90392h6207
$$ 187986 -52723 -52498 125302 -210587 97804 -286265 1798 -37712 -535 -125261 -315653 -86207
9169d40272h9362p1584l2290J0134f805D59378c6859n3974a9785B46231I1769
$$ -440272 -89362 -160946 -193236 -183102 -6805 459378 -36859 -90833 -19785 246231 91769
9157F0167a22094J2727A76829b24180m7431j56101A98456q5191b43009a18855
$$ 60167 -122094 -109367 176829 -224180 -271611 -427712 198456 113265 -243009 -118855
9146c85522G9195a31972b6920O705r1795d3091B05828N9470A28275a41139e3606
$$ -385522 79195 -131972 -26920 -20215 -112010 -43091 205828 265298 128275 -141139 -53606
9134b25312P9837M957A78188a18753c4041l860A21415d3834F7769a56924C5933
$$ -225312 -145475 -140518 178188 -118753 -34041 -37901 121415 -43834 67769 -156924 35933
9122a36908N8784k7413j54625e851C6924J01376n681J8260a91174E689J18514
$$ -136908 -78124 -105537 -260162 -5851 36924 138300 132619 150879 -191174 5689 124203
9111A24203E9534Q2270J80770b15759k27319E7320b25676G6616a53693j15700
$$ 124203 59534 141804 322574 -215759 -443078 57320 -225676 76616 -153693 -269393
9101b69393J00687A9278a25016K5022B21543c6506A61671k3950b14370e8671J7149
$$ -269393 -168706 19278 -125016 -99994 221543 -36506 161671 137721 -214370 -58671 -41522
9090d1522l4738J938q8884H2306n806a66543K7545j8111A00445a33154k78586
$$ -41522 -76260 -74322 -163206 82306 76500 -166543 -138998 -157109 100445 -133154 -411740
9079d11740a17579G981f6554A77739c08197A3948a30235B5287d7014k58293e4606
$$ -411740 -117579 7981 -66554 177739 -308197 13948 -130235 25287 -47014 -305307 -54606
9067b24404f1832j02841A0408g411j87811i295A1424a35801N6258D293c94074
$$ -224404 -61832 -164673 10408 -7411 -195222 -9295 11424 -135801 -79543 4293 -394074
9055d0367B00428a66892j27618C7070b18297M9089B0392b5526A27113b63171P0791
$$ -40367 200428 -166892 -294510 37070 -218297 -169208 20392 -25526 127113 -263171 -192380
9044a92380i1079H9560J23387h9474l4116k2126o744M2263p3630j17703c5725
$$ -192380 -91079 89560 212947 -89474 -123590 -145716 -152460 -110197 -183827 -301530 -35725
9032G44a27756o8374D6339c5200B03534c79200A53106m5179h1368c3251F0430
$$ 744 -127756 -196130 46339 -35200 203534 -379200 153106 107927 -81368 -33251 60430
9020b72381c2467G2001b66712i5890c7257l1050C65728j07957B9851g8696I3371
$$ -272381 -32467 72001 -266712 -95890 -37257 -68307 365728 257771 29851 -78696 93371
9008a00773A11379O8691e3048j1628k18426E0322J65765c1701e685A72189e7343
$$ -100773 111379 180070 -53048 -64676 -283102 50322 216087 -31701 -5685 172189 -57343
8996b20361L9781A34981F6468b5098j81237D0886O274f5534j34026d8339A35597
$$ -220361 -180580 134981 66468 -25098 -206335 40886 47160 -65534 -199560 -48339 135597
8984a84221j03666B7994J43734a29970l26696B35111A12578K8904C3335i603j01486
$$ -184221 -287887 27994 171728 -129970 -456666 235111 112578 141482 33335 -9603 -111089
8973a11089A98689b84460R6607P3272c0456k4433k25054k6886G9987a09268k34359
$$ -111089 198689 -284460 -187853 -114581 -30456 -54889 -279943 -306829 79987 -109268 -343627
8962c43627b0753B09221b80996a05395a2273k09851A58296c74849J05073Q0353
$$ -343627 -20753 209221 -280996 -105395 -12273 -222124 158296 -374849 -269776 -189423
8952a89423B9728J14301a24397d4563a7565A77399b28956F1496g6710j01361e2292
$$ -189423 29728 144029 -124397 -44563 -17565 177399 -228956 61496 -76710 -178071 -52292
8940H9118a18987f562k66159B16661e4842E1697K50557b07887a514A9476R1753
$$ 89118 -118987 -6562 -272721 216661 -54842 51697 302254 -207887 -1514 19476 111229
8929A11229h604A9395N6542N5970a64549K8556N3097B3776J95414c6358C5323
$$ 111229 -8604 19395 75937 131907 -164549 -135993 -82896 23776 219190 -36358 35323
8917h3587E07424A46445a27971A30851d05342C04147n6707O5014J7449J0081N35503
$$ -83587 507424 146445 -127971 130851 -405342 304147 247440 312454 329903 339984 875487
8906H75487J401954A016164m45249c118C3029E094R3294L6913a11367A99621A3773
$$ 875487 2277441 1016164 570915 -3118 33029 5094 98388 135301 -111367 199621 13773
8894B4310c25646A7944c23688A92973b74161a26534k58248A37675b03448B79633
$$ 24310 -325646 17944 -323688 192973 -274161 -126534 -384782 137675 -203448 279633
8883b48024k6080M2349B06308a04823l5142A34577g2646D6969B1219N8975c30161
$$ -248024 -274104 -231755 206308 -104823 -139965 134577 -72646 46969 21219 80194 -330161
8871F9787J26556a28893r3148j16201E1002A0726a39686n0423D8938a84364P7490
$$ 69787 196343 -128893 -222041 -338242 51002 10726 -139686 -190109 48938 -184364 -106874
8860a06874F5414K54333o3547e9150C1400P128P8618c4453A98297F436a2371l54163
$$ -106874 65414 319747 256200 -59150 31400 38528 117146 -34453 198297 6436 -12371 -366534
8848c66534a43997f0270A12273b06231I7119D5094j6391K54469H5109b57410B31923
$$ -366534 -143997 -60270 112273 -206231 97119 45094 28703 283172 85109 -257410 231923
8836D6890b41202B46396A08481a20907j6028j81267A22000h4340K4508l4475B431
$$ 46890 -241202 246396 108481 -120907 -136935 -318202 122000 -84340 -59832 -94307 2431
$$ [...]
##END NTUPLES=NMR SPECTRUM
##END=
