
##TITLE=AC1223_Punto_6074882_m5SeEwai4W
##JCAMPDX= 6.0         $$ Bruker NMR JCAMP-DX V2.0
##DATA TYPE= NMR SPECTRUM
##DATA CLASS= NTUPLES
##ORIGIN= BRUKER
##OWNER= Administrator
$$ 1.72 TOPSPIN		Version 2.1
$$ 2012-05-07 21:40:46.859 -0500  Administrator@TOPSPIN
$$ Compression mode = diff/dup
##.OBSERVE FREQUENCY= 400.13188235
##.OBSERVE NUCLEUS= ^1H
##.ACQUISITION MODE= SIMULTANEOUS (DQD)
##.ACQUISITION SCHEME= undefined
##.AVERAGES= 8
##.DIGITISER RES= 22
##SPECTROMETER/DATA SYSTEM= spect
##.PULSE SEQUENCE= zg30
##.SOLVENT NAME= COFFEE_meoh
##.SHIFT REFERENCE= INTERNAL, COFFEE_meoh, 1, 14.98061
##AUDIT TRAIL= $$ (NUMBER, WHEN, WHO, WHERE, PROCESS, VERSION, WHAT)
$$ ##TITLE= Audit trail, TOPSPIN		Version 2.1
$$ ##JCAMPDX= 5.01
$$ ##ORIGIN= Bruker BioSpin GmbH
$$ ##OWNER= Administrator
$$ $$ C:\Bruker\TOPSPIN/data/COFFEE/nmr/AC1223_Punto_6074882_m5SeEwai4W/10/pdata/1/auditp.txt
$$ ##AUDIT TRAIL=  $$ (NUMBER, WHEN, WHO, WHERE, PROCESS, VERSION, WHAT)
(   1,<2012-05-07 21:40:39.984 -0500>,<Administrator>,<TOPSPIN>,<go>,<TOPSPIN 2.1>,
      <created by zg
	started at 2012-05-07 21:39:33.109 -0500,
	POWCHK enabled, PULCHK disabled,
       configuration hash MD5:
       AF F2 23 6B 01 CD 40 DD E5 A1 38 A0 06 EA F7 77
       data hash MD5: 64K
       90 C3 10 D6 28 67 D6 04 F4 E2 57 1C 74 9F 14 59>)
(   2,<2012-05-07 21:40:42.515 -0500>,<Administrator>,<TOPSPIN>,<proc1d>,<TOPSPIN 2.1>,
      <Start of raw data processing
       efp LB = 0 FT_mod = 6 PKNL = 1 PHC0 = 0 PHC1 = 0 SI = 32K 
       data hash MD5: 32K
       1F AC F9 EB 44 D7 93 26 09 EC D3 F1 39 CA 78 25>)
(   3,<2012-05-07 21:40:42.953 -0500>,<Administrator>,<TOPSPIN>,<proc1d>,<TOPSPIN 2.1>,
      <pk PHC0 = 212.2119 PHC1 = 0 
       data hash MD5: 32K
       CC A0 02 70 88 7A C3 7F CF 8B 76 B9 C4 10 2E CF>)
(   4,<2012-05-07 21:40:43.093 -0500>,<Administrator>,<TOPSPIN>,<proc1d>,<TOPSPIN 2.1>,
      <abs ABSG = 1 
       data hash MD5: 32K
       D1 6C 04 77 35 51 69 46 61 DC 64 C3 04 42 3A E3>)
(   5,<2012-05-07 21:40:43.125 -0500>,<Administrator>,<TOPSPIN>,<proc1d>,<TOPSPIN 2.1>,
      <abs ABSG = 2 
       data hash MD5: 32K
       BC 6B 03 94 4E 00 D5 2F B7 B4 ED 20 FE 48 7D 48>)
(   6,<2012-05-07 21:40:43.156 -0500>,<Administrator>,<TOPSPIN>,<proc1d>,<TOPSPIN 2.1>,
      <abs ABSG = 3 
       data hash MD5: 32K
       16 D8 89 3E 8B C2 EC 7F 6C 87 1A CF C7 E1 4C FE>)
(   7,<2012-05-07 21:40:43.187 -0500>,<Administrator>,<TOPSPIN>,<proc1d>,<TOPSPIN 2.1>,
      <abs ABSG = 4 
       data hash MD5: 32K
       E2 72 59 17 D9 8A E3 B9 D9 45 FC CE C0 66 B4 D0>)
(   8,<2012-05-07 21:40:43.203 -0500>,<Administrator>,<TOPSPIN>,<proc1d>,<TOPSPIN 2.1>,
      <abs ABSG = 5 
       data hash MD5: 32K
       9F 5C 79 35 D5 56 41 EF C3 9E 7C E9 A1 22 01 A8>)
$$ ##END=
$$ 
$$ $$ hash MD5
$$ $$ 7C 21 38 B8 C0 19 43 E0 4E D2 3C 30 3B 9B 79 ED
##$RELAX= 
##$RELAX= 
##$RELAX= 
##$RELAX= 
##$RELAX= 
##$RELAX= 
##$RELAX= 
$$ Bruker specific parameters
$$ --------------------------
$$ [...]
150 150 150 150 150 150 150 150
##$TP07= 0
##$TPNAME0= <>
##$TPNAME1= <>
##$TPNAME2= <>
##$TPNAME3= <>
##$TPNAME4= <>
##$TPNAME5= <>
##$TPNAME6= <>
##$TPNAME7= <>
##$TPOAL= (0..7)
0.5 0.5 0.5 0.5 0.5 0.5 0.5 0.5
##$TPOFFS= (0..7)
0 0 0 0 0 0 0 0
##$TUNHIN= 0
##$TUNHOUT= 0
##$TUNXOUT= 0
##$USERA1= <user>
##$USERA2= <user>
##$USERA3= <user>
##$USERA4= <user>
##$USERA5= <user>
##$V9= 5
##$VALIST= <valist>
##$VCLIST= <CCCCCCCCCCCCCCC>
##$VD= 0
##$VDLIST= <DDDDDDDDDDDDDDD>
##$VPLIST= <PPPPPPPPPPPPPPP>
##$VTLIST= <TTTTTTTTTTTTTTT>
##$WBST= 1024
##$WBSW= 4
##$XGAIN= (0..3)
0 0 0 0
##$XL= 0
##$YL= 0
##$YMAX_a= 525504
##$YMIN_a= -626533
##$ZGOPTNS= <>
##$ZL1= 120
##$ZL2= 120
##$ZL3= 120
##$ZL4= 120
##$ABSF1= 14.98061
##$ABSF2= -5.57192
##$ABSG= 5
##$ABSL= 3
##$ALPHA= 0
##$AQORDER= 0
##$ASSFAC= 0
##$ASSFACI= 0
##$ASSFACX= 0
##$ASSWID= 0
##$AUNMP= <proc_prof1d_extract_pilot.lims>
##$AXLEFT= 0
##$AXNAME= <>
##$AXNUC= <1H>
##$AXRIGHT= 0
##$AXTYPE= 0
##$AXUNIT= <>
##$AZFE= 0.1
##$AZFW= 0.1
##$BCFW= 0
##$BC_mod= 0
##$BYTORDP= 0
##$COROFFS= 0
##$CY= 15
##$DATMOD= 1
##$DC= 0
##$DFILT= <>
##$DTYPP= 0
##$F1P= 0
##$F2P= 0
##$FCOR= 0.5
##$FTSIZE= 32768
##$FT_mod= 6
##$GAMMA= 0
##$GB= 0
##$INTBC= 1
##$INTSCL= 1
##$ISEN= 128
##$LB= 0
##$LEV0= 0
##$LPBIN= 0
##$MAXI= 10000
##$MC2= 0
##$MEAN= 0
##$ME_mod= 0
##$MI= 0
##$NCOEF= 0
##$NC_proc= -8
##$NLEV= 6
##$NOISF1= 0
##$NOISF2= 0
##$NSP= 0
##$NTH_PI= 0
##$NZP= 0
##$OFFSET= 14.98061
##$PC= 1
##$PHC0= 212.2119
##$PHC1= 0
##$PH_mod= 1
##$PKNL= yes
##$PPARMOD= 0
##$PPDIAG= 0
##$PPIPTYP= 0
##$PPMPNUM= 2147483647
##$PPRESOL= 1
##$PSCAL= 4
##$PSIGN= 0
##$PYNMP= <proc.py>
##$REVERSE= no
##$SF= 400.13
##$SI= 32768
##$SIGF1= 0
##$SIGF2= 0
##$SINO= 400
##$SIOLD= 32768
##$SPECTYP= <>
##$SREGLST= <1H.CDCl3>
##$SSB= 0
##$STSI= 32768
##$STSR= 0
##$SW_p= 8223.68421052632
##$SYMM= 0
##$S_DEV= 0
##$TDeff= 65536
##$TDoff= 0
##$TI= <>
##$TILT= no
##$TM1= 0
##$TM2= 0
##$TOPLEV= 0
##$USERP1= <user>
##$USERP2= <user>
##$USERP3= <user>
##$USERP4= <user>
##$USERP5= <user>
##$WDW= 1
##$XDIM= 32768
##$YMAX_p= 463889121
##$YMIN_p= -781943
##$CURPLOT= <Network HP LaserJet P1505>
##$CURPRIN= <$Network HP LaserJet P1505>
##$DFORMAT= <normdp>
##$LAYOUT= <+/1D_H.xwp>
##$LFORMAT= <normlp>
##$PFORMAT= <normpl>
##$SURQMSG= 1
$$ End of Bruker specific parameters
$$ ---------------------------------
##NTUPLES= NMR SPECTRUM
##VAR_NAME=  FREQUENCY,     SPECTRUM/REAL,   SPECTRUM/IMAG
##SYMBOL=    X,             R,               I
##VAR_TYPE=  INDEPENDENT,   DEPENDENT,       DEPENDENT
##VAR_FORM=  AFFN,          ASDF,            ASDF
##VAR_DIM=   32768,         32768,           32768
##UNITS=     HZ,            ARBITRARY UNITS, ARBITRARY UNITS
##FACTOR=    0.250966925370066, 1,           1
##FIRST=     8223.43324360095, -296901,      -236912
##LAST=      0,             98961,           -165736
##MIN=       0,             -781943,         0
##MAX=       8223.43324360095, 463889121,    0
$$ Real data points
##PAGE= N=1
##DATA TABLE= (X++(R..R)), XYDATA
$$ [...]
19550H6527a00423B4329d3370A16000c8716k4952j44198K2678A01375h1351j3981
19539i5332j30568D0475b2715r3799e0520J2357n3471l21392f148B9518A0174
19527A07195b09020d8319b520B2943b4750A9615a95171h5332B93393i7893F6899
19515b20460I2399b73697A1773b37007a10563M2921j14745K8427B00895b47340
19504b28445j93226D8184a831A37811b13246A8065b2375j50871K5979A64868a73665
19492i8755n9321e0150j68401B21046j00859E5691g5141F8754B2453b75284B44906
19480a08841A20045a75002d1080k72344H196A083J48263a75497E8503a38088C080
19468a70823g5482m52746f4573j13613Q7024k9646L9508D0894a66148H4512N1709
$$ y = [86527, -100423, 24329, -43370, 116000, -38716, -63668, -207866, -185188, 101375, -81351, -95332, -225900, 40475, -22715, -116514, -50520, -38163, -91634, -413026, -6148, 29518, 10174, 107195, -209020, -48319, -2520, 22943, -24750, 19615, -195171, -85332, 293393, -97893, 66899, -220460, 92399, -273697, 11773, -237007, -110563, -67642, -182387, -153960, 200895, -247340, -228445, -421671, 48184, -1831, 137811, -213246, 18065, -22375, -173246, -147267, 164868, -173665, -98755, -158076, -50150, -218551, 221046, 120187, 55691, -75141, 68754, 22453, -275284, 244906, -108841, 120045, -175002, -41080, -313424, 8196, 1083, 149346, -175497, 58503, -138088, 3080, -170823, -75482, -528228, -64573, -178186, -91162, -120808, -81300, 40894, -166148, 84512, 136221]
19457A36221B6585a89863b5534l64863A33702a07166c5259A18881a00288G9349
19446c3486n30015a16726l37752b06171c1749P541m5240G8198h8590L6860q1870
19435a33600B95995c1745o7108G1827d34639K00685A44381M2265E8225O5453b19554
19423c31249G1102J69551c860l72774i2677q2001A66108E5389d5595n3568H8736
19411B72238l2353c49667A90681d8461k3757L530G5291e3223l0985k68109a17181
19399i3196C26048a12471m6511A1963g1011j45378P3770C6920b8625A46033F0950
19387a74037j66240B9460a77287A82622a12598F9163b3298j12604J6152B23354
19376a28353m5466a9472j46468b6897q7246l5669A06519m1051k7943J13460a20426
$$ y = [136221, 26585, -189863, -25534, -390397, 133702, -107166, -35259, 118881, -100288, 79349, -33486, -563501, -116726, -454478, -206171, -31749, -24208, -69448, 78198, -88590, -51730, -133600, 295995, -31745, -98853, 71827, -434639, -233954, 144381, 186646, 58225, 123678, -219554, -331249, 71102, 240653, -3860, -376634, -92677, -174678, 166108, 55389, -45595, -99163, 88736, 272238, 239885, -349667, 190681, -48461, -72218, -68688, 75291, -53223, -84208, -352317, -117181, -93196, 326048, -112471, -158982, 11963, -71011, -216389, -142619, 36920, -28625, 146033, 60950, -174037, -340277, 29460, -177287, 182622, -112598, 69163, -23298, -135902, -119750, 223354, -128353, -173819, -19472, -165940, -26897, -114143, -149812, 106519, 65468, 37525, 150985, -120426]
19364B29827c38227C46770j58405c3437j48121h8720j01641i2378I878Q1212h7811
19352d22000g6222o9578D6822a04707r4389E5785a879k9378m7623K6131F1438
19340A2584J2033L0584a50418J5514j53342B34836a9640j17902C8589j0417b68629
19328I2129a29581c9218A82714a32455M8586K6425F8140a58488B69368B2426N2588
19317G5014a8047k57277i6036l994E6758e0840p6095N3519k0335j5243A51988
19305C1906R6109M2140E5471R9109a67704j66740a11816A28516c17130E6719i4981
19293C7865J86884B6640J74201q6698g40j75700I0532e2031C36870a6781m8279
19282f5060o2517R042M7276j67401l6101J28445K0063n9848c5042F7037a6837
$$ y = [229827, -338227, 346770, 188365, -33437, -181558, -88720, -190361, -92378, 9878, 91090, -87811, -422000, -76222, -145800, 46822, -104707, -199096, 55785, -1879, -31257, -78880, -52749, 61438, 12584, 24617, 55201, -150418, -134904, -288246, 234836, -19640, -137542, 38589, 28172, -268629, 92129, -129581, -39218, 182714, -132455, -83869, -57444, 68140, -158488, 269368, 22426, 75014, -18047, -275324, -96036, -100030, 56758, -50840, -126935, -73416, -93751, -108994, 151988, 31906, 128015, 170155, 55471, 154580, -167704, -334444, -111816, 128516, -317130, 56719, -94981, 37865, 224749, 26640, 200841, 114143, -740, -176440, 90532, -52031, 336870, -16781, -65060, -127577, -118535, -71259, -238660, -274761, -146316, -126253, -186101, -35042, 67037, -16837]
19270H6304c9777j76076e1736j26565A66035a63773O6929q9620A80200a09168
19259A80851d15162J49841h0743L4375C64569I7722a62806i256j19054d0936k58692
19248b99628d8962J2844k62192J0156e3658j25324A6409O4116a66963j6016h4194
19236D6650c02978B6749i4380A1953J38858g387q5311I6650i8265e164k93650
19225b98814A82327b72571p0116A1567O8554J93069h5497M788H4841b26204Q0730
19214a45474L4557J0262A25515a35916f051j06784B05637A9578L3643J48212l5232
19203A66201b37988A97953b69936B3748a78033B08793D6019b14853f8480l3946
19193a02426F4614R3160n5323a33079A09842C234R9141l6496o314a36896R793
$$ y = [86304, -39777, -215853, -51736, -178301, 166035, -163773, -96844, -186464, 180200, -109168, 180851, -415162, -265321, -80743, -46368, 364569, 97722, -162806, -9256, -128310, -40936, -299628, -48962, -36118, -298310, -288154, -53658, -178982, 16409, 80525, -166963, -182979, -84194, 46650, -302978, 26749, -94380, 11953, 150811, -7387, -92698, 96650, -98265, -5164, -298814, 182327, -272571, -342687, 11567, 80121, 273190, -85497, -80709, 84841, -226204, -145474, -110917, -100655, 125515, -135916, -6051, -112835, 205637, 19578, 53221, 201433, 166201, -237988, 197953, -269936, 23748, -178033, 208793, 46019, -214853, -68480, -102426, 64614, 157774, 102451, -133079, 109842, 3234, 102375, 65879, 59565, -136896, -127103]
19182a27103B3852R5208B0990a77530l040K7272M3777M3995B2836e6371D2629
19170I8371K89941a55507k7072I5974b06754j11938L1449a23122b8112l8691j65172
19159b31975J04029M9011A07034c6119r2418k6397H2136a13456K7934A27644b61161
19147I7074a52920k0059p2236G126J1031a91581I0168K26718j40817c53189a62777
19135a27725e8914m5537N924j67980A69191a43370l2416A27981e8840A42403a40184
19123a7978j70824C92962a61210o805O2990k6104D4439b47833h8003F1972b15984
19111e1561C5183J01515f2440L0246k8399D8366b61105g5300k01924l740D3389
19099a53844M8378N1796L315F1280c11146E9483d2133B9021F78J888h6834A39812
$$ y = [-127103, 23852, 119060, 20990, -177530, -180570, -153298, -109521, -65526, 22836, -56371, 42629, 98371, 388312, -155507, -182579, 95974, -206754, -318692, -287243, -123122, -28112, -66803, -231975, -127946, -78935, 107034, -36119, -128537, -154934, 82136, -113456, -85522, 127644, -261161, 97074, -152920, -172979, -245215, 7126, 18157, -191581, 90168, 316886, 176069, -353189, -162777, -127725, -58914, -104451, -98527, -266507, 169191, -143370, -175786, 127981, -58840, 142403, -140184, -17978, -188802, 392962, -161210, -168015, -105025, -131129, 44439, -247833, -88003, 61972, -215984, -51561, 35183, 136698, -62440, -32194, -60593, 48366, -261105, -75300, -277224, -280964, 43389, -153844, -105466, -53670, -50355, 61280, -311146, 59483, -42133, 29021, 678, 2566, -86834, 139812]
19086b14891A35002a283r1686G9591a64353c3854C7977j3325c79039J15239c5566
19074a92070K8580j8354C55327A0627i481j23408e7028j39361Q9840m07460a23780
19062c2564p194j21031l3067M2367A55022A6985b8417j13949D0561h2364j34531
19051b16895A50980a55588f001q2467k87798A91578B8223b24237g7094F2828A5663
19039c48166a73758A39726c73573J34241A50173a30810j77266a32492i078j65454
19029a74532j019h0558A7716g4289B02712a71689H2988K37396A22706K19956j37146
19018B05516C7965K14306A15610c5607A2965J70979d88674I5881J05582E9391
19007a34198b6742j58664B78386f174k03840A32181a26036l4152M5710B28433
$$ y = [-214891, 135002, -1283, -92969, 79591, -164353, -33854, 37977, 24652, -379039, -263800, -35566, -192070, -163490, -181844, 355327, 10627, -9481, -132889, -57028, -196389, -106549, -514009, -123780, -32564, -39758, -160789, -193856, -151489, 155022, 16985, -28417, -142366, 40561, -82364, -216895, 150980, -155588, -6001, -88468, -376266, 191578, 28223, -224237, -77094, 62828, 15663, -348166, -173758, 139726, -373573, -239332, 150173, -130810, -308076, -132492, -9078, -174532, -175551, -80558, 17716, -74289, 202712, -171689, 82988, 320384, 122706, 342662, 205516, 37965, 252271, 115610, -35607, 12965, 183944, -488674, 95881, 201463, 59391, -134198, -26742, -185406, 278386, -6174, -210014, 132181, -126036, -160188, -114478, 228433]
18996f6866l90523a2746B06954m1263i8757B47850F8835B2674H313a15722I9644
18984b64710I2173m707M2141C8343b15472A97599c2868I1331O4314a61947H1162
18972i9425j17477O5744B53900l8443g0412J0284C29050h9500o2784E2144d06425
18960a70659j3941Q9618a7915j23824r9433E840J26304J4241a96939B21760i9107
18948b99096g9274k8987k9165N0109d422l0226j84052e2699A63780h5291E8345
18936c4824k84398A98841H061a87666B28898E4514M09029a98744M1995e9319A97737
18924b9174o8422j30392B51260a23437j89666I1960b13134B42642j5835b46660
18913a78691B31227a53110M0181K9338F0343b63396c177k27040g5600B9855o811
$$ y = [-66866, -457389, -12746, 206954, 165691, -98757, 247850, 68835, 22674, 8313, -115722, 99644, -264710, 92173, 87466, 129607, 38343, -215472, 197599, -32868, 91331, 155645, -161947, 81162, -99425, -216902, -151158, 253900, 215457, -70412, -60128, 329050, -89500, -152284, 52144, -406425, -170659, -184600, -94982, -17915, -141739, -241172, 5840, 132144, 146385, -196939, 221760, -99107, -299096, -79274, -108261, -137426, -87317, -4422, -34648, -218700, -52699, 163780, -85291, 58345, -34824, -319222, 198841, 8061, -187666, 228898, 54514, 463543, -198744, -156749, -59319, 197737, -29174, -97596, -227988, 251260, -123437, -313103, 91960, -213134, 242642, 226807, -246660, -178691, 231227, -153110, -112929, -83591, 60343, -263396, -3177, -230217, -75600, 29855, 23044]
18902B3044K1670b54131M9943A7221J74168E9913a51041M263L5037R632K5657
18891g6452j55600A17224N3105a19558B47580b34848M7127Q877A4183R8384L21951
18880D34518h651l39479J42152A11883a26349A45699J17710M516a38836B5493
18869b04679n5230K6094A34682K31818b14531C9731J41643n9744a24427b0928
18858I4742f8314j25131C17762a11183C9274K9079d1923a7931j41836B39355a0122
18846B60417f4744k577l82385a59790f6784j20742N29l4669P2597A97874C9815
18834I0228j5425J00495G004c61751b6674j31650M6226d6198A68584b16143e2826
18822B08200A4442N2743J15196a44042j3229F1580B0783h1605A05578E994J79552
$$ y = [23044, 44714, -254131, -204188, 17221, 191389, 59913, -151041, -146778, -111741, -102109, -76452, -232052, 117224, 170329, -119558, 247580, -234848, -187721, -178844, 14183, 112567, 434518, -8651, -348130, -205978, 111883, -126349, 145699, 263409, 267925, -138836, 25493, -204679, -259909, -233815, 134682, 366500, -214531, 39731, 181374, 121630, -124427, -20928, 94742, -68314, -193445, 317762, -111183, 39274, 68353, -41923, -17931, -159767, 239355, -10122, 260417, -64744, -67321, -449706, -159790, -66784, -187526, -186997, -221666, -149069, 197874, 39815, 90228, 74803, 175298, 7004, -361751, -26674, -158324, -112098, -46198, 168584, -216143, -52826, 208200, 14442, 67185, 182381, -144042, -157271, 61580, 20783, -81605, 105578, 5994, 185546]
18811A85546c17065B19436C5561a50999B61821b02221B5077J45647a84352b6362
18800B25300b15318D29896m9856p0663C6949f6837A65826a55380C0024c2906A7400
18788E0238a03429o5618N6021G8318R8898h7811A79468a61118K5417r0936B3992
18776d6798A50256f1338A11030e3626k94569J50374R8838j29095M1137e7482A57399
18764F5244K85594A00270b53344i1515L9163J3152j02414L6498L7195q1752M0990
18753a08683n2197n0646A7552d79000F4321a57209j57413a28361j3975f8711A98069
18741A57027e4523j47561C3526b75723A69404a30727b3492j55170j51286I0002
18730F7610g7246A43469h1816I2907m3452a94558j9720R2216C11531a2716k67517
$$ y = [185546, -317065, 219436, 35561, -150999, 261821, -202221, 25077, 170724, -184352, -26362, 225300, -215318, 429896, 380040, 309377, 36949, -66837, 165826, -155380, 30024, -32906, 17400, 50238, -103429, -169047, -113026, 78318, 177216, -87811, 179468, -161118, -135701, -226637, 23992, -46798, 150256, -61338, 111030, -53626, -348195, -197821, -98983, -228078, -186941, -57482, 157399, 65244, 350838, 100270, -253344, -91515, -52352, -39200, -141614, -105116, -67921, -149673, -108683, -160880, -211526, 17552, -479000, 64321, -157209, -314622, -128361, -142336, -68711, 198069, 157027, -54523, -202084, 33526, -275723, 169404, -130727, -23492, -178662, -329948, 90002, 67610, -77246, 143469, -81816, 92907, 49455, -194558, -214278, -122062, 311531, -12716, -280233]
18719b80233i4710j85174c9996G3441B2726a41199C15276d02258h9088A7956c6564
18707B17702B9189A182b17241e3085p5490k3809D27914a62780d5191G660b74978
18695a09763a4332j06987D7216a56285A86874a4340C2127J52874b10933N0056
18685a60877A71442c06375D2321c15391a0541k6440B32895D5502P3352C9285h7592
18673A71905F4050j4934c31893a18710A28000K17881a34212k81068J17666C1093
18662c08452A44316b51730H5558a97006j53779H0985b6953C47415c21828A7899
18651A17837a61986c8275A10863J04958c51553a25026j21480f7031C60459c12671
18640E2431a44761A51680b03091k41407b15061D3160J0426b51879C24257i1083
$$ y = [-280233, -94710, -279884, -39996, 73441, 22726, -141199, 315276, -402258, -89088, 17956, -36564, 217702, 29189, 1182, -217241, -53085, -128575, -152384, 427914, -162780, -45191, 7660, -274978, -109763, -14332, -121319, 47216, -156285, 186874, -14340, 32127, 185001, -210933, -160877, 171442, -306375, 42321, -315391, -10541, -36981, 232895, 45502, 118854, 39285, -87592, 171905, 64050, 49116, -331893, -118710, 128000, 345881, -134212, -415280, -297614, 31093, -308452, 144316, -251730, 85558, -197006, -350785, 80985, -26953, 347415, -321828, 17899, 117837, -161986, -38275, 110863, 215821, -351553, -125026, -246506, -67031, 360459, -312671, 52431, -144761, 151680, -203091, -444498, -215061, 43160, 53586, -251879, 324257, -91083]
18629B7266a77615H7093k9091e1792K3741k2607l0001a4754A87019L1921H9079
18617A56794J6953e1024B50650a79781a8658l7588j4305j33281C4199q459a07441
18605a8098A56684D0850E599a2606j2169A68527a27676J943h373l29211d6523
18593C50294h6547B8474b0010j09616J8731A77829b99308J29907n2662q3350i6379
18581a04794B10597J07087A07958b0060A62369k9660F1816d20085A3639i4853
18570E628a62326c9464F2399g1872o8099O3225E6223c70517a23514l2915B25464
18558b04892N6965J45P559Q356n8634B93106i4770k7868N7034j69046d3687l72027
18546d15714F9911b4197H6039h6795L5657I6224c22631B56455d4530F8710K93576
$$ y = [27266, -177615, 87093, 58002, -51792, -28051, -50658, -80659, -14754, 187019, 218940, 89079, 156794, 173747, -51024, 250650, -179781, -18658, -56246, -70551, -203832, 34199, 25740, -107441, -18098, 156684, 40850, 5599, -12606, -24775, 168527, -127676, -125733, -8373, -337584, -46523, 350294, -86547, 28474, -20010, -129626, -110895, 177829, -299308, -169401, -222063, -305413, -96379, -104794, 210597, 317684, 107958, -20060, 162369, 132709, 61816, -420085, 13639, -94853, 5628, -162326, -39464, 62399, -71872, -139971, -76746, 56223, -370517, -123514, -156429, 225464, -204892, -147927, -147782, -140223, -131867, -190501, 293106, -94770, -122638, -65604, -234650, -43687, -415714, 69911, -24197, 86039, -86795, -51138, 96224, -322631, 256455, -44530, 68710, 362286]
18535C62286c4134k92133G442e6411C20579A39634J24569a2604j30818J0196r6175
18524b29401J12626j376l57720K09195d233B32234D434Q5670c37211e68j05541
18513a06109I3620b30766A6088P2762c1074c490j16547I3949b45732n6982A74060
18501C58201b42332E9824J116a66753e5669D9446a44517K0477H2940e26356a50233
18489f3856B70476a80476B3071a81251B33587p6180a11042d8092j53443A30930
18478h3902B07602g8569m23495a43418A13287E2717O1409J19570G1333b32364
18467d0096G3587A6716a32120k93463J87665l0118a9161C61686d767A59958h8246
18455a08513E5760b48977D8176h4821A9068J91845b4497r4048d4634k9626L1431
$$ y = [362286, -34134, -326267, 7442, -56411, 320579, 139634, 264203, -12604, -143422, -133226, -229401, -116775, -118151, -475871, -266676, -4233, 232234, 4434, 90104, -337211, -568, -106109, 93620, -230766, 16088, 88850, -31074, -3490, -120037, 93949, -245732, -302714, 174060, 358201, -242332, 59824, 60940, -166753, -55669, 49446, -144517, -124040, 82940, -526356, -150233, -63856, 270476, -180476, 23071, -181251, 233587, 157407, -111042, -48092, -201535, 130930, -83902, 207602, -78569, -502064, -143418, 113287, 52717, 114126, 233696, 71333, -232364, -40096, 73587, 16716, -132120, -425583, -237918, -268036, -19161, 361686, -4767, 159958, -88246, -108513, 55760, -248977, 48176, -84821, 19068, 210913, -24497, -118545, -44634, -74260, -42829]
18444d2829B42554p3703c58658d9681l70710J85718g3984j94648r730f012l81850
18433c87862a45344I5222b16308H2555h3061j3353L7177k48393M6374B42310A09443
18421i365A18870J6258b71417L2900A96883q3635K5488b58882d1858E96461f4629
18409a6808A42569b71806N5641d2164b363I1650c8314B19824E1050B2362d3187
18397B58046b4807D54383A02803D6403e1035k79397a19952H1779L1952J35155
18387B48886d0205n2083A40199n6778J29564a48544A39313C6613a91309j71472
18377c62781c4700j21208d1610q5633C69803b08403A19670K8805o7408c38918
18366G5819l2843a58565L0031N243A62648L2315c06682D7903K00022j17963a07197
$$ y = [-42829, 242554, 168851, -358658, -49681, -420391, -234673, -73984, -268632, -278362, -6012, -387862, -145344, 95222, -216308, 82555, -83061, -96414, -59237, -307630, -261256, 242310, 109443, -9365, 118870, 135128, -271417, -238517, 196883, 113248, 138736, -258882, -41858, 596461, -64629, -16808, 142569, -271806, -216165, -42164, -2363, 91650, -38314, 219824, 51050, 22362, -43187, 258046, -24807, 454383, 102803, 46403, -51035, -330432, -119952, 81779, 113731, 248886, -40205, -92288, 140199, 83421, 212985, -148544, 139313, 36613, -191309, -362781, -34700, -155908, -41610, -127243, 369803, -208403, 119670, 148475, 81067, -338918, 75819, 42976, -158565, -128534, -123291, 162648, 194963, -306682, 47903, 247925, 129962, -107197]
18354C1289P173a85018N3330L7029D2115b41339F3851J37802c93801A8297g5566
18342c21407C99375f8394A00746a08082l12879I4890b19219G2697d4365I9021
18331a28652e0893A545K09810M315p3186b45370F1117g277E2124J1275M6444a4650
18318e08k93253J43474a7949o0282n8606A13425k555e0079A83130f3021A93673
18306d52483f1793B80644B3230d44600J39441A7072J42422G2502i1852B3477a27708
18294a24058k67774J86177C3855c6417F0505a54197H6407a63620C19787b39569
18283a52608C22920g0345j10538O1465k05833a05185j88679A09227O2783m4738
18273A27272K6070J2999h2395m6233E3692e0240A11198a41510k1894a0287r6476
$$ y = [31289, 38462, -185018, -131688, -94659, 42115, -241339, 63851, 201653, -393801, 18297, -75566, -321407, 399375, -68394, 100746, -108082, -420961, 94890, -219219, 72697, -44365, 99021, -128652, -50893, 1545, 211355, 215670, 142484, -245370, 61117, -7277, 52124, 63399, 109843, -14650, -508, -293761, -150287, -17949, -78231, -136837, 113425, 110870, -50079, 183130, -63021, 193673, -452483, -61793, 280644, 23230, -444600, -305159, 17072, 159494, 72502, -91852, 23477, -127708, -124058, -391832, -205655, 33855, -36417, 60505, -154197, 86407, -163620, 319787, -239569, -152608, 322920, -70345, -180883, -119418, -325251, -105185, -293864, 109227, 172010, 127272, 153342, 166341, -82395, -128628, 53692, -50240, 111198, -141510, -163404, -10287, -106763]
18262a06763J3523j55658K8594C5205h4193c8208H4861f372m3084E8242b48215
18250C11865q3717J43661a0488C03602A0080K8553M9478b21542R8484l16025i7484
18238h3402J9805j16127A9364c47134B88942f5923D1627P9153J4627b4107l41745
18227c65852j04132D4349b79883b9725B51836J11573a8652A81473a0728j46688
18217a57416k80944A02380K1788h8279I2085b57550d3084E6450a96753c1143l01839
18206c32982a29096H22K19628c4845j658j02667A6886b43377B70628F5064b00685
18194A11137C6458K19865P1120a18428j27451c054r5364C4444b68041J10405j38319
18183b95955C430a80749p7926G1343M9248b19292E1257a45756A10097a75615j38488
$$ y = [-106763, -93240, -248898, -220304, 35205, -84193, -38208, 84861, -6372, -49456, 58242, -248215, 311865, 228148, 371809, -10488, 303602, 10080, 38633, 88111, -221542, -123058, -439083, -97484, -83402, -63597, -179724, 19364, -347134, 288942, -65923, 41627, 120780, 135407, -24107, -365852, -469984, 44349, -279883, -29725, 251836, 363409, -18652, 181473, -10728, -157416, -438360, 102380, 124168, -88279, 92085, -257550, -43084, 56450, -196753, -31143, -332982, -129096, 822, 220450, -34845, -36503, -139170, 16886, -243377, 270628, 65064, -200685, 111137, 36458, 256323, 327443, -118428, -245879, -3054, -98418, 34444, -268041, -157636, -295955, 3430, -180749, -258675, 71343, 120591, -219292, 51257, -145756, 110097, -175615, -314103]
18172c14103h6720J6069n2224M7697C1675d7509m4666H6911M090R5604J28274
18161C14879a32483k85592B04499b87616a20432J4511o9990B21455b35745A12452
18150F8838L34002B6302c50862B50370K004a15177H5076c53423h9932l5710L0677
18139i4965H2445a09368C5917f5466m6634K1228q9082a1583k38501h7812B39561
18127d7007J4463D0271m768a97119i8216b1830H1074a35545b0371G6635b19807
18115a55895A02068D8160c0672B4574j2216Q3947a69829N2161A06776K43071A45289
18103e8933b6599I1588b9151k8216k1158B8231K04769a07521B80639r9636l5233
18092A45770J53012C181a83441k67637b492q2946p7148A22704i2610A21253a74628
$$ y = [-314103, -86720, -70651, -122875, -75178, 31675, -47509, -92175, 86911, 91001, 186605, 314879, -132483, -418075, 204499, -287616, -120432, -105921, -175911, 221455, -235745, 112452, 68838, 402840, 26302, -350862, 250370, 252374, -115177, 85076, -353423, -89932, -125642, -94965, 82445, -109368, 35917, -65466, -112100, -90872, -179954, -11583, -250084, -87812, 239561, -47007, -32544, 40271, 35503, -197119, -98216, -21830, 81074, -135545, -20371, 76635, -219807, -155895, 102068, 48160, -30672, 24574, 12358, 96305, -169829, -117668, 106776, 349847, 145289, -58933, -26599, 91588, -29151, -57367, -78525, 28231, 233000, -107521, 280639, 181003, 145770, 298782, 3181, -183441, -451078, -2492, -85438, -162586, 122704, -92610, 121253, -174628]
18080A00576a16989k2236B5350i4086k8036r8854E7586K17776f9118H1421d4333
18068A04848k4666i4210q8300o4053l0547J31907P2169p8430F8634K02074a79897
18056i6088A11598h4136J5651H2486a66542H826K58090M6262a16073C550R0934
18045I4484C4155b12169E5757g4074B53492J9060f3085p8897B12971b20099F1921
18033B99778H159b52485G726b00917A20358a94120F450J45758h6891A65666a0767
18021B60791H5591g8358J3735G1191b11186R7890j25682a06743A41113a46626
18010A10032b11052c4483C93603D6641h4402B20431b04226C8197b99235H6811
17999a65541o1582d4143F0194P3758A0849e8732B5630e8584n21954b50935o4956
$$ y = [100576, -116989, -139225, 25350, -94086, -122122, -220976, 57586, 275362, -69118, 81421, -44333, 104848, 80182, -94210, -182510, -246563, -277110, -145203, -73034, -151464, 68634, 270708, -179897, -96088, 111598, -84136, -68485, 82486, -166542, 8826, 266916, 313178, -116073, 3550, 94484, 34155, -212169, 55757, -74074, 253492, 272552, -63085, -141982, 212971, -220099, 61921, 299778, 8159, -252485, 7726, -200917, 120358, -194120, 6450, 152208, -86891, 165666, -10767, 260791, 85591, -78358, -64623, 71191, -211186, -113296, -238978, -106743, 141113, -146626, 110032, -211052, -34483, 393603, 46641, -84402, 220431, -204226, 38197, -299235, 86811, -165541, -227123, -44143, 60194, 133952, 10849, -58732, 25630, -58584, -580538, -250935, -315891]
17988c15891N5259K2395n9313K8412A994b22017F0898a28934D3194J20544G2644
17976D1013a439j70522j5462A08712J06223b25502A43987a06357o1109A76304
17965F5868c01549P7345N4427A4013b59265P2014f9624j21970M7519j9396j1582
17954a75053A86810d3274l3146j91810A82758a71569j5206c4903D1808a20181
17943g4745j0952B2754a03430I27L1487f5747m4600E0544e696A57910J720j9465
17931A40165b61294A3898a20264n3564A77228p9752D4455K29115b0713A07339
17920a06935I3165c18189B61029a11017j59344a06365e916A2782P9162a12124
17909c494A30423d5970l1860k6911D7041c52427b6024A2908K8932J74431N9871
$$ y = [-315891, -260632, -238237, -297550, -269138, 1994, -222017, 60898, -128934, 43194, 163738, 72644, 41013, -1439, -171961, -187423, 108712, 214935, -225502, 143987, -106357, -167466, 176304, 65868, -301549, -224204, -169777, 14013, -259265, -187251, -69624, -191594, -144075, -163471, -175053, 186810, -43274, -76420, -268230, 182758, -171569, -186775, -34903, 41808, -120181, -74745, -85697, 22754, -103430, 927, 32414, -65747, -110347, 50544, -5696, 157910, 159630, 140165, -261294, 13898, -120264, -173828, 177228, 97476, 44455, 273570, -20713, 107339, -106935, 93165, -318189, 261029, -111017, -270361, -106365, -5916, 12782, 91944, -112124, -3494, 130423, -45970, -77830, -104741, 47041, -352427, -26024, 12908, 41840, 216271, 276142]
17898B76142a74141B20877a7179q1213M2690C6566J4211b94608D25944f1840B13462
17886A56975D7358a9181k505E734b37534q080A36130a64272D382K86234q8129
17875B02487H0356a95690A7549a29375k2896D9611J27678b16239Q6516a2275A04580
17863A35928a2322j11143n4891j40582G8379a06138D3032R8212P1060b7616H6585
17851d3016l1692B49376e0779B6035a25738b9734m6640j15325C74679r4707B6012
17839B34123I7867d0775A0805J83417E1928R1109J2782a83718A27129M643O7677
17828A99449b92434A16287a18704M4394B35915G0119a69083C25756G3082O7091
17818A40173a28968B28177b2564A44888a089C70457a37889A89449b00285A10309
$$ y = [276142, -174141, 220877, -17179, -98392, -55702, 36566, 50777, -294608, 425944, -61840, 213462, 156975, 47358, -19181, -21686, 5734, -237534, -245614, 136130, -164272, 4382, 290616, 202487, 80356, -195690, 17549, -129375, -152271, 49611, 177289, -216239, -129723, -12275, 104580, 135928, -12322, -123465, -178356, -318938, 78379, -106138, 43032, 141244, 212304, -27616, 86585, -43016, -74708, 249376, -50779, 26035, -125738, -29734, -76374, -191699, 374679, 279972, 26012, 234123, 97867, -40775, 10805, 194222, 51928, 143037, 155819, -183718, 127129, 131772, 199449, -292434, 116287, -118704, -74310, 235915, 70119, -169083, 325756, 73082, 140173, -128968, 228177, -22564, 144888, -1089, 370457, -137889, 189449, -200285, 110309]
17807I8006l9973a4245q7792A37033J23308c82437J01745a27890B8J65319a63075
17795E5740J94409c8446B50152a82051n6250g4764F1323J53052C8885b90080I7684
17783a32650F5936R4274h5538C2426K8582a05368j38389K5630f0827j52454g3667
17771f8159F8187a18728k19995A80864a95543d7931q38j00010A91247J44996a09494
17759a48573A0210a13954M1370c4096j54170h6907B19394I5707O2390n2177e6500
17747a49318l400O8089L5763k9916B48498J64844h2842l1101B54535B3991L0777
17736E4768a31133j24111a2883F4130J6802J5707a68771a8217o7357l05005G185
17724a23301C16464g532B55258a19683H8725j3939a60204k36461A19308A9549
$$ y = [98006, 58033, -14245, -102037, 137033, 260341, -382437, -280692, -127890, 28, 165347, -163075, 55740, 250149, -38446, 250152, -182051, -238301, -74764, 61323, 214375, 38885, -290080, 97684, -132650, 65936, 160210, -85538, 32426, 61008, -105368, -243757, -218127, -60827, -213281, -73667, -68159, 68187, -118728, -338723, 180864, -195543, -47931, -48769, -148779, 191247, 336243, -109494, -148573, 10210, -113954, -72584, -34096, -188266, -86907, 219394, 95707, 158097, 105920, -56500, -149318, -152718, -84629, -48866, -78782, 248498, 413342, -82842, -113943, 254535, 23991, 54768, -131133, -255244, -12883, 64130, 80932, 96639, -168771, -18217, -85574, -390579, 7185, -123301, 316464, -7532, 255258, -119683, 88725, 74786, -160204, -396665, 119308, 19549]
17713A9308Q3240b37709B30640a11144G2334K44141j57237C1948L5714R3392a47103
17701B33490h51l70171E8211a58726B70944B1642N8214a07948l42869A68819b90866
17689g7091I1223J56840b69597A68105d8584l04780B10274n0822B2948R6046g1054
17677A27942B5494K39539e1904B16603m9843k4274a09591D3794a69213I4459O0007
17666A54466b04462C59445D1160a32256A73384L2040j7056G0332L5579D3348N8351
17655A01699K7901F0917b5909A86098A349J88245B1431a77512C5224c91912H767
17643A85536a80357j64550a66488A09827l011j9849b9988J194j76769B53799h0807
17631e7414r24o4320a3139m48412A4695K35335A7681c1814j9306A20497n9452
$$ y = [19308, 102548, -237709, 230640, -111144, 72334, 316475, 159238, 31948, 67662, 161054, -147103, 233490, -851, -371022, 58211, -158726, 270944, 21642, 79856, -107948, -450817, 168819, -290866, -77091, 91223, 248063, -269597, 168105, -48584, -353364, 210274, 159452, 22948, 118994, -71054, 127942, 25494, 265033, -51904, 216603, 166760, 142486, -109591, 43794, -169213, 94459, 154466, -204462, 359445, 41160, -132256, 173384, 205424, 188368, 70332, 105911, 43348, 101699, 129600, 60917, -25909, 186098, 1349, 189594, 21431, -177512, 35224, -391912, 8767, 185536, -180357, -344907, -166488, 109827, 106816, 86967, -29988, -28794, -205563, 253799, -80807, -57414, -58338, -122658, -13139, -461551, 14695, 250030, 17681, -31814, -51120, 120497, 61045]
17620F1045J38862I3850K32576c75192a22448l5029b4024m4882a1935A78019i7205
17608b08726B24966q4379K10171C4574K39430i5715G0313K4663l2841f6533k4881
17597i1414B82054Q9653a77827A30499a38329d0977j46425A60835N3009a49518
17586b24773B42942c5986D12281a7694C33242G1171h1666m8050A9482a36272F2611
17574A11951M6815o4216c81643e5697B2069J38551r644a20851B32880g8094b817
17562A81139p3769a27569e5737A81536B9564J99022j05962b9414A1003J63688
17552A74691a12847D6329A8633M403g5172A3065R3391a09285j37101C1412A2695
17540A42925O9606C3212J59530H947K73143f4723p402A25112J38255D2165J73842
$$ y = [61045, 199907, 93850, 326426, -375192, -122448, -157477, -24024, -68906, -11935, 178019, -97205, -208726, 224966, 140587, 350758, 34574, 274004, -95715, 70313, 94976, 62135, -66533, -91414, 282054, 371707, -177827, 130499, -138329, -40977, -187402, 160835, 213844, -149518, -224773, 242942, -35986, 412281, -17694, 333242, 71171, -81666, -129716, 19482, -136272, 62611, 111951, 158766, 94550, -381643, -55697, 22069, 160620, 150976, -120851, 232880, -78094, -2817, 181139, 107370, -127569, -55737, 181536, 29564, 228586, 122624, -29414, 11003, 174691, -112847, 46329, 18633, 23036, -75172, 13065, 106456, -109285, -246386, 31412, 12695, 142925, 212531, 33212, 192742, 8947, 282090, -64723, -72125, 125112, 263367, 42165, 216007]
17529B16007G3395j3040a79576d0437B48719j21830J16467b18476B37863d24041
17518c83071C01009a28690p2789A61767J23406B9623a34731m8100m3082d6946
17507B87648B7809b37129a4576j24807A03437a82908P3075N2243D85586A42302
17496A74074A0146Q6965j7068a8874I6455J42297n606j04368L3619p8183i3414
17484C9747a1705D93128A29652j2689K09090A09500O1992a49212B83393A06366
17473f6654H6641f7976o2260M4841b9541j32572C84535A24947l383e5830E5807
17461C08177N7928A53107g4695H9775a6160A64563b63096B09469b86625F6970
17450A96861a6919A50392o1934L28554B00920R4534A26610a43937H5349N49791
$$ y = [216007, 73395, 60355, -179576, -40437, 248719, 126889, 243356, -218476, 237863, -424041, -383071, 301009, -128690, -201479, 161767, 285173, 29623, -134731, -182831, -225913, -46946, 287648, 27809, -237129, -14576, -139383, 103437, -182908, -109833, -57590, 485586, 142302, 174074, 10146, 97111, 80043, -18874, 96455, 238752, 233146, 128778, 162397, 84214, -93414, 39747, -11705, 493128, 129652, 116963, 326053, 109500, 171492, -149212, 283393, 106366, -66654, 86641, -67976, -130236, -85395, -29541, -162113, 384535, 124947, 121564, -55830, 55807, 308177, 366105, 153107, -74695, 89775, -16160, 164563, -263096, 209469, -286625, 66970, 196861, -16919, 150392, 88458, 417012, 200920, 295454, 126610, -143937, 85349, 635140]
17440F35140A86900M0792p992o0756J92058J3778B7616K40619K36969B06613J07792
17429C14405j32713k5437h1978D08733J06518m3240A55633P1332d5465F4947P9517
17418A44464K36593g7425J8475B6547K58542J92898C6880Q3395K09022K3596m7136
17407C05757J88243A7660L02118n0576E4408M10779A01140J14945c2617B34554
17396D08209A82577q9404J87364b48636i4179D04882A40087f4880K2878D69294
17385h8398J028A59974K55791r5217L2056A08347q581L02717A80103J43944j15698
17374B08349G8349K01731d292B90694b02595A86165K8011r5702J5384a9098K969
17363a6129q1786K0349C22007I1890a90847C59740A12552A7140R3348n4233J78230
$$ y = [635140, 186900, 227692, 219700, 158944, 351002, 364780, 27616, 268235, 505204, 206613, 314405, 181692, 156255, -81978, 408733, 515251, 472011, 155633, 226965, -45465, 64947, 144464, 381057, -77425, -58950, 26547, 285089, 477987, 36880, 120275, 329297, 352893, 305757, 494000, 17660, 319778, 269202, 54408, 465187, 101140, 216085, -32617, 234554, 408209, 182577, 93173, 280537, -248636, -94179, 404882, 140087, -64880, -42002, 469294, -88398, -87370, 159974, 415765, 320548, 352604, 108347, 99766, 402483, 180103, 324047, 208349, 78349, 280080, -4292, 290694, -202595, 186165, 214176, 118474, 133858, -19098, -16129, -97915, -77566, 322007, 91890, -190847, 359740, 112552, 17140, 110488, 56255, 234485]
17352B34485I8745J77925l097G4359O3015K47360c341A06232m7874L5421L23901
17341D17680A6990a01466A98760b5965k65365D20091a2548C0549K98886m1951
17331B87484a42083C01030j40227d0794C6939L01637f6466j2056B92309m5743
17321B46566E8503h2137B11825J50690j71415c0276C58496j29858f8645B70661
17310B11282b30556A27688a71176D7745K39735e9539F5414J47346C4638L535B488
17298A48605O8978j1445B6703l319J48923n5583j2397J0620i24A3118L05525A43147
17285a31354A2300e3899C37773a35799B70116C2411L7150c9695r722H5070K6479
17274A11549J24335e1307D0552K54675b15265D6983c4581E9713Q0154K34681a05344
$$ y = [234485, 98745, 276670, 273573, 74359, 137374, 384734, -3341, 106232, 58358, 93779, 417680, 16990, -101466, 198760, -25965, -291330, 420091, -12548, 30549, 329435, 287484, -142083, 301030, 160803, -40794, 36939, 338576, -66466, -78522, 292309, 246566, 58503, -82137, 211825, 362515, 191100, -30276, 358496, 228638, -68645, 270661, 211282, -230556, 127688, -171176, 47745, 287480, -59539, 65414, 212760, 34638, 38173, 2488, 148605, 217583, 206138, 26703, 23384, 172307, 116724, 104327, 114947, -924, 13118, 318643, 143147, -131354, 12300, -53899, 337773, -135799, 270116, 32411, 69561, -39695, -49417, 85070, 111549, 235884, -51307, 40552, 295227, -215265, 46983, -34581, 59713, 139867, 374548, -105344]
17262B52023M9210j015o5684D7891K914a09304B26293l7303n5940J85540J244
17251C19834q2783k968l6364B9237a42026A64319i2335C38855r7214J14176a64266
17239b18990A82123p0384J04069P9602m0421q1843l0736A6540F559K28054C1070
17227A79156A2960J55489M3964a19481B14044J2261k263a57988C77915j29645
17217B48270B5464b8409C9824J09716K63392I2215Q1325A3102L37202A08423L6073
17206A44496l1419J99139L577i623C12342a9612C47176A50902F6316K3240K12445
17195C02001J12109G0758L42918j8603a44525p174B49829C2338L32434o6116Q87
17184B99543J95050B9227K0086L72760N4140m1683q6491p5522A34652J09739K2592
$$ y = [252023, 301233, 300218, 234534, 47891, 50805, -109304, 226293, 188990, 133050, 318590, 319834, 237051, 234083, 197719, 29237, -142026, 164319, -92335, 338855, 241641, 355817, -164266, -218990, 182123, 111739, 215808, 295410, 254989, 173146, 142410, 16540, 6559, 234613, 31070, 179156, 12960, 168449, 212413, -119481, 214044, 226305, 224042, -157988, 377915, 248270, 25464, -28409, 39824, 149540, 412932, 92215, 173540, 13102, 350304, 108423, 144496, 113077, 312216, 315793, -9623, 312342, -19612, 347176, 150902, 66316, 89556, 302001, 414110, 70758, 413676, 395073, -144525, -151699, 249829, 32338, 364772, 298656, 299543, 494593, 29227, 49313, 422073, 476213, 434530, 348039, 272517, 134652, 244391, 266983]
17173B66983K34980F9157P4106L03179A27756J98340L6712A78509K89818F8238
17162B78170a54965C88075j80677P6856H7219J14237J62891r95J39442A75169
17151C05667J13621A21279P8290F8117J31942J28453K84573B10575r8843M30694
17141E42426E5906J17582L29582p077d0462n2405B73606B0320N43695a53161C03162
17129B76352K4356H858L61034l3236l9253r9302k6893K33711A84945P9297M12587
17118F76829k91312J46609r8371A26230J49671j17990O2612l4508K37147J65846
17108E89008k37148G9260L16297A55244L7875R5297A30720b93160D73637p8178
17098C95459R1208j63981G5949L13896m2943A23658L16534I8907J00839K37354
$$ y = [266983, 501963, 69157, 143263, 446442, 127756, 326096, 362808, 178509, 468327, 68238, 278170, -154965, 388075, 207398, 284254, 87219, 201456, 364347, 363352, 502794, 175169, 305667, 419288, 121279, 199569, 68117, 200059, 328512, 613085, 210575, 111732, 542426, 55906, 173488, 503070, 495993, -40462, -92867, 273606, 20320, 564015, -153161, 303162, 276352, 300708, 8858, 369892, 336656, 297403, 198101, 171208, 404919, 184945, 264242, 676829, 385517, 532126, 433755, 126230, 275901, 157911, 220523, 186015, 423162, 589008, 351860, 79260, 395557, 155244, 193119, 288416, 130720, -293160, 473637, 395459, 486667, 322686, 75949, 389845, 346902, 123658, 440192, 98907, 199746, 437100]
17088D37100M4531j68067j09349R1776A12833L42682A90679L05106j65966K95403
17078F25222L9349g988C61966j60972c2060C75824k6491J00368q6349J47517k03318
17067C07551N4597j36419K67946L69M215A49660n5019M07475o9069j84075N34270
17056G83242l36183J66308B40696l6268O01436C94433p3648J33309k26313H1174
17045E25122j09707F8663M80577m7549j22029J49824j79343L82774C32188N9324
17035C91512L15118j76988j31204K62835j48577J44343B58107K00855J8521j9279
17025D58204J87458A79159L43617K0318l8053j48699K4452J870K63146p7016J60584
17014G29378k40380m4971J73952R5977C39081L27049K825P8252m1549k3916q0942
$$ y = [437100, 481631, 313564, 204215, 295991, 112833, 455515, 190679, 495785, 329819, 625222, 664571, -7988, 361966, 200994, -32060, 375824, 349333, 449701, 363352, 510869, 307551, 362148, 225729, 493675, 494044, 498259, 149660, 94641, 502116, 433047, 248972, 783242, 447059, 613367, 240696, 204428, 805864, 394433, 320785, 454094, 227781, 81174, 525122, 415415, 68663, 549240, 501691, 379662, 529486, 350143, 732917, 332188, 391512, 706630, 529642, 398438, 661273, 512696, 657039, 258107, 458962, 477483, 458204, 645662, 179159, 522776, 543094, 505041, 356342, 380794, 382664, 645810, 568794, 729378, 488998, 444027, 617979, 713956, 339081, 666130, 668955, 747207, 705658, 681742, 600800]
17003F00800q4515L25227B35548M37259m2379J2158J27119j02709P0219J2046
16993G49261F0139M15784J46750k02935R4373J23694J94901l56072K47961J01473
16983H26068D09244J11795L2090J23171M0161r8009k03812K34342j07181J31440
16973F73241j04505j45747O86683E02233N56994l07930M8395l61981L79705j54514
16963F62902J18494j47137j50531L21850l56397L28579j295J59713J02979j17924
16953I21233k28181o441L52739j47988l37998J71928q7674J30481l61239K72706
16943F79566L30972j16356k46516J03335J56671J97180L7012j26090k66709L23516
16933A072581J12778l05287R4632L59183j71029k56280p2631p9733N07247j50674
$$ y = [600800, 516285, 841512, 235548, 672807, 630428, 642586, 769705, 666996, 737215, 749261, 60139, 475923, 622673, 419738, 514111, 637805, 832706, 476634, 724595, 826068, 409244, 521039, 553129, 676300, 716461, 618452, 414640, 648982, 541801, 673241, 568736, 422989, 1109672, 502233, 1059227, 751297, 799692, 437711, 817416, 662902, 781396, 634259, 483728, 805578, 449181, 777760, 776465, 936178, 1039157, 921233, 693052, 686611, 1039350, 891362, 553364, 725292, 637618, 768099, 406860, 679566, 1010538, 894182, 647666, 751001, 907672, 1104852, 1141864, 1015774, 749065, 1072581, 1185359, 880072, 974704, 1333887, 1162858, 906578, 833947, 754214, 1261461, 1110787]
16923A110787j59242J07830l22620M84617j41077K06925l74476K60068K00180
16914A372992n62223K06190L97851j63337j45087L48966k46484N8097j61966L19316
16904A424315k375l27849L73374J5447n1180J29083j28058n1320M60721p28473
16894A113685L14009q8073J02791J6472k23831K34186n1767j22971M67892j06375
16884A656018J08686l69578N0021J86186J26443L14693l40794o7225J3321K42521
16874A920292J35863k48417l88163K68131R4864m7059J61877l30970K60941q307
16864A819052K02427k43807M65879m92884O4166K09890J09235j95503L23356j1013
16854B250798j31694L32935O681k45231k0810J48461j28214j09043N42233K29725
$$ y = [1110787, 951545, 1059375, 736755, 1221372, 1080295, 1287220, 912744, 1172812, 1372992, 810769, 1016959, 1414810, 1251473, 1106386, 1455352, 1208868, 1266965, 1104999, 1424315, 1421940, 1094091, 1467465, 1482912, 1431732, 1560815, 1432757, 1381437, 1842158, 1113685, 1427694, 1339621, 1442412, 1458884, 1235053, 1469239, 1417472, 1294501, 1762393, 1656018, 1764704, 1395126, 1445147, 1631333, 1757776, 2072469, 1731675, 1664450, 1677771, 1920292, 2056155, 1807738, 1419575, 1687706, 1782570, 1735511, 1897388, 1566418, 1827359, 1819052, 2021479, 1777672, 2243551, 1750667, 1814833, 2024723, 2133958, 1938455, 2261811, 2250798, 2119104, 2452039, 2458720, 2213489, 2192679, 2341140, 2212926, 2103883, 2646116, 2875841]
16844B875841K093l68888K59135Q3109j86425M5367J8206L72423M1126K160o0421
16833C083726K1991R009L08541m04499K79240L1862L00681j4856k47254J50524
16823C518965m0740M3980J66025k51667L73933j67973J11349J85968K51223q1426
16813D109637K55079j91302M88721k83746o1226M17174k9769p4081q9387L45756
16803D886856K37767k71421L65486K96042p9920J15036k5820M66298K23869l55786
16793E858407K94787J13388p8089K64001K46144K05372M12008L2820J71702K68394
16783G788934J33197J98069k23157M21525K27492M49524k13909M59184k59206
16774H981653Q21129j01462M18986K41417L94914J61642M52854L06191M63702
$$ y = [2875841, 2877934, 2509046, 2768181, 2851290, 2664865, 2710232, 2728438, 3100861, 3141987, 3144147, 3083726, 3105717, 3114726, 3423267, 3018768, 3298008, 3329870, 3630551, 3615695, 3368441, 3518965, 3478225, 3522205, 3688230, 3436563, 3810496, 3642523, 3753872, 3939840, 4191063, 4109637, 4364716, 4173414, 4662135, 4378389, 4317163, 4734337, 4704568, 4630487, 4541100, 4886856, 5124623, 4853202, 5218688, 5514730, 5434810, 5549846, 5524026, 5990324, 6214193, 5858407, 6153194, 6266582, 6188493, 6452494, 6698638, 6904010, 7316018, 7348838, 7520540, 7788934, 7922131, 8120200, 7897043, 8318568, 8546060, 8995584, 8781675, 9240859, 8981653, 9802782, 9701320, 10120306, 10361723, 10756637, 10918279, 11371133, 11677324, 12141026]
16765A2141026M93214K72352N10559N36567J58738O10444p9728Q24762Q11840
16756A6279774L15694N44972M62067O43561R38688N11011P45700O21837P29365
16747B1792669J130531O77327R64251J296010P69388J337181J267952J146201
16739C0381510J417155J442294J735569J611169J798029J510565K290932K236730
16731D4423953K307774K584304K398460K680970L153716L600546L296699L663749
16723F8110171M197989M355460M695236N305589N186226O202477N648405O698945
16715A10400498O814614P319739P161073P966126P344754P898251P841717P164443
16707A69911215O971417O240108N557371M963955K799637K675371P81055k76220
$$ y = [12141026, 12634240, 12906592, 13417151, 13953718, 14112456, 14722900, 14643172, 15467934, 16279774, 16595468, 17140440, 17602507, 18246068, 19184756, 19695767, 20441467, 21063304, 21792669, 22923200, 23600527, 24564778, 25860788, 26630176, 27967357, 29235309, 30381510, 31798665, 33240959, 34976528, 36587697, 38385726, 39896291, 42187223, 44423953, 46731727, 49316031, 51714491, 54395461, 57549177, 61149723, 64446422, 68110171, 72308160, 76663620, 81358856, 86664445, 91850671, 98053148, 103701553, 110400498, 117215112, 124534851, 131695924, 139662050, 147006804, 154905055, 162746772, 169911215, 176882632, 183122740, 188680111, 193644066, 196443703, 199119074, 199900129, 199623909]
16699A99623909k218606l307539m190825n668127o104253o867990p293684p553209
16691A56419676p749321p839872p730696p145952p403132o707954o632969o211235
16683I8998545n839415n605507n420134m806591m446698m642205l495664l846480
16675F0895851l670097l201265k640419l229979k605261k302985k311086k094377
16667C8840382j904439j893886j456107j749676j325393j548172j447391q41756
16659B6673562j459689j132848p16627j239662r19261k80223j178976p97812j71950
16650A8776514j028517q00324m56884o52735n67896q88570m57809r8330n76841
16641A3248608p14521j23255n23887j32993o88477l88171K48300l25303l85733
$$ y = [199623909, 197405303, 194097764, 189906939, 184238812, 178134559, 171266569, 163972885, 156419676, 148670355, 140830483, 133099787, 125953835, 118550703, 111842749, 105209780, 98998545, 93159130, 87553623, 82133489, 77326898, 72880200, 68237995, 64742331, 60895851, 57225754, 54024489, 51384070, 48154091, 45548830, 43245845, 40934759, 38840382, 36935943, 35042057, 33585950, 31836274, 30510881, 28962709, 27515318, 26673562, 25213873, 24081025, 23364398, 22124736, 21205475, 20925252, 19746276, 18948464, 18776514, 17747997, 16947673, 16490789, 15838054, 15270158, 14381588, 13923779, 13825449, 13248608, 12534087, 12410832, 11886945, 11753952, 11065475, 10677304, 10925604, 10600301, 10214568]
16632A0214568m16125j71720l30390k67796l81186k08781p3653l79108k93209
16623G692600k79900j36142j40437Q625j24173m49229j41979K31419l95575j94905
16613F070304q5146l08156J5125p7657N5503m57464L3023j30382l14276O0605
16603D861479k00282k20265J11994j78822K0715J88934l80206J47338m70733k0794
16593C859358k39287l4064K14210l01069J14638K7063j92054j94555R8808r2781
16583C260267Q9517l10677J94615k72593L71893j46801j55471j75631O598J03724
16573B965441j65246k86040j48753l2247J21796J42722N864K3787l20495o8033
16563B238796J38389K504Q5745j98661k21024L49607j39906k35548l6402J14121
$$ y = [10214568, 9798443, 9626723, 9296333, 9028537, 8647351, 8438570, 8364917, 7985809, 7692600, 7412700, 7276558, 7136121, 7144746, 7020573, 6571344, 6429365, 6660784, 6265209, 6070304, 5985158, 5677002, 5692127, 5614470, 5669973, 5212509, 5245532, 5115150, 4800874, 4861479, 4661197, 4440932, 4552926, 4374104, 4394819, 4583753, 4203547, 4350885, 3880152, 3859358, 3620071, 3586007, 3800217, 3499148, 3613786, 3640849, 3448795, 3254240, 3353048, 3260267, 3349784, 3039107, 3233722, 2961129, 3333022, 3186221, 3030750, 2855119, 2861717, 2965441, 2800195, 2514155, 2365402, 2333155, 2454951, 2597673, 2603537, 2627324, 2306829, 2238796, 2377185, 2379689, 2465434, 2266773, 2045749, 2395356, 2255450, 2019902, 1983500, 2097621]
16553B097621j60500O3352k86534n6565j33560L79269k9266m14974J54128J6243
16543A629214L17479l61942J40066j73594m50126N23776p1812p6548j1988j98592
16533A265933N70357n44711K58278l35798K13386L6088K08745p8668j64717P8620
16523A507513j64676j06556K23410m959j98075j87841O07501k94123j09947J79498
16513A451745k18681j63241K21358j34616j16108J05606J02620k28118l7624J21016
16503A103957K63774m08841L144k16741M71263p2759k12002N2311k7065o4768
16493H92273j12419J83871L7251p0865M1214j97368J06328j42526Q6935K16745
16483A041439j94506O571k93405M22710o8302D52765M62000J26532j47685L42279
$$ y = [2097621, 1937121, 2000473, 1713939, 1657374, 1523814, 1903083, 1873817, 1458843, 1612971, 1629214, 1946693, 1584751, 1724817, 1551223, 1101097, 1624873, 1553061, 1476513, 1464525, 1265933, 1836290, 1291579, 1549857, 1214059, 1427445, 1463533, 1672278, 1593610, 1428893, 1507513, 1342837, 1236281, 1459691, 1454732, 1256657, 1068816, 1676317, 1382194, 1272247, 1451745, 1233064, 1069823, 1291181, 1156565, 1040457, 1146063, 1248683, 1020565, 982941, 1103957, 1367731, 958890, 962034, 745293, 1216556, 1143797, 931795, 984106, 957041, 892273, 779854, 963725, 1000976, 930111, 971325, 773957, 880285, 737759, 824694, 1041439, 846933, 853504, 560099, 982809, 914507, 452765, 914765, 1041297, 893612, 1235891]
16473A235891k58740m73875J83778J34961K04699m36498j7926P3048o8877P8184
16463F54645M58483D95612M05955j90076j16588j00239Q7863k20565L51400j11045
16453F02317B72019N6539J10413j21786k2102O82351l39421p4491K03817j60103
16443F07236B31949N15963k63072o1829M4920J26262j81749j51074J52663K05091
16433F19124p5247J76821j17498j29229J38661j7349l2669K85617A74220K54302
16423D28522L29966B75668L71964k73781K16612K33989l52960Q4990j45215A55289
16412F74745k05222j21344J57877O0718k18497K8653o9098A39677L11656J28936
16402E80269j63102J54143m7881B19576Q8622j25169J55914L79774B54478M88133
$$ y = [1235891, 977151, 503276, 687054, 822015, 1026714, 590216, 572290, 645338, 576461, 654645, 1113128, 495612, 901567, 711491, 594903, 494664, 582527, 361962, 713362, 602317, 272019, 328558, 438971, 317185, 295083, 977434, 638013, 563522, 767339, 607236, 231949, 747912, 484840, 423011, 467931, 594193, 412444, 261370, 414033, 619124, 543877, 720698, 603200, 473971, 612632, 595283, 562614, 848231, 174220, 428522, 758488, 275668, 647632, 373851, 590463, 824452, 471492, 556482, 411267, 155289, 674745, 469523, 348179, 506056, 566774, 348277, 376930, 307832, 139677, 451333, 580269, 417167, 571310, 523429, 219576, 308198, 183029, 338943, 718717, 254478, 742611]
16392G42611j22820l01255J40485j31341n9337J01056E1162L57311K40785B25211
16381C08834j09752m7021L62337I9210M36581H4474M29543A19079M79228j50990
16371D47317m8965l8736J68186A32172K07232j50519o595m2467J75890L173K4912
16360C43798A48143K93776A90379K54287J41467H970N94032F8166K17092R5335
16350C80593A45471d9920D90776A05523h9392C71613j53319q1869E8896J25695
16340A84591K79842k31909J74467j30844P8580m6737K08546H9347i6415B57704
16329D62250A55180J57171L017j5979E2712J05143D5806J84758J65006k9138k9848
16318C36584J5202e4069A50045J69355A25466J05n3704K77125j60638J64366j34452
$$ y = [742611, 619791, 318536, 459021, 327680, 268343, 369399, 51162, 408473, 649258, 225211, 308834, 199082, 152061, 514398, 99210, 535791, 84474, 514017, 119079, 598307, 447317, 398352, 359616, 527802, 132172, 339404, 188885, 182290, 139823, 315713, 318886, 343798, 148143, 441919, 190379, 444666, 586133, 8970, 603002, 68166, 285258, 380593, 145471, -49920, 490776, 105523, -89392, 371613, 218294, 136425, 58896, 184591, 464433, 232524, 406991, 276147, 354727, 307990, 516536, 89347, -96415, 257704, 462250, 155180, 312351, 315368, 299389, 52712, 157855, 45806, 230564, 395570, 366432, 336584, 351786, -54069, 150045, 319400, 125466, 125571, 71867, 348992, 188354, 352720, 218268]
16307B18268A05783Q3096E0976K38898A44636L669o4288L13011a2406D00460J76917
16296E77377E8597K1865J99432j09594a57269C25603D8236L0154K01924j38412
16286A41902J88142L67664A33909L9335C4054J90653e3115C22486a03510A65375
16275A51629e8877A14307C2299J08845K01944g4592A68215o9781c9105A00995
16264B3665J35776o8397J75569F5422K9834a10252d8586I5917M7185e1647B15812
16252A15599f9808j05432A89188A3849b3083B60555r3187D5552a33582A10686
16241H7411a67045H476J74325H5072O8522a27042f0846A81252p6867k3160f1766
16229A28683d8435A16831j3206b99663e5921j84774A93645G4647a2956r2173B3664
$$ y = [218268, 105783, 188879, 50976, 289874, 144636, 148305, 84017, 397028, -12406, 400460, 577377, 58597, 80462, 279894, 170300, -157269, 325603, 48236, 78390, 280314, 141902, 330044, 697708, 133909, 173244, 34054, 224707, -53115, 322486, -103510, 165375, 151629, -58877, 114307, 32299, 141144, 343088, -74592, 168215, 98434, -39105, 100995, 23665, 159441, 91044, 266613, 65422, 95256, -110252, -48586, 95917, 143102, -51647, 215812, 115599, -69808, -175240, 189188, 13849, -23083, 260555, 167368, 45552, -133582, 110686, 87411, -167045, 8476, 182801, 85072, 153594, -127042, -60846, 181252, 104385, 81225, -61766, 128683, -48435, 116831, 103625, -299663, -55921, -240695, 193645, 74647, -12956, -105129, 23664]
16217B01400I6259B3935b28122A37823J41589E8955e1527r048l7442A4347P3096
16206H7443g2873C3267K31918H3114h0077C68275H1603l0444J52013J07842j32364
16195A78650d2961r3512C13755g2190C09362f8251A61238g9044C58910j73870
16185A85040f1979A64957c18862a51909B73620L1573d40873a68199B47632a9793
16174A28412O192f8086l5485m9010B5084K19442J71297m148A24599e8117m3900
16163a02017d383A50294a52786d4246A16424k9399a6236B05968c3237q8305H6130
16151E2002J6368M12688j83726a43836C94911A1324K04644d45353A55789j164
16141A54625p5621a27012j1764c6258J6198B11277E3879F386e09720C7610J19720
$$ y = [201400, 96259, 23935, -228122, 137823, 279412, 58955, -51527, -60575, -98017, 14347, 87443, -72873, 33267, 265185, 83114, -80077, 368275, 81603, 51159, 203172, 311014, 178650, -42961, -136473, 313755, -72190, 309362, -68251, 161238, -79044, 358910, 185040, -61979, 164957, -318862, -151909, 273620, 305193, -440873, -168199, 247632, -19793, 128412, 134604, -68086, -103571, -152581, 25084, 244526, 415823, 411675, 124599, -58117, -102017, -4383, 150294, -152786, -44246, 116424, 87025, -16236, 205968, -33237, -121542, 86130, 52002, 68370, 481058, 297332, -143836, 394911, 11324, 215968, -445353, 155789, 154625, 79004, -127012, -138776, -36258, -20060, 211277, 53879, 6386, -509720, 37610, 157330]
16130A57330k7423k0707J4253K39134i6230K6390A24866Q1476l100B9773a05406
16118I2826N8011l2444A7764a32000A89034C0728b14510d6339r3342C22520A2329
16106A93325J35071h9941E2889O2021a1301A17055f9872A89169a22004G7294a37905
16094A58215M8811D7387i872B14340e423r8733K0769A81339J33336j03615j2352
16083A98708E6608a0463D2213J01457K1354E8898P1458b92932J26932H3448g8435
16071a56250A05665C6536a66122J7348j59641b6230j03189F1337b1462k15572
16061b37034A35238h7383d667E9679a43767c6359C47780b91915g6549K0523A72815
16049B20553r4330i3573B71374H95J25895b89651a10310B45955r4932h8185A91550
$$ y = [157330, 129907, 109200, 123453, 362587, -96230, -69840, 124866, 206342, 203242, 29773, -105406, 92826, 150837, 118393, 17764, -132000, 189034, 30728, -214510, -46339, -139681, 322520, 12329, 193325, 328396, -89941, 52889, 114910, -11301, 117055, -69872, 189169, -122004, 77294, -137905, 158215, 207026, 47387, -9872, 214340, -5423, -104156, -83387, 181339, 314675, 211060, 198708, 56608, -10463, 42213, 143670, 165024, 58898, 130356, -292932, -166000, 83448, -78435, -156250, 105665, 36536, -166122, -148774, -308415, -26230, -129419, 61337, -21462, -237034, 135238, -87383, -4667, 59679, -143767, -36359, 347780, -291915, -76549, -56026, 172815, 220553, 126223, -93573, 271374, 895, 126790, -289651, -110310, 245955, 151023, -88185, 191550]
16037f9780n2621c8210a6736k33833B51113a35674k07372j19520a62623a9627
16026a97618m3366B56563d69181a39170k4550E8380a59602r1512I8128J1373a64634
16014A63924a2155D8763b5572B54975f5708G9988L5054c6115B6577b13382g446
16002c5668H5198d6331j38339E2157a06718j02567p7924B77485a22522q4389a785
15990a0240j3072A94326A0004a65648L0731H5687B9325J05166g5688A53048a98030
15978f071B32207a02413A39718b40787d0270n526G393K09365J8150b25173B50700
15966A12144K27932G0180j0245d0128k91648J55973B0226K29393g9368j6851o4069
15955a60288C33865K9326J98137A9684a58548L715o1594a01411B3997J9178i3890
$$ y = [-69780, -122401, -38210, -16736, -250569, 251113, -135674, -343046, -462566, -162623, -19627, -197618, -240984, 256563, -469181, -139170, -163720, 58380, -159602, -251114, 98128, 109501, -164634, 163924, -12155, 48763, -25572, 254975, -65708, 79988, 115042, -36115, 26577, -213382, -7446, -35668, 85198, -46331, -184670, 52157, -106718, -209285, -287209, 277485, -122522, -206911, -1785, -10240, -23312, 194326, 10004, -165648, -134917, 85687, 29325, 134491, -75688, 153048, -198030, -6071, 232207, -102413, 139718, -240787, -40270, -45796, 7393, 216758, 234908, -225173, 250700, 112144, 340076, 70180, 59935, -40128, -331776, -175803, 20226, 249619, -79368, -96219, -160288, 333865, 363191, 561328, 19684, -158548, -154833, -216427, -101411, 23997, 43175, -93890]
15943H2019l7920a06959D5609a77755N2204J6958o8645h5692j31514J06657G5883
15931c47715a6975k2741l5570A04819a37743A43000b0611F2461J8113b73668J17426
15920a56242R761c5746j21032m6244j01299a9536B9098f6492P296I182H03b87021
15907B48326b2309H1679R7146N4018a19623F9002a14119d6873j09624p740g8235
15895d3803r6173d2019l26012F2109N2197c19882k41834b07344a8490k03924e2761
15883a3985A77052p8449A7813b73213A759d2913j63325A30164b5465j36265P0902
15872i0828O100B51681b61433f9282B38199a30865C0414a38656k49185A11568
15861c38419L5220A0271e50281g8396o3729n4779I1936O5653F3583A0559b35047
$$ y = [82019, 44099, -106959, 45609, -177755, -125551, -108593, -177238, -85692, -217206, -110549, 75883, -347715, -16975, -39716, -75286, 104819, -137743, 143000, -20611, 62461, 80574, -273668, -156242, -146481, -35746, -156778, -203022, -304321, -19536, 29098, -66492, -59196, 9182, 803, -287021, 248326, -22309, 81679, 178825, 232843, -119623, 69002, -114119, -46873, -156497, -164237, -78235, -43803, -139976, -42019, -368031, 62109, 114306, -319882, -561716, -207344, -18490, -222414, -52761, -13985, 177052, 98603, 17813, -273213, 1759, -42913, -206238, 130164, -25465, -161730, -90828, -84728, 251681, -261433, -69282, 238199, -130865, 30414, -138656, -387841, 111568, -338419, -303199, 10271, -550281, -78396, -142125, -196904, 91936, 157589, 63583, 10559, -235047]
15849C3637J18981e7296m8762o0686B230A060M4988a89856A84818b63387a5795
15837A37387Q4792F5568h8105J2160A82282c10886F2835b04201G9556J69043a41704
15825h6802j34514C9345J15553Q6651a07436F5223A2523L0874Q3252k8103b62688
15813b34140A62288K90033c73422a49081k04417f8468j15684a3556j0007B8187
15802A2760a20712B32232f5640k9720C3776b16424A9887m145O9398c67254a75399
15790B38887a58850g4684k89340c5583j64386A91989A129c69232n4890A02116
15779E4468b7265j95913A9085d629A4240b11389C051i833F8848b94447P5214e3255
15766a55350o3307c6368B26468a52269C22489f2648D16330a60186k8105B3145
$$ y = [33637, 152618, -57296, -106058, -166744, 2230, 1060, 46048, -189856, 184818, -263387, -15795, 137387, 222179, 65568, -88105, -75945, 182282, -310886, 62835, -204201, 79556, 248599, -141704, -86802, -221316, 39345, 154898, 241549, -107436, 65223, 12523, 43397, 126649, 98546, -262688, -234140, 162288, 452321, -373422, -149081, -353498, -68468, -184152, -13556, -23563, 28187, 12760, -120712, 232232, -65640, -95360, 33776, -216424, 19887, 15742, 85140, -367254, -175399, 238887, -158850, -74684, -364024, -35583, -199969, 191989, 1129, -369232, -424122, 102116, 54468, -27265, -223178, 19085, -4629, 14240, -211389, 3051, -9833, 68848, -294447, -219233, -53255, -155350, -218657, -36368, 226468, -152269, 322489, -62648, 416330, -160186, -188291, 23145]
15755F7647L4388c6482k61685d6070A54333L7150F9188A763J64161P7723i5579
15743A27762b2584j01459F8808d9966f98A2341K00784b00164q6338a6279C17426
15731a62845B59178b87838Q0006N2400e5948a1054j69122B89828b3079A14879
15720A20651b86934B8984i0925A84004D5206a55704C1828i4007B32893b34708
15709F2790a60701I3490a2092I447b39721A14534a9353B06954g1289d23q0910
15698h1333n9484k15743H9498b13202d666A6599a92535b0663I9950a47437d1945
15686a42162K6947c2263j31964B1726h7192b6592B03233b62153A46057b8086D09931
15674g7550E0212h3003n5966f402n0127K3356j62011g226A11177a73565C0664
$$ y = [67647, 102035, -36482, -298167, -46070, 154333, 191483, 69188, 1763, 165924, 243647, -95579, 127762, -22584, -124043, 68808, -49966, -698, 12341, 213125, -200164, -286502, -16279, 317426, -162845, 259178, -287838, -207832, -155432, -55948, -11054, -180176, 289828, -23079, 114879, 120651, -286934, 28984, -90925, 184004, 45206, -155704, 31828, -94007, 232893, -234708, 62790, -160701, 93490, -12092, 9447, -239721, 114534, -19353, 206954, -71289, -423, -81333, -140817, -356560, 89498, -213202, -4666, 16599, -192535, -20663, 99950, -147437, -41945, -142162, -115215, -32263, -164227, 21726, -87192, -26592, 203233, -262153, 146057, -28086, 409931, -77550, 50212, -83003, -138969, -6402, -56529, -33173, -195184, -7226, 111177, -173565, 30664]
15662c187H6271h479j50089I738M5498g1159j8324m8473A12878b02990Q033j52338
15650c47295E5885l153b49485j15951a56190I5049b87291E9054a78486g3040C97253
15638i4846H5569a31199k05029g467k22789N7720B81458g3700A28489f9692b4457
15626A07785l2638i0012m8800a5930l7607C5085O0235a75889F7909g5247j58747
15615b33994C6115A300L5682O220c98326C3906a88060H0124c5111A22436N8869
15604A81305b2848n3528C606b968p7310j0751b1296j97653a05579A19887a13707
15592A493b19568h4611A07331O1092b34273A14177J3911J8702a08645I8856b44576
15580d23901J52943A5669a18290E1228b0313k1835k4771J0326B8027b74130j22708
$$ y = [-3187, 86271, -8479, -158568, 9738, 55236, -71159, -89483, -137956, 112878, -202990, -194957, -347295, 55885, 52732, -249485, -365436, -156190, 95049, -287291, 59054, -178486, -73040, 397253, -94846, 85569, -131199, -336228, -7467, -230256, -172536, 281458, -73700, 128489, -69692, -24457, 107785, 75147, -90012, -138812, -15930, -53537, 35085, 95320, -175889, 67909, -75247, -233994, 36115, 1300, 36982, 43202, -398326, 33906, -188060, 80124, -35111, 122436, 181305, -22848, -76376, 3606, -2968, -80278, -91029, -21296, -218949, -105579, 119887, -113707, 1493, -219568, -84611, 107331, 168423, -234273, 114177, 128088, 146790, -108645, 98856, -244576, -423901, -270958, 15669, -118290, 51228, -20313, -42148, -66919, -56593, 28027, -274130, -396838]
15569c96838B2036K09582A7229J85073r2397a21214j99799J01257B38655D3100
15558d9742l0515B5122d637j7598n3123A96976k333r4654J7745l5100A1925b7059
15545C51684j72619n0859J28590K0204a78418A31423G371b23296K7836E1171d43615
15533b17053A78007f1540j20210O116C59611a92166D91708I4709L9646f6670k72719
15522c39389J67231d8491L502A2674R3678j3892k2546J33558a45924E2644d6176
15510b11288B01170G6521J87317p7465o6891A1935J90239p4327a94819A13421
15499C5555J27307e0203q5805g405j60563b3743k95427R2935P8709F579J17657
15488A24236a58790F0056P6621q489D3869j6171b01216L877Q9607L2529A18990
$$ y = [-396838, 22036, 231618, 17229, 202302, 109905, -121214, -321013, -219756, 238655, 43100, -49742, -80257, 25122, -4637, -22235, -75358, 196976, 194643, 99989, 117734, 82634, 11925, -27059, 351684, 179065, 128206, 256796, 277000, -178418, 131423, 7371, -223296, -195460, 51171, -443615, -217053, 178007, -61540, -181750, -175634, 359611, -192166, 491708, 94709, 134355, -66670, -339389, -172158, -48491, -44989, 12674, 106352, 92460, 69914, 203472, -145924, 52644, -46176, -211288, 201170, 76521, 263838, 186373, 119482, 11935, 202174, 127847, -194819, 113421, 35555, 162862, -50203, -136008, -7405, -167968, -23743, -319170, -226235, -147526, 6579, 124236, -158790, 60056, 136677, 128188, 43869, 27698, -201216, -197339, -107732, -75203, 118990]
15476C23441j00816a52907j51580J25974B0425b6883B91813h1813I0646a71884
15465A2529K76948c65056a49415C82128A76667f0187F557f4509g704k0698o7717
15454i6119j78148J21035k27013a76497Q0763j08017O9261F752K08708b16678
15443a19474A7899N6193K4532R049a21245G1810j8148a00517K7088m5634C27492
15431a886H7491a81718D60018B11992o0398J96904a12972H2399g7900k08876c9920
15419B08131o2709G0813a97986d9182I5690b16618g565D5971K35265o7657k0763
15408A92816R8785b43316B15011G7453J27941P3787A32779e5033D36170c17079
15397C4195f1663D46771a24474B05030h5102l6140D536MJ21036c33259A02777
$$ y = [323441, 222625, -152907, -304487, -178513, 20425, -26883, 291813, -81813, 90646, -171884, 12529, 289477, -365056, -149415, 382128, 176667, -60187, 6557, -64509, -7704, -28402, -96119, -274267, -153232, -380245, -176497, -95734, -203751, -134490, 6752, 215460, -216678, -119474, 17899, 74092, 98624, 107673, -121245, 71810, 53662, -100517, -73429, -119063, 327492, -1886, 87491, -181718, 460018, 211992, 151594, 348498, -112972, 82399, -77900, -286776, -39920, 208131, 145422, 70813, -197986, -49182, 95690, -216618, -7565, 45971, 281236, 213579, 192816, 291601, -243316, 215011, 77453, 205394, 279181, 132779, -55033, 436170, -317079, 34195, -61663, 446771, -124474, 205030, -85102, -121242, 4536, 4540, 125576, -333259, 102777]
15385a42041A24068D6L5366P7864a02752j35069j04748G3666c05459a9664l0037
15374d9701k28652g4812A50941p2578O0349g8967j77708J07668e0453G4569J5847
15363I0416P9932k3770d8974A26377J57894a92293a8479A81799q5245h2904L6860
15352d6044k1563B2072b27186q5789E2873K48387a11343j97963J28173A81278
15341a35035d9327A24232f36714A61467a17936A89566c0154l9046A85252h2201
15330b1247A0719c39401I9954c94622A78234f3638A11048h3675d0313e533l3662
15319c9195k50535C49251b95122J18227I9187b58117A83776k2988P7164o7599
15309A70353o5943e4365B31795i3197A42877J58901a01981H1768a88375B31392
$$ y = [-142041, 124068, 46, 35412, 113276, -102752, -237821, -342569, 73666, -305459, -19664, -49701, -278353, -74812, 150941, 78363, 138712, -78967, -256675, -149007, -50453, 74569, 90416, 170348, 146578, -48974, 126377, 284271, -192293, -18479, 181799, 96554, -82904, -46044, -67607, 22072, -227186, -312975, 52873, 301260, -111343, -309306, -181133, 181278, -135035, -49327, 124232, -636714, 161467, -117936, 189566, -30154, -69200, 185252, -82201, -21247, 10719, -339401, 99954, -394622, 178234, -63638, 111048, -83675, -40313, -5533, -39195, -289730, 349251, -295122, -176895, 99187, -258117, 183776, 160788, 237952, 170353, 104410, -54365, 231795, -93197, 142877, 301778, -101981, 81768, -188375, 231392]
15298A49008g6367b5718r836k05492A34465b26661I0559g9040B37281c3363D9266
15286a28037A64653c58077A70064c7014A8968J35585m2553a88266B821a4165L425
15275a0740j28491h380B1689c16400B20769D9484b33784A97571a18502c3397C84739
15263g709j14553C78189G0886J17046N110q3739P5002p8921a0768C44504C7143
15251B87211j41207B9754K42121H3629K76510e4984B7804a15719h386B47678n7385
15240A90293f739b06B8856J31836N84105j27201O26388m24892K32423l9276k82327
15229G29912l36157c0959H2483l2380K76368b22512C0373C162e6158C8699j9153
15218A9546J1800a52821f7582D9782q275J22919f165q8024A53848n7393e189A10147
$$ y = [149008, -76367, -25718, -35554, -241046, 134465, -226661, 90559, -79040, 237281, -33363, 49266, -128037, 164653, -358077, 170064, -37014, 18968, 154553, 112000, -188266, 2821, -14165, -10740, -139231, -8380, 21689, -316400, 220769, 49484, -233784, 197571, -118502, -33397, 384739, -7709, -122262, 378189, 70886, 187932, 193042, 109303, 184305, 105384, -10768, 344504, 37143, 287211, 146004, 29754, 271875, 83629, 360139, -54984, 27804, -115719, -8386, 247678, 190293, -6739, -206, 28856, 160692, 744797, 617596, 1243984, 819092, 1051515, 1012239, 729912, 393755, -30959, 82483, 50103, 326471, -222512, 30373, 3162, -56158, 38699, 19546, 31346, -152821, -67582, 49782, 41507, 164426, -6165, -94189, 153848, 96455, -5189, 110147]
15205A78168n0935a49856c2150A16266e0764E8545K29335a81647H0466J81988
15195B62454C6717i3305E93690j99160n6896A38986h3824K7848o1758B1983K6956
15184D8939a75509D2927K48971a79874E2953J42051b72005A9681n057J75067a74473
15172E65518I5211m5953J01924A8472b63568E6586k0534L27395b47964C1841J61975
15161A93816m8649J35084d1885B96601j31594k4128c2464D93060a78523A65691
15150C70957j53438a33898F7142Q0805m9192m8535K69367D9870J97112C161R2146
15139I5307k4032J34368I8821J37187j3901k0338f433A59516m4283K8781b13092
15127i1202l798c5961A50581n9147c8948a2092C42105a52404H924L71653a94388
$$ y = [178168, 127233, -149856, -32150, 116266, -50764, 58545, 287880, -181647, 80466, 262454, 36717, -93305, 593690, 394530, 337634, 138986, -83824, -55976, -117734, 21983, 48939, -175509, 42927, 291898, -179874, 52953, 195004, -272005, 19681, 14624, 189691, -174473, 565518, 95211, 49258, 151182, 18472, -263568, 56586, 36052, 363447, -247964, 31841, 193816, 145167, 280251, -41885, 296601, 165007, 140879, -32464, 493060, -178523, 165691, 370957, 217519, -133898, 67142, 147947, 98755, 50220, 319587, 49870, 246982, 3161, 95307, 71275, 205643, 98821, 236008, 222107, 201769, -6433, 159516, 115233, 144014, -213092, -91202, -95000, -35961, 150581, 91434, -38948, -12092, 342105, -152404, 8924, 380577, -194388]
15115B14857c0360a0021B6107d6201A24273J22135J10232F2198P0829j9217k980
15104A10830a9406B36652A2591J44797J21395a2602r3981E9263j5534b855j54919
15093a57774A34753E9423n082b11476H6616J23545a5149A5956h4423D4912M814
15082D9726A8525P8991J24027I5411P5117f0994B8110a65834g8949C67158E3690
15070a82836A47809D6701K00430B0447F694K7626h1938A93876l7341a48996c9074
15058A07515e1331C20724a03820A91847D0886K36938q1028I3983B895J38816c0449
15046H3471J28714J36693D3989A7729M82325A6615L4296J72502A6206i3309A78045
15034d8755A07968J24356J1241J17412A14858J23309n5384b34636B71866l7540
$$ y = [214857, -30360, -10021, 26107, -46201, 124273, 246408, 356640, 62198, 133027, 113810, 110830, -19406, 236652, 12591, 157388, 278783, -12602, -106583, 59263, 43729, -2855, -157774, 134753, 59423, 54341, -211476, 86616, 210161, -15149, 15956, -84423, 44912, 49726, 18525, 97516, 221543, 95411, 170528, -60994, 28110, -165834, -78949, 367158, 53690, -182836, 147809, 46701, 247131, 20447, 6694, 34320, -81938, 193876, 156535, -148996, -39074, 107515, -51331, 320724, -103820, 191847, 40886, 277824, 196796, 93983, 2895, 141711, -30449, 83471, 212185, 348878, 43989, 17729, 500054, 16615, 50911, 223413, 16206, -93309, 178045, -48755, 107968, 232324, 243565, 360977, 114858, 238167, 182783, -234636, 271866, 234326]
15024B34326m0501O9413D9552a8435B25753r3124J50993H9932K18286A11283K03953
15013C15236E2144b2957A52147J30179j33539D2149j8435M4829Q7516K45173I8412
15001C93564Q4197p0969k02812A8799O2544P0361J99752G0015N0808E6314J10057
14990A66371K77761c0855C60361d7585A52780J79170F7715L64389j21906a05656
14979B02233E3950M9740K57716l3283J07212J7834j16956N776j7708d99j8770
14968a9269B49000Q3306j19043K86692j26114j00633K17055A60178J50168j49308
14958A61038Q1824q6247Q7173o7961j4564D6715L9755L59958m6312j56617L9462
14947B82961j22521l7405J7609M12854p1802B03568d898A29947J46490Q8182j43204
$$ y = [234326, 193825, 263238, 49552, -18435, 225753, 132629, 283622, 89932, 308218, 111283, 315236, 52144, -22957, 152147, 282326, 148787, 42149, 23714, 68543, 156059, 401232, 98412, 393564, 477761, 406792, 203980, 18799, 81343, 151704, 351456, 70015, 120823, 56314, 166371, 444132, -30855, 360361, -47585, 152780, 331950, 67715, 432104, 310198, -105656, 202233, 53950, 103690, 361406, 328123, 435335, 453169, 336213, 341989, 324281, -499, -19269, 249000, 332306, 213263, 499955, 373841, 273208, 490263, 160178, 310346, 161038, 242862, 156615, 243788, 175827, 161263, 46715, 86470, 446428, 400116, 243499, 282961, 160440, 123035, 140644, 553498, 481696, 203568, -4898, 129947, 276437, 364619, 221415]
14936B21415P8394k4326p9706J49503j46190G7963J51961P5660j19324l8501N99383
14925G47142l25042j71272P7137j29461J41326j35254J93057O9402j37541A23950
14914B87001j35973J88525m050Q3184A30264a4800A6731L13789M8295A63381B2454
14902C51461K02455p9846F8849L47497k04060J46083j03373K08898q5076j10708
14892B68110F2493K26560A14740J58572L06116j61534j72701R3522J9600n8986
14882B99329L7208F6092N58055a14170C64408Q7756j51177J2551j53399n6847
14872A03292N17559B63746J02778l0860j46243J44368N8618J06306k42661J53423
14862D09475H5237K70734J4054m8868K98033k45915N3874j57369E7487J86103
$$ y = [221415, 299809, 275483, 195777, 345280, 199090, 77963, 229924, 305584, 186260, 147759, 747142, 422100, 250828, 327965, 198504, 339830, 204576, 397633, 467035, 329494, 123950, 287001, 151028, 339553, 335503, 418687, 130264, -14800, 16731, 330520, 378815, 163381, 22454, 351461, 553916, 474070, 68849, 416346, 212286, 358369, 254996, 463894, 378818, 268110, 62493, 289053, 114740, 273312, 579428, 417894, 245193, 338715, 358315, 299329, 336537, 66092, 624147, -114170, 364408, 452164, 300987, 313538, 160139, 103292, 620851, 263746, 366524, 335664, 189421, 333789, 392407, 498713, 256052, 409475, 85237, 355971, 370025, 321157, 619190, 373275, 427149, 269780, 57487, 243590]
14852B43590K64268R2992J0715A05397M17881B30810c6807A00895N12172j82435
14842D30632j14156J39882K20599k66755k0330M5773J03820j91429A46292M29962
14832E76254j93262J11153J37844k89759K64405k94172M063K9472R650o425I0313
14820B59321N9683L66601C29084P3776j28773N45166B71467K08796k4816o3128
14810C92319L0857M7129J51366B85183M16599B92337d1041E37207k26841L36029
14800F46395k3820k10383Q7653n022M5129k47985K44094B39293K04657J83542
14790F27492k25420A46411K57654j24747K81810M069B00304L06097Q6731I3137
14779B35367M05181p393j53112k23854L25871k80450K55693q908j39638J5666
$$ y = [243590, 507858, 600850, 611565, 105397, 523278, 230810, -36807, 100895, 613067, 430632, 316476, 456358, 676957, 410202, 389872, 435645, 539465, 348036, 146292, 576254, 382992, 494145, 631989, 342230, 606635, 312463, 316526, 345998, 355648, 349223, 90313, 259321, 319004, 685605, 329084, 402860, 274087, 819253, 271467, 480263, 455447, 392319, 423176, 470305, 621671, 285183, 701782, 292337, -41041, 537207, 310366, 646395, 622575, 412192, 499845, 494823, 539952, 291967, 536061, 239293, 443950, 627492, 402072, 146411, 404065, 279318, 561128, 565197, 200304, 506401, 593132, 93137, 235367, 640548, 633155, 480043, 256189, 582060, 301610, 557303, 548395, 408757, 424423]
14769D24423K22526j33415L68308j66576C21491L6907K48938P174r2992K61611
14759G83129n3487k76919o427J6489J37823O7281p8513o1306o2990j16275K94542
14748F43347j69089Q9627J12563J25293K12386m01770J07423Q0996J14375j40435
14738G74716p5162k11461k8170j78631L38675q4100L127J24920O2800j40980L24165
14727I09899n7587l93917J73057M1063J02079k98j3909k42649J84484O7688m882
14716G65028k23515A91621J73772M83992P3209r1709n355k74566p4391J84010
14706F60583m9405j8365O05172D43885L71501J61230k18673J63174j405k30558
14696F89154K13170j6844j88680J79705j003L0643k96975N19054m52878M00023
$$ y = [424423, 646949, 513534, 881842, 715266, 321491, 358398, 607336, 614510, 521518, 783129, 729642, 452723, 446296, 462785, 600608, 667889, 589376, 528070, 465080, 348805, 643347, 474258, 563885, 676448, 801741, 1014127, 612357, 719780, 800776, 915151, 774716, 699554, 488093, 459923, 281292, 619967, 535867, 538994, 663914, 726714, 585734, 909899, 852312, 458395, 631452, 672515, 774594, 774296, 760387, 517738, 702222, 769910, 765028, 541513, 191621, 365393, 849385, 922594, 830885, 825530, 550964, 476573, 660583, 611178, 592813, 1197985, 443885, 815386, 976616, 757943, 921117, 919712, 689154, 902324, 885480, 696800, 876505, 875502, 906145, 609170, 1128224, 675346, 1075369]
14686A075369k59323J33425K53486E08307L29515L8832Q4582j45284J31098K50824
14676A197874k96054n6166R631k5252O062j22777J88168j40544N88426n61463
14666G87905L02686r6398o9501m951m8624M23717l77921j86507J59143m0183j34514
14655G14852J90343J82726j30770k31065K25762K96188J27839k96501q0179N56279
14645A555474F98523O51053l15972J8225K97823k99028K15318k23129R8085j7369
14635A123529M2509j61877Q494J47081j3297j20173K30478P694j27852L9554q774
14624A167366K59443j51175J0584j27996O3366K82124l07690J11557J21295k15709
14614A213165K61644j87497j44428M31954l36797J97262J48205k61399K64811
$$ y = [1075369, 816046, 949471, 1202957, 508307, 837822, 876654, 961236, 815952, 947050, 1197874, 901820, 845654, 855285, 830033, 836095, 713318, 901486, 760942, 1349368, 787905, 1090591, 994193, 924692, 919741, 871117, 1294834, 916913, 730406, 889549, 849366, 714852, 905195, 1087921, 957151, 726086, 951848, 1248036, 1375875, 1079374, 999195, 1555474, 698523, 1349576, 1033604, 1051829, 1349652, 1050624, 1265942, 1042813, 1140898, 1123529, 1166038, 1004161, 1012655, 1159736, 1146439, 1026266, 1256744, 1264438, 1136586, 1176140, 1167366, 1426809, 1275634, 1286218, 1158222, 1221588, 1503712, 1196022, 1307579, 1428874, 1213165, 1474809, 1287312, 1142884, 1574838, 1238041, 1435303, 1583508, 1322109, 1586920]
14605A586920m06795K66368J83784k96238M56411m02694J46812j63694K08399
14596A579273M9005J348L04302p26454L65767n5579J97419k38201J88057k70584
14586A394353P03958p32239K42196k9317N555N5047M20787m75722m4647N19591
14576B059562k63071p8089Q2610K08067J07774m43870J71816K72692l37829k6557
14566A753105j07458L02822l264M7406j6282M5702r169l039J31565l4156N2028
14555B159260J6769L25228q0773j54817J19447O7139K24382l67454L27413m26441
14545B210153Q04542k78852K31871N20490l24203M87703J58370N74620N81322
14536D966016J124943J347024J915699L614995N810749R686688M401492j2546998
$$ y = [1586920, 1180125, 1446493, 1630277, 1334039, 1790450, 1387756, 1534568, 1370874, 1579273, 1628278, 1629626, 1933928, 1207474, 1573241, 1517662, 1715081, 1476880, 1664937, 1394353, 2098311, 1366072, 1608268, 1578951, 1584506, 1639553, 2060340, 1584618, 1539971, 2059562, 1796491, 1718402, 1801012, 2009079, 2116853, 1672983, 1844799, 2117491, 1779662, 1753105, 1645647, 1948469, 1945205, 1992611, 1976329, 2022031, 2012862, 2009823, 2141388, 2107232, 2159260, 2176029, 2501257, 2420484, 2265667, 2385114, 2452253, 2676635, 2309181, 2636594, 2210153, 3014695, 2735843, 2967714, 3488204, 3164001, 3651704, 3810074, 4384694, 4966016, 6090959, 7437983, 9353682, 12968677, 18779426, 28466114, 32867606, 20320608]
14528B0320608q178776m455485k133206j351040l41763n98478o02800J14813n09230
14519B264643N38654n01426J74374k72122L33787n07329L61191l5849J83500k68364
14509B271059J5500K20078J99570l37857r2254K21036O3847p0769k53637K73464
14499B510037L04773o1064k73222K79763J68111m07695r5481O99105O7522l59804
14489B832045j49252J82478k63020M83697k049j20302J24705q2967L06770j84874
14479C127231J45197K2274L42920o01303N57231R2921q2167L8225k22369L80054
14469C800214k56220M81309j56872j46818J73720j30828l1614R8999J08976O14178
14459D555044l06908o7752R9260J58235o90908M50322J17049L95118l73100N5464
$$ y = [20320608, 12141832, 7686347, 5553141, 4202101, 3860338, 3261860, 2659060, 2773873, 2264643, 2803297, 2301871, 2476245, 2204123, 2537910, 2030581, 2391772, 2355923, 2539423, 2271059, 2286559, 2506637, 2706207, 2368350, 2276096, 2497132, 2560979, 2490210, 2236573, 2510037, 2814810, 2753746, 2480524, 2760287, 2928398, 2520703, 2425222, 3124327, 3191849, 2832045, 2682793, 2865271, 2602251, 3085948, 3083899, 2963597, 3088302, 3005335, 3312105, 3127231, 3272428, 3294702, 3637622, 3036319, 3593550, 3686471, 3604304, 3642529, 3420160, 3800214, 3543994, 4025303, 3868431, 3721613, 3895333, 3764505, 3732891, 3831890, 3940866, 4555044, 4248136, 4180384, 4279644, 4437879, 3746971, 4197293, 4314342, 4709460, 4336360, 4391824]
14449D391824j27872O15367l31865l5432o5015N33190l55781O06151P4124m96190
14439D808501M73361k78905j5675J41129J7133J39406M48005k48037p9429N44527
14429E950016j86785K07039J89274m59818M84917j47130K93074k40351N59598
14420F649834m0125r2176Q0078M43996m07797j07259J07413O15396m23090K41604
14410G067874J99796M66043n52363L61793K61689P8126L66464k89744L12284Q4547
14400H356509L64753l26447L90322J93742J14265k59445J72111J46102N42013
14391I693925P4918j61275J40377N41308l82579P46622j69466J50608N11578M6573
14381A1192589j99062L79392L13399J45566J35663J34843L41463J63779M33534
$$ y = [4391824, 4263952, 4879319, 4547454, 4512022, 4447007, 4980197, 4624416, 5230567, 5304691, 4808501, 5281862, 5002957, 4987282, 5128411, 5145544, 5284950, 5732955, 5484918, 5405489, 5950016, 5763231, 5970270, 6159544, 5699726, 6184643, 6037513, 6330587, 6090236, 6649834, 6609709, 6517533, 6597611, 7041607, 6633810, 6526551, 6633964, 7249360, 6826270, 7067874, 7267670, 7733713, 7181350, 7543143, 7804832, 7882958, 8249422, 7959678, 8271962, 8356509, 8721262, 8394815, 8785137, 8978879, 9093144, 8833699, 9005810, 9151912, 9693925, 9768843, 9607568, 9747945, 10289253, 9906674, 10653296, 10483830, 10634438, 11146016, 11192589, 10993527, 11372919, 11686318, 11831884, 11967547, 12102390, 12443853, 12607632, 13041166]
14372A3041166j07930K13124P42876j52012M35498K93753M29993r0036K69334
14363A5075766N2628N10809O47115K23233M6344P78209J75534J64847O21913J58054
14353A8454452K92711k72148J034870O56957j05176L81878J033741M73865M46928
14344B2398078K58282Q34666J00373P35236M37926O43396M35418R37811K96862
14335B7078048J018423N11840P45244Q06746R06072N45668R98702N69512J351088
14326C4531343R14923K76273J050433J301040J038426J187324J292712J568994
14318D3161468R20547J349217J356011J440899J515330J496484K022496J739958
14310E5002410J581550K019161K074527K147568K245234K483711K170193K729139
$$ y = [13041166, 12933236, 13146360, 13889236, 13737224, 14172722, 14466475, 14896468, 14806432, 15075766, 15128394, 15639203, 16286318, 16509551, 16555895, 17334104, 17509638, 17674485, 18296398, 18454452, 18747163, 18475015, 19509885, 20166842, 20061666, 20443544, 21477285, 21951150, 22398078, 22656360, 23491026, 23591399, 24326635, 24764561, 25407957, 25843375, 26781186, 27078048, 28096471, 28608311, 29353555, 30160301, 31066373, 31612041, 32610743, 33180255, 34531343, 35446266, 35722539, 36772972, 38074012, 39112438, 40299762, 41592474, 43161468, 44082015, 45431232, 46787243, 48228142, 49743472, 51239956, 53262452, 55002410, 56583960, 58603121, 60677648, 62825216, 65070450, 67554161, 69724354, 72453493]
14302G2453493K827119K558644L153544L127843L638811L686258L324547L890693
14294I8660952M079190M646577M664580M746406N120619N941112N612867N950625
14286A39422928O764994P296877P348025P778177Q277492R039423R449766R597155
14278B04974837J0872790J0971411J1529025J2485517J2868427J3726656J4318894
14271B91747557J4779941J5063299J5564969J5393596J4723224J5091832J3132816
14264C95497234J2666951J1922708J0561812R410369Q106773P212676M706665
14257D60085188J505922J104520J193491k365273p358893p166341q646760j0028289
14249D28323565j1545413j2641038j3550311j2936013j3200124j3118004j4089564
$$ y = [72453493, 75280612, 77839256, 80992800, 84120643, 87759454, 91445712, 94770259, 98660952, 102740142, 107386719, 112051299, 116797705, 121918324, 127859436, 133472303, 139422928, 146187922, 153484799, 160832824, 168611001, 176888493, 185927916, 195377682, 204974837, 215847627, 226819038, 238348063, 250833580, 263702007, 277428663, 291747557, 306527498, 321590797, 337155766, 352549362, 367272586, 382364418, 395497234, 408164185, 420086893, 430648705, 440059074, 448165847, 455378523, 460085188, 461591110, 462695630, 463889121, 461523848, 454164955, 446998614, 438351854, 428323565, 416778152, 404137114, 390586803, 377650790, 364450666, 351332662, 337243098]
14242C37243098j4356183j3576656j2974908j3321045j3325544j2736072j2430985
14235B44521705j1238451j1151318j0938227r811266j0179076r708996r455532
14228A72038839q953471p935468q035769p211013o232949o257314n583621n926216
14220A15903018m808426m904646m743189m212066l338387m058603l514132l536484
14212H2787085k951785l036424l360649k460334k259553k502253k702419j631312
14204F1882356j956784k886024j390624k117649j478171j850955j083803j641233
14196D7477113j694054j358271j146915j091525q28435j160138j371156j222683
14188C7603936j046012p65294j338305l96792q20160j328064o96896r64057n27587
$$ y = [337243098, 322886915, 309310259, 296335351, 283014306, 269688762, 256952690, 244521705, 233283254, 222131936, 211193709, 201382443, 191203367, 181494371, 172038839, 163085368, 155149900, 147114131, 139903118, 133670169, 127412855, 121829234, 115903018, 111094592, 106189946, 101446757, 97234691, 93896304, 89837701, 86323569, 82787085, 79835300, 76798876, 73438227, 70977893, 68718340, 66216087, 63513668, 61882356, 59925572, 57039548, 55648924, 53531275, 52053104, 50202149, 49118346, 47477113, 45783059, 44424788, 43277873, 42186348, 41357913, 40197775, 38826619, 37603936, 36557924, 35792630, 34454325, 34057533, 33237373, 31909309, 31212413, 30248356, 29720769]
14179B9720769p84498o53716q38481n34566o15455p18250m99769p91966k41999
14170B4042069q03429n03604n31359l89911n45813n80864m43004m42941M9860
14161A9851004n12952q30712r2155k66088j57789p41155J3269p47915o71572J04085
14151A5948020r2511l37728k71366n16243J52409n57933k70189J4710o52916j93330
14141A3222923k03751p8581R629k15230l73884m96764N02923n31371m75518l4399
14131A1325977k57178r2563L3645n64408M5666j19573k41206N0461o17079J44089
14121I707831Q2170l95319j1642q9073j81048J19001l92115m09902r5157L0740
14111H365486J07106o0499k18561l28086M4061O1686n5299j4648k90722k25905
$$ y = [29720769, 28936271, 28282555, 27444074, 26909508, 26294053, 25575803, 25076034, 24284068, 24042069, 23238640, 22735036, 22203677, 21813766, 21267953, 20687089, 20244085, 19801144, 19851004, 19338052, 18507340, 18415185, 18149097, 17991308, 17250153, 17263422, 16515507, 15843935, 15948020, 15855509, 15517781, 15246415, 14730172, 14882581, 14324648, 14054459, 14069169, 13416253, 13222923, 13019172, 12940591, 12950220, 12734990, 12361106, 11864342, 12367265, 11835894, 11360376, 11325977, 11068799, 10976236, 11009881, 10445473, 10491139, 10371566, 10130360, 10180821, 9563742, 9707831, 9790001, 9394682, 9383040, 9293967, 9112919, 9231920, 8839805, 8429903, 8334746, 8365486, 8472592, 8412093, 8193532, 7865446, 7909507, 7971193, 7915894, 7901246, 7610524, 7384619]
14101G384619J93222l86552r8393n877j73519j15008r7921j70503K13954k45009
14091F499013l04659J45025l5565K7676j82319j45016j15264J44516j28303k41765
14081E663339j68849R6939j24610P5089j40975P6344j79583k57665j1728J5273
14071E043574J5180J63597l78972N4365n7686K12245k08333Q472m18699j04780
14061D328963K89101k44801m0176J45360J0041k4457J71944n62865L41703m8241
14051D366572l12154k4971J01392J92075j70775l68326K10335J8401j0487m5991
14041C956071n1083l47420J64014K3952L9594k55546k56425J64761j49517O0353
14031C348754j01196M19515k49944n2259n1203r9179J9801j40277K30626k32237
$$ y = [7384619, 7577841, 7191289, 7092896, 7087019, 6913500, 6798492, 6700571, 6530068, 6744022, 6499013, 6194354, 6339379, 6303814, 6331490, 6149171, 6004155, 5888891, 6033407, 5905104, 5663339, 5494490, 5591429, 5466819, 5541908, 5400933, 5477277, 5297694, 5040029, 5028301, 5043574, 5058754, 5222351, 4843379, 4897744, 4840058, 5052303, 4843970, 4852442, 4433743, 4328963, 4618064, 4373263, 4333087, 4478447, 4488488, 4464031, 4635975, 4073110, 4414813, 4366572, 4054418, 4029447, 4130839, 4322914, 4152139, 3783813, 3994148, 4012549, 4002062, 3956071, 3904988, 3557568, 3721582, 3745534, 3785128, 3529582, 3273157, 3437918, 3288401, 3348754, 3247558, 3667073, 3417129, 3364870, 3313667, 3214488, 3234289, 3094012, 3324638, 3092401]
14021C092401M8352j56648m8190J56023j39105K45380l82775L51075J08899m04607
14011B870805J3048J83825n26199J14090Q6992Q5844O4649l23117j83950M76521
14001B862508k76373k14985L0132L52393j98299j70303k07722J9013R1094L9915
13991B327373J24693k35621K8872J9222K11809l46850M7883L907L2639L18694
13981B532621l77062J89483N40272J07508J6704P52618O47240J643359K556357
13972H609100N264566R558503Q390144r094617p600910m507776k885229j233509
13964F500272j264219p52527k34292o59670k3746j00759k30484m7814n42625j2509
13954B631627J69847n61164K33142k96108j23883J34060J64906k14725k3686j99603
$$ y = [3092401, 3140753, 2984105, 2935915, 3091938, 2952833, 3198213, 2815438, 3166513, 3275412, 2870805, 2883853, 3067678, 2541479, 2655569, 2742561, 2828405, 2893054, 2569937, 2385987, 2862508, 2586135, 2371150, 2401282, 2753675, 2555376, 2385073, 2177351, 2196364, 2287458, 2327373, 2452066, 2216445, 2245317, 2264539, 2476348, 2129498, 2177381, 2181288, 2213927, 2532621, 2155559, 2345042, 2885314, 2992822, 3009526, 3762144, 4409384, 6052743, 8609100, 13873666, 23432169, 31822313, 22727696, 15126786, 10619010, 7733781, 6500272, 5236053, 4483526, 4249234, 3589564, 3565818, 3465059, 3234575, 3186761, 2644136, 2631627, 2801474, 2240310, 2473452, 2177344, 2053461, 2187521, 2352427, 2137702, 2114016, 1914413]
13944A914413K79909L6196k74828K850J50546k8087j91608K66055K7405k72752
13934A910099j56082o6039L45429n38951K70381L30567m93260o154K17813n0032
13924A763771j70597J77695M4928j37635R7768l51155K47149M960M61802l71165
13914A767521J4517l39428N8434M6001J63129m7151l46019K68721p1968m24981
13904A088776M27173J89645q1118m06027M29590j53479J70498P3093j2528l23397
13894A402226j97300N9427J69039l5462J61328o15098L59960j2646P3060K4583
13884A389117j19956N2091M17905m39911j05808l4428k11378J27489K30248j06897
13874A198472J36810P9835j20484k03190K23557l37424L34553l68218M69741j75934
$$ y = [1914413, 2194322, 2230518, 1955690, 1958540, 2109086, 2080999, 1889391, 2155446, 2182851, 1910099, 1754017, 1687978, 2033407, 1494456, 1764837, 2095404, 1602144, 1595990, 1813803, 1763771, 1593174, 1770869, 1815797, 1678162, 1775930, 1424775, 1671924, 1676884, 2138686, 1767521, 1782038, 1442610, 1501044, 1547045, 1710174, 1663023, 1317004, 1585725, 1513757, 1088776, 1515949, 1705594, 1624476, 1218449, 1648039, 1494560, 1665058, 1738151, 1725623, 1402226, 1204926, 1264353, 1433392, 1397930, 1559258, 944160, 1304120, 1291474, 1364534, 1389117, 1269161, 1321252, 1739157, 1299246, 1193438, 1159010, 947632, 1075121, 1305369, 1198472, 1335282, 1415117, 1294633, 1091443, 1315000, 977576, 1312129, 943911, 1413652, 1237718]
13864A237718K49855j63142K5947J09685l14915J4936J4570k59150J27929o7582
13854I75851j17743K17443k5056J15876P6402j16550P4790k09917N71016m47767
13844A114345J11551l19891p8208J31556o0255L5088M5943q6300M1956J31395
13834A067180n4986K13742j68030j25284n2423k50623N22515l07647K72676l35671
13824G81449K25047j58905J06079j37967L44194j32902k8686J84945j36744j98332
13814H48178J70596J06323m69579K26262J20289j47383R840J15931K7110k38210
13804G69357j86880L53355k55915J5871Q7853m4036k7145k9887J2487M5596j29031
13793F11625P0789K38128J81436j07158k16617L0716J25465j51410O8159j08201
$$ y = [1237718, 1487573, 1324431, 1350378, 1460063, 1145148, 1160084, 1174654, 915504, 1043433, 975851, 858108, 1075551, 1050495, 1166371, 1242773, 1126223, 1201013, 991096, 1562112, 1114345, 1225896, 906005, 827797, 959353, 899098, 934186, 980129, 893829, 935785, 1067180, 1012194, 1225936, 1057906, 932622, 880199, 629576, 1152091, 844444, 1117120, 781449, 1006496, 847591, 953670, 815703, 1159897, 1026995, 998309, 1183254, 1046510, 848178, 1018774, 1125097, 655518, 881780, 1002069, 854686, 864526, 980457, 1007567, 769357, 582477, 935832, 679917, 695788, 783641, 739605, 712460, 682573, 695060, 740656, 611625, 682414, 920542, 1101978, 994820, 778203, 808919, 934384, 782974, 851133, 742932]
13783G42932J68511D17205L84239J6920K3196Q8384l76498l4869L79736k11210
13773F87103O5766O3056l34801K34633q4091j80016L21700N9556J09031k78450
13763F63487J85360C88671L22142M3587l34052M97139k18789l8752J37673n0619
13753G47000K65084D72083J66154K8559j52781L46059l68575J44374k018m6094
13743E87761J68541k84230J98117O8563l00561J20039M97255l59572K93858C41028
13732F71627p1283R0026j1566k45568k0679L77219l07686J82043J25544k84308
13722E05369k996J02248O9558p2014m4606J53110n2796j34838K09467N5039B20932
13710C78535J02834l561j53503J37903J79581j29768J81391p7050n3091J32093
$$ y = [742932, 911443, 417205, 801444, 818364, 841560, 929944, 553446, 518577, 898313, 687103, 752869, 815925, 481124, 715757, 631666, 451650, 773350, 832906, 941937, 663487, 848847, 388671, 710813, 754400, 420348, 917487, 698698, 659946, 797619, 747000, 1012084, 472083, 638237, 666796, 514015, 860074, 491499, 635873, 633855, 587761, 756302, 472072, 670189, 738752, 438191, 558230, 1055485, 695913, 989771, 341028, 671627, 600344, 690370, 678804, 433236, 412557, 789776, 482090, 664133, 789677, 505369, 502373, 604621, 674179, 602165, 557559, 710669, 657873, 523035, 732502, 787541, 220932, 378535, 481369, 477808, 324305, 462208, 641789, 512021, 693412, 616362, 563271, 695364]
13700F95364k74971K26335j3916R1161k41805K05967C36161L28115l16263J12672
13690D60685l4593j44790K06696j70010J73445K10238l13503L527M0063J13608
13680E45366J710A82870K89360n4454J79587j20580J6329l2093J07235B64774
13669D46974M3111N38225C63669o7555K99698k56835j00388J3788K00816C3691
13658E30433r9864k9083K00287j6742k84473J2454K8248J44019j96724p5583K84512
13647D97484j03355L4327o7921K63655J17160B56767L33324j57207r7571N6591
13637C91904J21994o8201q2553j7282K42818J26676L2315k69894A39351L77432
13627E16783j40576L74954C15434Q638n497J7643J93814j71686A53679J17129
$$ y = [695364, 420393, 646728, 632812, 723973, 482168, 688135, 336161, 664276, 348013, 460685, 426092, 281302, 487998, 317988, 491433, 701671, 388168, 391695, 431758, 545366, 547076, 182870, 472230, 417776, 597363, 476783, 493112, 461019, 568254, 264774, 446974, 490085, 1028310, 363669, 296114, 595812, 338977, 238589, 252377, 453193, 33691, 530433, 430569, 401486, 601773, 585031, 300558, 313012, 341260, 485279, 288555, 212972, 497484, 394129, 428456, 360535, 624190, 741350, 256767, 590091, 432884, 335313, 391904, 513898, 445697, 363144, 345862, 588680, 715356, 747671, 477777, 139351, 516783, 376207, 751161, 315434, 324072, 318575, 336218, 530032, 358346, 153679, 270808]
13617B70808E8620L43057A64163K47736p9982A46169L91225j75120J66326j92341
13607C36259J74372J29892j29955M7389n0816k9647J58659k80036R2058A24638
13596B26862J48884K67406q0522A73114L61735j63085L10766B25841L05405J31885
13586F63131l25475L94842B80346J39279J10416B26527K06714j28658J33884O041
13576D44508q3848J54930A75590L4448K13594A57653L04914A13091M60608B07457
13565E79776k86821j06601o9293M34414j19133q4439K1825j25667J08025K3216
13555C75302j72811Q3077O5723j42748L28442o1216K39622a04230A55654J79323
13545C34977j13170K31090n333J3772j68077n2679Q566I9707K32914J06737l4282
$$ y = [270808, 58620, 401677, 164163, 411899, 331917, 146169, 537394, 362274, 528600, 336259, 510631, 640523, 510568, 557957, 507141, 477494, 636153, 356117, 448175, 124638, 226862, 375746, 643152, 562630, 173114, 534849, 371764, 682530, 225841, 531246, 663131, 337656, 732498, 280346, 419625, 530041, 226527, 433241, 304583, 438467, 444508, 360660, 515590, 175590, 210038, 423632, 157653, 462567, 113091, 573699, 207457, 579776, 292955, 186354, 117061, 551475, 432342, 347903, 369728, 244061, 352086, 375302, 202491, 285568, 351291, 208543, 536985, 475769, 715391, -104230, 155654, 334977, 221807, 452897, 447564, 461336, 293259, 240580, 249146, 99707, 332621, 439358, 405076]
13534D05076A35693i016D2087M42139A24756R7761O4920J37346k6657J93559j31608
13523D60077j65883R4413E3305K20089F8694J24982r5531R926K58613J8016a3530
13511D53774q4407A60094L8224q423K576r5903m1901e683D02668J9862O5672j06867
13499C81335J35787j70038j57088m1718A6278J53738R0712k2741o9611C4426J45607
13488A80033k6308K17645j81006F4704J53032C1117L58723A80016K27405j79296
13478B28125l6101k4961d4439C54889K6836j13091e794C17850q5974J59181J3980
13467D05037A35557J20873K4981J51910j2820k03202K16562A01244J33838A12714
13456C44156A47670K59799q4414o5556d9499A38163K38390q1761J18564D3026
$$ y = [405076, 135693, -9016, 42087, 484226, 124756, 222517, 287437, 424783, 398126, 591685, 460077, 294194, 388607, 53305, 273394, 68694, 193676, 98145, 108071, 366684, 384700, -13530, 453774, 369367, 160094, 198318, 189895, 192471, 96568, 54667, -5683, 402668, 422530, 488202, 381335, 517122, 347084, 189996, 148278, 16278, 170016, 260728, 237987, 168376, 34426, 180033, 153725, 371370, 190364, 64704, 217736, 31117, 389840, 180016, 407421, 228125, 192024, 167063, -44439, 354889, 381725, 268634, -5794, 317850, 231876, 391057, 405037, 135557, 256430, 281411, 433321, 420501, 217299, 433861, 101244, 235082, 112714, 344156, 147670, 407469, 323055, 257499, -49499, 138163, 376553, 294792, 413356, 43026]
13445A27572L08683j72730O0005n6086m1276K6013B7171L16515H3772P42938A10176
13433D34949F462J30696J04400i589B72588j01820c3581C31590A22098h403C08238
13421A25043a63005C60501N5389I9412Q1100L14946p4783A00363J12117o0815
13411A51665F6147K27142b143B38768K09044k01736O1540K8027A33676P9127A05803
13399f061E00270A61720f2502C62623A12339L77803A46749A6096L67964A79279
13388B90474j16854F6202M56871k59186K5856f6408G8469L85377j09054j44323
13378B10469e5470B8131a02943A37558J13339b5381C9351L00888J4414I4372m4368
13367E0004J71733e0062m24A33261k3611J07663J06218L4729K35386A76949n5829
$$ y = [127572, 436255, 263525, 323530, 267444, 226168, 252181, 27171, 343686, 83772, 826710, 110176, 434949, 6462, 137158, 241558, -9589, 272588, 170768, -33581, 331590, 122098, -8403, 308238, 125043, -163005, 360501, 415890, 99412, 180512, 495458, 420675, 100363, 212480, 151665, 66147, 293289, -2143, 238768, 447812, 246076, 307616, 335643, 133676, 212803, 105803, -6061, 500270, 161720, -62502, 362623, 112339, 490142, 146749, 16096, 384060, 179279, 290474, 173620, 66202, 523073, 263887, 289743, -66408, 78469, 463846, 354792, 210469, -55470, 28131, -102943, 137558, 250897, -25381, 39351, 340239, 354653, 94372, 50004, 221737, -50062, -50486, 133261, 109650, 217313, 323531, 358260, 593646, 176949, 121120]
13356A21120j7989K97930G8228J79333m5372J24065k5917R1406A79140J54486
13346C33626m3836J9111k3709r6626J1731q5870J51103J8905m5986j04371L7564
13335A71642J81445q969J35592k01727A28439L51339A45386J41839j02152p9400
13325A05673M71048j00987B12489R2411A44833J78537A35970m4222h051D51005
13314C15609K0131n0921P1884r5366J35017d0652A23264E8652L65540j04293R0732
13303D10631E8135N9210b693F2040J07653p760m128K40873A79592l9002J2259
13292A52849C1756j2368L1873L8057J86392C4924a58217B28543K5748C1194a1881
13280D9833J93901A06847a9276B39573P5148A41815J49923F3116g0020A90031
$$ y = [121120, 103131, 401061, 78228, 257561, 212189, 336254, 310337, 401743, 179140, 333626, 289790, 308901, 285192, 188566, 200297, 114427, 265530, 284435, 238449, 134078, 171642, 353087, 344118, 479710, 277983, 128439, 479778, 145386, 287225, 185073, 105673, 576721, 475734, 212489, 304900, 144833, 323370, 135970, 91748, -8051, 451005, 315609, 335740, 284819, 356703, 261337, 396354, -40652, 123264, 58652, 424192, 319899, 410631, 58135, 117345, -2693, 62040, 169693, 161933, 157805, 398678, 179592, 140590, 152849, 31756, 19388, 51261, 89318, 275710, 34924, -158217, 228543, 254291, 31194, -11881, 49833, 243734, 106847, -19276, 239573, 314721, 141815, 291738, 63116, -70020, 190031]
13269A28330k1242P3204m9311n9616k4091g362D1320L00415h145B63079q7796
13258A75283m3251c9014B289a84971O5283A29034J79011Q0390a50990B94748b19
13246C4913j7237M5866J9830b70873B25193c0283A77045a91142N6555B76590i9643
13234b15693C07921l1687F2058J11690D1541a09994l9992A20787M40932A40421
13223E112O4278J92692J0455l2675r0592D6599L6424L17569c5643k60318b3023
13211A49071N1037l3404O1447a65628D0748K37490b01036A25089B5832M60089
13201D85921G4115A2449J39544o0746L26880A72053j8041p3745k032a18345B0141
13189H1200j7911d9045B16344A01696N2882L0899Q6835L872J01035J7063A55530
$$ y = [128330, 107088, 180292, 130981, 71365, 47274, -7362, 41320, 341735, -8145, 263079, 175283, 132032, -39014, 2289, -184971, -119688, 129034, 308045, 388435, -150990, 294748, -219, 34913, 17676, 63542, 83372, -270873, 225193, -30283, 177045, -191142, -134587, 276590, -99643, -215693, 307921, 276234, 62058, 173748, 41541, -109994, -149986, 120787, 561719, 140421, 5112, 69390, 262082, 272537, 239862, 149270, 46599, 83023, 400592, -35643, -295961, -23023, 149071, 200108, 166704, 228151, -165628, 40748, 278238, -201036, 125089, 25832, 485921, 74115, 12449, 151993, 91247, 418127, 172053, 154012, 80267, 78235, -118345, 20141, 81200, 63289, -49045, 216344, 101696, 154578, 185477, 272312, 276184, 377219, 394282, 155530]
13177g3593D8047e3241D29919J1808a36520D264K67767A01100P0560J1086P4997
13166B57743K2749a47050f7871B17466e3772A92189m8247N5321E3395R5136E3224
13154B87984m5602J85755I9831i6046H8169J69215o8513A7444J51400J96323A37628
13142b533C7622L51796j87486G6805L15462b18237F4517L37767g8494n1201c8235
13130C30018A18394K02574A14222a13716A3443d20114E1896O1946b55708A27939
13119H1218A5124a9659C21848j43456M0745C4939e2023A03275j2953l863f628
13107H3172a20960b2382A30737J2174b59767N2465c5421k82210g0427l2031A60678
13095b04156C2952i6792j12350A84149J14630H8380K75473A78916Q7053m5015
$$ y = [-73593, 48047, -53241, 429919, 441727, -136520, 4264, 272031, 101100, 171660, 182746, 257743, 280492, -147050, -67871, 217466, -53772, 192189, 143942, 199263, 53395, 148531, 53224, 287984, 242382, 428137, 99831, -96046, 88169, 257384, 188871, 17444, 168844, 365167, 137628, -2533, 37622, 389418, 201932, 76805, 392267, -218237, 64517, 402284, -78494, -129695, -38235, 330018, 118394, 320968, 114222, -113716, 13443, -420114, 51896, 113842, -255708, 127939, 81218, 15124, -19659, 321848, 178392, 219137, 34939, -52023, 103275, 90322, 86459, -6628, 83172, -120960, -22382, 130737, 142911, -259767, -207302, -35421, -317631, -70427, -102458, 160678, -204156, 32952, -96792, -209142, 184149, 298779, 88380, 363853, 178916, 265969, 220954]
13085B20954I9925b5939B2571K03187E1823J54352K0656J20476D6522J10048N0733
13074B07303e4277k14679e6693D41409A32188b57419C0643K09342i0923A3078
13063C2006a64118A05218J85715j09970H0745R6669a3867A40842J42155o0227
13053B22770J25867c3966B6518J53289g980l14055c5179C20393B0178L4565J5999
13042G0742d9750B37500F7744e1158A13223K05026k7955p2030e7367C08928F3508
13030e3879J3570A05983f6188j06630N9778j486k45182B9087J95516A04274e7225
13018C8560L46091q5658A10331a82231E5427J96261d9063B34438A07052K95189
13008D02241g7762C49862G9228K99146B6282P2915K24425j57365j5283D4764L8846
$$ y = [220954, 99925, -25939, 22571, 225758, 51823, 206175, 226831, 347307, 46522, 156570, 207303, -54277, -268956, -56693, 441409, 132188, -257419, 30643, 239985, -90923, 13078, 32006, -164118, 105218, 290933, 180963, 80745, 177414, -13867, 140842, 282997, 222770, 348637, -33966, 26518, 179807, -7980, -322035, -35179, 320393, 20178, 54743, 70742, -49750, 237500, 67744, -51158, 113223, 318249, 290294, 218264, -57367, 308928, 63508, -53879, -40309, 105983, -66188, -172818, -113040, -114526, -359708, 29087, 224603, 104274, -57225, 38560, 384651, 298993, 110331, -182231, 55427, 251688, -49063, 234438, 107052, 402241, -77762, 349862, 79228, 378374, 26282, 99197, 323622, 166257, 150974, 44764, 83610]
12997H3610K4977K9754F519b6989B26663P2374o5311n1664p5390d3290j25852
12986a69142B1413K21552p2205p1116K05428b5572I2835e0259o1281E9561h2064
12974B56666I1568a10746C39985c9856j7627A79848H4065C9543a88517d2391A89568
12962A03504k3177J37555j9060i1955e746B77614B8951P4806b25572B88242H8777
12950f3954A58686J44311l9313i2333B30423f9577e081l5514B02652g286A45647
12938g5738B05040a30545B40356Q3510j50610k2157a93094a3049E009J10553M644
12927A20206O0019a3551k16680B0214J7449J90264d6183A62236J2731c4886j59324
12916a94210O1865A23354b06828p924A91134a21498J0881C30545J42739p6005
$$ y = [83610, 108587, 138341, 6519, -26989, 226663, 299037, 233726, 182062, 106672, -43290, -169142, 21413, 242965, 170760, 99644, 305072, -25572, 92835, -50259, -111540, 59561, -82064, 256666, 91568, -110746, 339985, -39856, -57483, 179848, 84065, 39543, -188517, -42391, 189568, 103504, 80327, 217882, 198822, -91955, -5746, 277614, 28951, 103757, -225572, 288242, 88777, -63954, 158686, 302997, 263684, -92333, 230423, -69577, -5081, -40595, 202652, -7286, 145647, -75738, 205040, -130545, 240356, 323866, 173256, 151099, -193094, -13049, 5009, 115562, 120206, 180225, -13551, -230231, 20214, 37663, 227927, -46183, 162236, 174967, -34886, -194210, -132345, 123354, -206828, -214752, 191134, -121498, -110617, 330545, 473284, 397279]
12906C97279A80957J12326h3226G7410h2995B10551E4842G143b17237M4235C44795
12894A31776a51965M8294D99508A20140J2138a98696C1219b86010J36771B43195
12883a17287M1461j05519l515N1271C7983K54690A41260e7843k0563A64778k7487
12872A37291J0750J20074D3382K6895K25306B152J78417a34804D44850o7993a94627
12860g5014L2120E1635B8M3633J02794b06314l9798E2609L1008J25663r0717n6729
12848F1834f129C32711A64583J45244e8649I3947a7923k59173A84726a84428j40520
12837c24948A07619h7776C2318N7024M1555b38861f5420m6802n3449j33931g3228
12825d3762G2031A7852K70258a47486C7297J15011O8746a89055G5720g826l8382
$$ y = [397279, 180957, 293283, -83226, 77410, -82995, 210551, 54842, 7143, -217237, -173002, 344795, 131776, -151965, -103671, 499508, 120140, 132278, -198696, 31219, -286010, -149239, 243195, -117287, -75826, -181345, -184860, -133589, 37983, 292673, 141260, -57843, -78406, 164778, 137291, 148041, 268115, 43382, 70277, 295583, 2152, 180569, -134804, 444850, 376857, -194627, -75014, -42894, 51635, 28, 43661, 146455, -206314, -246112, 52609, 83617, 209280, 118563, 61834, -6129, 332711, 164583, 309827, -58649, 93947, -17923, -277096, 184726, -184428, -324948, 107619, -87776, 32318, 89342, 130897, -238861, -65420, -112222, -165671, -299602, -73228, -43762, 72031, 17852, 288110, -147486, 37297, 152308, 221054, -189055, 75720, -7826, -46208]
12814d6208D26022c95610b0891r1692N5455D2134g9912I1817P0821G7902a63870
12802h2131j67703a14751A21926j7929J62415b01596Q3574o0930A71292b62762
12791H8774b4684E211a69646o7778d24C43186b53146k4095F1239i2365C05965
12779C67786r8771c5707p51C4719h8230B19674k4151a59429K1565N1467j19498
12768b05895c1154A15346f2432m59647A48694h5782F9805B7368c20047B0314J72009
12757A92323m3118l8927J9941l6531l8880O8223C4582b21954J08610G4608a66066
12745A61068J63839G6195K65006a74266o6456K6765M7545q204H7124i2293c0253
12733D3236b251A25829J749n3997c54488d9331C4115b3805A46266A957J33631
$$ y = [-46208, 426022, -395610, -20891, -112583, -57128, 42134, -79912, 91817, 162638, 77902, -163870, -82131, -249834, -114751, 121926, 103997, 266412, -201596, -118022, -178952, 171292, -262762, 88774, -24684, 5211, -169646, -237424, -424, 343186, -253146, -277241, 61239, -92365, 305965, 367786, 269015, -35707, -36458, 34719, -88230, 219674, 195523, -159429, -137864, -86397, -205895, -31154, 115346, -62432, -522079, 148694, -85782, 69805, 27368, -320047, 20314, 192323, 149205, 110278, 130219, 93688, 54808, 123031, 34582, -221954, -113344, 74608, -166066, 161068, 324907, 76195, 341201, -174266, -240722, -213957, -166412, -174616, 87124, -92293, -30253, 43236, -2251, 125829, 127578, 73581, -354488, -49331, 34115, -23805, 146266, 1957, 135588]
12722A35588a3101o3853E1338R0743F2852n594e2482A54751B9374j367p531J02477
12710A22953a86456B16982F7122a52428C73747c9267C201K67748b13268C24943
12699B40993J12889j58383g0371A17406M4332B1633J05922k9541A0559P6241R8224
12688A85024q1691J97440D1498J70224J25508h4261G2376B2828b5395q3695A28992
12676A070J324J65912K40758f1729j56383C3087c72215A43644a21080A99484l2782
12665A66702K46140G4461B9292f6715A33342J3430J57482A09247K5924f6357C76414
12653e2579B16345j04928h736E7770a9806A92784n4399m7014Q3034o4194D2735
12641g422D10710A42510K11883F5344J39116o2523a05839I0150A3303O5946K88974
$$ y = [135588, -13101, -76954, 51338, 142081, 62852, 57258, -52482, 154751, 29374, 28007, 20476, 122953, -186456, 216982, 67122, -152428, 373747, -39267, 3201, 270949, -213268, 324943, 240993, 353882, 195499, -70371, 117406, 161738, 21633, 127555, 98014, 10559, 86800, 185024, 103333, 300773, 41498, 211722, 337230, -84261, 72376, 22828, -25395, -109090, 128992, 1070, 2394, 168306, 409064, -61729, -218112, 33087, -372215, 143644, -121080, 199484, 166702, 412842, 74461, 29292, -66715, 133342, 146772, 304254, 109247, 135171, -66357, 376414, -52579, 216345, 111417, -8736, 57770, -19806, 192784, 138385, 91371, 174405, 110211, 42735, -7422, 410710, 142510, 354393, 65344, 204460, 141937, -105839, 90150, 13303, 79249, 368223]
12630C68223a60240b5734E4229Q4433J95904I9706L438J0272a926m5183k74139
12619c21248A36618A8297a1590C6721e821B54815I4220j0771J90456m8712a16910
12607A23590k1950J36984j07716J43894J30204A85124h6230b2551L345F8372a04984
12595c8328n0534A4948i6032A22650g9855A47366d02670a57785B82370p9076k3995
12584A79299a15521H5791K55879b19537B03033j01435M2261c1061C80753d0899
12573a85453E0068J23951B2467K9742O305b23054A53674C0557f661p2757G1245
12561d5084B32694a86778O0763C61843A74323j8232O104N228P5406a482C05421
12549A98070H382i3642B42663c03027B5195b4233m25556F4379c9460N021A11954
$$ y = [368223, -160240, -25734, 54229, 138662, 334566, 99706, 103144, 113416, -1926, -47109, -321248, 136618, 18297, -11590, 36721, -5821, 254815, 94220, 83449, 273905, 225193, -116910, 123590, 101640, 238624, 130908, 274802, 405006, 185124, -86230, -22551, -19206, 68372, -104984, -38328, -88862, 14948, -96032, 122650, -79855, 147366, -402670, -157785, 282370, 203294, 179299, -115521, 85791, 341670, -219537, 203033, 101598, 143859, -31061, 380753, -40899, -185453, 50068, 174019, 22467, 52209, 58514, -223054, 153674, 30557, -6661, -79418, 71245, -45084, 232694, -186778, -126015, 361843, 174323, 156091, 162195, 167423, 242829, -1482, 305421, 198070, 8382, -93642, 242663, -303027, 25195, -24233, -449789, 64379, -39460, -34439, 111954]
12537I4065m025K2167N2374C7559a83082d3635b4p9459K1219a1624j43151j4982
12525a69757I2981a22016M7883J5923J6731j9892k04688a21470c9286F4950c39522
12513C95673c9454I3261g208l21140G0576a09597r8384L3445A99504K1973d8628
12501B3512b90663Q0230B25994c9470j41991A89015a35875j85760A76647j9917
12491A56730D2940a44753L5894o8730H1649a97332O1296j7571g0299A72860a6882
12479B11186a96332Q6612k92256A20508f279m3156n1821D01500A32844A1393a05435
12467b68008f534j97136O7349C61681E8266k0981K82428j16063a6306C2977d38666
12455a93821c8725j30056A27136e7654r3543m0878D3779J13601E3061a08351p8708
$$ y = [94065, 90040, 112207, 164581, 37559, -183082, -43635, -24, -79483, -58264, -11624, -154775, -169757, 92981, -122016, -74133, -58210, -41479, -61371, -266059, -121470, -39286, 64950, -339522, 395673, -39454, 93261, -7208, -328348, 70576, -109597, -207981, -174536, 199504, 221477, -48628, 23512, -290663, -210433, 225994, -39470, -181461, 189015, -135875, -321635, 176647, 156730, 42940, -144753, -108859, -177589, 81649, -197332, -136036, -153607, -70299, 172860, -16882, 211186, -196332, -109720, -401976, 120508, -6279, -49435, -101256, 401500, 132844, 11393, -105435, -268008, -6534, -203670, -136321, 361681, 58266, 37285, 319713, 203650, -16306, 32977, -438666, -193821, -38725, -168781, 127136, -57654, -151197, -192075, 43779, 157380, 53061, -108351, -187059]
12444a87059A63627j9277J01434J31100c6298A11855K5563b99763d3363B463a41025
12432b0446k7464A47139H409b3838k4534A72809F7004O7133h9947B34161m1170
12421A92991g4240D6041b5883p8950j39449A56586i49A91026e5205b5082j75331
12410b00413B32187N144J91312d01345J94192j57909I5233A9526b1199H004K1249
12399B9253J42424a93866A35569k3786h8380k79310a78843g8401K0239q4779B94773
12387c94271I292g1970B72853d5103k0851m6586J5975p7682P2972k20955B3570
12375A14228b48687K238a00644L9838a5021j16818d99k2098m7608n9189j8560
12364a47954e5780I3677d26878i061C15330a35307B61519n4258b11649Q0172N7173
$$ y = [-187059, 163627, 144350, 245784, 376884, -36298, 111855, 137418, -299763, -43363, 2463, -141025, -20446, -47910, 147139, 8409, -23838, -48372, 172809, 67004, 134137, -89947, 234161, 192991, -74240, 46041, -25883, -104833, -244282, 156586, -949, 191026, -55205, -25082, -200413, 232187, 237331, 428643, -401345, -207153, -365062, 95233, 19526, -21199, 8004, 29253, 171677, -193866, 135569, 111783, -88380, -367690, -178843, -78401, -58162, -142941, 294773, -394271, 9292, -71970, 272853, -45103, -65954, -112540, -96565, -174247, -101275, -322230, 23570, 114228, -248687, -246449, -100644, -60806, -15021, -131839, -499, -22597, -70205, -129394, -147954, -55780, 93677, -426878, -9061, 315330, -135307, 261519, 207261, -211649, -131477, -74304]
12353g4304H7605J17682I4779N4201b08751E6449J8579b90779M9661N3534B06115
12341a06549C7738O8451L6717b6538F0216a09851I9161K7414a18835H1346Q4590
12330A65936J58340b9755I6920I073c6494B18193m731a20738n719B13406I2988
12318I8247a71262j54382C1058P8810b12983E2839j9927K34949n2393b6848B72973
12306B32537c53808A98657G4982a60858k04456a48832A8492b70084A52159B1282
12295d7259A50582a38993A73337d2186B26367q5031K06618A04422B906J97367
12285B00273G934d2155A15367a43264A25099d21766A1192J80707E1792L3325J22592
12274B07709b95655A95033G8458b24150A37817a4065C19169j56296A2497f0702
$$ y = [-74304, 87605, 205287, 94779, 148980, -208751, 56449, 75028, -290779, -241118, -187584, 206115, -106549, 37738, 106189, 142906, -26538, 60216, -109851, 99161, 126575, -118835, 81346, 165936, 324276, -29755, 96920, 9073, -36494, 218193, 213462, -120738, -126457, 213406, 92988, 98247, -171262, -325644, 31058, 109868, -212983, 52839, 32912, 267861, 215468, -26848, 272973, 232537, -353808, 198657, 74982, -160858, -365314, -148832, 18492, -270084, 152159, 21282, -47259, 150582, -138993, 173337, -42186, 226367, 141336, 347954, 104422, 2906, 200273, 7934, -42155, 115367, -143264, 125099, -421766, 11192, 191899, 51792, 85117, 207709, -295655, 195033, 78458, -224150, 137817, -14065, 319169, 162873, 12497, -60702]
12263i08k15817B46924Q1927a0400A02350f7328B17329j3169L5363f9166A63008
12251a76461c1352j30812B94899b82854C70728A70473k9114r026Q7480r1258K5106
12240A53661j0994a72241c6233A10470J56834L5298J14258M4523B2346d9983j16616
12229a66599N1501n0764A91576q7203L07460a08100M8298D37272B1719e2767R625
12218d3142B52162D3408K4999a75171c9282D38469j44382L8619b9482B80462A17112
12206C84404g3847A45140j2766J9819O3853R4156F3494F981h9981L8842A79930
12194B53904p171F555P7876b16620a6299E1273M2542g1863E95353b54552I8456
12182C59217p8232q217F1827i499m4618G0642B0972P5923J57219L07284G4531
$$ y = [-908, -216725, 246924, 328851, -10400, 102350, -67328, 217329, 204160, 239523, -69166, 163008, -176461, -31352, -162164, 294899, -282854, 370728, 170473, 141359, 132333, 219813, 128555, 153661, 142667, -172241, -36233, 110470, 267304, 302602, 416860, 461383, 22346, -49983, -166599, -115098, -165862, 191576, 104373, 411833, -108100, -59802, 437272, 21719, -52767, -43142, 252162, 43408, 68407, -175171, -39282, 438469, 294087, 332706, -29482, 280462, 117112, 384404, -73847, 145140, 132374, 152193, 216046, 310202, 63494, 6981, -89981, -51139, 179930, 253904, 246733, 6555, 84431, -216620, -16299, 51273, 93815, -71863, 595353, -254552, 98456, 359217, 280985, 272768, 61827, -9499, -54117, 70642, 20972, 96895, 254114, 561398, 74531]
12170a97162H9313J04087a50692H7585O8542d2150j01587A86772J40877A57667
12159A41487J83819M0725p4344N6330g8763p9206O8496C79652b0739p7075A90700
12147E57091c70012C33541f6129J5332A60825J86119j59101n0357o1334L2483
12137A08635J41020a59823O8628A57655B5147O0869c101k4058D7365g590E3033
12125A47692C7097i0023j8355A60922f3704o2533a8393F4307b14276Q14A74525
12113e734j71293j7017n3392n9795A1501e8388M542j4576A66471D1493c8634p4535
12101a13169E77973k14217c48250i071p0480C57463G7216d1686G5614K78351A24791
12089A12523K98107a90377j26717a49139a8428B13554J90018j33592b26602A97413
$$ y = [-197162, 89313, 193400, -150692, 87585, 156127, -42150, -143737, 186772, 327649, 157667, 141487, 325306, 366031, 291687, 348017, -78763, -157969, -89473, 379652, -20739, -97814, 190700, 557091, -370012, 333541, -66129, -50797, 160825, 346944, 187843, 137486, 76152, 108635, 249655, -159823, -91195, 157655, 25147, 86016, -3101, -27159, 47365, -7590, 53033, 147692, 37097, -90023, -108378, 160922, -63704, -126237, -18393, 64307, -214276, -213462, 174525, -5734, -177027, -194044, -247436, -307231, 11501, -58388, -53846, -68422, 166471, 41493, -38634, -113169, 577973, 363756, -348250, -9071, -79551, 357463, 77216, -41686, 75614, 353965, 124791, 112523, 410630, -190377, -317094, -149139, -18428, 213554, 403572, 269980, -226602, 197413]
12078B499J338J1849a15903F9706O2152n8564B9955K15099l9883a20814A16488
12066E426a2847D6649J50327h6343a8047B23842e266C5321K0047K39468M2121
12055C36957K84610Q96558o00673D54927B22769R9860n0858o7118G6895b9771
12044g0960l8975j88618d445B23153R1298A1833a11058C5449b25222Q1374B6978
12032A749b39356C50163F2271J35694h2392H5478h3732j9591c3437B05976O0332
12021B66308a30896A24509h058o24654i1433j51230f8447A15626R8403p9982L5400
12010A69447b1875b569G9912f6722H1129b14891e1650r965B34100B1787e8996
11998b51472B4194d1654o7088N955A99454e16589i4679A14708b80604b9074j46995
$$ y = [2499, 3837, 15686, -115903, 69706, 131858, 73294, 29955, 245054, 205171, -120814, 116488, 5426, -12847, 46649, 196976, -86343, -18047, 223842, -5266, 35321, 55368, 294836, 336957, 621567, 1518125, 917452, 454927, 222769, 322629, 271771, 204653, 76895, -29771, -70960, -109935, -298553, -4445, 223153, 314451, 11833, -111058, 35449, -225222, -143848, 26978, 1749, -239356, 350163, 62271, 197965, -82392, 85478, -83732, -103323, -33437, 205976, 266308, -130896, 124509, -8058, -632712, -91433, -242663, -68447, 115626, 214029, 134047, 169447, -21875, -2569, 79912, -66722, 81129, -214891, -51650, -61615, 234100, 21787, -58996, -251472, 24194, -41654, -108742, -102787, 199454, -516589, -94679, 114708, -280604, -29074, -176069]
11987a76069j86083d1470r756A58028g0761A65030a10351F1300K9978a05550A5918
11975B07520f73k68084J11385A47591E3298b02562R0101A97053L7359F8942a16556
11963E2909a12212o0580A16607M9384a95562p5374J8941a05795k92436I7662g5577
11951B28213d2896C0407h6871j20557K6613L6779A4807P7979A0631J51262h5087
11939A12060b74509k00644A38012N452J5381J9772A6871g9618b8187j4841j28302
11928a71330B57465B7747P9077a17247G5527h9556l14155B34026b45350B75555
11917A58867E8222L28648I4797B1533K11007a4944F4878J1113a75370o291H443
11905b96877N2911a2567j75660B42346n0431H8327k1742p527b14698a02306n4869
$$ y = [-176069, -362152, -41470, -51226, 158028, -70761, 165030, -110351, 61300, 91278, -105550, 15918, 207520, -673, -268757, -157372, 147591, 53298, -202562, -112461, 197053, 234412, 68942, -116556, 52909, -112212, -172792, 116607, 165991, -195562, -270936, -251995, -105795, -398231, 97662, -75577, 228213, -42896, 30407, -86871, -207428, -180815, -144036, 14807, 92786, 10631, 161893, -85087, 112060, -274509, -475153, 138012, 143464, 158845, 178617, 16871, -79618, -28187, -43028, -171330, 257465, 27747, 106824, -117247, 75527, -89556, -403711, 234026, -245350, 275555, 158867, 58222, 386870, 94797, 21533, 232540, -14944, 64878, 75991, -175370, -181661, 8443, -296877, -243966, -12567, -188227, 242346, 191915, 88327, 66585, 59058, -214698, -102306, -157175]
11894a57175l4251H2730c31310e0572E4290b70542h7806c7997l5094D1908d2407
11882f3087H6747b309r9812l33994B08817b71825H5304N1924C6973M1186a75088
11870i75m3205j6987D3065a53136B9252f5101l5316a0352F4443b56133H4457N378
11858H9835c9405A2256J61307a6597F3131b09056C7148b43751l85174h420k7139
11847c5559D3065K24969c9533k71227k1548D0429P6557E7545J1926N5127Q619
11836A33217i9149A07962J44905h5878F5580b27531F0994a89782L8403e729A70675
11824b09325c3483F647d097k81085A92050D7753C341Q9871j930K14273A49080
11812e6584o2381G3905J1498c44228O2853J34685e6444j01583H4929J67965g9789
$$ y = [-157175, -191426, 82730, -331310, -50572, 54290, -270542, -87806, -37997, -73091, 41908, -42407, -63087, 86747, -2309, -102121, -436115, 208817, -271825, 85304, 137228, 36973, 78159, -175088, -975, -44180, -61167, 43065, -153136, 29252, -65101, -100417, -10352, 64443, -256133, 84457, 89835, -39405, 12256, 173563, -16597, 63131, -209056, 37148, -243751, -628925, -8420, -35559, 43065, 268034, -39533, -310760, -332308, 40429, 116986, 57545, 69471, 124598, 133217, -99149, 107962, 252867, -85878, 65580, -227531, 60994, -189782, -151379, -5729, 170675, -209325, -33483, 6647, -4097, -285182, 192050, 47753, 3341, 93212, 91282, 305555, 149080, -56584, -118965, 73905, 85403, -344228, -281375, -146690, -56444, -158027, 84929, 252894, -79789]
11800G0440J71286j09361c38024a25406J4390r1454R1966I4975a07079k73402
11790c80481a16502D2767b11914j5245B74829a48400j35864D7722e6476j20055
11780a76531K3802A65708d1306A25840C1581a58749a978r8655k90851Q0043c3028
11768A36737l07a53091G6546a05195L2568a873j45788O3804C73499q1280a72161
11756c3192j66509M7601g2931l03046h5685A74845b63008K212A14140a48796G8869
11744a44199D0583K2072F004b26982B69169A06986J1593C1624K20948C2690a50592
11732a55012A87479h6981a4642a883k09773K6960P9258a1309R36A53354d8091
11720B06654N3844A27634f0247E587b2610A09870b29224G710a24344B03624R1823
$$ y = [70440, 241726, 132365, -338024, -125406, -111016, -202470, -110504, 94975, -107079, -380481, -116502, 42767, -211914, -227159, 274829, -148400, -284264, 47722, -56476, -176531, -152729, 165708, -41306, 125840, 31581, -158749, -1978, -100633, -391484, -311441, -33028, 136737, 136430, -153091, 76546, -105195, -72627, -1873, -147661, -83857, 373499, 292219, -172161, -33192, -199701, -152100, -72931, -375977, -85685, 174845, -263008, -260796, 114140, -148796, 78869, -144199, 40583, 62655, 6004, -226982, 269169, 106986, 118579, 31624, 252572, 32690, -150592, -155012, 187479, -86981, -14642, -1883, -211656, -184696, -105438, -11309, -10373, 153354, -48091, 206654, 260498, 127634, -60247, 5587, -22610, 109870, -229224, 7710, -124344, 203624, 295447]
11709B95447b1801B337O1823a31307B63702e8716k57850J46351A48327e0021J4697
11698c5324C45317n3897o5823J36310b82294B52955F2962k8122N4649N5774h571
11686a01670A590K22298A6308a3659j290B62556E7003A0255J45300a28939m9412
11675a78351O7796B90357c18448B2562L6843a11527L7373B07758a44669A2613
11664G9874e957k33597g2378A40444a20030C4651p849f6726a472A70167J64226
11653C34393h5505a0065C13885D8596b43299A73230m5872J13459D3068e9221j99411
11642b58632R7185f5944j9374a276q636G6687K15117A05672a41167D8029a8440
11630a10643Q726k18616A04031B7178a67525f4356F0201a00011C7333J1072M8781
$$ y = [295447, -21801, 2337, 64160, -131307, 263702, -58716, -316566, -170215, 148327, -50021, -35324, 345317, 291420, 225597, 361907, -282294, 252955, 62962, 34840, 89489, 145263, -8571, -101670, 1590, 223888, 16308, -13659, -14949, 262556, 57003, 10255, 155555, -128939, -178351, -110555, 290357, -318448, 22562, 59405, -111527, -74154, 207758, -144669, 12613, 79874, -5957, -239554, -72378, 140444, -120030, 34651, 26802, -66726, -1472, 170167, 334393, -85505, -10065, 313885, 48596, -243299, 173230, 127358, 240817, 43068, -59221, -258632, -161447, -65944, -85318, -1276, -9912, 76687, 291804, 105672, -141167, 48029, -18440, -110643, -101917, -320533, 104031, 27178, -167525, -64356, 60201, -100011, 37333, 48405, 97186]
11619I7186d8292C5982J64700H9712a46737c97F0614h5506A36981i3112G913o77
11607G236b17688D0542L9246b63478h5887j42492f8413A95740a02508q5411Q0316
11596a07603J3538A43971a97991R4057M5634l12491a10337j479A27256k3450a20050
11584C31026A24980a15718A03414a47745A73883a4963E6682J37500J1036b25590
11573E5216g1207k1648E14224c20734N2939d7669l44991f1319A81172q5805K7929
11562A23296a36326H6306i7879B00680K4721o9284J704a08184B10285c40615a06530
11550I5895i5856A50923A0593J95159A0803h8849A46301f5637A15791a83132E2508
11538b20128j77472A78518B1507a01968B86266j03072a61602G4540P2730n6775
$$ y = [97186, -48292, 35982, 200682, 89712, -146737, -397, 60614, -85506, 136981, -93112, 7913, 7236, -217688, 40542, 79788, -263478, -85887, -228379, -68413, 195740, -102508, -187919, -107603, -94065, 143971, -197991, -103934, -58300, -370791, -110337, -111816, 127256, 103806, -120050, 331026, 124980, -115718, 103414, -147745, 173883, -14963, 56682, 194182, 205218, -225590, 55216, -71207, -92855, 514224, -320734, -267795, -47669, -392660, -61319, 181172, 95367, 123296, -136326, 86306, -97879, 200680, 225401, 156117, 157821, -108184, 210285, -340615, -106530, 95895, -95856, 150923, 10593, 205752, 10803, -88849, 146301, -65637, 115791, -183132, 52508, -220128, -397600, 178518, 21507, -101968, 286266, 183194, -161602, 74540, 147270, 90495]
11528I0495k8023K35293D5306J63271A02413m0911i5197D2067b90987B12563q9116
11517A23447c33294C6313J93618a8772B45302f1989a6310F5231O3218k8899D7565
11505c04601A46178b28016J5443B01166b73892A87731p4683a16393j13500c8073
11494C09557F2838a3392D96d02153I9207J68031A03215A1515J84814N5291a95100
11482E3813J96869k6229O941c01701D4893P561K77515c1141D09593j64397F670
11470A85348B9806J5406K60216e6347E16P7680L48398b85563A98338q7711L47377
11459D58004A76881m3882J62617h4506A77029L7382Q4458m6401n4346h4083A37441
11447F6759R4035C4638L40590B1836b2357n8718C43779q6759A13610B9062d07797
$$ y = [90495, 62472, 297765, 45306, 208577, 102413, 61502, -95197, 42067, -290987, 212563, 123447, -333294, 36313, 229931, -18772, 245302, -61989, -16310, 65231, 128449, 99550, 47565, -304601, 146178, -228016, -212573, 201166, -273892, 187731, 113048, -116393, -229893, -38073, 309557, 62838, -13392, 496, -402153, 99207, 267238, 103215, 11515, 196329, 251620, -195100, 53813, 250682, 224453, 231394, -301701, 44893, 52454, 329969, -31141, 409593, 245196, 6670, 185348, 29806, 45212, 305428, -56347, 516, 78196, 426594, -285563, 198338, 110627, 458004, 176881, 132999, 295616, -84506, 177029, 214411, 298869, 252468, 198122, -84083, 137441, 66759, 160794, 34638, 375228, 21836, -22357, -81075, 343779, 257020, 113610, 29062, -407797]
11435E33172C7297N2823g2392o2356d0379O804E4401g9482B39665F7092J69076
11424B36168J23515A73688M59523i2650I6296d03456A19036a59074J6965e9304
11413a5590k62102P0813f6409B0217J00875k2225i021I0097d20980F3844a03989
11401h4732f888B27107J90111g9233A88926q4990M5901c47984J24745i8736M7338
11390e1398A6288J09255a11693h005k58219a28516B7808L127b49462f9862A25979
11378c0840I7754a97462E8095b93065A5105b70978J28747O8268j15351b4921j0014
11367c4935B7452d19924b2931D9040J4036a91585A54795a93938A31173d41922
11356B87464A39608a86850P8681A14096C7945b84820A07582a33330f0915A47133
$$ y = [533172, 37297, 90120, -72392, -134748, -40379, -33575, 54401, -79482, 239665, 67092, 236168, 359683, 173688, 633211, -92650, 96296, -403456, 119036, -159074, -142109, -59304, -15590, -277692, -206879, -66409, 20217, 121092, 98867, -9021, 90097, -420980, 63844, -103989, -84732, -6888, 227107, 417218, -79233, 188926, 103936, 149837, -347984, -223239, -98736, -51398, 16288, 125543, -111693, -8005, -266224, -128516, 27808, 30935, -249462, -69862, 125979, -30840, 97754, -197462, 58095, -293065, 15105, -270978, -142231, -73963, -189314, -24921, -34935, 27452, -419924, -22931, 49040, 63076, -191585, 154795, -193938, 131173, -441922, 287464, 139608, -186850, -108169, 114096, 37945, -284820, 107582, -133330, -60915, 147133]
11345b54110A05791d8907B39614E5287k0046J00333a30401A51572E8941J12590
11335A71531a4802A00010i3338k44900b64C18032I6054b37964E08535H5923B8981
11323a8721B30300a17220B10198q3950b29305l1175D8193d51928C09958j50899
11313A59059f3678k43850g5002C4163J73600r9591P562C3250K83678a59451A2825
11301c45509b5047A18812e8032A00662b74338N810a17106j17858A16978n5171
11291F1807K9483a62223E4581c3464n0551C8403N675A8555b30444B3254P7609
11280A00863C1068L4027O636a15702k61813J33259B0863h9492B1380q549a11540
11268A8964b28175h8479L6411j4985G0635h6754k28386j06993A52515a0641A06710
$$ y = [-254110, 105791, -48907, 239614, 55287, 35241, 135574, -130401, 151572, 58941, 171531, -14802, 100010, -93338, -338238, -264, 318032, 96054, -237964, 508535, 85923, 28981, -18721, 230300, -117220, 210198, 126248, -229305, -260480, 48193, -451928, 309958, 159059, -63678, -307528, -75002, 34163, 207763, 108172, 115734, 33250, 316928, -159451, 12825, -345509, -25047, 118812, -58032, 100662, -274338, -268528, -117106, -234964, 116978, 61807, 91290, -162223, 54581, -33464, -84015, 38403, 44078, 18555, -230444, 23254, 100863, 31068, 65095, 71731, -115702, -377515, -244256, 20863, -89492, 21380, 12831, -111540, 18964, -228175, -88479, -52068, -67053, 70635, -86754, -315140, -422133, 152515, -10641, 106710]
11256g2519l9801n2233e8016j27963B78779E2320d02513E7621a06626C91786c47709
11244E4012c866l0993j77923g5996r4488C42105G075b93142D2937c47089D7320
11232a29233F116a58663P7576b0669C01839A05330Q7769N1690a40341H9937L7380
11221A27317K0904b28251A0340M302b05092c0470m9762A89522a27219c8081j97127
11210b35208C06256e7861G0403J88885B7013P6496l6851K5131m4509h5064j21695
11199b06759j20935H8115d6809A69929a72971D2157A0253c4203G8221d22591q6137
11188e08728c9826E5093b01743A35784n8421J41766r2304A0404c7927A2052L54312
11177C66364F3703A5029h8826q7741A36021J42481J5911a40784j00437J4939N2912
$$ y = [-72519, -112320, -164553, -58016, -185979, 278779, 52320, -402513, 57621, -106626, 391786, -347709, 54012, -3866, -34859, -212782, -75996, -170484, 342105, 7075, -293142, 42937, -347089, 47320, -129233, 6116, -158663, -81087, -20669, 301839, 105330, 193099, 244789, -140341, 89937, 127317, 148221, -228251, 10340, 14642, -205092, -30470, -80232, 189522, -127219, -38081, -235208, 306256, -57861, 70403, 259288, 27013, 103509, 66658, 91789, 47280, -85064, -206759, -327694, 88115, -46809, 169929, -172971, 42157, 10253, -34203, 78221, -422591, -508728, -39826, 55093, -201743, 135784, 77363, 219129, 126825, 10404, -37927, 12052, 366364, 63703, 15029, -88826, -176567, 136021, 278502, 294413, -140784, -241221, -226282, -173370]
11166a73370A69571c70466g643B28656P7006a43912N2566A98224b63716e1428
11155B7446a85905i654j52815f895q8999r5212Q8041m09503b5035j58854A43291
11143b83959C12618j39020a26396j53186d3749f912H2988C4407L4000Q5459L1084
11132A84950b28580G5748K36008b6856A23941A4242a462j81084B11155A2642a43469
11120a37002D3227b20407f6240A54480l6416N8623A7194f6928A26903L274a06755
11108D7143J28374a77257B72819C3356b98117a5494l191A74684l8996a06278C33767
11096a5622A37346g1803D7880A9909J39103a62272I1867J05078b3949I7210k4892
11085G2318J71820a89679I3140Q5125C1115a39827B8637P622J68814J41737a06352
$$ y = [-173370, 169571, -370466, -7643, 228656, 305662, -143912, -91346, 198224, -263716, -51428, 27446, -185905, -9654, -162469, -6895, -95894, -191106, -103065, -512568, -25035, -183889, 143291, -283959, 312618, 173598, -126396, -279582, -43749, -6912, 82988, 34407, 68407, 153866, 184950, -228580, 75748, 311756, -26856, 123941, 14242, -1462, -182546, 211155, 12642, -143469, -137002, 43227, -220407, -66240, 154480, 118064, 176687, 17194, -66928, 126903, 130177, -106755, 47143, 175517, -177257, 272819, 33356, -298117, -15494, -18685, 174684, 135688, -106278, 333767, -15622, 137346, -71803, 47880, 19909, 159012, -162272, 91867, 196945, -23949, 97210, 72318, 244138, -189679, 93140, 178265, 31115, -139827, 28637, 36259, 205073, 346810, -106352]
11073C7820N1764J3703K1991C2973C039R3273L23548j94533m6782N7594m5156
11062A90983L50780B70117A10478J64100N8978j37018a1852B51321K98544k11522
11052C38343k3959p552J46732M15195D04208K20326n6280p576j7137P1599P1667
11041F86807C14785L66701B61330L02714L8403j56931K97072J9154n9763m6763
11031F55216o133R1060k39930K34381j12521k57898K14934j73555L80726k30861
11021E55419J51845l1503L09311B95350L26045m8228K51470C84347K76644C23044
11010G06777J57722k11297n1912J59718j89965r3629J65632K4402J40010k69526
11000E37932j46287l8831L26088J77886C82203L74870l35854K63710m0774k32828
$$ y = [37820, 89584, 103287, 125278, 32973, 3039, 96312, 419860, 225327, 178545, 236139, 190983, 541763, 270117, 110478, 274578, 333556, 196538, -11852, 251321, 549865, 338343, 314384, 306832, 453564, 868759, 404208, 624534, 568254, 560678, 543541, 615140, 686807, 314785, 681486, 261330, 564044, 602447, 445516, 742588, 761742, 701979, 655216, 649083, 740143, 500213, 734594, 622073, 364175, 579109, 405554, 786280, 555419, 707264, 675761, 985072, 295350, 621395, 573167, 824637, 384347, 660991, 323044, 706777, 864499, 653202, 601290, 761008, 571043, 477414, 643046, 667448, 807458, 537932, 391645, 352814, 678902, 856788, 382203, 757073, 421219, 684929, 644155, 411327]
10990D11327K29421K01817k69480K66074B20908M22826k44613r066J41171K04742
10980G35968j76680o919J49912k1647J13344j71153l3404k074L05728J58400k83025
10969G68450O0136K33587j29699M65954j5664o1223J61332j196O34294l46096
10959A769875P01613n1697O0857K88027l74366j14465m4034l16705p9843j71911
10949A667351k97968j9696L16863k93738Q8176M1797j58425N4410j01269q0291
10939A217210j38155J50900k68198q4513C26980N92495l72070O7382C02333F6798
10928D48734K65301B53667j04955K2001G7547C8689d1730C92334a5068A54368
10917C0800K39562A32639p806E1679Q8761c31513A37840F2115j0873K7595N1177
$$ y = [411327, 640748, 842565, 573085, 839159, 220908, 643734, 399121, 390055, 531226, 735968, 559288, 552369, 702281, 680634, 793978, 622825, 589421, 587347, 893075, 1051475, 768450, 828586, 1062173, 932474, 1398428, 1382764, 1321541, 1482873, 1481677, 2115971, 1769875, 2471488, 2419791, 2480648, 2768675, 2394309, 2279844, 2235810, 1919105, 1839262, 1667351, 1369383, 1349687, 1666550, 1372812, 1460988, 1502785, 1344360, 1398770, 1297501, 1217210, 1079055, 1229955, 961757, 877244, 326980, 919475, 547405, 614787, 302333, 66798, 448734, 714035, 253667, 148712, 170713, 77547, 38689, -41730, 392334, -15068, 154368, 30800, 270362, 132639, 124833, 51679, 140440, -331513, 137840, 62115, 51242, 78837, 130014]
10906A30014h9906A03240b7036B21757f863m0164A52789e93266A74978a75518
10895a70570C4137g6441B74360F733J47933b50525B3348K68628c00223G0987f6856
10883b49016b0893j4780k23848a03922k2472k6044A24594b3387r0561C4627b03115
10871A29449b11425B07407e9863B0456a2350A52161c5069j2945k30830j24214
10861d03058J27091q5642A22064f0258k92995B53433c4486a4453B788c5353G9320
10849D37002c5501k28675J15111j24759D7509O5282K40292e0025k9420D5691E16
10837B972Q6512P420c9331F6162b18630n4443l3539J49415A14552a25975j33053
10826b59028K8346A42897g5040A54999F397f9765L3683A65425c1674C4023d383
$$ y = [130014, -89906, 103240, -27036, 221757, -6863, -47027, 152789, -593266, 174978, -175518, -170570, 34137, -76441, 274360, 6733, 154666, -250525, 23348, 291976, -300223, 70987, -66856, -249016, -20893, -35673, -259521, -103922, -126394, -152438, 124594, -23387, -113948, 34627, -203115, 129449, -211425, 207407, -59863, 20456, -12350, 152161, -35069, -48014, -278844, -403058, -275967, -361609, 122064, -60258, -353253, 253433, -34486, -14453, 2788, -35353, 79320, 437002, -35501, -264176, -149065, -273824, 47509, 112791, 353083, -50025, -79445, 45691, 516, 2972, 89484, 96904, -39331, 66162, -218630, -273073, -306612, -157197, 114552, -125975, -259028, -230682, 142897, -75040, 154999, 6397, -69765, -36082, 165425, -31674, 34023, -4383]
10814e7078A08628J7875F0986J08092F7746j4169c82709J11713k7446e6887p9958
10803a36845n7055C8831g6809k93330e2851k15468J14468O3860A10552c29676
10792a52912A56201p5552l9419R8940e0168G1849b85127e3525J244k12960j27013
10781c92254H1150a48395J2361A68792j5183a47931m190l1504F5177c998B10403
10769b8335j21395A57879b58623I9172c44188J3795B8498a80636G0453h2681C6671
10757c15403e4691B37736n846a90904a6580E2007a8480B54654b13795I8680b90614
10745a26452l4633A82232p3342b60636a12712G4217a40169c2403j35853c0305
10734B1920b57147a25445k30498Q5608B0237b93980B00343p9659N3599a53656
$$ y = [-57078, 108628, 126503, 60986, 169078, 67746, 53577, -382709, -270996, -298442, -56887, -136845, -193900, 38831, -76809, -370139, -52851, -268319, -153851, -89991, 110552, -329676, -152912, 156201, 80649, 41230, 140170, -50168, 71849, -285127, -53525, -52281, -265241, -392254, 81150, -148395, -136034, 168792, 153609, -147931, -152121, -183625, 65177, -3998, 210403, -28335, -149730, 157879, -258623, 99172, -344188, -330393, 28498, -180636, 70453, -82681, 36671, -315403, -54691, 237736, 231890, -190904, -16580, 52007, -18480, 254654, -213795, 98680, -290614, -126452, -161085, 182232, 108890, -260636, -112712, 74217, -140169, -32403, -168256, -30305, 21920, -257147, -125445, -355943, -270335, 20237, -293980, 200343, 120684, 174283, -153656]
10723a86701A8521b03488A44196E506a23303B3555N0802a93596M5799A33765a68115
10711G6627J6323d0621A45548o5642J26049e9784a6003D1734a07106A14906b08826
10699A1086b7368A36292b28222g0698A24648b04549A10345d31055A18544N4809
10689A73353k0627Q1988a54936f3742j35735B4922J01803b814H6339b72647a27
10677A2125a44036q868a1517I7013E473d7121K2368j60014o5545k67949a40298
10665b2819G3191e2538G4621A1473A628g912k15240A40504l8159d98507K38193
10654b60314C31965g1592M172m3935A0998M089c38411A59808m9236f618p5541
10643h2159a8389j8346q7822A20370h2836F1211J48604a067A45491o0281g2795
$$ y = [-186701, 18521, -203488, 144196, 5506, -123303, 23555, 74357, -193596, -147797, 133765, -168115, 76627, 92950, -40621, 145548, 79906, 205955, -59784, -16003, 41734, -107106, 114906, -208826, 11086, -27368, 136292, -228222, -70698, 124648, -204549, 110345, -431055, 118544, 173353, 152726, 234714, -154936, -63742, -199477, 24922, 126725, -2814, 86339, -272647, -127, 12125, -144036, -152904, -11517, 97013, 5473, -47121, -24753, -184767, -250312, -518261, -140298, -22819, 73191, -52538, 74621, 11473, 1628, -7912, -223152, 140504, 102345, -498507, -260314, 331965, -71592, -67420, -111355, 10998, 15087, -338411, 159808, 110572, -6618, -82159, -18389, -36735, -124557, 120370, -82836, 61211, 209815, -1067, 145491, 85210, -72795]
10631a79235A69509a35727A96588a29375j75717A35762M7236J09299g3121A75610
10620E4503c3322B0575J12274a78422h0069A59567K2927b04256f3666D6567b07266
10608A27838J44022G7103b69019a3370I1670l384K3459a41189k63445b8756j72699
10597b01455C63355e8099C57324c6098j62050K5941R807b9245l40535a50761L4000
10586a16761A7094M2108b53592R3631A06071Q0952A8710K8069O790b0235r0822
10575a11057L0893k3301I2879K09417B8826b6938j05701G1008J5633J31227n5077
10564A62791b89177R8171b3123j42896O4999b7010k63603B0959L42874a16294
10553B1872M2182B9644J71777q5344a82388A27924B7478a44912I9666D8238K4916
$$ y = [-179235, 169509, -135727, 196588, -129375, -305092, 135762, 182998, 292297, -73121, 175610, 54503, -33322, 20575, 132849, -178422, -80069, 159567, 182494, -204256, -63666, 46567, -207266, 127838, 271860, 77103, -269019, -13370, 91670, 88286, 111745, -141189, -404634, -28756, -201455, 363355, -58099, 357324, -36098, -198148, -172207, -162400, -29245, -369780, -150761, -116761, 17094, 59202, -253592, -159961, 106071, 187023, 18710, 46779, 53569, -20235, -111057, -80164, -103465, 92879, 302296, 28826, -26938, -132639, 71008, 86641, 217868, 162791, -289177, -191006, -23123, -166019, -101020, -27010, -290613, 20959, 363833, -116294, 21872, 64054, 29644, 201421, 116077, -182388, 127924, 27478, -144912, 99666, 48238, 73154]
10542G3154L01756m5160a81902k20122a84022f8396q8969A56362h0212j17287
10532a97499I1825C799c37403g9336A2615i4348o3169c8822q8745l5702A56237
10520i1657H2279P3999b58517J6232j3817B08290a05590A79357H8282P2104K8717
10509A89103k9134J04996b03910A21480c9106H1667a90275B95981a07573c6383
10498g2583a2649r0741q5742e9675j3551k29184R7360g6289a1408m4022k88042
10487c43472J39474B57149b30779F0668L5552J8839j5350a4663e657A5546R5306
10476A10852c05399P2462A2655L0654a19627A79934C4289L54391A51938K35848
10466C87786m8849E2384J99719M1436I9543J33393n9397J26544C8304J4489c89661
$$ y = [73154, 374910, 329750, -181902, -402024, -184022, -68396, -157365, 156362, -80212, -197499, 91825, 3799, -337403, -79336, 12615, -94348, -157517, -38822, -127567, -163269, 156237, -91657, 82279, 156278, -258517, -242285, -256102, 208290, -105590, 179357, 88282, 160386, 189103, 159969, 264965, -203910, 121480, -39106, 81667, -190275, 295981, -107573, -36383, -72583, -12649, -103390, -189132, -59675, -73226, -302410, -205050, -76289, -11408, -55430, -343472, -203998, 257149, -230779, 60668, 96220, 115059, 99709, -14663, -5657, 15546, 110852, -305399, -232937, 12655, 43309, -119627, 179934, 34289, 388680, 151938, 387786, 338937, 52384, 252103, 293539, 99543, 232936, 173539, 300083, 38304, 52793, -389661]
10454e26078i0777G5083K0403a48645B31252k2394a02959A7903e0537m33548B84849
10442F7262b53729h5976A33999b63721L0211N0903k8500C20711a20064D1375M23853
10431D65228j57707j46964o8583b34951B8164b36577g1609n6591B48735A1965
10420G1707a2717n38351H6560K13989b61981E3868L6730b15462h183B12826a1931
10408a60126A42311b56078d3136F1221F614c77764c7120b986B23899B5278a16624
10396a69434r298d0939A44743o1531a69979k32797E186a06366G5678d2847p2757
10385a15604K2827A61579J04853g658A15944h1547A59093b03568A67251a03511
10374B35341q3680a36978b3346d64H5846l2762K78869H0609J32271b6379G9078
$$ y = [-526078, -90777, 75083, 95486, -148645, 231252, 208858, -102959, 17903, -50537, -484085, 284849, 67262, -253729, -85976, 133999, -263721, -233510, -182607, -211107, 320711, -120064, 41375, 465228, 307521, 160557, 91974, -234951, 28164, -236577, -71609, -128200, 248735, 11965, 71707, -12717, -551068, 86560, 300549, -261981, 53868, 90598, -215462, -8183, 212826, -11931, -160126, 142311, -256078, -43136, 61221, 6614, -377764, -37120, -2986, 223899, 25278, -116624, -169434, -178732, -40939, 144743, 83212, -169979, -402776, 5186, -106366, 75678, -42847, -115604, -92777, 161579, 266432, -7658, 115944, -81547, 159093, -203568, 167251, -103511, 235341, 151661, -136978, -23346, -464, 85846, 53084, 331953, 80609, 212880, -26379, 79078]
10362B66363P1884A65764K9209m678F9214A8092N1944c9181C84321P0170B11897
10350C22535F5777k2887c3941C81904A33321k7427J12021J8877h8946C73966A58579
10338i6391b4648B57073O5401K35440M9105j28191L5863A74885K15630C3208L80046
10327D13254q1742A16639J4164K06431f7149B94016d373A84246f8063J44o9103
10316a37022C20375K18169b41773d4306G2551Q9058J1894b59875B25031c3647
10305B3051K01729G7774c3857B78166A24812M36789B38524H4577N5653N0710a397
10293A80127a40338A80571a97536E6736B3034a31034k7748d7688A6100b5836j44759
10282a70595a0362E0092c3935j02386r299K2735L6997n5533e9954H8777b17685
$$ y = [266363, 338247, 165764, 194973, 190295, 69214, 18092, 70036, -39181, 384321, 454491, 211897, 322535, 65777, 42890, -33941, 381904, 133321, 105894, 217915, 236792, -88946, 373966, 158579, -96391, -24648, 257073, 322474, 557914, 607019, 478828, 514691, 174885, 390515, 33208, 413254, 331512, 116639, 130803, 337234, -67149, 294016, -4373, 184246, -68063, -67919, -137022, 320375, 538544, -241773, -44306, 72551, 161609, 173503, -259875, 225031, -33647, 23051, 224780, 77774, -33857, 278166, 124812, 561601, 238524, 84577, 140230, 190940, -1397, 180127, -140338, 180571, -197536, 56736, 23034, -131034, -158782, -47688, 16100, -25836, -170595, -10362, 50092, -33935, -136321, -145620, -122885, -85888, -141421, -59954, 88777, -217685]
10270F1973a17697G782a40474j05795d247l51778A449a7785A10157f0015D0529
10258b33969B06873o3773a15798b1912j39015b9471C9171M66380j7675j74154
10248C13722j54902l6033K69245d5578C89040F2472j54Q9510J65080G7574L1108
10237A08682d772j68230P8185n2505g0156C250M10744j37395a57288O3908A30999
10225b08353c4989k28354c525A44209i9551D0722f361E674L6020L26548a41754
10213c3383A93431a75522C9799J84462b29420A13512a12619D5349a72746E1515
10202e3712M834m9822l38602J83908A97820e45j70310C03802j23106A5626K3109
10191C8735c67635E6092f2475l59009f5755I9646b5636F574M75e1717A30279i5650
$$ y = [61973, -117697, 7782, -140474, -246269, -4247, -356025, 1449, -17785, 110157, -60015, 40529, -233969, 206873, 143100, -115798, -21912, -160927, -29471, 39171, 505551, 487876, 313722, 158820, 122787, 392032, -45578, 389040, 62472, 62318, 151828, 316908, 77574, 108682, -4772, -173002, -94817, -147322, -70156, 3250, 413994, 276599, -157288, -93380, 130999, -208353, -34989, -263343, -3525, 144209, -99551, 40722, -6361, 5674, 41694, 368242, -141754, -33383, 193431, -175522, 39799, 224261, -229420, 113512, -112619, 45349, -172746, 51515, -53712, -48878, -98700, -437302, -253394, 197820, -545, -170855, 303802, 180696, 15626, 38735, -367635, 56092, -62475, -421484, -65755, 99646, -25636, 6574, 7049, -51717, 130279, -95650]
10178G7919d4549j41132C44486a85529A76833i365j17474k25992E3517d4897E7737
10166a98786l540e7293j56820e7268r1917m9837Q9126d9737n6610F3398a08282
10154A08311f4304j79704g0839r4285j47318L7453J23936Q465A53359i8410d8367
10142C43469a31951O0166j52225B3240J94745a24984o2818A89838A14J46624a64582
10130a71941n7460g00k75053a02800l6277d9668D5189P1043a78446B01178c14879
10118b04990A12451a54762A21467b497j02636l32669a76888A36859K07412j09916
10108B34355A7063e0610C6335K60477a66405O1429B38273a75398A24897b3447
10097b0689A14817b63157A13569a82590k3422i3172B2059K63084c4380A65262
$$ y = [77919, -44549, -185681, 344486, -185529, 176833, -9365, -126839, -352831, 53517, -44897, 57737, -198786, -202326, -57293, -214113, -57268, -149185, -199022, -109896, -49737, -106347, 63398, -108282, 108311, -64304, -244008, -70839, -165124, -312442, -274989, -151053, -142588, 153359, -98410, -48367, 343469, -131951, -71785, -224010, 23240, 217985, -124984, -187802, 189838, 114, 146738, -164582, -171941, -229401, -700, -275753, -102800, -139077, -49668, 45189, 116232, -178446, 201178, -314879, -204990, 112451, -154762, 121467, -2497, -105133, -437802, -176888, 136859, 344271, 234355, 17063, -50610, 36335, 296812, -166405, -104976, 238273, -175398, 124897, -23447, -20689, 114817, -263157, 113569, -182590, -206012, -93172, 22059, 285143, -34380, 165262]
10086B39852g6217A2758a62005j52273A71788l8035d430l9698l8868A94258e5952
10074A37520b22129A23938A7038J00935a20109M7118H486a59749j20958J30387
10064a50320j50392a2161j45431H8380A1766K4544c56243a62521f8229l16108
10054c84337J00551i3124A69086b568B32365h3316A70443g5526B6598b7350D7747
10042H5145C0417a94701F6126b08634L3259c404j46153A85740d82737A9253c93148
10030I328d1162m411k49993a3476k13480A87281F0341J97757C5452J44491b9043
10018b97894a43919l01025e2035l9796b8593j30248A71020e0965j91937e1713
10007i3059j17987O6471l25843G7706b69442j84847A22717K10515a19198A57571
$$ y = [239852, -76217, 12758, -162005, -314278, 171788, 133753, -4430, -44128, -82996, 194258, -55952, 137520, -222129, 123938, 17038, 117973, -120109, -72991, 8486, -159749, -280707, -150320, -300712, -12161, -157592, 88380, 11766, 36310, -356243, -162521, -68229, -384337, -283786, -93124, 169086, -2568, 232365, -83316, 170443, -75526, 26598, -27350, 47747, 85145, 30417, -194701, 66126, -208634, -175375, -3404, -149557, 185740, -482737, 19253, -393148, 9328, -41162, -45573, -295566, -13476, -226956, 187281, 60341, 258098, 35452, 179943, -29043, -297894, -143919, -444944, -52035, -91831, -28593, -158841, 171020, -50965, -242902, -51713, -93059, -211046, -144575, -470418, 77706, -269442, -454289, 122717, 333232, -119198, 157571]
9996b92927j9279J9252n1250a70190E8988d9187j59872h1155m9154m9130F3646
9984A5811J56216a37221A32548a19745A72056c05783B09034b15408c7128j35468
9974a72596j58882a26358A84957C6230L3153c1908k84155B05070q938P110a60277
9962e6876j59895R5559M3526E7697b19486Q5692A47793b9097K197G2031f69734
9950g7054D2841c78818A9345P8027a81142o1058D7849e5494A46311J50648b43460
9938D7235b23213F2670i24j74413l3605a1879m15904I2155i9174B9578q296a7581
9925A4667a61471C332R0526b34972a4092j63489L8856e3928F690b57040a13068
9913a33978j2130l9615A1271c40505J33303H0422b53646A0459b16146H2100O2813
$$ y = [-292927, -312206, -292954, -344204, -170190, 58988, -49187, -209059, -81155, -130309, -179439, 63646, 15811, 172027, -137221, 132548, -119745, 172056, -305783, 209034, -215408, -37128, -172596, -331478, -126358, 184957, 36230, 69383, -31908, -316063, 205070, 196132, 203242, -160277, -56876, -216771, -121212, -77686, 57697, -219486, -133794, 147793, -29097, -26900, 72031, -669734, -77054, 42841, -378818, 19345, 97372, -181142, -242200, 47849, -55494, 146311, 296959, -243460, 47235, -223213, 62670, -924, -175337, -208942, -11879, -427783, 92155, -99174, 29578, 21282, -17581, 14667, -161471, 3332, 93858, -234972, -14092, -177581, -138725, -53928, 6690, -257040, -113068, -133978, -146108, -185723, 11271, -340505, -207202, 80422, -253646, 10459, -216146, 82100, 144913]
9902A44913J26252m8505h5387j16762o3966i4207B73028g8480b5419E7659a56487
9890a17622r924r428p357b3550l43316C3443b33777E0733b65219i0787l04789
9879c95576J58729J10851M711K504q3971j8674g8734A92396a79430b5351F6078
9867e3706L771G6955J91198b39059j19348G9347r479J0506a59583b9339G0257
9855A3711h463j28564k79418Q6881J31788k3548A91169c32230g6580l204A02810
9843a79886b1532A49883a78610c0304j7250C6488A5581b35171I1740a57444e3951
9831e14451B61574c9708A84052a35842m9440c4148A10381i1491A22580k8762J21162
9820B14980K26485e8977B90945b50285i5279a2131j15736j353A92240G0678K43816
$$ y = [144913, 271165, 222660, -85387, -202149, -266115, -94207, 273028, -78480, -25419, 57659, -156487, -117622, -127546, -136974, -144331, -23550, -366866, 33443, -233777, 50733, -265219, -90787, -395576, -236847, -125996, -121285, -118781, -202752, -221426, -78734, 192396, -179430, -25351, 66078, -53706, -49935, 76955, 268153, -239059, -358407, 79347, 69868, 80374, -159583, -29339, 70257, 13711, -8463, -137027, -416445, -329564, -197776, -221324, 191169, -332230, -76580, -79784, 102810, -179886, -21532, 149883, -178610, -30304, -47554, 36488, 15581, -235171, 91740, -157444, -53951, -514451, 261574, -39708, 184052, -135842, -185282, -34148, 110381, -91491, 122580, 93818, 214980, 441465, -58977, 290945, -250285, -95279, -12131, -127867, -129220, 192240, 70678, 314494]
9809C14494a42337k1271G0395K262a11690r819g548G543f5250j10577A56404J88200
9797C44604G8486M3245h4100C78280b40353H2323g5733A5712a5732B27387a36568
9785A8614b11605m2570m8683g959k25684A15943b04143E123c34508B02862d7557
9773c58424A69081L35895c46438I4034J88552a31815B32006r5696a3235p4163
9763h7398b0140k90145h048o3694C33981h4221p1244K3890A627d4739p530l4088
9751h6357I2776c7006j43084d6592C40947c66626a41022j8768E935J29311b82114
9739b70879a25524A28651a24750j52295h2825m6867B20917c197l168m52256C2206
9727c47917a38466K2437B92797H1424c59393p5032a02493c1496k41682h6816I8091
$$ y = [314494, -142337, -163608, 70395, 72657, -111690, -121509, -7548, 7543, -65250, -175827, 156404, 344604, 78486, 121731, -84100, 378280, -240353, 82323, -75733, 15712, -15732, 227387, -136568, 18614, -211605, -254175, -302858, -7959, -233643, 115943, -204143, 5123, -334508, 202862, -47557, -358424, 169081, 504976, -346438, 94034, 282586, -131815, 232006, 136310, -13235, -87398, -20140, -310285, -8048, -71742, 333981, -84221, -155465, -131575, 1627, -44739, -52269, -86357, 92776, -37006, -180090, -46592, 340947, -366626, -141022, -159790, 5935, 135246, -282114, -270879, -125524, 128651, -124750, -277045, -82825, -129692, 220917, -3197, -6365, -458621, 32206, -347917, -138466, -116029, 292797, 81424, -359393, -434425, -102493, -31496, -273178, -86816, 98091]
9715c7679B26832n3838a53686r9114R9276r351g8052K7059F2367j9734k1096J7444
9703C8981b76596Q9966j40632P2662N4760B03266C1274c0966j26322k03758C398
9691b48683K7273B91706b35517K1367G2557b15561F2483a33479O1900A09594g3414
9679I9414L16782i3100o2540A16505D9478i6001j67496c8529E5398a82048B15053
9667d8862k27029B5058J6419a91177e2806J4614A44798a78019I5161k8966j3773
9656E2422c97066A0865a10980J4496F5396e4146l07938J43185k305J06883a9069
9644b44823A46129p409B7715e33736h666A47672Q654c3683j931%j98292A04138
9631A33281a51970J9128n8928B99984e5600j75702H8205L00315b23059I206f6145
$$ y = [-37679, 226832, 172994, -153686, -252800, -153524, -162875, -78052, -50993, 62367, 42633, 21537, 38981, -276596, -186630, -327262, -254600, -199840, 203266, 31274, -30966, -157288, -361046, 3398, -248683, -221410, 291706, -235517, -214150, 72557, -215561, 62483, -133479, -71579, 109594, -73414, 99414, 416196, -93100, -155640, 116505, 49478, -96001, -263497, -38529, 55398, -182048, 215053, -48862, -275891, 25058, 41477, -191177, -52806, -38192, 144798, -178019, 95161, 66195, 52422, -397066, 10865, -110980, -96484, 65396, -54146, -362084, -218899, -221204, -114321, -19069, -244823, 146129, 138720, 27715, -533736, -8666, 147672, 156326, -33683, -35614, -35614, -233906, 104138, 133281, -151970, -132842, -191770, 299984, -55600, -231302, 88205, 388520, -223059, 9206, -66145]
9619e3831j14488f2828j49885A4708L74855g4597B37190c30209K3103d1161n4068
9608i5229j81274J17890j4237P842O870P5583j17174E9153a1506j183k01652A46515
9595f6347A3418a37103N3535A87350d2849l0626B16209c8534l3486j63886c4391
9583A08241c7502q1492b0844j60829A14536O4908a33145N5240J8661j47614N0984
9572a55874j3604L1742A73930c8878q2591j21982B16859d62569C61977c54513
9561a11585k53416f6735a2538k38783a21737I998J10223b11263r5566G9981b17738
9549a84729g2204C75314a33371A00603j9687E125f3618j23121f1998k43394F717
9537A72491b35788A67105d5948A08850J8722c13145J48649L2429A3462K13456
$$ y = [-53831, -168319, -62828, -212713, 14708, 389563, -74597, 237190, -330209, -307106, -41161, -95229, -276503, -158613, -172850, -165008, -158138, -82555, -199729, 59153, -11506, -12689, -214341, 146515, -66347, 13418, -137103, -83568, 187350, -42849, -73475, 216209, -38534, -72020, -235906, -34391, 108241, -37502, -118994, -20844, -181673, 114536, 179444, -133145, -77905, -59244, -206858, -155874, -169478, -137736, 173930, -38878, -121469, -243451, 216859, -462569, 361977, -354513, -111585, -365001, -66735, -12538, -251321, -121737, 9998, 120221, -211263, -306829, 79981, -217738, -184729, -72204, 375314, -133371, 100603, 80916, 5125, -63618, -186739, -61998, -305392, 6717, 172491, -235788, 167105, -45948, 108850, 127572, -313145, -164496, -132067, 13462, 226918]
9527B26918a03591n7909f9815b9401A44768g5617A44368d4075j77340m8534Q0155
9516a89794G6615a34721A7626f4007k49175C6274a9663I0076a78601a4795j01217
9505a16012g936k10018a07103l2069L4680A28770F1166j6182i2692A42832i3001
9493B3803d4746j82343J01421E8163c49469d6276B56009E16c22543b8138A48506
9481b56552B65916h1480o0891e088r0782B72265b18708j31286e990A16200Q5007
9470B01207b44765A03812c8624l39996f114E3158c08085J22069f5057q4572j05355
9459b54984E781J7472P4703a03001e254j10696A81896G64e6464j1988E3995c93718
9446A08778M4015g4989r2777B42859e86242a54385L8512o2820B28608o2146B1010
$$ y = [226918, -103591, -161500, -69815, -29401, 144768, -75617, 144368, -44075, -221415, -269949, -189794, 76615, -134721, 17626, -64007, -313182, 36274, -19663, 90076, -178601, -14795, -116012, -7936, -217954, -107103, -139172, -104492, 128770, 61166, 44984, -92692, 142832, -93001, 23803, -44746, -227089, -125668, 58163, -349469, -46276, 256009, 516, -322543, -28138, 148506, -256552, 265916, -81480, -142371, -5088, -95870, 272265, -218708, -349994, -5990, 116200, 201207, -244765, 103812, -38624, -378620, -6114, 53158, -308085, -186016, -65057, -149629, -254984, 5781, 23253, 97956, -103001, -5254, -115950, 181896, 764, -56464, -68452, 53995, -393718, 108778, 152793, -74989, -167766, 242859, -586242, -154385, -115873, -178693, 228608, 166462, 21010]
9434g3045B39822i1683k70165f8006j22850j52507f592l5097J1747l4676p9444
9423a44062L491N2025r5279J1661m3626A39954a07571A13042A3045d7711j3483
9412f1194n1065n2540q3399i5579c8717j40199B74364E8950a49215A71259e9532
9400a59088k0536p6788A75223A5442J03539M25a83159B80698j31518a26762M2076
9389h4686B26906a42963k03414H5198M7804K086a37658o3888j7449D14749A22165
9377b77525a02334d9919F1170i7392b6477l1385D5177d27582f4266D6842d10787
9365h5331C4615b37388o9066B72005b56250j64103e7498o1231j70643I3776c3632
9353b44144J11154A70578b25496J2731f9422j91181B27464a43809A18110c8535
$$ y = [-73045, 239822, -91683, -361848, -68006, -190856, -343363, -6592, -41689, -29942, -64618, -144062, -140571, -88546, -183825, -172164, -215790, 139954, -107571, 113042, 13045, -47711, -61194, -112259, -164799, -248198, -95579, -38717, -178916, 274364, 58950, -149215, 171259, -59532, -159088, -179624, -256412, 175223, 15442, 118981, 119406, -183159, 280698, 149180, -126762, -84686, 226906, -142963, -346377, 85198, 133002, 135088, -137658, -201546, -218995, 414749, 122165, -277525, -102334, -49919, 61170, -97392, -26477, -57862, 45177, -427582, -64266, 46842, -410787, -85331, 34615, -237388, -306454, 272005, -256250, -420353, -57498, -118729, -289372, 93776, -33632, -244144, -132990, 170578, -225496, -212765, -69422, -260603, 227464, -143809, 118110, -38535]
9342E1157J76875b77373E543L7655d94774f188l4693A56714b18355B5986a94168
9330f2700j74952o0947E8621C56g9355c9573H1525j0419d24873J41916B3569b45048
9317A49645K6487q3101a99885c1623o6690o2282j18853A4658K4242N4791a63060
9305b18629B73102a57135l2129I1091e4905C2200q827b30018o6620A84301Q5686
9294B69987a45181o5973c2162A35493b03025c7922m7867j67781f2652A44331c0221
9282B563M6423O3261e1145B4733R7707d93722H608J30183a80497O0614k3383o190
9270a49456k35782i5347K742A25669c72369B9121f2966A79496E86J62127H565
9258A40512J42498a58742q7438a11149I6776c61609b3304k90755Q1150G1595P5566
$$ y = [51157, 228032, -277373, 5543, 43198, -494774, -6188, -40881, 156714, -218355, 25986, -194168, -62700, -237652, -298599, 58621, 356, -79355, -39573, 81525, 71106, -424873, -282957, 23569, -245048, 149645, 176132, 93031, -199885, -31623, -98313, -160595, -279448, 14658, 38900, 93691, -163060, -218629, 273102, -157135, -189264, 91091, -54905, 32200, 23373, -230018, -296638, 184301, 269987, -145181, -211154, -32162, 135493, -203025, -37922, -85789, -253570, -62652, 144331, -30221, 2563, 48986, 112247, -51145, 24733, 122440, -493722, 8608, 138791, -180497, -119883, -143266, -149456, -385238, -95347, -92605, 125669, -372369, 29121, -62966, 179496, 586, 162713, 8565, 140512, 283010, -158742, -246180, -111149, 96776, -361609, -23304, -314059, -232909, 71595, 147161]
9247A47161a79441d1017j26309j11119A08751b8353B2386b82418J03766k28978
9237d07630a97339C4364a06428j15765B76190B2973g935A87559b5973P066k2851
9226d1758A52103b64418i0830f050B2904M7755P0899b03932l6656O4974O916h0094
9213F0802a5542m8884J7212A7760J6582M493a97343j4431G819J14660l9275d5225
9200B2350e0109H8089K12713h1382B12035a10596n5742O9984p0331B22003a37055
9188I1929A8694K08272i5467A6583J22114a10318c9634B4088b18592P4429A74220
9176a41693F4532M0374d6074k66093A15371C9020d8436o771p1081F905a07889
9164A66301h8827H5121a20617a6780E7060a29069e2556j65343b5538p8632A00587
$$ y = [147161, -179441, -41017, -167326, -278445, 108751, -28353, 22386, -282418, -178652, -407630, -197339, 34364, -106428, -222193, 276190, 22973, -7935, 187559, -25973, -18907, -41758, 152103, -264418, -90830, -6050, 22904, 70659, 141558, -203932, -240588, -175614, -168698, -80094, 60802, -15542, -64426, -47214, 17760, 34342, 38835, -197343, -211774, 7819, 122479, 83204, -45225, 22350, -50109, 88089, 300802, -81382, 212035, -110596, -166338, -96354, -166685, 222003, -137055, 91929, 18694, 226966, -95467, 16583, 138697, -110318, -39634, 24088, -218592, -144163, 174220, -141693, 64532, 104906, -46074, -312167, 115371, 39020, -48436, -55207, -126288, 6905, -107889, 166301, -88827, 85121, -120617, -16780, 57060, -129069, -52556, -217899, -25538, -104170, 100587]
9152B53770B8635a69697I7901R8607G0197f6213j47917A70835C8364e296A37025
9140h0922H6533b1266A85035d64835K27021a11862A15515J7800l7140M0261a24637
9128B14013c00524A83056k1605A0947L8243a78713N5927j44234f6443c2524l07693
9117c40217j0431J60993N8209L0372a2244A1074f9865J9177p9672j12127B22160
9105d0654F3548J65054A2113L43402a30955A74141f682j73630G1644l1693b31732
9093f4248B1188a20609k4679g942A34534D0904K6110J56146a12191o5880J5189
9082a62882A28658b5272C82946g3441I2575a51367A28522c7377I221i117m7961
9071e7078k03529j37231K185D3977b32213B4598M304K0403a00978A17147E6340
$$ y = [253770, 28635, -169697, 97901, 196508, 70197, -66213, -214130, 170835, 38364, -5296, 137025, -80922, 86533, -21266, 185035, -464835, -237814, -111862, 115515, 133315, 96175, 136436, -124637, 214013, -300524, 183056, 161451, 10947, 49190, -178713, -122786, -267020, -66443, -32524, -340217, -350648, -189655, -131446, -101074, -12244, 11074, -69865, -50688, -130360, -242487, 222160, -40654, 63548, 228602, 12113, 355515, -130955, 174141, -6682, -180312, 71644, 39951, -231732, -64248, 21188, -120609, -145288, -7942, 134534, 40904, 67014, 223160, -112191, -178071, -162882, 128658, -25272, 382946, -73441, 92575, -151367, 128522, -37377, 9221, -9117, -57078, -260607, -397838, -395653, 43977, -232213, 24598, 28902, 49305, -100978, 117147, 56340]
9059b65462O6497B1453b54251A63636q1531K8594J00369a96969i0590a1389B1357
9047F0793a06140k58227A51365b71605b7493A818c09658I9022c26568A57470c25860
9035A12114a51789C2128r366a81072A7173M8224d15791f3595A66286b0094k6740
9024d6834A95234a96000g114k46433Q5943k77463a05750j35783g0388j25973a1969
9012f7319A25320g8009q7432A40063a77540c7821A05563a53474c1499j02557j88449
9001c22505A96119b66025r304q3754I4332b41172g201l1926F7868a73655p353
8990a81008A86284K04497f5309j11452A05635a73252j27736C3569a31786E7738
8979A69882a10804b0597m549r2803e5013D1734b36120g1579l51190A30157C7743
$$ y = [-265462, -198965, 21453, -254251, 163636, 82105, 110699, 211068, -196969, -90590, -11389, 21357, 60793, -106140, -364367, 151365, -271605, -27493, 1818, -309658, 99022, -326568, 157470, -325860, 112114, -151789, 32128, 22762, -181072, 17173, 65397, -415791, -63595, 166286, -20094, -46834, 195234, -196000, -7114, -253547, -167604, -445067, -105750, -241533, -70388, -196361, -11969, -67319, 125320, -78009, -165441, 140063, -177540, -37821, 105563, -153474, -31499, -134056, -322505, 196119, -266025, -275329, -359083, 94332, -241172, -7201, -39127, 67868, -173655, -181008, 186284, 390781, -65309, -176761, 105635, -173252, -300988, 33569, -131786, 57738, 169882, -110804, -20597, -25146, -117949, -55013, 41734, -236120, -71579, -422769, 130157, 37743]
8967a17684G5064J24722n7795a81945N7860j51261C3880J09976p0291b07497F041
8955c31317B21730b03715I3297g0182E7747f4976l58746F2129J27538b06585h0377
8943b57382c362C3367J48320a39770m0753b8699m18587B8173f7493k01609R3456
8932a75646Q5216B66119g1503c3944j51105k3824A89414c3576p7470l7844C7153
8920C57752c1748j70094p1508J32024C4600J71811k8269L4156j05812K36058a61044
8908B41482K79612M34530J177259o92056G17372A45781K78704j88854h5927k00662
8898b86589C37597A21244B7631P455c6897A7845K03945b208B17296Q8648a71641
8886c0797k57964O2795a8316n0555k6752M1704F255a27473d5615A87485n6395
$$ y = [-117684, 75064, 199786, 141991, -181945, -124085, -275346, 33880, 143856, 73565, -207497, 6041, -331317, 221730, -203715, 93297, -70182, 57747, -64976, -423722, 62129, 189667, -206585, -80377, -257382, -3362, 33367, 181687, -139770, -180523, -28699, -447286, 28173, -67493, -269102, -175646, -90430, 266119, -71503, -33944, -185049, -208873, 189414, -33576, -111046, -148890, 37153, 357752, -31748, -201842, -273350, -141326, 34600, 206411, 178142, 212298, 106486, 342544, -161044, 241482, 521094, 955624, 2132883, 1440827, 717372, 145781, 424485, 235631, -85927, -286589, 337597, 121244, 27631, 35086, -36897, 17845, 221790, -2208, 217296, 305944, -171641, -30797, -288761, -225966, -18316, -68871, -95623, -53919, 6255, -127473, -45615, 187485, 131090]
8875A31090D8634N1002a74096K4107B84287f0783B11957h6051l6867q7936g2175
8863A55730a93199E1966a12810q8254c7507p5351a5333C26619a08354L7375j0304
8852h1283B58192b8166k14553j621h1988A97624H5989B8889J44871r460h4703
8840e6211p6194A18768C743R0486b1328Q929C671c3151E6464E119c97535Q1501
8828c16034a24406M5301E7560b18199o6390f7124A68479a45070K3263B89269A14295
$$ y = [131090, 48634, 99636, -174096, -149989, 284287, -60783, 211957, -86051, -122918, -210854, -72175, 155730, -193199, 51966, -112810, -201064, -37507, -112858, -15333, 326619, -108354, -70979, -81283, 258192, -28166, -242719, -244340, -81988, 197624, 85989, 28889, 173760, 164300, -84703, -56211, -132405, 118768, 3743, 94229, -21328, -12399, 3671, -33151, 56464, 5119, -397535, -316034, -124406, -79105, 57560, -218199, -284589, -67124, 168479, -145070, -121807, 289269, 114295]
$$ [...]
##END NTUPLES=NMR SPECTRUM
##END=
