
##TITLE=AC1223_Punto_6074882_m5SeEwai4W
##JCAMPDX= 6.0         $$ Bruker NMR JCAMP-DX V2.0
##DATA TYPE= NMR SPECTRUM
##DATA CLASS= NTUPLES
##ORIGIN= BRUKER
##OWNER= Administrator
$$ 1.72 TOPSPIN		Version 2.1
$$ 2012-05-07 21:53:52.562 -0500  Administrator@TOPSPIN
$$ Compression mode = diff/dup
##.OBSERVE FREQUENCY= 400.13188235
##.OBSERVE NUCLEUS= ^1H
##.ACQUISITION MODE= SIMULTANEOUS (DQD)
##.ACQUISITION SCHEME= undefined
##.AVERAGES= 64
##.DIGITISER RES= 22
##SPECTROMETER/DATA SYSTEM= spect
##.PULSE SEQUENCE= noesygpps1d.comp
##.SOLVENT NAME= COFFEE_meoh
##.SHIFT REFERENCE= INTERNAL, COFFEE_meoh, 1, 14.9667
##AUDIT TRAIL= $$ (NUMBER, WHEN, WHO, WHERE, PROCESS, VERSION, WHAT)
$$ ##TITLE= Audit trail, TOPSPIN		Version 2.1
$$ ##JCAMPDX= 5.01
$$ ##ORIGIN= Bruker BioSpin GmbH
$$ ##OWNER= Administrator
$$ $$ C:\Bruker\TOPSPIN/data/COFFEE/nmr/AC1223_Punto_6074882_m5SeEwai4W/12/pdata/1/auditp.txt
$$ ##AUDIT TRAIL=  $$ (NUMBER, WHEN, WHO, WHERE, PROCESS, VERSION, WHAT)
(   1,<2012-05-07 21:53:46.937 -0500>,<Administrator>,<TOPSPIN>,<go>,<TOPSPIN 2.1>,
      <created by zg
	started at 2012-05-07 21:42:16.703 -0500,
	POWCHK enabled, PULCHK disabled,
       configuration hash MD5:
       AF F2 23 6B 01 CD 40 DD E5 A1 38 A0 06 EA F7 77
       data hash MD5: 64K
       21 1F DF 08 C6 EE CD 1D 4A 71 24 0A 79 8A BB 71>)
(   2,<2012-05-07 21:53:50.500 -0500>,<Administrator>,<TOPSPIN>,<proc1d>,<TOPSPIN 2.1>,
      <Start of raw data processing
       efp LB = 0.3 FT_mod = 6 PKNL = 1 PHC0 = 0 PHC1 = 0 SI = 128K 
       data hash MD5: 128K
       61 9C EB 2B E0 5C 87 D6 69 7B 95 0A D1 18 0F 41>)
(   3,<2012-05-07 21:53:51.671 -0500>,<Administrator>,<TOPSPIN>,<proc1d>,<TOPSPIN 2.1>,
      <pk PHC0 = 34.24438 PHC1 = 0 
       data hash MD5: 128K
       75 3C 80 22 20 CD F9 E0 8D 6D 8F D9 9C AF 23 70>)
(   4,<2012-05-07 21:53:52.218 -0500>,<Administrator>,<TOPSPIN>,<proc1d>,<TOPSPIN 2.1>,
      <abs ABSG = 1 
       data hash MD5: 128K
       C1 32 43 5E EC 72 CD D2 AF 16 32 62 31 AC 73 A4>)
(   5,<2012-05-07 21:53:52.296 -0500>,<Administrator>,<TOPSPIN>,<proc1d>,<TOPSPIN 2.1>,
      <abs ABSG = 2 
       data hash MD5: 128K
       DF 86 11 EA FA 76 75 0B EB 2D 06 62 AB 3F CE 91>)
(   6,<2012-05-07 21:53:52.375 -0500>,<Administrator>,<TOPSPIN>,<proc1d>,<TOPSPIN 2.1>,
      <abs ABSG = 3 
       data hash MD5: 128K
       62 FD A8 B2 04 97 CF 4A 33 F3 F7 B1 78 89 65 13>)
(   7,<2012-05-07 21:53:52.421 -0500>,<Administrator>,<TOPSPIN>,<proc1d>,<TOPSPIN 2.1>,
      <abs ABSG = 4 
       data hash MD5: 128K
       D3 42 0B 22 BA FB 47 DF 79 9A 3F AA 80 28 69 6E>)
(   8,<2012-05-07 21:53:52.484 -0500>,<Administrator>,<TOPSPIN>,<proc1d>,<TOPSPIN 2.1>,
      <abs ABSG = 5 
       data hash MD5: 128K
       00 0A 89 FE DC 8E 5D 43 10 84 38 29 1B BA 71 C5>)
$$ ##END=
$$ 
$$ $$ hash MD5
$$ $$ B9 96 4F 9E 59 12 D9 A1 B3 C0 55 7B 52 B7 B2 33
##$RELAX= 
##$RELAX= 
##$RELAX= 
##$RELAX= 
##$RELAX= 
##$RELAX= 
##$RELAX= 
##$RELAX= 
$$ Bruker specific parameters
$$ [...]
##$TP07= 0
##$TPNAME0= <>
##$TPNAME1= <>
##$TPNAME2= <>
##$TPNAME3= <>
##$TPNAME4= <>
##$TPNAME5= <>
##$TPNAME6= <>
##$TPNAME7= <>
##$TPOAL= (0..7)
0.5 0.5 0.5 0.5 0.5 0.5 0.5 0.5
##$TPOFFS= (0..7)
0 0 0 0 0 0 0 0
##$TUNHIN= 0
##$TUNHOUT= 0
##$TUNXOUT= 0
##$USERA1= <user>
##$USERA2= <user>
##$USERA3= <user>
##$USERA4= <user>
##$USERA5= <user>
##$V9= 5
##$VALIST= <valist>
##$VCLIST= <CCCCCCCCCCCCCCC>
##$VD= 0
##$VDLIST= <DDDDDDDDDDDDDDD>
##$VPLIST= <PPPPPPPPPPPPPPP>
##$VTLIST= <TTTTTTTTTTTTTTT>
##$WBST= 1024
##$WBSW= 4
##$XGAIN= (0..3)
0 0 0 0
##$XL= 0
##$YL= 0
##$YMAX_a= 10768935
##$YMIN_a= -5648972
##$ZGOPTNS= <>
##$ZL1= 120
##$ZL2= 120
##$ZL3= 120
##$ZL4= 120
##$ABSF1= 14.9667
##$ABSF2= -5.585831
##$ABSG= 5
##$ABSL= 3
##$ALPHA= 0
##$AQORDER= 0
##$ASSFAC= 0
##$ASSFACI= 0
##$ASSFACX= 0
##$ASSWID= 0
##$AUNMP= <proc_prof1d_extract.lims>
##$AXLEFT= 0
##$AXNAME= <>
##$AXNUC= <1H>
##$AXRIGHT= 0
##$AXTYPE= 0
##$AXUNIT= <>
##$AZFE= 0.1
##$AZFW= 0.1
##$BCFW= 0
##$BC_mod= 0
##$BYTORDP= 0
##$COROFFS= 0
##$CY= 15
##$DATMOD= 1
##$DC= 0
##$DFILT= <>
##$DTYPP= 0
##$F1P= 0
##$F2P= 0
##$FCOR= 0.5
##$FTSIZE= 131072
##$FT_mod= 6
##$GAMMA= 0
##$GB= 0
##$INTBC= 1
##$INTSCL= 1
##$ISEN= 128
##$LB= 0.3
##$LEV0= 0
##$LPBIN= 0
##$MAXI= 10000
##$MC2= 0
##$MEAN= 0
##$ME_mod= 0
##$MI= 0
##$NCOEF= 0
##$NC_proc= -3
##$NLEV= 6
##$NOISF1= 0
##$NOISF2= 0
##$NSP= 0
##$NTH_PI= 0
##$NZP= 0
##$OFFSET= 14.9667
##$PC= 1
##$PHC0= 34.24438
##$PHC1= 0
##$PH_mod= 1
##$PKNL= yes
##$PPARMOD= 0
##$PPDIAG= 0
##$PPIPTYP= 0
##$PPMPNUM= 2147483647
##$PPRESOL= 1
##$PSCAL= 4
##$PSIGN= 0
##$PYNMP= <proc.py>
##$REVERSE= no
##$SF= 400.130005567469
##$SI= 131072
##$SIGF1= 0
##$SIGF2= 0
##$SINO= 400
##$SIOLD= 131072
##$SPECTYP= <>
##$SREGLST= <1H.CDCl3>
##$SSB= 0
##$STSI= 131072
##$STSR= 0
##$SW_p= 8223.68421052632
##$SYMM= 0
##$S_DEV= 0
##$TDeff= 65536
##$TDoff= 0
##$TI= <>
##$TILT= no
##$TM1= 0
##$TM2= 0
##$TOPLEV= 0
##$USERP1= <user>
##$USERP2= <user>
##$USERP3= <user>
##$USERP4= <user>
##$USERP5= <user>
##$WDW= 1
##$XDIM= 131072
##$YMAX_p= 464512619
##$YMIN_p= -92166055
##$CURPLOT= <Network HP LaserJet P1505>
##$CURPRIN= <$Network HP LaserJet P1505>
##$DFORMAT= <normdp>
##$LAYOUT= <+/1D_H.xwp>
##$LFORMAT= <normlp>
##$PFORMAT= <normpl>
##$SURQMSG= 1
$$ End of Bruker specific parameters
$$ ---------------------------------
##NTUPLES= NMR SPECTRUM
##VAR_NAME=  FREQUENCY,     SPECTRUM/REAL,   SPECTRUM/IMAG
##SYMBOL=    X,             R,               I
##VAR_TYPE=  INDEPENDENT,   DEPENDENT,       DEPENDENT
##VAR_FORM=  AFFN,          ASDF,            ASDF
##VAR_DIM=   131072,        131072,          131072
##UNITS=     HZ,            ARBITRARY UNITS, ARBITRARY UNITS
##FACTOR=    0.0627417313425165, 1,          1
##FIRST=     8223.62146879498, 9253,         -95774
##LAST=      0,             9331,            -95272
##MIN=       0,             -92166055,       0
##MAX=       8223.62146879498, 464512619,    0
$$ Real data points
##PAGE= N=1
##DATA TABLE= (X++(R..R)), XYDATA
$$ [...]
67372 162260 160416 158443 156258 154518 153788 153652 153039 151509 150000 149970 151693 153821 154908 154996 155192 156046
67356 156046 157155 158132 158977 159484 159367 159280 160507 162996 164766 164213 162201 160768 160438 160120 159313 158863 159422
67339 159422 160466 161393 162538 164421 166660 168334 169045 169112 168991 168827 168315 166777 163830 160302 158038 158318
67323 158318 160709 163828 166876 169885 172779 174937 175917 176113 176377 177112 177822 177543 175708 172713 169655 167516
67307 167516 166629 166790 167537 168268 168536 168514 168815 169602 170297 170602 171293 173183 175582 176871 176816 177252 179764 183414
67289 183414 185690 185427 183848 182839 183155 184586 186844 189454 191284 191264 189691 188174 188030 189154 190655
67274 190655 191956 192961 193688 194408 195841 198467 201708 204517 206751 209112 211533 212669 211778 210386 210938
67259 210938 213900 217225 218856 218946 219170 220516 222374 223551 223594 223078 222870 223225 223534 223014 221668 220456 220458
67242 220458 221953 224258 226286 227319 227510 227652 228218 228745 228483 227537 226762 226479 226021 224859 223508 222847 223084
67225 223084 224009 225736 228387 231357 233676 234939 235164 234056 231502 228743 227794 229211 231390 232645 233171
67210 233171 234247 236234 238325 239839 240865 241773 242852 244394 246449 248516 250013 250924 251460 251350 250339
67195 250339 249276 249591 251367 252934 252893 251686 250524 249568 248281 247095 247386 249539 252002 252749 251189 248293
67179 248293 245433 243606 243384 244791 246986 248537 248503 247421 247034 248811 252575 256655 259411 260530 260873
67164 260873 261524 263232 266315 270372 274134 276235 276341 275161 273391 271319 269531 269033 270053 271414 271865
67149 271865 271621 271809 272846 274300 276107 278716 281891 284511 286028 287263 289179 291568 293575 294947 296003
67134 296003 296775 296951 296525 295903 295431 295246 295366 295511 295080 293943 293147 294248 297910 303444 309457 314440 317065
67117 317065 316876 314879 312876 311980 312175 313159 314823 316810 318475 319782 321611 324574 327900 329984 329908 328157
67101 328157 326073 324936 325330 327049 329529 332289 334794 336260 336249 335388 334721 334256 333081 331309 330843 333338
67085 333338 338046 342616 345641 347546 349312 351319 353343 354796 354887 353320 351006 349487 349491 350490 351644 352634
67069 352634 353682 355490 359203 365554 373616 380953 385502 387125 387284 387600 388791 390462 391665 392017 392278
67054 392278 393345 394746 394992 393674 392317 392663 394860 397961 401417 405120 408611 411463 414238 417927 422255
67039 422255 425631 427111 427536 428215 429311 430255 431151 432754 435210 437731 439742 441688 444353 447862 451676
67024 451676 455295 458612 461847 465479 469927 474848 478928 480986 481365 481724 483328 485902 488270 489653 490202
67009 490202 490710 492013 494247 496463 497503 497507 497971 500016 503229 506643 509974 513253 516182 519010 523271
66994 523271 530044 537763 543383 545933 547519 550487 555011 559928 564496 568423 571360 573500 575926 579407
66980 579407 583405 587042 590378 593897 597458 600712 603966 607659 611444 614844 618338 622766 627948 632927
66966 632927 637286 641270 644931 648313 652198 657434 663555 669173 673725 677745 681575 685229 689680 696680
66952 696680 706579 717359 726527 733247 738267 742809 748091 754881 762720 770229 776865 783601 791310 799375
66938 799375 806767 813779 821673 830994 841017 850444 858035 863191 866887 871531 878864 888236 897873 907437
66924 907437 918092 930130 941937 951894 960318 968726 977718 986445 994244 1002179 1012456 1026138 1041818
66911 1041818 1057032 1070890 1084613 1099388 1114720 1129487 1143654 1157830 1171701 1184356 1196103
66900 1196103 1208766 1223821 1241044 1259110 1276713 1293074 1308428 1324440 1343189 1365098 1388369
66889 1388369 1410868 1432000 1452517 1473392 1495528 1519775 1546276 1574037 1601854 1629467 1657307
66878 1657307 1685570 1714316 1744249 1776434 1811091 1847267 1883866 1920547 1957562 1995256 2033946
66867 2033946 2073893 2115086 2157280 2200335 2244276 2289011 2334322 2380247 2427073 2474788 2522954
66856 2522954 2571495 2621280 2673487 2728541 2786121 2846027 2908361 2972656 3037538 3101838 3165821
66845 3165821 3230767 3297492 3365783 3435249 3505985 3578124 3651319 3725089 3799355 3874193 3949418
66834 3949418 4024981 4101535 4179932 4260096 4340890 4421159 4500436 4578621 4655611 4731556 4806932
66823 4806932 4881880 4955663 5027089 5095305 5159966 5221017 5278711 5333702 5386553 5436970 5483724
66812 5483724 5525417 5561224 5590974 5614846 5633312 5647308 5657957 5665605 5669091 5666404 5656344 5639320
66800 5639320 5616396 5588140 5554897 5517642 5477532 5434537 5387358 5334906 5277176 5214567 5147413
66789 5147413 5076767 5004727 4932964 4861244 4788224 4713394 4637415 4560744 4482930 4403623 4323573
66778 4323573 4244172 4166194 4089201 4012048 3933952 3855195 3776762 3699258 3622478 3546287 3471489
66767 3471489 3399281 3329988 3262890 3197168 3132489 3068722 3005718 2943485 2882086 2821238 2760496
66756 2760496 2700020 2640796 2583966 2530137 2479200 2430296 2382080 2333724 2285829 2239675 2195451
66745 2195451 2151906 2108050 2064361 2021747 1980070 1938520 1897054 1856591 1817933 1781205 1746262
66734 1746262 1712961 1681000 1650078 1620337 1592094 1565000 1537951 1510031 1481216 1452076 1423231
66723 1423231 1395211 1368350 1342465 1316961 1291609 1267006 1243929 1222357 1201371 1180010 1158000
66712 1158000 1135807 1114225 1093854 1074756 1056555 1038885 1021597 1004430 986839 968574 950301
66701 950301 933187 917800 903759 890482 877726 865260 852592 839434 825986 812248 797542
66690 797542 781518 765382 751100 739200 728188 716478 704103 692069 680845 670297 660571 652080
66678 652080 644735 637912 631135 624237 617011 609412 601945 595021 587862 578923 567752 555812 545179
66665 545179 536850 530387 524539 518050 510697 503946 499759 498090 496200 491272 483300 474721 467671 462481
66651 462481 458524 455280 452301 448997 445073 440844 436794 432977 428938 424023 417817 410619 403436 397142
66637 397142 391571 385836 379527 373206 367617 362908 358818 355205 352077 349355 346938 344777 342623 339896
66623 339896 336190 331902 328007 325097 322793 320300 317441 314925 313426 312554 310976 307687 303035 298369
66609 298369 294776 292265 290090 287730 285391 283540 282027 280026 277031 273547 270337 267290 263856 260587
66595 260587 259209 260638 263677 266298 267502 267237 265274 261386 256420 252038 249350 248473 249139 250560 250875
66580 250875 248224 242976 237793 234816 233539 232049 229491 226492 223838 221761 220225 219090 217988 216604
66566 216604 215073 213738 212669 211640 210317 208177 204721 200256 196152 193758 193185 193441 193433 192483 190333 187340
66550 187340 184485 182653 181974 182187 183300 185411 188117 190625 192284 192697 191753 189995 188492 187584 186128
66535 186128 182719 177428 171703 167023 164399 164586 167449 171315 174262 176072 177755 179262 179256 177384 175082
66520 175082 173426 171717 169148 166416 164396 162411 159380 155890 153529 152660 152464 152840 154550 157468 160299
66505 160299 162350 164170 165972 166801 166014 164474 163401 162781 161693 159538 156258 152034 147640 144519 143515
66490 143515 143777 143750 143029 142389 142242 142107 141691 141480 141824 142212 141982 141281 140810 140960 141687 142993 144860 146712
66472 146712 147573 147064 145920 145030 144105 141823 137610 132860 129822 129322 130092 130452 130030 129445 128982 128440 128052
66455 128052 128603 130375 132656 134592 135967 136827 136961 136342 135661 135671 136116 135972 134779 133187 132064 131577 131328
66438 131328 130958 130311 129367 128427 128177 129122 130882 132321 132467 131215 129125 126684 124001 121304 119529 119882
66422 119882 122438 125462 126798 126158 125465 126531 128822 130172 129445 127712 126688 126801 127331 127840 128647 130007
66406 130007 131581 132885 133652 133437 131536 127958 124214 122333 122975 124982 126807 127699 127357 125372 121914
66391 121914 118523 117102 117954 119492 120148 119950 119949 120689 121729 122285 121892 120669 119369 118910 119522 120594 121699
66374 121699 123258 125626 127964 128989 128699 128284 128172 127358 125255 123123 122542 123082 122851 121238 119806 120044
66358 120044 121421 122468 123006 124006 125383 125277 122220 117358 113559 112382 112726 112709 112189 112598 114548 116535
66342 116535 116488 114082 110977 109020 108801 109849 111452 112976 113943 114389 114993 116391 118399 120220 121354 121887
66326 121887 121909 121171 119615 117919 117070 117422 118384 119057 118956 118126 116805 115146 113278 111520 110414 110335 111092
66309 111092 112059 112873 113798 115262 117184 119108 120894 122796 124728 125895 125595 124246 123136 123079 123543 123215
66293 123215 121273 118091 114963 113328 114006 116769 120566 124246 127127 128790 128630 126150 121898 117685 115389
66278 115389 115541 117255 119233 120435 120080 117893 114703 112237 111819 113395 115907 118234 119545 119278 117293
66263 117293 113832 109185 103936 99787 99058 102261 106762 109190 108946 108117 108122 108278 108049 108689 111318 114710
66247 114710 116688 116985 117048 117410 117040 115465 113901 113595 114160 114339 113664 112600 111557 110491 109289 108029
66231 108029 106968 106595 107459 109542 111877 113161 112882 111735 110878 110850 111291 111759 112617 114673 117764 120285
66215 120285 120662 119099 117342 116861 117770 119292 120555 120930 120374 119639 119613 120265 120793 120826 120728 120526 119387 116701
66197 116701 113109 109917 107949 107391 108161 109819 111455 112304 112357 112038 111618 111384 111979 113984 117145 120331
66181 120331 122159 121752 119440 116948 116155 117222 118555 119064 119568 121208 123399 124662 124893 125233 125813 125268
66165 125268 122939 120182 118743 118738 118995 118715 118066 117609 117797 118732 119894 120319 119469 117791 116360 116181 117766
66148 117766 120671 123294 123993 122894 121883 122251 123108 122855 121391 119753 118172 115984 113426 112016 112700
66133 112700 114764 117127 119636 122292 124176 124333 123263 122406 122357 122654 123180 124492 126494 128045 128534 128846
66117 128846 129860 130868 130654 129528 128896 128992 128583 127155 125940 126024 126647 126368 125075 123712 122664 121590
66101 121590 120487 119693 118987 117909 117051 117859 120800 124634 127860 130016 131187 131226 130158 128603 126997 124966
66085 124966 122330 120330 120851 124379 129383 133828 136802 138665 140232 142133 144630 147561 150264 151636
66071 151636 150627 147081 142150 137520 134066 131529 129506 128259 128346 129916 132642 135844 138414 139244 138401
66056 138401 137404 137666 138935 139927 140087 139929 139826 139551 139100 139051 139731 140697 141484 142364 144000 146683 150060 153187
66038 153187 154724 153767 150930 148187 147235 148320 150764 153903 156952 158731 158574 157324 156410 155932 154636
66023 154636 152100 149920 149886 151483 152217 150520 147570 145882 146552 148388 149512 149224 148152 147084 146088 144713
66007 144713 142676 140278 138256 137334 137824 139591 142246 145165 147450 148401 148366 148759 150654 153456 155499 155925
65991 155925 155427 155148 155554 156594 158189 159985 161157 161202 160652 160403 160561 160614 160557 161081 162531 164364 165819
65974 165819 166555 166409 165167 163006 160764 159348 159153 160285 162870 166671 170777 174342 177423 180505 183452
65959 183452 185700 187491 189925 193337 196472 198004 198433 199508 201882 204308 205365 205133 204648 204547 205158
65944 205158 207310 211615 216753 219927 219899 218755 219654 223500 228997 235367 243160 252133 260166 265385 268273
65929 268273 270560 272950 275118 277056 278756 279004 276382 271615 267281 264718 262739 260057 257402 256041
65915 256041 255459 254062 251486 248640 245748 241907 236763 231406 227159 224267 222091 219939 217378 214259
65901 214259 210727 207029 203360 200274 198920 200145 203383 207124 210369 213025 215120 216700 218500 221464
65887 221464 225294 228581 230868 233439 237351 241857 245779 249453 253970 259061 263182 265556 266892 267997
65873 267997 268901 269652 270990 273550 276878 279709 281101 281255 281465 283177 286732 291140 295441 299904 305281
65858 305281 311292 316910 322052 327777 334534 341387 347557 353561 359840 365227 368227 369497 371583 375989
65844 375989 381614 386421 389550 391160 391236 389829 388017 387254 387459 386751 383597 378464 372771 366978 360684
65829 360684 354183 348605 344272 339943 334207 326963 319106 311481 304711 299370 295426 291844 287481 282209
65815 282209 276621 271015 265445 260445 256757 254409 252892 252167 252539 253530 254002 253640 253228 252997 251833 248958
65799 248958 245549 243575 243454 243853 243640 243077 243040 243863 245278 246970 248816 250714 252416 253552 253898 253638
65783 253638 253304 253450 254560 257058 260901 265036 267960 269193 269761 270826 272353 273727 275193 277777 281858
65768 281858 286618 291108 295271 299688 304778 310545 316848 323583 330629 337691 344208 349603 353785 357314
65754 357314 360820 364336 367338 369201 369455 367916 365082 362215 360405 359406 357727 354034 348303 341765 336125
65739 336125 332693 331645 331847 331728 330602 329038 327970 327783 328346 329505 331250 333604 336682 340882 346841
65724 346841 355113 365717 377871 390280 402007 413191 424819 437733 451921 466593 480700 493397
65712 493397 504204 512768 518418 520162 517415 510599 500782 488774 474927 459767 444470 430511 418873
65699 418873 409544 401712 394721 389018 385862 385800 387813 390495 393755 398698 406090 415819 427796 442378
65685 442378 459494 478158 497308 516582 535799 554156 570474 583989 594579 602521 608245 611939
65673 611939 613063 610639 604212 594096 580538 563460 543504 522458 501749 481044 459312 437009
65661 437009 416163 398291 383082 369193 355531 341641 327771 315047 304942 297909 292774 287786
65649 287786 282182 276556 271974 268865 266502 263441 258771 253104 248071 244729 242766 241336 240225 239827
65635 239827 240348 241420 242408 242827 242647 242483 243322 245772 249690 254634 260304 266132 270918 273753 275411 278105
65619 278105 283486 291409 300936 311820 324243 337606 350749 363597 377679 394540 414194 435617
65607 435617 458299 482655 509127 537385 566246 593962 618879 640437 659551 677536 694739
65596 694739 710596 724612 736526 745715 751502 754286 755512 756282 756812 757441 759062 761934 764941 766738
65582 766738 766844 764977 760336 752634 742982 732371 719747 703023 681790 657712 632369 606137 579292
65569 579292 552706 526918 501671 476897 453138 430639 409183 389356 372674 359559 348256
65558 348256 336808 325271 314846 305692 297009 288808 282033 276871 272280 267478 262868 259123 256226
65545 256226 253923 252410 251937 252049 251790 250644 249096 248199 248566 249697 250440 250265 249879 250358 251956 254132
65529 254132 256418 258701 260867 262891 265283 268788 273427 278406 283221 288415 295035 303676 314319 326823
65515 326823 341300 358103 377443 398772 420602 441405 461001 480795 502304 525329 547606
65504 547606 566284 579960 589439 596456 601666 604207 603201 598876 591707 581304 567255 550632 533329
65491 533329 515888 497232 476748 455425 434490 414279 395213 378663 365595 355126 345558 336335
65479 336335 327836 319873 311869 304395 299015 296295 295040 293827 292310 290607 288438 285526 282126 278474
65465 278474 274215 268913 262722 256192 249968 245097 242843 243308 244698 244971 243985 243015 242260 240136 235573
65450 235573 229950 225744 223710 222424 220626 218999 219168 221502 224656 227114 228506 229277 229679 229698 229656 230205
65434 230205 231490 232809 233438 233532 233932 235318 237934 241937 247383 253732 259887 265020 269042 272043 273733
65419 273733 274024 273862 274676 276817 279156 280493 280777 280469 279335 276720 272836 268835 265371 261858 257586
65404 257586 253000 249197 246500 244298 242261 240968 240915 241352 240727 238394 235421 233378 232493 231493 229373
65389 229373 226639 224300 222205 219449 216384 214966 216504 219962 223286 225636 227324 228322 228364 228361 230098 234014
65373 234014 238500 242037 244993 248503 252482 255776 257744 258624 258600 257467 255214 252218 248844 245451 242733
65358 242733 241428 241624 242791 244368 245846 246577 246296 245738 245895 246686 247249 247642 249050 251846 254483 255295
65342 255295 254777 255123 257799 262345 267258 271220 273569 274530 275225 276874 279721 283087 286427 289730 292780
65327 292780 294751 294942 293526 291181 288365 285368 282773 281215 280681 280479 280024 279351 278803 278552 278647 279290 280710
65310 280710 282743 284821 286559 288241 290509 293672 297497 301729 306606 312756 320742 330711 342171 353873
65296 353873 364243 372496 379390 386533 394858 404025 413331 422705 432415 442056 450340 456070 459199 460779
65282 460779 461753 461757 459243 453047 443854 433884 425028 417470 410109 401937 392781 383057 373181 363186 352784
65267 352784 342005 331849 323816 318388 314371 310322 306262 303251 301542 300275 299177 299274 301038 302690
65253 302690 301658 297624 293017 290124 288548 286089 281685 276726 273490 272850 273769 274737 275163 275273 275143 274462
65237 274462 273291 272483 272915 274531 276535 278388 280255 282568 285514 288903 292094 294061 294028 292190 289466
65222 289466 286523 283470 280520 278230 276748 275549 274473 274366 275817 277675 277979 276377 274562 274009 274294
65207 274294 274250 273832 273790 273994 273307 271256 268853 267293 266509 265634 264553 264269 265605 267941 269590 269488 268303
65190 268303 267729 268681 270387 271327 270710 268712 265684 261860 257890 254739 252504 249943 246033 241751 239350
65175 239350 239668 241031 241301 240334 239623 239923 240263 239515 238024 237106 237467 238758 240348 241697 242000 240419 237160
65158 237160 233797 231980 232074 233376 235153 236771 237285 235992 233614 231996 232160 233310 234254 235103 236827 239533
65142 239533 242146 243754 244518 245031 245375 245117 243927 242070 240469 240249 241749 243959 245320 245256 244595 244520 245602
65125 245602 247926 251485 255942 260342 263580 265155 265466 265618 266915 269905 273568 275985 276262 275451 275173
65110 275173 275877 277010 278336 280101 282091 283576 284417 285508 287725 290917 294190 296884 299157 301952 306341
65095 306341 312434 318966 324548 329364 334885 341808 349218 356202 363385 372101 382722 394755 408068
65082 408068 422877 438574 453678 467291 479870 492311 504941 517740 530869 544310 557390
65071 557390 569243 579566 588371 595116 598752 598831 596194 592224 587652 582334 576085 569286 562464 555461
65057 555461 547231 536617 523420 508759 494372 481411 469833 458932 448343 438261 428729 419145
65045 419145 408899 398326 388541 380301 373288 366563 359372 351412 342722 333694 325013 317315 310843 305562
65031 305562 301547 299061 298167 298218 297922 296292 293704 291703 291348 292024 292346 291926 291517 291584 291710 291456 290703 288793
65013 288793 284582 278266 272191 268659 267494 266936 266384 266827 268737 271123 273072 274916 277181 279316 280214
64998 280214 279495 277744 275974 275182 275814 277155 277841 277460 277113 277909 279485 280655 281003 281055 281237 281532 282018
64981 282018 282886 283773 283735 282115 279143 275551 271948 268523 265028 260991 256246 251231 246555 242406 238764
64966 238764 236027 234838 235165 236055 236604 236891 237701 239496 241907 244162 245808 246973 247993 248879 249254 248923
64950 248923 248400 248716 250621 253981 257990 262002 266177 271207 277326 283732 289215 293246 296191 298569 300520
64935 300520 301995 303022 303662 304090 304735 305861 306995 307481 307665 308662 310612 312173 312483 312636 314189 316908
64919 316908 319232 320576 321759 323305 324698 325544 326094 326190 324836 321578 317389 313371 309251 304098 298123
64904 298123 292810 289226 286813 284113 280370 276239 272954 270979 269705 268443 267204 266264 265617 265480 266637
64889 266637 269151 271191 270581 267550 264522 262968 262098 261119 260960 262488 264517 265208 264531 263697 262917 261512
64873 261512 259891 259552 260918 262716 263891 264849 266372 268298 269715 269683 267645 264078 260888 259987 261056
64858 261056 261746 260714 259425 260289 263818 268389 272079 273999 274446 274648 275994 278778 281907 284369 286525
64843 286525 289434 293438 298184 303551 309585 315731 321101 325597 330036 335095 340823 347356 355428 365790
64829 365790 378271 391492 403382 412337 418457 423514 429123 435026 439871 443458 447064 451114 453610
64816 453610 451930 445882 438062 431178 425733 420466 414408 407965 402273 398047 395177 393095 391176 388879
64802 388879 385890 382311 378556 374943 371479 368149 365063 362049 358343 353223 347001 340958 336106 332240
64788 332240 328349 323734 318588 313642 309352 305398 301103 296478 292618 290599 290086 289657 288600 287702 287867
64773 287867 288658 288945 288626 288792 290103 291761 292404 291595 290073 288825 288314 288549 289579 291637 294761 298499
64757 298499 302361 306572 311823 317989 323680 327843 331458 336706 344433 353505 362904 373218 385126 397314
64743 397314 407282 414076 419081 423950 428710 432187 433404 432029 428248 423013 417996 414311 411183 406574
64729 406574 399499 391411 384931 381340 379583 377742 375132 372733 371781 372397 373655 374562 374671 374202 374066 375552
64713 375552 379301 384474 389353 392920 395603 398639 403054 409063 415879 422313 428327 435738 446288 459024
64699 459024 470966 480767 490080 500395 510246 517281 521931 526785 532759 538196 541928 544997 548546 551986
64685 551986 554411 556223 557826 557927 554856 548915 541751 533834 524327 513480 503293 495090 487741 479318
64671 479318 469770 461003 454610 450416 447203 444061 440798 437518 434340 431528 429562 428878 429526 431120 433041
64656 433041 434670 435646 436152 436865 438411 440884 444035 447606 451118 453607 454400 454108 454047 454350 453495 450084
64640 450084 444385 437508 429954 421937 414466 408776 404650 400434 395060 389255 384411 380914 378020 374908
64626 374908 371368 367713 364510 362378 361770 362687 364525 366364 367823 369726 373504 379635 386984 394059 400507
64611 400507 407039 414417 423160 433655 445523 456975 465841 471440 474757 476842 477933 478202 478162 477762
64597 477762 475837 471258 464258 456251 448721 442587 438149 435125 432975 431468 430782 431056 432288 434669 438374
64582 438374 442872 447185 451101 455443 460914 467465 475118 484377 495179 506436 517527 529448 543305
64569 543305 558192 571752 582605 591114 597963 603124 606274 607059 604766 598831 590174 580985 572434 563201
64555 563201 551066 535675 519043 503420 489296 475649 461651 447732 435164 425162 418505 415410
64543 415410 415031 415253 413860 410383 406392 403795 403354 404890 407991 411899 415500 418293 420959 424317 428326
64528 428326 432809 438359 445310 452350 457670 461405 465583 471577 478873 486480 494163 501778 508778 515137
64514 515137 521798 529333 536904 543188 547650 550372 551483 551402 550741 549124 544925 537155 526905 515840
64500 515840 503951 490124 474569 459183 445437 433172 421787 411443 402576 395102 388748 383640
64488 383640 380031 377863 377067 377852 380145 382945 384863 385406 385464 386347 388420 390732 391909 391257 388996 385698
64472 385698 381932 378469 376270 375786 376367 376697 375834 373804 371406 369618 368931 369022 369250 369564 370540 372384 374481
64455 374481 376335 378276 380569 382398 382732 381960 381649 382694 384688 387138 390264 394246 398715 403584 409534
64440 409534 416991 425207 433168 441044 450036 460945 473444 486470 498786 509327 517694 524403 530107
64427 530107 534475 536243 534530 529880 523926 518229 513509 509724 506700 504548 503413 502810 501603 498886
64413 498886 494860 490673 487472 485593 484349 482450 479008 474616 471336 471234 474790 480715 487033 492251
64399 492251 496026 499308 503555 509212 515035 519479 522563 525666 529557 533587 537176 541247 547501 556722
64385 556722 568367 581400 594919 608247 621227 634578 649516 666856 686796 709460 735197
64374 735197 764166 796013 830307 867343 908462 955463 1009400 1069712 1134788 1203790 1277956
64363 1277956 1359897 1451796 1554521 1668198 1792885 1928369 2073518 2225825 2381322 2535094
64353 2535094 2682638 2821119 2949139 3065310 3167484 3253358 3321016 3368560 3394013 3396417
64343 3396417 3376798 3337414 3280196 3206236 3116332 3011233 2891534 2758324 2614347 2464119
64333 2464119 2312599 2163816 2020563 1884755 1757724 1640327 1532899 1435104 1346125 1265370
64323 1265370 1192806 1128250 1070620 1018510 971350 929274 891853 857757 825877 796156 769110
64312 769110 745168 724556 706969 691015 674842 657837 640851 624260 606833 587570 567846
64301 567846 550345 536103 523873 512356 501767 492907 485896 480491 476892 475400 475631 476668 477965
64288 477965 479794 482823 487349 492773 497750 500989 501991 500994 498452 494876 490816 486411 481048 474107
64274 474107 466117 458597 452631 448162 444758 442358 440930 439966 438859 437441 435864 434263 432773 431433
64260 431433 429774 427010 423094 419245 416959 416760 418254 420909 424160 426952 427940 426329 422379 417154 412063
64245 412063 408313 406287 405371 404525 402945 400018 395105 387903 378985 369655 361366 355442 352871 353729 356893
64230 356893 360780 364309 366889 368038 367884 367822 369576 373327 377609 381427 385687 391832 399671 407439 413843
64215 413843 419271 424828 430905 437189 443731 451252 460004 468734 475446 479421 482028 485147 489115 492733
64201 492733 495013 496145 496702 496654 495594 493489 490737 487764 484863 482118 479021 474338 466897 456676 445052
64186 445052 433901 424470 416807 410020 403186 396260 390160 385842 383373 381949 380649 378964 376743 374028
64172 374028 371153 368824 367756 367976 368584 368520 367703 367193 367956 369742 371537 372839 373926 374914 375307 374683 373233
64155 373233 371269 368635 365103 361099 357643 355638 355295 356021 356800 357167 357937 360299 363844 366268 365812 363536
64139 363536 362308 363701 366668 369184 370443 371426 374003 379592 388095 397961 407565 416543 425552 435308
64125 435308 446559 460437 477407 495777 512561 526272 537758 547702 554516 555792 551006 541656
64113 541656 529309 514841 499388 484566 471212 458753 446362 434306 423685 415237 408793 403774
64101 403774 399768 396476 393362 389752 385464 381102 377422 374494 371869 369462 367728 367072 367694 370051 374468
64086 374468 380011 384788 388087 391379 396290 402357 407851 412184 416110 419837 422508 423744 424353 424933 424764
64071 424764 422726 418722 413817 409535 407198 407187 408480 409512 409849 410535 412693 416570 422146 429708 439249
64056 439249 449949 460821 471348 481203 490183 498973 509195 521902 536420 551123 564733 576419
64044 576419 585532 592134 597312 602171 607024 612110 618208 625570 633034 639434 645346 652146 659730 666471
64030 666471 671160 673566 673221 669260 661767 652022 641053 629079 616536 604340 592654 580588 567679
64017 567679 554642 542219 530460 519694 510913 504376 498937 493802 489900 488362 488515 488632 488059 487300
64003 487300 486555 485535 484492 484126 484587 485633 487601 490961 495014 498448 501423 505746 512466 520447 528032
63988 528032 535196 543264 553176 564754 577161 589406 600916 612300 625133 640179 656035 670208
63976 670208 681385 690068 697235 703257 708148 711916 714084 713501 709370 702417 694565 687432 681551 677011
63962 677011 674194 673350 673762 674036 673374 672070 670555 668581 665799 662500 658859 653725 645447 634333 623210
63947 623210 614662 608378 602251 595713 590549 588141 587149 584961 580903 577003 575634 577204 580408 584046
63933 584046 588040 592942 599042 606099 613593 621013 628046 634842 642297 651844 664547 680115 697000
63920 697000 713745 730222 747406 766125 786382 807815 830267 853793 878579 905102 933890
63909 933890 964781 996891 1029834 1064583 1102500 1143884 1188268 1235910 1288023 1345419 1408014
63898 1408014 1476092 1551139 1634708 1727173 1828494 1939794 2063299 2200926 2353774 2523013
63888 2523013 2710296 2916834 3142462 3385885 3645350 3918670 4202963 4494941 4791600
63879 4791600 5090242 5387512 5678325 5955831 6212562 6441816 6638437 6799063 6922023
63870 6922023 7006532 7051138 7053014 7009606 6921374 6792289 6627306 6430087 6203737 5952950
63860 5952950 5684235 5404190 5118379 4831713 4548725 4273010 4007080 3753162 3513637
63851 3513637 3290479 3084740 2896864 2726922 2574119 2436636 2312564 2200879 2101157 2012645
63841 2012645 1934095 1864332 1802461 1747478 1698152 1653468 1612929 1576160 1542277 1509815 1477394
63830 1477394 1444511 1411741 1380283 1351412 1326216 1305348 1288667 1275267 1264249 1255590 1250092 1248596
63818 1248596 1251419 1258369 1268951 1282669 1299505 1320007 1344436 1371736 1399845 1427237 1453963 1481112
63806 1481112 1509482 1538598 1566567 1591018 1610851 1627156 1641779 1654881 1664572 1669128 1668591 1663680
63794 1663680 1654164 1639381 1619924 1597609 1573720 1547947 1519040 1485918 1448259 1406853 1363568
63783 1363568 1320339 1277877 1235613 1192902 1149822 1106873 1064615 1023859 985652 950572 918192
63772 918192 887373 856963 826395 796178 767741 742118 718569 695255 671605 649221 629882
63761 629882 613440 598537 584726 572557 561847 551293 540220 529562 520459 512763 505711 499275
63749 499275 493793 488622 482399 474837 467366 461578 457529 453903 449489 444238 439215 435716 434080 433134
63735 433134 431122 427426 423072 419361 416417 413405 409771 405825 402343 400008 398935 398324 396922 394417
63721 394417 392086 391272 391388 390436 387673 384669 383104 382340 380231 375999 371295 368264 367382 367601 367976 368465
63705 368465 369317 370387 371320 371987 372391 372399 372043 371964 373002 375153 377484 379329 381036 383042 384750 385147 384386
63688 384386 383877 384658 386351 387943 388991 389782 390870 392899 396474 401716 408019 414442 420183 424673 427715
63673 427715 429894 432427 436163 440823 445462 449507 453189 457207 462129 467916 473882 479409 484722 490619
63659 490619 497375 504404 511039 516914 521405 523630 523647 522876 522521 522048 520065 516281 511747 507526 504095
63644 504095 501818 500839 500391 499190 496921 494723 493962 495024 497370 500090 502251 503435 504294 506072 509330
63629 509330 513453 517535 521277 524982 529217 534523 540771 546651 550527 552089 552515 552887 553281 553767 555160
63614 555160 557902 560912 562582 562694 562589 563701 566473 570311 573836 575455 574506 571771 568300 564095 558700
63599 558700 552741 547747 544421 542084 539972 538026 536160 533735 530444 527006 524470 523390 524089 526868
63585 526868 531267 535859 539810 544222 550934 560140 570131 579320 587633 595869 604627 614145 624429 635227
63571 635227 646529 659309 674959 693488 712985 731466 748789 766214 784789 805004 827581
63560 827581 853455 882864 915214 949990 987200 1026924 1069047 1113571 1160594 1209878 1261048
63549 1261048 1314352 1370468 1429137 1488432 1545708 1598752 1645667 1684297 1712687 1730236 1738102
63538 1738102 1738477 1733506 1724511 1711908 1695978 1677713 1658402 1638159 1615457 1588637 1557476 1522798
63526 1522798 1485078 1444350 1401367 1357922 1315643 1274903 1235247 1196725 1160578 1128604 1101771
63515 1101771 1079545 1060839 1045450 1033903 1025875 1019927 1015548 1014406 1018191 1025773 1034212 1042636 1053426
63502 1053426 1068902 1088304 1109176 1130674 1154086 1180566 1209849 1241416 1275745 1313852 1356259
63491 1356259 1402970 1454096 1509832 1569946 1633821 1701055 1771186 1841991 1908172 1962765 2000709
63480 2000709 2021201 2026706 2020457 2005428 1984827 1961971 1938965 1916023 1892366 1867366 1840747 1812212
63468 1812212 1781142 1746301 1705900 1658770 1605772 1549384 1491511 1432398 1372130 1312306 1255149
63457 1255149 1201302 1149610 1099171 1050907 1006916 968791 936596 908921 883654 859150 835020
63446 835020 811889 790499 771265 754451 740115 727695 716167 704990 694712 686285 679896 674689
63434 674689 669490 663593 657031 650473 644960 641286 639324 638048 636470 634520 632910 632294 632857 634545 637202
63419 637202 640353 643386 646284 649859 654801 660608 665681 668443 668288 665773 662239 659082 657062 656321 656900
63404 656900 658650 660536 661015 659841 658810 659766 662346 664823 666876 670262 676654 685958 696935 708396
63390 708396 719462 729716 739681 750565 763297 778445 796965 819774 846282 874667 904220 936246
63378 936246 972007 1011146 1053255 1099767 1152592 1211150 1271819 1329993 1381957 1425586 1460737
63367 1460737 1489142 1513287 1535589 1558850 1586230 1619421 1657496 1698920 1744181 1795050 1851740
63356 1851740 1912443 1975450 2039736 2102995 2160646 2207735 2241281 2260899 2268437 2267186 2260025 2247523
63344 2247523 2228681 2203753 2175138 2145005 2113296 2078713 2040399 1997691 1949484 1895446 1837404
63333 1837404 1778083 1718498 1657715 1595400 1533697 1476069 1424611 1378861 1337070 1298287 1262963
63322 1262963 1231777 1204558 1180870 1161149 1146370 1136742 1131513 1130006 1131925 1136638 1143396 1152809 1167101
63309 1167101 1188077 1215360 1247196 1282399 1320887 1362885 1408374 1457108 1508657 1562716 1619660
63298 1619660 1680290 1744593 1811147 1878077 1943961 2007320 2065878 2117039 2158768 2189536 2208184
63287 2208184 2214803 2211391 2200738 2184663 2163806 2138719 2110323 2079465 2046756 2012587 1976513 1936726
63275 1936726 1891066 1838852 1781368 1720675 1658525 1596274 1534983 1475390 1418346 1365531 1319198
63264 1319198 1280741 1249672 1224292 1203341 1186725 1174189 1163098 1148099 1124252 1091000 1052424
63253 1052424 1013141 974778 936978 900574 867967 840559 817260 795932 775325 755371 736600
63242 736600 719761 705260 692496 680327 668545 658325 650753 645352 640401 634371 626797 618271 609976
63229 609976 602842 596713 590514 583464 575876 568641 562372 557399 554087 552579 552343 552475 552425 552111 551441 550203
63213 550203 548584 547429 547675 549543 552472 555830 559477 563503 567640 571327 574469 577805 582293 588321
63199 588321 595702 604192 613715 624152 635136 646045 656209 665441 674482 684505 695897 707948
63187 707948 720067 732803 747131 763268 780973 800637 823084 848250 874946 902099 929653
63176 929653 958247 988740 1022083 1058623 1097083 1134931 1170364 1203621 1236086 1268661 1301411
63165 1301411 1334205 1366999 1399577 1431378 1461641 1489757 1515868 1541140 1566917 1593306 1618801
63154 1618801 1641222 1658520 1668885 1671144 1665621 1653841 1636720 1613663 1584101 1549342 1511999 1473979
63142 1473979 1435942 1398519 1362969 1330371 1300984 1274889 1252798 1235751 1224133 1217216 1213640 1212196
63130 1212196 1212263 1213714 1216740 1222001 1230717 1243978 1261620 1282035 1303408 1324909 1346511 1368166 1389717
63117 1389717 1411388 1433596 1456081 1477658 1497132 1514247 1529527 1543194 1554401 1561597 1563650 1560413
63105 1560413 1552129 1538670 1519875 1496433 1469609 1439907 1406781 1370019 1330662 1289970 1248246
63094 1248246 1205650 1163604 1124195 1088218 1054904 1023663 994986 969231 945601 923207 902522
63083 902522 884833 870454 858289 847103 836531 826692 817551 809147 802033 796890 793718 791863 790933
63070 790933 791210 792943 795665 798698 801963 805638 809128 811332 812274 813737 817571 823769 830797 837502 843874
63055 843874 850112 855970 861382 867031 873613 880861 887830 894098 900146 906390 912277 916785 919791 922496
63041 922496 926230 931001 935536 938680 940521 942270 945422 950962 958764 967512 975539 982016 987031 990609
63027 990609 992382 992633 992886 994608 997688 1001043 1004605 1009781 1017728 1027864 1038565 1048982 1059815 1072430
63013 1072430 1087505 1104550 1122681 1141710 1162325 1185295 1210937 1239385 1270786 1304867 1340904
63002 1340904 1378737 1419380 1463899 1512069 1563011 1616894 1674966 1737840 1804804 1875096 1948927
62991 1948927 2026687 2107825 2191146 2275779 2361306 2447249 2532875 2617374 2700048 2780676 2859919
62980 2859919 2938951 3018313 3097396 3175259 3251433 3325441 3395853 3460436 3517157 3564579 3601268
62969 3601268 3625307 3634743 3628514 3606866 3570818 3521282 3458904 3384986 3302344 3214850 3125980 3037874
62957 3037874 2951592 2867909 2787997 2713722 2647184 2589455 2539990 2497946 2463928 2439415 2424349
62946 2424349 2416475 2413739 2416392 2425835 2442098 2463618 2489046 2518011 2549932 2583197 2616145 2648364
62934 2648364 2680555 2713340 2746505 2779127 2809994 2837794 2861177 2878958 2890452 2895454 2893728 2884544
62922 2884544 2866940 2840404 2805019 2761033 2708563 2647882 2579660 2504975 2425386 2342996 2260061
62911 2260061 2178438 2099547 2024568 1954049 1887513 1824252 1764593 1709679 1659912 1614415 1572093
62900 1572093 1532290 1494257 1457254 1421737 1389318 1360674 1334348 1308362 1282039 1255416 1228031
62889 1228031 1199723 1171837 1146106 1122570 1099903 1077502 1056074 1036403 1018718 1002936 988242
62878 988242 972732 955115 936769 920601 907693 896556 885881 876220 868187 860674 852181 843009
62866 843009 834938 829215 825674 823324 821075 818370 815693 814041 813477 812761 810898 808230 805345 801725 796574
62851 796574 790619 785876 783388 781931 779287 774474 768446 762785 758026 753594 749277 745962 744334 743564
62837 743564 742425 741404 742205 745004 747684 748425 747762 747316 747700 748733 750601 753408 756224 757955 758860 760028
62821 760028 761651 762952 763588 763925 763922 762922 760877 758872 758036 758454 759397 760157 760438 760264 759655 758361 756160
62804 756160 753563 751611 750488 748967 746142 743289 742909 745840 750189 753307 754208 753902 754031 755465 757905
62789 757905 760585 763264 766168 768906 770314 770102 769956 771839 775496 778669 779723 779033 777862 777042 776915
62774 776915 777517 778443 779292 780448 782668 785852 789140 792319 796097 800789 805875 811233 817521 824634 830966
62759 830966 835284 838528 842793 849206 857719 868227 880464 893139 904582 914510 924231 934977 946969
62746 946969 960298 975636 993323 1012353 1031125 1049227 1067957 1089013 1112943 1139021 1166447
62735 1166447 1195457 1227269 1263082 1303202 1347041 1393967 1444265 1499311 1560625 1628660 1702708
62724 1702708 1782065 1866938 1958071 2055882 2160358 2271221 2387528 2507364 2628705 2750381
62714 2750381 2871366 2989070 3099177 3197385 3280648 3346736 3393660 3420167 3426164 3412096 3378442
62703 3378442 3326390 3258536 3178162 3087781 2988680 2881810 2768937 2653049 2537520 2424507
62693 2424507 2314198 2206096 2101019 2001131 1907944 1821147 1739787 1663777 1593638 1529319 1469945
62682 1469945 1414491 1362344 1313607 1269138 1229923 1196097 1167001 1142203 1121632 1104458 1088884
62671 1088884 1073753 1059565 1047209 1036501 1026891 1018867 1013545 1011238 1011413 1013767 1018423 1025303 1034111
62658 1034111 1044749 1057050 1070493 1085019 1101721 1121796 1145156 1171000 1199443 1231523 1267869
62647 1267869 1308561 1354075 1405094 1461324 1521734 1586166 1655615 1730692 1810852 1895298 1983386
62636 1983386 2073695 2163845 2251824 2336633 2417177 2491550 2558035 2615795 2663722 2699340 2719755
62625 2719755 2723272 2709641 2679530 2634655 2577825 2511758 2437916 2357076 2270672 2180768 2088953
62614 2088953 1996200 1904001 1814896 1731378 1654231 1582051 1512587 1444994 1380875 1322707 1271103
62603 1271103 1224139 1179601 1137293 1098657 1064728 1035198 1009224 986328 966344 948862 932855
62592 932855 916831 899620 881283 863059 846276 831523 818850 808139 798935 790514 782581 775432
62580 775432 769082 762916 756831 752024 749707 749476 749861 750165 750693 751380 751476 750767 750048 750031 750667 751877 754006
62563 754006 757080 760495 764097 768757 774992 781624 786917 790877 795508 802789 813148 825906 840276
62550 840276 855599 871436 888093 906638 927782 951033 975559 1001689 1030763 1063360 1098466
62539 1098466 1134920 1173241 1215359 1262622 1314635 1370019 1427656 1486776 1546221 1604154 1658505
62528 1658505 1707429 1749406 1783267 1808266 1823954 1829876 1825578 1811129 1787612 1756866 1720527 1679325
62516 1679325 1633390 1583245 1530362 1476692 1423722 1372089 1321933 1273391 1226693 1181966 1139178
62505 1139178 1098425 1060270 1025571 994732 967141 941692 917969 896594 878272 862920 850043
62494 850043 839550 831563 825560 820273 814519 807814 800341 792829 786362 781672 778525 776293 775056 775469
62480 775469 777495 780165 782861 786027 790073 794380 798157 801773 806419 812746 820517 829414 839483 850872
62466 850872 863752 878530 895716 915623 938573 965141 995758 1030260 1068361 1110219 1155928
62455 1155928 1204715 1255486 1307991 1362515 1418461 1474212 1528532 1580904 1630159 1673978 1710646
62444 1710646 1740367 1763919 1780916 1790625 1793914 1792720 1787578 1777205 1761013 1740820 1719380 1698288
62432 1698288 1678330 1661079 1648744 1642487 1641883 1646163 1655208 1669220 1688265 1712464 1741985 1776430
62420 1776430 1814805 1856526 1901979 1951446 2003732 2056316 2106641 2152649 2192273 2223289 2244223
62409 2244223 2255155 2257183 2250775 2234569 2206040 2163832 2109596 2047233 1980219 1910047 1837217 1762791
62397 1762791 1688216 1614350 1541742 1471695 1406108 1346216 1292139 1243542 1199940 1160502 1124599
62386 1124599 1092638 1065440 1042637 1022700 1004713 989065 976019 964857 955144 947712 943378 941430
62374 941430 940309 939188 937956 936282 933715 930185 925301 917643 906040 891517 876804 863792 852251
62361 852251 841027 829435 817359 804996 793001 782229 772944 764732 757374 751248 746665 743328 740665
62348 740665 738233 735631 732437 728495 724033 719520 715779 714009 714953 717794 720527 721792 721987 722415 723850
62333 723850 726363 730114 735585 742879 751124 758924 765528 771355 777275 783706 790876 799625 810901 824260
62319 824260 838032 851672 867000 886047 908441 932064 955770 980222 1006521 1035445 1067723
62308 1067723 1103547 1141758 1181004 1221814 1266206 1315299 1368952 1427785 1493515 1566647 1645904
62297 1645904 1730821 1822807 1922058 2025208 2127896 2228171 2325090 2415081 2492452 2553519 2598149
62286 2598149 2627262 2641117 2640602 2628060 2605403 2572492 2528445 2473864 2410917 2341758 2267698 2189727
62274 2189727 2109311 2028594 1949862 1874672 1803756 1737971 1678716 1626465 1579360 1534716 1492041
62263 1492041 1453184 1418945 1386925 1353763 1318631 1283446 1250222 1219327 1189968 1161164 1132113
62252 1132113 1102675 1073906 1047601 1024833 1005105 987048 969739 953288 938427 925696 914919
62241 914919 905427 896837 889435 883598 878969 874655 870274 866464 864115 863376 863609 864241 865411 867903 872657
62226 872657 880218 890267 901533 912403 921984 930635 939479 949532 961347 975156 990781 1007366
62214 1007366 1023696 1039330 1055478 1074504 1098214 1126405 1157046 1188209 1220048 1254790 1294673
62203 1294673 1340169 1390529 1445668 1506792 1575233 1651417 1735055 1825495 1921444 2020945 2122089
62192 2122089 2223209 2321973 2414908 2498507 2570371 2628777 2671781 2697794 2706909 2700823 2681409
62181 2681409 2649922 2607227 2553788 2489446 2414194 2329634 2239061 2145810 2051965 1958767 1867540
62170 1867540 1779805 1696935 1620038 1549809 1486128 1428030 1374350 1324422 1278361 1237002 1201336
62159 1201336 1171357 1145518 1122012 1100615 1082473 1067952 1055625 1043858 1032554 1022783 1015408 1010808
62147 1010808 1009348 1011120 1015325 1020666 1026459 1033116 1041670 1052936 1066739 1081669 1096093 1109775 1123855
62134 1123855 1138782 1153141 1165526 1176892 1189677 1204640 1219862 1233087 1244015 1253908 1263898 1274290
62122 1274290 1284952 1295790 1307129 1319747 1334070 1349266 1363891 1377744 1392428 1409761 1430465
62111 1430465 1454945 1484468 1520495 1563259 1611953 1666160 1726195 1791976 1862251 1935039 2008181
62100 2008181 2079344 2146003 2205576 2255349 2292650 2315975 2326179 2325837 2317078 2300408 2275562 2242607
62088 2242607 2201789 2153165 2097193 2035434 1970123 1903325 1836875 1772605 1711926 1655451 1603649
62077 1603649 1557500 1517765 1483917 1454767 1430074 1410458 1395617 1383805 1373623 1365380 1360007 1357474
62065 1357474 1357196 1359345 1364581 1372648 1382180 1391792 1400426 1406751 1409456 1408659 1406125 1403407 1400427 1396448
62051 1396448 1391733 1387178 1382529 1376061 1366358 1353815 1340164 1327065 1315462 1305628 1297137 1289083 1281129
62038 1281129 1274534 1271489 1273067 1278145 1284771 1292336 1301882 1314250 1328511 1342612 1355425 1367751 1381317
62025 1381317 1397127 1415025 1434523 1455493 1477840 1501080 1524969 1550496 1579441 1612518 1648445
62014 1648445 1685439 1723417 1764092 1808963 1857780 1909055 1961531 2014930 2069670 2126066 2183705
62003 2183705 2241588 2299106 2356574 2414058 2469598 2519291 2559474 2588382 2605675 2611346 2605791 2590256
61991 2590256 2566257 2534605 2495332 2448293 2393475 2331242 2262838 2190294 2115311 2038694 1961367
61980 1961367 1885146 1811523 1740267 1670460 1602719 1539110 1480824 1427094 1376627 1329015 1284397
61969 1284397 1242850 1204701 1170617 1140765 1114288 1089897 1066496 1043268 1020094 998101 978779
61958 978779 962176 946917 932305 919120 907658 896398 883906 871069 860033 851542 844706 838925
61946 838925 834524 831682 830203 830399 832766 836448 839350 840398 840809 842517 845969 849903 852618 853033 851155
61931 851155 848044 845040 842568 839905 836153 831035 824731 817649 810665 804899 800700 797227 793351 788726
61917 788726 783865 779612 776650 774829 772680 768379 761780 754874 749629 745991 742769 739892 738591 739397
61903 739397 740952 741037 738231 732669 725998 720761 718861 720038 722297 724252 726627 731043 737774 745379 752410
61888 752410 758925 766269 775784 787893 802068 817383 833176 849464 866845 885966 906958 929325
61876 929325 952370 975687 999149 1022439 1044897 1066039 1086016 1105134 1122984 1138539 1151203
61865 1151203 1161317 1169336 1174991 1177682 1177332 1174292 1168701 1160687 1151175 1141752 1133564 1126989 1122557 1121338
61851 1121338 1123838 1129156 1135973 1144002 1153744 1165080 1176922 1188189 1198378 1207240 1214627 1220653 1225189
61838 1225189 1227100 1224886 1218309 1208480 1196017 1180274 1161167 1140668 1121168 1102856 1084064 1064054
61826 1064054 1044197 1026196 1010297 995762 982239 969945 958885 948430 937554 925459 912332
61815 912332 899556 888697 880063 872618 865403 858534 852703 848373 845842 845509 847585 851857 858088 866227
61801 866227 875904 886268 896987 909096 924302 943608 966959 993699 1022670 1052413 1082385 1113910
61789 1113910 1148806 1186845 1225572 1263029 1299549 1336111 1371957 1405141 1434905 1461843 1485493
61778 1485493 1503386 1513521 1516820 1515896 1511913 1504170 1492769 1480074 1468772 1459741 1453016 1449864 1452128
61765 1452128 1459508 1469105 1478257 1486768 1495722 1505112 1513530 1519395 1521241 1517159 1505289 1485331 1458913
61752 1458913 1428190 1394471 1358337 1320512 1282124 1244191 1207033 1170305 1133779 1098239 1065275
61741 1065275 1035831 1009177 983779 959055 935811 915047 896919 880941 866667 853979 843037
61730 843037 834027 826607 819659 812074 803845 795875 788735 782206 776143 770968 766920 763562 760564 758414
61716 758414 757637 757665 757104 754985 751329 746859 742742 740251 739824 740370 740167 738627 736826 736279 737620 740372
61700 740372 743444 745651 746305 745686 744866 744905 746225 748562 751211 753456 755155 756909 759344 762228 764607
61685 764607 765695 765261 763333 760126 756266 752462 748883 745420 742582 741377 742037 743633 745399 747717 751231
61670 751231 755607 759929 763900 767870 771932 775729 779004 781650 783405 784311 785370 787788 791331 794342
61656 794342 795847 796921 799286 803076 806838 809566 811823 814485 816916 817176 814156 809056 804284 800964
61642 800964 797973 793564 787407 780611 774148 767942 761535 755023 749129 744599 741615 739487 736943 733127
61628 733127 728356 723607 719429 715851 713151 711720 710966 709360 706149 702344 699351 697322 695624 694206
61614 694206 693363 692516 690561 687521 684788 683374 682820 682153 681029 679374 676781 673156 669582 667577 667498 668289
61598 668289 668873 669249 670019 671238 672156 672079 671192 670314 669901 669680 669514 670170 672553 676152 678942 679254 677455
61581 677455 675566 675540 678101 682741 688290 693533 697632 699969 699811 696679 691211 685062 679455 674365 669560
61566 669560 665770 663917 663543 663022 661344 658781 655786 652201 648001 644036 641452 640751 641729 643805 645937
61551 645937 646603 644543 639600 632645 624836 617080 609911 603516 597826 592666 587738 582594 576956 571012
61537 571012 565023 558726 551685 544321 537906 533217 529767 526560 522895 518094 511446 503392 496084 491555
61523 491555 489382 487163 483371 478884 475524 473893 472965 471230 467907 463534 459764 458195 458964 460553 461165
61508 461165 460259 458692 457567 457047 456329 454861 453366 453067 453751 453456 450898 447519 445966 446846 448313 448926
61492 448926 449445 451234 454201 457265 459954 462424 464484 465772 466700 468262 470792 473600 475903 477645 479285
61477 479285 481042 482393 482317 480415 477825 476291 475998 475217 472883 470599 470788 473416 476071 477249 477965 479772
61461 479772 482583 485167 486652 486676 485043 482232 479520 477487 474984 470844 466361 464633 467077 471562 474519
61446 474519 474246 471797 469389 468603 469607 471219 471693 470076 467057 464250 462548 461449 460095 458613 458126
61431 458126 459368 461483 462472 461138 458573 457344 458880 461984 464327 465129 465623 467018 469130 471462 474566
61416 474566 479175 484555 488972 491744 493702 495511 496703 496888 496857 497670 499325 501100 502724 504372 505843
61401 505843 506574 506360 505455 504078 502356 500597 499084 497830 497059 497512 499412 501372 501501 499807 498525 499578
61385 499578 502388 504756 505387 505023 505410 507655 511501 515872 520035 524160 528630 533116 536867 539841 542848
61370 542848 546464 550440 554405 558406 562321 565464 567457 568995 570912 572738 573073 571484 569312 568316 569066
61355 569066 571071 573994 577982 582770 587195 590203 592061 593942 596285 598200 598687 597702 595563 592070 587180
61340 587180 582114 578664 577341 577089 576790 576022 574364 571347 567641 565116 564805 565640 566013 565714 565360 564765
61324 564765 563291 561430 560550 561002 561720 562015 562668 564685 567757 570588 572336 573247 574193 575911 578469 581197
61308 581197 583287 584551 585376 586051 586665 587634 589592 592401 594946 596565 598293 601995 608440 616825 626089
61293 626089 635804 645656 654978 663502 672046 681571 691737 701299 709927 718675 728241 737741 746024 753498
61279 753498 761574 770542 779165 786365 792280 797438 801957 805979 809873 813301 814926 813938 811340 808922
61265 808922 807470 806745 806651 807204 807540 806281 803272 800181 798927 800074 803004 807015 811835 817503 824281
61250 824281 832573 842523 853729 865582 877925 891230 905971 921777 937382 951614 964266 975530
61238 975530 984685 990170 991286 989075 984969 979325 972131 964436 957671 951684 944782 936098 926763 918269
61224 918269 910660 903120 895534 888421 881633 874279 866243 859043 854602 853263 853422 853207 852174 851140 850751
61209 850751 851050 852429 855891 861581 867922 873358 878508 885264 893929 902798 910867 919302 929333 940112
61195 940112 950012 959050 968340 977592 985054 990202 994890 1001003 1008065 1014153 1018401 1021503 1024149 1026225
61181 1026225 1027665 1028990 1030487 1031558 1031575 1030886 1030264 1029670 1028477 1026880 1026064 1026576 1027342 1026989 1025670 1024830
61165 1024830 1025522 1027790 1031523 1036911 1043724 1050954 1057718 1064084 1070545 1077025 1082966 1088249 1093480 1099317
61151 1099317 1105948 1113354 1121596 1130395 1138639 1144936 1148925 1151710 1154671 1158123 1161645 1165562 1171388 1180539
61137 1180539 1193023 1207658 1223205 1239094 1255477 1272858 1291312 1309833 1326873 1341750 1354927
61126 1354927 1366638 1376076 1382664 1387345 1391610 1395719 1398982 1401395 1403667 1405644 1406092 1404382 1401247 1397431
61112 1397431 1392707 1386916 1380986 1375892 1371115 1365078 1356823 1346494 1334428 1320708 1305762 1290607 1275981
61099 1275981 1261528 1246300 1230103 1213982 1199187 1185956 1173709 1162243 1151989 1142939 1134296 1125963
61087 1125963 1119559 1116623 1115927 1113865 1107881 1098544 1087895 1076890 1065335 1053605 1043152 1035220 1029793
61074 1029793 1026047 1023385 1021803 1021568 1022934 1026159 1031418 1038458 1046614 1055630 1066333 1079856 1096167
61061 1096167 1114117 1133128 1153861 1176812 1201377 1227185 1255213 1286273 1319313 1352855 1387417
61050 1387417 1424504 1463425 1501326 1536793 1571325 1606395 1640904 1672749 1701511 1728124 1752777
61039 1752777 1774479 1792097 1804748 1811621 1812492 1808221 1800128 1789076 1775512 1759729 1741563 1720438
61027 1720438 1696285 1669872 1641848 1612360 1582160 1553078 1526322 1500943 1475013 1447955 1420940
61016 1420940 1395411 1372052 1350843 1331328 1312962 1295851 1280995 1269435 1261329 1256048 1252690 1250352
61004 1250352 1248659 1248447 1251206 1257539 1266898 1279011 1294388 1312919 1333340 1354993 1378949 1406309
60992 1406309 1436503 1468501 1502708 1540190 1580765 1623465 1668491 1717323 1771055 1829870 1894013
60981 1894013 1964156 2040711 2123516 2212152 2306133 2405224 2510136 2622376 2742897 2871442
60971 2871442 3007482 3150643 3299855 3453813 3613552 3783232 3967046 4166513 4381949
60962 4381949 4614797 4866695 5137807 5428436 5741676 6083160 6460076 6882610 7364457
60953 7364457 7918918 8555663 9283535 10114051 11059002 12128417 13337216 14711964 16284769
60944 16284769 18083257 20132853 22453366 25010784 27639722 30029759 31844906 32909222
60936 32909222 33299829 33269749 33091281 32963700 33013384 33294471 33732249 34080372 33996849 33222811
60926 33222811 31722824 29674257 27338428 24936577 22606930 20422514 18416960 16599045
60918 16599045 14964115 13504243 12210699 11070986 10069020 9188928 8416577 7738508
60910 7738508 7142362 6618061 6156248 5746069 5376966 5042456 4739934 4466854 4219308
60901 4219308 3994265 3790598 3606924 3440064 3286633 3145018 3015030 2896309 2787605
60892 2787605 2687068 2592976 2504482 2421630 2344370 2272049 2204498 2142896 2088432 2040483 1997303
60881 1997303 1958279 1924172 1895036 1869172 1844560 1820439 1797013 1774368 1752259 1730586 1709597
60870 1709597 1689561 1670335 1651366 1632421 1614371 1598663 1585699 1574419 1564017 1555412 1550159 1548387
60858 1548387 1548765 1550279 1553090 1557663 1563865 1571106 1578818 1586632 1594448 1602325 1610221 1618047 1626162 1635387
60844 1635387 1646181 1658114 1670351 1682099 1692409 1700411 1706331 1711492 1716507 1720077 1720351 1716905 1710618
60831 1710618 1702194 1691755 1679397 1665096 1648241 1628182 1605151 1580090 1553864 1527192 1500859
60820 1500859 1475273 1450183 1425454 1401558 1378623 1355702 1331977 1308150 1285617 1264715 1244777
60809 1244777 1225510 1207210 1189877 1173162 1157031 1141721 1127369 1114397 1103636 1095008 1086694 1076836
60797 1076836 1065641 1054600 1044098 1033179 1021372 1009313 997639 986557 976287 966656 956444
60786 956444 944572 931836 920085 909788 899883 889890 880474 871740 862681 852698 842133 830932 818442
60773 818442 805060 792495 781600 771371 760982 751519 744597 740189 736788 733045 728525 723556 719032
60760 719032 715799 713717 711866 709883 708385 707890 708247 709285 710937 712424 712620 711716 711371 712677 715143
60745 715143 718109 721688 725495 727941 728003 726587 724972 722968 719915 716589 714553 714070 713934 713131 711671
60730 711671 709982 708353 706706 704399 700757 696358 692907 691061 689262 685724 680659 675345 669986 664098
60716 664098 658416 654525 652608 651168 649127 646859 644989 643582 642846 643238 644209 643986 641492 637790 634920
60701 634920 633763 633646 633606 633340 633072 632926 632551 631306 628945 626149 624175 623878 625199 627485 630037 632530
60685 632530 635268 638951 643747 648674 652335 654265 655112 655456 655071 653569 651186 648447 645293 641092 635539
60670 635539 629105 622331 614972 606433 597192 589189 584090 581259 578213 573327 567450 562512 559157 556475
60656 556475 553700 551264 549944 549532 548776 546592 543184 539979 538450 538926 540422 541388 540529 537352 532586
60641 532586 528052 525468 525072 525756 526576 527506 528560 529043 528354 527039 526399 527316 529910 533946 538854 543572
60625 543572 547125 549477 551402 553502 555761 557982 560252 562951 566619 571775 578440 585792 592677 598664
60611 598664 604456 611072 618663 626206 632346 636404 638454 638679 637298 635300 634376 635249 636615 636807 636272
60596 636272 637070 639882 643115 645446 647620 650578 653121 653089 650270 646692 644319 643655 644309 645480 645855 644355
60580 644355 641371 638296 635561 632000 626421 619031 611054 603765 598178 594765 592931 591400 589549 587847
60566 587847 586659 585447 583686 581785 580250 578580 576105 573661 573186 575353 578543 580655 581263 581498 582424
60551 582424 584254 586683 589094 590547 590529 589801 589727 590595 591519 592252 593909 597169 600976 604186 607516 612221
60535 612221 617406 620619 621142 620798 621148 621741 621856 622115 623059 623690 623031 622173 623071 625846 628880 631260 633750
60518 633750 637468 642874 650038 658745 668146 677214 685734 694329 703792 715122 729698 748135 768887
60505 768887 789014 806477 820873 832063 839254 841705 839519 833531 825144 816296 808595 802266 796740
60492 796740 792311 790213 790861 793204 796345 800853 807763 817092 828161 840879 855885 873573 893543
60479 893543 914922 936847 958590 979325 997749 1012200 1021560 1026048 1026775 1024741 1020803 1016302 1012666
60466 1012666 1010155 1007718 1004371 1000100 995348 990483 986098 982997 981331 980394 979785 980219 982730 987507 993966
60451 993966 1001501 1009738 1018632 1028926 1042126 1059417 1080804 1105646 1133745 1165542 1201623 1242500
60439 1242500 1288603 1340047 1396499 1457329 1521331 1586004 1647743 1703436 1751531 1791011 1819817
60428 1819817 1835097 1834897 1819019 1788505 1745188 1691848 1631839 1567841 1501274 1433253 1365854 1301853
60416 1301853 1243154 1189864 1141168 1096792 1057185 1022340 991177 962483 935978 911787 889284
60405 889284 867376 845986 826369 809589 795477 783448 773549 765861 759318 752024 742841 732150
60393 732150 721137 710829 701872 694573 688709 683494 678216 673024 668868 666340 664695 662445 659013 655310
60379 655310 652303 649593 646121 641948 638274 635628 633028 629328 624611 619794 615603 612531 611174 611794
60365 611794 613853 616631 619990 623846 627204 628628 627785 625842 624109 622831 621604 620497 620221 621223 623051
60350 623051 624919 626778 629389 633138 637157 640214 642355 644937 648826 653255 656922 659647 662230 665061
60336 665061 667751 670153 672886 676432 680227 683170 684863 685929 687078 688283 689086 689504 690269 692127 695149
60321 695149 698807 702505 705961 709345 713196 717904 723156 728282 733346 739218 746116 752793 758052 762481
60307 762481 767516 773061 777431 779710 780758 781598 782262 782987 785189 789991 796617 803357 809662 816393 824538
60292 824538 834647 846928 860638 873626 883754 890949 896941 902926 908288 911627 912089 909445 903826
60279 903826 895922 886950 877973 869479 861774 855312 850373 846624 843168 838934 833197 826225 819372 814054
60265 814054 810551 808095 806039 804385 803242 802502 802299 803147 805276 808320 812056 816996 823754 832254 842161
60250 842161 853894 868436 886016 905687 926720 949919 976661 1006412 1035845 1060919 1079405
60239 1079405 1090931 1095126 1090989 1078284 1058488 1033781 1005918 976665 948426 923257 901569 882787
60227 882787 866943 854508 844814 836062 827281 819235 812875 807793 802891 797798 792800 787890 782814 777848
60213 777848 773724 770609 767648 763713 758352 752020 745582 739649 734250 729162 724487 720685 718018 716308
60199 716308 715330 715010 714977 714402 712791 710610 708626 706849 704712 702206 700187 699422 699815 700738 701749 702853
60183 702853 704407 706922 710574 714745 718371 720980 723169 725871 729402 733365 737081 739838 741131 741154 740970
60168 740970 741767 743934 747051 750552 754150 757837 761834 766378 771207 775513 778875 781937 785540 789475
60154 789475 792957 796249 800749 807241 815047 823305 832052 841303 849964 856780 862027 867456 874677 884141
60140 884141 895180 906357 916201 924499 932545 941369 950179 957586 963864 970533 977743 983592 986493 986917
60126 986917 986256 985074 983310 981247 979291 977180 974176 969863 964339 957912 950876 943280 934827 925584
60112 925584 916803 910110 905473 900923 894847 887785 881384 876435 872764 870178 868444 866858 864934 863284
60098 863284 862896 863839 865471 867530 870077 872637 874469 875648 876966 878785 880827 882963 885306 887598 889601
60083 889601 892127 896451 902286 907502 910639 912911 916902 923820 932825 942577 952356 961635 969576 975671
60069 975671 980558 985522 991012 995952 998842 999403 998964 999263 1001121 1004107 1007045 1008873 1009572 1010388 1012547
60054 1012547 1015559 1017485 1017370 1016769 1018180 1022355 1027787 1032466 1035330 1036255 1035608 1034132 1032741 1032054 1032036 1031888
60038 1031888 1030242 1026010 1019520 1012500 1006540 1001919 998228 995349 993088 990555 987112 983693 982113 982986
60024 982986 985175 987234 988655 989677 990656 991696 992381 992047 990833 990011 990383 990766 989171 985183 979951 974035
60008 974035 966757 957850 948218 938598 928685 918126 907306 896668 886330 876878 869308 863547 858133
59995 858133 852150 846425 842005 838494 834978 831682 829492 828414 827661 826867 826127 825254 824164 823962 826562
59980 826562 832876 841790 850921 858176 863006 866669 871002 876510 881965 886158 889348 892409 895288 897149
59966 897149 897452 895925 891912 884937 875802 866130 856811 847621 838275 829007 820199 812207 805513 800173
59952 800173 795111 788849 781114 773068 765813 759399 753350 747394 741458 735622 730356 726249 723306 721041
59938 721041 719323 718431 718153 717693 716842 716539 717750 720368 723640 727079 730339 732811 734269 735748 738883
59923 738883 744110 749951 754299 756214 756387 756097 755962 755629 754528 752671 750603 748757 747166 745791 744750
59908 744750 744112 743853 744190 745535 747720 749588 749933 748846 747773 748128 750141 753012 755774 757864 759297
59893 759297 760646 762546 764756 765946 764952 762193 759228 756966 755148 753808 754071 756482 759382 760422 759546
59878 759546 758982 760020 761288 760927 759114 757275 755864 754486 753633 754538 757179 759952 761813 763582 766397
59863 766397 769911 772983 775593 778947 783680 788848 793120 796613 801077 808283 818493 830513 842754
59850 842754 853717 861822 865917 866537 865957 866143 866978 867159 866273 865055 863968 862855 862030 862336 863733 864967
59834 864967 865224 865127 865520 866268 867105 868768 872270 877653 884365 892219 900964 909517 916981 924144 932707 942970
59818 942970 953351 962163 968830 973462 976585 979504 983538 988274 991629 992300 991174 989754 988225 985948
59804 985948 982873 979372 975314 970562 966023 963091 962139 962385 963137 964470 966917 971234 978121 987113 995908
59789 995908 1001858 1004299 1004651 1004329 1003582 1002394 1001316 1000860 1000830 1000616 999479 996352 990214 981055 969815 957206
59773 957206 943573 930154 919232 912243 908551 906727 906060 906108 905862 904565 902640 900628 897869 893535
59759 893535 888418 884189 881073 877608 872733 866862 860930 855734 852316 851524 852575 853143 851468 847614 842377
59744 842377 836185 829706 824350 821085 819357 818074 817055 816570 815870 813310 808043 800958 793910 788455 785167
59729 785167 783566 782600 781551 780534 779928 779580 778975 778140 777903 779122 781812 785056 787683 789115 789723 790383
59713 790383 791616 793197 794547 795270 795267 794613 793562 792577 792199 792819 794515 797034 800080 803811 808821 815300
59697 815300 822355 828538 832969 835692 837211 838254 839804 842697 847116 852946 860409 869588 879520 888829
59683 888829 897458 906745 917382 928196 937468 944635 950120 954337 957648 960673 963758 966458 968165 968937
59669 968937 969189 969007 968333 967430 966516 965330 963593 961497 959265 956783 954283 952714 952533 952671 951763 950035
59653 950035 948837 948482 947772 945868 943529 942061 941806 942120 942319 942189 941789 940988 939219 935971 931854 928749
59637 928749 928192 929754 931694 933076 934428 936365 938629 940790 943071 945799 948405 949498 947863 943381
59623 943381 937330 931831 928486 927234 926726 925763 923989 921293 917391 912412 907382 903490 900892 898498 894848
59608 894848 889211 882104 874943 868960 864300 860223 856130 852118 848577 845653 843252 841326 840042 839848
59594 839848 841294 844395 848118 850936 852181 852647 853705 855999 859049 861799 863358 863486 862652 861577 860537
59579 860537 859094 856584 852848 848512 844677 842334 841912 843082 844770 845433 843830 840032 835609 832287 830376
59564 830376 828841 826790 824089 820504 815380 808882 802725 798657 796581 794917 792372 788566 783518 777746
59550 777746 772687 769829 769311 770276 772448 776163 780746 784270 785599 785578 785587 785711 785147 783723 782221 781535 782075
59533 782075 783533 784766 784352 781949 778821 776610 775838 775902 776024 775636 774354 772261 770005 768041 765936 762948
59517 762948 759042 754800 750596 746524 743036 740919 740463 741110 741994 742517 742416 741727 740814 740134 739923 740337 741781
59500 741781 744604 748358 751831 754078 755229 756147 757612 759948 763044 766373 769228 771415 773730 777401
59486 777401 782907 789557 796418 803517 812007 823151 837255 853586 871340 890478 911197 932244
59474 932244 950107 960750 962571 957326 948124 937265 926389 917445 911963 909552 908528 908173 909151 911525
59460 911525 913905 915395 917041 920251 924710 929098 933055 936979 940390 941995 941285 938683 934099 926729
59446 926729 916570 904963 893228 881770 870832 861024 852522 844592 836577 828869 822534 818484 817038
59433 817038 817462 817676 815540 811051 806458 803570 801749 799308 796074 793641 793593 796447 801952 809385 817533
59418 817533 825178 831789 837492 842677 848090 854850 863408 872482 879798 884162 886386 888173 890531 893294
59404 893294 895654 896931 897279 897940 900541 905703 912354 918655 923760 928659 935155 943973 953993 963521
59390 963521 972245 981666 993481 1007731 1022569 1035696 1045969 1053736 1059687 1063413 1063450 1059061 1051673
59377 1051673 1043891 1037111 1030665 1023415 1015440 1007708 1000660 993833 986791 979979 974545 971476 970868 971892
59363 971892 973598 975986 980428 989017 1003267 1023023 1046442 1071323 1096840 1124003 1154447 1189162
59351 1189162 1228173 1270135 1311006 1343944 1362511 1364959 1355095 1338979 1321309 1304548 1289973 1278815
59339 1278815 1272779 1273377 1279756 1287095 1288401 1278687 1257204 1226214 1189354 1151314 1116713 1087375 1061612
59326 1061612 1037493 1015882 998914 986454 975991 965722 955964 947410 939771 932831 927656 925738
59314 925738 927344 931204 935523 939071 941596 943584 945646 948247 951902 957111 963706 970687 977217 983523
59300 983523 990438 998462 1007719 1018283 1029769 1041143 1051919 1063285 1076907 1092645 1108505 1123098
59288 1123098 1137192 1152515 1169817 1188663 1208386 1228560 1248758 1268503 1287522 1305816 1323402
59277 1323402 1339951 1354666 1366655 1375592 1381772 1385253 1385256 1380869 1372267 1360741 1347616 1333583 1318999
59264 1318999 1304138 1288880 1272637 1255020 1236472 1218096 1200898 1185329 1171490 1159691 1150595
59253 1150595 1144494 1140477 1136935 1133378 1131376 1133186 1139529 1149136 1160278 1172139 1184672 1197571 1209484
59240 1209484 1218017 1220620 1216088 1205465 1191265 1175654 1159458 1142770 1126054 1110366 1096583 1084692
59228 1084692 1074049 1064243 1055344 1047105 1038501 1028905 1019503 1012431 1008161 1004844 1000965 997696 997446 1000652
59214 1000652 1005347 1009887 1014781 1021408 1029917 1039285 1049021 1059986 1073265 1088474 1103576 1116600 1127468
59201 1127468 1137675 1148076 1157429 1163485 1165138 1163087 1158721 1153000 1146329 1138907 1130850 1122087 1112260
59188 1112260 1100959 1088418 1076014 1065542 1057703 1051668 1046324 1041459 1037381 1034107 1031645 1030751 1032512
59175 1032512 1037015 1042752 1047467 1049695 1049843 1049879 1051430 1054017 1055719 1055751 1055539 1056737 1059051 1060765 1060744 1059044
59159 1059044 1056017 1051814 1046599 1040525 1033625 1026210 1019013 1012463 1006245 1000072 994343 989509 985436 982042
59145 982042 979779 978694 977780 976239 974666 973966 973784 973225 972382 971834 971285 970191 969303 969943 971931 973674
59129 973674 974172 973645 972510 971260 970970 972167 973427 973050 972010 973033 976435 979271 979437 978522 979419 982961
59113 982961 988257 994650 1001661 1008185 1013494 1018480 1024588 1032118 1040566 1049859 1059990 1070207 1079888 1089810
59099 1089810 1101166 1113484 1124728 1133527 1140313 1146148 1151153 1154286 1154191 1150257 1143257 1134928 1126662 1118714
59085 1118714 1110749 1102648 1094380 1085617 1076158 1066562 1057725 1049709 1041303 1031010 1018623 1005904 995361
59072 995361 988028 982618 977246 971471 966011 961042 956137 951667 948788 947767 947682 948186 950101 953728 958093
59057 958093 962913 969866 980375 993017 1004735 1014208 1022616 1031359 1040541 1049833 1059465 1069583 1079259
59044 1079259 1086840 1091284 1093055 1093757 1094940 1097203 1100434 1104556 1109489 1114370 1117543 1117739 1115063 1110814
59030 1110814 1106637 1103710 1102090 1100799 1099095 1097506 1096877 1096688 1095430 1092571 1088773 1084070 1077383 1068394
59016 1068394 1058389 1048504 1038624 1028899 1020733 1014871 1009692 1003027 994814 986506 978688 970969 963684 957896
59002 957896 953687 949914 945782 941622 938077 935485 933989 933307 932480 930719 928415 926612 925853 926390 928880
58987 928880 933441 938217 940452 939333 936693 934660 933655 933032 932565 932547 933061 933942 935250 937352 940440 944063
58971 944063 947188 949025 949925 951131 953574 957472 963221 971595 982313 993402 1003237 1012623 1023639 1036846
58957 1036846 1051015 1065418 1080776 1097508 1114158 1128291 1138472 1145169 1150078 1154557 1158321 1159910
58945 1159910 1158822 1156601 1155083 1154371 1153778 1154091 1157050 1162584 1168300 1172304 1175134 1178397 1182796 1188260 1194808
58930 1194808 1202227 1209536 1215601 1219927 1222475 1223356 1223119 1222600 1221946 1220479 1218026 1215561 1213921 1212749 1211634
58915 1211634 1211571 1214150 1219614 1226767 1234718 1243651 1253832 1264834 1276199 1288121 1300861 1313821 1325850
58902 1325850 1336460 1346318 1356233 1365863 1373816 1379191 1382710 1385780 1388382 1388415 1383645 1374110 1362076 1349549
58888 1349549 1336387 1321271 1304081 1286502 1270197 1255171 1240458 1225886 1212366 1200630 1190440
58877 1190440 1181076 1171922 1162535 1152878 1143738 1136262 1130836 1126934 1124117 1122298 1120890 1118799 1115900 1113594
58863 1113594 1113217 1114684 1117318 1120896 1124887 1127820 1128938 1129738 1132203 1135919 1138788 1140501 1143343 1148981
58849 1148981 1156167 1162591 1167811 1173232 1179985 1187988 1196798 1206450 1217331 1229659 1243159 1257110 1270791
58836 1270791 1283826 1296021 1307173 1317551 1328275 1340409 1353724 1367218 1381021 1396867 1416250
58825 1416250 1438797 1462916 1487347 1511412 1534263 1554815 1572535 1587822 1601391 1613292 1622490
58814 1622490 1627511 1627816 1624469 1618938 1611092 1599008 1581264 1559055 1535452 1512779 1491286 1470275
58802 1470275 1449626 1429663 1410168 1390544 1370969 1352416 1335099 1317795 1299497 1281020 1263730
58791 1263730 1247093 1229073 1209111 1189167 1171271 1155477 1141121 1128584 1118317 1109080 1098930
58780 1098930 1087682 1076955 1067895 1060103 1052697 1045115 1036761 1027115 1016581 1006376 997234 988971 981381
58767 981381 974744 969258 964808 961563 960030 960150 961011 961818 962688 964173 966311 968389 969475 969282 968753 969552
58751 969552 972505 976708 980482 982847 983622 982798 980805 979002 978659 979385 979428 977668 974514 970878 967138 963189
58735 963189 958767 953566 947698 942026 937410 933632 929736 925283 920631 916299 912952 911662 913013 915902
58721 915902 918351 919669 920959 923536 927795 933498 939879 945280 947971 947782 945998 943402 939463 933788
58707 933788 927244 920977 915108 908937 901988 894537 887633 882546 879552 877421 874906 872478 871439 871578
58693 871578 871259 869990 869298 870547 873350 876869 881309 887130 893739 899936 905042 909048 912383 916070 921238
58678 921238 927939 935138 942244 949715 957782 965698 972851 979645 986585 993443 999919 1006134 1011817 1016129
58664 1016129 1019146 1022453 1027239 1032640 1037023 1040159 1043068 1046451 1050494 1055761 1063019 1072109 1081883 1091335
58650 1091335 1100299 1109115 1117946 1126263 1132777 1136216 1136402 1134218 1130449 1125092 1117761 1108055 1095524 1080206
58636 1080206 1063305 1046326 1029378 1011401 992293 973568 956579 941452 928145 916900 906848
58625 906848 895835 883027 870403 860279 852347 844620 836428 828898 822914 818055 813403 808380 803060
58612 803060 798524 796480 797601 800581 803595 806255 809409 813744 819618 827627 838132 850424 863107
58599 863107 874923 884515 890227 891419 889625 887228 885093 882400 878449 873645 868855 864711 861493 858891
58585 858891 855964 852020 847507 843529 840684 838769 837229 835440 833019 830425 828738 828365 828506 828469 828769
58570 828769 830213 832642 835479 838895 843341 848214 851951 853466 852986 851764 851349 852638 855192 857906 860599
58555 860599 864227 869311 875174 881188 887585 894358 900599 905873 911076 916948 922810 927890 932649 937574
58541 937574 941789 944328 945723 946799 946885 945001 942040 939918 939072 938455 937466 936236 934571 932528 931667 933786
58525 933786 938507 943913 949532 956832 966623 977829 989206 1000659 1012361 1024006 1035606 1047939
58513 1047939 1061581 1076169 1090943 1105442 1119670 1134173 1149679 1166051 1182174 1197805 1214847
58502 1214847 1235557 1260145 1287461 1317154 1349123 1381342 1410667 1436247 1460255 1484657 1508764
58491 1508764 1530382 1547913 1560776 1569125 1573729 1575148 1572774 1565724 1554701 1541721 1527985 1513548
58479 1513548 1499013 1485645 1473262 1459774 1443566 1424876 1404210 1381223 1356304 1331728 1309655
58468 1309655 1289901 1270953 1252473 1235488 1220612 1207273 1194654 1182539 1171321 1161850 1155148 1151687
58456 1151687 1150697 1150371 1148845 1145288 1140359 1135593 1132008 1129388 1126997 1124433 1121349 1117133 1111827 1106867
58442 1106867 1103781 1102377 1101282 1099977 1098983 1098113 1095963 1091603 1085940 1081149 1079298 1081220 1085677 1089842
58428 1089842 1091808 1092693 1095272 1100728 1107912 1115511 1123370 1131633 1140247 1149749 1161109 1174406 1188983
58415 1188983 1205100 1223754 1244274 1263792 1280112 1293754 1306117 1316900 1324649 1328933 1330550 1330038
58403 1330038 1327166 1321877 1314914 1307573 1301242 1296950 1294927 1294753 1296198 1299660 1305676 1314283 1324951 1336665
58389 1336665 1348075 1358128 1366750 1374459 1381216 1386084 1388072 1386844 1382548 1375495 1366109 1354955 1342794
58376 1342794 1330810 1320408 1312394 1306619 1302721 1300670 1300230 1300759 1302236 1305613 1311220 1317663 1323513 1329411
58362 1329411 1337253 1347780 1360115 1373054 1385479 1396019 1403783 1409166 1412901 1414871 1414943 1413958 1412354
58349 1412354 1408846 1402438 1394798 1388385 1382943 1376431 1368967 1362926 1358941 1354809 1349131 1343464 1339793 1338116
58335 1338116 1337780 1339247 1343095 1348610 1354622 1360760 1367102 1373518 1379887 1385973 1390890 1393923 1396006 1398930
58321 1398930 1402830 1406015 1407659 1409051 1411619 1415174 1418803 1422316 1426293 1431633 1439151 1448602 1458356 1467389
58307 1467389 1477272 1490448 1506780 1523621 1539072 1553200 1566378 1578865 1592083 1607692 1624925
58296 1624925 1641237 1656151 1672100 1690785 1710966 1730566 1748731 1764979 1778528 1789499 1799042
58285 1799042 1807675 1815283 1823067 1833082 1845313 1857611 1869321 1882703 1899974 1921136 1945324 1971851
58273 1971851 1999236 2025707 2051566 2078680 2106970 2134132 2159575 2185601 2213573 2241985 2269658
58262 2269658 2297665 2326236 2352688 2374608 2392833 2409346 2424516 2438225 2451532 2465361 2479529
58251 2479529 2494647 2512803 2534683 2558169 2581373 2605051 2630517 2657447 2685290 2714631 2745553
58240 2745553 2776776 2807962 2840831 2876715 2915000 2954803 2995678 3036033 3074004 3110972 3150821
58229 3150821 3194503 3238929 3282554 3327921 3376722 3426719 3476366 3528535 3586459 3649308 3714835
58218 3714835 3783027 3854090 3926162 3998407 4073230 4152069 4232084 4310618 4390134 4475082 4566407
58207 4566407 4662541 4763231 4868887 4978507 5091610 5210058 5335062 5464975 5598912 5739620
58197 5739620 5889590 6047210 6210027 6378929 6555796 6740021 6930830 7130332 7340998
58188 7340998 7562924 7796606 8045430 8312572 8598767 8905790 9237993 9597173 9980082
58179 9980082 10384401 10812876 11268400 11750110 12258046 12796316 13367557 13969925 14604246
58170 14604246 15278339 15999252 16767061 17581393 18447563 19370332 20348486 21382511 22481489
58161 22481489 23655817 24909853 26248851 27685743 29232868 30894070 32673452 34584792
58153 34584792 36644062 38861108 41248669 43831265 46634531 49673922 52964711 56534623
58145 56534623 60417214 64646494 69274696 74387562 80090721 86494826 93729335 101955214
58137 101955214 111345114 122066000 134298530 148248387 164107458 182020773 202119279
58130 202119279 224569497 249589578 277481145 308615313 343037364 379527721 414753405
58123 414753405 443616895 461108929 464512619 454354649 433617484 406125935 375283920
58116 375283920 343581949 312621250 283324117 256170360 231374663 208968335 188840892
58109 188840892 170807889 154681255 140288577 127460631 116037140 105881354 96868375
58102 96868375 88864656 81736499 75373005 69685238 64589593 60008141 55879952 52155800
58094 52155800 48783489 45710191 42895498 40310088 37924555 35710753 33651282 31736567
58086 31736567 29953801 28287236 26726538 25265747 23896108 22608335 21399943 20272487
58078 20272487 19223368 18247062 17341333 16504307 15727443 14999015 14313052 13668256 13060255
58069 13060255 12482126 11931194 11408428 10912070 10438183 9986559 9560014 9158465 8779199
58060 8779199 8421904 8087736 7773997 7475287 7189725 6919291 6664455 6423070 6193975
58051 6193975 5977077 5770254 5570517 5377857 5193890 5017231 4844384 4674903 4511713
58042 4511713 4356371 4207634 4064557 3927513 3796017 3668371 3543454 3420580 3298372
58033 3298372 3176243 3056131 2940371 2828932 2721002 2617769 2521015 2430618 2346044 2268426
58023 2268426 2198127 2132233 2067772 2005584 1947555 1892028 1836086 1780809 1729841 1683700 1639832
58012 1639832 1597658 1559108 1524145 1489923 1454937 1420530 1387850 1356426 1326193 1298022 1271779
58001 1271779 1246386 1221977 1199571 1178578 1157165 1135216 1114575 1096194 1079147 1062423 1045795
57990 1045795 1029184 1013070 998972 987503 976656 964227 951097 939652 929794 919322 907768
57979 907768 896972 887817 879045 869445 859071 848283 837480 827511 818443 808558 796608 784275 774112
57966 774112 765896 757557 748826 740985 733585 724682 714312 704719 696849 689413 681783 675138 670152 665814
57952 665814 661053 655545 648743 640251 631402 624355 619301 614343 608217 601311 594225 587410 582100 579411
57938 579411 578485 577519 576406 576229 576429 574992 571358 566699 561339 554385 546206 538749 533044 528572 525226
57923 525226 523487 522464 520254 516659 513241 510439 507158 503541 501422 501332 501541 500790 499560 497988 495151
57908 495151 491377 488732 488055 487723 486503 485414 485541 486124 486117 485757 485384 484460 482947 481891 481625 481106 479976
57891 479976 479275 479204 478405 476734 476447 478882 481967 482958 481963 480807 480099 479664 480667 484739 491541 499167
57875 499167 506660 514488 522907 531491 540094 548884 557418 564865 571076 576452 580839 583376 583474 581341 577706
57860 577706 573513 569612 566151 562362 557332 550939 543971 537574 532443 528136 523279 517024 510095 503801
57846 503801 498432 493574 489460 486516 483922 480331 476109 472982 471061 468174 463026 457248 453174 451022
57832 451022 449640 448790 449027 449983 450356 449695 449188 450453 453884 458213 461601 463226 463558 462874 460437 456197
57816 456197 452457 451955 454358 456484 456245 454554 452974 451593 450191 449639 450558 451774 451505 449332 446041
57801 446041 442337 438741 435986 434472 433780 433476 433943 435847 439258 443572 447745 450488 451116 450409 449766 449436
57785 449436 448576 446823 444346 440447 434157 426655 421020 418651 417673 415737 412543 408599 403624 397902 393513
57770 393513 392247 393310 394693 395802 397174 398685 399805 400985 403153 406316 409799 413224 416212 418118
57756 418118 419227 421045 423915 425521 423585 419091 414793 411272 406678 400045 392616 385726 379442 373803
57742 373803 369752 368067 368398 369834 371671 373443 375007 376705 378819 381028 383102 385651 389146 392583
57728 392583 394469 395051 396258 399239 403144 406579 409201 411476 413784 416282 419014 421722 423937 425551
57714 425551 426973 428616 430554 432687 434857 436726 437754 437411 435413 431995 427990 424182 420547 416701
57700 416701 413053 410598 409268 407633 404887 402158 400936 401073 401361 401400 401814 403098 405284 408319 411909
57685 411909 415342 418270 421164 424230 426545 427280 427134 427397 428006 427717 425908 423184 420453 418401 417536 417717
57669 417717 417925 417403 416612 416135 415289 413138 410365 408613 408066 407127 404540 400628 396412 392767 390479 389878
57653 389878 390109 389839 388816 387737 386555 384211 380346 376134 372908 370877 369618 369026 369289 370476 372531
57638 372531 375213 377844 379634 380416 380701 381015 381521 382069 382212 381484 380198 379492 379917 380554 380454 380360 381814
57621 381814 384954 388562 392151 396772 403806 414205 428824 448024 470680 494827 519768 546594
57609 546594 576595 610263 647886 689490 733155 774160 806507 825211 827647 814197 788247 754710
57597 754710 717935 681099 646897 617234 591957 569163 547360 526608 507570 490653 476337
57586 476337 465002 455903 447471 439179 432054 426921 423371 421052 420564 422097 424306 425656 426024 425992 425408
57571 425408 423899 422073 420921 420229 418745 415861 412301 409248 407481 407219 408015 408754 408357 406722 404715
57556 404715 403262 402624 402411 401962 400788 398899 396831 395452 395612 397548 400277 402032 401974 401218 401520 403122
57540 403122 404596 404522 402558 399230 395799 394059 394878 396912 398069 398353 399744 403068 406636 408529 408649
57525 408649 407734 406038 404120 403380 404334 405362 404602 402267 399866 398104 396966 397073 399153 402510 405475
57510 405475 407273 408293 408878 409205 410108 412527 415948 418600 419466 419157 418769 418823 419475 420767 422353 423711
57494 423711 424935 426770 429711 433544 437718 441611 444513 446051 446638 447021 447490 448103 449373 451916 455487
57479 455487 459212 462747 466497 470731 475332 480423 486341 492784 498843 504121 509100 514141 518964 523423
57465 523423 527998 532884 537169 539666 540431 541084 543633 549062 556672 564547 570907 575324 578660 582034 586085
57450 586085 590905 595981 600182 602683 604294 607190 612743 619942 626491 631220 634907 638944 643784 648754
57436 648754 652913 655804 657645 659099 660929 663745 667839 672974 678235 682350 684621 685750 687567 691586
57422 691586 697780 704831 711470 717288 722343 726629 730337 734132 738469 742900 746843 750985 756973 765346
57408 765346 774552 782505 788587 793621 798493 803533 808853 814426 819852 824667 828947 833180 837609 842159
57394 842159 846958 852388 858437 864419 869628 874202 879153 885591 893850 903322 913062 922401 930854 937805
57380 937805 942914 946840 950909 955784 961002 966094 971602 978558 987453 998045 1009577 1020737 1030128
57367 1030128 1037555 1044414 1052009 1059909 1066808 1072667 1078975 1087016 1096845 1107926 1119644 1130917 1140433
57354 1140433 1148060 1155535 1165057 1177379 1191599 1206452 1221148 1235025 1247142 1256796 1264370 1271121
57342 1271121 1277875 1284376 1290376 1296883 1305379 1315813 1326457 1336205 1346074 1357735 1371339 1385609 1399472
57329 1399472 1412658 1425080 1436626 1447463 1457906 1468209 1479011 1491389 1505577 1520060 1532965
57318 1532965 1544018 1554135 1563576 1571913 1579628 1588152 1598003 1608303 1618611 1629949 1643273 1657955
57306 1657955 1672557 1686385 1699589 1712455 1725372 1738919 1753250 1767637 1781187 1793745 1805811
57295 1805811 1817909 1830436 1843691 1857630 1871812 1885912 1900080 1914648 1929745 1945230 1960681
57284 1960681 1975545 1989798 2004314 2019898 2036014 2051376 2065902 2081019 2097674 2115052 2131895
57273 2131895 2148209 2164866 2182073 2199105 2215289 2230645 2245782 2261488 2278153 2295303 2312044
57262 2312044 2328137 2344084 2360093 2375814 2391345 2407600 2425104 2443229 2461189 2478936 2496468
57251 2496468 2513307 2529623 2546999 2566844 2588593 2610616 2632286 2653928 2675275 2695667 2715710
57240 2715710 2737062 2760160 2783427 2805309 2825989 2846446 2866808 2886576 2905842 2925254 2944894
57229 2944894 2963976 2981927 2999344 3017665 3037916 3059911 3082674 3105523 3128519 3151961 3175876
57218 3175876 3200194 3224928 3249663 3273287 3294832 3314480 3333181 3351352 3368526 3384321 3399159
57207 3399159 3413863 3429003 3444816 3461354 3478351 3495112 3510859 3525305 3538893 3552393 3566089
57196 3566089 3579397 3591579 3602744 3613658 3624463 3634367 3643110 3651973 3662336 3673562 3683365 3690395
57184 3690395 3695584 3700712 3706476 3712404 3718077 3723681 3729413 3734872 3739335 3742747 3746406 3752433 3762396 3776514
57170 3776514 3794223 3815124 3839056 3865543 3893673 3922497 3951338 3979884 4008302 4037032 4066084
57159 4066084 4094667 4121758 4146736 4169160 4188373 4203861 4215691 4224037 4228689 4229710 4228193 4225515
57147 4225515 4222028 4217379 4211942 4206940 4203124 4200473 4199320 4200516 4203979 4208253 4212531 4218307 4227787 4240898
57133 4240898 4254975 4267571 4278699 4289948 4302164 4314771 4327047 4339048 4350880 4361697 4370128
57122 4370128 4375383 4377191 4374836 4367262 4354336 4337042 4316106 4291323 4262762 4231525 4198484 4163264
57110 4163264 4125577 4086806 4048989 4012890 3978333 3945872 3916560 3890510 3867438 3848478 3835491
57099 3835491 3828117 3823137 3817198 3808623 3795995 3776809 3748864 3712122 3668237 3619057 3566320 3511802
57087 3511802 3456838 3402348 3350066 3302850 3262796 3229565 3201298 3176589 3154864 3135541 3117806
57076 3117806 3100883 3083725 3064604 3041477 3012525 2976088 2930660 2875504 2810975 2738050 2657836
57065 2657836 2571419 2479246 2380251 2272222 2153217 2022066 1877632 1718588 1543859 1352081
57055 1352081 1140521 905817 645922 359986 46201 -298790 -678414 -1095915 -1555903 -2064106
57045 -2064106 -2625180 -3242575 -3920604 -4664409 -5478153 -6366655 -7339569 -8410813 -9593471
57036 -9593471 -10899434 -12345210 -13953531 -15747596 -17748542 -19980275 -22470935 -25247141
57028 -25247141 -28331371 -31740435 -35467996 -39466977 -43689128 -48189145 -53180984 -58918388
57020 -58918388 -65441005 -72401154 -79135754 -84918420 -89187464 -91630551 -92166055 -90903956
57012 -90903956 -88106074 -84126407 -79337495 -74072064 -68593975 -63091656 -57686094 -52448435
57004 -52448435 -47418397 -42616352 -38051210 -33728381 -29655634 -25843661 -22304124 -19048314
56996 -19048314 -16084515 -13413141 -11024198 -8899835 -7017946 -5353396 -3879705 -2573179
56988 -2573179 -1415245 -389852 519689 1329714 2053476 2701172 3281362 3800637 4262999
56979 4262999 4671580 5030790 5345953 5622000 5864133 6079333 6276249 6464067 6651380
56970 6651380 6843355 7037100 7220304 7376943 7495842 7574788 7618776 7636174 7635183 7620961 7594920
56959 7594920 7557094 7508655 7451615 7387358 7317102 7243215 7168376 7093649 7018638 6943266 6868138
56948 6868138 6793452 6718840 6643913 6567703 6487843 6401762 6308702 6209617 6105664 5998165 5889367
56937 5889367 5781021 5671991 5559046 5440434 5317059 5189750 5057056 4916527 4766752
56928 4766752 4607366 4438439 4260897 4076525 3886583 3691366 3492125 3292461 3096618
56919 3096618 2906943 2724063 2548972 2383579 2229315 2086307 1954192 1832971 1722820
56910 1722820 1623524 1534294 1454047 1381960 1317975 1262492 1215203 1174555 1138840 1107685 1082042
56899 1082042 1062801 1049773 1041798 1037206 1034133 1030871 1026215 1019259 1008980 994580 976496 956562
56887 956562 936623 917151 897755 878920 862412 849545 839681 831226 823767 818311 815397 814090 813392
56874 813392 813865 817061 823729 833206 844138 855070 864614 871737 875813 875864 870244 858020 840514 820553
56860 820553 800118 779477 758546 737998 718775 701484 686723 675122 666430 659232 652281 645698
56848 645698 640323 636247 632633 628872 625481 623776 624680 627628 630655 631996 631652 631047 631244 632135 633335
56833 633335 634925 636929 638907 640723 643207 647518 654178 662947 673037 683009 691203 696830 700050 700531
56819 700531 696816 688151 676335 664624 654860 646509 638292 629889 622177 616776 615482 619266 627459 638419
56805 638419 651251 666566 685550 708612 734979 763255 792395 822244 852683 881820 905532
56794 905532 919715 923037 917165 904830 888600 871082 854768 841085 830228 822199 817325 815594
56782 815594 816493 820083 827632 840634 859670 884600 915360 952003 994189 1040965 1090582 1139982
56770 1139982 1184627 1219432 1240280 1245111 1234378 1210914 1179005 1142942 1106002 1070276 1036840
56759 1036840 1006048 978271 954532 935954 922516 913136 907401 906489 911776 923048 938888 958521
56747 958521 982342 1010452 1041094 1070470 1093645 1105867 1104090 1088220 1061124 1027072 989757 951440
56735 951440 913624 878023 846317 818883 794472 771814 751264 734157 720866 710611 703274 700115
56723 700115 702053 708237 717147 728202 741081 753970 763786 768143 766210 757881 743286 723418 700283
56710 700283 675937 651858 629185 608675 590041 572173 554582 538099 523648 510923 498903
56699 498903 487256 476474 466865 458215 450488 444132 439310 435283 431032 426317 421681 417373 412807 407471
56685 407471 402115 398419 397320 397985 398589 397738 395089 391252 387576 385445 385065 385168 384524 383325 382288 380867
56669 380867 377742 373129 369117 367116 366121 364407 361961 360167 359828 360694 362521 365233 368076 369792 369849
56654 369849 368675 366657 363937 361482 361089 363447 366791 368355 367070 364362 362559 362895 364854 366845 367486
56639 367486 366567 365022 364049 364369 366130 368985 372103 374603 376309 377720 379029 379714 379599 379768 381618 385209
56623 385209 389284 392906 396249 399568 402209 403259 402782 401735 400693 399241 396954 394600 393745 394932 396772
56608 396772 397347 396332 395030 394400 394069 393646 393888 395526 397611 398305 397163 395459 394299 393631 393323 393961
56592 393961 395935 398707 401664 404890 408370 411154 412259 411957 411369 411130 411197 411692 413032 415263 417816 419948
56576 419948 421126 421359 421540 422917 425551 427773 427960 426435 424684 423120 420855 417671 414877 413772 414117
56561 414117 414587 414121 412477 410055 407488 405041 402318 398982 395583 392893 390531 387305 383097 379382 377436
56546 377436 376943 376858 376738 376652 376591 376674 377178 377631 376623 373480 369618 367319 367379 368719 369907 370235 369613 368458
56528 368458 367741 368274 369725 370871 371002 370622 370692 371522 372483 372550 371194 369051 367670 368289 370793 373898 376227
56511 376227 377223 377494 378445 381153 385267 389374 392680 395883 400134 405726 412252 419472 427443 436208 445803
56496 445803 456001 465493 472026 474190 472791 469941 467361 466004 466204 466939 465763 461183 455027 451017
56482 451017 450810 452482 452952 450814 446746 442375 439151 437474 436573 435651 434868 434453 433430 430691 427043 424565
56466 424565 423809 423417 422824 423376 425765 428089 427984 425541 422686 420524 418819 417510 417219 418191 419752 420804
56450 420804 420315 417724 413729 410336 409178 409860 410617 410319 409104 407372 405195 402744 400451 398541 396961
56435 396961 395844 395449 395483 394977 393117 390051 386872 384850 384502 385187 385825 386251 387468 390222 393718 396305
56419 396305 397242 397207 397213 397578 398089 398726 399900 401923 404345 406145 407028 408208 411080 415060 417846 418285 417885
56402 417885 418564 419881 419845 417990 416137 416045 417569 419476 420974 421900 422187 421872 421258 420577 419727 418667 417843
56385 417843 417871 418883 420397 421752 422528 422558 421608 419232 415265 410539 406734 405141 405702 407467 409739 412430
56369 412430 415543 418777 421602 423427 423881 423255 422538 422637 423638 424951 425908 425974 424932 423495 423287 425341
56353 425341 428617 430792 430662 429151 427882 427458 427455 427404 427214 426899 426448 426023 425989 426691 428208 430370 432896 435488
56335 435488 437745 439143 439414 438957 438584 438737 439279 440124 441576 443720 445990 447801 449260 450689 451809 452078
56319 452078 451690 451584 452467 454378 457127 460445 463665 465976 467372 468839 471266 474524 477930 481206 484516
56304 484516 487688 489881 490228 488670 486017 483246 480798 478653 476965 476444 477898 481338 485588 489039 491003
56289 491003 492236 493761 495282 495494 494252 493485 495036 498320 501342 503616 506445 510363 514142 517002 520092
56274 520092 524628 529842 534132 537309 540310 543406 546181 548900 552397 556693 560946 564794 568639 572609
56260 572609 576352 579987 584183 588921 592974 595019 594777 592971 590742 589242 589180 590440 592389 594596 597030
56245 597030 599736 602632 605508 608007 610024 612465 617048 624672 634348 644247 653432 662037 670361 678529
56231 678529 686568 694045 700177 705140 710701 718499 728127 737933 747307 757078 768027 780282 793925
56218 793925 808974 824805 840813 857633 876559 897648 919405 940459 960807 981553 1004258
56207 1004258 1030267 1059563 1090495 1121730 1154264 1190343 1230700 1274237 1320319 1369891 1424186
56196 1424186 1483676 1548538 1618949 1694785 1776185 1864395 1960765 2064965 2175608 2292666 2417545
56185 2417545 2550432 2689104 2830846 2974041 3117270 3258247 3394388 3523262 3641781
56176 3641781 3746045 3832726 3899967 3946672 3971911 3975368 3957541 3919419 3862853 3790915 3706410
56165 3706410 3610116 3502086 3384586 3261836 3136745 3010114 2883463 2760091 2642190 2529167
56155 2529167 2420341 2317331 2221880 2132773 2047029 1963541 1884005 1810617 1744006 1683034 1625844
56144 1625844 1571447 1520686 1474982 1434101 1396352 1361080 1329268 1301110 1274928 1249577 1226270
56133 1226270 1206600 1190100 1175029 1160510 1146688 1133819 1122308 1112666 1104471 1096356 1087828 1079926
56121 1079926 1073352 1067413 1061706 1057232 1054748 1053558 1053169 1054490 1058050 1062543 1066575 1070355 1074327 1077887
56107 1077887 1081172 1086372 1095188 1106310 1117451 1128589 1141124 1155064 1169417 1184490 1201532 1220658
56095 1220658 1241116 1263046 1287132 1313159 1340784 1371143 1405940 1445534 1489562 1538668 1593865
56084 1593865 1655116 1722448 1797539 1881979 1974502 2071941 2172270 2274555 2376452 2473936 2563391
56073 2563391 2642334 2708994 2763603 2809811 2852570 2894449 2935251 2974146 3009775 3039115 3059270
56062 3059270 3070694 3076378 3077793 3073786 3063218 3045812 3019782 2981223 2927208 2858196 2776971 2686946
56050 2686946 2592160 2497301 2406467 2322243 2245883 2177532 2116447 2062112 2014974 1975292 1941848
56039 1941848 1912937 1887883 1866425 1847801 1832075 1821120 1815975 1814040 1811382 1807388 1804795 1805542 1809063
56026 1809063 1814469 1821754 1830590 1840231 1850980 1863696 1877737 1891487 1905033 1920226 1937751 1956232
56014 1956232 1974532 1992968 2011927 2031259 2051537 2074108 2099206 2125346 2150851 2174941 2197594
56003 2197594 2219903 2244216 2272162 2302561 2332761 2361779 2390691 2420608 2452122 2486186 2523478
55992 2523478 2563050 2603201 2643279 2683290 2722766 2761756 2801677 2843209 2884802 2925563 2967955
55981 2967955 3014803 3065105 3115972 3167375 3221505 3278598 3337129 3397304 3460484 3525851 3591596
55970 3591596 3659071 3731844 3810775 3893748 3979977 4070719 4165898 4263938 4364884 4469961 4578413
55959 4578413 4688861 4803534 4926879 5059995 5200493 5347484 5502196 5664062 5831395
55950 5831395 6006252 6193707 6395688 6610126 6836508 7077481 7334731 7608169 7899546
55941 7899546 8211825 8544803 8896432 9268343 9664427 10084138 10523654 10984082 11471966
55932 11471966 11991087 12540627 13122286 13741891 14402377 15102231 15842653 16629439 17466203
55923 17466203 18352898 19292817 20294070 21362768 22502195 23719872 25027200 26430727
55915 26430727 27932608 29541446 31273820 33144014 35162533 37346474 39720136 42302893
55907 42302893 45108073 48157037 51483570 55123908 59118536 63529582 68444433 73960510
55899 73960510 80182306 87235080 95261615 104401194 114792781 126604613 140041977 155331054
55891 155331054 172730688 192557307 215136804 240684446 269200380 300318818 332905280
55884 332905280 364510299 391329128 409221438 415390958 409533120 393642227 370827355
55877 370827355 344124483 315908415 287821006 260900324 235747068 212677594 191817031
55870 191817031 173134879 156486839 141684585 128543274 116883225 106527757 97321484
55863 97321484 89138084 81862045 75377526 69582071 64396025 59749853 55573939 51807124
55855 51807124 48402768 45318564 42509649 39937203 37574009 35395944 33376785 31496219
55847 31496219 29743694 28108695 26574973 25129254 23767952 22490361 21292159 20170005
55839 20170005 19125126 18156800 17257847 16420861 15643265 14922048 14249098 13616194 13019981
55830 13019981 12458297 11926443 11420863 10942098 10490275 10061450 9651391 9259161 8884356
55821 8884356 8525020 8181074 7855619 7549866 7260443 6984133 6721306 6472312 6234797
55812 6234797 6007347 5791459 5586762 5388406 5192811 5002542 4821872 4650514 4485359
55803 4485359 4325867 4174088 4031023 3895858 3767328 3643495 3521692 3400677 3281552
55794 3281552 3165259 3050927 2937739 2826332 2717431 2611477 2510461 2417258 2331833 2250748
55784 2250748 2171650 2095554 2023720 1955545 1890985 1831773 1778231 1727788 1678510 1631450 1587792
55773 1587792 1546640 1507503 1471947 1440463 1410529 1380212 1351163 1325507 1302091 1278401 1254116
55762 1254116 1230205 1206355 1181899 1157797 1135265 1113726 1092280 1071956 1054414 1039418 1025390
55751 1025390 1011522 997833 984166 970588 957837 946269 935386 925246 917050 911612 908642 907978
55739 907978 909622 912029 912757 911880 912475 916515 922398 927674 931872 935263 937271 937891 938671 940654 943144
55724 943144 945606 948456 950578 948759 941491 930937 919144 904916 886849 867088 849157 833740
55712 833740 819309 805514 793383 783344 775327 769645 765542 760116 750901 738660 725850 713609
55700 713609 702029 691805 683292 675210 666501 658320 652081 646873 641040 634900 629425 623468 615070 604590
55686 604590 593838 582963 571042 559212 550146 544250 539081 532916 526742 522140 519057 516209 512431
55673 512431 507418 502179 498561 497153 495995 492592 486720 480006 473491 467109 460947 455260 449579 443439
55659 443439 437706 433706 431390 429801 428894 429275 430486 431182 430884 430211 429739 429973 431883 435761 439810 441575
55643 441575 440686 438672 436302 432845 428003 422859 418491 414848 411316 407458 403080 398483 394604 392100
55629 392100 390398 388406 385832 383075 380420 378281 377622 378945 381348 383674 386007 388868 391668 393443
55615 393443 394557 396106 397949 398851 398408 397347 396068 394333 392358 390940 390424 390555 391226 392278 392870 392253
55599 392253 391001 390344 390512 390819 391014 391253 391124 390090 388799 388521 389311 389954 389706 388900 387933 386951 386535 387365
55581 387365 388990 390080 390112 389818 389802 389642 388510 385904 381632 375795 368958 361920 355404 350077 346230 342979
55565 342979 338727 333210 328201 325270 323755 322008 319598 316882 313458 308883 304317 301591 300866 300748 300377
55550 300377 299833 298790 296490 293056 289320 285384 280676 275285 269841 264334 258546 253480 250769 250545 251204
55535 251204 251190 249908 247295 244076 242156 243108 246248 249508 251833 253259 253315 251452 248877 247836 248969
55520 248969 251217 254214 258603 263893 268301 271218 273758 276418 278380 279730 282191 286740 292345 297831
55506 297831 303072 307564 309896 309759 308543 306818 303192 297010 290240 285019 281004 276890 272929 269941
55492 269941 267166 263347 259199 256595 255715 254916 253265 251500 250460 250110 250196 250478 250132 248227 245241 243118
55476 243118 243298 245194 246854 246661 244392 241273 239252 239698 242447 246104 249203 250902 250840 248955 245667
55461 245667 241950 238875 236950 235885 235003 233879 232598 231537 231049 231167 231291 230279 227547 224103 221710
55446 221710 220786 220062 218681 217388 216857 216144 214189 211862 210779 210731 210102 208492 207029 206136 204977 203392
55430 203392 202458 202524 202351 201063 199580 199230 199994 200905 201241 200665 199201 197719 197586 199087 200885 201596 201236
55413 201236 200714 200697 201468 203113 205256 207090 208121 208537 208746 208945 209027 208390 206309 203242 201142 201240 202165
55396 202165 201790 200335 199623 199674 198602 196111 194404 194691 195297 194538 193293 193074 193365 192689 190943 188975 187032
55379 187032 185268 184678 185806 187436 188137 188408 189772 192440 195300 197619 199348 200266 200189 199561 198716 197132
55363 197132 194558 192151 191161 191117 190762 190281 191019 193230 195669 197464 199109 201344 203943 205806 205712 203130
55347 203130 198864 194595 191290 188560 186068 184642 185047 186467 187451 187830 188520 189794 190935 191347 191054 190406
55331 190406 190217 191720 195277 199417 202226 203426 204181 205245 206310 206837 206507 205227 203715 203508 205193
55316 205193 207074 206957 204920 202894 201726 200322 197783 194818 192596 191452 191199 191751 192979 194628 196458
55301 196458 197803 197285 194246 190391 188505 189049 189328 186769 182072 178399 178186 181331 185724 188788 189082
55286 189082 187238 185306 184831 185757 187246 188866 190452 191445 191214 190003 188872 188516 188600 188544 188557 189308 190603
55269 190603 191244 190684 190171 191236 193396 194577 193863 192451 191470 190334 188234 186022 185218 185915 187079 188414
55253 188414 190440 192846 194212 193646 191739 189700 188292 187713 187702 187615 186950 185957 185374 185730 187242 189935 193176
55236 193176 195607 196413 196395 196907 198055 198733 198154 196476 194314 192587 192439 194141 196393 197791 198619 199881
55220 199881 201124 201026 199980 199979 201453 202212 200475 197273 194676 193031 191408 189725 188822 188915 189437 190279 192052
55203 192052 194977 198335 201105 202614 202598 201222 199141 197117 195576 194725 194826 195865 197051 197246 196093
55188 196093 194433 193448 193598 194504 195586 196408 196433 194923 191607 187362 183758 181794 181439 182309 184070 185884
55172 185884 186361 184907 182687 181335 180897 179969 177849 175627 174836 175680 177075 178068 178828 180237 182651 185157
55156 185157 186272 185421 183459 181641 180555 180335 181192 182980 184670 185156 184623 184550 186257 189680 193376 195521
55140 195521 195371 194113 193787 194947 196084 195833 194828 194389 194420 193995 193451 194152 196276 198368 199242 199031 198253
55123 198253 197219 196671 197602 199871 202012 202906 202723 201952 200658 199238 198759 199721 201185 201827 201329 200318
55107 200318 199495 199120 198717 197136 193765 189904 187905 188497 189978 190582 190574 191329 193357 196301 200030 204464
55091 204464 208666 211241 211699 210837 209840 209412 209490 209342 208221 206297 204595 203694 202995 201711 199999 198529
55075 198529 197542 197101 197818 200328 204052 207223 208303 207042 204326 201561 200117 200673 202717 204840 205717
55060 205717 204856 202621 199886 197667 196761 197348 198726 199605 199080 197523 196248 196058 196525 197014 197775 199262
55044 199262 200874 201455 200936 200372 200282 200041 199201 198348 198207 198826 200105 202141 204422 205670 205343 204548 204592 205293
55026 205293 205719 206011 207226 209455 211266 211418 210435 210126 211788 215063 218280 219786 219022 216545 213400 210792
55010 210792 209937 211263 213496 214368 212855 210288 208855 209419 211262 213354 215138 216294 216552 215932 214858
54995 214858 213926 213580 213784 213877 213081 211342 209455 208217 207829 208211 209360 211038 212551 213274 213175 212509 211292
54978 211292 209423 207157 205114 203933 204001 205296 207375 209629 211527 212460 211778 209606 207341 206490 207018 207771
54962 207771 208417 209725 211663 212706 211871 210301 209644 209651 208653 206046 203237 202185 203825 207706 212301 215643
54946 215643 216497 215246 213412 212255 211956 211886 211397 210552 210294 211565 214074 216414 217631 218129 218635 219022 218765
54929 218765 218031 217520 217516 217814 218335 219162 220013 220241 219409 217682 215835 214896 215275 216053 215774 214263 212908 212709
54911 212709 213016 213051 213712 216460 220820 224551 226481 227822 230070 232611 233432 231884 229754 229249 230452 231454
54895 231454 230992 230114 230654 232617 234132 233791 231977 229780 227825 226576 226630 227883 229229 229880 230362 231492
54879 231492 233036 234045 233923 232480 229658 226053 223131 222013 222351 223091 223895 225262 227714 231435 236066
54864 236066 240391 243028 244107 245424 248261 252023 255742 259641 264070 268208 271418 274913 280337 287407
54850 287407 294546 301119 307239 312057 314342 314425 313589 311782 308008 302775 297840 293376 287733 280544 273861
54835 273861 269434 266814 264968 263814 263081 261523 258681 256064 255303 256228 257776 259518 261140 261671 260568
54820 260568 258682 257061 255768 254847 255180 257029 258842 259157 259032 261073 266570 274804 284424 293912 301242
54805 301242 304882 305294 304317 303215 302267 301596 300759 297953 291643 283275 276514 273101 270950 267138 261404
54790 261404 255590 250762 246375 241879 237836 235293 234696 235508 236386 235864 233424 229977 226967 224950 223370
54775 223370 221656 220025 218952 218178 216748 214149 211168 209370 209721 211821 214409 216421 217505 217847 217756
54760 217756 217383 216584 215094 213069 211458 211531 213711 216887 219162 219440 218236 216934 216450 216853 217941 219533
54744 219533 221042 221518 220726 219887 220644 223264 226383 228522 229392 229629 229857 230277 230874 231605 232419 233181 233551
54727 233551 233105 231855 230626 230528 231999 234511 237133 239067 239799 239250 237909 236496 235458 235076 235890 238376
54711 238376 242143 246041 249276 251931 254350 256659 259201 262743 267736 273756 280144 286804 293859 300791
54697 300791 306584 310719 313674 316323 319007 321177 321902 320781 318308 315127 311190 306133 300428 295385
54683 295385 291742 288827 285482 281194 275882 269365 262066 255891 253142 254158 256761 258485 258857 258982 259386
54668 259386 259196 257629 255471 254352 254840 256064 257337 259291 262853 267712 272658 277142 281673 286717 292036
54653 292036 297245 302243 306896 310914 314275 317118 318935 318569 315479 310515 305022 299630 294240 288615
54639 288615 282597 276287 270590 266966 265944 266242 265997 264595 262613 260382 257554 254144 251171 249798 250091
54624 250091 250830 250465 248403 245558 243431 242448 241496 239444 236714 234737 234178 234450 234868 235424 236231 236996 237536
54607 237536 238229 239364 240310 240018 238374 236532 235544 234944 233089 228996 223592 219042 217105 218254 221827
54592 221827 226306 229577 229970 227705 225021 224318 226182 229353 232216 233982 234754 235037 235180 235021 234167 232819
54576 232819 232056 232804 234713 236485 237244 237112 236555 235807 235132 235121 236284 238529 241244 243739 245415 245734 244478
54559 244478 242131 239776 238332 237774 237182 235684 233383 231228 229958 229408 229006 228706 229016 230210 231992 234171
54543 234171 237114 240935 244441 245720 244179 241443 239691 239430 239507 238998 238138 237333 236369 235132 234337 234755
54527 234755 236189 237905 239624 241432 243144 244590 246099 247733 248375 246721 243132 239442 236964 235784
54513 235784 235867 237388 239557 240575 239573 237557 235858 234769 234393 235426 237899 240214 240963 240984 242124 244429
54497 244429 246227 246829 247491 249361 251825 253432 253552 252633 251650 251668 253095 254886 255152 253155 250264 248594
54481 248594 249183 251769 255578 259627 262709 263975 263669 262868 262494 262864 263968 265668 267494 268640 268538 267394
54465 267394 266020 265064 264421 263416 261620 259482 258059 258013 258796 258956 257467 254819 252671 252203 252885 253021
54449 253021 251443 248482 245414 243372 242761 243225 243855 243809 243132 242873 244062 246544 249017 250228 250045 249350
54433 249350 248941 248670 247835 246373 245236 245243 246016 246618 246949 247653 248679 248922 247687 245731 244399 244312 245351
54416 245351 247288 249811 252304 254263 255706 256828 257581 257996 258539 259650 261235 263022 265054 267348 269442
54401 269442 270841 271674 272346 272736 272272 270782 268940 267924 268767 271576 275101 277447 277547 275687 272583 268755
54385 268755 265133 263202 263498 264598 264610 263335 262063 261591 261487 261161 260781 261003 262361 264709 266774 266743 264064
54368 264064 260273 257265 255409 254419 255253 259240 265364 270362 272164 271861 271636 272081 272423 272246 271796 271239
54352 271239 270631 270210 269947 269286 268156 267882 270046 274415 278738 280865 280658 279731 279684 280814 282280 283212 283623
54335 283623 284418 286635 290610 295610 300180 303011 303670 302514 300125 297210 294829 293917 294287 294831 295075 295778
54319 295778 297466 299301 300210 300345 300332 299864 298370 296562 295733 295625 294552 291776 288438 286000 285086 286010
54303 286010 288851 292577 295544 297493 299754 302882 305554 306718 307411 309265 312269 315315 318078 321014
54289 321014 324113 327031 330023 333433 336406 337297 335475 331951 328171 324898 322131 319427 316234 312400
54275 312400 308333 304430 300731 297475 295328 294376 293444 291346 288450 286093 284687 283476 282136 281516 282442
54260 282442 284560 286803 288472 289503 290089 290379 290316 289515 287536 284482 281262 279068 278501 279162 280059 280458
54244 280458 280256 279474 277780 275073 272401 271464 272889 275533 277752 278716 278258 276333 273354 270482 268698
54229 268698 267861 267234 266589 266194 266117 266390 267590 270362 274355 278293 281205 283032 284015 284083 282991 280791 278094
54212 278094 275956 275161 275305 274970 273296 271179 270401 271869 275081 278892 282139 283956 284385 284673 286140 288661
54196 288661 290757 291204 290041 288153 286508 285806 286256 287599 289684 292710 296409 299424 300485 300129 300209 301563
54180 301563 303074 303296 302011 299705 296480 292419 288590 286609 287000 288458 289071 288153 286734 286275 287105 288271
54164 288271 288761 288372 287350 285878 284307 283305 283150 283350 283666 285059 288655 293868 298465 300645 300402 298871
54148 298871 297068 295443 293972 292428 290815 289422 288119 286028 282668 279036 276629 275606 275021 274644 275187
54133 275187 276623 277711 277621 276809 275850 274734 273882 274449 276595 278680 279298 279066 279137 278968 277230 274441 272990
54116 272990 274429 278018 281981 285086 286863 287446 287647 288390 289642 290448 290219 289477 289136 289572 290489 291197 290996
54099 290996 289871 288887 289189 290413 290734 288876 285572 282644 281111 280665 280622 280746 281142 281803 282492 282941 282946 282327
54081 282327 281005 279239 277688 276945 277047 277738 279121 281519 284598 287318 289154 290782 292996 295483 297345
54066 297345 298347 298751 298232 296005 292081 287613 283922 281824 281743 283528 286123 288373 290278 292540 294806
54051 294806 295702 295049 294682 296122 298521 300019 300366 300870 302254 303806 304563 304259 303237 302410 303146 306007
54035 306007 309488 311152 310374 308979 308710 309098 308555 306792 305101 304460 304346 303664 302348 301654 302830 305675
54019 305675 308689 310844 312910 316432 321500 326206 328550 328256 326450 324313 322747 322752 325019 329098 333743
54004 333743 338295 343163 348720 354357 359223 363601 368881 376025 384488 392956 400751 407950 414160 417949
53990 417949 418070 414968 410499 406264 402801 400340 399468 400430 402275 403402 403091 402207 402339 404342 407702 411274
53974 411274 414647 418597 423938 430143 435663 439637 442646 445685 449106 452920 457263 461773 465116 466141
53960 466141 465386 464629 465000 466175 467291 467792 467255 465220 461624 456949 451696 446120 440627 435909 432240
53945 432240 428970 425138 420488 415643 411318 407581 403922 400047 396458 393944 392411 390669 387756 384130
53931 384130 381046 379039 377615 376237 374860 373557 372379 371677 371825 372489 372866 372825 373037 373644 373572 371816 368906
53914 368906 366524 365905 367019 369019 371023 372569 373705 374725 375847 377311 379582 382910 386740 390130
53900 390130 392910 395811 399360 403398 407903 413381 419847 426022 430229 431741 430953 428770 426276 424385
53886 424385 423273 422554 422380 423590 426363 429595 432382 435319 439436 444669 450454 457136 465385 474578 483079
53871 483079 489934 495181 498905 501496 504590 509909 516864 522975 527214 531358 537290 544596 552011 559897
53857 559897 569688 581697 595047 609418 625451 643511 663190 683911 704694 723172 736055 741337
53845 741337 739591 732934 723394 712418 701022 689586 677838 665591 653365 642019 632045 623477
53833 623477 616085 609225 601852 593272 583723 573726 563110 551460 539461 528805 520292 512831 505049
53820 505049 497341 491348 487572 484487 480241 474446 467896 461266 454831 449062 444617 441527 438878 435624
53806 435624 431612 427632 424517 422294 420283 417885 415060 411962 408513 404728 401235 398863 397581 396308
53792 396308 393997 390704 387456 385342 384690 384793 384439 383073 381355 380165 379330 378200 377277 378022 380618 383104
53776 383104 383483 381888 379898 378593 378185 378795 380394 382312 383753 384444 384138 382281 379272 377319 378406
53761 378406 381673 384185 384203 382315 379749 377408 376697 379052 383735 387788 389389 390122 392782 398087 404707
53746 404707 411532 418356 424915 430762 436034 441215 446271 450943 455741 461562 468126 473712 476824 477692
53732 477692 477995 479401 482222 485140 486469 486162 486191 488272 491555 493538 493097 491488 490132 488613 485577
53717 485577 480741 475152 469926 465532 461926 458473 453809 446817 438057 429588 423071 418559 415390 413401
53703 413401 412567 412034 410596 408025 405024 401944 398583 395410 393744 394046 394989 395102 394535 394193 393832 392344
53687 392344 389628 386790 384507 382553 381110 381208 383297 386448 389607 392707 395893 398575 400205 401310 402735
53672 402735 404286 405125 405343 406191 408553 411867 414797 416661 418015 419980 423040 426529 429503 432054 435234
53657 435234 439585 444429 449056 453892 459661 465758 470472 472864 473729 474556 476140 478473 481351 484587 487873
53642 487873 490908 493803 497108 501257 505891 509895 512313 513352 514353 516594 520120 523786 526392 527756
53628 527756 528761 530394 532797 535282 537123 537968 537570 535788 533238 531286 530656 530511 529766 528918 529331 530850
53612 530850 531514 530048 527397 525172 523656 522298 521331 521691 523567 525935 527541 527897 527446 527095 527412 528018
53596 528018 528069 527323 526160 524581 522204 519625 518583 519915 522329 524117 525238 526627 528388 530076 532161
53581 532161 535582 540028 544155 547483 550729 554203 557298 559827 562479 565486 568182 570474 573517 577985
53567 577985 582708 586177 588846 592726 598857 606159 612923 618707 624406 630864 637932 644982 652007 659749
53553 659749 668596 677846 686491 694400 702105 709625 716281 721756 726695 732011 738025 744343 750072 754202
53539 754202 756486 758156 761044 765533 769803 771487 769787 765848 761485 757813 754758 751506 747526 743104
53525 743104 738650 733754 727727 721165 716057 713825 713784 713991 713145 711242 708907 706720 704851 702871 700083
53510 700083 696426 692684 689488 686657 684108 682811 683862 686828 689995 692278 693894 695034 695065 693787 692635
53495 692635 693484 696517 700274 703783 707628 712558 718097 723446 729225 737146 747827 759848 771316 781622
53481 781622 791222 800497 809723 819769 831697 845505 860047 874557 889670 906459 924881 943752
53469 943752 962216 980793 1000879 1023448 1048441 1075201 1103068 1131395 1159435 1186896 1214685
53458 1214685 1244476 1277129 1311798 1347003 1382272 1418382 1456271 1496304 1538485 1582730 1628748
53447 1628748 1675867 1723021 1768886 1812362 1853353 1892819 1931647 1969694 2006372 2041810 2076702
53436 2076702 2111151 2144423 2175941 2205929 2235082 2264184 2294018 2324923 2356341 2387438 2418194
53425 2418194 2449121 2479873 2509153 2536318 2562068 2586907 2609750 2628922 2643967 2655616 2664282
53414 2664282 2669427 2670385 2667232 2660772 2651913 2640832 2626479 2607336 2583275 2556459 2529903 2505195
53402 2505195 2481878 2458546 2433823 2406628 2376571 2344386 2311302 2277703 2242996 2207156 2171743
53391 2171743 2138637 2108004 2078280 2048308 2018956 1992225 1969140 1949074 1931124 1915471 1902928
53380 1902928 1893444 1885720 1878569 1872350 1868756 1869176 1873332 1879594 1886616 1894650 1905084 1918726 1934829
53367 1934829 1952011 1969832 1989120 2010955 2035856 2063985 2095569 2130797 2169468 2210967 2254556
53356 2254556 2299707 2346235 2394173 2443638 2495053 2549495 2608284 2671814 2739044 2808538 2879758
53345 2879758 2952993 3028533 3106559 3187534 3271841 3359023 3448107 3538602 3630545 3723632 3817122
53334 3817122 3910609 4004084 4097123 4188764 4278260 4365175 4448780 4528409 4604537 4678243 4749139
53323 4749139 4814974 4873901 4926048 4972129 5011637 5043436 5067151 5082772 5089684 5087514 5077510 5061572
53311 5061572 5039835 5010230 4970554 4920259 4860457 4793060 4719796 4641215 4556768 4466725 4373750
53300 4373750 4281427 4191214 4101945 4012347 3922830 3834481 3747674 3662481 3579508 3499318 3421549
53289 3421549 3345420 3270764 3197908 3126891 3057597 2990467 2926301 2865268 2806729 2750281 2696539
53278 2696539 2646556 2600692 2558413 2519221 2483433 2451724 2423988 2399017 2375536 2353203 2332175
53267 2332175 2311971 2291476 2270345 2249804 2231530 2215915 2201848 2188152 2174729 2162201 2151060
53256 2151060 2141742 2135284 2133020 2135289 2140942 2148594 2157881 2168859 2180680 2192102 2203426 2216753 2233757
53243 2233757 2254151 2277119 2303260 2333780 2368041 2403431 2438095 2472964 2510539 2552158 2596800
53232 2596800 2642157 2686383 2728887 2769820 2809026 2845626 2878516 2906945 2930522 2949195 2963615
53221 2963615 2974983 2983770 2988822 2988493 2982525 2972001 2957436 2937965 2912868 2883142 2850855 2817236
53209 2817236 2781908 2743759 2702160 2657507 2611015 2563992 2517081 2470113 2422662 2374551 2325827
53198 2325827 2276485 2226343 2175059 2122372 2068715 2015618 1964973 1917468 1871870 1826114 1779147
53187 1779147 1731758 1685837 1642842 1602661 1563885 1525380 1487600 1452011 1419206 1388173 1357653
53176 1357653 1327731 1299588 1274057 1251026 1230187 1211703 1195800 1181931 1168568 1153938 1137062
53165 1137062 1118184 1098229 1077874 1057230 1036257 1015111 993911 972538 950929 929336 908003
53154 908003 886901 866200 846755 829476 814208 799863 785798 772396 759949 747679 734605
53143 734605 720888 707270 693411 678042 661257 645496 633194 623958 615137 604964 594131 584336
53131 584336 576424 570304 565564 561429 556863 551665 547053 544309 543056 541614 538882 535143 531132 527183
53117 527183 523400 519871 516416 512795 509466 507434 506752 505743 502523 497191 491858 488428 486968 486343 485813
53102 485813 485403 484988 483822 481338 478070 475307 473823 473161 472246 470495 468279 466490 465723 465690 465296 463367
53086 463367 459444 453970 447917 442416 438566 437045 437805 440279 443867 447837 450966 452065 451157 449557 448400
53071 448400 447665 446992 446680 447056 447467 446952 445776 445287 446097 447335 447998 448307 449259 451312 453885 455915 456665
53054 456665 456392 456442 458207 461570 464661 465585 464246 462101 460339 458818 456836 454313 451753 449323 446591
53039 446591 443285 439807 436767 434454 433191 433695 436208 439419 441343 441539 441617 443034 445210 446504 446384
53024 446384 445776 445618 445972 446288 445866 444238 441776 439729 438958 438955 438856 438991 440380 442892 445109 446086 446064 445258
53006 445258 443285 440380 438067 437660 438738 439935 440645 441075 441056 439909 437642 435498 434810 435518 436166 435457
52990 435457 433734 432704 433675 436369 439579 442370 444025 443456 439896 434323 429191 426324 425640 426118 427224
52975 427224 428987 431330 433869 435995 436915 436217 434586 433366 432998 432536 431038 428802 426770 425450 425017
52960 425017 425742 427529 429447 430564 431023 431644 432610 433153 432489 430706 428801 428076 429187 431475 433545 434723
52944 434723 435507 436397 437003 436834 436310 436217 436565 436652 435997 434592 432611 430530 429234 429287 430220 431134 431797 432640
52926 432640 433997 435901 438303 440856 442847 444060 445309 447262 449069 449307 448175 447696 449573 453721 459034
52911 459034 464595 469843 474473 478724 483156 487674 491272 493124 493423 492864 491805 490400 489086 488394 488409
52896 488409 488747 488867 488258 486607 484153 481662 479682 477839 475144 471072 466243 461939 458958 457120 456019
52881 456019 455830 456732 457664 456746 453480 449657 447156 445625 443495 440773 439318 440287 442753 445235 447279
52866 447279 448885 449498 448596 446654 444710 443320 442456 441882 441008 438974 435739 432788 431934 433534 436416 439292
52850 439292 441529 442726 442500 441010 439085 437426 435945 434169 432101 430348 429384 428915 428181 426933 425841
52835 425841 425738 426674 428075 429585 431118 432141 431762 429917 427886 427137 427998 429736 431441 432437 432432 431887 431922
52818 431922 433254 435393 437228 438067 437874 437140 437068 439069 443139 447363 450129 452337 456031 461124 465075
52803 465075 465949 464211 461204 457702 454865 454835 458578 463968 467627 468256 466821 464127 460131 455668 452794
52788 452794 452420 452830 451581 448109 443615 439151 434919 431105 428226 426469 425424 424703 424207 423594 422093
52773 422093 419384 416281 413922 412306 410260 407180 404246 403241 404374 406059 406961 407384 408134 408916 408760
52758 408760 407584 406311 405744 406347 408811 413351 418290 420868 420210 418316 417417 417634 418150 419225 421364 423421
52742 423421 423580 421939 420237 419020 416992 413638 410625 409554 409738 409444 408441 408000 408841 410306 411433
52727 411433 411952 412073 411883 411212 409866 407939 405898 404231 403187 403015 404062 405952 407126 406430 405023 405233
52711 405233 407135 407894 405445 401396 398967 399199 400765 402598 404719 406724 407360 405997 403320 400406 398245
52696 398245 398070 400560 404328 406587 406093 404355 403413 403524 403856 404384 405930 408840 412611 416523 419923 422287
52680 422287 423824 425716 428967 433123 436864 439657 442016 444194 445635 446057 446243 447093 448408 449389 450073
52665 450073 451362 453456 455143 455332 454690 454814 455880 456187 454325 450931 447684 445280 443161 440750 438048
52650 438048 435244 432578 430471 429087 427876 426351 425135 425329 426879 428521 429431 429961 430546 431015 431362 432161
52634 432161 433531 434527 434359 433584 433377 434144 435503 437091 438664 439865 440714 441917 443862 445585 445696 444216
52618 444216 442590 441732 440898 438857 435655 432739 431456 431728 432318 432375 432467 433724 436076 438048 438538 438166 438362
52601 438362 439656 441404 442742 443223 442951 442820 444207 447618 451843 455279 457829 460642 464165 467530 469922
52586 469922 471482 472521 472777 471903 470050 467634 465108 463181 462501 462755 462838 462360 462240 463256 464792 465852
52570 465852 466758 468856 472840 478214 484282 490739 497241 503210 508292 512319 514597 513966 510142 504531 499139
52555 499139 494796 490894 486693 482297 478202 474492 471000 468037 466295 465848 465771 465221 464611 465112 466997 469113
52539 469113 470181 470098 469622 469205 468659 467757 466675 465829 465545 465787 466000 465447 464055 462690 462233 462678 463647 465460
52521 465460 468800 473311 477444 479981 480967 480826 479507 477246 475371 475183 476247 476820 476061 474848 474209 473821
52505 473821 472650 470478 468124 466432 465596 465351 465304 464980 463916 461850 458821 455161 451535 448839 447719
52490 447719 448076 449101 449841 449795 449153 448542 448372 448368 447919 446987 446338 446595 447300 447343 446235 444521 442964 441841
52472 441841 441206 441289 442149 443301 444283 445494 447744 450764 452923 453169 452801 454254 457967 461541 462608 461732
52456 461732 461431 462912 465136 467086 469382 472935 477250 481190 484749 488798 493425 497726 501367 505215
52442 505215 509988 514942 518335 518851 516474 512444 508449 505280 502088 497523 491739 486535 483162 480804
52428 480804 477966 474738 472720 472902 474541 476251 477442 478337 479172 479884 480358 480541 480374 479971 479905 481009 483557
52411 483557 486684 488972 489783 489903 490598 492147 493609 493993 493297 492339 492043 493174 496317 501511 507845 513842
52395 513842 518398 521255 522598 522479 520790 517595 513267 508219 502608 496476 490279 485115 482021 480808
52381 480808 479949 478018 475228 473102 472521 472594 471770 469690 467367 465730 464808 464521 465401 467806 470832 472878
52365 472878 473272 472702 472161 472249 473500 476270 479922 483064 485310 487992 492299 497425 501632 504637 507770
52350 507770 512102 517644 524366 532656 542451 552960 563605 574319 584535 592869 598239 600518 599804
52337 599804 596108 590341 584408 579368 574373 568457 562532 558281 555620 552781 548946 545478 544126 544922
52323 544922 546373 547113 546902 546345 546099 546449 547620 550267 555095 561729 568538 574073 578348 582224 586131
52308 586131 590141 594774 600620 607272 613714 619836 626639 634603 642578 648633 651558 651423 649337 646818
52294 646818 644853 643371 642052 641578 643317 647711 653705 659949 665773 670840 674860 678356 683002 690504
52280 690504 701308 714656 729346 744184 758487 772784 788489 806255 825149 844034 863193
52269 863193 883862 906648 931239 957390 985263 1014824 1045611 1077141 1109127 1141472 1174482
52258 1174482 1208705 1243806 1277960 1309290 1337774 1364887 1391385 1416515 1439488 1460666 1480885
52247 1480885 1500547 1519852 1538963 1557202 1572912 1585109 1594860 1604127 1613465 1621696 1627680 1631508
52235 1631508 1633933 1635523 1636674 1637759 1638611 1638154 1635072 1628947 1620598 1611354 1602098 1593007 1584130 1576047
52221 1576047 1569844 1566446 1566202 1569074 1574864 1583099 1593174 1605054 1619503 1637003 1656598 1676409 1695330
52208 1695330 1713627 1731837 1749769 1766961 1783617 1800552 1818247 1836127 1852710 1866521 1877299
52197 1877299 1886222 1894496 1901735 1906529 1908810 1910621 1913778 1917552 1919780 1919774 1918696 1916969 1912770 1903975 1890846
52182 1890846 1875763 1860599 1845190 1828424 1810009 1790790 1771784 1753543 1736297 1720060 1704336
52171 1704336 1688317 1672046 1657145 1645634 1637916 1632502 1627798 1623352 1619167 1614890 1610588 1607537 1607006
52158 1607006 1608479 1610148 1611166 1612477 1615422 1620528 1627756 1636807 1646610 1655396 1661997 1666766 1670901 1675381
52144 1675381 1680778 1687350 1694734 1701991 1708405 1713879 1718263 1720980 1721877 1721953 1722633 1724694 1728276 1733326 1739259
52129 1739259 1744617 1748029 1749506 1750201 1751045 1752169 1753467 1754860 1755831 1755391 1752946 1749073 1745227 1742605 1741043
52114 1741043 1738901 1734336 1726946 1717948 1708744 1699945 1692101 1686341 1683272 1681760 1680003 1677680 1676051 1676093
52100 1676093 1677760 1681086 1686554 1693737 1700864 1706810 1712700 1720319 1729360 1737461 1742941 1746434 1749555 1752963
52086 1752963 1756306 1759428 1762726 1766490 1770595 1775068 1780519 1787726 1796897 1807479 1818609 1829753 1841126
52073 1841126 1853524 1867581 1883142 1899623 1917024 1936124 1957569 1981365 2007623 2037138 2070482
52062 2070482 2106996 2145551 2186067 2229219 2274733 2321011 2366550 2410665 2452685 2491692 2527524
52051 2527524 2560726 2590712 2615231 2632880 2645320 2655563 2664441 2669937 2669804 2663754 2653262 2640460
52039 2640460 2627382 2615252 2603969 2592639 2580737 2568449 2556141 2544062 2532409 2521110 2509714
52028 2509714 2498036 2486652 2476043 2465471 2453529 2439854 2425754 2413249 2403976 2398769 2397480 2399205
52016 2399205 2403196 2409463 2418200 2429134 2442010 2456960 2473536 2490085 2505363 2520291 2536753 2554927
52004 2554927 2573168 2590209 2605909 2619934 2631528 2640935 2649375 2657038 2662447 2664300 2662568 2657392 2648555
51991 2648555 2636711 2623452 2609070 2591765 2570323 2546266 2521950 2497658 2472083 2444835 2416788
51980 2416788 2388417 2359333 2329385 2299022 2268627 2238454 2209132 2181463 2155911 2132783 2112387
51969 2112387 2094274 2076993 2059589 2042904 2028458 2016524 2006236 1996937 1988226 1979197 1969059 1958287
51957 1958287 1947827 1937296 1925272 1911324 1896459 1881519 1866459 1851326 1836449 1821213 1803972
51946 1803972 1783778 1761163 1736697 1710042 1681278 1652075 1624348 1598280 1572603 1546475 1520130
51935 1520130 1493889 1467478 1440506 1413228 1386672 1362124 1340307 1320920 1303176 1286796 1272062
51924 1272062 1258822 1246197 1233671 1221798 1211211 1201428 1191364 1180496 1168661 1155082 1138898
51913 1138898 1120744 1102657 1085950 1070200 1054911 1041130 1030274 1022061 1015020 1008925 1005289 1005071
51901 1005071 1007122 1009584 1011886 1014518 1017716 1021456 1026196 1032358 1039186 1045269 1050198 1054620 1058448 1060158
51887 1060158 1058436 1053686 1047334 1040295 1032859 1025647 1019957 1017139 1017873 1021875 1028167 1036030 1045859 1058764
51873 1058764 1075087 1093635 1112425 1129787 1144727 1156840 1166005 1171696 1172617 1167762 1157903 1145168
51861 1145168 1130984 1115323 1098076 1079942 1061517 1042798 1024258 1007178 991974 977376 962438
51850 962438 948453 937663 930956 927914 928201 931465 936761 943729 953476 966375 979514 988602 992490
51837 992490 993846 995151 996102 995468 993427 990856 987732 983389 977378 969174 958003 943855 927949 911548
51823 911548 895265 880062 867676 858861 852181 845891 840449 837881 838976 842347 846196 849822 853268
51810 853268 856517 859623 863115 867719 873680 880436 886876 891905 894890 895614 893945 889808 883475 875560
51796 875560 866722 857674 849494 843414 840060 839140 839965 841944 844614 847624 850805 853829 855848 855986 854229
51781 854229 851274 847512 842925 837931 833336 829112 824230 818221 811962 806239 800516 794165 788192 784434
51767 784434 783214 782984 782345 781485 781242 781560 781420 780031 777598 774892 772306 769506 766064 762194 758544 755434
51751 755434 752780 750701 749513 749019 748658 748723 750608 755055 760718 765243 767397 767501 766262 764256 762314
51736 762314 761188 760541 759139 756396 752936 749168 744165 736916 728410 721375 717550 715878 713961 710888
51722 710888 707752 705492 703446 700846 698878 699852 704274 709911 714199 716657 718447 720413 722394 724029
51708 724029 725411 727143 730221 735545 742997 751361 759715 768562 778938 790792 803047 814912 826044
51695 826044 835487 841701 844168 844101 842818 840013 834487 826308 817312 809237 802091 794980 788079 782875 780258
51680 780258 779239 778353 777807 779216 783299 789008 795292 802613 811966 823215 835283 847389 859074 869496
51666 869496 877909 884799 891599 899204 907431 915542 922148 924855 921654 913237 902668 892164 881442
51653 881442 870074 859881 853139 849121 844482 837277 828960 821948 816782 812661 809526 808151 808761 810936
51639 810936 814666 820039 825665 828877 828351 825634 823233 821843 820534 819129 818975 821111 824712 827714 828337
51624 828337 825770 820365 813811 808419 805345 803706 801998 800015 798763 798818 799681 800704 801904 803712 806571
51609 806571 811036 817753 827090 839103 853826 870986 889226 906292 920472 931358 938705 941193
51597 941193 937324 927556 914636 901515 889588 879339 871847 868536 869454 872774 876381 879383 881549
51584 881549 881914 878949 872286 863449 854369 845566 836339 826450 816865 808671 801833 795472 789006 782348
51570 782348 775062 766179 755415 744225 734921 728719 725041 722686 721039 720011 719474 719270 719372 719546 719161
51555 719161 717851 716228 715451 716063 717485 718550 718398 717206 716256 716889 719108 721777 724555 728754 735351
51540 735351 742909 748837 752457 755570 760152 766942 776251 788303 802018 814917 825247 833144 838866
51527 838866 841122 838652 832832 827073 823610 821942 820567 819368 819959 824079 831921 842025 852934 864879
51513 864879 879385 897253 917653 939317 961663 984428 1007345 1030930 1056454 1084015 1111522
51502 1111522 1136874 1160558 1184910 1211447 1240372 1272279 1308555 1349925 1395936 1445996 1499423
51491 1499423 1553912 1605171 1648960 1683009 1706752 1720073 1722890 1715416 1698330 1672886 1640800 1603480
51479 1603480 1561412 1514832 1464936 1413753 1363064 1314218 1268647 1227266 1189253 1152665 1116661
51468 1116661 1082174 1050243 1020909 994101 970258 949362 930514 913214 897952 884694 871971
51457 871971 858667 845838 835468 827966 822087 816845 812231 808326 805000 802498 801210 800816 800653 801011
51443 801011 802946 806432 809594 810390 808505 805102 801193 796916 792280 787987 785069 783760 783049 781590 778970
51428 778970 775781 772701 770070 768239 767430 766894 765072 761178 755922 750093 743224 734610 724889 715352 706058
51413 706058 696105 685786 677107 671661 668969 667325 665392 662564 658732 654542 651323 649957 649946 649980 649233
51398 649233 647926 646969 647344 649487 653004 657166 661723 666793 672073 676948 681575 687085 694347 703252 713531
51383 713531 725351 738582 752532 767328 784486 804680 825425 842551 853975 860776 864632 865771
51371 865771 863993 860329 856468 852980 848897 842923 834757 825442 816640 809317 803132 797312 791771 786664
51357 786664 781360 775092 768637 763878 761346 759695 758300 758753 762421 767821 772215 775104 778352 783166
51343 783166 788756 794068 799196 804673 810657 817309 824824 832598 839344 844570 849243 854699 861745 871015
51329 871015 882994 897106 911704 925767 940059 956242 975607 999098 1027545 1061097 1099095
51318 1099095 1141158 1187719 1239139 1295453 1357748 1428254 1507133 1589522 1667332 1734265 1788431
51307 1788431 1830693 1862053 1882764 1892561 1890909 1877485 1852733 1817595 1772835 1719244 1658405 1592472
51295 1592472 1523206 1452079 1381401 1314343 1253198 1198037 1147444 1100328 1056869 1018103 984817
51284 984817 956672 932338 910564 890908 873249 857078 841850 827705 815108 803953 793750
51273 793750 784510 776532 769312 761652 753047 744170 735672 727378 719046 711179 704505 699184 694993 691810
51259 691810 689439 687404 685420 683700 682309 680579 677851 674633 672422 672177 673383 674719 675325 675219 674803
51244 674803 674417 674432 675348 677396 680199 683247 686570 690443 694399 697225 698098 697056 694173 689221 682735
51229 682735 676422 671518 667450 663207 659455 657920 658924 661029 663260 666324 671163 677341 683431 688309
51215 688309 691678 693980 696093 698553 700858 702142 702536 703141 704570 706418 708340 710679 713666 716830 719638
51200 719638 722042 723994 725071 724871 723250 720113 715769 711499 708639 706800 704094 699529 694151 689321
51186 689321 685084 680954 677126 673891 670743 667188 663775 661406 660170 659764 660415 662372 664892 666672 666981
51171 666981 665726 663004 659492 656701 655636 655410 654208 651528 648658 647000 646734 647074 647125 646497 645644 645611
51155 645611 647013 649457 652283 655429 658960 662202 664232 665068 665711 667140 669828 673996 679602 686051 692408
51140 692408 697864 701826 704035 705063 706301 708764 712028 714632 715253 713336 709403 705248 702936 702718 702529
51125 702529 700393 696732 693380 691062 689019 686690 684451 682825 682027 682207 683216 684249 684567 684348 684075
51110 684075 683565 682562 681760 682049 683165 684452 686550 690778 696897 703050 708016 712159 716038 719564 722693
51095 722693 725477 727126 726548 724287 722495 722361 722892 722768 721974 720889 719265 717093 715292 714436 713881 713099
51079 713099 712819 713720 715042 715689 715821 716063 715905 714415 712058 710345 709755 709187 707488 704573 701168 698349
51063 698349 697255 698337 700810 703428 705604 707253 708158 708506 709646 712979 718118 723243 727335 730925 734549
51048 734549 737861 740779 744207 748694 753316 756998 760373 765114 771600 778312 783608 787100 788989 789109
51034 789109 787492 785415 784750 786127 788393 790106 791023 791754 792612 793476 794477 795987 797964 799955 801825
51019 801825 803834 805821 807019 807016 806438 806303 807173 809187 812292 816017 819661 823451 829055 838053 850081
51004 850081 863284 876492 890086 904793 920800 938602 959651 984881 1012704 1039337 1061505
50993 1061505 1078585 1092345 1105384 1120109 1138352 1160726 1185939 1211283 1234378 1254591 1272738
50982 1272738 1289426 1303666 1312974 1314953 1309252 1298228 1285491 1273508 1262505 1251306 1238548 1222925
50970 1222925 1203136 1178550 1149970 1119387 1089079 1061051 1036710 1016359 999272 984960 974121
50959 974121 967665 965049 964571 965379 968232 974043 982463 992272 1002490 1012747 1023230 1034751 1048282
50946 1048282 1063841 1080067 1095229 1108422 1119777 1130197 1141186 1154254 1169860 1187179 1205175
50935 1205175 1223503 1242139 1260903 1279886 1299767 1320953 1342641 1363382 1382369 1399787 1416240
50924 1416240 1432363 1448724 1465578 1482881 1500863 1520051 1540169 1559581 1576788 1592225 1607751
50913 1607751 1624582 1642870 1663395 1688441 1720175 1758880 1803502 1853561 1909706 1972592 2041945
50902 2041945 2116936 2196837 2280901 2367911 2456416 2545496 2634918 2724428 2813131 2899672 2982550
50891 2982550 3060010 3130183 3192019 3245831 3292225 3330644 3359926 3380405 3394480 3404622 3411512
50880 3411512 3414594 3413694 3409282 3401619 3390380 3374939 3354616 3329049 3298935 3266021 3231722 3196034
50868 3196034 3158265 3118249 3076017 3030736 2981186 2927185 2869451 2808042 2742158 2671931 2599274
50857 2599274 2526307 2453859 2382316 2313123 2248085 2187326 2129174 2072434 2018067 1968178 1923879
50846 1923879 1884591 1849022 1816185 1785616 1757285 1731513 1708558 1688067 1669236 1651699 1635858
50835 1635858 1622112 1610182 1599635 1590598 1583248 1576900 1570472 1563933 1558565 1555593 1555122 1556491 1558980
50822 1558980 1561972 1565147 1568915 1574152 1581268 1590108 1600789 1613701 1628482 1644164 1660949 1680566
50810 1680566 1703877 1729225 1754508 1780084 1808097 1839450 1873281 1909430 1949628 1995610 2047291
50799 2047291 2103545 2163920 2229052 2300087 2378189 2464071 2557623 2658528 2767431 2885946 3015340
50788 3015340 3155841 3307285 3469501 3641737 3822499 4010463 4204888 4404828 4608659
50779 4608659 4814575 5020514 5223020 5417173 5598439 5763919 5911195 6037098 6138882
50770 6138882 6215994 6269489 6300182 6308694 6297055 6268895 6227984 6177779 6122434 6066742 6014230
50759 6014230 5966035 5922182 5883117 5849204 5819088 5789198 5754818 5711609 5656691 5588883 5507951
50748 5507951 5413621 5305550 5184002 5049792 4903467 4745483 4577715 4404093 4229163 4056580
50738 4056580 3889424 3730986 3583863 3448511 3323723 3208636 3103546 3008949 2924855 2851247
50728 2851247 2788149 2734767 2689248 2649887 2616174 2588250 2565742 2547462 2531824 2517110 2501757
50717 2501757 2484939 2466929 2448727 2431362 2415342 2400179 2384347 2366343 2346043 2324445 2301902
50706 2301902 2277435 2250274 2221189 2191612 2162186 2133116 2105240 2079484 2055490 2032029 2008882
50695 2008882 1987366 1968957 1954250 1943336 1936230 1932650 1932165 1934829 1941087 1950981 1964201 1981029 2002416
50682 2002416 2028882 2060125 2095995 2137150 2184457 2238364 2299029 2366374 2439849 2518919 2603825
50671 2603825 2694920 2791131 2890273 2991184 3094245 3199347 3304866 3409530 3513784 3617919
50661 3617919 3719974 3817052 3907799 3991824 4067240 4130677 4179702 4213649 4232049 4234002 4219702
50650 4219702 4191422 4152484 4106095 4055447 4003913 3954455 3909294 3870149 3837905 3811808 3789838
50639 3789838 3770330 3752736 3736759 3721585 3706066 3688512 3665868 3634171 3590718 3535364 3469425
50628 3469425 3394244 3311555 3224331 3136141 3049854 2967596 2891445 2823091 2762990 2710817 2666818
50617 2666818 2631804 2605712 2587137 2574961 2569871 2573597 2586905 2608936 2638282 2673806 2714156 2757283
50605 2757283 2801175 2844819 2887857 2929599 2969226 3006859 3043472 3079482 3114520 3149130 3185572
50594 3185572 3225776 3269039 3313009 3356725 3401615 3449606 3501479 3557270 3617110 3681191 3749673
50583 3749673 3823092 3902130 3986612 4075470 4168195 4265489 4367722 4473211 4578738 4681486
50573 4681486 4779942 4873311 4960810 5041448 5113952 5177038 5230461 5275845 5315548 5349617 5373374
50562 5373374 5378320 5356553 5305754 5230904 5141449 5046766 4953791 4867364 4790804 4725476 4671030
50551 4671030 4627142 4594507 4573257 4560923 4553063 4545828 4536959 4524465 4505626 4477702 4438593 4386183
50539 4386183 4318236 4234205 4136761 4030253 3917644 3799886 3678318 3556263 3437495 3323959
50529 3323959 3215865 3113399 3017259 2927845 2845101 2769276 2700841 2639378 2583447 2532009 2485291
50518 2485291 2443803 2407203 2374699 2345992 2321145 2299949 2282112 2267809 2257458 2251086 2248436 2249542
50506 2249542 2254800 2264562 2278883 2297287 2318561 2341392 2365769 2393284 2425614 2463234 2506109 2554709
50494 2554709 2609226 2668371 2730147 2793581 2858655 2924831 2991006 3056900 3123211 3190199 3257258
50483 3257258 3324145 3391632 3460713 3532349 3608401 3691721 3784654 3888153 4002616 4128617 4266319
50472 4266319 4415259 4575537 4748436 4935058 5134883 5346371 5568378 5800238 6040881
50463 6040881 6288519 6540806 6794624 7046055 7291171 7526607 7748856 7953326 8134695
50454 8134695 8288085 8409643 8496501 8546857 8560091 8536454 8476901 8383512 8259677 8109468
50444 8109468 7937214 7748320 7550202 7351598 7160453 6982471 6821608 6681576 6566563
50435 6566563 6480239 6424083 6396867 6395722 6416983 6455445 6503497 6552068 6592360 6616087 6614939 6581952
50423 6581952 6514188 6412967 6281031 6120590 5934605 5728478 5509212 5283476 5057095 4835185
50413 4835185 4621237 4416355 4220432 4033916 3857874 3692900 3539000 3396345 3265357
50404 3265357 3146116 3038200 2940978 2853803 2776367 2709008 2651847 2603235 2560209 2521333 2488044
50393 2488044 2462048 2442377 2426526 2413778 2405510 2402298 2402433 2403718 2405376 2407695 2410921 2415207 2420842
50380 2420842 2427876 2435848 2444306 2453180 2462380 2471390 2479635 2487160 2494822 2503822 2514893 2527946 2542866
50367 2542866 2560654 2583061 2610612 2641771 2674833 2710217 2750053 2795964 2848209 2906719 2971872
50356 2971872 3044119 3123547 3209891 3302526 3400680 3504238 3613915 3729945 3850936 3974843
50346 3974843 4100448 4226725 4351251 4470944 4584509 4692482 4794252 4886324 4964454 5026523
50336 5026523 5072299 5100876 5109545 5095416 5057717 4998264 4919796 4824316 4713607 4591391 4463914
50325 4463914 4337516 4216048 4101418 3995914 3902561 3823369 3758690 3708547 3673355 3652861
50315 3652861 3645396 3648649 3660319 3677518 3696277 3712185 3720991 3718487 3700829 3665814 3613603 3546022
50303 3546022 3465587 3375194 3277783 3175671 3070528 2964066 2858165 2754234 2653170 2555994
50293 2555994 2463735 2376621 2294323 2217120 2145757 2080051 2019023 1962857 1913244 1870939 1834304
50282 1834304 1801409 1772416 1748541 1729659 1714684 1703783 1698348 1698753 1703704 1712180 1724611 1741430
50270 1741430 1761382 1782058 1801514 1818615 1832143 1840410 1842055 1836977 1826424 1812295 1796469 1780598
50258 1780598 1766064 1753654 1743191 1733789 1724640 1715567 1706946 1699323 1692998 1687671 1682597 1677489 1673177
50245 1673177 1670969 1671418 1674098 1678356 1683589 1688957 1693754 1698270 1703539 1710126 1717962 1727378 1739048 1752510
50231 1752510 1765990 1778648 1791972 1807855 1825959 1844138 1861106 1877628 1895247 1914884 1936803
50220 1936803 1961305 1989198 2021452 2057548 2093392 2121568 2135046 2131185 2112219 2082749 2047634
50209 2047634 2011374 1977406 1947143 1920341 1896712 1876511 1859477 1844275 1829663 1815749 1803568
50198 1803568 1793724 1785854 1779295 1773982 1770718 1770519 1773568 1778906 1785340 1792495 1800751 1810498 1821940 1835399
50184 1835399 1851270 1869797 1891405 1916977 1946917 1979952 2013629 2046228 2077540 2107733 2136393
50173 2136393 2163078 2187902 2210738 2230409 2245594 2256501 2264879 2272207 2278140 2280728 2277852 2268396
50161 2268396 2252236 2229292 2198863 2160416 2115242 2066808 2018922 1973609 1931146 1891817 1856824
50150 1856824 1827375 1803595 1784698 1769574 1756449 1742289 1723538 1698110 1666668 1631987 1597321
50139 1597321 1565112 1536307 1510128 1484711 1458715 1432609 1408151 1386588 1367579 1349798 1332152
50128 1332152 1314289 1296422 1279044 1262664 1247447 1233180 1219678 1207026 1195186 1183579 1171577
50117 1171577 1159489 1148661 1140199 1133801 1128177 1122636 1117778 1114446 1112545 1111446 1111257 1112754 1115901 1119375
50103 1119375 1122215 1125363 1130741 1139052 1149191 1159659 1169738 1179438 1189229 1200161 1213502 1229755
50091 1229755 1248311 1268263 1289121 1310627 1332318 1353484 1373091 1389746 1402481 1411976 1420333 1428994
50079 1428994 1437269 1443574 1447929 1452647 1460506 1472667 1488553 1507465 1529836 1556587 1587497 1621065
50067 1621065 1656444 1694864 1738287 1787137 1840457 1897941 1960221 2026831 2095372 2163472 2230503
50056 2230503 2296604 2361183 2423391 2483278 2541336 2597543 2651731 2704057 2753810 2798222 2833724
50045 2833724 2858030 2869966 2868000 2850787 2819241 2776556 2725824 2668832 2607257 2543396 2478986
50034 2478986 2414529 2350620 2288994 2231348 2177950 2128328 2082766 2042163 2006781 1975971 1948869
50023 1948869 1924494 1901345 1877941 1854121 1831217 1810616 1792414 1775680 1759656 1744319 1729812
50012 1729812 1715717 1701111 1685326 1668494 1651312 1634407 1618012 1602081 1586506 1571266 1556578
50001 1556578 1542827 1530111 1517963 1505871 1494138 1483988 1476655 1472439 1470568 1469795 1469259 1469167 1470733
49988 1470733 1475064 1481861 1489497 1496654 1503662 1511946 1522312 1534192 1546517 1558711 1570586 1581763
49976 1581763 1591913 1601380 1610840 1620147 1628224 1634444 1639455 1644015 1647727 1649927 1651460 1654263 1658970 1664028
49962 1664028 1667632 1669755 1671783 1674892 1679300 1684451 1689370 1693378 1697052 1702039 1709401 1718607 1728455 1738279
49948 1738279 1747743 1756377 1764300 1772812 1783334 1796270 1811835 1831249 1855683 1884257 1914552 1945261
49936 1945261 1977142 2011143 2046810 2083091 2119657 2156597 2193299 2228280 2259840 2286397 2306308
49925 2306308 2317605 2317966 2305286 2278846 2239990 2191339 2135302 2073584 2007817 1940055 1872674 1808015
49913 1808015 1747741 1691914 1639181 1588669 1541405 1498951 1461052 1425914 1392772 1362843 1337431
49902 1337431 1316337 1298577 1283477 1270329 1258038 1246086 1235247 1226562 1220084 1215409 1212947 1213729
49890 1213729 1217929 1224183 1230604 1236424 1242747 1251631 1264073 1278937 1294292 1309510 1325098 1340453
49878 1340453 1353077 1360902 1364618 1366841 1369279 1371335 1371006 1366358 1356363 1341096 1321499 1298784 1274147
49865 1274147 1248950 1224663 1202219 1181692 1162834 1145736 1130966 1119467 1112255 1109557 1110128 1112094
49853 1112094 1114591 1117766 1121046 1122731 1122074 1120687 1120798 1122883 1126223 1131131 1138979 1149900 1161865 1172694
49839 1172694 1182349 1192726 1205627 1221326 1238845 1257131 1275652 1293852 1310366 1323407 1332137 1337224
49827 1337224 1339882 1340876 1340663 1339688 1337802 1333838 1326477 1315343 1300755 1282941 1262269 1239956 1217713
49814 1217713 1196667 1177102 1159021 1142242 1126226 1110700 1096508 1085079 1076896 1071077 1066549 1063047
49802 1063047 1060739 1059481 1058916 1059148 1061012 1065505 1072763 1081675 1090967 1100797 1112599 1126945 1142406 1157430
49788 1157430 1172636 1189951 1209690 1229862 1248370 1264564 1278260 1288730 1295652 1300111 1303501 1305801
49776 1305801 1305775 1302580 1296378 1287578 1276419 1263454 1249808 1236574 1224104 1212010 1199754 1187296
49764 1187296 1175371 1165170 1157651 1153165 1151741 1153365 1157726 1163953 1171215 1179784 1191052 1206085 1224147
49751 1224147 1242955 1260502 1276456 1291637 1306399 1319954 1331265 1340056 1346772 1352047 1356664 1361529
49739 1361529 1366875 1371526 1373724 1372877 1369897 1365611 1359512 1350496 1338202 1322921 1304603 1282911 1258430
49726 1258430 1233052 1208807 1186599 1166244 1147349 1129888 1114291 1101311 1091523 1084549 1078998 1073662
49714 1073662 1068710 1065272 1063899 1063986 1064769 1066343 1069366 1074166 1080486 1087895 1096163 1105357 1115670 1126973
49700 1126973 1138661 1150383 1162755 1176395 1190071 1201005 1207890 1212524 1217263 1221588 1222820 1219809
49688 1219809 1214108 1207295 1198985 1188205 1175381 1161949 1148995 1137130 1126896 1118363 1110954 1104416
49676 1104416 1099284 1095694 1092642 1089352 1086645 1085838 1086890 1088885 1091803 1096237 1101434 1105280 1106896 1108236
49662 1108236 1112254 1119945 1129719 1139546 1149316 1160898 1175863 1193320 1210583 1225985 1240213 1254420
49650 1254420 1268021 1279260 1287119 1291429 1291803 1288178 1282337 1277135 1273641 1270290 1265413 1259377 1253618 1248706
49636 1248706 1244336 1240298 1236228 1230877 1222918 1212503 1201239 1190550 1180774 1171973 1164913 1160746 1159995
49623 1159995 1162207 1166537 1172374 1179399 1187405 1196404 1206736 1218690 1232111 1246941 1264220 1285616
49611 1285616 1311255 1338420 1362994 1381965 1394196 1399807 1400167 1398266 1397472 1399258 1402741 1406619 1410778
49598 1410778 1415828 1422138 1429797 1438404 1445891 1448232 1441680 1425683 1403208 1378206 1353009 1328020 1303198
49585 1303198 1279258 1257328 1237776 1219945 1203243 1188095 1175420 1165601 1158501 1154065 1151987 1150915
49573 1150915 1149073 1145970 1142611 1139694 1136399 1131488 1124888 1117490 1109786 1101442 1092149 1082369 1073067 1064772
49559 1064772 1057015 1048875 1040270 1032325 1026081 1021237 1016885 1013095 1010709 1009674 1008804 1007510 1006659 1007265 1009303
49544 1009303 1012270 1015927 1019776 1022702 1024009 1024254 1024417 1024838 1025446 1026326 1027395 1028222 1028840 1030041 1032167 1034356
49528 1034356 1035760 1036777 1038210 1039986 1041728 1043855 1046949 1050609 1054197 1058215 1063587 1069938 1075973 1081342
49514 1081342 1086669 1091836 1095881 1098893 1102484 1107771 1114161 1120788 1128025 1136710 1146693 1157057 1167381
49501 1167381 1178119 1189916 1202835 1215826 1226839 1234145 1237929 1239996 1241512 1241688 1239212 1234352 1228852
49488 1228852 1224004 1219639 1215205 1211293 1209592 1211076 1214485 1217258 1218426 1220002 1224755 1232890 1241835 1249080
49474 1249080 1254103 1257670 1260847 1265285 1272942 1284154 1296806 1308658 1320124 1333633 1350631 1370344
49462 1370344 1391348 1412994 1434879 1455900 1474650 1490455 1503562 1514526 1523777 1531719 1538849 1545677
49450 1545677 1552653 1560436 1570188 1583197 1599787 1618778 1638354 1657210 1674158 1686809 1691924 1687766
49438 1687766 1675375 1656881 1633367 1605426 1575243 1546418 1521117 1498277 1475281 1451043 1427022
49427 1427022 1405571 1387920 1373803 1362517 1353785 1347385 1342331 1337242 1331888 1327893 1327189 1329798 1333588
49414 1333588 1336273 1337300 1337822 1339317 1342379 1346412 1350105 1352300 1352781 1352505 1353169 1356238 1361896 1368748 1374959
49399 1374959 1379935 1384546 1389568 1394587 1398890 1402660 1406239 1408620 1407925 1403606 1397146 1390356 1383846 1377419
49385 1377419 1370994 1364549 1358001 1351826 1347134 1344391 1342583 1340475 1338358 1337805 1339917 1344451 1350480 1357451
49371 1357451 1365852 1377251 1393155 1413266 1435559 1458922 1484991 1516271 1553263 1595023 1641894
49360 1641894 1695446 1755942 1822668 1897184 1982088 2072982 2153533 2203309 2212331 2187047 2142682
49349 2142682 2092259 2042821 1997831 1959294 1927877 1903396 1885833 1875121 1870151 1868930 1869611 1870796
49337 1870796 1871416 1871428 1872299 1875563 1880813 1886196 1890949 1896176 1902643 1909001 1913116 1914439 1913961 1912018 1907220
49322 1907220 1897865 1883991 1867619 1851059 1835124 1819035 1802062 1784958 1769549 1757046 1747292 1739700
49310 1739700 1734312 1731602 1731710 1734357 1739097 1745116 1751090 1755943 1759676 1762696 1764376 1763174 1758638 1752471
49296 1752471 1746740 1741412 1734688 1725769 1716212 1707924 1700659 1692552 1682834 1672847 1664210 1657189 1651568 1648077
49282 1648077 1647573 1649144 1650472 1650409 1650112 1651067 1652868 1653714 1652503 1649592 1645824 1641750 1637833 1634648 1632528
49267 1632528 1631275 1630372 1629377 1628202 1627180 1626750 1626988 1627696 1629082 1631864 1636300 1641596 1646860 1652253 1658563
49252 1658563 1666022 1674367 1683737 1694474 1706138 1717806 1729510 1742247 1756275 1770592 1784606 1799111
49240 1799111 1814720 1830462 1845205 1859796 1876404 1895950 1917331 1938864 1959081 1976087 1987654
49229 1987654 1992720 1992048 1987001 1978475 1967347 1954859 1941717 1927577 1912300 1897025 1882936 1869416
49217 1869416 1854728 1838527 1822501 1808329 1796238 1786121 1778843 1775210 1774271 1774027 1773827 1774957 1778762
49204 1778762 1785196 1793549 1803354 1813762 1822943 1829302 1833089 1835989 1839544 1844838 1853203 1865884 1883045
49191 1883045 1904338 1930397 1962217 1998742 2036784 2074048 2110342 2144341 2170984 2184717 2184951 2176010
49179 2176010 2161551 2141186 2113243 2078901 2042180 2006899 1974938 1946791 1922588 1902594 1887351
49168 1887351 1877149 1870974 1866496 1861844 1857236 1854390 1854600 1857788 1863143 1870008 1878138 1887442 1897611 1907982
49154 1907982 1918050 1928229 1939673 1953056 1967830 1982953 1997974 2013073 2028516 2044567 2061648
49143 2061648 2080028 2099500 2119777 2141040 2163633 2187240 2210887 2233852 2256244 2278460 2300169
49132 2300169 2320164 2337583 2353317 2369616 2387776 2406713 2424658 2441877 2460305 2480395 2500051
49121 2500051 2517607 2534526 2553787 2576512 2601794 2629281 2660154 2695433 2734923 2778289 2826003
49110 2826003 2878672 2936482 2999946 3070201 3147224 3227532 3303946 3367720 3411505 3431920 3431010 3415575
49098 3415575 3394207 3373604 3356578 3342833 3331462 3322972 3319189 3321423 3328991 3339703 3351540 3363612
49086 3363612 3375731 3387669 3398984 3409373 3419047 3428797 3439592 3452111 3466839 3484508 3505742 3530013
49074 3530013 3555642 3581452 3607890 3635830 3664870 3693913 3723113 3753942 3787100 3821472 3855678
49063 3855678 3889809 3924881 3961081 3997362 4032837 4068099 4104909 4144618 4187026 4231079 4276725
$$ [...]
##END NTUPLES=NMR SPECTRUM
##END=
