##TITLE=coffee_type CCIN01-ROVE100_50-50%
COFFEE_meoh_noesyp64 COFFEE_meoh {C:\Bruker\TOPSPIN} Administrator 7
##JCAMPDX= 6.0         $$ Bruker NMR JCAMP-DX V2.0
##DATA TYPE= NMR SPECTRUM
##DATA CLASS= NTUPLES
##ORIGIN= Bruker BioSpin GmbH
##OWNER= Administrator
$$ 1.72 TOPSPIN		Version 2.1
$$ 2012-05-18 15:51:28.745 -0700  Administrator@X
$$ Compression mode = diff/dup
##.OBSERVE FREQUENCY= 400.13188235
##.OBSERVE NUCLEUS= ^1H
##.ACQUISITION MODE= SIMULTANEOUS (DQD)
##.ACQUISITION SCHEME= undefined
##.AVERAGES= 64
##.DIGITISER RES= 22
##SPECTROMETER/DATA SYSTEM= spect
##.PULSE SEQUENCE= noesygpps1d.comp
##.SOLVENT NAME= COFFEE_meoh
##.SHIFT REFERENCE= INTERNAL, COFFEE_meoh, 1, 14.98061
##AUDIT TRAIL= $$ (NUMBER, WHEN, WHO, WHERE, PROCESS, VERSION, WHAT)
$$ ##TITLE= Audit trail, TOPSPIN		Version 2.1
$$ ##JCAMPDX= 5.01
$$ ##ORIGIN= Bruker BioSpin GmbH
$$ ##OWNER= Administrator
$$ $$ C:\Bruker\TOPSPIN/data/Administrator/nmr/12-COFFEE-2502/172/pdata/1/auditp.txt
$$ ##AUDIT TRAIL=  $$ (NUMBER, WHEN, WHO, WHERE, PROCESS, VERSION, WHAT)
(   1,<2012-02-25 19:46:15.516 -0500>,<Administrator>,<TOPSPIN>,<go>,<TOPSPIN 2.1>,
      <created by zg
	started at 2012-02-25 19:34:45.281 -0500,
	POWCHK enabled, PULCHK disabled,
       configuration hash MD5:
       B0 76 FB 9C 50 81 44 7D 18 B3 26 32 4E 60 AD 96
       data hash MD5: 64K
       72 5E 5F B9 E2 C3 DA C2 93 BF 06 D6 54 A6 16 84>)
(   2,<2012-02-25 19:46:18.234 -0500>,<Administrator>,<TOPSPIN>,<proc1d>,<TOPSPIN 2.1>,
      <Start of raw data processing
       efp LB = 0.3 FT_mod = 6 PKNL = 1 PHC0 = 0 PHC1 = 0 SI = 128K 
       data hash MD5: 128K
       12 D9 83 99 83 17 03 0E A7 61 79 67 1B 56 74 6C>)
(   3,<2012-02-25 19:46:19.531 -0500>,<Administrator>,<TOPSPIN>,<proc1d>,<TOPSPIN 2.1>,
      <pk PHC0 = 19.07776 PHC1 = 0 
       data hash MD5: 128K
       03 0E E8 7A 53 34 2A 8C 25 84 E5 66 56 EB 42 EC>)
(   4,<2012-02-25 19:46:19.766 -0500>,<Administrator>,<TOPSPIN>,<proc1d>,<TOPSPIN 2.1>,
      <abs ABSG = 1 
       data hash MD5: 128K
       EA 97 4E 7C D5 C9 2B 11 FF 38 6B 24 33 7B 1C B4>)
(   5,<2012-02-25 19:46:19.844 -0500>,<Administrator>,<TOPSPIN>,<proc1d>,<TOPSPIN 2.1>,
      <abs ABSG = 2 
       data hash MD5: 128K
       99 72 59 0E 34 8B 5A 51 80 F2 83 14 DE D6 BC 4B>)
(   6,<2012-02-25 19:46:19.891 -0500>,<Administrator>,<TOPSPIN>,<proc1d>,<TOPSPIN 2.1>,
      <abs ABSG = 3 
       data hash MD5: 128K
       14 7E 7B 35 8C 33 EC E8 4F B6 AA 6D 97 B0 F8 FA>)
(   7,<2012-02-25 19:46:19.969 -0500>,<Administrator>,<TOPSPIN>,<proc1d>,<TOPSPIN 2.1>,
      <abs ABSG = 4 
       data hash MD5: 128K
       BC BF 57 04 6B E2 23 00 92 15 1D 0E 20 0A 8D 44>)
(   8,<2012-02-25 19:46:20.203 -0500>,<Administrator>,<TOPSPIN>,<proc1d>,<TOPSPIN 2.1>,
      <abs ABSG = 5 
       data hash MD5: 128K
       BB E1 B8 0F 99 6A DE A3 E4 CF 35 D2 5C DE 47 D1>)
(   9,<2012-02-25 19:46:20.328 -0500>,<Administrator>,<TOPSPIN>,<audit>,<TOPSPIN 2.1>,
      <user comment:
       ICON-NMR User ID: Administrator
$$ [...]
150 150 150 150 150 150 150 150
##$TP07= 0
##$TPNAME0= <>
##$TPNAME1= <>
##$TPNAME2= <>
##$TPNAME3= <>
##$TPNAME4= <>
##$TPNAME5= <>
##$TPNAME6= <>
##$TPNAME7= <>
##$TPOAL= (0..7)
0.5 0.5 0.5 0.5 0.5 0.5 0.5 0.5
##$TPOFFS= (0..7)
0 0 0 0 0 0 0 0
##$TUNHIN= 0
##$TUNHOUT= 0
##$TUNXOUT= 0
##$USERA1= <user>
##$USERA2= <user>
##$USERA3= <user>
##$USERA4= <user>
##$USERA5= <user>
##$V9= 5
##$VALIST= <valist>
##$VCLIST= <CCCCCCCCCCCCCCC>
##$VD= 0
##$VDLIST= <DDDDDDDDDDDDDDD>
##$VPLIST= <PPPPPPPPPPPPPPP>
##$VTLIST= <TTTTTTTTTTTTTTT>
##$WBST= 1024
##$WBSW= 4
##$XGAIN= (0..3)
0 0 0 0
##$XL= 0
##$YL= 0
##$YMAX_a= 13856511
##$YMIN_a= -7055503
##$ZGOPTNS= <>
##$ZL1= 120
##$ZL2= 120
##$ZL3= 120
##$ZL4= 120
##$ABSF1= 14.98061
##$ABSF2= -5.57192
##$ABSG= 5
##$ABSL= 3
##$ALPHA= 0
##$AQORDER= 0
##$ASSFAC= 0
##$ASSFACI= 0
##$ASSFACX= 0
##$ASSWID= 0
##$AUNMP= <proc_prof1d_extract>
##$AXLEFT= 0
##$AXNAME= <>
##$AXNUC= <1H>
##$AXRIGHT= 0
##$AXTYPE= 0
##$AXUNIT= <>
##$AZFE= 0.1
##$AZFW= 0.1
##$BCFW= 0
##$BC_mod= 0
##$BYTORDP= 0
##$COROFFS= 0
##$CY= 15
##$DATMOD= 1
##$DC= 0
##$DFILT= <>
##$DTYPP= 0
##$F1P= 0
##$F2P= 0
##$FCOR= 0.5
##$FTSIZE= 131072
##$FT_mod= 6
##$GAMMA= 0
##$GB= 0
##$INTBC= 1
##$INTSCL= 1
##$ISEN= 128
##$LB= 0.3
##$LEV0= 0
##$LPBIN= 0
##$MAXI= 10000
##$MC2= 0
##$MEAN= 0
##$ME_mod= 0
##$MI= 0
##$NCOEF= 0
##$NC_proc= -3
##$NLEV= 6
##$NOISF1= 0
##$NOISF2= 0
##$NSP= 0
##$NTH_PI= 0
##$NZP= 0
##$OFFSET= 14.98061
##$PC= 1
##$PHC0= 19.07776
##$PHC1= 0
##$PH_mod= 1
##$PKNL= yes
##$PPARMOD= 0
##$PPDIAG= 0
##$PPIPTYP= 0
##$PPMPNUM= 2147483647
##$PPRESOL= 1
##$PSCAL= 4
##$PSIGN= 0
##$PYNMP= <proc.py>
##$REVERSE= no
##$SF= 400.13
##$SI= 131072
##$SIGF1= 0
##$SIGF2= 0
##$SINO= 400
##$SIOLD= 131072
##$SPECTYP= <>
##$SREGLST= <1H.CDCl3>
##$SSB= 0
##$STSI= 131072
##$STSR= 0
##$SW_p= 8223.68421052632
##$SYMM= 0
##$S_DEV= 0
##$TDeff= 65536
##$TDoff= 0
##$TI= <>
##$TILT= no
##$TM1= 0
##$TM2= 0
##$TOPLEV= 0
##$USERP1= <user>
##$USERP2= <user>
##$USERP3= <user>
##$USERP4= <user>
##$USERP5= <user>
##$WDW= 1
##$XDIM= 131072
##$YMAX_p= 481439838
##$YMIN_p= -280584475
##$CURPLOT= <Network HP LaserJet P1505>
##$CURPRIN= <$Network HP LaserJet P1505>
##$DFORMAT= <normdp>
##$LAYOUT= <+/1D_H.xwp>
##$LFORMAT= <normlp>
##$PFORMAT= <normpl>
##$SURQMSG= 1
$$ End of Bruker specific parameters
$$ ---------------------------------
##NTUPLES= NMR SPECTRUM
##VAR_NAME=  FREQUENCY,     SPECTRUM/REAL,   SPECTRUM/IMAG
##SYMBOL=    X,             R,               I
##VAR_TYPE=  INDEPENDENT,   DEPENDENT,       DEPENDENT
##VAR_FORM=  AFFN,          ASDF,            ASDF
##VAR_DIM=   131072,        131072,          131072
##UNITS=     HZ,            ARBITRARY UNITS, ARBITRARY UNITS
##FACTOR=    0.0627417313425165, 1,          1
##FIRST=     8223.62146879498, -1889,        -100952
##LAST=      0,             2174,            -101799
##MIN=       0,             -280584475,      0
##MAX=       8223.62146879498, 481439838,    0
$$ Real data points
##PAGE= N=1
##DATA TABLE= (X++(R..R)), XYDATA
$$ [...]
60778A091900R029R210R820Q983N736J331k200l986m637n170n970o680o966p178
60764A093222p883q944r651r783r907j0444j1060j1133j0391q983p367o108n241
60751I76327m075k255p88r06k126k646j811q01n29k01J218L182M258M052L628
60736I76527M247O199Q644J0365J0909J1016J1542J2243J2305J1699J1043J0344
60724A097083R325Q749R728J1479J1619R361O680N419M922L732J981N38q53k787
60710A176976m468m572l341k189j648j216q02p84p94j4J252J658O67q39j901k446
60694A155539k739k862k958l223l468l322k843k285j447OJ674K688K742K143J055
60679A140700n20k192l473m350m819m244k373o08p73k605l895l432k369k258l097
$$ plain form
60778 1091900 1100929 1110139 1119959 1128942 1134678 1136009 1133809 1129823 1125186 1120016 1114046 1107366 1100400 1093222
60764 1093222 1085339 1076395 1066744 1056961 1047054 1036610 1025550 1014417 1004026 995043 987676 981568 976327
60751 976327 972252 969997 969209 968303 966177 963531 961720 960919 960390 960189 961407 964589 968847 972899 976527
60736 976527 980774 986973 995617 1005982 1016891 1027907 1039449 1051692 1063997 1075696 1086739 1097083
60724 1097083 1106408 1115157 1124885 1136364 1147983 1157344 1164024 1169443 1174365 1178097 1180078 1180616 1179763 1176976
60710 1176976 1172508 1167936 1164595 1162406 1160758 1159542 1158740 1157956 1157162 1157148 1158400 1160058 1160725 1159886 1157985 1155539
60694 1155539 1152800 1149938 1146980 1143757 1140289 1136967 1134124 1131839 1130392 1130398 1132072 1134760 1137502 1139645 1140700
60679 1140700 1140180 1137988 1134515 1130165 1125346 1121102 1118729 1118121 1117348 1114743 1110848 1107416 1105047 1102789 1099692
60664A099692m061m906n654n855n207m392m381n210o153o705o751o121m748l177
60650A026371k310k582l753n350o960q267r127r620r842r786r593r728j0581j1966
60636I16906j3192j3600j2960j1474r552p574n896m962n127o145p109p271o765
60623H05279o230n860n324m462l605l128l005k778j777L57K960M541M307L293
60609G84568L259M567N950O287N774N231N094N386N985O611P124P941R521J1399
60595H74697J2595J3076J3768J4851J5316J4839J4774J6234J8146J8699J7990
60584A044985J7522J7399J5990J2889J0325J0335J1744J1580R139O857O938Q523
60572A184226R141P907O131N135M780M256L195J524r35l999o762q378q938r124
$$ plain form
60664 1099692 1095631 1090725 1085071 1079216 1074009 1069617 1065236 1060026 1053873 1047168 1040417 1034296 1029548 1026371
60650 1026371 1024061 1021479 1017726 1012376 1005416 997149 988022 978402 968560 958774 949181 939453 928872 916906
60636 916906 903714 890114 877154 865680 856128 848554 842658 837696 832569 826424 819315 812044 805279
60623 805279 799049 793189 787865 783403 779798 776670 773665 770887 769110 769467 772427 776968 781275 784568
60609 784568 787827 792394 798344 804631 810405 815636 820730 826116 832101 838712 845836 853777 863298 874697
60595 874697 887292 900368 914136 928987 944303 959142 973916 990150 1008296 1026995 1044985
60584 1044985 1062507 1079906 1095896 1108785 1119110 1129445 1141189 1152769 1161908 1168765 1175703 1184226
60572 1184226 1193367 1201274 1207405 1212540 1217320 1221576 1224771 1226295 1225360 1221361 1214599 1206221 1197283 1188159
60558A188159r396r889j0681j1487j1543j0474q962p900p233o356n275m311k968
60545A081684k98L435O661Q409R339J0349J1099J0716R334Q058P478P040N965
60532A179269M336K851J743M32j361k580j828O70L102M411N412O858P786P145
60518A218246N964O030P040P080N679M239L339J850p24l100m314n122o187o656
60504A233364n817m752m844n798o512o830p017o481m589k109l38O42J616K668
60490A183203L307L645M210M988N800O998Q679R997J0684J2379J6586K1908K5444
60477A317828K6792K8505L2354L7389M2272M7441N3754O0615O6870P2560P8359
60466A864739Q3834Q7362Q7445Q3377P5084O3047M8349L2374J6694L228o314j1652
$$ plain form
60558 1188159 1178763 1168874 1158193 1146706 1135163 1124689 1115727 1107827 1100594 1094238 1088963 1084652 1081684
60545 1081684 1081386 1084821 1091482 1099891 1109230 1119579 1130678 1141394 1150728 1158786 1166264 1173304 1179269
60532 1179269 1183605 1186456 1188199 1188631 1187270 1184690 1182862 1183532 1186634 1191045 1196457 1203315 1211101 1218246
60518 1218246 1224210 1230240 1237280 1244360 1250039 1254278 1257617 1259467 1258743 1255643 1251329 1246207 1240020 1233364
60504 1233364 1227547 1222795 1217951 1212153 1205641 1198811 1191794 1185313 1180724 1178615 1178277 1178919 1180535 1183203
60490 1183203 1186510 1190155 1194365 1199353 1205153 1212151 1220830 1230827 1241511 1253890 1270476 1292384 1317828
60477 1317828 1344620 1373125 1405479 1442868 1485140 1532581 1586335 1646950 1713820 1786380 1864739
60466 1864739 1948573 2035935 2123380 2206757 2281841 2344888 2393237 2425611 2442305 2445533 2439219 2427567
60454B427567j4004j4587j3637j1341q780p147o541o410o772p974r537j0228r431
60441B301178p665n471k422K421R442J8137K7496L6525M4765N2689O1350P1214
60429B609659Q1402R0437R7553J02758J05685J05379J01795R6767R2709R0690
60419C574834R0786R3973J02324J16976J37054J61168J88972K20463K54799K91000
60409E232349L29152L69375M09402M44126M67572M74371M59423M17858L47077
60400H950705K49234J31504L866j23479k41266l41201m16535m63979m85436m87008
60390F776405m75483m55457m29477l99716l68497l37484l07353k78395k50982
60381C473561k25455k02037j80862j61868j44774j29442j16046j04515r4244q4727
$$ plain form
60454 2427567 2413563 2398976 2385339 2373998 2365218 2358071 2351530 2345120 2338348 2330374 2320837 2310609 2301178
60441 2301178 2293513 2288042 2285620 2288041 2297483 2315620 2343116 2379641 2424406 2477095 2538445 2609659
60429 2609659 2691061 2781498 2879051 2981809 3087494 3192873 3294668 3391435 3484144 3574834
60419 3574834 3665620 3759593 3861917 3978893 4115947 4277115 4466087 4686550 4941349 5232349
60409 5232349 5561501 5930876 6340278 6784404 7251976 7726347 8185770 8603628 8950705
60400 8950705 9199939 9331443 9335309 9211830 8970564 8629363 8212828 7748849 7263413 6776405
60390 6776405 6300922 5845465 5415988 5016272 4647775 4310291 4002938 3724543 3473561
60381 3473561 3248106 3046069 2865207 2703339 2558565 2429123 2313077 2208562 2114318 2029591
60371B029591p6135o8779o2444n6816n2094m8483m5491m2521l9807l7988l6876
60360A462157l5556l3479l0808k7951k5516k4379k4714k5170k4099k1512j8887
60349A170086j7137j5870j4639j3570j2486j0651q030n828n100n473n744n237
60337A050321m181l194k699k496j892o18O00R58P85R61J515J819J921K324K607
60322A048731J817L20m32l27q71k349k727o97J977K783J901J243J114M5k258l936
60306A046334l474j680m97p51j666k072j571p20l13n26r03j134j235r37K51J899
60290A031005K618J928J119J289J586Q94L20J935N246P160O051M020M044O229
60276A075444Q124P974O357M947M646N100N495N594N961P074Q481R376R792J0408
$$ plain form
60371 2029591 1953456 1884677 1822233 1765417 1713323 1664840 1619349 1576828 1537021 1499033 1462157
60360 1462157 1426601 1393122 1362314 1334363 1308847 1284468 1259754 1234584 1210485 1188973 1170086
60349 1170086 1152949 1137079 1122440 1108870 1096384 1085733 1077703 1071875 1066775 1061302 1055558 1050321
60337 1050321 1046140 1042946 1040247 1037751 1035859 1035241 1035841 1036799 1037584 1038545 1040060 1041879 1043800 1046124 1048731
60322 1048731 1050548 1050868 1050436 1050109 1049238 1046889 1044162 1043465 1045442 1048225 1050126 1051369 1052483 1052528 1050270 1046334
60306 1046334 1042860 1041180 1040683 1039932 1038266 1036194 1034623 1033903 1033590 1033064 1032161 1031027 1029792 1028855 1029106 1031005
60290 1031005 1033623 1035551 1036670 1037959 1039545 1040439 1040759 1042694 1047940 1055100 1061151 1065171 1069215 1075444
60276 1075444 1083568 1091542 1097899 1102846 1107492 1112592 1118087 1123681 1129642 1136716 1145197 1154573 1164365 1174773
60262A174773J1090J0762R085P243O216N221K901n27l581n645p572r994j2167
60249A187805j2985j2377j1153r862q372o370m008k028j198j490k003k094k271
60236A111594l267m541m715l599k592k562k502j189P78J732J122k35j623k885
60222A085516l605l100j315J200M023O588P633O391M280L705N094O855Q440J1136
60208A142841J4947J7163J5846J2910J1703J2820J4484J5850J7396J8747J8730
60197A313437J7656J7174J7651J7839J7508J8225K0808K3923K6146K7794K9742
60186A547903L1974L4344L7476M1734M6326N0486N4536N8974O3411O7494P1931
60175B106589P7475Q3607Q9246R4231R9095J03744J07342J09189J09156J07603
$$ plain form
60262 1174773 1185863 1196625 1205710 1212953 1219169 1224390 1227291 1226764 1223183 1217538 1209966 1199972 1187805
60249 1187805 1174820 1162443 1151290 1141428 1133056 1126686 1122678 1120650 1119452 1117962 1115959 1113865 1111594
60236 1111594 1108327 1103786 1099071 1095472 1092880 1090318 1087816 1086627 1087405 1089137 1090259 1090024 1088401 1085516
60222 1085516 1081911 1078811 1077496 1078696 1082719 1089307 1096940 1103331 1107611 1111316 1116410 1123265 1131705 1142841
60208 1142841 1157788 1174951 1190797 1203707 1215410 1228230 1242714 1258564 1275960 1294707 1313437
60197 1313437 1331093 1348267 1365918 1383757 1401265 1419490 1440298 1464221 1490367 1518161 1547903
60186 1547903 1579877 1614221 1651697 1693431 1739757 1790243 1844779 1903753 1967164 2034658 2106589
60175 2106589 2184064 2267671 2356917 2451148 2550243 2653987 2761329 2870518 2979674 3087277
60165C087277J05255J02628R9130R3447Q5365P6276O7355N8127M7612L6029K4409
60154C882910J3409L493m540j0397j4982j9083k1877k1929j9215j4933r728l399
60142C759729M020J2163K1127L1116M1342N0614N8990O7571P6652Q5335R3120
60131D301779J00408J06955J11192J11891J09441J04679R7328Q6650P3127N8391
60121E261841M3693K9232J4998J409j1180k3037l4505m4974n2893n7050n7618
60110E069916n5636n1642m5331l6446k5458j3187l89J1982K2788L1569L9012M5961
60098D993139N2249N7009N9730O0480N9387N6490N1973M5982L8575L0328K2515
60087E527857J5944R946L456l184q466j1641j3188j3125j0124l103O963J7747
$$ plain form
60165 3087277 3192532 3295160 3394290 3487737 3573102 3649378 3716733 3774860 3822472 3858501 3882910
60154 3882910 3896319 3899812 3895272 3884875 3869893 3850810 3828933 3807004 3787789 3772856 3763128 3759729
60142 3759729 3763749 3775912 3797039 3828155 3869497 3920111 3979101 4046672 4123324 4208659 4301779
60131 4301779 4402187 4509142 4620334 4732225 4841666 4946345 5043673 5130323 5203450 5261841
60121 5261841 5305534 5334766 5349764 5351173 5339993 5316956 5282451 5237477 5184584 5127534 5069916
60110 5069916 5014280 4962638 4917307 4880861 4855403 4842216 4841827 4853809 4876597 4908166 4947178 4993139
60098 4993139 5045388 5102397 5162127 5222607 5281994 5338484 5390457 5436439 5475014 5505342 5527857
60087 5527857 5543801 5553747 5557203 5554019 5545553 5533912 5520724 5507599 5497475 5494372 5501335 5519082
60075E519082K8024L8903N2542O9827Q9383J08845J27061J44903J63860J84410
60065F526840K06061K28422K51221K73422K93364L10166L24263L36052L44513
60056I094324L47724L44439L34646L18853K97471K70944K39903K04878J66044
60047A1619226J23459P7317K7811k4782p9229j32575j81000k21891k54693k79518
60037A0674125k95747l02861l01955k95158k83433k66194k43428k17024j89259
60028H279066j60797j31133j00617p1050m4064j9577L771K6548M7096O2529P1330
60017G963102P4581P4191P0534O2657N0288L4425J6157l662k3585m1974n8588
60006H218126p4370q9314j02110j12390j21460j29945j36547j40404j42884j45406
$$ plain form
60075 5519082 5547106 5586009 5638551 5708378 5797761 5906606 6033667 6178570 6342430 6526840
60065 6526840 6732901 6961323 7212544 7485966 7779330 8089496 8413759 8749811 9094324
60056 9094324 9442048 9786487 10121133 10439986 10737457 11008401 11248304 11453182 11619226
60047 11619226 11742685 11820002 11847813 11823031 11743802 11611227 11430227 11208336 10953643 10674125
60037 10674125 10378378 10075517 9773562 9478404 9194971 8928777 8685349 8468325 8279066
60028 8279066 8118269 7987136 7886519 7815469 7771405 7751828 7755599 7782147 7829243 7891772 7963102
60017 7963102 8037683 8111874 8182408 8245065 8295353 8329778 8345935 8342273 8318688 8276714 8218126
60006 8218126 8143756 8054442 7952332 7839942 7718482 7588537 7451990 7311586 7168702 7023296
59996G023296j47040j46152j43076j38910j32817j23092j10442r7668q5998p4048
59986E824053o0640m6622l3247k0450p461O219K0818L6071N0558O2612P2189Q0660
59974E984760Q8372R3744R5253R3061Q7996Q0028O8567N3601L6003J7049k146
59963F696288k1275m0750o0387p8524r3409j05038j14346j20960j23397j21428
59953E816774j16541j09796j00967r0131p8356o6158n2956l8802k4934j1717K362
59942E128778J8383L5106N0636O4777P8425R1801J04745J17713J30842J42564
59932E963770J50663J54329J53906J49156J39311J24746J07298Q8723O9668N0062
59922G151632K9568P722j5385l8441n9611p8004r3830j07163j17094j22257j21780
$$ plain form
59996 7023296 6876256 6730104 6587028 6448118 6315301 6192209 6081767 5984099 5898101 5824053
59986 5824053 5763413 5716791 5683544 5663094 5655633 5661852 5682670 5718741 5769299 5831911 5904100 5984760
59974 5984760 6073132 6166876 6262129 6355190 6443186 6523214 6591781 6645382 6681385 6698434 6696288
59963 6696288 6675013 6634263 6573876 6495352 6401943 6296905 6182559 6061599 5938202 5816774
59953 5816774 5700233 5590437 5489470 5399339 5320983 5254825 5201869 5163067 5138133 5126416 5128778
59942 5128778 5147161 5182267 5232903 5297680 5376105 5467906 5572651 5690364 5821206 5963770
59932 5963770 6114433 6268762 6422668 6571824 6711135 6835881 6943179 7031902 7101570 7151632
59922 7151632 7181200 7188922 7173537 7135096 7075485 6997481 6903651 6796488 6679394 6557137 6435357
59911F435357j15902j06085r4275q1578o7689n1994l4835j7223K11J7196L3102
59900E916285M7237N9960P2568Q5636R8043J08077J15029J19184J20647J19012
59890F861678J14490J08537J02653R6723Q9532Q1036P3093O7356O3375N9857N7089
59879G775419N6745N9576O4878P2386Q3175R8088J16554J37655J61356J87718
59869H813550K15629K43254K69119K92082L10742L23646L29750L27891L16155
59860A1441818K92476K55927K07189J48215Q1876J1611n9001j26341j86610k36494
59850A1830666k74496l01258l18221l26498l27102l21342l10208k93913k72663
59841I084965k47626k20598j93056j65812j39061j12331q4903n6824k9197l152
$$ plain form
59911 6435357 6319455 6213370 6119095 6037517 5969828 5917834 5882999 5865776 5865987 5883183 5916285
59900 5916285 5963522 6023482 6096050 6181686 6279729 6387806 6502835 6622019 6742666 6861678
59890 6861678 6976168 7084705 7187358 7284081 7373613 7454649 7527742 7595098 7658473 7718330 7775419
59879 7775419 7832164 7891740 7956618 8029004 8112179 8210267 8326821 8464476 8625832 8813550
59869 8813550 9029179 9272433 9541552 9833634 10144376 10468022 10797772 11125663 11441818
59860 11441818 11734294 11990221 12197410 12345625 12427501 12439112 12380111 12253770 12067160 11830666
59850 11830666 11556170 11254912 10936691 10610193 10283091 9961749 9651541 9357628 9084965
59841 9084965 8837339 8616741 8423685 8257873 8118812 8006481 7921578 7864754 7835557 7832405
59831G832405K1031M3575O4467Q3325R9349J11168J17402J17591J11929R9852
59821H702094Q0030N2212J8104k0061o0765j02237j41481j75566k03388k25308
59811G923634k41607k52214k57313k57446k53455k46916k39605k31785k21947
59802E721346k09295j95426j82236j69242j54745j38883j23505j09266r4987q0198
59792D263563o6467n5496m7146m0003l2921k5571j8496j3128j0863j1364j2448
59781C929660j2177j0621r218q875r165r176q773q975j0932j4426j7817j9911
59769C789594k1327k3406k6323k9162l1340l2708l2597l0136k5706k0801j6268
59758C499820j1836p680n013m500n237n960o288n915l594J797R663J8018K5099
$$ plain form
59831 7832405 7853436 7897011 7961478 8044803 8144152 8255320 8372722 8490313 8602242 8702094
59821 8702094 8782124 8834336 8852440 8832379 8771614 8669377 8527896 8352330 8148942 7923634
59811 7923634 7682027 7429813 7172500 6915054 6661599 6414683 6175078 5943293 5721346
59802 5721346 5512051 5316625 5134389 4965147 4810402 4671519 4548014 4438748 4343761 4263563
59792 4263563 4197096 4141600 4094454 4054451 4021530 3995959 3977463 3964335 3953472 3942108 3929660
59781 3929660 3917483 3906862 3897644 3888769 3879604 3870428 3861655 3852680 3841748 3827322 3809505 3789594
59769 3789594 3768267 3744861 3718538 3689376 3658036 3625328 3592731 3562595 3536889 3516088 3499820
59758 3499820 3487984 3480304 3475291 3470791 3465554 3459594 3453306 3447391 3443797 3445594 3455257 3473275 3498374
59745C498374K9958L2119L1890L0892L1092L3091L6021L9129M2383M5204M5765
59734C895918M2736L7327L2436K9625K7749K5011K1573J9379J9796K2367K5940
59723D199857L0102L5147M1278M8518N7094O7321P9129R2029J05527J19425J33945
59712E009372J49779J67711J87851K09308K30869K51859K72078K91056L07436
59703G077319L18651L20718L08662K78120K27487J59302Q0199n03p3189j30609
59693H566157j69598j91169j99132j97967j90787j78667j61843j41334j18993
59684G016667r6373p4253n3155l3135j3116Q211L0241N0479O7600Q3368J00482
59673G087016J19409J38625J57231J75765J94819K14383K34691K56438K79997
$$ plain form
59745 3498374 3528332 3560451 3592341 3623233 3654325 3687416 3723437 3762566 3804949 3850153 3895918
59734 3895918 3938654 3975981 4008417 4038042 4065791 4090802 4112375 4131754 4151550 4173917 4199857
59723 4199857 4229959 4265106 4306384 4354902 4411996 4479317 4558446 4650475 4756002 4875427 5009372
59712 5009372 5159151 5326862 5514713 5724021 5954890 6206749 6478827 6769883 7077319
59703 7077319 7395970 7716688 8025350 8303470 8530957 8690259 8770458 8769955 8696766 8566157
59693 8566157 8396559 8205390 8006258 7808291 7617504 7438837 7276994 7135660 7016667
59684 7016667 6920294 6846041 6792886 6759751 6746635 6754846 6785087 6835566 6903166 6986534 7087016
59673 7087016 7206425 7345050 7502281 7678046 7872865 8087248 8321939 8578377 8858374
59664H858374L05231L32216L61250L92062M23851M56243M89423N23336N57451
59655A2699437N91316O24416O55363O82027P02678P16357P22203P19329P07736
59646A8820862O88712O64291O37112O10680N88426N71662N59038N48431N38673
59637B4227887N28985N17526N01414M77898M44956M01331L46973K83573K14163
59628B7944706J42080P0559L066n6797j06203j43793j69269j82590j83821j73662
59618B7144276j53405j23976q5364l7713J7108P5977J37044K01168K69947L42537
59608B7787599M15243M84209N47548O04194O51253O83313O94451O80296O37995
59599C3186101N65101M59941L23695J61656j7886k05570l91568n65568p17998
$$ plain form
59664 8858374 9163605 9495821 9857071 10249133 10672984 11129227 11618650 12141986 12699437
59655 12699437 13290753 13915169 14570532 15252559 15955237 16671594 17393797 18113126 18820862
59646 18820862 19509574 20173865 20810977 21421657 22010083 22581745 23140783 23689214 24227887
59637 24227887 24756872 25274398 25775812 26253710 26698666 27099997 27446970 27730543 27944706
59628 27944706 28086786 28157345 28160411 28103614 27997411 27853618 27684349 27501759 27317938 27144276
59618 27144276 26990871 26866895 26781531 26743818 26760926 26836903 26973947 27175115 27445062 27787599
59608 27787599 28202842 28687051 29234599 29838793 30490046 31173359 31867810 32548106 33186101
59599 33186101 33751202 34211143 34534838 34696494 34678608 34473038 34081470 33515902 32797904
59590C2797904q42002r34127r93876j023623j028371j013746r83526r40045q86981
59581B4151607q30146p74966p24700o81991o50944o36118o39790o60286o91693
59572A7860973p24613p49070p58929p53671p35758p07633o71900o32240n91734
59563A1535425n50982n09663m69103m31413l96802l63904l32448l03480k77136
59554G900494k52356k29080k08576j91042j74738j58297j42436j28715j17841
59545F297413j09785j04199j00143r6500r3486r2628r4657r8293j01592j03534
59535E302596j03903j02827j01042r9513r7951r4706q8849q1545p4586o8393o2356
59524D326925n6395n1043m6268m1084l4441k6152j7135r000k988J050M522Q768
$$ plain form
59590 32797904 31955902 31021775 30027899 29004276 27975905 26962159 25978633 25038588 24151607
59581 24151607 23321461 22546495 21821795 21139804 20488860 19852742 19212952 18552666 17860973
59572 17860973 17136360 16387290 15628361 14874690 14138932 13431299 12759399 12127159 11535425
59563 11535425 10984443 10474780 10005677 9574264 9177462 8813558 8481110 8177630 7900494
59554 7900494 7648138 7419058 7210482 7019440 6844702 6686405 6543969 6415254 6297413
59545 6297413 6187628 6083429 5983286 5886786 5793300 5700672 5606015 5507722 5406130 5302596
59535 5302596 5198693 5095866 4994824 4895311 4797360 4702654 4613805 4532260 4457674 4389281 4326925
59524 4326925 4270530 4219487 4173219 4132135 4097694 4071542 4054407 4045407 4042419 4043469 4047991 4056759
59512D056759J3976J9331K3906K7472L0811L5043M0198M4878M7855M9617N1481
59501D441327N3744N5973N8742O3400O9871P6291Q1494Q6649R3679J02998J13516
59490E297684J24168J34717J45646J57727J71181J85007J97738K09035K19683
59481F842586K29899K38721K45375K49948K52012K49875K42358K30674K17370
59472H998818K03623J88093J68241J42400J11408P8852M9204K4733M241j4822
59462I954791l3407n0259o3544p2319p6616p6873p3372o5975n4260l7939j6932
59451I333295Q744L8606P1058J03502J33426J59297J80344J95809K04358K03912
59441A0632351J92244J68150J32236Q6500L3543k3734q2355j39964j94809k44544
$$ plain form
59512 4056759 4070735 4090066 4113972 4141444 4172255 4207298 4247496 4292374 4340229 4389846 4441327
59501 4441327 4495071 4551044 4609786 4673186 4743057 4819348 4900842 4987491 5081170 5184168 5297684
59490 5297684 5421852 5556569 5702215 5859942 6031123 6216130 6413868 6622903 6842586
59481 6842586 7072485 7311206 7556581 7806529 8058541 8308416 8550774 8781448 8998818
59472 8998818 9202441 9390534 9558775 9701175 9812583 9891435 9940639 9965372 9969613 9954791
59462 9954791 9921384 9871125 9807581 9735262 9658646 9581773 9508401 9442426 9388166 9350227 9333295
59451 9333295 9342039 9380645 9451703 9555205 9688631 9847928 10028272 10224081 10428439 10632351
59441 10632351 10824595 10992745 11124981 11211481 11245024 11221290 11138935 10998971 10804162 10559618
59431A0559618k85733l15575l33711l41543l40462l31824l17837l00683k80881
59422G711369k57956k32705k07357j83432j60707j38325j15813r3091p0689m9699
59412F201595l0269j0685J0536L2235N2133P0227Q8302J06469J22944J37277J50797
59401F931561J63112J71278J73513J70976J64366J51688J31349J05001P5054M1442
59391H279340L351l7522p7942j16136j51485j82378k06854k24847k37685k45928
59381F801914k49480k49074k45687k39068k28781k16221k03665j91754j79689
59372D798495j67353j55416j43643j31223j18611j07228r7287q7713p8277o9985
59362C641759o3032n6065m8071l9695l2142k5844k0552j5763j0600m147L570J1520
$$ plain form
59431 10559618 10273885 9958310 9624599 9283056 8942594 8610770 8292933 7992250 7711369
59422 7711369 7453413 7220708 7013351 6829919 6669212 6530887 6415074 6321983 6251294 6201595
59412 6201595 6171326 6160641 6171177 6203412 6255545 6325772 6414074 6520543 6643487 6780764 6931561
59401 6931561 7094673 7265951 7439464 7610440 7774806 7926494 8057843 8162844 8237898 8279340
59391 8279340 8282691 8245169 8167227 8051091 7899606 7717228 7510374 7285527 7047842 6801914
59381 6801914 6552434 6303360 6057673 5818605 5589824 5373603 5169938 4978184 4798495
59372 4798495 4631142 4475726 4332083 4200860 4082249 3975021 3877734 3790021 3711744 3641759
59362 3641759 3578727 3522662 3474591 3434896 3402754 3376910 3356358 3340595 3329995 3325848 3329418 3340938
59350C340938J8787K5350L1499L6726L9306L7205L0136K0973J4192J2223J3954
59339C621289J7205K1546K7871L6458M6557N6866O5042O8063O5044N9257N5709
59328D140907N6881O2058O9853P9392Q9505R9089J08636J19648J32211J44803
59318E102983J56959J70418J86799K05312K23777K41221K58865K78958L02913
59309G128205L30171L58800L87610M17377M49340M82791N15085N43745N67443
59300A1180567N84853N93799N92211N79550N57217N28009M95097M60788M25994
59291A5998085L90998L56460L23347K92191K62536K32596J99233J59364J12093
59282A8326903N8650k56o5701j38028k14226k89236l58953m20592m71266n08556
$$ plain form
59350 3340938 3359725 3385075 3416574 3453300 3492606 3529811 3559947 3580920 3595112 3607335 3621289
59339 3621289 3638494 3660040 3687911 3724369 3770926 3827792 3892834 3960897 4025941 4085198 4140907
59328 4140907 4197788 4259846 4329699 4409091 4498596 4597685 4706321 4825969 4958180 5102983
59318 5102983 5259942 5430360 5617159 5822471 6046248 6287469 6546334 6825292 7128205
59309 7128205 7458376 7817176 8204786 8622163 9071503 9554294 10069379 10613124 11180567
59300 11180567 11765420 12359219 12951430 13530980 14088197 14616206 15111303 15572091 15998085
59291 15998085 16389083 16745543 17068890 17361081 17623617 17856213 18055446 18214810 18326903
59282 18326903 18385553 18385297 18319596 18181568 17967342 17678106 17319153 16898561 16427295 15918739
59272A5918739n32247n43874n44693n35628n18744m96847m71492m43095m12877
59263A1419242l82910l54135l26223k99800k76970k58824k43940k30253k17191
59254H828996k05212j94395j84586j76223j69988j65658j61898j57130j50595
59245G263311j42744j34581j26622j18760j11205j04492r8128r0403q0612p0447
59235F185317o1842n4356m6252l7308k8645k0402j1697k708N509J3315K2317L2542
59223E995790M2051N0144N8738O9395Q0803R0886R9907J09714J20624J30821J38698
59212F987571J44377J48775J52083J53629J52701J49102J42754J32854J17580
59203H281426R4805O3308K3810k0506o4649j04141j37279j64641j86451k01773
$$ plain form
59272 15918739 15386492 14842618 14297925 13762297 13243553 12746706 12275214 11832119 11419242
59263 11419242 11036332 10682197 10355974 10056174 9779204 9520380 9276440 9046187 8828996
59254 8828996 8623784 8429389 8244803 8068580 7898592 7732934 7571036 7413906 7263311
59245 7263311 7120567 6985986 6859364 6740604 6629399 6524907 6426779 6336376 6255764 6185317
59235 6185317 6123475 6069119 6022867 5985559 5956914 5936512 5924815 5922107 5927616 5940931 5963248 5995790
59223 5995790 6037841 6087985 6146723 6216118 6296921 6387807 6487714 6597428 6718052 6848873 6987571
59212 6987571 7131948 7280723 7432806 7586435 7739136 7888238 8030992 8163846 8281426
59203 8281426 8376231 8439539 8463349 8442843 8378194 8274053 8136774 7972133 7785682 7583909
59193G583909k10608k14959k16622k15280k10228k02559j94003j84838j74744
59184E760068j64525j54812j44200j31096j16765j03944r2975q1877o9934n8431
59174D641509m7835l7186k6624j7665j0239k047Q139J8790K8379L7677M8175N9995
59162D701068P2429Q5179R8235J11880J27232J45234J64949J84629K04522K26338
59152F121695K49945K73364K96344L20601L45233L65222L76391L78949L74011
59143I101755L59413L31882K91326K40194J80160J12373L9888l2909j02629j66579
59133A0354874k21236k63746k94461l15659l28006l30488l23561l10112k92984
59124G674621k73312k51645k29103k06865j85576j65549j46930j29542j13195
$$ plain form
59193 7583909 7373301 7158342 6941720 6726440 6516212 6313653 6119650 5934812 5760068
59184 5760068 5595543 5440731 5296531 5165435 5048670 4944726 4851751 4769874 4699940 4641509
59174 4641509 4593674 4556488 4529864 4512199 4501960 4499913 4508052 4526842 4555221 4592898 4641073 4701068
59162 4701068 4773497 4858676 4956911 5068791 5196023 5341257 5506206 5690835 5895357 6121695
59152 6121695 6371640 6645004 6941348 7261949 7607182 7972404 8348795 8727744 9101755
59143 9101755 9461168 9793050 10084376 10324570 10504730 10617103 10656991 10624082 10521453 10354874
59133 10354874 10133638 9869892 9575431 9259772 8931766 8601278 8277717 7967605 7674621
59124 7674621 7401309 7149664 6920561 6713696 6528120 6362571 6215641 6086099 5972904
59115E972904r7989q3899p0655n8534m8438m0489l3335k5745j8164j1911p760
59104E475985o100p209j0250j3299j5765j9637k6459l4161l9056m0552m1692m5027
59092E176778m9780n3552n5297n5944n6886n8180n8130n5000m9518m4541m1370
59081D598580l7644l0604k1301j3369q017k856M077J1481J7103K0904K4510K8639
59069D591503L2711L6466M0616M5737N1440N6934O1969O6961P2400P8390Q4680
59058E219807R0734R5672R8643R9752J00210J00845J00676R7929R2408Q5810P9500
59047F261986P3176O6208N8975N1992M4714L6386K7540J9708J4059J1017J0749
59036F676510J3187J7831K4083L1380L8567M3712M5147M2349L5292K3483O133
$$ plain form
59115 5972904 5874915 5791016 5720361 5661827 5613389 5572900 5539565 5513820 5495656 5483745 5475985
59104 5475985 5469885 5462676 5452426 5439127 5423362 5403725 5377266 5343105 5304049 5263497 5221805 5176778
59092 5176778 5126998 5073446 5018149 4962205 4905319 4847139 4789009 4734009 4684491 4639950 4598580
59081 4598580 4560936 4530332 4509031 4495662 4487645 4484789 4488866 4500347 4517450 4538354 4562864 4591503
59069 4591503 4624214 4660680 4701296 4747033 4798473 4855407 4917376 4984337 5056737 5135127 5219807
59058 5219807 5310541 5406213 5504856 5604608 5704818 5805663 5906339 6004268 6096676 6182486 6261986
59047 6261986 6335162 6401370 6460345 6512337 6557051 6593437 6620977 6640685 6654744 6665761 6676510
59036 6676510 6689697 6707528 6731611 6762991 6801558 6845270 6890417 6932766 6968058 6991541 6997674
59025F997674j6992m5160p6485j08061j37108j62379j83811k00941k12739k19147
59015E634851k21307k19938k14930k07102j98478j89926j80142j68328j56248
59006C878452j46086j37548j28774j19118j09408j00310r2055q5007p8914p2337
58996B808895o4430n6624n0908m7011m2980l8062l3211k9062k5228k1705j9317
58985B380357j8409j8280j8066j7357j5999j4093j1947r262n037P73O275R811
58973B268766J2437J6508K2131K6848K8959K9325K9230K7936K3476J5341N623
58962B506580k478p235r551j1495j3806j5570j6110j5905j5192j3290j0266p781
58950B367901o845o047l695n32J518K346L258M260M027K330K47k054n630j0551
$$ plain form
59025 6997674 6980682 6935522 6859037 6750976 6613868 6451489 6267678 6066737 5853998 5634851
59015 5634851 5413544 5193606 4978676 4771574 4573096 4383170 4203028 4034700 3878452
59006 3878452 3732366 3594818 3466044 3346926 3237518 3137208 3045153 2960146 2881232 2808895
58996 2808895 2744465 2687841 2636933 2589922 2546942 2508880 2475669 2446607 2421379 2399674 2380357
58985 2380357 2361948 2343668 2325602 2308245 2292246 2278153 2266206 2256944 2251907 2252680 2258955 2268766
58973 2268766 2281203 2297711 2319842 2346690 2375649 2404974 2434204 2462140 2485616 2500957 2506580
58962 2506580 2504102 2496867 2487316 2475821 2462015 2446445 2430335 2414430 2399238 2385948 2375682 2367901
58950 2367901 2361056 2355009 2351314 2350782 2352300 2354646 2357904 2362164 2366191 2368521 2368768 2366714 2361084 2350533
58936B350533j5224j8425k0546k2439k4305k5963k6942k6252k3407j9761j7309
58925B109960j6063j4122j0609o857m183k010Q76M360P135Q280Q201Q392J0291
58912B103651J3765J7019J8753K0081K3110K8028L2917L6280L8231L9226L9270
58901B410331L8698L8292L8100L7400L6055L4722L3415L1416K9015K7942K9438
58890B784824L3029L7655M2665M7179N0060N1540N3547N7173O0822O2147O1203
58879C341844O0372O1463O4018O6428O7894O9088P1404P5713Q1592Q7884R4027
58868D141727J00456J07568J14830J21516J28044J35767J45277J55479J64934
58859E315598J73805J83667J95280K07536K19436K32177K47811K66170K84977
$$ plain form
58936 2350533 2335309 2316884 2296338 2273899 2249594 2223631 2196689 2170437 2147030 2127269 2109960
58925 2109960 2093897 2079775 2069166 2062309 2058126 2056116 2056992 2061352 2068487 2076767 2084968 2093360 2103651
58912 2103651 2117416 2134435 2153188 2173269 2196379 2224407 2257324 2293604 2331835 2371061 2410331
58901 2410331 2449029 2487321 2525421 2562821 2598876 2633598 2667013 2698429 2727444 2755386 2784824
58890 2784824 2817853 2855508 2898173 2945352 2995412 3046952 3100499 3157672 3218494 3280641 3341844
58879 3341844 3402216 3463679 3527697 3594125 3662019 3731107 3802511 3878224 3959816 4047700 4141727
58868 4141727 4242183 4349751 4464581 4586097 4714141 4849908 4995185 5150664 5315598
58859 5315598 5489403 5673070 5868350 6075886 6295322 6527499 6775310 7041480 7326457
58850G326457L03376L23463L47294L73960M00988M27515M54409M81920N08819
58841A0948201N33726N56004N75181N90271N99495O00266N89801N66288N28848
58832A6088081M76452M08238L25684K32881J33583K9484p7163j80902k75294l56897
58822A6804147m25153m79453n18889n44432n58816n63883n60032n48408n31692
58813A2073389n12193m90674m67473m43383m19080l94839l71096l48406l26816
58804H299429l06084k86357k67777k49912k32600k16760k03257j91613j81015
58795F164054j71798j64476j58114j51173j43288j34672j24900j14023j03727
58786D897883r5204q6882p6748o5849n6584m8454l8902k8039j8843j2271n769
$$ plain form
58850 7326457 7629833 7953296 8300590 8674550 9075538 9503053 9957462 10439382 10948201
58841 10948201 11481927 12037931 12613112 13203383 13802878 14403144 14992945 15559233 16088081
58832 16088081 16564533 16972771 17298455 17531336 17664919 17694403 17617240 17436338 17161044 16804147
58822 16804147 16378994 15899541 15380652 14836220 14277404 13713521 13153489 12605081 12073389
58813 12073389 11561196 11070522 10603049 10159666 9740586 9345747 8974651 8626245 8299429
58804 8299429 7993345 7706988 7439211 7189299 6956699 6739939 6536682 6345069 6164054
58795 6164054 5992256 5827780 5669666 5518493 5375205 5240533 5115633 5001610 4897883
58786 4897883 4802679 4715797 4639049 4573200 4516616 4468162 4429260 4401221 4382378 4370107 4364338
58775D364338K439J0885J8011K4815L2629M0697M7830N4558O2065P0528P9768
58764D808563Q9905J00292J09442J17241J25644J36058J47571J58882J70325J82717
58754F146640J95763K09066K23460K39844K57589K75405K93284L12598L34599
58745H488248L59297L85367M11043M35808M61016M87747N14387N37648N55662
58736A2636223N68210N74173N70895N56268N29264M88219M31026L57895K71865
58727A6984038J76046P2617l4722j39889k37526l25178m01484m64422n12861n47917
58717A4568702n71126n82761n83367n75454n62090n44966n24977n03465m81594
58708I638902m59396m36545m13135l89181l64573l40099l17218k96271k76387
$$ plain form
58775 4364338 4366777 4377662 4395673 4420488 4453117 4493814 4541644 4596202 4658267 4728795 4808563
58764 4808563 4898468 4998760 5108202 5225443 5351087 5487145 5634716 5793598 5963923 6146640
58754 6146640 6342403 6551469 6774929 7014773 7272362 7547767 7841051 8153649 8488248
58745 8488248 8847545 9232912 9643955 10079763 10540779 11028526 11542913 12080561 12636223
58736 12636223 13204433 13778606 14349501 14905769 15435033 15923252 16354278 16712173 16984038
58727 16984038 17160084 17232701 17197979 17058090 16820564 16495386 16093902 15629480 15116619 14568702
58717 14568702 13997576 13414815 12831448 12255994 11693904 11148938 10623961 10120496 9638902
58708 9638902 9179506 8742961 8329826 7940645 7576072 7235973 6918755 6622484 6346097
58699F346097k57469k40538k25482k10547j94802j79319j65047j51490j38319
58690D583084j26293j15537j04801r3505q2568p2333o1737n0578m0295l1308k1966
58679C782163j1542j998M714Q776J0315P571n31j2114k4759l8213n2483o5175
58667C606724p3396p7051p8041p7405p5309p2624p0439o8841o7777o7854o8874
58656B809113o9192o8075o7105o7504o8082o7678o7455o8305o8069o4331n8555
58645B074762n4314n2460n0883m8205m4835m1016l6606l2500k9783k7746k4922
58634A631492k1648j9406j8195j6871j5612j5644j6678j6955j5932j4918j4889
58623A444744j5389j5618j5100j3434j0662p665n041k195J256M248N965P806J1770
$$ plain form
58699 6346097 6088628 5848090 5622608 5412061 5217259 5037940 4872893 4721403 4583084
58690 4583084 4456791 4341254 4236453 4142948 4060380 3988047 3926310 3875732 3835437 3804129 3782163
58679 3782163 3770621 3768623 3773337 3782113 3792428 3799999 3799468 3787354 3762595 3724382 3671899 3606724
58667 3606724 3533328 3456277 3378236 3300831 3225522 3152898 3082459 3013618 2945841 2877987 2809113
58656 2809113 2739921 2671846 2604741 2537237 2469155 2401477 2334022 2265717 2197648 2133317 2074762
58645 2074762 2020448 1967988 1917105 1868900 1824065 1783049 1746443 1713943 1684160 1656414 1631492
58634 1631492 1609844 1590438 1572243 1555372 1539760 1524116 1507438 1490483 1474551 1459633 1444744
58623 1444744 1429355 1413737 1398637 1385203 1374541 1366876 1361835 1359640 1360896 1365144 1371109 1378915 1390685
58610A390685J7657K3472K7822L0346L0917L0299L0414L1867L2310K9408K4298
58599A699495J9525J4773P795j013q399j2691j5485j8490k1456k3802k5806k7225
58587A587221k6909k4787k2478k1075j9852j7851j5279j2663r900o820l676n25
58575A405406K913O454R439J1777J4102J6773J9452K1778K3667K5060K6245K8272
58563A611338L2089L7213M1992M5280M7352M9394N2424N6509O0823O4927O9771
58552B169112P6325Q3421Q8779R2652R8281J07524J18087J26734J33520J40891
58542C235326J49821J58903J66409J71405J73436J72436J68306J59623J44031
58533D699696J20878R2195O0201K5898q841m0388o6776q9599j10238j26440j35562
$$ plain form
58610 1390685 1408342 1431814 1459636 1489982 1520899 1551198 1581612 1613479 1645789 1675197 1699495
58599 1699495 1719020 1733793 1741588 1740575 1732176 1719485 1704000 1685510 1664054 1640252 1614446 1587221
58587 1587221 1560312 1535525 1513047 1491972 1472120 1454269 1438990 1426327 1416427 1409607 1405931 1405406
58575 1405406 1408319 1414773 1424212 1435989 1450091 1466864 1486316 1508094 1531761 1556821 1583066 1611338
58563 1611338 1643427 1680640 1722632 1767912 1815264 1864658 1917082 1973591 2034414 2099341 2169112
58552 2169112 2245437 2328858 2417637 2510289 2608570 2716094 2834181 2960915 3094435 3235326
58542 3235326 3385147 3544050 3710459 3881864 4055300 4227736 4396042 4555665 4699696
58533 4699696 4820574 4912769 4972970 4998868 4990027 4949639 4882863 4793264 4683026 4556586 4421024
58522D421024j39058j40280j39422j34281j24958j14167j03352r1930q0068o8928
58512C284580n8159m6313l3881k3035j4076m863N809J6667K6364L5083M3220N0259
58500C281655N5462N8112N6962N0697L8959K1900l50k6387n2738p6079r5358j10134
58488C202701j18678j20189j17540j14739j12436j08608j02794r6572r0416q3278
58478B137451p5226o7770o1593n6321n2148m9275m6290m1823l7188l4618l3411
58467A581788l0881k6767k3514k2149k0994j8790j6332j4595j3614j3393j3734
58456A367025j3321j1188q698p752p685o521m472l164k125N74M434O788O939O896
58442A327730P906R368J1154J3844J6581J7907J8759K1506K6010K9915L2879L6942
$$ plain form
58522 4421024 4281966 4141686 4002264 3867983 3743025 3628858 3525506 3433576 3353508 3284580
58512 3284580 3226421 3180108 3146227 3123192 3109116 3104253 3110062 3126729 3153093 3188176 3231396 3281655
58500 3281655 3337117 3395229 3452191 3502888 3541847 3563747 3563397 3537010 3484272 3408193 3312835 3202701
58488 3202701 3084023 2963834 2846294 2731555 2619119 2510511 2407717 2311145 2220729 2137451
58478 2137451 2062225 1994455 1932862 1876541 1824393 1775118 1728828 1687005 1649817 1615199 1581788
58467 1581788 1550907 1524140 1500626 1478477 1457483 1438693 1422361 1407766 1394152 1380759 1367025
58456 1367025 1353704 1342516 1333818 1326066 1318381 1311860 1307388 1304224 1302099 1302673 1307107 1313895 1320834 1327730
58442 1327730 1335636 1345004 1356158 1370002 1386583 1404490 1423249 1444755 1470765 1500680 1533559 1570501
58430A570501M2451M7199N0229N3083N6410N8496N7962N5135N0098M2297L2579
58419B116440K2772J2877J421j1177k2668l2452m1771n0175n5368n7204n8426
58408A824269o0462o1609o0231n6939n2791m7997m3146l9198l5868l2321k9204
58397A304503k7393k5488k1712j7579j5832j5455j3030q707o173o428o471m786
58385A135449l439l594l427j848j77J090L218N876O896O370P025R481J1364J1948
58371A186232J3296J5586J6003J3690J1312J0112P966M024P21o56k046m439o027
58358A265774o372p811j0658j1595r120o244n428n129l753k621k525j542J190
58345A194166L530M581O660J0652J3708J4050J3715J4108J3227J0064P201O193
$$ plain form
58430 1570501 1612952 1660151 1710380 1763463 1819873 1878369 1936331 1991466 2041564 2083861 2116440
58419 2116440 2139212 2152089 2153510 2142333 2119665 2087213 2045442 1995267 1939899 1882695 1824269
58408 1824269 1763807 1702198 1641967 1585028 1532237 1484240 1441094 1401896 1366028 1333707 1304503
58397 1304503 1277110 1251622 1229910 1212331 1196499 1181044 1168014 1159307 1153134 1146706 1140235 1135449
58385 1135449 1132010 1128416 1124989 1123141 1122964 1124054 1127272 1133148 1140044 1146414 1153439 1162920 1174284 1186232
58371 1186232 1199528 1215114 1231117 1244807 1256119 1266231 1274197 1278221 1278942 1278286 1276240 1271801 1265774
58358 1265774 1259402 1251591 1240933 1229338 1220218 1213974 1208546 1203417 1199664 1197043 1194518 1192976 1194166
58345 1194166 1197696 1202277 1208937 1219589 1233297 1247347 1261062 1275170 1288397 1298461 1305662 1311855
58333A311855M758J498j119j503k008m116n053k669P78L162O213J1036J4554J4543
58319A351929J3889J5431J6794J4770J0984Q542O733L773J437K044L843M057L882
58306A458108N890Q958J0252J0031J0349J1000J0687J0253J1237J3013J4346J5705
58294A589829J7434J8187J7695J8180K0531K2274K1937K1803K3643K5392K5104
58283A822009K4247K3998K2309J8029J3982J2438J1467R174P475Q080Q982Q578
58271A990768Q975J1460J3232J2578J2649J5780J8771J8441J7394J9374K3173
58260B162595K6066K9050L3621L7322L7640L6787L7940M0270M1972M4193M7674
58249B575130M9821M9427M9727N2423N3652N0529M6590M5723M5953M4399M3088
$$ plain form
58333 1311855 1316613 1318111 1316992 1315489 1313481 1309365 1304312 1301643 1302421 1305583 1311796 1322832 1337386 1351929
58319 1351929 1365818 1381249 1398043 1412813 1423797 1432339 1439072 1442845 1444282 1446326 1450169 1454226 1458108
58306 1458108 1463998 1472956 1483208 1493239 1503588 1514588 1525275 1535528 1546765 1559778 1574124 1589829
58294 1589829 1607263 1625450 1643145 1661325 1681856 1704130 1726067 1747870 1771513 1796905 1822009
58283 1822009 1846256 1870254 1892563 1910592 1924574 1937012 1948479 1957653 1965128 1973208 1982190 1990768
58271 1990768 1999743 2011203 2024435 2037013 2049662 2065442 2084213 2102654 2120048 2139422 2162595
58260 2162595 2188661 2217711 2251332 2288654 2326294 2363081 2401021 2441291 2483263 2527456 2575130
58249 2575130 2624951 2674378 2724105 2776528 2830180 2880709 2927299 2973022 3018975 3063374 3106462
58238C106462M4321M5615M4873M5223M9020N2537N2485N2203N5417N9653O2056
58227C669865O5550P2569P8850Q0607Q1819Q7127R3707R7657J02049J10571J19615
58216D659986J25162J31361J43426J57881J68741J77500J87988J97304K01082
58207F150431K01868K03054K00551J89986J75887J64149J52087J36296J23312
58198G697621J21178J26803J33006J41717J58451J80007J99924K20162K45276
58189I224145K71022K91076L08847L30133L50620L63477L72822L86461M02326
58180A2300929M15537M31366M56808M87025N14952N46353N89814O40156O88224
58171A7071164P38398P98915Q63511R21136R75422J035703J097885J154080J212028
$$ plain form
58238 3106462 3150783 3196398 3241271 3286494 3335514 3388051 3440536 3492739 3548156 3607809 3669865
58227 3669865 3735415 3807984 3886834 3967441 4049260 4136387 4230094 4327751 4429800 4540371 4659986
58216 4659986 4785148 4916509 5059935 5217816 5386557 5564057 5752045 5949349 6150431
58207 6150431 6352299 6555353 6755904 6945890 7121777 7285926 7438013 7574309 7697621
58198 7697621 7818799 7945602 8078608 8220325 8378776 8558783 8758707 8978869 9224145
58189 9224145 9495167 9786243 10095090 10425223 10775843 11139320 11512142 11898603 12300929
58180 12300929 12716466 13147832 13604640 14091665 14606617 15152970 15742784 16382940 17071164
58171 17071164 17809562 18608477 19471988 20393124 21368546 22404249 23502134 24656214 25868242
58162B5868242J284031J365772J447065J533083J632642J737101J835304J937708
58154C8640948K060506K199162K344781K511051K713577K937827L161222L391427
58146E9960501L647939L925990M221018M569317N016985N567201O208957O977936
58138A00095844P934190R103398J0498805J2162696J4103950J6233926J8474807
58131A88607616K0915079K3759447K7164025L1195642L5702055L9737112M1062977
58124D08143953L6911698K6054676J0329511o158950j9563107k8184806l2392712
58117C95140263l3414189l2447622l0437337k8038414k5573531k3135102k0777806
58110B01316262j8572231j6539220j4658051j2939234j1412486j0058869q828171
$$ plain form
58162 25868242 27152273 28518045 29965110 31498193 33130835 34867936 36703240 38640948
58154 38640948 40701454 42900616 45245397 47756448 50470025 53407852 56569074 59960501
58146 59960501 63608440 67534430 71755448 76324765 81341750 86908951 93117908 100095844
58138 100095844 108030034 117133432 127632237 139794933 153898883 170132809 188607616
58131 188607616 209522695 233282142 260446167 291641809 327343864 367080976 408143953
58124 408143953 445055651 471110327 481439838 475280888 455717781 427532975 395140263
58117 395140263 361726074 329278452 298841115 270802701 245229170 222094068 201316262
58110 201316262 182744031 166204811 151546760 138607526 127195040 117136171 108308000
58103A08308000p709406o719328n838055n018819m246270l527617k844962k174582
58095G0228961j532392r37177l46252L08674J038022J805381K577458L247734
58087G6390409L513397K981331J514006n54648k606865m141779n001772n303091
58079F6790988n249815n011676m691761m339684l978802l625446l289520k971672
58071C3632612k671367k393146k140210j909899j701167j518617j364037j231661
58063A8702508j115972j016244r30424q53507p85108p29659o86040o45998o05546
58054A1334010n68690n37199n06267m73467m42685m15733l88694l60131l34807
58045G306337l16022l01544k89414k80275k71894k59180k41791k24506k08563
$$ plain form
58103 108308000 100598594 93879266 88041211 83022392 78776122 75248505 72403543 70228961
58095 70228961 68696569 67759392 67413140 67721814 68759836 70565217 73142675 76390409
58087 76390409 79903806 82885137 84399143 83844495 81237630 77095851 72094079 66790988
58079 66790988 61541173 56529497 51837736 47498052 43519250 39893804 36604284 33632612
58071 33632612 30961245 28568099 26427889 24517990 22816823 21298206 19934169 18702508
58063 18702508 17586536 16570292 15639868 14786361 14001253 13271594 12585554 11939556 11334010
58054 11334010 10765320 10228121 9721854 9248387 8805702 8389969 8001275 7641144 7306337
58045 7306337 6990315 6688771 6399357 6119082 5847188 5588008 5346217 5121711 4913148
58036D913148j90261j69336j50603j35495j20178j04050r2146q6774q4207q2055
58026C698043q2833q7814r4050r9549j05214j10175j11592j10352j10387j11334
58016B674743j08548j01414r4680r0412q5622p9143p3742o9949o4776n8143n3752
58005A794562n1961m8606m2534l7627l5616l3519k9917k7252k6178k4193k1507
57994A415652k1640k4448k5291k2896k1255k1831k1012j7593j5739j7482j9019
57983A187446j7673j6169j6579j6113j2585q622o852n980m824n354q292j0521
57971A057882j0103r496j0838j2383j2505j2712j3866j3636j0683p379n673m241
57959I34367k120j048j750j913l33R65J053K237N501P998P779O928P424P911P315
$$ plain form
58036 4913148 4722887 4553551 4402948 4267453 4147275 4043225 3951079 3864305 3780098 3698043
58026 3698043 3615210 3527396 3433346 3333797 3228583 3118408 3006816 2896464 2786077 2674743
58016 2674743 2566195 2464781 2370101 2279689 2194067 2114924 2041182 1971233 1906457 1848314 1794562
58005 1794562 1742601 1693995 1651461 1613834 1578218 1544699 1514782 1487530 1461352 1437159 1415652
57994 1415652 1394012 1369564 1344273 1321377 1300122 1278291 1257279 1239686 1223947 1206465 1187446
57983 1187446 1169773 1153604 1137025 1120912 1108327 1099705 1092853 1086873 1082049 1076695 1068403 1057882
57971 1057882 1047779 1038283 1027445 1015062 1002557 989845 975979 962343 951660 944281 938608 934367
57959 934367 932247 931199 929449 927536 927203 928168 929221 931458 936959 944957 952736 959664 967088 974999 982314
57944I82314P581R934J2233J3018J4446J8247K2146K3422K2909K2577K2021K0054
57932A190902J7148J3997J0243O472M483L852J592l016o864q283j0018j4481j9740
57919A186287k2997k4662k6168k6847k5829k4224k2858k0534j6864j3869j2494
57908I48941j0698p477n441o509q084o694k979pJ078J020K05q73r33m4l55k698
57892H98452m856n242n594p566r469r244q194q583r515q452n368k534j210r39
57878H11686j070q84P01L718O477P698Q061Q506Q650Q078P475P080N872L493J163
57863H86704m78k535n816r604j3405j7635k1681k3605k2935k1371j9933j8013
57851G09693j5907j5265j5954j5663j3668j1739j0303p537l607j661k657l341
$$ plain form
57944 982314 989895 999829 1012062 1025080 1039526 1057773 1079919 1103341 1126250 1148827 1170848 1190902
57932 1190902 1208050 1222047 1232290 1238762 1243245 1247097 1248689 1245673 1238809 1230526 1220508 1206027 1186287
57919 1186287 1163290 1138628 1112460 1085613 1059784 1035560 1012702 992168 975304 961435 948941
57908 948941 938243 930766 925325 918816 910732 904038 901059 901052 902130 903150 903355 902482 901549 901505 901150 898452
57892 898452 893596 888354 882760 875194 865725 856481 848287 839704 830189 821737 816369 813835 812625 811686
57878 811686 810616 809732 810433 814151 820628 828326 836387 844893 853543 861621 869096 876176 882048 885541 886704
57863 886704 886226 883691 877875 868271 854866 837231 815550 791945 769010 747639 727706 709693
57851 709693 693786 678521 662567 646904 633236 621497 611194 603657 600050 598389 595732 592391
57839E92391j718k47r01j272Q72L205K968K020L426N977O587N740O107P526P769
57824F40450O895O704O866N547L209K191K867L239K007m51l609o909r131r678
57810F50197r627r719q856o511m770n407o746o070l630j553k52J283K967M148
57796E95454N442P431Q849Q528P777Q243Q881P805N662M324L595K143M51k05n50
57781F73830k049l915m324l688l772m530m683m535n248o087n368l484k200j771
57767F18176j393j506k755l669k581q99j190k882l367k700l432n912p525o912
57753E71453n631n138n241n964p959j0354j0990r496p857p425p624p756p727o850
57739D65441m431j727p64r92J90L258N720O073N796O458P482P887P949P802O587
$$ plain form
57839 592391 590673 590426 589525 588253 589125 592330 595298 597318 600744 606721 613308 619048 625155 632681 640450
57824 640450 647345 654049 660915 666462 669671 671862 674729 677968 679975 679524 675915 669006 659875 650197
57810 650197 640570 630851 621995 615484 610714 605307 598561 592491 588861 587308 587056 588339 591306 595454
57796 595454 600896 608327 617176 625704 633481 641724 650605 658410 664072 668396 671991 674134 674585 674380 673830
57781 673830 671781 667866 663542 659854 656082 651552 646869 642334 637086 630999 625631 622147 619947 618176
57767 618176 616783 615277 612522 608853 606272 605373 604183 601301 597934 595234 591802 585890 578365 571453
57753 571453 565822 560684 555443 549479 541520 531166 520176 510680 502823 495398 487774 480018 472291 465441
57739 465441 461010 459283 458519 457527 457717 460975 466695 472768 478564 485022 492504 500391 508340 516142 522729
57724E22729M331K960L961O357Q230Q964R038Q768Q309Q001P737O784M899K904
57710F13972J542M05j342l629n478o202o302o862q081q777q120p306q078r791
57696E35951r899p731n456m512l606j715m06j007j856j040K29j5n80R80L868N074
57680E08279M177L610M477N489N913O450O941O286M851M241M540M379L810M240
57666E77683N485N764M922M652N228N101M329N154Q151J0759J1025J0227J0422
57653F68902J1682J3144J4676J6031J6157J4751J3099J2364J2399J2891J4080
57642H20176J5677J6799J7628J9374K2087K4354K5795K7901L1463L4968L6554
57631A092776L6035L4209L1680K9214K7798K7687K8533L0606L4366L8842M2536
$$ plain form
57724 522729 527060 530020 533981 540338 548568 557532 566570 575338 583647 591648 599385 606169 611068 613972
57710 613972 615514 615919 614577 610948 605470 599268 592966 586104 578023 569246 561126 553820 545742 535951
57696 535951 526052 518321 512865 508353 504747 503032 502626 501619 499763 498723 498952 498937 498357 499337 503205 508279
57680 508279 512456 516066 520543 526032 531945 538395 545336 551622 556473 560714 565254 569633 573443 577683
57666 577683 583168 588932 593854 598506 603734 608835 613164 618318 626469 637228 648253 658480 668902
57653 668902 680584 693728 708404 724435 740592 755343 768442 780806 793205 806096 820176
57642 820176 835853 852652 870280 889654 911741 936095 961890 989791 1021254 1056222 1092776
57631 1092776 1128811 1163020 1194700 1223914 1251712 1279399 1307932 1338538 1372904 1411746 1454282
57620A454282M6092N1773N9891O8183P5423Q3124R2708J03516J14924J27985J43412
57609B421313J59973J76548J93791K12031K29238K42658K50478K49649K33882
57600D369561J97245J40455P2416N338n1592r5316j27770j52031j69169j78727
57590D010410j81535j80219j76634j70587j61789j51563j41533j31995j22415
57581B592140j12583j02477r2158q2250p3456o5296n6805m8629m2450l8000l2914
57570A845122k6352k0196j5512j0510l878K281N316O089P637J0982J4858J8646
57558A834483K3048K8193L3343L8499M4497N1404N8286O4621P0802P7266Q4057
57547B408499R1141R8291J04905J10451J14541J16038J12916J03985Q9931P1853
$$ plain form
57620 1454282 1500374 1552147 1612038 1680221 1755644 1838768 1931476 2034992 2149916 2277901 2421313
57609 2421313 2581286 2757834 2951625 3163656 3392894 3635552 3886030 4135679 4369561
57600 4369561 4566806 4707261 4779677 4785015 4733423 4638107 4510337 4358306 4189137 4010410
57590 4010410 3828875 3648656 3472022 3301435 3139646 2988083 2846550 2714555 2592140
57581 2592140 2479557 2377080 2284922 2202672 2129216 2063920 2007115 1958486 1916036 1878036 1845122
57570 1845122 1818770 1798574 1783062 1772552 1768674 1770955 1776271 1782360 1789997 1800979 1815837 1834483
57558 1834483 1857531 1885724 1919067 1957566 2002063 2053467 2111753 2176374 2247176 2324442 2408499
57547 2408499 2499640 2597931 2702836 2813287 2927828 3043866 3156782 3260767 3350698 3422551
57537C422551M9825K4104l232k9447n3381p5146r4137j08903j18912j25036j28185
57526B760101j28534j26235j22004j16772j11288j05994j00745r4784q7628p9916
57516A686201p2922o7345o2810n8363n3228m7445m2018l8154l6133l5184l4354
57505A138245l3022l0828k7908k5110k3137k1513j9363j6972j5284j4022j1945
57494H99141r147p333p236p408o324m263k327r85l02j48N46L106O770Q779Q029
57479H80898O925Q169J1194J3580J4638J5625J7283J9150K0840K2399K3674K4659
57467A079034K6070K8284L0239L0748L0475L1380L4383L8692M3148M7189N0770
57456A470412N4284N8356O3035O7595P1763P6369Q1942Q7220Q9938Q8626Q3110
$$ plain form
57537 3422551 3472376 3496480 3493248 3463801 3410420 3335274 3241137 3132234 3013322 2888286 2760101
57526 2760101 2631567 2505332 2383328 2266556 2155268 2049274 1948529 1853745 1766117 1686201
57516 1686201 1613279 1545934 1483124 1424761 1371533 1324088 1282070 1243916 1207783 1172599 1138245
57505 1138245 1105223 1074395 1046487 1021377 998240 976727 957364 940392 925108 911086 899141
57494 899141 889994 882661 875425 868017 861693 857430 855103 854118 853816 853668 854214 857320 864090 872869 880898
57479 880898 887823 895992 907186 920766 935404 951029 968312 987462 1008302 1030701 1054375 1079034
57467 1079034 1105104 1133388 1163627 1194375 1224850 1256230 1290613 1329305 1372453 1419642 1470412
57456 1470412 1524696 1583052 1646087 1713682 1785445 1861814 1943756 2030976 2120914 2209540 2292650
57445B292650P4118O3045N0977L7058J9150k696k4651m2549n5917o6937p6424
57434B267824q2903q5315q4556q2195p9138p5841p2434o8466o3481n7943n2763
57423A462789m8032m3230l8419l4224l0671k7001k2648j7767j3024r481q097q345
57411A161850p844m597O27N253Q058J0186J3122J6862K0506K3658K6762L0455
57399A304898L4806L9210M3046M6579N0663N5447O0072O4014O7833P2008P5873
57388A914449P8376P9032P7338P2212O3088N0784L6210J9150l95k0506l8548n3662
57376B277528o6650p7698q5853r0681r2975r3451r1987q8563q4079p9678p5693
57365A350220p1670o7143o2349n8021n4443n0964m7004m3125m0048l6920l2253
$$ plain form
57445 2292650 2366768 2429813 2480790 2517848 2536998 2534302 2509651 2467102 2411185 2344248 2267824
57434 2267824 2184921 2099606 2015050 1932855 1853717 1777876 1705442 1636976 1573495 1515552 1462789
57423 1462789 1414757 1371527 1333108 1298884 1268213 1241212 1218564 1200797 1187773 1178292 1170195 1161850
57411 1161850 1154006 1149409 1150036 1155289 1163347 1173533 1186655 1203517 1224023 1247681 1274443 1304898
57399 1304898 1339704 1378914 1421960 1468539 1519202 1574649 1634721 1698735 1766568 1838576 1914449
57388 1914449 1992825 2071857 2149195 2221407 2284495 2335279 2371489 2390639 2390244 2369738 2331190 2277528
57376 2277528 2210878 2133180 2047327 1956646 1863671 1770220 1678233 1589670 1505591 1425913 1350220
57365 1350220 1278550 1211407 1149058 1091037 1036594 985630 938626 895501 855453 818533 786280
57354G86280k6808k3421k2996k2739j9954j5775j3288j3253j3871j3732j2726
57343E87717j0832q289o602p068q399q017n728m045m481n553n183l390j676q44
57329E07610l89M63J680K281J374l39p57J142L708M548L413J926J178J099J715
57314E30652L231M905N567N368N640O924Q570J0234J2283J4524J5986J6348J6289
57301F56521J6103J5178J3296J1409J0622J1143J2281J2944J2281J0647R688J0508
57289H02621J2156J2948J2716J2481J2471J2157J1905J2710J4215J4898J4486
57278I45764J4488J5893J7811J8916J8854J7783J5831J3611J2103J1575J1556
57267A114185J2000J3277J4895J5638J5357J5287J6147J7227J7851J8476J9684
$$ plain form
57354 786280 759472 736051 713055 690316 670362 654587 641299 628046 614175 600443 587717
57343 587717 576885 568596 561994 554926 546527 538510 532782 528737 524256 518703 513520 510130 508454 507610
57329 507610 507221 507684 509364 511645 513019 512680 511923 513065 516773 521321 524734 526660 527838 528937 530652
57314 530652 533883 538788 544355 549723 555363 562287 570857 581091 593374 607898 623884 640232 656521
57301 656521 672624 687802 701098 712507 723129 734272 746553 759497 771778 782425 792113 802621
57289 802621 814777 827725 840441 852922 865393 877550 889455 902165 916380 931278 945764
57278 945764 960252 976145 993956 1012872 1031726 1049509 1065340 1078951 1091054 1102629 1114185
57267 1114185 1126185 1139462 1154357 1169995 1185352 1200639 1216786 1234013 1251864 1270340 1290024
57256A290024K1161K2255K2687K2345K1280K0255K0398K1871K3748K5260K6359
57245A537643K7033K7126K6990K7247K7798K8073K8119K8348K8362K7519K6485
57234A840743K6593K7633K8015K7353K7027K7840K8885K9383K9838L0710L1488
57223B155508L1905L2514L3343L3498L2843L2482L2801L2684L1700L1295L2639
57212B513212L4665L5642L5499L5313L5573L6141L6884L7221L6065L3313L0378
57201B899906K8313K6541K4384K2522K1612K0861J9538J8727J9751K1780K2955
57190C146890K3317K4683K7773L1249L3722L5256L6556L7907L9278M0626M1796
57179C519053M2687M3549M4614M5543M5891M6043M7128M9811N3554N7003N9169
$$ plain form
57256 1290024 1311185 1333440 1356127 1378472 1399752 1420007 1440405 1462276 1486024 1511284 1537643
57245 1537643 1564676 1591802 1618792 1646039 1673837 1701910 1730029 1758377 1786739 1814258 1840743
57234 1840743 1867336 1894969 1922984 1950337 1977364 2005204 2034089 2063472 2093310 2124020 2155508
57223 2155508 2187413 2219927 2253270 2286768 2319611 2352093 2384894 2417578 2449278 2480573 2513212
57212 2513212 2547877 2583519 2619018 2654331 2689904 2726045 2762929 2800150 2836215 2869528 2899906
57201 2899906 2928219 2954760 2979144 3001666 3023278 3044139 3063677 3082404 3102155 3123935 3146890
57190 3146890 3170207 3194890 3222663 3253912 3287634 3322890 3359446 3397353 3436631 3477257 3519053
57179 3519053 3561740 3605289 3649903 3695446 3741337 3787380 3834508 3884319 3937873 3994876 4054045
57168D054045O0428O2373O6178P1188P5732P9182Q2247Q5238Q7549Q9166R1269
57157D904595R4418R7576R9891J02283J05884J10085J13499J16212J19398J23304
57147E987145J27048J30310J33809J37900J41665J43436J41694J35833J26919
57138G205759J17468J09694J04027R9741R6299R3354R0239Q6700Q3716Q2406Q2344
57127H251747Q2118Q1303Q0747Q0952Q1444Q1750Q1976Q2168Q2094Q1772Q1232
57116I149303P9536P5075O7352N7775M8288L9934L3074K8164K5504K4632K4628
57105I653265K4963K5515K5898K5213K2675J8304J3018Q110M561K750K670M307
57093I831249P665J2495J8333K4987L2706M1517N0441N7862O2966O6533O9719
$$ plain form
57168 4054045 4114473 4176846 4243024 4314212 4389944 4469126 4551373 4636611 4724160 4813326 4904595
57157 4904595 4999013 5096589 5196480 5298763 5404647 5514732 5628231 5744443 5863841 5987145
57147 5987145 6114193 6244503 6378312 6516212 6657877 6801313 6943007 7078840 7205759
57138 7205759 7323227 7432921 7536948 7636689 7732988 7826342 7916581 8003281 8086997 8169403 8251747
57127 8251747 8333865 8415168 8495915 8576867 8658311 8740061 8822037 8904205 8986299 9068071 9149303
57116 9149303 9228839 9303914 9371266 9429041 9477329 9517263 9550337 9578501 9604005 9628637 9653265
57105 9653265 9678228 9703743 9729641 9754854 9777529 9795833 9808851 9816961 9821522 9824272 9826942 9831249
57093 9831249 9838914 9851409 9869742 9894729 9927435 9968952 10019393 10077255 10140221 10206754 10276473
57082A0276473P2001P0673O2599M6466K3479l581l1955o0024q7312j13448j37282
57071A0118089j57497j73992j88149k01717k16080k32605k52782k77596l07537
57062H110134l43581l87275m39123m97614n60525o26931o97397p72810q53638
57053B931240r40252I57090a80810j257865j399801j567931j764411j990524k246820
57044a0408162k532783k848359l196034l580564m008364m490292n044857n695639
57036d1805054o464954p371094q428001r640310j0994712j2454075j3954045j5405467
57028a26517712j6720582j7858181j8821501j9548481j9768465j9014598j6872959
57021b55122479j3286494q636225l539277J425834N850414R479606J2175804J3919373
$$ plain form
57082 10276473 10348474 10419147 10481746 10528212 10551691 10548110 10516155 10456131 10368819 10255371 10118089
57071 10118089 9960592 9786600 9598451 9396734 9180654 8948049 8695267 8417671 8110134
57062 8110134 7766553 7379278 6940155 6442541 5882016 5255085 4557688 3784878 2931240
57053 2931240 1990988 957090 -180810 -1438675 -2838476 -4406407 -6170818 -8161342 -10408162
57044 -10408162 -12940945 -15789304 -18985338 -22565902 -26574266 -31064558 -36109415 -41805054
57036 -41805054 -48270008 -55641102 -64069103 -73709413 -84704125 -97158200 -111112245 -126517712
57028 -126517712 -143238294 -161096475 -179917976 -199466457 -219234922 -238249520 -255122479
57021 -255122479 -268408973 -277045198 -280584475 -279158641 -273308227 -263828621 -251652817 -237733444
57013b37733444J4806347J5014123J4757815J4252779J3672424J3110660J2583496
57006a39535800J2072341J1564523J1058230J0547941J0019574R457366Q849970
56999f5965855Q194028P498225O782865O072154N387159M745262M160526L640416
56991a9485220L184316K787768K446464K154986J904637J684996J486695J302623
56983b532735J129343d34722C91076P04558O05488N27801M69771M26978L93358
56974C519030L65120L41252L20041K98279K74679K50940K28384K06227J83980
56965E987932J62538J41894J20546R8196P6276N4910L2287Q240j4290l2595m6692
56954F589242n7920o7935p9694r5837j14697j30963j41774j49233j55822j60963
$$ plain form
57013 -237733444 -222927097 -207912974 -193155159 -178902380 -165229956 -152119296 -139535800
57006 -139535800 -127463459 -115898936 -104840706 -94292765 -84273191 -74815825 -65965855
56999 -65965855 -57771827 -50273602 -43490737 -37418583 -32031424 -27286162 -23125636 -19485220
56991 -19485220 -16300904 -13513136 -11066672 -8911686 -7007049 -5322053 -3835358 -2532735
56983 -2532735 -1403392 -434722 391076 1095634 1701122 2228923 2698694 3125672 3519030
56974 3519030 3884150 4225402 4545443 4843722 5118401 5369341 5597725 5803952 5987932
56965 5987932 6150470 6292364 6412910 6511106 6587382 6642292 6674579 6682819 6668529 6635934 6589242
56954 6589242 6531322 6463387 6383693 6287856 6173159 6042196 5900422 5751189 5595367 5434404
56944E434404j63774j65457j66636j65722j62413j59449j57909j53780j42070
56935C997194j21378r1709n2548r330K0556J6356k8149r7517j66177k15246k39482
56924C012570k43483k34899k20042k02887j86215j72355j62110j53870j45319
56915A291390j35870j26500j17593j08234r7640q6290p5516o6369n8813n1744
56905C66821m4094l6026k8494k1733j5135q550k426L480R865J5911J9153J8020
56893B76792J3239O292j621q626j2399j2827j2656j3997j5651j5236j2470q670
56881A82170m528j57L752O581Q870J1326J3525J5001J6664J9686K3599K6705K7598
56868C50792K5379J9472J0641J346o174j1655j5834j8785k0205k0402j9809j8431
$$ plain form
56944 5434404 5270630 5105173 4938537 4772815 4610402 4450953 4293044 4139264 3997194
56935 3997194 3875816 3784107 3731559 3722229 3742785 3759141 3730992 3633475 3467298 3252052 3012570
56924 3012570 2769087 2534188 2314146 2111259 1925044 1752689 1590579 1436709 1291390
56915 1291390 1155520 1029020 911427 803193 705553 619263 543747 477378 418565 366821
56905 366821 322727 286701 258207 236474 221339 212789 210363 213843 223708 239619 258772 276792
56893 276792 290031 296323 294702 286076 273677 260850 248194 234197 218546 203310 190840 182170
56881 182170 177642 177485 181237 187818 196688 208014 221539 236540 253204 272890 296489 323194 350792
56868 350792 376171 395643 406284 407630 401456 389801 373967 355182 334977 314575 294766 276335
56856B76335j6503j4680j2909j0448p660o090n879n148l119j711k314l216k368
56843A84290p85o35j536j446j10J081J818K873L996M404M794O455Q657R329Q158
56828B31343O900O721P287Q179R018Q323M463j970q368j2769j4757j4235j1354
56815B18781p598m893l439j938J75K464N115Q799J2924J6067J8271K0958K4454
56802C10140K7564K9880L2404L5295L6810L5101K9740K1225J0727O41o528j0550
56790E52449j3308j5733j6442j4147r841n673k626j23K944P333J2893J8586K3710
56777E40022K8893L5013M1694M8189N4941O1835O5188N9420M2976K0594j245j9177
56765I78343l2458m0457m3093m2348m0703l8554l4786k9421k3770j8283j2114
$$ plain form
56856 276335 259832 245152 232243 221795 214135 208045 202166 197018 193899 192188 189874 186658 184290
56843 184290 183505 182870 181334 179888 179778 180859 182677 185550 189546 193950 198744 205199 213856 223185 231343
56828 231343 238243 244964 252251 260430 269448 277771 282234 280264 271896 259127 244370 230135 218781
56815 218781 211183 206290 202851 200913 201088 203552 208667 217466 230390 246457 264728 285686 310140
56802 310140 337704 367584 399988 435283 472093 507194 536934 558159 568886 569527 562999 552449
56790 552449 539141 523408 506966 492819 482978 477305 474679 474556 477500 484833 497726 516312 540022
56777 540022 568915 603928 645622 693811 748752 810587 875775 935195 978171 998765 997520 978343
56765 978343 945885 905428 862335 819987 779284 740730 705944 676523 652753 634470 622356
56754F22356n089J419O214R870J4004J9657K6835L4805M1910M5311M2022L1038
56742H90352J4474l628j9687l1840l9560m2992m2924m0618l7140l3116k9270k6333
56730E57718k3943k0493j4982q504l031Q45M115P697J1577J5270J8120J9245J8031
56717E81665J4584R102J387p992j6594k1768k3457k3998k4894k5249k3912k1720
56705D17154k0435k0151j9099j6036j1998r291r110j0464j1367j0684q761o671
56693B63087n302m915m892m129k339p85p71j673j794j070j209k760l953l427k234
56678B21834j853j906j474j184j966k856k242o57j32j156k178k126j517j081p93
56663A98713n10k76P5N84O81J3o27m41l9m36j161r73P5P82P01L18k57j208j974
$$ plain form
56754 622356 617267 618686 624900 634770 648774 668431 695266 730071 771981 817292 859314 890352
56742 890352 904826 901198 881511 849671 810111 767119 724195 683577 646437 613321 584051 557718
56730 557718 533775 513282 498300 489796 486765 487610 491725 499422 510999 526269 544389 563634 581665
56717 581665 596249 605351 606738 598746 582152 560384 536927 512929 488035 462786 438874 417154
56705 417154 396719 376568 357469 341433 329435 320144 311034 300570 289203 278519 269758 263087
56693 263087 257785 252870 247978 243849 241510 240725 239954 238281 236487 235417 234208 231448 227495 224068 221834
56678 221834 219981 218075 216601 215417 213451 210595 208353 207696 207564 206408 204230 202104 200587 199506 198713
56663 198713 198203 197927 198002 198586 199267 199280 198653 198212 198173 197737 196576 195603 195678 196460 197161 197479 197222 196014 194040
56644A94040j854j350j332j403p23J44P2l89K40J758K562K280J826J113p68l019
56628A93197l493j975o05m20k9J351K172J217j11K33K095L658L640J992m05j929
56612B00588j283R08K637L007K862K846K578K218K762M010M202K714J280J357
56598B32686K014J701N34n90j648k783l193k340j330j588k898l996m390m448m197
56583B03534l248j591L59K155L282L214K047N21p81j722k017j323j35N01L31j8
56567B05109l44r87j613j367m25N7r4J66R65R64m19j927k439k391k399k000p72
56550A90084O17J455J885K101J959J849K471L177K346Q4j344o54P54J243J104
56535B09131J069O92k74o78J42Q54L00m42J22J382J824J617K017L081L774L730
$$ plain form
56644 194040 192186 190836 189504 188101 187378 187522 187594 187205 187445 189203 191765 194045 195871 196984 196216 193197
56628 193197 189704 187729 187124 186704 186675 188026 190198 191415 191304 191537 193632 197290 200930 202922 202517 200588
56612 200588 199305 200213 202850 205857 208719 211565 214143 216361 219123 223133 227335 230049 231329 232686
56598 232686 234700 236401 236935 236345 234697 231914 228721 226381 225051 223463 220565 216569 212179 207731 203534
56583 203534 200286 198695 199054 201209 204491 207705 209752 210273 209492 207770 205753 204430 204295 204796 205127 205109
56567 205109 204765 203778 202165 200798 200373 200430 200336 200502 201467 202431 202012 200085 197646 195255 192856 190856 190084
56550 190084 190701 192156 194041 196142 198101 199950 202421 205598 207944 208028 206684 206030 206784 208027 209131
56535 209131 210200 210892 210618 209940 210082 210936 211236 210794 210916 212298 214122 215739 217756 220837 224611 228341
56519B28341L320K597J539P69Q06J230J555K017K635K659J960J634K114K124Q91
56504B56191j37N67K174L102L779N639Q248R703R456Q742Q482Q430Q336Q380Q492
56489C49584Q400Q131P639O462M752L793M442N621N517L623O76k475m927n653
56475C95585m704l638l564l760l259k636k730k955k509k236l359n139n704m674
56461C44718l427l168m043n525o441n559l401k404l762n334m485j864k67o61j517
56446B92860j570j043m42p2m79j686k348j395mo4j258j597n25N67P89P30R32J158
56428B84553J282J392J022k46j579j738r42l73k03L43J277J912K386L344M248
56413B96678L855K368J366J452J665J398J322K013L044L805M169M131L783L668
$$ plain form
56519 228341 231661 234258 235797 236566 237372 238602 240157 242174 244809 247468 249428 251062 253176 255300 256191
56504 256191 256054 256621 258795 261897 265676 271315 279563 289266 298722 307464 315946 324376 332712 341092 349584
56489 349584 357984 366115 373754 380216 384968 388761 393203 398824 404341 407964 408640 406165 401238 395585
56475 395585 390881 387243 383679 379919 376660 374024 371294 368339 365830 363594 360235 355096 349392 344718
56461 344718 341291 338123 334080 328555 322114 316555 313154 310750 306988 301654 297169 295305 295038 294377 292860
56446 292860 291290 290247 289805 289733 289254 287568 285220 283825 283821 283757 282499 280902 280377 280944 281733 282463 283395 284553
56428 284553 285835 287227 288249 288003 286424 284686 283744 283371 283168 283511 284788 286700 289086 292430 296678
56413 296678 300533 302901 304267 305719 307384 308782 310104 312117 315161 318966 323135 327266 331049 334717
56399C34717M248N132N650N774N662M885L260J854J864L064M432N512N935M740
56385C96729J956j83L12K205K654J270J82M33Q25N34M57J217J834J239k50j607
56369D09807k267k268k102k539l732m745m783m390m435m714m785n221o421p006
56355C50399n442k683j083j106j163n36k92j115k164k440j874q90j08k11r13o48
56339C27731J263K954K290o6j805k359k698k579q29J802K962K142J184J049O46
56324C33687n01j076l65L64K7n59k81M31N02n0k78M37J808K965L342L426M056
56307C47935M762L975J674J52Q30K088K087J772K735L943L596K637L122M272L883
56292C89463K614L032M897N503M535M437N634N629L606J903J781J614N97N86K472
$$ plain form
56399 334717 338965 344097 349747 355521 361183 366068 369328 371182 373046 376110 380542 386054 391989 396729
56385 396729 398685 398502 398814 401019 403673 404943 405125 405558 406383 406917 407374 408591 410425 411664 411414 409807
56369 409807 407540 405272 403170 400631 396899 392154 387371 382981 378546 373832 369047 363826 357405 350399
56355 350399 344957 342274 341191 340085 338922 338386 338094 336979 334815 332375 330501 329611 329503 329292 328379 327731
56339 327731 328994 331948 334238 334172 332367 330008 327310 324731 323902 325704 328666 330808 331992 333041 333687
56324 333687 333186 332110 331745 332109 332136 331577 331296 331727 332229 332179 331901 332338 334146 337111 340453 343879 347935
56307 347935 352697 356672 358346 358498 359328 361416 363503 365275 368010 371953 375549 378186 381308 385580 389463
56292 389463 392077 395109 400006 405509 410044 414481 420115 425744 429350 431253 433034 434648 435245 435831 438303
56277D38303M115L819K929L134L867M118M376M910M501K692J191J437K706L974
56263D86072N537P407Q286P567O505O026N381M187L762N020O882Q027Q539Q741
56249E77939Q281P325O958P447P853P846Q042Q195P438O552P334R220R703Q626
56235F88759Q637J0357J0847Q522N919N462N879N273M489M704M621L144K327M393
56221G73333P850R799J0326J1494J3388J4380J4393J4927J6314J7474J8053J8715
56209I40446J9713K0959K3055K6497L0313L2991L4443L5816L7854M0423M3269
56198A285779M6356M9936N4582O0445O6372P1038P5017Q0189Q6756R2643R6285
56187B065398R8281R9756J00756J00715R8830R3920Q5707P6208O7632N9081M7936
$$ plain form
56277 438303 442418 446237 449166 452300 456167 460285 464661 469571 474072 476764 477955 479392 482098 486072
56263 486072 491609 499016 507302 514869 521374 527400 532781 536968 540730 545750 552632 560659 569198 577939
56249 577939 586220 593545 600503 607950 615803 623649 631691 639886 647324 653876 661210 670430 680133 688759
56235 688759 697396 707753 718600 727122 733041 738503 744382 749655 754144 758848 763469 766613 768940 773333
56221 773333 781183 790982 801308 812802 826190 840570 854963 869890 886204 903678 921731 940446
56209 940446 960159 981118 1004173 1030670 1060983 1093974 1128417 1164233 1202087 1242510 1285779
56198 1285779 1332135 1382071 1436653 1497098 1563470 1634508 1709525 1789714 1876470 1969113 2065398
56187 2065398 2163679 2263435 2364191 2464906 2563736 2657656 2743363 2819571 2887203 2946284 2994220
56176B994220L4297K1012R294k167j3441k2567k9300l5763m2194m6028m6659m7129
56164B773575m9247n0939n0613n0305n1939n3987n4629n5067n6835n8823n9656
56153B181535o0315o1726o2519o1665o0621o0290n8739n4694n0445m8420m7414
56142A554687m5089m1788l9057l6758l4167l1687k9195k5409k0991j9168k0663
56131A210715k1399j8154j3279j0615j0006r311q670q996q861o875m777m559m782
56118A080431l200o75Q91K130M218N829N649N431P017Q819Q791Q391R815J1886
56104A155423J2569J3056J5296J7969J8917J9294K1215K3643K4657K5341K7289
56093A374669K8804K8093K7562L0236L4182L5518L4746L5174L7127L9085M2558
$$ plain form
56176 2994220 3028517 3049529 3058823 3056656 3043215 3020648 2991348 2955585 2913391 2867363 2820704 2773575
56164 2773575 2724328 2673389 2622776 2572471 2520532 2466545 2411916 2356849 2300014 2241191 2181535
56153 2181535 2121220 2059494 1996975 1935310 1874689 1814399 1755660 1700966 1650521 1602101 1554687
56142 1554687 1509598 1467810 1428753 1391995 1357828 1326141 1296946 1271537 1250546 1231378 1210715
56131 1210715 1189316 1171162 1157883 1147268 1137262 1127951 1119281 1110285 1101424 1094549 1089772 1085213 1080431
56118 1080431 1077231 1076556 1077447 1079577 1083795 1089624 1095273 1100704 1107721 1116540 1125331 1133722 1143537 1155423
56104 1155423 1167992 1181048 1196344 1214313 1233230 1252524 1273739 1297382 1322039 1347380 1374669
56093 1374669 1403473 1431566 1459128 1489364 1523546 1559064 1593810 1628984 1666111 1705196 1747754
56082A747754N0043N9319O5483O8107P1163P6375Q1676Q6162R1831J00111J10545
56071B608569J23024J37989J54654J71812J89313K05943K17554K20644K16136
56062D245638K06735J93052J75956J59747J48181J39188J27733J11714R1045O4077
56052E663066L0387m874l4675n6763p2654q2860q8537r5110j08203j27153j47383
56041D875241j66916j85130j97915k00664j94812j85571j74553j60257j43957
56032C265466j29048j15765j02124q8730p7296o6462n4571m4250l8332l3831k6417
56021B488640j8173j4045j3129j0800p183n691n320k397J579K140M75J726N785
56008B423607Q047Q206J0095J3789J6181J8326K3570K9391L0203K7526K8047L2060
$$ plain form
56082 1747754 1797797 1857116 1922599 1990706 2061869 2138244 2219920 2306082 2397913 2498024 2608569
56071 2608569 2731593 2869582 3024236 3196048 3385361 3591304 3808858 4029502 4245638
56062 4245638 4452373 4645425 4821381 4981128 5129309 5268497 5396230 5507944 5598989 5663066
56052 5663066 5693453 5688579 5653904 5597141 5524487 5441627 5353090 5257980 5149777 5022624 4875241
56041 4875241 4708325 4523195 4325280 4124616 3929804 3744233 3569680 3409423 3265466
56032 3265466 3136418 3020653 2918529 2829799 2752503 2686041 2631470 2587220 2548888 2515057 2488640
56021 2488640 2470467 2456422 2443293 2432493 2425310 2419619 2414299 2411902 2413481 2415621 2416096 2417822 2423607
56008 2423607 2431654 2439860 2449955 2463744 2479925 2498251 2521821 2551212 2581415 2608941 2636988 2669048
55996B669048L3520L1555L1820L5680L7942L6859L6893L9816M2041M2719M5776
55985C083669N1990N7100N9502O2101O5358O6392O5863O7875P2459P6001P9004
55974C807314Q4968R1976R4637R4083R6453J01721J04231J04081J07300J14424
55964D801188J19839J22990J29220J38999J47569J55669J68874J85761J98957
55955F169066K08619K22212K40126K54788K65302K79217K97969L14369L26482
55946H578150L39951L54591L63387L67079L74929L88590M00527M10739M28780
55937A2006723M56251M84226N11331N47040N93117O39662O83849P34233P91812
55928A7448244Q45685Q92739R42566R97890J050161J099899J160237J234128J309592
$$ plain form
55996 2669048 2702568 2734123 2765943 2801623 2839565 2876424 2913317 2953133 2995174 3037893 3083669
55985 3083669 3135659 3192759 3252261 3314362 3379720 3446112 3511975 3579850 3652309 3728310 3807314
55974 3807314 3892282 3984258 4078895 4172978 4269431 4371152 4475383 4579464 4686764 4801188
55964 4801188 4921027 5044017 5173237 5312236 5459805 5615474 5784348 5970109 6169066
55955 6169066 6377685 6599897 6840023 7094811 7360113 7639330 7937299 8251668 8578150
55946 8578150 8918101 9272692 9636079 10003158 10378087 10766677 11167204 11577943 12006723
55937 12006723 12462974 12947200 13458531 14005571 14598688 15238350 15922199 16656432 17448244
55928 17448244 18293929 19186668 20129234 21127124 22177285 23277184 24437421 25671549 26981141
55919B6981141J383596J467944J565280J663483J760928J872140K001564K138889
55911D0834965K287340K466540K678094K899677L122984L365134L634313L923048
55903F5212095M247418M651125N156027N752848O457229P328048Q414538R737805
55895A16957133J1335638J3253401J5467879J7902413K0548152K3476617K6702117
55888B45643350L0146671L3711858L7023373L8812809L6861259K9288879J6349724
55881D67837923Q46888j3473432k4050874l0321094l3034469l3269616l1974072
55874C02561254k9883354k7472362k4960051k2442555k0008666j7728352j5623097
55867A44442817j3707571j2018460j0570845r329888q254186p330031o542466
$$ plain form
55919 26981141 28364737 29832681 31397961 33061444 34822372 36694512 38696076 40834965
55911 40834965 43122305 45588845 48266939 51166616 54289600 57654734 61289047 65212095
55903 65212095 69459513 74110638 79266665 85019513 91476742 98804790 107219328 116957133
55895 116957133 128292771 141546172 157014051 174916464 195464616 218941233 245643350
55888 245643350 275790021 309501879 346525252 385338061 422199320 451488199 467837923
55881 467837923 468684811 455211379 431160505 400839411 367804942 334535326 302561254
55874 302561254 272677900 245205538 220245487 197802932 177794266 160065914 144442817
55867 144442817 130735246 118716786 108145941 98816053 90561867 83231836 76689370
55860G6689370n853281n233435m685544m213428l798665l425638l101449k832403
55852D3545527k605333k408075k244393k113053j994318j872467j752134j639640
55844B6916114j527778j411685j300990j203383j112844j025027r47755q85704
55836A7500948q30675p77140p31873o98537o67958o33310o00356n73532n46356
55827A1441211n14950m86859m66945m47811m23409l99198l79762l59123l32838
55818G630316l07565k89139k72559k52916k35160k23529k11890j94236j75325
55809E467997j61735j51337j40450j32767j32294j35255j37225j40830j48479
55800D187625j54936j54882j51059j47661j42453j32414j20673j10966j01348
$$ plain form
55860 76689370 70836089 65602654 60917110 56703682 52905017 49479379 46377930 43545527
55852 43545527 40940194 38532119 36287726 34174673 32180355 30307888 28555754 26916114
55844 26916114 25388336 23976651 22675661 21472278 20359434 19334407 18386652 17500948
55836 17500948 16670273 15893133 15161260 14462723 13794765 13161455 12561099 11987567 11441211
55827 11441211 10926261 10439402 9972457 9524646 9101237 8702039 8322277 7963154 7630316
55818 7630316 7322751 7033612 6761053 6508137 6272977 6049448 5837558 5643322 5467997
55809 5467997 5306262 5154925 5014475 4881708 4749414 4614159 4476934 4336104 4187625
55800 4187625 4032689 3877807 3726748 3579087 3436634 3304220 3183547 3072581 2971233
55791B971233q9643p8932p1992o6750o2576o3830p1334p7591p6812p2965p1628
55780B167180p0930o7190o2813o1247n9872n5048m9138m5855m3466l8744l3038
55769A579839k8634k3804j7128j1961j0935j0776p976m950n154o932p632r113
55757A434844j3456j7669j8426j7975j9978k3344k5332k6685k8659k9007k6050
55746A188263k2907k2790k3785k2909k1261k0626j9196j5543j2518j2291j1789
55735I82648q220m788n481q177q600p506q127r705r218o908m914l083p60J16j667
55720H95610l273k311j293k938m708l309j252l255q770j3693j6967k0000k1807
55707G92034k0381j7218j5471j4911j3374j1323j0602j0510r623r624j2771j7322
$$ plain form
55791 2971233 2881590 2802658 2730666 2663916 2601340 2537510 2466176 2388585 2311773 2238808 2167180
55780 2167180 2096250 2029060 1966247 1905000 1845128 1790080 1740942 1695087 1651621 1612877 1579839
55769 1579839 1551205 1527401 1510273 1498312 1487377 1476601 1468625 1463675 1458521 1451589 1443957 1434844
55757 1434844 1421388 1403719 1385293 1367318 1347340 1323996 1298664 1271979 1243320 1214313 1188263
55746 1188263 1165356 1142566 1118781 1095872 1074611 1053985 1034789 1019246 1006728 994437 982648
55735 982648 974428 969640 964159 955982 947382 939876 931749 922044 912826 905918 901004 897921 897161 897277 895610
55720 895610 892337 890026 888733 885795 881087 877778 876526 873271 864501 850808 833841 813841 792034
55707 792034 771653 754435 738964 724053 710679 699356 688754 678244 668621 658997 646226 628904
55695F28904j9881k0496k1163k1203j8639j4424j0823p217j864L753O678P116
55683E10741P197O705M206Q88r92k153m648p524q222p123o777p636q255q428q716
55668D59263q199o271n075o614q970r029p274o302o417o492p222r417j0847r090
55654C52044n969m883n273m100j495k71p80p22M81J244J196J210Q35o05j428Q3
55638C31567J836M46l261n345m613l421l246l385l537l959l626j725n9m04p49
55623B96519J804N621O510M264K547K897L497L709M902O554O169L714J992J958
55609C52657J722O07J87N25n24l271n154m815l813l370k754j839j927k878k545
55594C22808k63J826K039J219N70r5j064j878k495l299l615k382m28K22n99j207
$$ plain form
55695 628904 609023 588527 567364 546161 527522 513098 502275 495058 493194 496947 503625 510741
55683 510741 517938 524643 528849 529737 528745 526592 521944 514420 506198 499075 492298 484662 476407 467979 459263
55668 459263 451064 444793 439718 433104 424134 415105 407831 401529 395112 388620 381398 371981 361134 352044
55654 352044 346075 341192 335919 331819 330324 330053 329273 328551 329032 330276 331472 332682 333517 332912 331484 331567
55638 331567 333403 333849 330588 325243 320630 317209 313963 310578 307041 303082 299456 297731 297672 297268 296519
55623 296519 298323 303944 310454 314718 317265 320162 323659 327368 332270 338824 344993 348707 350699 352657
55609 352657 354379 354986 355173 355698 355174 351903 346749 341934 338121 334751 331997 330158 328231 325353 322808
55594 322808 322545 324371 326410 327629 328199 328104 327040 325162 322667 319368 315753 313371 312943 313165 312566 311359
55578C11359j131j648l066m064l986l551l094k477k579m391o660p017n449m144
55564B58102m054m177m104m458m846m114k754k371k882k854k408k946m232m713
55550B07189m527n008n483l971j147M5j099k352k696l398m468l864j284Q35J243
55535A70015J457K255K048K56j047m65N91P01N89R29P47l20p02M99K018K955M316
55518A86842O394P218N607L514L429N227P363R298J0972J1582J0799R993J0681
55505B88919J2788J5461J8253K0483K0923J9112J5776J1256N130j980p990j1773
55493D06358j4310j6703j8681j9830k0528k0749j9685j7441j5429j4346j3403
55482B15253j2196j1475j1272j0307q093n817m246k759j277j007k179l074k516
$$ plain form
55578 311359 310228 308580 305514 301450 297464 293913 290819 288342 285763 281372 274712 267695 262246 258102
55564 258102 254048 249871 245767 241309 236463 232349 229595 227224 224342 221488 219080 216134 211902 207189
55550 207189 202662 197654 192171 188200 187053 187098 185999 183647 180951 177553 173085 169221 167937 168772 170015
55535 170015 171472 173727 175775 176031 174984 174519 175110 175811 176400 177329 178076 177756 177054 177553 179571 182526 186842
55518 186842 193236 200454 206061 209575 213004 218231 225594 234892 245864 257446 268245 278238 288919
55505 288919 301707 317168 335421 355904 376827 395939 411715 422971 428101 426121 418131 406358
55493 406358 392048 375345 356664 336834 316306 295557 275872 258431 243002 228656 215253
55482 215253 203057 191582 180310 170003 161910 156093 151847 149088 147811 146804 144625 141551 139035
55469A39035j493j104q02J5N42Lr38j552k258l280l556k279k51J279J971J995
55453A27327J599J683L054M652M374K221N43N18P38J62j30N92R22k55j735k163
55437A44102k198k789l183k519j758k060k800k991l130l837m204l514l127m459
55423A01533o252o068l809j710j262j851k151j545m31K7r91k594k898j690q86
55408F7422j641k710k718k223k055j513K2J267R40R9M14J233O37j357k903l084
55392E1830k605j949r52p3k82j384j869p08J531L410L766K408L94p42o45m21q53
55375E0856j276j012o73r56j066R7J858K299O86j713l069k468l02K000L016K548
55359E0825J536O62j32o41l17M06K27p95p43J378L871M665L975L166K383J115
$$ plain form
55469 139035 137542 136438 135636 135651 136193 136196 135258 133706 131448 128168 124612 122333 122082 123361 125332 127327
55453 127327 128926 130609 133663 138315 142689 144910 145453 145971 146709 146871 146741 147333 148255 148000 146265 144102
55437 144102 141904 139115 135932 133413 131655 129595 126795 123804 120674 116837 112633 109119 105992 101533
55423 101533 95281 89213 85404 83694 82432 80581 78430 76885 76454 76481 75490 72896 69998 68308 67422
55408 67422 65781 63071 60353 58130 56075 54562 54584 55851 56791 56890 57304 58537 59174 57817 54914 51830
55392 51830 49225 47276 46324 46251 45969 44585 42716 42008 43539 46949 50715 53123 53517 52775 52130 51709 50856
55375 50856 49580 48568 47895 46939 45873 45970 47828 50127 50813 49100 46031 43563 43261 45261 48277 50825
55359 50825 52361 53023 52891 52250 51933 52339 52566 51771 51028 52406 56277 60942 64917 68083 70466 71581
55343G1581L1K17J127J188J75o00l48L04M57j67j357k558l051k628j756p03P57
55326F2669K205K326P70q30r16j71j63p98p76n8Rr53j529n73J072J513Nk239l271
55307E8292k296k72J327J900J385n38l641o008n637l262j612j558j205M58J597
55292C8930P24n73j63J126J070k09o67K02Q16J69j050k001k563k552j602j16Q98
55275C2439J006N43j42p83r86q13j037j832j983o57Q14M45j528k835k087j54J378
55258B1788J840J501J001R94J642K415K732K514J723P9k121l695l841l081k144
55243B3347q76Q72K137J941Q12R1J99N96R36J237J354J174Q38J93j146k597k643
55226B8465r89O22P88L46O25J221J153Q55J238J781J525R80J113J332O10l88m88
$$ plain form
55343 71581 71612 71829 72956 74144 74319 73719 73371 73675 74132 73965 72608 70050 66999 64371 62615 61912 62669
55326 62669 64874 67200 67970 67140 66224 66053 65890 65092 64316 64258 64267 63314 61785 61212 62284 63797 63802 61563 58292
55307 58292 55996 55724 57051 58951 60336 59798 56157 50149 44512 41250 39638 38080 36875 37333 38930
55292 38930 39654 39081 38918 40044 41114 40905 40238 40440 41256 41425 40375 38374 35811 33259 31657 31541 32439
55275 32439 33445 33988 33846 33063 32077 31264 30227 28395 26412 25755 26569 27014 25486 22651 20564 20410 21788
55258 21788 23628 25129 26130 27124 28766 31181 33913 36427 38150 38229 36108 32413 28572 25491 23347
55243 23347 22471 23343 25480 27421 28233 28324 28523 29119 30055 31292 32646 33820 34658 34851 33705 31108 28465
55226 28465 27476 28098 28886 29232 29857 31078 32231 33086 34324 36105 37630 38610 39723 41055 41665 41277 40789
55209D0789m69j806l565l332j193J62m75j289o74M99R15Q99J188J383R80N83P44
55192C5339P37k78j654j943p30R98K013J791P58o6J4N29L98o05j490j383o46l32
55174C3450q72j567j398k62P11M69n40r74o26o10j191r08J137L418L736J939m38
55157C5474k278l192k628n66J443J759Q91N66R91P97k39n01J019L097L743K263
55141D2639m43k723l135j586L54R61J44r25j508j635j333p12l66m98q5J650L446
55124C4245L375J690N83J055J837J570M10q94k008k554k043p82J33J04m98j197
55108C5026j732j582l65J254K106J976J465O22r28k622l263k788k285k077j247
55093B3560N79K375L157L104K692J801K92j262j963j387J4J077Q19l13q75n73
$$ plain form
55209 40789 40320 38514 34949 31617 30424 30586 30111 28822 28148 28647 29562 30461 31649 33032 34012 34595 35339
55192 35339 36076 35798 34144 32201 31471 32469 34482 36273 37031 36965 36979 37508 37906 37301 35811 34428 33782 33450
55174 33450 32578 31011 29613 29351 30062 30531 29991 29017 28391 27781 26590 25682 26819 30237 33973 35912 35474
55157 35474 33196 30004 27376 26810 28253 30012 30903 31469 32460 33257 33018 32517 33536 36633 40376 42639
55141 42639 42196 39473 36338 34752 35106 36067 36211 35286 33778 32143 30810 30098 29732 29234 29149 30799 34245
55124 34245 37620 39310 39893 40948 42785 44355 44765 43871 41863 39309 37266 36484 36617 36721 36223 35026
55108 35026 33294 31712 31347 32601 34707 36683 38148 38770 37842 35220 31957 29169 26884 24807 23560
55093 23560 24139 26514 29671 32775 35467 37268 37560 36298 34335 32948 32962 34039 34858 34545 33670 33097
55077C3097q12k067k276J94L398M130K486J323J549J162p36k156j490O7P09M83
55061C9061K85K62L79J028J922J981J238J233K528L562L096K190K316L130L489
55046F7700L394L399L197K302J242P39N40J76k0J54j08j206j792n05J613K216
55030H3041R16k42K05J135O03j423l039k927j961j818k502k342o34R29M74j344
55014F9071k192j180L53J043Q89M10r3j89M56J186Q92l38j260j254q95o24l20
54997F5955j33l19k14R66K223J675l67j283K10K289K783J768M61o61j448j447
54981G2458q63q01j460j562m81O49R65J226J935J904L86j019m34J507K762K764
54965G9936K457K366K305K424K915L217K779K095J841J707J209Q71J286J798J477
$$ plain form
55077 33097 32285 30218 27942 28136 31534 35664 38150 39473 41022 42184 41448 39292 37802 37869 38578 39061
55061 39061 39346 39608 39987 41015 42937 44918 46156 47389 49917 53479 56575 58765 61081 64211 67700
55046 67700 71094 74493 77690 79992 81234 81973 82513 82689 82669 82823 82715 81509 79717 79212 80825 83041
55030 83041 83957 83715 83920 85055 85658 84235 81196 78269 76308 74490 71988 69646 69012 69941 70415 69071
55014 69071 66879 65699 66052 67095 67984 68394 68301 68112 68568 69754 70646 70308 69048 67794 66899 66275 65955
54997 65955 65822 65503 65289 66255 68478 70153 69786 68503 68713 71002 73785 75553 76014 75353 73905 72458
54981 72458 71595 70794 69334 67772 67291 67940 68905 70131 72066 73970 74356 73337 72903 74410 77172 79936
54965 79936 82393 84759 87064 89488 92403 95620 98399 100494 102335 104042 105251 106122 107408 109206 110683
54950A10683P52P75J655K447K485J708K95j120j575j022n90q13o63O23J944K010
54934A19594J397J369J510L76j960l716l589k006k66N55J80o58r89r85j578k354
54918A06880j510J091K720J355j215j975j020p82j893k529j641l11L72O30Q79
54903A01051R26O96L90p0o15l91J050K390K099R52J073K652L828L805L891M988
54887A28715O126O347O102N862N021L341K127K593M083N177N959P776J0925J3699
54873B13853J4129J2287J0365J0349J1794J2345J0445O775K813r06m411p234q932
54860B83672j0025j1206j2173j2373j2274j2538j2495j0938q217n963m946m618
54848A65906m537m638m246k594m73L23m56j083l38J015J777J943K182K831L929
$$ plain form
54950 110683 111435 112210 113865 116312 118797 120505 120800 119680 118105 117083 116493 115680 115017 115640 117584 119594
54934 119594 120991 122360 123870 124246 122286 118570 114981 112975 112709 113264 113444 112786 111797 110812 109234 106880
54918 106880 105370 106461 109181 110536 109321 107346 106326 105544 103651 101122 99481 99170 99542 100172 101051
54903 101051 101977 102673 103063 102993 102378 101987 103037 105427 107526 108478 109551 112203 116031 119836 123727 128715
54887 128715 134841 141188 147290 153152 158173 161514 163641 166234 170317 175494 181453 189229 200154 213853
54873 213853 227982 240269 250634 260983 272777 285122 295567 302342 305155 304249 299838 292604 283672
54860 283672 273647 262441 250268 237895 225621 213083 200588 189650 181433 175470 170524 165906
54848 165906 161369 156731 152485 149891 149418 149741 149285 148202 147864 148879 150656 152599 154781 157612 161541
54833A61541N352O547P057P506Q965J1224J2929J3554J3788J3626J1723P443K159
54820B83414k290n446p795r592j0933j2061j2898j2961j2292j1542j0724r073
54808A65807o670m949m709m854m159l137k937l330l209k487k005j777q43J111
54794A21852K962L359K084J08j251j269l30M44K78p09k111l693m934m810k937
54779A09043n83M06m58k010l030l378l459l302k610j417l09J1o30j621k038j479
54763H3136m26L26M86L50K55K44K92N71J197J768J565M76n62n37K40L45r57k691
54745H6078l341k508r38O05J734K196K073K119L020M322M884M520M288M976O014
54730A20042O411O065N646N575N710N887O210O787P505Q295R424J1264J3642J5732
$$ plain form
54833 161541 166893 173440 180497 188003 196968 208192 221121 234675 248463 262089 273812 281255 283414
54820 283414 281124 275678 267883 258291 247358 235297 222399 209438 197146 185604 174880 165807
54808 165807 159137 154188 149479 144625 140466 137329 134392 131062 127853 125366 123361 121584 120741 121852
54794 121852 124814 128173 130257 130365 129114 127845 127515 127959 128237 127528 125417 121724 116790 111980 109043
54779 109043 108460 108866 108408 106398 103368 99990 96531 93229 90619 89202 88893 88904 88274 86653 84615 83136
54763 83136 82710 83036 83522 83872 84127 84371 84663 85234 86431 88199 89764 90240 89678 89141 89381 89726 88769 86078
54745 86078 82737 80229 79291 79896 81630 83826 85899 88018 91038 95360 100244 104764 109052 114028 120042
54730 120042 126453 132518 138164 143739 149449 155336 161546 168333 175838 184133 193557 204821 218463 234195
54716B34195J6847J7123J6909J5738J2745Q286M151J594o2k099m526o412p428
54703C07061p903p755o672n210m437m356l875k487r76j26K28N01P16J020K004
54688B67733L787N505O392O808P510Q338Q409P444O157N277M758M236L851M117
54674C50322M982N463M641K843J335P72M22r49l892q135j2840j6605j7976j6764
54660B93619j4509j2953j2370j1979j1402j0907j0489r763q637p373o043m638
54648A72556l630l637m482n132m716l291j765j279k194l346l000j134R2q97k768
54633A31377k961j045J138K270K732L041K813J807O49%o8M36J570K793L135K421
54617A52108J506J090J074J251J638J927J566O98L05J103K892M982O483O497N068
$$ plain form
54716 234195 251042 268165 285074 300812 313557 321843 325994 327588 327526 325427 320901 314489 307061
54703 307061 299158 291403 284731 279521 275084 270728 266853 264366 263390 263264 263492 263993 264709 265729 267733
54688 267733 271520 277025 283417 290225 297735 306073 314482 321926 328083 333360 338118 342354 346205 350322
54674 350322 355304 360767 365408 368251 369586 370358 370780 369831 365939 357804 344964 328359 310383 293619
54660 293619 279110 266157 253787 241808 230406 219499 209010 199247 190610 183237 177194 172556
54648 172556 168926 165289 160807 155675 150959 147668 145903 144624 142430 139084 136084 134950 135042 134145 131377
54633 131377 128416 127371 128509 130779 133511 136552 139365 141172 141821 141821 141753 142189 143759 146552 149687 152108
54617 152108 153614 154704 155778 157029 158667 160594 162160 162858 163163 164266 167158 172140 178623 185120 190188
54602A90188L780M117N338N305L448J321J61l12k51J158L893O062O060M667L787
54587B38722L998M524M928N565O784Q478J0277J1696J2530J3368J4984J7029J8235
54574C71118J8095J7153J5362J1797O667J970j025l448o587r508j0651j0584j1004
54561C89355j1880j1873j1210j1584j2997j3094j0618p564o578p600q563q496
54549B67298q227q370q177o844m953l806l719l694k866j812j913l471n006m831
54535A99609l089j650j870l022l456k802k233k538k976k627j950j955k319j710
54521A65412O3J578J756R80j89j824l331l019m43K054J958q8j387r20m4J39j41
54504A62554q08k347m205m601k688M59L386N465O274N454L730K621K580K717K607
$$ plain form
54602 190188 193968 198085 203423 208728 212176 213497 213658 213346 213095 214253 218146 224208 230268 234935 238722
54587 238722 242720 247244 252172 257737 264521 272999 283276 294972 307502 320870 335854 352883 371118
54574 371118 389213 406366 421728 433525 440192 442162 441137 437689 431102 421594 410943 400359 389355
54561 389355 377475 365602 354392 342808 329811 316717 306099 298535 291957 284357 275794 267298
54549 267298 259071 250701 242524 235680 230727 226921 223202 219508 216642 214830 212917 209446 204440 199609
54535 199609 196520 194870 193000 189978 186522 183720 181487 178949 175973 173346 171396 169441 167122 165412
54521 165412 165475 167053 168809 169789 169600 167776 164445 161426 160983 163037 164995 164907 163520 162600 162556 162695 162554
54504 162554 161746 159399 155194 150593 147905 148364 151750 157215 163489 168943 172673 175294 177874 180591 183198
54489A83198K680K511Q54j828k939j198J248J665K31q58n04P16K027K931K967
54474A93701K483K878M789O753P074O265O163P244Q319Q532Q145P562O765N660
54460B82333M056J638j248l337m014m475o189q655r944r190p274n407m216m029
54446B20049m739n343m759l173j811j338j304j045l79M74R96N97m54p43P75L232
54430B01035M653M301L291K907L179L293K721J775J279J708K540K753K148J587
54416B39170J709K134K365K650L193L309K224K53j448j949r75R53K320J614p06
54401B56816k233j562k25n13k266l276k342m95O28M16n13j035o03k8n15j645j576
54384B39033L6J055N5j240o54Q61P23j196k681k878l118l975m189l034j536o75
$$ plain form
54489 183198 185878 188389 189243 187415 184476 183278 184526 186191 186422 185564 185060 185776 187803 190734 193701
54474 193701 196184 199062 203851 210604 217678 223943 230106 237350 245669 254201 262346 269908 276673 282333
54460 282333 286389 288027 286779 283442 279428 274953 268764 260109 250165 240975 233701 228294 224078 220049
54446 220049 215310 209967 205208 202035 200224 198886 197582 196537 196158 196632 197628 198225 197771 197028 197803 201035
54430 201035 205688 209989 213280 216187 219366 222659 225380 227155 228434 230142 232682 235435 237583 239170
54416 239170 240879 243013 245378 248028 251221 254530 256754 257007 255559 253610 252635 253588 255908 257522 256816
54401 256816 254583 253021 252796 252283 250017 246741 244399 243904 244532 244948 244435 243400 242797 242769 242254 240609 239033
54384 239033 239069 240124 240179 238939 238285 239146 239869 238673 235992 233114 229996 226021 221832 218798 217262 216587
54368B16587k47j05p29j805k022j065k35l10k71Q34K165K331J340L03j35k38n78
54351B15820j570l000l748k686j58K209L347L587L593L588L895M961O358O725
54337B42921N395L298J760J202J347J843K202K004J548J462J402J73k297m223
54323B60037m069k492j364j513k316l064l706m338m682m314l183j865j249j814
54309B20068l173m426m812l957j974L24J835K333K630L073K735J094m49k84Q54
54294B15871P79r67k591k696j652k25J260K081J407P6J86K096L527K812J257R21
54278B24142J527J308n9j217j398j266j546k005k006j366n92o01k001m276o083
54263B02561o636o303n640m629l322k360k164k226k061k088k843l694l395j734
$$ plain form
54368 216587 216340 216235 215506 213701 211679 210614 210379 210069 209798 210632 212797 215128 216468 216771 216636 216398 215820
54351 215820 214250 211250 207502 204816 204658 206867 210214 213801 217394 220982 224877 229838 236196 242921
54337 242921 248316 251614 253374 254576 255923 257766 259968 261972 263520 264982 266384 266557 264260 260037
54323 260037 255968 253476 252112 250599 248283 245219 241513 237175 232493 228179 224996 223131 221882 220068
54309 220068 216895 212469 207657 203700 201726 202050 203885 206218 208848 211921 214656 215750 215301 215017 215871
54294 215871 216650 215683 213092 210396 208744 208519 209779 211860 213267 213343 213529 215625 219152 221964 223221 224142
54278 224142 225669 226977 226918 225701 224303 223037 221491 219486 217480 216114 215522 214921 212920 208644 202561
54263 202561 195925 189622 183982 179353 176031 173671 171507 169281 167220 165132 162289 158595 155200 153466
54249A53466R0O76l25k091l305l190k150j314j332j831k058j643p70M0K22k19
54233A34266n98n41q23k280m109m587l471k431k679l486l645l112k456j745j019
54218I7284r53j944l041k771q71J511L113L545L180K546J866J116N43O12J123
54203A06859J024L3m70N59J644N97j851k650q84R61J022O90J704L028K728J263
54187A16257M59M43n7j105j550j230j058j034p8J888L355L056J325o08j720j640
54171A16703q55m62r03j270n80O87J275Q79J57n49j192j161K25K329L494K813
54155A21590Q02j472k977k848j164N49O87n98j869k478k859l100k672j700j114
54140I8777j272j512j400j287j329j024j36P81J165J009M45l35p19j69P23P16
$$ plain form
54249 153466 153556 154232 153907 151816 148511 145321 143171 141857 140525 138694 136636 134993 134223 134263 134485 134266
54233 134266 133668 133127 132304 130024 125915 121328 117857 115426 112747 109261 105616 102504 100048 98303 97284
54218 97284 96331 94387 91346 88575 87704 89215 92328 95873 99053 101599 103465 104581 105124 105736 106859
54203 106859 107883 107916 107446 108005 109649 110246 108395 105745 104861 105822 106844 107534 109238 112266 114994 116257
54187 116257 116716 117159 117102 115997 114447 113217 112159 111125 111047 112935 116290 119346 120671 120063 118343 116703
54171 116703 115848 115386 114483 113213 112633 113320 114595 115474 115631 115082 113890 112729 112954 115283 118777 121590
54155 121590 122392 120920 117943 115095 113931 114480 115167 114569 112700 110222 107363 104263 101591 99891 98777
54140 98777 97505 95993 94593 93306 91977 90953 90817 91598 92763 93772 94217 93882 93163 92994 93717 94433
54124I4433k58q41k43O10N40k34o32k02O72J453J659Q71p86k415l148k905k082
54107H6492r32K71R24O77Q2J12R93J914J954R64l95j345j588j301p07J34J001
54090H9250J298O17o09j412j367r47q18j167j791k393k586k070j049k41j09l13
54074G4293k12K42M86K00j88o0N47J073J323J805K817L632L178J518J4k50K42
54057I0660J25j162k712l171k211r09o08j436k264k198j602j176o50O44K246K836
54041G6412K077J099R48J632K835M234M800L329M79j214n31O43K4j767k364j224
54025I1412L9L89M33O91P48M95N74R72O11q76k122j775l13P89J073J241J713K052
54007I8146J896J576J464J245L20j085j849j159M20J575J735J450J451J893K598
$$ plain form
54124 94433 94175 93334 93091 93701 94241 94007 93375 93173 93845 95298 96957 97828 97042 94627 91479 88574 86492
54107 86492 85560 85831 86755 87432 87514 87626 88619 90533 92487 93451 93056 91711 90123 88822 88115 88249 89250
54090 89250 90548 91165 90556 89144 87777 86830 86012 84845 83054 80661 78075 76005 74956 74715 74606 74293
54074 74293 74081 74323 74809 75009 74821 74761 75308 76381 77704 79509 82326 85958 89136 90654 90668 90418 90660
54057 90660 90785 89623 86911 83740 81529 80620 80012 78576 76312 74114 72512 71336 70686 71330 73576 76412
54041 76412 78489 79588 80536 82168 85003 89237 94037 97366 97845 96631 96100 96743 96767 95000 92636 91412
54025 91412 91451 91840 92273 92964 93712 94207 94781 95753 96364 95488 93366 91591 91278 92067 93140 94381 96094 98146
54007 98146 100042 101618 103082 104327 104647 103562 101713 100554 100974 102549 104284 105734 107185 109078 111676
53992A11676L205L053J709Jm51P95K316K689K216J985K160K145J814J573J622
53977A38508K076L237M905N957N592M493L822L691L669M118N560P171P564O923
53963B07286O872P972Q766P743N267L114K737M109N744N947M514K883K061J244
53949B76259n91k633l320k839k661k915k297o99J52p24k142k761k966l785n052
53934B41026n744n419m485l657l546m206m836m565l647l049k942k710k396k683
53920A87141l207k475j72J843J762lj721k418k203j429m69J84L87M64N50L75m
53903A78605j6N52J273J855K294K133P95j041j683o41O57R76Q53J298K159K669
53887A92738K683K457K096J982K747M119M810M325L752L971M305M007L746M394
$$ plain form
53992 111676 114881 117934 119643 119644 119193 119988 122304 124993 127209 129194 131354 133499 135313 136886 138508
53977 138508 140584 143821 148726 154683 160275 164768 168590 172281 175950 180068 185628 192799 200363 207286
53963 207286 214158 222130 230896 238639 243906 247020 249757 253866 259610 265557 270071 272954 275015 276259
53949 276259 275668 273035 269715 266876 264215 261300 259003 258304 258456 257732 255590 252829 249863 246078 241026
53934 241026 235282 229863 225378 221721 218175 213969 209133 204568 200921 197872 194930 192220 189824 187141
53920 187141 183934 181459 181287 183130 184892 184889 183168 180750 178547 177118 176649 176833 177220 177684 178234 178609 178605
53903 178605 178589 179141 180414 182269 184563 186696 187491 186450 184767 184126 184783 185759 186612 187910 190069 192738
53887 192738 195421 197878 199974 201956 204703 208822 213632 217957 221709 225680 229985 233992 237738 242132
53873B42132N456N980O074O176N862M746L629L288L061K118J155J151J356O18
53859B92802r4J187M016N646M801L131K491K738L075L703M953O072O240N983O412
53844C53156P510Q155P725O855O479O590O229M795K951J870J676J443P78L21K10
53829D16743o16k576m230m366m259n907q571r368p360m921m524o051p948r319
53815C36727r830r054p203n574n192n641n957n983n979n789n218m681m652m958
53801B51016n298n822o501o568n498m112l709m311m642l786k276j474k179l790
53787A91050m671l706j610j84r3k45L09R16O25m6J11J023J570J426J281J214L98
53770A89368j256k401j921l71Q67J191R54O83P68J425K457L269L442L004K038
$$ plain form
53873 242132 247588 253568 259642 265818 271680 276426 280055 283343 286404 288522 289677 290828 292184 292802
53859 292802 292708 293895 297911 303557 308358 311489 313980 316718 319793 323496 328449 334521 340761 346744 353156
53844 353156 360666 368821 376546 383401 389880 396470 402699 407494 410445 412315 413991 415434 416212 416533 416743
53829 416743 416127 413551 409321 404955 400696 394789 386218 376850 369490 364569 360045 353994 346046 336727
53815 336727 326897 317843 310640 305066 299874 294233 288276 282293 276314 270525 265307 260626 255974 251016
53801 251016 245718 239896 233395 226827 221329 217217 213508 209197 204555 200769 198493 197019 194840 191050
53787 191050 186379 182673 181063 180879 180786 180541 180850 181766 182391 182345 182456 183479 185049 186475 187756 188970 189368
53770 189368 188112 185711 183790 183419 184286 185477 186431 187114 187882 189307 191764 195033 198475 201479 203517
53755B03517O29o40j012p58j059k036k000K68L366M872M458L831L893L813L084
53740B24226K622L060L508L113K536K761L431L606L453L775M518N020N435O470
53726B77534P734P753N890L233J255M09L35O57J165J761K521L450M129L951K704
53711C24481O52j746l728m324l418k339k546l875m959n013m220k817j214o81k263
53696B81990m763n560l885j727r60j249j644k417l928m991m112j666M03O26j125
53681B44992l894n893n437k867o88o18j414j049P5j7j533k622k306j616j472j388
53665B12253q77o02j124j662j062P09K719M039M161L043J333O7k62pL35P09J294
53648B25066K186L383M543N029M709M445M892N132L734J108o17l32R11K047L580
$$ plain form
53755 203517 204146 203506 202494 201736 200677 198641 196641 196909 200275 205147 209605 213436 217329 221142 224226
53740 224226 226848 229908 233416 236529 239065 241826 245257 248863 252316 256091 260609 265629 271064 277534
53726 277534 285268 293021 298911 302144 303399 303808 304143 304800 305965 307726 310247 313697 317826 321777 324481
53711 324481 325133 323387 319659 315335 311917 309578 307032 303157 298198 293185 288965 286148 284934 284253 281990
53696 281990 277227 271667 267782 266055 265095 263846 262202 259785 255857 250866 246754 245088 245491 246117 244992
53681 244992 241098 235205 229768 226901 226213 225595 224181 223132 223207 223190 221657 219035 216729 215113 213641 212253
53665 212253 211376 210774 209650 207988 206926 207635 210354 214393 218554 221597 222930 222997 222735 222728 223063 223772 225066
53648 225066 227252 230635 235178 240207 244916 249361 254253 259385 263119 264227 263610 263278 264189 266236 269816
53633B69816O000P970P865O311N511O162O680N666L689K058J044L53M68K156M774
53618C36523O336N811M488M288N264N704M613K931J973J648J025L4m32P1Q95J236
53602C82408R85M91Jl27k56L65J351K252K621K225J148l12j799k844k808j403
53586C84098N60J543Q80m27r52n07l3k29r36j659k006j721p97L81J391K070K223
53569C83879J552L06n06k33N49R49J027J340J784J910J992K661L736M530N017
53554D10493N565N736M811L433L254M769O785Q227R115R511R095Q160P647P619
53540E04220P212O552P058Q943J0205R438Q064Q074Q899Q523O831N669N821O045
53526F11554N350M495M551N276N554M783L315K048J798K543L275L092K312J844
$$ plain form
53633 269816 275816 283786 291651 297962 303473 309635 316315 321981 325670 327728 328772 329125 329593 331749 336523
53618 336523 342859 348670 353158 357446 362710 368414 373027 375958 377931 379579 380604 380638 380206 380277 381172 382408
53602 382408 383393 383884 383885 383558 383302 383667 385018 387270 389891 392116 393264 392952 391153 388309 385501 384098
53586 384098 384658 386201 387081 386654 385702 385195 385162 384933 383997 382338 380332 378611 377814 378195 379586 381656 383879
53569 383879 385431 385737 385231 384998 385547 386496 387523 388863 390647 392557 394549 397210 400946 405476 410493
53554 410493 416058 421794 426605 430038 433292 438061 444846 453073 462188 471699 480794 488954 496601 504220
53540 504220 511432 517984 525042 533985 544190 553628 561692 569766 578665 587188 594019 599688 605509 611554
53526 611554 616904 621399 625950 631226 636780 641563 644878 646926 648724 651267 654542 657634 659946 661790
53512F61790J627P36r04j963j411oO41P7m64M39K670M485M181J912m10j143n18
53495F71739J27J75N8L8k60q35p94N37K497L682L417K188Q54l2j55P35K493M399
53477F90863N670O230O653P196P343O692N979O436Q137R833J0752J1780J4093
53464G97657J7244J9567K0262K0189K0533K1518K2687K3770K4818K5893K6969
53453A041107K7992K8812K9331K9880L1111L3329L6088L8622M0496M1808M3066
53442A421642M4907M7574N0452N2506N3521N4493N6427N8958O0771O1295O1305
53431B023851O1667O2140O1823O0416N8562N7211N7138N8828O2119O5811O8395
53420B697961O9472O9951P0479P0330O8374O4693O0414N6289N2338M8770M6224
$$ plain form
53512 661790 663417 664153 663249 661286 659875 659869 660510 660587 660123 660562 663232 667717 671898 673810 673400 672257 671739
53495 671739 671866 672041 672099 672137 671877 671042 670248 670785 673282 676964 680381 682569 683423 683391 683236 683971 686464 690863
53477 690863 696533 702763 709416 716612 723955 730647 736626 743062 751199 761032 771784 783564 797657
53464 797657 814901 834468 854730 874919 895452 916970 939657 963427 988245 1014138 1041107
53453 1041107 1069099 1097911 1127242 1157122 1188233 1221562 1257650 1296272 1336768 1378576 1421642
53442 1421642 1466549 1514123 1564575 1617081 1670602 1725095 1781522 1840480 1901251 1962546 2023851
53431 2023851 2085518 2147658 2209481 2269897 2328459 2385670 2442808 2501636 2563755 2629566 2697961
53420 2697961 2767433 2837384 2907863 2978193 3046567 3111260 3171674 3227963 3280301 3329071 3375295
53409C375295M4722M3173M0497L6800L3154L0619K9685L0105L0874L0891K9950
53398C755765K8634K6856K3307J7164R752L458r17m844j0002j6417k2791k7999
53386C781966l1844l4848l7723m0851m3898m6146m7379m8296m9880n2454n5338
53375C293309n7380n7839n7027n6044n5660n5555n4898n3530n1956n0210m7557
53364B695653m3684l9494l6005l2921k9202k4865k1088j8191j4583q555o74O669
53352B433060J2038J6388K1369K6980L1672L4582L6844M0397M5721N1222N4934
53341B805207N6724N8460O1842O6392P0125P2218P4164P7844Q3099Q8097R1809
53330C605981R5096R9144J03793J08080J11907J16281J21901J28107J33541J37505
$$ plain form
53409 3375295 3420017 3463190 3503687 3540487 3573641 3604260 3633945 3664050 3694924 3725815 3755765
53398 3755765 3784399 3811255 3834562 3851726 3861478 3864936 3864019 3859175 3849173 3832756 3809965 3781966
53386 3781966 3750122 3715274 3677551 3636700 3592802 3546656 3499277 3450981 3401101 3348647 3293309
53375 3293309 3235929 3178090 3121063 3065019 3009359 2953804 2898906 2845376 2793420 2743210 2695653
53364 2695653 2651969 2612475 2576470 2543549 2514347 2489482 2468394 2450203 2435620 2427065 2426391 2433060
53352 2433060 2445098 2461486 2482855 2509835 2541507 2576089 2612933 2653330 2699051 2750273 2805207
53341 2805207 2861931 2920391 2982233 3048625 3118750 3190968 3265132 3342976 3426075 3514172 3605981
53330 3605981 3701077 3800221 3904014 4012094 4124001 4240282 4362183 4490290 4623831 4761336
53320D761336J40323J42457J43661J43378J41819J40197J39619J39961J39942
53311F032693J38160J33868J27196J19030J10514J02286R4376Q7050Q1140P6859
53301G103172P2737O6965N9716N3018M7915M2948L6057K6997J6787N553p750k3702
53289G500413m1645o0589p9778r8010j13586j25638j35010j43029j49756j54194
53279F399178j56042j56385j56426j56279j55400j53736j51834j50100j48574
53270E014402j47384j46798j46636j46135j44610j41869j37857j32510j26228
53261C744375j19867j13736j07101r9331r1050q3475p6924p0892o5199o0009n4858
53250B801933m8883m2313l6583l2365k8386k2924j5922q952l520r4J612K206K502
$$ plain form
53320 4761336 4901659 5044116 5187777 5331155 5472974 5613171 5752790 5892751 6032693
53311 6032693 6170853 6304721 6431917 6550947 6661461 6763747 6858123 6945173 7026313 7103172
53301 7103172 7175909 7242874 7302590 7355608 7403523 7446471 7482528 7509525 7526312 7531865 7524115 7500413
53289 7500413 7458768 7398179 7318401 7220391 7106805 6981167 6846157 6703128 6553372 6399178
53279 6399178 6243136 6086751 5930325 5774046 5618646 5464910 5313076 5162976 5014402
53270 5014402 4867018 4720220 4573584 4427449 4282839 4140970 4003113 3870603 3744375
53261 3744375 3624508 3510772 3403671 3304340 3213290 3129815 3052891 2981999 2916800 2856791 2801933
53250 2801933 2753050 2710737 2674154 2641789 2613403 2590479 2574557 2565605 2562085 2561991 2563603 2565809 2568311
53237B568311L207M540O317Q382J0852J3932J7680K1764K5529K8460L0766L3284
53225B773024L6777M1338M6306N0657N3755N6051N8690O1926O4379O4583O2884
53214C370370O0910N9471N8136N6682N5475N4133N1386M7012M2744M0326L9567
53203C936212L9046L7898L5897L2741K8355K3426J8597J3488P297J3p739j5578
53191D149653k3481l1470l9795m8751n7731o5305p1118p6723q3390q9949r4236
53180C467704r5946r6429r6179r4403r1054q7412q4339q1439p8446p6018p4726
53169B511313p4328p4571p5409p6181p5821p4516p3747p3968p3492p0852o7073
53158A701355o4225o2395n9678n4952m9304m4570m1383l9090l6793l4101l1267
$$ plain form
53237 2568311 2571518 2576058 2582375 2590757 2601609 2615541 2633221 2654985 2680514 2708974 2739740 2773024
53225 2773024 2809801 2851139 2897445 2948102 3001857 3057908 3116598 3178524 3242903 3307486 3370370
53214 3370370 3431280 3490751 3548887 3605569 3661044 3715177 3766563 3813575 3856319 3896645 3936212
53203 3936212 3975258 4013156 4049053 4081794 4110149 4133575 4152172 4165660 4172957 4172970 4165231 4149653
53191 4149653 4126172 4094702 4054907 4006156 3948425 3883120 3812002 3735279 3651889 3561940 3467704
53180 3467704 3371758 3275329 3179150 3084747 2993693 2906281 2821942 2740503 2662057 2586039 2511313
53169 2511313 2436985 2362414 2287005 2210824 2135003 2060487 1986740 1912772 1839280 1768428 1701355
53158 1701355 1637130 1574735 1515057 1460105 1410801 1366231 1324848 1285758 1248965 1214864 1183597
53147A183597k8960k7645k7037k6317k5068k3780k3184k3154k2567k0592j7965
53136I17328j6487j7033j8437j8777j7536j5947j5345j5839j6708j7394j7722
53125G30103j7418j6123j3996j2068j1525j2402j3281j2862j1644j1417j2850
53114E84517j4504j4698j3412j1542r247o339l821l378n217p646r083r321q688
53101D67621p216n321m139m232m677m306l404l244m225n392n830n833o258p117
53087C96427p349o180m335l294l451l779l562l393l828m045l147k001k176l403
53073C42484l812k821j907k017k013o65J238J933R33r00k644l699l584k457j309
53058C18760q20n94k55l98j485k594k583j890j774k163j679J51K036K514J383
$$ plain form
53147 1183597 1154637 1126992 1099955 1073638 1048570 1024790 1001606 978452 955885 935293 917328
53136 917328 900841 883808 865371 846594 829058 813111 797766 781927 765219 747825 730103
53125 730103 712685 696562 682566 670498 658973 646571 633290 620428 608784 597367 584517
53114 584517 570013 555315 541903 530361 521114 514775 510954 507576 502359 494713 485630 476309 467621
53101 467621 460405 455084 450945 446713 442036 437730 434326 431082 426857 421465 415635 409802 403544 396427
53087 396427 389078 382898 378563 375269 371818 368039 364477 361084 357256 353211 350064 348063 345887 342484
53073 342484 338672 335851 333944 331927 329914 329249 330487 332420 333353 332453 329809 326110 322526 320069 318760
53058 318760 317940 317346 317091 316693 315208 312614 310031 308141 306367 304204 302525 302676 304712 307226 308609
53043C08609n31k205k852k464k063k633l754m139l557l156l627m157l775k849
53029B66847k341k297j969j212q23j391k369k671j871n84K58L42J71L83J051J670
53013B53194J754J306P75O42J008J527J852K016K259K552K661K705L118L908M384
52998B85661L930K676J153k85j370j811j726j779k355l006l253l455m139m998
52984B65243n322n176n171n329n201m967n343o154o222n019l456k517k008j321
52970B02037o16m67q58j355j796k101j944j413j538l053m856m971l135j320j222
52955A71392k234k622j839p82k31j28k74q52j858k702k689j652n5J262J413J21
52939A56270j800l016k912j998j031k91Q6j89j047j761j733j157m81L23J346K123
$$ plain form
53043 308609 308078 305873 303021 300557 298494 295861 292107 287968 284411 281255 277628 273471 269696 266847
53029 266847 264506 262209 260240 259028 258205 256814 254445 251774 249903 249319 249577 249919 250090 250473 251524 253194
53013 253194 254948 256254 257029 257671 258679 260206 262058 264074 266333 268885 271546 274251 277369 281277 285661
52998 285661 289591 292267 293420 293135 291765 289954 288228 286449 284094 281088 277835 274380 270241 265243
52984 265243 259921 254745 249574 244245 239044 234077 228734 222580 216358 211339 207883 205366 203358 202037
52970 202037 201421 200954 200096 198741 196945 194844 192900 191487 189949 186896 182040 177069 173934 172614 171392
52955 171392 169158 166536 164697 163915 163684 163556 163282 162430 160572 157870 155181 153529 153474 154736 156149 156270
52939 156270 154470 151454 148542 146544 145513 145222 145308 145119 144072 142311 140578 139421 138940 139263 140609 142732
52923A42732K233K039K024J807R35J27M46J463J711R71M32L34n96k617l701k234
52907A48106M15J702J185L50n2m89q41k10J248K069J629J060J397K048J929J189
52891A62735P56Q77J024R42R33J202J502J482J045L91j69m08l00J05P64J442J659
52874A75982J267Q90J260K159K634K297J765J630J638J265O87P19J907L832N235
52859B05167N036L531K430L060M666N303M387L378L518M003L307J568N13J009
52845B50876J877J465k37j646j553n02M5n25j505k180k847l941m783m184k267
52830B28093n61r5l76o65j219k337l154k587j172n58j217j773j045L41R96O84
52814B13355K79J79k58j455k579k354p82O25M67r91k197k066j009j95j99n94o89
$$ plain form
52923 142732 144965 147004 149028 150835 151770 151897 152343 153806 155517 156488 156920 157254 156658 154041 150340 148106
52907 148106 148521 150223 151408 151758 151706 151217 150376 150166 151414 153483 155112 156172 157569 159617 161546 162735
52891 162735 163491 164368 165392 166334 167267 168469 169971 171453 172498 172889 172720 172312 172012 172117 172881 174323 175982
52874 175982 177249 178139 179399 181558 184192 186489 188254 189884 191522 192787 193474 194193 196100 199932 205167
52859 205167 210203 213734 216164 219224 223890 229193 233580 236958 240476 244479 247786 249354 249867 250876
52845 250876 252753 254218 253981 252335 250782 250280 250325 249800 248295 246115 243268 239327 234544 230360 228093
52830 228093 227532 227437 227061 226396 225177 222840 219686 217099 215927 215369 214152 212379 211334 211675 212671 213355
52814 213355 213634 213813 213555 212100 209521 207167 206385 207010 207477 206486 204289 202223 201214 201019 200820 200226 199537
52797A99537l63j16l32o72l61P12J628J511Q32R76K357L662L441J950P35N79O46
52780B16722k9r26o07J204K818K415K60j593j825j270j394k117k122r32M28R33
52764B11965O88K34k99p48n31M54J002k78l058n368n685m419l149k825k981k595
52748A82407j433k42L75R49K391M289M939L439J013m55n30q7M13J307K504L044
52732B04323K308R71K57N66J158R66l18j885k582k119j198m01L85J024N61j355
52716B02661l248l367k182j845l177m864n700n961n910m768k328j35L39l97j001
52701A58117j356k007k508k124j569k140l408l704k843k431l022l058j503K90
52687A26734N94j71m71k58r10k878m833n269l954j676O39K350L100K785J483l39
$$ plain form
52797 199537 199174 199058 198726 198054 197693 198405 200033 201544 202376 203352 205709 209371 212812 214762 215497 216076 216722
52780 216722 216693 215767 215160 216364 219182 221597 221857 220264 218439 217169 215775 213658 211536 210604 211032 211965
52764 211965 212653 212887 212588 211840 211309 211763 212765 212487 209429 204061 198376 193957 190808 187983 185002 182407
52748 182407 180974 180732 181107 182056 184447 188736 193675 197114 198127 197672 197142 197055 197468 198775 201279 204323
52732 204323 206631 207602 207859 208425 209583 210549 210231 208346 205764 203645 202447 202046 202431 203455 204016 202661
52716 202661 199413 196046 193864 192019 188842 183978 178278 172317 166407 161639 159311 159176 159515 159118 158117
52701 158117 156761 154754 152246 150122 148553 146413 143005 139301 136458 134027 131005 127947 126444 126734
52687 126734 127328 127157 126686 126428 125518 122640 117807 112538 108584 106908 107547 109897 112997 115782 117265 116926
52671A16926j617j303L11J438O65j354k699k381j066J76R22J198R89L28n12j113
52655A10908j103l82O22J189J099Q87R85R44J48j168k199k609k453j616k33O50
52639A05669J23j072j360o35k56n55j63J355K169Q66r99j015M11O74j000k439
52623A01773j798O8J340J722J948K020J443O15N94J531K401K347J451J57j115
52608A16497j700r31P48J713Q88q29j533m82J372K791L306K823J247q28j740q8
52592A23254L465O443O826M755J980M3o84o00k5J038K474L702M046L488K684K079
52576A64968J418M52l59m75j90j68l58k57p5m87j177r72J33M96q17k369k385j445
52558A55933j535l029m247m013k945j883o33R51J897J307r7p05l4R02J029L37
$$ plain form
52671 116926 115309 114006 114317 115755 116420 115066 112367 109986 108920 109096 110018 111216 112205 112533 112021 110908
52655 110908 109805 109423 110045 111234 112333 113220 114205 115149 115297 114129 111930 109321 106868 105252 105019 105669
52639 105669 105792 104720 103360 102725 102469 101914 101751 103106 105275 106141 105142 104127 104538 105212 104212 101773
52623 101773 99975 100043 101383 103105 105053 107073 108516 109131 109725 111256 113657 116004 117455 117612 116497
52608 116497 114797 113866 114614 116327 117215 116386 114853 114371 115743 118534 121840 124663 125910 125082 123342 123254
52592 123254 126719 133162 139988 144743 146723 146766 146082 145482 145457 146495 148969 152671 156717 160205 162889 164968
52576 164968 166386 166838 166479 166004 165814 165646 165288 165031 164956 164469 163292 162320 162453 162949 162132 159763 157378 155933
52558 155933 154398 151369 147122 143109 140164 138281 137648 138599 140496 141803 141706 141001 140967 141869 142898 143235
52542A43235m55p10k95M59J084J355J389J197M58r15k226k488j510j19Q20J312
52526A42591J874K514K426R59j230k346j141J642L751L544J491m40o80O81K267
52511A57903K702J674Jj190j412r91m87o9M25J059J605J789J521Q78L2o41n50
52494A64249O77K572L930L857K693J490P29N2o95r70n08j25o83j739k103j613
52478A71813j222j305r90L18J800K315J924J416R93M09L6N87J780K444K142J737
52462A86197J816J600J90j681k261q89J186K216J556j07j470j470r9J365J356
52447A89505l27k235k859k091p97M56J528J943J046r29k693l219k703j914j037
52432A73674K38J809K883K688J287l92j244q43K36J121J554J755J549L95j366
$$ plain form
52542 143235 142780 142070 141775 142234 143318 144673 146062 147259 147717 146802 144576 142088 140578 140459 141279 142591
52526 142591 144465 146979 149405 150364 149134 146788 145647 147289 151040 154584 156075 155635 154955 155636 157903
52511 157903 160605 162279 162280 161090 159678 158687 158200 158131 158556 159615 161220 163009 164530 165408 165440 164799 164249
52494 164249 164926 167498 171428 175285 177978 179468 180197 180249 179554 178584 178076 177951 177268 175529 173426 171813
52478 171813 170591 169286 168296 168614 170414 172729 174653 176069 177062 177471 177507 178094 179874 182318 184460 186197
52462 186197 188013 189613 189803 188122 185861 184972 186158 188374 189930 189823 188353 186883 186784 188149 189505
52447 189505 189178 186943 184084 181993 181196 181652 183180 185123 186169 185240 182547 179328 176625 174711 173674
52432 173674 173912 175721 178604 181292 182579 182187 180943 180100 180336 181457 183011 184766 186315 186710 185344
52417A85344k176j031R72J827J104K24K65P28P76O14R13J564J874J590R91K49
52401A95828n85j114q65L3R25J510K018K516K665K335J930J741J456P31p2k72
52385B10780J86O02L87l85j194j540j145j56P42Q47L18J84J083K229K148L57j980
52368B13463l169k516q00N26N88k06p63o07l74p22j175p42M11Q62k37j905k411
52351B00223j139J071K915L484K518O44p87p21N65J842K244J952J627J690K106
52336B20234K437K089R38k68n11L36J268J245K21r50j354p35L55R93P89L08L24
52319B27719P35P07R5l8J156K890L504K548J267Q83J234J504J528J643J686J191
52303B50252M59L80J048J519J285R75J024Q63K85M67K223M123M183K873K457L496
$$ plain form
52417 185344 183168 182137 183109 184936 186040 186264 186529 187257 188033 188647 189560 191124 192998 194588 195579 195828
52401 195828 195243 194129 193264 193297 194222 195732 197750 200266 202931 205266 207196 208937 210393 211124 211052 210780
52385 210780 210966 211568 211955 211570 210376 208836 207691 207535 208277 209124 209442 209626 210709 212938 215086 215443 213463
52368 213463 210294 207778 206978 207504 208092 207886 207123 206516 206142 205420 204245 203503 203914 204776 204539 202634 200223
52351 200223 199084 200155 203070 206554 209072 209716 208929 208208 208773 210615 212859 214811 216438 218128 220234
52336 220234 222671 224760 225698 225430 224919 225255 226523 227768 227989 227039 225685 224950 225305 226298 227087 227395 227719
52319 227719 228454 229161 229256 229218 230374 233264 236768 239316 240583 241466 242700 244204 245732 247375 249061 250252
52303 250252 250711 251091 252139 253658 254943 255918 256942 257805 258090 258557 260780 264903 269086 271959 274416 277912
52287B77912M169L486K858L437L888K392n13k613k615q61J552L205L047J828J670
52272C02842L050L788K515J274K344M199L769J550Q59K322L023J642N90J641K915
52257C38323K389J500K578M812N667M964M774N904P019P088O610O364O541P211
52243D11744Q344R290R329Q689Q231Q389R042R992J0654J0175Q804Q298R755J1850
52229E42586J2608J2177J2108J2626J2641J2093J2131J2829J2836J1710J0618
52218F76963J0137R373Q142Q032R822J1565J1055R134Q555J0055J1507J0991Q970
52205H04301O999N660M601L640K817J856N04o13l10J690M012M780L407J053n45
52190H43852m76Q43K153K340J405N07P27J847K838L514M854P301R653J0436R811
$$ plain form
52287 277912 282081 285567 288425 291862 295750 298142 297629 295016 292401 291540 293092 296297 299344 301172 302842
52272 302842 305892 309680 312195 313469 315813 320012 323781 325331 326190 328512 331535 333177 333767 335408 338323
52257 338323 340712 342212 344790 349602 355269 360233 365007 370911 377930 385018 391628 397992 404533 411744
52243 411744 420088 429378 438707 447396 455627 464016 473058 483050 493704 503879 512683 520981 530736 542586
52229 542586 555194 567371 579479 592105 604746 616839 628970 641799 654635 666345 676963
52218 676963 687100 696473 704615 712647 722469 734034 745089 754223 762778 772833 784340 795331 804301
52205 804301 811300 816960 821561 825201 828018 829874 830378 829765 829455 831145 835157 839937 843344 844397 843852
52190 843852 843376 844219 846372 848712 850117 850624 851351 853198 856036 859550 864404 871705 881358 891794 901605
52175I01605R205R271R350Q918Q531Q858R579R851R588R541J0125J0650J0058
52162A025130Q301O593O111O649O899O017M474L296K827K508J670L73n63m58J57
52147A079984j73j993l892m190l345l356m812o110o017n360n284n340m676l903
52133A021533m132m987n273n077n366n846n103l001j211r12j367j308n34M23J128
52118I78967J181K45j282k430k961l698n130o469o629n453l571j673m30l61j270
52103I39036k267k820l236l740l792k999k066k105l197m355m767m615m558m841
52089H89678n072m790m159l809l962m071l674l193l285l729l772l437l487m015
52075H35223m073l080j799j354j849k519k770k583k169j735j446j405j673k405
$$ plain form
52175 901605 910810 920081 929431 938349 946880 955738 965317 975168 984756 994297 1004422 1015072 1025130
52162 1025130 1033431 1040024 1046135 1052784 1059683 1065700 1070174 1073470 1076297 1078805 1080475 1080848 1080285 1079827 1079984
52147 1079984 1079811 1077818 1073926 1069736 1066391 1063035 1058223 1052113 1046096 1040736 1035452 1030112 1025436 1021533
52133 1021533 1017401 1012414 1007141 1002064 996698 990852 985749 982748 981537 980625 979258 977950 977416 977839 978967
52118 978967 980148 980393 979111 976681 973720 970022 964892 958423 951794 946341 942770 941097 940667 940306 939036
52103 939036 936769 933949 930713 926973 923181 920182 918116 916011 912814 908459 903692 899077 894519 889678
52089 889678 884606 879816 875657 871848 867886 863815 860141 856948 853663 849934 846162 842725 839238 835223
52075 835223 831150 828070 826271 824917 823068 820549 817779 815196 813027 811292 809846 808441 806768 804363
52061H04363l634m867n156l879j352J200K414J863O75N65J931L375L535K701J923
52046H05657J417J055J613L864O751Q242Q186Q463R929J1067J0465R100Q896J0189
52032I04894J1811J2982J3908J5061J6633J8432J9710J9669J8464J7117J6100
52021A084781J4917J3468J2712J3259J4327J4894J4848J4184J2168Q662N365M220
52009A227805M911N180L589R40r48j042K31J421J188n80k911n055o865p909p430
51994A212525n839m983n823o972o695n328m308l908l538l351l617l232j051J641
51980A155521K374J229Q21K186L181K019J35j78Q53J399J068R59J321J188L40
51965A174416j39L83J139J220P60J70q06k469m125m780m765n658q249j1305j2924
$$ plain form
52061 804363 800729 795862 790706 786827 785475 786675 789089 790952 791627 792192 794123 797498 801033 803734 805657
52046 805657 807074 808129 809742 813606 820357 828599 836785 845248 855177 866244 876709 885809 894705 904894
52032 904894 916705 929687 943595 958656 975289 993721 1013431 1033100 1051564 1068681 1084781
52021 1084781 1099698 1113166 1125878 1139137 1153464 1168358 1183206 1197390 1209558 1218220 1223585 1227805
52009 1227805 1232716 1237896 1241485 1242425 1241477 1240435 1240666 1242087 1243275 1242695 1239784 1234729 1227864 1219955 1212525
51994 1212525 1206686 1201703 1195880 1188908 1182213 1176885 1172577 1168669 1165131 1161780 1158163 1154931 1153880 1155521
51980 1155521 1157895 1159124 1159945 1162131 1165312 1167331 1167466 1167288 1168141 1169540 1170608 1171567 1172888 1174076 1174416
51965 1174416 1174277 1174660 1175799 1177019 1177779 1177949 1177143 1174674 1170549 1165769 1161004 1155346 1147097 1135792 1122868
51950A122868j2709j1818j1218j0829j0511j0806j2104j3749j4728j5012j5489
51939I83895j6777j8585k0151k0886k0660j9865j9138j8778j8610j8507j8625
51928G73313j8902j8867j8358j7862j7774j7860j8037j8781j9941j9911j7405
51917E69615j3647j1424j1865j3392j4055j3712j3433j3776j4296j4249j3281
51906D22485j1699j0305r610r249q585p711p128o654n616m156l325l565m145m474
51892C26263m987n927o285n005k789j540k017l023l146k598k707l986n353n387
51878B71513l933k137j113j070j607k317k915l246l432l592l334k134m69K25o06
51863B39833j611j223J79P07o07k795m136l685j864j72n6j348k303j768o27j15
$$ plain form
51950 1122868 1110159 1098341 1087123 1076294 1065783 1054977 1042873 1029124 1014396 999384 983895
51939 983895 967118 948533 928382 907496 886836 866971 847833 829055 810445 791938 773313
51928 773313 754411 735544 717186 699324 681550 663690 645653 626872 606931 587020 569615
51917 569615 555968 544544 532679 519287 505232 491520 478087 464311 450015 435766 422485
51906 422485 410786 400481 390871 381622 373037 365326 358198 351544 345928 341772 338447 334882 330737 326263
51892 326263 321276 315349 309064 304059 301270 299730 297713 294690 291544 288946 286239 282253 276900 271513
51878 271513 267580 265443 264330 263260 261653 259336 256421 253175 249743 246151 242817 240683 240214 240439 239833
51863 239833 238222 236999 237178 237885 237278 234483 230347 226662 224798 224626 224570 223222 220919 219151 218524 218409
51847B18409J89J245K268J666o3p01K89Q94k74k107l110l416l510k798r87N73
51831B08567O38J0J36P12M85l18l40N16Q46jj072j463j433j444j207l23R31J997
51813B07237K666K975K817K051P77o06j556j742j359r42p28n24l45n42r51o36
51797B08592P62K057J768J15j172q53P17K308K914K262R65K04N65J284J207K48
51781B23943p43j323j659j478K2K755N070N214L100L10j375j122P18K965M183
51766B40580L417P78k381m009k751O95L807M508L083J477R22R59O79K8l66q5Q05
51749B52146J894K502K097R65J72M38J370K165K759L808N477O807O674N120L421
51734B97815K819L454M643N803O745P347P561P705Q174Q698Q479P254N592L844
$$ plain form
51847 218409 218598 219843 222111 223777 223714 223013 223302 224196 223922 221815 218705 215289 211779 208981 207994 208567
51831 208567 209205 209215 209351 210063 210548 210230 209890 210406 211252 211251 210179 208716 207283 205839 204632 204309 205240 207237
51813 207237 209903 212878 215695 217746 218523 217917 216361 214619 213260 212318 211590 211066 210721 210179 209228 208592
51797 208592 209354 211411 213179 213294 212122 211269 211986 214294 217208 219470 220435 220639 221204 222488 223695 223943
51781 223943 223200 221877 220218 218740 218762 221517 226587 231801 234901 235211 233836 232714 233432 236397 240580
51766 240580 243997 244775 242394 238385 235634 236329 240136 244644 247727 249204 250126 251085 251764 251792 251426 251341 252146
51749 252146 254040 256542 258639 259604 259776 260214 261584 263749 266508 270316 275793 282600 289274 294394 297815
51734 297815 300634 304088 308731 314534 321279 328626 336187 343892 352066 360764 369243 376497 382089 385933
51720C85933J535j507m112m832l888l061l617n039n935n543m123k516j589j604
51706C40102j854j300J3P08l59k524l845l167j231L76R30R24R81R74M70m93j473
51689C29232k252k879l229l122k718k227j263N43K333K520R78m03q5J111J414
51674C19953O12n7k9M4k13k20M62J365J843J755J257O23M78J372K722K918R98
51657C35883k055m111l837j800J39N77q2k01R81K289K086L27j578k343j535O43
51641C25383L083L822J882j064k346j633j025j745k586k245j305q95q98q02j028
51626C16598k029l017k960k081j148m3J600L060L270K417J402K46j547l435m351
51611C07982m565n328o628o924n471l380j927j136o77p88j512k089k027j874k063
$$ plain form
51720 385933 387468 385961 381849 377017 373129 370068 366451 361412 355477 349934 345811 343295 341706 340102
51706 340102 338248 336948 336961 337669 337310 334786 330941 327774 326543 326919 327849 328773 329754 330728 331198 330705 329232
51689 329232 326980 324101 320872 317750 315032 312805 311542 312085 314418 316938 317916 317513 317428 318539 319953
51674 319953 320565 320508 320479 320523 320310 320090 320552 321917 323760 325515 326772 327395 327873 329245 331967 334885 335883
51657 335883 333828 329717 325880 324080 324219 324796 324714 324513 325494 327783 329869 330196 328618 326275 324740 325383
51641 325383 328466 332288 334170 333106 330760 329127 328102 326357 323771 321526 320221 319326 318428 317626 316598
51626 316598 314569 311552 308592 306511 305363 305320 306920 309980 313250 315667 317069 317315 315768 312333 307982
51611 307982 303417 298089 291461 284537 279066 275686 273759 272623 271946 271158 269646 267557 265530 263656 261593
51596B61593j914p23Q19J456J163R66J226J258O50p4m42p62j337j639r10O38J846
51579B63814J932J307Q98R70R95N43j30m84l45J25P66J444J960K229K356K241
51563B80621J390l24j963k230r14R37K294L035L414L336K654J814J696K775M623
51548C03158O115O191M623K227J77q54q78k38M56L24j029k704l115j753K37J506
51532C14443J988K554L717N061N782N357L993K537J721J384Q33j6n39n29n52r36
51516C46798j150q61o87j144j575j145m21p51k292l747m170l976l952m070l743
51501C13114k789j709j131j107j006l05M64K19j027j889j581j162j785k611k001
51486B93694j87J011R25N99N49%j167j713j201j102k373l512k609j18J996K987
$$ plain form
51596 261593 259679 258956 259775 261231 262394 263360 264586 265844 266494 266420 265978 265216 263879 262240 261330 261968 263814
51579 263814 265746 267053 267951 268921 269916 270459 270329 269845 269500 269625 270391 271835 273795 276024 278380 280621
51563 280621 282011 281687 279724 277494 276580 277517 279811 282846 286260 289596 292250 294064 295760 298535 303158
51548 303158 309273 315464 320087 322314 322491 321637 320759 320521 320977 321301 320272 317568 314453 312700 312937 314443
51532 314443 316431 318985 322702 327763 333545 338902 342895 345432 347153 348537 349370 349354 348815 348286 347734 346798
51516 346798 345648 344787 344100 342956 341381 340236 339815 339064 336772 333025 328855 324879 320927 316857 313114
51501 313114 310325 308616 307485 306378 305372 305067 305531 305750 304723 302834 301253 300091 298306 295695 293694
51486 293694 293507 294518 295443 296042 296591 296591 295424 293711 292510 291408 289035 285523 282914 282796 284792 287779
51470B87779L463L635L249K843L260M020L865K913K596L272L556K580J426J565
51456C30022K900M201M598M079L164K664L111L899L631J769n30j643r74R24L086
51441C64901M572M907M473L999L583K916K434L010M184M140K307N10M02R54K19
51426D07511j356j440N33K266J560j112l627m585m035k769j810j917k963m036
51412C82220m452m246l639k677j825j941l108m078l545j636L68J392J239M08j66
51397C54314L21J596K253J307n32j770j996j941k063k059j746j388j019m23p4
51382C44780r65k947m233l521j834j275k443m134n245n718n681m965l842l179
51368B94798l252l229k490j816k350l837m802m409l348k744k774k659j741l34
$$ plain form
51470 287779 291242 294877 298126 300969 304229 308249 312114 315027 317623 320895 324451 327031 328457 330022
51456 330022 332922 337123 341721 345800 348964 351628 354739 358638 362269 364038 363508 361865 360891 361815 364901
51441 364901 369473 374380 378853 382852 386435 389351 391785 394795 398979 403119 405426 405936 406338 407292 407511
51426 407511 406155 404715 405248 407514 409074 407962 404335 399750 395715 392946 391136 389219 386256 382220
51412 382220 377768 373522 369883 367206 365381 363440 360332 356254 352709 351073 351441 352833 354072 354480 354314
51397 354314 354635 356231 358484 359791 359259 357489 355493 353552 351489 349430 347684 346296 345277 344854 344780
51382 344780 343815 340868 336635 333114 331280 330005 327562 323428 318183 312465 306784 301819 297977 294798
51368 294798 291546 288317 285827 284011 281661 277824 273022 268613 265265 262521 259747 257088 255347 255013
51354B55013N04M0j212j887j218J72J087J000J91q36j499j204p9N87l36k079k630
51337B45614j398j01m18j756k252j262K61J385J897J485l18k913m462l887k275
51322B29600j346r35O95L908O373N537J860j504k077k77J814K836K725J757J22
51307B51088j579k337j718m49L05Q7n67r47j015j321k114k784k603j876j704k419
51291B28047k975k473j592j651k682l490l382k699j698j67J491K019Q07j165k508
51276B05882k780k225j035L44R85L60j037k547m143n580n749m125k137j681k497
51261A72035k631j380j70p0j36Q57K255K448J268J53P0M14J71o51j191q83m2O08
51243A73125O54K80MJ11K87j47j420k811l215k358j093k58L74J473K690K724J032
$$ plain form
51354 255013 255517 255557 254345 252458 251240 251412 252499 253499 253690 252854 251355 250151 250072 250659 250323 248244 245614
51337 245614 244216 244115 243697 241941 239689 238427 238688 240073 241970 243455 243137 240224 235762 231875 229600
51322 229600 228254 227319 228014 231922 238295 243832 245692 244188 242111 241834 243648 246484 249209 250966 251088
51307 251088 249509 247172 245454 245005 245310 245397 244830 243883 242868 241547 239433 236649 234046 232170 230466 228047
51291 228047 225072 222599 221007 219356 216674 213184 209802 207103 205405 205238 206729 208748 209555 208390 205882
51276 205882 203102 200877 199842 200186 201171 201531 200494 197947 193804 188224 182475 178350 176213 174532 172035
51261 172035 169404 168024 167854 167784 167648 168505 170760 173208 174476 174629 174699 175113 175284 174633 173442 172559 172517 173125
51243 173125 173779 174059 174063 174174 174461 174314 172894 170083 166868 164510 163417 163159 163533 165006 167696 170420 171452
51226A71452j239k461k162j093j38L05K54k6k83n76j014j061P4K024L139K492
51210A69687J252J053J697J741P74k74r07j584k345k399j550q18r35j354j308
51195A62730j010r47r08m97kJ00k3m2k62j077j918j717l45J171J895J804J339
51178A60291Q92R01J769L216M099L461J702J90k35J5K09L94J011J862K259K140
51162A84176K110K124J254o47k077j687j56R01J246J722K191J572l1j062p54M
51146A90886N45J414K626K763J148n40m61O55P63l21r77n46j0P0M07J352K130
51129B01904K292K455K820K378O46q91m93J265K044P93r91j340j94Q70O26p44
51113B13440k371l656m342m240l454k636k493k883k861j815j47J301K125K279
$$ plain form
51226 171452 170213 167752 165590 164497 164359 164664 164918 164892 164609 164033 163019 161958 162032 164056 167195 169687
51210 169687 170939 171992 173689 175430 176204 175930 175023 173439 171094 168695 167145 166327 165392 164038 162730
51195 162730 161720 160773 159865 159368 159366 159466 159443 159401 159139 158062 156144 154427 154082 155253 157148 158952 160291
51178 160291 161183 162084 163853 167069 171168 174629 176331 176521 176286 176301 176510 176904 177915 179777 182036 184176
51162 184176 186286 188410 189664 189017 186940 185253 185097 185998 187244 188966 191157 192729 192698 191636 190882 190886
51146 190886 191431 192845 195471 198234 199382 198842 198381 199036 199799 199478 198501 197955 197945 198015 198422 199774 201904
51129 201904 204196 206651 209471 211849 212495 211604 211111 212376 214420 215213 214222 212882 212688 213558 214184 213440
51113 213440 211069 207413 203071 198831 195377 192741 190248 187365 184504 182689 182542 183843 185968 188247
51099A88247J562j16k043k856j797L84K068K290J513Q25N93K60n13j096p71K9
51083A88579J45p15j619j679r05L19J675K511J988K71j267j680j475j339q15O25
51067A84619K025J974P77J54Q12J766K145K140J823N38j652l049k112M80K587
51052A95027L100K714K335J783N17j004j444n8K362M196M428L260J694R24J839
51037B21673M130N887N216K694J086J740K626J343j061j536K19J152m53k305j724
51022B40687J73K47j885l452k766j355j171j674j141L53J018R5j062j131p80j566
51006B24590l350m122k556K15J977J901Q90j7o02q82o91j17L30M04L76L30j53
50989B18523j169j959j781p86M24J540K309K046N03j108r16J432M178N332M583
$$ plain form
51099 188247 189809 189693 187650 184794 182997 183381 185449 187739 189252 190077 190670 190930 190417 189321 188550 188579
51083 188579 188724 188009 186390 184711 183806 184125 185800 188311 190299 190570 189303 187623 186148 184809 183994 184619
51067 184619 186644 188618 189395 189549 190361 192127 194272 196412 198235 198773 197121 194072 191960 192440 195027
51052 195027 198127 200841 203176 204959 205476 204472 203028 202970 205332 209528 213956 217216 218910 219834 221673
51037 221673 225803 231690 236906 239600 240686 242426 245052 246395 245334 243798 244017 245169 244716 242411 240687
51022 240687 240860 241107 239222 235770 233004 231649 230478 228804 227663 228016 229034 229129 228067 226936 226156 224590
51006 224590 221240 217118 214562 214777 216754 218655 219545 219528 218926 218044 217353 217236 217566 217970 218346 218676 218523
50989 218523 217354 215395 213614 212828 213252 214792 217101 219147 219650 218542 217626 219058 223236 228568 233151
50974B33151L075J844J147R70J393K136K353J435j05j110j131p70m80J46J482
50959B45536K864L491L843N052O871P517N962L363J559R99R10Q56J212K274L647
50944B95956M422L814K019P03J871N480Q801R145O916N015N420P287Q449P850
50930C73148O244N264O117Q606J1136J2111J1423J0320R846J0005J0386J0904
50918D85510J1644J2516J3403J4322J5200J5845J6318J6994J8084J9407K0756
50907F59999K2225K3936K5781K7594K9505L1931L5159L8733M1306M1592L9968
50896A017729L8686L9814M3027M6006M6825M5371M2675L9773L7190L4685L1335
50885A463116K6596K1314J6964J3851J1076Q237N909M166K042q08l212m092l951
$$ plain form
50974 233151 236226 238070 239217 240187 241580 243716 246069 247504 247399 246289 245158 244388 243908 244054 245536
50959 245536 248400 251891 255734 260786 267657 275174 281136 284499 286058 287057 287967 288823 290035 292309 295956
50944 295956 300378 304192 306211 306914 308785 314265 323066 332211 339127 344142 349562 356849 365298 373148
50930 373148 379392 384656 390773 399379 410515 422626 434049 444369 454215 464220 474606 485510
50918 485510 497154 509670 523073 537395 552595 568440 584758 601752 619836 639243 659999
50907 659999 682224 706160 731941 759535 789040 820971 856130 894863 936169 977761 1017729
50896 1017729 1056415 1096229 1139256 1185262 1232087 1277458 1320133 1359906 1397096 1431781 1463116
50885 1463116 1489712 1511026 1527990 1541841 1552917 1561154 1567063 1571229 1573271 1572463 1569251 1565159 1561208
50872A561208l710l194k017j110j847m195p092j0240j4003j7904k0828k2819k5116
50859A427133k8211l1200l3424l5297l7042l7997l7910l7717l8084l8093l6400
50848A035758l3060k9253k5766k2727k0361j9045j8517j7834j6205j3619j0718
50837H08653q393p121o419n211l140j079J7L55P87J598K477L357M476N591N986
50822H01934N460M814N042O267P681Q365Q135P569P251P133O900O722P123Q040
50808H98436Q758R057R674J1162J2973J4264J5088J6041J7271J8579K0152K2314
50796A073769K4907K7678L0983L5160L9521M2929M5356M7920N1345N5310N9429
50785A534307O4016O9560P5986Q2594Q8278R2064R4103R5837R8328J00723J01404
$$ plain form
50872 1561208 1557498 1554304 1552287 1551177 1549330 1545135 1538043 1527803 1513800 1495896 1475068 1452249 1427133
50859 1427133 1398922 1367722 1334298 1299001 1261959 1223962 1186052 1148335 1110251 1072158 1035758
50848 1035758 1002698 973445 947679 924952 904591 885546 867029 849195 832990 819371 808653
50837 808653 800260 793139 786720 781509 778369 777290 777307 777662 778449 780047 782524 785881 790357 795948 801934
50822 801934 807394 812208 817250 823517 831198 839563 847698 855267 862518 869651 876551 883273 890396 898436
50808 898436 907194 916251 925925 937087 950060 964324 979412 995453 1012724 1031303 1051455 1073769
50796 1073769 1098676 1126354 1157337 1192497 1232018 1274947 1320303 1368223 1419568 1474878 1534307
50785 1534307 1598323 1667883 1743869 1826463 1914741 2006805 2100908 2196745 2295073 2395796 2497200
50774B497200J00281R8375R5265Q8925P8744O7068N6513M7153L7567K7710J8983
50763C213784J2025N996K14m695p536p749n705k286J547M966P261P734O084K808
50749C234448j357o480j3225k1493l0211l8767m7486n6038o2555o5524o5782o5342
50737B760188o4811o3315o0508n7050n2956m7058l8827k9735k2048j6521j1808
50726B295551o055J223Q941J5936K2284K8578L4333L8151L9679M0174M0553M0103
50714B599451L8036L4982L1619K6901J9670J1245M288p88o138j3024k0159k6169
50702B699914l1722l8074m4869n0745n5093n8129n9944o0635o0855o1155o1110
50691B117583n9792n6947n3054m8579m3845l9245l5007l0826k6216k1107j5787
$$ plain form
50774 2497200 2597481 2695856 2791121 2880046 2958790 3025858 3082371 3129524 3167091 3194801 3213784
50763 3213784 3225809 3231805 3232019 3227324 3219788 3212039 3206334 3204048 3205595 3210561 3217822 3225556 3231640 3234448
50749 3234448 3233091 3226611 3213386 3191893 3161682 3122915 3075429 3019391 2956836 2891312 2825530 2760188
50737 2760188 2695377 2632062 2571554 2514504 2461548 2414490 2375663 2345928 2323880 2307359 2295551
50726 2295551 2289496 2290719 2299660 2315596 2337880 2366458 2400791 2438942 2478621 2518795 2559348 2599451
50714 2599451 2637487 2672469 2704088 2730989 2750659 2761904 2766192 2765404 2759266 2746242 2726083 2699914
50702 2699914 2668192 2630118 2585249 2534504 2479411 2421282 2361338 2300703 2239848 2178693 2117583
50691 2117583 2057791 2000844 1947790 1899211 1855366 1816121 1781114 1750288 1724072 1702965 1687178
50680A687178j0469n201K4N175J0026J4127J7433K0877K5679L1919L8361M3935
50668A879064M8630N2906N6974O0947O4839O7995O9396O8913O7522O5808O3139
50657B566133N8900N3563M7788M1302L3576K5028J6632Q825J543n141j1138j6561
50645B820450k0974k3125k2331j9593j6336j2690q124l211P62L790P110J1032
50633B716760J4103J4875J3408J0559O854K705j080l908o127q547j1264j3359
50621B734979j3562j1191o705j528K956O459R791J3956J9409K5993L3154M0350
50609B854061M7641N5698O4924P4783Q4413R3598J02475J10641J17311J22128
50599C727673J24853J24476J19852J11523J01801R2500Q3451P3700O3261N2927
$$ plain form
50680 1687178 1676709 1671508 1671532 1676707 1686733 1700860 1718293 1739170 1764849 1796768 1835129 1879064
50668 1879064 1927694 1980600 2037574 2098521 2163360 2231355 2300751 2369664 2437186 2502994 2566133
50657 2566133 2625033 2678596 2726384 2767686 2801262 2826290 2842922 2851747 2853290 2848149 2837011 2820450
50645 2820450 2799476 2776351 2754020 2734427 2718091 2705401 2697277 2694066 2694828 2698618 2705728 2716760
50633 2716760 2730863 2745738 2759146 2769705 2776559 2779264 2778184 2774276 2768149 2759602 2748338 2734979
50621 2734979 2721417 2710226 2703521 2701993 2704949 2711408 2721199 2735155 2754564 2780557 2813711 2854061
50609 2854061 2901702 2957400 3022324 3097107 3181520 3275118 3377593 3488234 3605545 3727673
50599 3727673 3852526 3977002 4096854 4208377 4310178 4402678 4486129 4559829 4623090 4676017
50589D676017M3058L3449K3892J4193L940o925j7427k6178l2643l7329m0855m3283
50577D589909m4243m3157l9470l3273k5846j9034j3830r817o071k274J081L217
50565D357192L462J432k718q147j3849j9424k5127l0944l5786l8159l7735l5804
50553D114393l3811l1708k8326k3197j7223j1316n198J724Q730J3877J5757J4602
50541D018304J1561P457K511l337j0475j9620l1035m3757n6129o7173p6891q5273
50529C646143r1833r6501j00027j02650j03066r9925r4057q7891q2572p7041p0423
50518B640157o3787n8509n4060m8837m2503l6044l0059k4482j9851j7077j5641
50507B229307j3619j0129o359l337m2M870J0524J4625J6467J7724K0266K4472
$$ plain form
50589 4676017 4719075 4752524 4776416 4790609 4794549 4787624 4770197 4744019 4711376 4674047 4633192 4589909
50577 4589909 4545666 4502509 4463039 4429766 4403920 4384886 4371056 4361239 4355168 4352894 4353975 4357192
50565 4357192 4360654 4362086 4359368 4351221 4337372 4317948 4292821 4261877 4226091 4187932 4150197 4114393
50553 4114393 4080582 4048874 4020548 3997351 3980128 3968812 3963614 3965338 3974068 3987945 4003702 4018304
50541 4018304 4029865 4037322 4039833 4036496 4026021 4006401 3975366 3931609 3875480 3808307 3731416 3646143
50529 3646143 3554310 3457809 3357782 3255132 3152066 3052141 2958084 2870193 2787621 2710580 2640157
50518 2640157 2576370 2517861 2463801 2414964 2372461 2336417 2306358 2281876 2262025 2244948 2229307
50507 2229307 2215688 2205559 2199200 2195863 2195821 2200691 2211215 2225840 2242307 2260031 2280297 2304769
50495B304769K9803L5771M1782M7153N2003N7543O4634P2608Q0149Q6994R3933
50484B967142J01346J08485J14317J18306J20179J19541J16353J11466J06171
50475C983306J01214R6616R2473Q9530Q8536Q9176R0015Q9755Q8442Q7204Q6833
50464D983100Q7208Q8225R0655R5254J01332J07084J11514J15175J18691J21455
50454F019693J22370J21035J17322J10406R9523Q5328O9266N1580L1140P580j7569
50443F817674m2252o5447q6725j05392j20875j33278j42530j47631j47633j42916
50433E682995j34459j22303j06033q6747o7136m9172l2605j6455j245J0927J8145
50422E095912J9688J5483N384j0414l0559n2800p5248r7122j18003j36724j51585
$$ plain form
50495 2304769 2334572 2370343 2412125 2459278 2511281 2568824 2633458 2706066 2786215 2873209 2967142
50484 2967142 3068488 3176973 3291290 3409596 3529775 3649316 3765669 3877135 3983306
50475 3983306 4084520 4181136 4273609 4363139 4451675 4540851 4630866 4720621 4809063 4896267 4983100
50464 4983100 5070308 5158533 5249188 5344442 5445774 5552858 5664372 5779547 5898238 6019693
50454 6019693 6142063 6263098 6380420 6490826 6590349 6675677 6744943 6796523 6827663 6835243 6817674
50443 6817674 6775422 6709975 6623250 6517858 6396983 6263705 6121175 5973544 5825911 5682995
50433 5682995 5548536 5426233 5320200 5233453 5166317 5117145 5084540 5068085 5066840 5077767 5095912
50422 5095912 5115600 5131083 5136467 5126053 5095494 5042694 4967446 4870324 4752321 4615597 4464012
50411D464012j61588j66999j68643j67299j63880j59344j53971j47323j39312
50402C035653j30727j22202j13469j04275r5376q7586q0371p2595o4457n7424
50392B107171n2078m7114m1012l3976k7630k3158k0175j7290j3716j0197q033
50381A812792p077n334j322L905Q010J0352J2487J5679J9260K1773K2875K3569
50369A936969K5284K9001L4489L9992M3428M4453M4798M6294M9077N2088N4537
50358B400410N6484N8337O0345O2224O3245O3096O2690O3408O5468O7933P0390
50347C094030P3447P7135Q0110Q1350Q1652Q2328Q3102Q2499P9898P6052P1718
50336C963321O6740O0617N3191M4646L5207K4861J3118n90j5964l1769m7124o2194
$$ plain form
50411 4464012 4302424 4135425 3966782 3799483 3635603 3476259 3322288 3174965 3035653
50402 3035653 2904926 2782724 2669255 2564980 2469604 2382018 2301647 2229052 2164595 2107171
50392 2107171 2055093 2007979 1966967 1932991 1905361 1882203 1862028 1844738 1831022 1820825 1812792
50381 1812792 1805715 1800381 1799059 1802964 1810974 1821326 1833813 1849492 1868752 1890525 1913400 1936969
50369 1936969 1962253 1991254 2025743 2065735 2109163 2153616 2198414 2244708 2293785 2345873 2400410
50358 2400410 2456894 2515231 2575576 2637800 2701045 2764141 2826831 2890239 2955707 3023640 3094030
50347 3094030 3167477 3244612 3324722 3406072 3487724 3570052 3653154 3735653 3815551 3891603 3963321
50336 3963321 4030061 4090678 4143869 4188515 4223722 4248583 4261701 4261111 4245147 4213378 4166254 4104060
50324D104060p6970r0090r9799j05570j07859j06885j02920r7262r1393q4997
50314C140315p6438o5382n3639m2858l2831k2824j3291n241R71M908N064L12p924
50301B831142j6707k5001l4346m5568n6339o3488o6882o9337p2799p6157p7298
50290B227220p5956p3526p0934o8019o4689o1367n7976n3689m8284m3018l9312
50279A570450l6955l4371l0595k6273k2681k0287j8491j6412j3656j0391p096
50268A333242m345k678k302k631k366n70K297M829O190O820P483Q398R547J1227
50254A375141J3457J5368J5985J5549J5212J5353J5054J3665J2211J2474J4793
50243A534262J7404J8237J7057J5491J5090J5823J6661J7033J6999J6112J3236
$$ plain form
50324 4104060 4027090 3937000 3837201 3731631 3623772 3516887 3413967 3316705 3225312 3140315
50314 3140315 3063877 2998495 2944856 2901998 2869167 2846343 2833052 2827811 2828782 2833690 2838754 2839066 2831142
50301 2831142 2814435 2789434 2755088 2709520 2653181 2589693 2522811 2453474 2380675 2304518 2227220
50290 2227220 2151264 2077738 2006804 1938785 1874096 1812729 1754753 1701064 1652780 1609762 1570450
50279 1570450 1533495 1499124 1468529 1442256 1419575 1399288 1380797 1364385 1350729 1340338 1333242
50268 1333242 1328897 1326219 1323917 1321286 1318920 1318350 1320647 1325476 1331666 1338486 1345969 1354367 1363914 1375141
50254 1375141 1388598 1403966 1419951 1435500 1450712 1466065 1481119 1494784 1506995 1519469 1534262
50243 1534262 1551666 1569903 1586960 1602451 1617541 1633364 1650025 1667058 1684057 1700169 1713405
50232A713405Q092K330j879m115n761p869r879j0804j0916j1567j3628j6801k0321
50219A610287k3706k6570k8307k8467k7280k5473k3618k1895k0443j9417j8715
50208A346396j7997j7185j6587j6381j6386j6414j6268j5291j2767r389p329p711
50196A176691q783p968n342l387l331l682k946j890j792k027j154N30J309O79
50182A136907j20k06k22r31j928k431k543k853l284l092k022r68j148k699m332
50167A108128m663l812l235l869n012n412m911m392m405m549m218l413k639k323
50153A051275k384k336j866j225p58j52J086K443K670J663R75J683K808K864K115
50138A060861J867K110J572l4j404j624j370j657k373k691k197j215m52o22j817
$$ plain form
50232 1713405 1721497 1723827 1721948 1717833 1712072 1704203 1694324 1683520 1672604 1661037 1647409 1630608 1610287
50219 1610287 1586581 1560011 1531704 1503237 1475957 1450484 1426866 1404971 1384528 1365111 1346396
50208 1346396 1328399 1311214 1294627 1278246 1261860 1245446 1229178 1213887 1201120 1191731 1184402 1176691
50196 1176691 1167908 1159940 1154598 1151211 1147880 1144198 1141252 1139362 1137570 1135543 1134389 1134919 1136228 1136907
50182 1136907 1136787 1136581 1136359 1135428 1133500 1131069 1128526 1125673 1122389 1119297 1117275 1116307 1115159 1112460 1108128
50167 1108128 1103465 1099653 1096418 1092549 1087537 1082125 1077214 1072822 1068417 1063868 1059650 1056237 1053598 1051275
50153 1051275 1048891 1046555 1044689 1043464 1042706 1042554 1043640 1046083 1048753 1050416 1051391 1053074 1055882 1058746 1060861
50138 1060861 1062728 1064838 1066410 1066376 1064972 1063348 1061978 1060321 1057948 1055257 1053060 1051845 1051393 1050771 1048954
50123A048954l193l715l167j935j07K293M444N300N027M697M551L836K684K493
50109A072162L887N606O369O705P871R897J1791J2968J3417J3037J1974J1156
50097A186840J1454J2515J3308J3542J3708J4034J4412J5078J6444J8154J9261
50086A348750J9525J9856K1252K3721K6410K8385K9287K9549K9990L0902L1774
50075A639401L2176L2540L3666L5758L8449M1232M3470M4600M5294M7750N3478
50064B087814O0973O7050P0683P4169Q0132Q8744R8716J09563J21748J35347J49888
50053C144827J65106J80812J96473K11750K26905K41303K52013K55621K51537
50044E126347K41945K28319K10049J87429J64062J44303J29315J17366J07219
$$ plain form
50123 1048954 1045761 1042046 1038879 1036944 1036837 1039130 1043574 1048874 1053901 1058598 1063149 1066985 1069669 1072162
50109 1072162 1076049 1081655 1088024 1094729 1102600 1112497 1124288 1137256 1150673 1163710 1175684 1186840
50097 1186840 1198294 1210809 1224117 1237659 1251367 1265401 1279813 1294891 1311335 1329489 1348750
50086 1348750 1368275 1388131 1409383 1433104 1459514 1487899 1517186 1546735 1576725 1607627 1639401
50075 1639401 1671577 1704117 1737783 1773541 1811990 1853222 1896692 1941292 1986586 2034336 2087814
50064 2087814 2148787 2215837 2286520 2360689 2440821 2529565 2628281 2737844 2859592 2994939 3144827
50053 3144827 3309933 3490745 3687218 3898968 4125873 4367176 4619189 4874810 5126347
50044 5126347 5368292 5596611 5806660 5994089 6158151 6302454 6431769 6549135 6656354
50035F656354R8884R1114Q0465O3757M0023R417k8007p1054j16228j59318j97694
50024F467713k29937k54087k67990k71478k66911k57336k44857k30707k15703
50015D228707k00140j83947j67476j51777j37815j25542j14025j02423r1029q1150
50005B873383p3625o7546o1163n4181m7974m3210l8708l3665k9467k7503k6350
49994B369991k3401j8712j4809j2700j0637p338l928j681M7K118L715L863L515
49981B290043M353O370Q296R745J1346J3244J4959J6485J8169J9741K0637K1245
49969B454633K2676K5299K8394L1256L3799L6204L8749M1876M5653M9359N2291
49958B860189N4790N7764O1453O5382O9284P3311P7574Q2194Q7567R3920J00825
$$ plain form
50035 6656354 6755238 6846352 6926817 6990574 7030597 7040014 7012007 6940953 6824725 6665407 6467713
50024 6467713 6237776 5983689 5715699 5444221 5177310 4919974 4675117 4444410 4228707
50015 4228707 4028567 3844620 3677144 3525367 3387552 3262010 3147985 3045562 2954533 2873383
50005 2873383 2799758 2732212 2671049 2616868 2568894 2525684 2486976 2453311 2423844 2396341 2369991
49994 2369991 2346590 2327878 2313069 2300369 2289732 2282394 2278466 2276785 2276832 2278950 2282665 2286528 2290043
49981 2290043 2294396 2300766 2309062 2318807 2330153 2343397 2358356 2374841 2393010 2412751 2433388 2454633
49969 2454633 2477309 2502608 2531002 2562258 2596057 2632261 2671010 2712886 2758539 2807898 2860189
49958 2860189 2914979 2972743 3034196 3099578 3168862 3242173 3319747 3401941 3489508 3583428 3684253
49947C684253J07882J15399J23683J32320J41278J52047J66351J83906K02979
49938E010098K22934K44768K68941K94263L19403L44101L68068L89642M06183
49929G868401M15174M14657M03859L84226L59280L32872L07869K86367K69663
49920A1042368K57090K45629K31651K12639J86701J51439J04671M6397k0679r2310
49910A2365596j63872k30905k89980l39612l79920m11200m33267m46416m52332
49901I218092m53160m49719m41283m27459m09664l90027l69242l46553l22008
49892E608977k97492k74832k53845k33332k13305j94932j78726j64154j50972
49883C647387j39541j29529j19732j09701j00560r3507q8320q3908p9717p5903
$$ plain form
49947 3684253 3792135 3907534 4031217 4163537 4304815 4456862 4623213 4807119 5010098
49938 5010098 5233032 5477800 5746741 6041004 6360407 6704508 7072576 7462218 7868401
49929 7868401 8283575 8698232 9102091 9486317 9845597 10178469 10486338 10772705 11042368
49920 11042368 11299458 11545087 11776738 11989377 12176078 12327517 12432188 12478585 12457906 12365596
49910 12365596 12201724 11970819 11680839 11341227 10961307 10550107 10116840 9670424 9218092
49901 9218092 8764932 8315213 7873930 7446471 7036807 6646780 6277538 5930985 5608977
49892 5608977 5311485 5036653 4782808 4549476 4336171 4141239 3962513 3798359 3647387
49883 3647387 3507846 3378317 3258585 3148884 3048324 2954817 2866497 2782589 2702872 2626969
49873B626969p2718p0220o8234o6239o3658o0412n6681n2254m7013m2057l8939
49862A988544l7315l4767k9893k4413k0927j9585j8344j5879j2717r757p163m938
49850A752846l405k651k105r34J401M718P851R387R444J0077J2924J6834J9245
49837A835632J9552J9639K0978K2998K4834K7075L0657L5255L9971M4864N0435
$$ plain form
49873 2626969 2554251 2484031 2415797 2349558 2285900 2225488 2168807 2116553 2069540 2027483 1988544
49862 1988544 1951229 1916462 1886569 1862156 1841229 1821644 1803300 1787421 1774704 1764947 1757784 1752846
49850 1752846 1749441 1746790 1744685 1743751 1745152 1749870 1757721 1767108 1776552 1786629 1799553 1816387 1835632
49837 1835632 1855184 1874823 1895801 1918799 1943633 1970708 2001365 2036620 2076591 2121455 2171890
$$ [...]
##END NTUPLES=NMR SPECTRUM
##END=
