##TITLE=coffee_type CCIN01-ROVE100_60-40%
COFFEE_meoh_noesyp64 COFFEE_meoh {C:\Bruker\TOPSPIN} Administrator 5
##JCAMPDX= 6.0         $$ Bruker NMR JCAMP-DX V2.0
##DATA TYPE= NMR SPECTRUM
##DATA CLASS= NTUPLES
##ORIGIN= Bruker BioSpin GmbH
##OWNER= Administrator
$$ 1.72 TOPSPIN		Version 2.1
$$ 2012-05-18 15:51:07.745 -0700  Administrator@X
$$ Compression mode = diff/dup
##.OBSERVE FREQUENCY= 400.13188235
##.OBSERVE NUCLEUS= ^1H
##.ACQUISITION MODE= SIMULTANEOUS (DQD)
##.ACQUISITION SCHEME= undefined
##.AVERAGES= 64
##.DIGITISER RES= 22
##SPECTROMETER/DATA SYSTEM= spect
##.PULSE SEQUENCE= noesygpps1d.comp
##.SOLVENT NAME= COFFEE_meoh
##.SHIFT REFERENCE= INTERNAL, COFFEE_meoh, 1, 14.98061
##AUDIT TRAIL= $$ (NUMBER, WHEN, WHO, WHERE, PROCESS, VERSION, WHAT)
$$ ##TITLE= Audit trail, TOPSPIN		Version 2.1
$$ ##JCAMPDX= 5.01
$$ ##ORIGIN= Bruker BioSpin GmbH
$$ ##OWNER= Administrator
$$ $$ C:\Bruker\TOPSPIN/data/Administrator/nmr/12-COFFEE-2502/152/pdata/1/auditp.txt
$$ ##AUDIT TRAIL=  $$ (NUMBER, WHEN, WHO, WHERE, PROCESS, VERSION, WHAT)
(   1,<2012-02-25 18:59:39.359 -0500>,<Administrator>,<TOPSPIN>,<go>,<TOPSPIN 2.1>,
      <created by zg
	started at 2012-02-25 18:48:09.094 -0500,
	POWCHK enabled, PULCHK disabled,
       configuration hash MD5:
       B0 76 FB 9C 50 81 44 7D 18 B3 26 32 4E 60 AD 96
       data hash MD5: 64K
       ED 0A 80 0A 5D A6 3A A4 F1 C2 91 95 6C E7 46 FA>)
(   2,<2012-02-25 18:59:42.062 -0500>,<Administrator>,<TOPSPIN>,<proc1d>,<TOPSPIN 2.1>,
      <Start of raw data processing
       efp LB = 0.3 FT_mod = 6 PKNL = 1 PHC0 = 0 PHC1 = 0 SI = 128K 
       data hash MD5: 128K
       2C 73 37 D3 9E CF 3C 24 5B 76 93 CE 8D BB 22 D1>)
(   3,<2012-02-25 18:59:43.391 -0500>,<Administrator>,<TOPSPIN>,<proc1d>,<TOPSPIN 2.1>,
      <pk PHC0 = 22.55493 PHC1 = 0 
       data hash MD5: 128K
       7F 1B B5 1C A5 FF 53 C1 8D 2A 6B 77 0D 8E 91 94>)
(   4,<2012-02-25 18:59:43.625 -0500>,<Administrator>,<TOPSPIN>,<proc1d>,<TOPSPIN 2.1>,
      <abs ABSG = 1 
       data hash MD5: 128K
       33 8C EC 1C 26 7F 78 49 E0 3E E2 AE 57 95 BD 48>)
(   5,<2012-02-25 18:59:43.703 -0500>,<Administrator>,<TOPSPIN>,<proc1d>,<TOPSPIN 2.1>,
      <abs ABSG = 2 
       data hash MD5: 128K
       7C DA 08 A2 24 30 B9 58 64 05 83 DF 3C 9E 57 91>)
(   6,<2012-02-25 18:59:43.766 -0500>,<Administrator>,<TOPSPIN>,<proc1d>,<TOPSPIN 2.1>,
      <abs ABSG = 3 
       data hash MD5: 128K
       1B 88 24 76 53 FF DD FD 96 0F 11 F9 A4 A3 04 D3>)
(   7,<2012-02-25 18:59:43.844 -0500>,<Administrator>,<TOPSPIN>,<proc1d>,<TOPSPIN 2.1>,
      <abs ABSG = 4 
       data hash MD5: 128K
       6C 6C C7 9E 7A DA B5 0F 43 9C 60 EF A5 CB C9 31>)
(   8,<2012-02-25 18:59:44.109 -0500>,<Administrator>,<TOPSPIN>,<proc1d>,<TOPSPIN 2.1>,
      <abs ABSG = 5 
       data hash MD5: 128K
       CE 7F 7B BE 54 72 33 76 BE F0 AA 14 3D 6B 14 5A>)
(   9,<2012-02-25 18:59:44.234 -0500>,<Administrator>,<TOPSPIN>,<audit>,<TOPSPIN 2.1>,
      <user comment:
       ICON-NMR User ID: Administrator
$$ [...]
150 150 150 150 150 150 150 150
##$TP07= 0
##$TPNAME0= <>
##$TPNAME1= <>
##$TPNAME2= <>
##$TPNAME3= <>
##$TPNAME4= <>
##$TPNAME5= <>
##$TPNAME6= <>
##$TPNAME7= <>
##$TPOAL= (0..7)
0.5 0.5 0.5 0.5 0.5 0.5 0.5 0.5
##$TPOFFS= (0..7)
0 0 0 0 0 0 0 0
##$TUNHIN= 0
##$TUNHOUT= 0
##$TUNXOUT= 0
##$USERA1= <user>
##$USERA2= <user>
##$USERA3= <user>
##$USERA4= <user>
##$USERA5= <user>
##$V9= 5
##$VALIST= <valist>
##$VCLIST= <CCCCCCCCCCCCCCC>
##$VD= 0
##$VDLIST= <DDDDDDDDDDDDDDD>
##$VPLIST= <PPPPPPPPPPPPPPP>
##$VTLIST= <TTTTTTTTTTTTTTT>
##$WBST= 1024
##$WBSW= 4
##$XGAIN= (0..3)
0 0 0 0
##$XL= 0
##$YL= 0
##$YMAX_a= 13686705
##$YMIN_a= -6481876
##$ZGOPTNS= <>
##$ZL1= 120
##$ZL2= 120
##$ZL3= 120
##$ZL4= 120
##$ABSF1= 14.98061
##$ABSF2= -5.57192
##$ABSG= 5
##$ABSL= 3
##$ALPHA= 0
##$AQORDER= 0
##$ASSFAC= 0
##$ASSFACI= 0
##$ASSFACX= 0
##$ASSWID= 0
##$AUNMP= <proc_prof1d_extract>
##$AXLEFT= 0
##$AXNAME= <>
##$AXNUC= <1H>
##$AXRIGHT= 0
##$AXTYPE= 0
##$AXUNIT= <>
##$AZFE= 0.1
##$AZFW= 0.1
##$BCFW= 0
##$BC_mod= 0
##$BYTORDP= 0
##$COROFFS= 0
##$CY= 15
##$DATMOD= 1
##$DC= 0
##$DFILT= <>
##$DTYPP= 0
##$F1P= 0
##$F2P= 0
##$FCOR= 0.5
##$FTSIZE= 131072
##$FT_mod= 6
##$GAMMA= 0
##$GB= 0
##$INTBC= 1
##$INTSCL= 1
##$ISEN= 128
##$LB= 0.3
##$LEV0= 0
##$LPBIN= 0
##$MAXI= 10000
##$MC2= 0
##$MEAN= 0
##$ME_mod= 0
##$MI= 0
##$NCOEF= 0
##$NC_proc= -3
##$NLEV= 6
##$NOISF1= 0
##$NOISF2= 0
##$NSP= 0
##$NTH_PI= 0
##$NZP= 0
##$OFFSET= 14.98061
##$PC= 1
##$PHC0= 22.55493
##$PHC1= 0
##$PH_mod= 1
##$PKNL= yes
##$PPARMOD= 0
##$PPDIAG= 0
##$PPIPTYP= 0
##$PPMPNUM= 2147483647
##$PPRESOL= 1
##$PSCAL= 4
##$PSIGN= 0
##$PYNMP= <proc.py>
##$REVERSE= no
##$SF= 400.13
##$SI= 131072
##$SIGF1= 0
##$SIGF2= 0
##$SINO= 400
##$SIOLD= 131072
##$SPECTYP= <>
##$SREGLST= <1H.CDCl3>
##$SSB= 0
##$STSI= 131072
##$STSR= 0
##$SW_p= 8223.68421052632
##$SYMM= 0
##$S_DEV= 0
##$TDeff= 65536
##$TDoff= 0
##$TI= <>
##$TILT= no
##$TM1= 0
##$TM2= 0
##$TOPLEV= 0
##$USERP1= <user>
##$USERP2= <user>
##$USERP3= <user>
##$USERP4= <user>
##$USERP5= <user>
##$WDW= 1
##$XDIM= 131072
##$YMAX_p= 513827608
##$YMIN_p= -233771553
##$CURPLOT= <Network HP LaserJet P1505>
##$CURPRIN= <$Network HP LaserJet P1505>
##$DFORMAT= <normdp>
##$LAYOUT= <+/1D_H.xwp>
##$LFORMAT= <normlp>
##$PFORMAT= <normpl>
##$SURQMSG= 1
$$ End of Bruker specific parameters
$$ ---------------------------------
##NTUPLES= NMR SPECTRUM
##VAR_NAME=  FREQUENCY,     SPECTRUM/REAL,   SPECTRUM/IMAG
##SYMBOL=    X,             R,               I
##VAR_TYPE=  INDEPENDENT,   DEPENDENT,       DEPENDENT
##VAR_FORM=  AFFN,          ASDF,            ASDF
##VAR_DIM=   131072,        131072,          131072
##UNITS=     HZ,            ARBITRARY UNITS, ARBITRARY UNITS
##FACTOR=    0.0627417313425165, 1,          1
##FIRST=     8223.62146879498, 6528,         -95940
##LAST=      0,             10581,           -96506
##MIN=       0,             -233771553,      0
##MAX=       8223.62146879498, 513827608,    0
$$ Real data points
##PAGE= N=1
##DATA TABLE= (X++(R..R)), XYDATA
$$ [...]
60785I26910J2334J3379J5201J6569J6716J6266J6139J6100J5122J2884J0027
$$ 926910 939244 952623 967824 984393 1001109 1017375 1033514 1049614 1064736 1077620 1087647
60774A087647P067L907O55j857k894k741k419k775m103o214q387r545r218q297
$$ 1087647 1094714 1098621 1099276 1097419 1094525 1091784 1089365 1086590 1082487 1076273 1067886 1058341 1049123 1040826
60760A040826q178r154j0258j0751j0915j1103j0843r669q143p156o555n464l836
$$ 1040826 1032648 1023494 1013236 1002485 991570 980467 969624 959955 951812 944656 938101 932637 928801
60747I28801k706k740l319l297k141j07K130L798M302L561K032O14O17L020O978
$$ 928801 926095 923355 920036 916739 914598 914491 916621 920419 924721 928282 930314 930928 931545 934565 941543
60732I41543R688R081O563N820Q638J2983J5590J5332J3583J2263J2324J3453
$$ 941543 951231 960312 966875 972695 981333 994316 1009906 1025238 1038821 1051084 1063408 1076861
60720A076861J4500J4529J3767J3101J2585J1312Q920O322M515L563L193L445
$$ 1076861 1091361 1105890 1119657 1132758 1145343 1156655 1165575 1171897 1176412 1179975 1183168 1186613
60708A186613M037M040K842R62o57j510j401m83K12o33k733m054l312j671j075
$$ 1186613 1190650 1194690 1197532 1198494 1197837 1196327 1194926 1194443 1194655 1194022 1191289 1187235 1183923 1182252 1181177
60693A181177j912l200m025l787k161mO84r48l161l819l061k459k506k663l117
$$ 1181177 1179265 1176065 1172040 1168253 1166092 1166088 1166772 1165824 1162663 1158844 1155783 1153324 1150818 1148155 1145038
60678A145038m471o078o613o153n972o420o620o121n163l508r74R76L26k366m023
$$ 1145038 1140567 1134489 1127876 1121723 1115751 1109331 1102711 1096590 1091427 1087919 1086945 1087921 1088247 1085881 1081858
60663A081858k883m91Q68Q61K81p00k081l169l536l900m869n719n598n071n238
$$ 1081858 1078975 1078484 1079352 1080213 1080494 1079794 1077713 1074544 1071008 1067108 1062239 1056520 1050922 1045851 1040613
60648A040613n977o339o116n811n439m711m193m928o795q372q802q830r514j0669
$$ 1040613 1034636 1028297 1022181 1016370 1010931 1006220 1002027 997099 990304 981932 973130 964300 954786 944117
60634I44117j1346j1370j1481j1914j1709j0088p989p368q887j1086j2140j1663
$$ 944117 932771 921401 909920 898006 886297 876209 868220 860852 851965 840879 828739 817076
60622H17076j0355q735p028n696m968m230k872j467r66r98k94J229K119J528L60
$$ 817076 806721 797986 790958 785262 780294 776064 773192 771725 770759 769761 769467 770696 772815 774343 774703
60607G74703j73NM65J283K614M015M927N417N813O223O817Q035R921J1784J2914
$$ 774703 774530 774535 775000 776283 778897 782912 787839 793256 799069 805292 812109 820144 830065 841849 854763
60592H54763J3264J3112J2678J2456J3149J4747J6213J6667J6382J6161J6272
$$ 854763 868027 881139 893817 906273 919422 934169 950382 967049 983431 999592 1015864
60581A015864J6400J6140J5109J3209J1244J0602J1656J3113J3523J2850J1867
$$ 1015864 1032264 1048404 1063513 1076722 1087966 1098568 1110224 1123337 1136860 1149710 1161577
60570A161577J0847R730R002R133R411Q485O141L543J584j03k160m283n559n668
$$ 1161577 1172424 1182154 1191156 1200289 1209700 1218185 1224326 1227869 1229453 1229350 1227190 1222907 1217348 1211680
60556A211680n345n694p166r099j0255r998q871p911p457o918n649l714j688K0
$$ 1211680 1206335 1200641 1193475 1184376 1174121 1164123 1155252 1147341 1139884 1132966 1127317 1123603 1121915 1121935
60542A121935J458K736L639L832L405K816K183J009j041l452n344o364o558n724
$$ 1121935 1123393 1126129 1129768 1133600 1137005 1139821 1142004 1143013 1141972 1138520 1133176 1126812 1120254 1114530
60528A114530l726j229P09J774K394K740K704K887M338O881Q862R138Q475Q254
$$ 1114530 1110804 1109575 1110284 1112058 1114452 1117192 1119896 1122783 1127121 1134002 1142864 1152002 1160477 1168731
60514A168731Q692R112R145Q750P626N661L526K073J349R04O07L57n29k565m941
$$ 1168731 1177423 1186535 1195680 1204430 1212056 1217717 1221243 1223316 1224665 1225569 1226176 1226533 1226004 1223439 1218498
60499A218498o103n609m594m289m798n470n776n387l936j329J792M305N655O560
$$ 1218498 1212395 1206786 1202192 1197903 1193105 1187635 1181859 1176472 1172536 1171207 1172999 1177304 1182959 1189519
60485A189519Q261J0828J2792J3106J3138J5515K0947K7289L2140L5270L7906
$$ 1189519 1197780 1208608 1221400 1234506 1247644 1263159 1284106 1311395 1343535 1378805 1416711
60474A416711M0886M4624M9781N6541O3706O9820P4726P8646Q0182P6918O8214
$$ 1416711 1457597 1502221 1552002 1608543 1672249 1742069 1816795 1895441 1975623 2052541 2120755
60463B120755N5951M2233K7803J3189mj0064j6599k0140k0976j9239j5655j1292
$$ 2120755 2176706 2218939 2246742 2259931 2259927 2249863 2233264 2213124 2192148 2172909 2157254 2145962
60451B145962o811k686J39Q10j87j255j425j271j550j504O86N880J2973K0170
$$ 2145962 2139151 2136465 2136604 2137414 2137227 2135972 2134547 2133276 2131726 2130222 2130908 2136788 2149761 2169931
60437B169931K6701L3024L9828M7445N6043O5673P5920Q5931R5052J03137J10215
$$ 2169931 2196632 2229656 2269484 2316929 2372972 2438645 2514565 2600496 2695548 2798685 2908900
60426B908900J16131J20661J23750J25664J27374J30662J37303J47942J62249
$$ 2908900 3025031 3145692 3269442 3395106 3522480 3653142 3790445 3938387 4100636
60417D100636J80187K02405K29178K59583K92110L25558L58922L90829M18849
$$ 4100636 4280823 4483228 4712406 4971989 5264099 5589657 5948579 6339408 6758257
60408F758257M38270M41403M19820L68931K90341J89631P3368n0712j72378k80745
$$ 6758257 7196527 7637930 8057750 8426681 8717022 8906653 8980021 8929309 8756931 8476186
60398H476186l68186m31698m71153m88186m86730m72328m49562m20852l88040
$$ 8476186 8108000 7676302 7205149 6716963 6230233 5757905 5308343 4887491 4499451
60389D499451l53777l20528k89268k59941k32506k06929j83099j61579j43502
$$ 4499451 4145674 3825146 3535878 3275937 3043431 2836502 2653403 2491824 2348322
60380B348322j28869j15822j02751r0413q0686p3670o7509o0897n4242m8094m2084
$$ 2348322 2219453 2103631 2000880 1910467 1829781 1756111 1688602 1627705 1573463 1525369 1483285
60369A483285l6221l1973l0655l1232l1047k8746k5491k3135k2051k1358k0449
$$ 1483285 1447064 1415091 1384436 1353204 1322157 1293411 1267920 1244785 1222734 1201376 1180927
60358A180927j9486j8690j7931j7205j6842j6822j6355j4547j1478q245n958m893
$$ 1180927 1161441 1142751 1124820 1107615 1090773 1073951 1057596 1043049 1031571 1023326 1017368 1012475
60346A012475m607m608m687m769m740m637m753n183n261m094j964n65j067k314
$$ 1012475 1007868 1003260 998573 993804 989064 984427 979674 974491 969230 965136 963172 962607 961540 959226
60332I59226k026K09K290K429J493J684L644O005P415P739P275N996L978J828
$$ 959226 957200 957409 959699 962128 963621 965305 968949 974954 982369 990108 997383 1003379 1007357 1009185
60318A009185O2j372k535k884j926k72O40J01r86j180l03L01n18k208l173k722
$$ 1009185 1009247 1007875 1005340 1002456 1000530 1000258 1000898 1000999 1000013 998833 998530 998831 998313 996105 992932 990210
60302I90210j580n27N44J656J787J3k663l868k504K2J587J720J597K176L113L489
$$ 990210 988630 988103 988647 990303 992090 992103 989440 985572 983068 983090 984677 986397 987994 990170 993283 996772
60286I96772L039K452K587L571M645N006M753M786N684O923P545P350O997O940
$$ 996772 999811 1002263 1004850 1008421 1013066 1018072 1022825 1027611 1033295 1040218 1047763 1055113 1062110 1069050
60272A069050O792O002M791L910L740M033M494N030N420N324M831M529M742N088
$$ 1069050 1075842 1081844 1086635 1090545 1094285 1098318 1102812 1107842 1113262 1118586 1123417 1127946 1132688 1137776
60258A137776M923L779J247k693o773q832q096o388o031o995p455o720o048o372
$$ 1137776 1142699 1146478 1147725 1145032 1138259 1129427 1121331 1114943 1108912 1101917 1094462 1087742 1081694 1075322
60244A075322o849o257m698l193k467k716l773m834m788l366j511k12K90m4j270
$$ 1075322 1068473 1062216 1057518 1054325 1051858 1049142 1045369 1040535 1035747 1032381 1030870 1030658 1030948 1030904 1029634
60229A029634k680k939j838r77j747l418m135l106r23J529L554M612M876N285
$$ 1029634 1026954 1024015 1022177 1021200 1019453 1016035 1011900 1008794 1007871 1009400 1012954 1017566 1022442 1027727
60215A027727O281P167P470Q007R520J1228J2064J2488J3485J4514J4297J3225
$$ 1027727 1034008 1041175 1048645 1056652 1066172 1077400 1089464 1101952 1115437 1129951 1144248 1157473
60203A157473J3007J4014J4980J5401J6084J6920J6312J3991J2494J4229J8246
$$ 1157473 1170480 1184494 1199474 1214875 1230959 1247879 1264191 1278182 1290676 1304905 1323151
60192A323151K1577K3037K4132K6412K9486L1998L3500L4888L7404M1620M7106
$$ 1323151 1344728 1367765 1391897 1418309 1447795 1479793 1513293 1548181 1585585 1627205 1674311
60181A674311N2768N7546O1178O4447O8604P4257Q0828Q7256R3144R8769J04049
$$ 1674311 1727079 1784625 1845803 1910250 1978854 2053111 2133939 2221195 2314339 2413108 2517157
60170B517157J08356J11538J14251J16688J17796J16604J13622J09950J05517
$$ 2517157 2625513 2737051 2851302 2967990 3085786 3202390 3316012 3425962 3531479
60161C531479R9287R0892Q0911O9716N7262M3986L0831J8290O363m420j2980j8879
$$ 3531479 3630766 3721658 3802569 3872285 3929547 3973533 4004364 4022654 4029017 4024597 4011617 3992738
60149C992738k2750k5259k6348k5582k2613j7280j0012k080N419J2935K2001L3285
$$ 3992738 3969988 3944729 3918381 3892799 3870186 3852906 3842894 3840814 3846233 3859168 3881169 3914454
60137C914454M5790N7977O8972P8729Q7842R7107J06414J14098J18226J18502
$$ 3914454 3960244 4018221 4087193 4165922 4253764 4350871 4457285 4571383 4689609 4808111
60127D808111J16054J11603J04930R6085Q5730P4019O0279M4161K6429Q407q512
$$ 4808111 4924165 5035768 5140698 5236783 5322513 5396532 5456811 5500972 5527401 5535808 5527296
60116E527296k3105l5036m5201n4239o0985o3826o3199o0964n7428n1074m1616
$$ 5527296 5504191 5469155 5423954 5369715 5308730 5244904 5181705 5120741 5063313 5012239 4970623
60105D970623l0953k0370q945L881J6130K5278L1257L5957M0901M6575N2858N8513
$$ 4970623 4939670 4919300 4910355 4914236 4930366 4955644 4986901 5022858 5063759 5110334 5163192 5221705
60093E221705O1173N9376N4192M7779M1088L4016K6821K0063J3721P624K130k529
$$ 5221705 5282878 5342254 5396446 5444225 5485313 5519329 5546150 5566213 5579934 5587558 5589688 5587159
60081E587159o724r957r905m592M991J6053K7410M0228N5609P3058R1516J10532
$$ 5587159 5580435 5570478 5560573 5555981 5560972 5577025 5604435 5644663 5700272 5773330 5864846 5975378
60069E975378J30079J50199J71137J93143K15870K38544K60573K81560L01009
$$ 5975378 6105457 6255656 6426793 6619936 6835806 7074350 7334923 7616483 7917492
60060G917492L18627L34545L48623L59840L66963L69214L65735L55273L37403
$$ 7917492 8236119 8570664 8919287 9279127 9646090 10015304 10381039 10736312 11073715
60051A1073715L13361K84471K50363K10046J64197J14880O3390R837m5202r9991
$$ 11073715 11387076 11671547 11921910 12131956 12296153 12411033 12474423 12484260 12439058 12339067
60041A2339067j52572k01104k43364k77411l02864l20217l29004l28181l18505
$$ 12339067 12186495 11985391 11742027 11464616 11161752 10841535 10512531 10184350 9865845
60032I865845l02722k82781k58420k29327j97183j64435j32114j00136o8884l9199
$$ 9865845 9563123 9280342 9021922 8792595 8595412 8430977 8298863 8198727 8129843 8090644
60022H090644j1415J4278L6757N4482O7011P4903P7982P4824O4638M8971L0637
$$ 8090644 8079229 8093507 8130264 8184746 8251757 8326660 8404642 8479466 8544104 8593075 8623712
60011H623712J1316q921k9638m8766o4267p6687q8770j02188j15614j26638j34749
$$ 8623712 8635028 8626107 8596469 8547703 8483436 8406749 8317979 8215791 8100177 7973539 7838790
60000G838790j41414j47669j52923j56235j57637j57652j56094j52092j45137
$$ 7838790 7697376 7549707 7396784 7240549 7082912 6925260 6769166 6617074 6471937
59991F471937j35618j24246j11261r6574q0722o5217n1352l8687k5429j0474N479
$$ 6471937 6336319 6212073 6100812 6004238 5923516 5858299 5806947 5768260 5742831 5732357 5737836
59980E737836K1095L5894N0018O3277P5225Q5812R5050J02181J05864J05301J00778
$$ 5737836 5758931 5794825 5844843 5908120 5983345 6069157 6164207 6266388 6372252 6477553 6578331
59969F578331R3242Q3464P1393N6155L7232J5857n601k6057m6526o7709q7874
$$ 6578331 6671573 6755037 6826430 6882585 6919817 6935674 6930073 6904016 6857490 6789781 6701907
59958F701907j04497j17191j27344j35108j38637j36638j30290j21858j12402
$$ 6701907 6597410 6480219 6352875 6217767 6079130 5942492 5812202 5690344 5577942
59949E577942j01455q8272p2790n5731l8127k0656l483J3172K8914M4129O0253
$$ 5577942 5476487 5388215 5315425 5259694 5221567 5200911 5197428 5210600 5239514 5283643 5343896
59938E343896P7894R5289J10068J22383J34574J47531J59085J66571J69376J67941
$$ 5343896 5421790 5517079 5627147 5749530 5884104 6031635 6190720 6357291 6526667 6694608
59928F694608J61761J49987J33336J13847R2850P0250M5771J9922o395l2389n7157
$$ 6694608 6856369 7006356 7139692 7253539 7346389 7416639 7462410 7482332 7475937 7443548 7386391
59917G386391p9540r8638j14202j26174j33991j36798j34452j27884j18172j05512
$$ 7386391 7306851 7208213 7094011 6967837 6833846 6697048 6562596 6434712 6316540 6211028
59907F211028q9673p1344n2145l3136j4152M986K3508M0739N7172P3364Q8442
$$ 6211028 6121355 6050011 5997866 5964730 5950578 5955564 5979072 6019811 6076983 6150347 6238789
59896F238789J00973J10936J19411J26399J30479J30795J28050J23206J16518
$$ 6238789 6339762 6450698 6570109 6696508 6826987 6957782 7085832 7209038 7325556
59887G325556J08422J00082R2319Q4844P7364P0645O5740O2844O1684O2504O5984
$$ 7325556 7433978 7534060 7626379 7711223 7788587 7859232 7924972 7987816 8049500 8112004 8177988
59876H177988P2594Q2657R6537J14260J35304J59209J85855K14560K43414K70316
$$ 8177988 8250582 8333239 8429776 8544036 8679340 8838549 9024404 9238964 9482378 9752694
59866I752694K94399L15701L33580L46036L50702L45970L31029L05045K66724
$$ 9752694 10047093 10362794 10696374 11042410 11393112 11739082 12070111 12375156 12641880
59857A2641880K15151J51476P9702N163o7886j36925j99824k54053k97651l30195
$$ 12641880 12857031 13008507 13088209 13093372 13025486 12888561 12688737 12434684 12137033 11806838
59847A1806838l52106l63558l64716l56656l41386l20997k97089k70609k41798
$$ 11806838 11454732 11091174 10726458 10369802 10028416 9707419 9410330 9139721 8897923
59838H897923k10637j77766j44782j13188q3228n4051k4848M345L2615N8567Q0988
$$ 8897923 8687286 8509520 8364738 8251550 8168322 8114271 8089423 8093768 8126383 8184950 8265938
59827H265938R9419J13870J23918J28537J26948J18907J04000Q1477N1506J5932
$$ 8265938 8365357 8479227 8603145 8731682 8858630 8977537 9081537 9163014 9214520 9230452
59817I230452k2993o4048j06317j47443j83995k13934k37784k57019k71884k81360
$$ 9230452 9207459 9143411 9037094 8889651 8705656 8491722 8253938 7996919 7725035 7443675
59807G443675k84743k82639k76343k66779k54365k39779k24339k09245j94542
$$ 7443675 7158932 6876293 6599950 6333171 6078806 5839027 5614688 5405443 5210901
59798E210901j79364j63267j46834j30769j15024r9298q3925o9649n6805m5383
$$ 5210901 5031537 4868270 4721436 4590667 4475643 4376345 4292420 4222771 4165966 4120583
59788D120583l5631k7835k1567j6037j1365q667q482r774j0944j1290j0977j0148
$$ 4120583 4084952 4057117 4035550 4019513 4008148 3999481 3990999 3981225 3970281 3958991 3948014 3937866
59776C937866q996q335r198j1732j5141j8780k2506k5925k8257k9410l0344l1636
$$ 3937866 3928870 3920535 3911337 3899605 3884464 3865684 3843178 3817253 3788996 3759586 3729242 3697606
59764C697606l2448l1702k9681k7432k5081k2125j9133j7680j8149j8880j8042
$$ 3697606 3665158 3633456 3603775 3576343 3551262 3529137 3510004 3492324 3474175 3455295 3437253
59753C437253j5395j1636p062j734L821Q908J3122J6074J7401J7829J9305K3131
$$ 3437253 3421858 3410222 3403160 3401426 3405247 3414155 3427277 3443351 3460752 3478581 3497886 3521017
59741C521017K8594L4251L9777M5373N0130N2505N2277N0632M8439M5581M1913
$$ 3521017 3549611 3583862 3623639 3669012 3719142 3771647 3823924 3874556 3922995 3968576 4010489
59730D010489L7690L3036K8176K4193K2390K2732K4076K6088K9800L5991M4197
$$ 4010489 4048179 4081215 4109391 4133584 4155974 4178706 4202782 4228870 4258670 4294661 4338858
59719D338858N3724O4518P6518Q9196J02407J16941J33507J51820J71049J90586
$$ 4338858 4392582 4457100 4533618 4622814 4725221 4842162 4975669 5127489 5298538 5489124
59709E489124K10051K29292K48731K68853K88878L06637L20039L27569L26570
$$ 5489124 5699175 5928467 6177198 6446051 6734929 7041566 7361605 7689174 8015744
59700H015744L12091K79055K25980J56377P7145l741p8606j41063j87102k15841
$$ 8015744 8327835 8606890 8832870 8989247 9066392 9062651 8984045 8842982 8655880 8440039
59690H440039k29138k30123k21673k05960j85064j61189j35905j09801q3565n8702
$$ 8440039 8210901 7980778 7759105 7553145 7368081 7206892 7070987 6961186 6877621 6818919
59680F818919l6156j4780P426L0685N3305P4179R3976J13595J33032J52352J72460
$$ 6818919 6782763 6767983 6775409 6806094 6859399 6933578 7027554 7141149 7274181 7426533 7598993
59669G598993J94002K16600K39818K63939K89069L14616L40676L68812M00242
$$ 7598993 7792995 8009595 8249413 8513352 8802421 9117037 9457713 9826525 10226767
59660A0226767M33990M68092N02160N37433N74547O12475O49713O85459P19112
$$ 10226767 10660757 11128849 11631009 12168442 12742989 13355464 14005177 14690636 15409748
59651A5409748P49197P73228P88721P94334P90130P76825P55283P27224O95997
$$ 15409748 16158945 16932173 17720894 18515228 19305358 20082183 20837466 21564690 22260687
59642B2260687O65529O38244O14585N94310N77109N61792N46140N28106N06015
$$ 22260687 22926216 23564460 24179045 24773355 25350464 25912256 26458396 26986502 27492517
59633B7492517M77321M38741L88902L29833K64830J95727J23512N0795j7905p8239
$$ 27492517 27969838 28408579 28797481 29127314 29392144 29587871 29711383 29762178 29744273 29666034
59623B9666034j27438j63966j87019j96599j93416j78452j52606j16489p0401
$$ 29666034 29538596 29374630 29187611 28991012 28797596 28619144 28466538 28350049 28279648
59614B8279648j5073M7429J14269J83656K55271L28608M01876M73049N40707O02839
$$ 28279648 28264575 28312004 28426273 28609929 28865200 29193808 29595684 30068733 30609440 31212279
59604C1212279O55758O95268P17968P20576O98854O48777N68272M57048L15823
$$ 31212279 31868037 32563305 33281273 34001849 34700703 35349480 35917752 36374800 36690623
59595C6690623J47537m0812k38809m34967o18106p78153r08288j006697j074908
$$ 36690623 36838160 36797348 36558539 36123572 35505466 34727313 33819025 32812328 31737420
59586C1737420j114466j126435j113724j081688j035752r79858r17845q54912
$$ 31737420 30622954 29496519 28382795 27301107 26265355 25285497 24367652 23512740
59578B3512740p96706p47831p12044o92954o92784p09847p37607p66790p89032
$$ 23512740 22716034 21968203 21256159 20563205 19870421 19160574 18422967 17656177 16867145
59569A6867145p99306p95818p78691p49575p11984o70197o26878n82382n36927
$$ 16867145 16067839 15272021 14493330 13743755 13031771 12361574 11734696 11152314 10615387
59560A0615387m92341m50650m11960l75138l40052l07748k78695k52355k28330
$$ 10615387 10123046 9672396 9260436 8885298 8545246 8237498 7958803 7706448 7478118
59551G478118k06681j87138j69247j53283j39800j28319j17821j08657j02386
$$ 7478118 7271437 7084299 6915052 6761769 6621969 6493650 6375829 6267172 6164786
59542F164786r9303r7618r5873r4836r5971r8899j01684j03174j03873j04554
$$ 6164786 6065483 5967865 5871992 5777156 5681185 5582286 5480602 5377428 5273555 5169001
59532E169001j04955j04186j01813r8092r3316q7438q0454p2867o5422n8442n1789
$$ 5169001 5064046 4959860 4858047 4759955 4666639 4579201 4498747 4425880 4360458 4302016 4250227
59521D250227m5272l8719l1715k4024j6365r913m757L46O345J2818J8895K4265
$$ 4250227 4204955 4166236 4134521 4110497 4094132 4084219 4079462 4079808 4086153 4098971 4117866 4142131
59509D142131K8667L1600L3441L5820L9757M4288M8044N1307N5092N9149O2542
$$ 4142131 4170798 4202398 4235839 4271659 4311416 4355704 4403748 4455055 4510147 4569296 4631838
59498D631838O5643O9812P5395Q1703Q8782R7419J07409J17604J27907J39510
$$ 4631838 4697481 4767293 4842688 4924391 5013173 5110592 5218001 5335605 5463512 5603022
59488E603022J52674J65925J78086J89758K02071K15046K27948K40112K50772
$$ 5603022 5755696 5921621 6099707 6289465 6491536 6706582 6934530 7174642 7425414
59479G425414K58901K64028K66435K66108K62183K54121K42642K28813K12530
$$ 7425414 7684315 7948343 8214778 8480886 8743069 8997190 9239832 9468645 9681175
59470I681175J92484J67542J38014J05902P4018M4469J7850n972k6796m4283n8690
$$ 9681175 9873659 10041201 10179215 10285117 10359135 10403604 10421454 10415482 10388686 10344403 10285713
59459A0285713p0428p9047q3467q3051p7669o7057n1142l0813p281J9069M8162
$$ 10285713 10215285 10136238 10052771 9969720 9892051 9824994 9773852 9743039 9735758 9754827 9802989
59448I802989P8746J08776J37130J63517J86597K03578K11951K10379J97780J73120
$$ 9802989 9881735 9990511 10127641 10291158 10477755 10681333 10893284 11103663 11301443 11474563
59438A1474563J36638R0180L5895k4180q7156j49282k07525k59867l03829l36454
$$ 11474563 11611201 11701381 11737276 11713096 11625940 11476658 11269133 11009266 10705437 10368983
59428A0368983l56690l66418l67972l61791l47584l26841l02693k77590k52018
$$ 10368983 10012293 9645875 9277903 8916112 8568528 8241687 7938994 7661404 7409386
59419G409386k25349j97275j68516j40433j13886q8540o3764l9784j7138M660
$$ 7409386 7184037 6986762 6818246 6677813 6563927 6475387 6411623 6371839 6354701 6359361
59409F359361K6684M8875P0052Q9686J08248J25766J41563J55654J68583J79436
$$ 6359361 6386045 6434920 6504972 6594658 6702906 6828672 6970235 7125889 7294472 7473908
59399G473908J85747J86144J81368J71867J56259J33332J03933O9587L0810j1700
$$ 7473908 7659655 7845799 8027167 8199034 8355293 8488625 8592558 8662145 8692955 8681255
59389H681255n5459r7481j36307j71530k02328k27844k48096k63138k72233k75109
$$ 8681255 8625796 8528315 8392008 8220478 8018150 7790306 7542210 7279072 7006839 6731730
59379F731730k73185k68143k60263k49428k36750k23592k09991j95714j81946
$$ 6731730 6458545 6190402 5930139 5680711 5443961 5220369 5010378 4814664 4632718
59370D632718j69891j58391j45093j29847j15058j02620r2187q2486p2857o3310
$$ 4632718 4462827 4304436 4159343 4029496 3914438 3811818 3719631 3637145 3564288 3500978
59360C500978n4437m7148m1358l5299k7525j9160j2332o779k27P806J5091K0279
$$ 3500978 3446541 3399393 3358035 3322736 3295211 3276051 3263719 3256940 3256713 3264519 3279610 3299889
59348C299889K4985L0695L5456L5671L0498K2808J6278J2817J2649J5338K0176
$$ 3299889 3324874 3355569 3391025 3426696 3457194 3480002 3496280 3509097 3521746 3537084 3557260
59337C557260K6307L3123M0436M7967N4653N8790N9290N7025N4645N4735N8280
$$ 3557260 3583567 3616690 3657126 3705093 3759746 3818536 3877826 3934851 3989496 4044231 4102511
59326D102511O4955P4198Q5295R7009J08225J19178J31094J44445J58182J71205
$$ 4102511 4167466 4241664 4326959 4423968 4532193 4651371 4782465 4926910 5085092 5256297
59316E256297J84195J99435K18614K40809K63129K83933L05112L30096L59459
$$ 5256297 5440492 5639927 5858541 6099350 6362479 6646412 6951524 7281620 7641079
59307G641079L90108M19622M49622M82898N18366N51395N78853O01151O18619
$$ 7641079 8031187 8450809 8900431 9383329 9901695 10453090 11031943 11633094 12251713
59298A2251713O28437O26811O12833N88776N57618N21819M83691M45101M06595
$$ 12251713 12880150 13506961 14119794 14708570 15266188 15788007 16271698 16716799 17123394
59289A7123394L67806L28773K90072K51706K12617J71310J26358P6316J9882m3493
$$ 17123394 17491200 17819973 18110045 18361751 18574368 18745678 18872036 18948352 18968234 18924741
59279A8924741j13277j88006k65323l41927m14029m78105n31276n71385n97412
$$ 18924741 18811464 18623458 18358135 18016208 17602179 17124074 16592798 16021413 15424001
59270A5424001o09838o10113n99670n79858n52742n21144m87365m52297m16219
$$ 15424001 14814163 14204050 13604380 13024522 12471780 11950636 11463271 11010974 10594755
59261A0594755l80018l44979l11706k80047k50161k22898j98808j77599j58964
$$ 10594755 10214737 9869758 9558052 9278005 9027844 8804946 8606138 8428539 8269575
59252H269575j43324j31120j21817j14325j08165j03482j00177r7888r6752r7216
$$ 8269575 8126251 7995131 7873314 7758989 7650824 7547342 7447165 7349277 7252525 7155309
59242G155309r8688r9249r7422r3814r0397q8247q6484q3424p8396p2244o6193
$$ 7155309 7056621 6957372 6859950 6766136 6675739 6587492 6501008 6417584 6339188 6266944 6200751
59231F200751o0492n4299m6709l7509k7078j6061n298M692J4485K5359L7638N0250
$$ 6200751 6140259 6085960 6039251 6001742 5974664 5958603 5953305 5957997 5972482 5997841 6035479 6085729
59219F085729O2484P5123Q8783J02119J13412J23344J34253J46683J58648J68583
$$ 6085729 6148213 6223336 6312119 6414238 6527650 6650994 6785247 6931930 7090578 7259161
59209G259161J77001J84287J88433J86153J75304J55632J28369R6116O2105K8582
$$ 7259161 7436162 7620449 7808882 7995035 8170339 8325971 8454340 8550456 8612561 8641143
59199H641143l732l4444o3012q9771j15768j40677j62250j78850j91133k00207
$$ 8641143 8637411 8602967 8539955 8450184 8334416 8193739 8031489 7852639 7661506 7461299
59189G461299k05681k07059k05515k02453j97378j89256j79182j69541j60860
$$ 7461299 7255618 7048559 6843044 6640591 6443213 6253957 6074775 5905234 5744374
59180E744374j51342j39610j26269j12821j00393q9460p9583o9428n8278m7108
$$ 5744374 5593032 5453422 5327153 5214332 5113939 5024479 4944896 4875468 4817190 4770082
59170D770082l7014k7149j5823l259Q652J9239K9892M1872N5046O9108Q4341J00686
$$ 4770082 4733068 4705919 4690096 4686837 4695489 4714728 4744620 4786492 4841538 4910646 4994987 5095673
59158E095673J17574J35262J54913J76747J99490K22182K45268K69157K93009
$$ 5095673 5213247 5348509 5503422 5680169 5879659 6101841 6347109 6616266 6909275
59149F909275L15740L37090L56671L72760L82825L84576L76015L55525L22904
$$ 6909275 7225015 7562105 7918776 8291536 8674361 9058937 9434952 9790477 10113381
59140A0113381K79603K27153J65970R6569K1396n5301j29053j96226k54267l01961
$$ 10113381 10392984 10620137 10786107 10882676 10904072 10848771 10719718 10523492 10269225 9967264
59130I967264l39169l65559l79927l81546l72075l55360l35128l13142k89548
$$ 9967264 9628095 9262536 8882609 8501063 8128988 7773628 7438500 7125358 6835810
59121F835810k64514k39177k15141j93175j72766j53068j34042j16195r9635q4064
$$ 6835810 6571296 6332119 6116978 5923803 5751037 5597969 5463927 5347732 5248097 5164033
59111E164033o9627n6906m5888l5838k6467j8280j1241m099L914J1358J5854J7102
$$ 5164033 5094406 5037500 4991612 4955774 4929307 4911027 4899786 4895687 4899601 4910959 4926813 4943915
59099D943915J7361J8636K0311K0401J8339J5450J2696R270L974k785r440j5298
$$ 4943915 4961276 4979912 5000223 5020624 5038963 5054413 5067109 5076379 5080353 5077568 5068128 5052830
59087E052830k1123k7595l4070l9271m2532m3994m4142m3556m2632m1105l8320
$$ 5052830 5031707 5004112 4970042 4930771 4888239 4844245 4800103 4756547 4713915 4672810 4634490
59076D634490l4257k9831k5764k1669j6710j0595l565L957J1258J7441K2450K7408
$$ 4634490 4600233 4570402 4544638 4522969 4506259 4495664 4492099 4496056 4507314 4524755 4547205 4574613
59064D574613L3349M0028M6603N2986N9803O7419P5665Q4136R2252R9358J05182
$$ 4574613 4607962 4647990 4694593 4747579 4807382 4874801 4950466 5034602 5126854 5226212 5331394
59053E331394J09772J12797J13971J14416J16200J19562J22027J21555J19273
$$ 5331394 5441166 5553963 5667934 5782350 5898550 6018112 6140139 6261694 6380967
59044F380967J17364J15416J11013J03401R4372Q5668P7543P0073O3907N9205
$$ 6380967 6498331 6613747 6724760 6828161 6922533 7008201 7085744 7155817 7219724 7278929
59034G278929N5314N2007M9790M8575M7078M3687L6953K5400Q242j3633l8651
$$ 7278929 7334243 7386250 7436040 7484615 7531693 7575380 7612333 7637733 7645975 7632342 7593691
59023G593691o6474r7439j30172j61499j89063k12334k30808k43223k49370k50931
$$ 7593691 7527217 7429778 7299606 7138107 6949044 6736710 6505902 6262679 6013309 5762378
59013E762378k49451k45005k37671k28747k19065k07639j93576j78441j64942
$$ 5762378 5512927 5267922 5030251 4801504 4582439 4374800 4181224 4002783 3837841
59004C837841j53800j43505j32867j22342j12702j03816r5251q7176p9927p3139
$$ 3837841 3684041 3540536 3407669 3285327 3172625 3068809 2973558 2886382 2806455 2733316
58994B733316o6117n9019n2977m8594m4823m0195l4887l0556k7956k6052k4062
$$ 2733316 2667199 2608180 2555203 2506609 2461786 2421591 2386704 2356148 2328192 2302140 2278078
58983B278078k2818k2903k2722k0213j5804j1863r519p772n460k445J181N481
$$ 2278078 2255260 2232357 2209635 2189422 2173618 2161755 2152236 2144464 2139004 2136559 2137740 2143221
58971B143221J0088J4556J9105K3663K6544K5838K2012J7324J2819P906K674j727
$$ 2143221 2153309 2167865 2186970 2210633 2237177 2263015 2285027 2302351 2315170 2323076 2325750 2324023
58959B324023n238q976j2742j4815j4871j4559j4390j2723r168o192n525n287
$$ 2324023 2318785 2309809 2297067 2282252 2267381 2252822 2238432 2225709 2216541 2210349 2204824 2199537
58947B199537k917R12L623M481M549M067K426J30j489k490m413q123j2789j7022
$$ 2199537 2196620 2197532 2201155 2205636 2210185 2214252 2216678 2216808 2215319 2212829 2208416 2200293 2187504 2170482
58933B170482k0045k1920k3369k5062k6520k6397k4264k1186j8026j4535j0828
$$ 2170482 2150437 2128517 2105148 2080086 2053566 2027169 2002905 1981719 1963693 1949158 1938330
58922A938330q130o758m960j338K817N374O430P704R793J2047J4566J8119K2157
$$ 1938330 1930200 1923442 1918482 1917144 1919961 1925335 1931765 1939469 1949262 1961309 1975875 1993994 2016151
58909B016151K4748K4848K3498K2630K3591K6577L0579L4031L6124L7178L7385
$$ 2016151 2040899 2065747 2089245 2111875 2135466 2162043 2192622 2226653 2262777 2299955 2337340
58898B337340L6232L3924L2076L1781L2037L1475L0561L0628L1703L3081L5160
$$ 2337340 2373572 2407496 2439572 2471353 2503390 2534865 2565426 2596054 2627757 2660838 2695998
58887B695998L8787M3344M7403N0930N5106O0084O4672O8029P0208P1112P0575
$$ 2695998 2734785 2778129 2825532 2876462 2931568 2991652 3056324 3124353 3194561 3265673 3336248
58876C336248O9490O9461P1265P4659P9355Q5013R0773R6280J02708J11133J20403
$$ 3336248 3405738 3475199 3546464 3621123 3700478 3785491 3876264 3972544 4075252 4186385 4306788
58865D306788J28349J34851J41698J49631J57644J65498J74805J86802K00732
$$ 4306788 4435137 4569988 4711686 4861317 5018961 5184459 5359264 5546066 5746798
58856E746798K15226K30049K45833K63068K81962L02427L23849L45676L68396
$$ 5746798 5962024 6192073 6437906 6700974 6982936 7285363 7609212 7954888 8323284
58847H323284L92978M19366M46515M73901N01754N29680N56270N80256O00988
$$ 8323284 8716262 9135628 9582143 10056044 10557798 11087478 11643748 12224004 12824992
58838A2824992O17553O28482O32289O27327O11186N81587N37959M80887M10142
$$ 12824992 13442545 14071027 14703316 15330643 15941829 16523416 17061375 17542262 17952404
58829A7952404L25000K26898J20334J0556r8473k03493l01047l88049m62426n22622
$$ 17952404 18277404 18504302 18624636 18635192 18536719 18333226 18032179 17644130 17181704 16659082
58819A6659082n67559n97597o14673o20752o16894o04116n84338n60001n33433
$$ 16659082 16091523 15493926 14879253 14258501 13641607 13037491 12453153 11893152 11359719
58810A1359719n06566m80291m53867m26212l98049l71660l48164l26392l04979
$$ 11359719 10853153 10372862 9918995 9492783 9094734 8723074 8374910 8048518 7743539
58801G743539k84245k65151k47613k31054k15710k02247j90511j79661j69286
$$ 7743539 7459294 7194143 6946530 6715476 6499766 6297519 6107008 5927347 5758061
58792E758061j59560j50445j41288j31328j20334j08939r8288q8986q0340p1092
$$ 5758061 5598501 5448056 5306768 5175440 5055106 4946167 4847879 4758893 4678553 4607461
58782D607461o0993n1056m2156l4011k5611j6295o340L069J0713J6730K2905L0695
$$ 4607461 4546468 4495412 4453256 4419245 4393634 4377339 4370999 4374068 4384781 4401511 4424416 4455111
58770D455111L9387M7230N4117O1761P1088Q0968R0009R8398J07221J16894J27010
$$ 4455111 4494498 4541728 4595845 4657606 4728694 4809662 4899671 4998069 5105290 5222184 5349194
58759E349194J37186J47460J58290J70383J84038J98638K13448K28844K45915
$$ 5349194 5486380 5633840 5792130 5962513 6146551 6345189 6558637 6787481 7033396
58750G033396K64854K84841L05540L27504L50889L75015L99699M25737M53445
$$ 7033396 7298250 7583091 7888631 8216135 8567024 8942039 9341738 9767475 10220920
58741A0220920M81676N08931N34445N57584N77127N91929O01281O03788N96620
$$ 10220920 10702596 11211527 11745972 12303556 12880683 13472612 14073893 14677681 15274301
58732A5274301N76853N43146M95597M34464L59778K71895J72223O4022m7415j56295
$$ 15274301 15851154 16394300 16889897 17324361 17684139 17956034 18128257 18192279 18144864 17988569
58722A7988569k58600l52187m34675n02929n55423n93701o20007o34558o36768
$$ 17988569 17729969 17377782 16943107 16440178 15884755 15291054 14671047 14036489 13399721
58713A3399721o28530o14199n97149n77735n55027n29218n01720m73755m45828
$$ 13399721 12771191 12156992 11559843 10982108 10427081 9897863 9396143 8922388 8476560
58704H476560m18265l91484l65725l40919l17039k94426k73612k54731k37238
$$ 8476560 8058295 7666811 7301086 6960167 6643128 6348702 6075090 5820359 5583121
58695E583121k20263k03353j86827j71389j57327j44085j30765j17281j04787
$$ 5583121 5362858 5159505 4972678 4801289 4643962 4499877 4369112 4251831 4147044
58686D147044r4397q5592p6628o6719n6967m8653m1470l4221k6520j8920j2026
$$ 4147044 4052647 3967055 3890427 3823708 3766741 3718088 3676618 3642397 3615877 3596957 3584931
58675C584931o590l948n085r519j6205k5112l6448m8546n8278o4013o6903o8758
$$ 3584931 3578341 3574393 3569308 3559789 3543584 3518472 3482024 3433478 3375200 3311187 3244284 3175526
58663C175526o9870o9556o7789o5550o3967o3543o3815o3826o3405o3611o5041
$$ 3175526 3105656 3036100 2968311 2902761 2838794 2775251 2711436 2647610 2584205 2520594 2455553
58652B455553o6222o5156o2293o0172n9872n9654n7854n5226n3190n1266m8037
$$ 2455553 2389331 2324175 2261882 2201710 2141838 2082184 2024330 1969104 1915914 1864648 1816611
58641A816611m3860m0833l9942l9655l7677l3417k8372k4395k1966k0281j8809
$$ 1816611 1772751 1731918 1691976 1652321 1614644 1581227 1552855 1528460 1506494 1486213 1467404
58630A467404j8029j8261j8485j7419j5443j4245j4618j5702j6433j6553j5943
$$ 1467404 1449375 1431114 1412629 1395210 1379767 1365522 1350904 1335202 1318769 1302216 1286273
58619A286273j4278j1749r079o385l093P15L997O275Q337J0874J3540J5955J8507
$$ 1286273 1271995 1260246 1251167 1244782 1241689 1242404 1246401 1252676 1261013 1271887 1285427 1301382 1319889
58606A319889K1409K3999K5826K7364K8783K8973K6847K2813J7885J2073M996
$$ 1319889 1341298 1365297 1391123 1418487 1447270 1476243 1503090 1525903 1543788 1555861 1560857
58595A560857k297p637j0119j1316j3553j7385k1136k2898k2609k1831k1559k1125
$$ 1560857 1558560 1550923 1540804 1529488 1515935 1498550 1477414 1454516 1431907 1410076 1388517 1367392
58583A367392j9615j7463j5514j3212r266l993N57L080M323N639P461R639J2084
$$ 1367392 1347777 1330314 1314800 1301588 1292322 1288329 1288886 1291966 1296289 1301928 1309389 1319028 1331112
58570A331112J4588J6903J9387K2603K6139K9005L1308L4165L7736M0782M2747
$$ 1331112 1345700 1362603 1381990 1404593 1430732 1459737 1491045 1525210 1562946 1603728 1646475
58559A646475M4706M7672N1341N5283N9965O5690P1752P7524Q3382Q9797R6679
$$ 1646475 1691181 1738853 1790194 1845477 1905442 1971132 2042884 2120408 2203790 2293587 2390266
58548B390266J04241J13255J23560J33586J42204J49907J57383J64189J69765
$$ 2390266 2494507 2607762 2731322 2864908 3007112 3157019 3314402 3478591 3648356
58539C648356J74427J78249J79945J77824J70860J58150J38745J13106Q3567N2312
$$ 3648356 3822783 4001032 4180977 4358801 4529661 4687811 4826556 4939662 5023229 5075541
58529E075541K0011j2825m4701p4265j01053j23909j40556j50286j55402j58069
$$ 5075541 5095552 5082727 5038026 4963761 4862708 4738799 4598243 4447957 4292555 4134486
58519D134486j57213j50750j39637j27383j16162j05591r4800q3446p1010n7242
$$ 4134486 3977273 3826523 3686886 3559503 3443341 3337750 3242950 3159504 3088494 3031252
58509C031252m3495l1928k3075j5592q271j027O092J3476K1294K9004L5469L9032
$$ 3031252 2987757 2955829 2932754 2917162 2908891 2907864 2913956 2927432 2948726 2977730 3013199 3052231
58497C052231L8118L2604K3732J1905m136k4591m6281o5029p9407r0171r7015
$$ 3052231 3090349 3122953 3146685 3158590 3154454 3129863 3083582 3018553 2939146 2848975 2751960
58486B751960r8725r6319r3175r1231q9299q5865q1495p7313p2815o6878o0017
$$ 2751960 2653235 2556916 2463741 2372510 2283211 2197346 2115851 2038538 1965723 1898845 1838828
58475A838828n4216n0747m8998m7325m4483m0420l6117l2682l0431k8768k6782
$$ 1838828 1784612 1733865 1684867 1637542 1593059 1552639 1516522 1483840 1453409 1424641 1397859
58464A397859k4015k0993j9053j9026j9802j9056j5903j2105r959r747j0090r999
$$ 1397859 1373844 1352851 1333798 1314772 1294970 1275914 1260011 1247906 1237947 1228200 1218110 1208111
58452A208111r529q873q027p123o223m916k842k99K219M610O666P673P453P182
$$ 1208111 1198582 1189709 1181682 1174559 1168336 1163420 1160578 1160279 1162498 1167108 1173774 1181447 1188900 1196082
58438A196082Q271J0823J3921J6928J9617K1798K3776K6607L0816L5365L8936
$$ 1196082 1204353 1215176 1229097 1246025 1265642 1287440 1311216 1337823 1368639 1404004 1442940
58427A442940M1714M4702M7720M9384M8871M6547M2910L7853L1139K2912J3766
$$ 1442940 1484654 1529356 1577076 1626460 1675331 1721878 1764788 1802641 1833780 1856692 1870458
58416A870458M733l273j0549j8633k8434l8721m7126n2393n4964n5849n5596n4304
$$ 1870458 1875191 1871918 1861369 1842736 1814302 1775581 1728455 1676062 1621098 1565249 1509653 1455349
58404A455349n2085m9392m6730m3736l9199l3037k7536k4967k4304k2472j8802
$$ 1455349 1403264 1353872 1307142 1263406 1224207 1191170 1163634 1138667 1114363 1091891 1073089
58393A073089j5654j4091j2091q412n290n092o560o827n377l504j502Q91K544
$$ 1073089 1057435 1043344 1031253 1022841 1017551 1012459 1005899 999072 993695 990191 988689 989580 992124
58380I92124K248J259K039M806P484Q612Q521Q111Q234R692J2252J4264J4605
$$ 992124 994372 995631 997670 1002476 1009960 1018572 1027093 1035204 1043438 1053130 1065382 1079646 1094251
58367A094251J4037J3421J2060R524P220N985L902p60n837p528n495k827j657
$$ 1094251 1108288 1121709 1133769 1143293 1150513 1156498 1160400 1159640 1153803 1146275 1140780 1137953 1136296
58354A136296j612k056k928l511k938j840j333q81O76K624L411L474M537O683
$$ 1136296 1134684 1132628 1129700 1126189 1123251 1121411 1120078 1119197 1119873 1122497 1125908 1129382 1133919 1140602
58340A140602Q645J0403J2654J4279J3274J0051P017N062L005K62k524n233q032
$$ 1140602 1149247 1159650 1172304 1186583 1199857 1209908 1216925 1221987 1224992 1225254 1222730 1217497 1209465
58327A209465r857r691q794q923r041o912l207o25O18K810O423R444J1061J2361
$$ 1209465 1199608 1189917 1181123 1172200 1163159 1156247 1153040 1152415 1153033 1155843 1162266 1171710 1182771 1195132
58313A195132J3185J2069R692Q647R215Q957P236O428P732R339R843J0135J0762
$$ 1195132 1208317 1220386 1230078 1238725 1247940 1256897 1264133 1270561 1278293 1287632 1297475 1307610 1318372
58300A318372J0775J0273J0926J2770J3734J3434J4149J6794J9162J9740J9995
$$ 1318372 1329147 1339420 1350346 1363116 1376850 1390284 1404433 1421227 1440389 1460129 1480124
58289A480124K1352K2764K2950K2352K1483K0011J8714J9415K1643K2322K0213
$$ 1480124 1501476 1524240 1547190 1569542 1591025 1611036 1629750 1649165 1670808 1693130 1713343
58278A713343J7712J6722J5842J3466J0824R828J0294J1162J2349J3774J4492
$$ 1713343 1731055 1747777 1763619 1777085 1787909 1797737 1808031 1819193 1831542 1845316 1859808
58267A859808J4290J4207J4594J4744J5049J6993K0321K3010K4660K6893K9639
$$ 1859808 1874098 1888305 1902899 1917643 1932692 1949685 1970006 1993016 2017676 2044569 2074208
58256B074208L0535K9138K8297K9897L2519L4760L7431M0740M2620M1930M0484
$$ 2074208 2104743 2133881 2162178 2192075 2224594 2259354 2296785 2337525 2380145 2422075 2462559
58245B462559M0073M0063L9478L8728L7943L6379L4682L4836L6770L8068L8033
$$ 2462559 2502632 2542695 2582173 2620901 2658844 2695223 2729905 2764741 2801511 2839579 2877612
58234B877612L8647M0701M2615M4139M7216N1856N5253N6544N8447O2641O7500
$$ 2877612 2916259 2956960 2999575 3043714 3090930 3142786 3198039 3254583 3313030 3375671 3443171
58223C443171P1863P6773Q2003Q5276Q6658Q9312R4289R9258J03841J10892J20624
$$ 3443171 3515034 3591807 3673810 3759086 3845744 3935056 4029345 4128603 4232444 4343336 4463960
58212D463960J28976J34210J39598J47048J53742J57906J61926J66433J67216
$$ 4463960 4592936 4727146 4866744 5013792 5167534 5325440 5487366 5653799 5821015
58203E821015J61726J53166J44468J33863J20470J08563J02062R9925J00922J07288
$$ 5821015 5982741 6135907 6280375 6414238 6534708 6643271 6745333 6845258 6946180 7053468
58193G053468J19602J33699J47076J62692J82502K03294K23234K45962K73586
$$ 7053468 7173070 7306769 7453845 7616537 7799039 8002333 8225567 8471529 8745115
58184H745115L02181L29048L57559L89943M22666M54485M91183N36019N83028
$$ 8745115 9047296 9376344 9733903 10123846 10546512 11000997 11492180 12028199 12611227
58175A2611227O26280O67998P10963P51327P86373Q21010Q58866Q95672R29746
$$ 12611227 13237507 13905505 14616468 15367795 16154168 16975178 17834044 18729716 19659462
58166A9659462R69368J020468J076171J128614J181806J242329J307191J372361
$$ 19659462 20628830 21649298 22725469 23854083 25035889 26278218 27585409 28957770
58158B8957770J443433J525362J611525J696120J787792J897812K025237K167639
$$ 28957770 30401203 31926565 33538090 35234210 37022002 38919814 40945051 43112690
58150D3112690K334753K535914K766065L020843L312774L654922M043398M476720
$$ 43112690 45447443 47983357 50749422 53770265 57083039 60737961 64781359 69258079
58142F9258079M977798N575306O280594P106227Q084180R231635J0516424J1889265
$$ 69258079 74235877 79811183 86091777 93198004 101282184 110513819 121030243 132919508
58134A32919508J3330787J4839945J6424437J8168763K0278159K2967291K6291345
$$ 132919508 146250295 161090240 177514677 195683440 215961599 238928890 265220235
58127B65220235L0076658L3828201L6450237L6142428L1112126K0947232P411867
$$ 265220235 295296893 329125094 365575331 401717759 432829885 453777117 461188984
58120D61188984o331623j7507057k4950809k8980134l0516828l0433649k9374634
$$ 461188984 454857361 437350304 412399495 383419361 352902533 322468884 293094250
58113B93094250k7758546k5805542k3632197k1359762j9113321j6958373j4909539
$$ 293094250 265335704 239530162 215897965 194538203 175424882 158466509 143556970
58106A43556970j2991589j1238097r644593q180727o844758n659019m619647l699189
$$ 143556970 130565381 119327284 109682691 101501964 94657206 88998187 84378540 80679351
58098H0679351k890482k192980j555100q83895j20337P35722J654094K529468
$$ 80679351 77788869 75595889 74040789 73156894 73036557 73772279 75426373 77955841
58090G7955841L075419K876665J691400k64831k389515m081080n071363n440684
$$ 77955841 81031260 83907925 85599325 85334494 82944979 78863899 73792536 68351852
58082F8351852n412811n178888m853493m497782m138471l780309l424234l078597
$$ 68351852 62939041 57760153 52906660 48408878 44270407 40490098 37065864 33987267
58074C3987267k753599k452933k176443j926551j706760j516200j350545j207409
$$ 33987267 31233668 28780735 26604292 24677741 22970981 21454781 20104236 18896827
58066A8896827j086739r86252r00902q27604p66846p18243o77752o40860o05655
$$ 18896827 17810088 16823836 15922934 15095330 14328484 13610241 12932489 12291629 11685974
58057A1685974n71094n35414m98566m63539m32628m04413l76747l50490l27859
$$ 11685974 11114880 10579466 10080900 9617361 9184733 8780320 8403573 8053083 7725224
58048G725224l09135k93680k82074k74322k67589k58847k48522k38874k30064
$$ 7725224 7416089 7122409 6840335 6566013 6298424 6039577 5791055 5552181 5322117
58039E322117k20378k09235j97321j84826j71979j60293j50924j42756j34190
$$ 5322117 5101739 4892504 4695183 4510357 4338378 4178085 4027161 3884405 3750215
58030C750215j25517j17570j09863j02488r7965r8224j01147j03203j04150j05988
$$ 3750215 3624698 3507128 3397265 3294777 3196812 3098588 2997441 2894238 2790088 2684100
58020B684100j08439j09049j07155j04366j01362r7302r2309q7608q3059p7300
$$ 2684100 2575661 2466612 2359457 2255091 2153729 2056427 1964118 1876510 1793451 1716151
58010A716151p0493o4446n9851n5700n1517m7839m4435m0352l6035l3122l1881
$$ 1716151 1645658 1581212 1521361 1465661 1414144 1366305 1321870 1281518 1245483 1212361 1180480
57999A180480l0811k9107k7593k6817k6140k5181k4512k4319k3781k2301k0305
$$ 1180480 1149669 1120562 1092969 1066152 1040012 1014831 990319 966000 942219 919918 899613
57988H99613j8501j7245j6672j6537j6027j4558j2560j0747r234q152q232r548
$$ 899613 881112 863867 847195 830658 814631 800073 787513 776766 767532 759380 751148 741600
57976G41600j0483r441o930m692l446k819k744l364m236n004o128p498p434m842
$$ 741600 731117 721676 714746 710054 706608 703789 701045 697681 693445 688441 682313 674815 667381 662539
57962F62539j488pl72m69M56J218J344J813K995L946M294M973O616Q555R758R667
$$ 662539 661051 661044 660672 660203 660659 661877 663221 665034 668029 671975 676269 681242 687858 696413 706171 715838
57946G15838Q206O153N289O677R037J0357J0760J2117J4933J7605J8941J9523
$$ 715838 724044 730197 735486 742163 751200 761557 772317 784434 799367 816972 835913 855436
57934H55436K0085K0270J9625J8486J6989J4344R779L565l303r827j5231j9147
$$ 855436 875521 895791 915416 933902 950891 965235 975014 978579 975276 965449 950218 931071
57922I31071k1742k3306k3931k4013k4437k5472k6092k5232k3144k0567j7407
$$ 931071 909329 886023 862092 838079 813642 788170 762078 736846 713702 693135 675728
57911F75728j3535r978p788o392m700l231l258m262m283k724q53M94J829L308
$$ 675728 662193 652215 644427 638035 633335 630104 626846 622584 618301 615577 614724 615218 617047 620355
57897F20355M080L871L586L631K970O16k978o489q862r593q825p498o618o199
$$ 620355 624435 628306 631892 635523 638493 639109 636131 629642 620780 611187 602362 594864 588246 582047
57883E82047n608m745m044l540k901k223j732r50P95L219N414P027Q095Q255P336
$$ 582047 576439 571694 567650 564110 561209 558986 557254 556304 557099 560318 565732 572759 580854 589109 596445
57868E96445O076N034L392L85k909m902n944p443r349j0673j1896j4146j6445
$$ 596445 602521 607555 610947 611332 608423 603521 597577 590134 580785 570112 558216 544070 527625
57855E27625j6746j5622j5736j7257j7212j4430j1682j1304j1752j0697q818p896
$$ 527625 510879 495257 479521 462264 445052 430622 418940 407636 395884 385187 376369 368473
57843C68473p377n639l207j867j598r38L24J292K250M285O817P737O466M951N165
$$ 368473 361096 355457 352250 350383 348785 347847 348171 349463 351713 355998 362815 370552 377018 381969 387134
57828C87134O981Q943R848R192P212M992L762L703L997L972L398J825j248n137
$$ 387134 394115 403058 412906 422098 429310 434302 438064 441767 445764 449736 453134 454959 453711 448574
57814D48574p985q611p817p213p213o938n938n080n210n398l582O61M829N906
$$ 448574 440589 431978 424161 416948 409735 402797 396859 391779 386569 381171 377589 378250 383079 388985
57800C88985L765J246Q07K175L621M583N972Q368J0845J1805J0576P966N373L502
$$ 388985 392750 393996 394803 396978 400599 405182 411154 419522 430367 442172 452748 460714 466087 469589
57786D69589K106Q59q4n43p83r90q97o03j153l228n751o990o856o716p024o649
$$ 469589 471695 472554 472470 471927 471144 470154 469257 468654 467501 464273 458522 451532 444676 437960 430936 424287
57770D24287m936k966k059k164k403k319j913j347j160j982l497m520m609m643
$$ 424287 419351 416385 414326 412162 409759 407440 405527 404180 403020 401038 397541 393021 388412 383769
57756C83769n236n644n103m327m568n803o878p114o946p142p957q891q895p271
$$ 383769 378533 372889 367786 363459 358891 353088 346210 339096 332150 325008 317051 308160 299265 291994
57742B91994m710k884k595k891k409r97N28J587K191K590L113M047N250O210O597
$$ 291994 287284 284400 281805 278914 276505 275508 276036 277623 279814 282404 285517 289564 294814 301024 307621
57727C07621O307N168L458K580L797O178P349O865O912Q730J0242R004N984M190
$$ 307621 313928 319096 322554 325134 328931 335109 342458 349323 356235 364965 375207 384211 390195 394385
57713C94385M365M370K691L75q97j022j249k745n766r317j1574j1538j0272r593
$$ 394385 398750 403120 405811 406186 405289 404267 403018 400273 394507 385190 373616 362078 351806 342213
57699C42213r717r392q223p312p272p139o007m542l904l987l728k704j517p50
$$ 342213 332496 323104 314881 307569 300297 293158 287151 282609 278705 274718 270990 268286 266769 266019
57685B66019k73M99K003L986N402N201L585K123K156L420M623N025M884M567M046
$$ 266019 265746 266245 268248 272234 277636 282837 286422 288545 290701 294121 298744 303769 308653 313220 317266
57670C17266L360K942L168L934M894N756O171N745M680M037M831O888R113J0712
$$ 317266 320626 323568 326736 330670 335564 341320 347491 353236 357916 361953 366784 373672 382785 393497
57656C93497J1618J1919J1675J1420J1924J3122J4013J4049J3792J3765J3525
$$ 393497 405115 417034 428709 440129 452053 465175 479188 493237 507029 520794 534319
57645E34319J2771J2397J3439J5558J7674J9430K0998K2019K2286K2958K5350
$$ 534319 547090 559487 572926 588484 606158 625588 646586 668605 690891 713849 739199
57634G39199K8699L0797L1048L1033L1786L2342L1715L0662L0428L1129L2399
$$ 739199 767898 798695 829743 860776 892562 924904 956619 987281 1017709 1048838 1081237
57623A081237L4622L8375M3464M9379N5997O3130P0226P7271Q5177R4518J04695
$$ 1081237 1115859 1154234 1197698 1247077 1303074 1366204 1436430 1513701 1598878 1693396 1798091
57612A798091J15093J26254J39045J53414J68511J83540J98058K12126K26176
$$ 1798091 1913184 2039438 2178483 2331897 2500408 2683948 2882006 3094132 3320308
57603C320308K39025K45388K37201K09247J63266J06301M6355r934n7928r5937
$$ 3320308 3559333 3804721 4041922 4251169 4414435 4520736 4567091 4557157 4499229 4403292
57593D403292j25074j46854j61663j70346j75403j78594j78711j73906j65245
$$ 4403292 4278218 4131364 3969701 3799355 3623952 3445358 3266647 3092741 2927496
57584B927496j55631j46043j35459j24093j13856j05268r6412q5885p4801o4987
$$ 2927496 2771865 2625822 2490363 2366270 2252414 2147146 2050734 1964849 1890048 1825061
57574A825061n6725m9136m1636l4258k7337k1416j6718j2605q276l911j45L239
$$ 1825061 1768336 1719200 1677564 1643306 1615969 1594553 1577835 1565230 1556954 1553043 1552898 1556137
57562A556137O927J0709J3855J6741K0523K5349L0405L5756M2314M9847N6789
$$ 1556137 1563064 1573773 1587628 1604369 1624892 1650241 1680646 1716402 1758716 1808563 1865352
57551A865352O2504O8074P4482Q1632Q9487R8120J06070J10807J11955J12076
$$ 1865352 1927856 1995930 2070412 2152044 2241531 2339651 2445721 2556528 2668483 2780559
57541B780559J12740J11572J04898R1942P4441N3361K8481R36k6179n0352p1408
$$ 2780559 2893299 3004871 3109769 3201711 3276152 3329513 3357994 3358930 3332751 3282399 3210991
57530C210991r0226j06704j19606j27836j31469j31777j30379j28054j24368j18582
$$ 3210991 3120765 3014061 2894455 2766619 2635150 2503373 2372994 2244940 2120572 2001990
57520B001990j10894j02523r4766q8125q2253p6523p0723o5173o0249n5945n2111
$$ 2001990 1891096 1788573 1693807 1605682 1523429 1446906 1376183 1311010 1250761 1194816 1142705
57509A142705m8747m5665m2249l8184l4150l1014k8601k6094k3439k1222j9303
$$ 1142705 1093958 1048293 1006044 967860 933710 902696 874095 848001 824562 803340 784037
57498G84037j6796j3673j1110r721q555o648m648m037n108o462o350m187j004
$$ 784037 767241 753568 742458 732737 724182 717534 712886 708849 703741 697279 690929 686742 685738
57485F85738J494K618L431N274P778R250R134R012J0666J3874J6758J7919J7878
$$ 685738 687232 689850 693281 698555 706333 715583 724717 733729 744395 758269 775027 792946 810824
57472H10824J8454K0753K3653K4856K3898K3324K5751L0422L4230L5804L6837
$$ 810824 829278 850031 873684 898540 922438 945762 971513 1001935 1036165 1071969 1108806
57461A108806L9348M3521M8621N4230N9746O4169O7312P0176P3429P6678P9694
$$ 1108806 1148154 1191675 1240296 1294526 1354272 1418441 1485753 1555929 1629358 1706036 1785730
57450A785730Q2942Q6184Q8017Q7521Q5058Q0610P2842O0960M6085K9657J1750
$$ 1785730 1868672 1954856 2042873 2130394 2215452 2296062 2368904 2429864 2475949 2505606 2517356
57439B517356p688k7145m4557n9175p1096p9894q5080q7325q7852q7077q4817
$$ 2517356 2509668 2482523 2437966 2378791 2307695 2227801 2142721 2055396 1967544 1880467 1795650
57428A795650q1170p6287p0062o2977n6405n1046m6076m0790l6014l2641k9933
$$ 1795650 1714480 1638193 1568131 1505154 1448749 1397703 1351627 1310837 1274823 1242182 1212249
57417A212249k6685k2979j9227j4739r083l930j374r31j39K243N493Q938J2576
$$ 1212249 1185564 1162585 1143358 1128619 1119536 1115606 1114232 1113301 1113162 1115405 1120898 1129836 1142412
57404A142412J5822J7870J9422K2251K6776L1721L6362M1192M6134N0032N2648
$$ 1142412 1158234 1176104 1195526 1217777 1244553 1276274 1312636 1353828 1399962 1449994 1502642
57393A502642N5490N9692O4514O8789P2483P5775P7664P6761P2886O6875N9032
$$ 1502642 1558132 1617824 1682338 1751127 1823610 1899385 1977049 2053810 2126696 2193571 2252603
57382B252603M8601L4832J8213N90j6177l1780m7278o2839p6253q4687q7733q7778
$$ 2252603 2301204 2336036 2354249 2354839 2338662 2306882 2259604 2196765 2120512 2035825 1948092 1860314
57370A860314q7389q7205q6258q3473p8713p3063o8098o4238o0184n4778m8906
$$ 1860314 1772925 1685720 1599462 1515989 1437276 1364213 1296115 1231877 1171693 1116915 1068009
57359A068009m4360m1199l7797l3432k9276k6443k4494k2507k0420j8619j7127
$$ 1068009 1023649 982450 944653 911221 881945 855502 831008 808501 788081 769462 752335
57348G52335j5858j4902j4004j2428r975p620o511o613o758n849l955k337k284
$$ 752335 736477 721575 707571 695143 685168 677548 671037 664424 657666 651817 647862 645525 643241
57335F43241l682m958m781l315j477L59K138L312L463L142K963K291K52k305l333
$$ 643241 639559 634601 629820 626505 625028 625387 627525 630837 634300 637442 640405 642696 642948 640643 637310
57320F37310k087K93K562M342N284M965L943L454L638L342K130J135J405K671
$$ 637310 635223 635516 638078 642420 647704 652669 656612 660066 663704 667046 669176 670311 671716 674387
57306F74387M301O195Q019Q735P816O245N530O227P819R465J0483J0664J0314
$$ 674387 678688 684883 692902 701637 709453 715698 721228 727455 735274 744739 755222 765886 776200
57293G76200R707Q720P611P422Q551R488Q627O899O771Q734J0801J1707J2367
$$ 776200 785907 794627 802238 809660 818211 827699 836326 843225 849996 858730 869531 881238 893605
57280H93605J3564J4353J3819J2587J1453J0166Q755Q529J0305J2805J4164J4088
$$ 893605 907169 921522 935341 947928 959381 969547 978302 986831 997136 1009941 1024105 1038193
57268A038193J3540J3300J3780J5167J6755J7186J6342J5796J6466J7108J6310
$$ 1038193 1051733 1065033 1078813 1093980 1110735 1127921 1144263 1160059 1176525 1193633 1209943
57257A209943J4745J4073J4677J5810J7000J8007J8397J8501J9958K3891K9210
$$ 1209943 1224688 1238761 1253438 1269248 1286248 1304255 1322652 1341153 1361111 1385002 1414212
57246A414212L3814L6686L7847L7514L6687L7205L9571M1735M1820M0965M1551
$$ 1414212 1448026 1484712 1522559 1560073 1596760 1633965 1673536 1715271 1757091 1798056 1839607
57235A839607M3474M4554M4063M3488M3816M4324M4326M4138M3949M3357M2520
$$ 1839607 1883081 1927635 1971698 2015186 2059002 2103326 2147652 2191790 2235739 2279096 2321616
57224B321616M2251M2606M2799M2689M2922M3440M3434M3248M4511M7662N0869
$$ 2321616 2363867 2406473 2449272 2491961 2534883 2578323 2621757 2665005 2709516 2757178 2808047
57213B808047N2372N2590N2847N3136N2532N0942M8995M6554M2779L7678L2438
$$ 2808047 2860419 2913009 2965856 3018992 3071524 3122466 3171461 3218015 3260794 3298472 3330910
57202C330910K7850K3284J7845J1960P090M051K338J315J305K970O066R609J3014
$$ 3330910 3358760 3382044 3399889 3411849 3418939 3422990 3425328 3426643 3427948 3430918 3436984 3446593 3459607
57189C459607J6394J9753K2803K5564K8255L0524L1732L2205L3022L4241L4541
$$ 3459607 3476001 3495754 3518557 3544121 3572376 3602900 3634632 3666837 3699859 3734100 3768641
57178C768641L3236L1411L0200K9167K7431K5325K3703K2555K1677K1868K3909
$$ 3768641 3801877 3833288 3863488 3892655 3920086 3945411 3969114 3991669 4013346 4035214 4059123
57167D059123K6816K8829K9877L1553L4886L9624M5690N3559O2643P0801P6323
$$ 4059123 4085939 4114768 4144645 4176198 4211084 4250708 4296398 4349957 4412600 4483401 4559724
57156D559724P9492Q1485Q2568Q2227Q0551P8527P6834P4975P2018O8008O4173
$$ 4559724 4639216 4720701 4803269 4885496 4966047 5044574 5121408 5196383 5268401 5336409 5400582
57145E400582O1522N9617N7308N4371N1666M9672M7908M5961M4093M2383M0250
$$ 5400582 5462104 5521721 5579029 5633400 5685066 5734738 5782646 5828607 5872700 5915083 5955333
57134E955333L7518L5192L4505L5944L9600M5585N3378O1604O9257P6328Q2730
$$ 5955333 5992851 6028043 6062548 6098492 6138092 6183677 6237055 6298659 6367916 6444244 6526974
57123F526974Q7538R0061R0555Q9056Q4756P7577O8997N9906M8911L4689J9136
$$ 6526974 6614512 6704573 6795128 6884184 6968940 7046517 7115514 7175420 7224331 7259020 7278156
57112G278156O104k846r539j6089k2430k7176k9580l0018k9351k8228k6607k4036
$$ 7278156 7284260 7281414 7271875 7255786 7233356 7206180 7176600 7146582 7117231 7089003 7062396 7038360
57100G038360k0683j7779j6580j7447k0446k6122l4910m6211n8699p0934q1313
$$ 7038360 7017677 6999898 6983318 6965871 6945425 6919303 6884393 6838182 6779483 6708549 6627236
57089F627236q8408r2139r3940r5149r6102r7084r8730j00744j01738j01337j01147
$$ 6627236 6538828 6446689 6352749 6257600 6161498 6064414 5965684 5864940 5763202 5661865 5560718
57078E560718j02649j05801j10800j19442j33132j50960j71448j94910k22861
$$ 5560718 5458069 5352268 5241468 5122026 4988894 4837934 4666486 4471576 4248715
57069D248715k56470k96749l44379l97794m53500n10092n69957o35154H0717f92699
$$ 4248715 3992245 3695496 3351117 2953323 2499823 1989731 1419774 784620 80717 -692699
57058a536588r16954r92649j070882j154241j246138j347715j459246j582855
$$ -1536588 -2453542 -3446191 -4517073 -5671314 -6917452 -8265167 -9724413 -11307268
57050a1307268j721074j874937k046445k240612k461753k710133k985452l290722
$$ -11307268 -13028342 -14903279 -16949724 -19190336 -21652089 -24362222 -27347674 -30638396
57042c0638396l628955l999204m399884m832198n295538n784166o294953o834265
$$ -30638396 -34267351 -38266555 -42666439 -47498637 -52794175 -58578341 -64873294 -71707559
57034g1707559p409933q019894q654846r303893r944394j0532091j1021237j1399497
$$ -71707559 -79117492 -87137386 -95792232 -105096125 -115040519 -125572610 -136593847 -147993344
57026a47993344j1685374j1871901j1863381j1466446j0468630q795399o661904
$$ -147993344 -159678718 -171550619 -183414000 -194880446 -205349076 -214144475 -220806379
57019b20806379m562226l007814k170691j753127j230456k40860J236349L011395
$$ -220806379 -225368605 -228376419 -230547110 -232300237 -233530693 -233771553 -232535204 -229523809
57011b29523809M905764O837780Q766851J0624688J2302523J3672872J4619084
$$ -229523809 -224618045 -217780265 -209013414 -198388726 -186086203 -172413331 -157794247
57004a57794247J5069273J5021923J4542987J3738435J2724926J1608732J0470294
$$ -157794247 -142724974 -127703051 -113160064 -99421629 -86696703 -75087971 -64617677
56997f4617677R358708Q301044P315753O415784N604972M880252M238543L677952
$$ -64617677 -55258969 -46957925 -39642172 -33226388 -27621416 -22741164 -18502621 -14824669
56989a4824669L193822K778329K423793K122993J867009g92271F62699J289286
$$ -14824669 -11630847 -8852518 -6428725 -4305732 -2438723 -792271 662699 1951985
56981A951985J146392J023255R18179Q29813P55079O89870O31065N76240N22791
$$ 1951985 3098377 4121632 5039811 5869624 6624703 7314573 7945638 8521878 9044669
56972I044669M69677M19087L74304L36294L03815K75568K50227K25185J97271
$$ 9044669 9514346 9933433 10307737 10644031 10947846 11223414 11473641 11698826 11896097
56963A1896097J64607J27123Q6617M7372J4785q826k6122m1120n5094o7581p9439
$$ 11896097 12060704 12187827 12274444 12321816 12336601 12327775 12301653 12260533 12205439 12137858 12058419
56952A2058419r2272j05785j18092j27978j34787j37145j34276j28188j22266
$$ 12058419 11966147 11860362 11742270 11614292 11479505 11342360 11208084 11079896 10957630
56943A0957630j17761j13461j08124j00890q9561p1611m8381k7024j7468k7968
$$ 10957630 10839869 10726408 10618284 10517394 10427833 10356222 10307841 10280817 10263349 10235381
56933A0235381o2831j21545j97799k80042l55116m13433m52025m73479m82131
$$ 10235381 10172550 10051005 9853206 9573164 9218048 8804615 8352590 7879111 7396980
56924G396980m81134m72620m59153m43332m26045m06774l86008l65629l46170
$$ 7396980 6915846 6443226 5984073 5540741 5114696 4707922 4321914 3956285 3610115
56915C610115l25478l01507k75199k49248k25129k02755j81917j62350j43062
$$ 3610115 3284637 2983130 2707931 2458683 2233554 2030799 1848882 1686532 1543470
56906A543470j23367j04227q7132p2027n7745m4053l1826k1363j1970l224M450
$$ 1543470 1420103 1315876 1228744 1156717 1098972 1054919 1023093 1001730 989760 986536 990986
56895I90986J0373J3793J3751R832L074m650j1863j7456k0306k0186j8664j7610
$$ 990986 1001359 1015152 1028903 1038735 1041809 1037159 1025296 1007840 987534 967348 948684 931074
56883I31074j6977j5211j1713p650m303j803L78K632N070P483R438J1026J3091
$$ 931074 914097 898886 887173 879523 875220 873417 873795 876427 881497 888980 898418 909444 922535
56870I22535J5895J8045J7715J4494R047J588p802j7610k5318k9590l0883l0005
$$ 922535 938430 956475 974190 988684 997731 999319 991517 973907 948589 918999 888116 858111
56858H58111k7560k4866k3598k3901k4133k3074k1208j9325j7242j4754j2627
$$ 858111 830551 805685 782087 758186 734053 710979 689771 670446 653204 638450 625823
56847F25823j1549j0897r629p862o590o269o458o564o197n174l785k791k504k206
$$ 625823 614274 603377 593748 585886 579296 573027 566569 560005 553808 548634 544849 542058 539554 537348
56833E37348j194nL17KN55K786N770Q205R984J1635J2833J2523J0525Q026O150
$$ 537348 536154 536149 536466 536468 537023 539809 545579 553784 563768 575403 588236 600759 611284 619310 625460
56818F25460M700K896Q34n04m57P75K624M528N899O585P427R512J2609J5309J7126
$$ 625460 630160 633056 633890 633386 632929 633704 636328 640856 646755 653340 660767 670279 682888 698197 715323
56803G15323J9429K3459K8229L1621L3108L4033L5101L4804L0919K2905J2272
$$ 715323 734752 758211 786440 818061 851169 885202 920303 955107 986026 1008931 1021203
56792A021203J175q692j6082k0031k0360j8174j5304j2748r872n446O02P008J2692
$$ 1021203 1022378 1013686 997604 977573 957213 939039 923735 910987 901115 895669 896271 903279 915971
56779I15971J7716K2577K7327L1955L7087M3591N1545N9796O5965O6644N8660
$$ 915971 933687 956264 983591 1015546 1052633 1096224 1147769 1207565 1273530 1340174 1398834
56768A398834M1528J8637m729k4584l9234m8130n1309m9975m6267m1688l6396
$$ 1398834 1440362 1458999 1454270 1429686 1390452 1342322 1291013 1241038 1194771 1153083 1116687
56757A116687l0235k3736j7636j2059o625r45N209J1801J8315K4204K9800L5899
$$ 1116687 1086452 1062716 1045080 1033021 1026396 1025451 1030660 1042461 1060776 1084980 1114780 1150679
56745A150679M1831M4468M0136K7716R685r530k5941l7468m4163m7362m8211m6983
$$ 1150679 1192510 1236978 1277114 1304830 1314515 1304985 1279044 1241576 1197413 1150051 1101840 1054857
56733A054857m3918m0127l6743l3327k8328k1486j4819j0343p481l791J844Q035
$$ 1054857 1010939 970812 934069 900742 872414 850928 836109 825766 818285 814494 816338 824373
56721H24373J2983J6600J9622K1405J9787J3426L531p010j5846k2299k6704k9273
$$ 824373 837356 853956 873578 894983 914770 928196 931727 924717 908871 886572 859868 830595
56709H30595k9839k8540k6365k4625k3793k3164k1842j9843j7883j6329j4859
$$ 830595 800756 772216 745851 721226 697433 674269 652427 632584 614701 598372 583513
56698E83513j3194j1648j0669j0159r497q176o264m429l492l736m421m249k718
$$ 583513 570319 558671 548002 537843 528346 520170 513906 509477 505985 502249 497828 493579 490861
56685D90861q74l37j400k593k405j100k63o35j268j110o31j019k221k901k328
$$ 490861 489987 489650 488250 485657 483252 482152 481889 481254 479986 478876 478245 477226 475005 472104 469776
56670D69776j319q94r09n91K03Q72P73l89k396m229m521k968r16M1l29j165j830
$$ 469776 468457 467563 466654 466063 466266 467138 467911 467522 465126 460897 456376 453408 452492 452533 452204 451039 449209
56653D49209k226k283k003j655j216q8J744K923K217M34n69m57n22j203j254J00
$$ 449209 446983 444700 442697 441042 439826 439738 441482 444405 446622 447056 446487 446030 445508 444305 443051 443151
56637D43151J700K017J052j85j101j446p81Q92K420K618J813J280J293Q15o72
$$ 443151 444851 446868 447920 447735 446634 445188 444407 445299 447719 450337 452150 453430 454723 455538 454866
56622D54866k043j933p16j96j342l081l794l416l215l718l917k854j044L50R85
$$ 454866 452823 450890 450174 449978 448636 445555 441761 438345 435130 431412 427495 424641 423597 423947 424932
56607D24932J301J614K018K607K989K234L26j056m75J149J858J671K472M905P175
$$ 424932 426233 427847 429865 432472 435461 437695 438021 436965 436490 437639 439497 441168 443640 448545 455720
56592D55720P489O105M330K833J752J329J577J988K292K841L750M352L977K765
$$ 455720 463209 469314 473644 476477 478229 479558 481135 483123 485415 488256 492006 496358 500335 503100
56578E03100J429O30O20Q84M00j053k205k003j320j491j795n45J467J314j709
$$ 503100 504529 505159 505779 506663 507063 506010 503805 501802 500482 498991 497196 496651 498118 499432 497723
56563D97723m708n242m309l813l303j511O94J261n0j730k842l484l546k869k188
$$ 497723 493015 487773 483464 479651 476348 474837 475531 476792 476742 475012 472170 468686 465140 462271 460083
56548D60083k264k427j555n6N65o6q92j114q28k11N95R97N76k2M7M65N33Q06K291
$$ 460083 457819 455392 453837 453781 454346 454280 453388 452274 451446 451235 451830 452827 453403 453381 453428 453893 454426 455232 457523
56529D57523M257M700L126J266N71O14N73P79J753K792K761J819J284J817K556
$$ 457523 461780 466480 469606 470872 471443 472057 472630 473409 475162 477954 480715 482534 483818 485635 488191
56514D88191K284J045R4K43P14J51j350k095q90J507L525M636N365N993O235O042
$$ 488191 490475 491520 491614 491857 492571 492722 491372 489277 488387 489894 493419 498055 503420 509413 515648 521690
56498E21690N942O394P151P404O634N405N076O223P603P609O470N704N535M608
$$ 521690 527632 534026 541177 548581 555215 560620 565696 571919 579522 587131 593601 599305 604840 609448
56484F09448K662J456J983K629J578n23k028l008m464n856n805m673m248m914
$$ 609448 612110 613566 615549 618178 619756 619233 617205 614197 609733 603877 598072 593399 589151 584237
56470E84237n288m749m325m690n058m776m532n117n981n913m610l051k505l293
$$ 584237 578949 574200 569875 565185 560127 555351 550819 545702 539721 533808 529198 526147 523642 520349
56456E20349m370m334l145k197k285k463j746r09j256k394k930k801l087l759
$$ 520349 515979 511645 508500 506303 504018 501555 499809 498900 497644 495250 492320 489519 486432 482673
56442D82673l529k137j004j073j580j575j270j131q08J52J299J772J321L90l45
$$ 482673 479144 477007 476003 474930 473350 471775 470505 469374 468566 468718 470017 471789 473110 473500 473155
56427D73155k97N83J496J562J036J046J973K814K437Q82q45j689j165L32J583
$$ 473155 472858 473441 474937 476499 477535 478581 480554 483368 485805 486687 485842 484153 482988 483320 484903
56412D84903J532M85j18O39K138L109L111K775K774L044L182L330M125N560O500
$$ 484903 486435 486920 486802 487441 489579 492688 495799 498574 501348 504392 507574 510904 515029 520589 527089
56397E27089O021M693L731L306K864K727L710N165N309L978L083L641M300L843
$$ 527089 533110 537803 541534 544840 547704 550431 554141 559306 564615 568593 571676 575317 579617 583460
56383E83460L060K748J939M6j167j34J517J122q61j665m83O44N8j839m104o096
$$ 583460 586520 589268 591207 591253 590086 589952 591469 592591 591730 590065 589582 590226 590284 588445 584341 578245
56367E78245o812n497l328k528l559m725m799m270l899l681l531l468k918j231
$$ 578245 571433 565936 562608 560080 556521 551796 546997 542727 538828 535147 531616 528148 525230 523999
56353E23999Q84J745O78j513l700m939m277j727R73K094K000J992J901P99o59
$$ 523999 524883 526628 527306 525793 522093 517154 512877 511150 512123 514217 516217 518209 520110 520909 520250
56338E20250j069q35j337j864n05J892J968j103l947l754k012j710l044l852k903
$$ 520250 519181 518346 517009 515145 514640 516532 518500 517397 513450 509696 507684 505974 502930 499078 496175
56323D96175q39J216K546K870K433J696P08n45j313q16K56M34k91n72K2N56P38
$$ 496175 495336 496552 499098 501968 504401 506097 506805 506260 504947 504131 504387 504821 504530 503958 503980 504536 505274
56306E05274J381K543L191L124L318L908L850L142L193M222M517L329K363L073
$$ 505274 506655 509198 512389 515513 518831 522739 526589 529731 532924 537146 541663 544992 547355 550428
56292E50428M404M677M049L650L596L328K902K717K729K790L031L385L694M405
$$ 550428 554832 559509 563558 567208 570804 574132 577034 579751 582480 585270 588301 591686 595380 599785
56278E99785N939P293O913N067L581K976K052O60M56J988L446L447K930L078L485
$$ 599785 605724 613017 619930 624997 628578 631554 633606 634266 634722 636710 640156 643603 646533 649611 653096
56263F53096L767M864P096Q820Q748P948P861P955P083N808N432N858O136O196
$$ 653096 656863 661727 668823 677643 686391 694339 702200 710155 717238 723046 728478 734336 740472 746668
56249G46668O518O998P417Q157R294R925R561R061R168R286Q879Q816R886J1058
$$ 746668 753186 760184 767601 775758 785052 794977 804538 813599 822767 832053 840932 849748 859634 870692
56235H70692J0630Q460N990M711N288P357R381R717Q434P175O917P118P309P825
$$ 870692 881322 889782 895772 900483 905771 913128 922509 932226 940660 947835 954752 961870 969179 977004
56221I77004Q498Q458P965Q545J0658J3036J5016J7352J9927K1223K1150K1890
$$ 977004 985502 993960 1001925 1010470 1021128 1034164 1049180 1066532 1086459 1107682 1128832 1150722
56209A150722K4401K6695K7451K8746L2798L8181M1948M3949M6336N0079N4479
$$ 1150722 1175123 1201818 1229269 1258015 1290813 1328994 1370942 1414891 1461227 1511306 1565785
56198A565785N9230O4591P0152P5395Q0918Q7367R3933R9541J04651J10251J15847
$$ 1565785 1625015 1689606 1759758 1835153 1916071 2003438 2097371 2196912 2301563 2411814 2527661
56187B527661J20062J22467J23298J22183J18628J13147J06497R8416Q8075P5140
$$ 2527661 2647723 2770190 2893488 3015671 3134299 3247446 3353943 3452359 3540434 3615574
56177C615574N9726M2445K5103R899k970j5244k7408l7597m4850n1127n8245o4876
$$ 3615574 3675300 3717745 3742848 3752747 3749777 3734533 3707125 3669528 3624678 3573551 3515306 3450430
56165C450430o8623o9511o9361o9099o8784o8991p0200p1702p2701p3543p4504
$$ 3450430 3381807 3312296 3242935 3173836 3105052 3036061 2965861 2894159 2821458 2747915 2673411
56154B673411p4763p3903p2912p2332p1226o9359o8365o8882o8655o5631o1127
$$ 2673411 2598648 2524745 2451833 2379501 2308275 2238916 2170551 2101669 2033014 1967383 1906256
56143A906256n7543n4735n1159m7102m4021m1760l8924l5345l1969k9048k6320
$$ 1906256 1848713 1793978 1742819 1695717 1651696 1609936 1571012 1535667 1503698 1474650 1448330
56132A448330k4153k2809k1394j9115j6578j4518j2616j0789r907r782q397n025
$$ 1448330 1424177 1401368 1379974 1360859 1344281 1329763 1317147 1306358 1296451 1286669 1278272 1273247
56120A273247k142k108l649l736j418K095N461P515P404O339P256J0906J4368
$$ 1273247 1271105 1268997 1265348 1261612 1260194 1262289 1267750 1275265 1282669 1289008 1296264 1307170 1321538
56107A321538J5232J4812J5212J5924J5894J6206J7890J9661K0597K2412K5960
$$ 1321538 1336770 1351582 1366794 1382718 1398612 1414818 1432708 1452369 1472966 1495378 1521338
56096A521338K8418K7576K6155K7874L1582L3527L3421L3839L5358L6727L8492
$$ 1521338 1549756 1577332 1603487 1631361 1662943 1696470 1729891 1763730 1799088 1835815 1874307
56085A874307M1935M5589M7109M7831N1213N7568O4266P0453P7552Q5770R4164
$$ 1874307 1916242 1961831 2008940 2056771 2107984 2165552 2229818 2300271 2377823 2463593 2557757
56074B557757J03684J16253J31179J46182J61455J78804J97065K11981K20619
$$ 2557757 2661441 2777694 2908873 3055055 3216510 3395314 3592379 3804360 4024979
56065D024979K22686K18144K07120J91966J76061J60718J45918J32855J22076
$$ 4024979 4247665 4465809 4672929 4864895 5040956 5201674 5347592 5480447 5602523
56056E602523J09909R0806O3436L1631j33k9145n3338p1636q5476r7411j08573
$$ 5602523 5712432 5803238 5866674 5898305 5898172 5869027 5815689 5744053 5658577 5561166 5452593
56045E452593j19662j32840j49592j67874j84109j96442k03533k02908j94083
$$ 5452593 5332931 5200091 5050499 4882625 4698516 4502074 4298541 4095633 3901550
56036C901550j80913j66960j51077j31661j12228r7455q6194p4105o1260n1149
$$ 3901550 3720637 3553677 3402600 3270939 3158711 3061256 2975062 2900957 2839697 2788548
56026B788548m3716l5703k7050k0774j6861j2148o233k040m23N85J402O35r75
$$ 2788548 2744832 2709129 2682079 2661305 2644444 2632296 2626063 2624023 2623600 2624185 2625587 2626222 2625247
56013B625247j257o47q49m92K733O753P575O022O197Q340R412R990J3829K0627
$$ 2625247 2623990 2623343 2622494 2622002 2624735 2631488 2639063 2645085 2651282 2659622 2669034 2679024 2692853 2713480
55999B713480K5766K7638K9197L1990L4495L6474L9295M1887M2018M1200M2664
$$ 2713480 2739246 2766884 2796081 2828071 2862566 2899040 2938335 2980222 3022240 3063440 3106104
55988C106104M5330M5919M5853M9204N4764N7508N7327N8651O1915O3349O3175
$$ 3106104 3151434 3197353 3243206 3292410 3347174 3404682 3462009 3520660 3582575 3645924 3709099
55977C709099O5732P0953P3929P3779P4979P8969Q2291Q4009Q7168R1849R4650
$$ 3709099 3774831 3845784 3919713 3993492 4068471 4147440 4229731 4313740 4400908 4492757 4587407
55966D587407R5900R9786J06597J12665J18229J26888J37108J43360J46317J52532
$$ 4587407 4683307 4783093 4889690 5002355 5120584 5247472 5384580 5527940 5674257 5826789
55956E826789J63203J72887J80378J90840K05583K19688K31573K45231K61417
$$ 5826789 5989992 6162879 6343257 6534097 6739680 6959368 7190941 7436172 7697589
55947G697589K76463K91337L11679L37461L62884L87539M16660M49620M80409
$$ 7697589 7974052 8265389 8577068 8914529 9277413 9664952 10081612 10531232 11011641
55938A1011641N10669N49166N96278O42301O83518P26083P71229Q11240Q44084
$$ 11011641 11522310 12071476 12667754 13310055 13993573 14719656 15490885 16302125 17146209
55929A7146209Q77851R16448R55119R94030J041442J098746J157134J213667J275853
$$ 17146209 18024060 18940508 19895627 20889657 21931099 23029845 24186979 25400646 26676499
55920B6676499J346319J418883J493571J578493J672842J766575J861726J974976
$$ 26676499 28022818 29441701 30935272 32513765 34186607 35953182 37814908 39789884
55912C9789884K114205K272540K450066K659437K904943L179758L489424L852587
$$ 39789884 41904089 44176629 46626695 49286132 52191075 55370833 58860257 62712844
55904F2712844M273550M743298N274921N907297O666622P557374Q595190R804444
$$ 62712844 66986394 71729692 77004613 82911910 89578532 97135906 105731096 115535540
55896A15535540J1172223J2653084J4237235J5969346J7892687K0038599K2481873
$$ 115535540 126707763 139360847 153598082 169567428 187460115 207498714 229980587
55889B29980587K5317445K8544589L2040304L5590568L8651395L9889075L7273765
$$ 229980587 255298032 283842621 315882925 351473493 390124888 430013963 467287728
55882D67287728K9266988J6296209R76683j3330546k4312788l1362224l5008565
$$ 467287728 496554716 512850925 513827608 500497062 476184274 444822050 409813485
55875D09813485l6110870l5471826l3754531l1434656k8799838k6039667k3311600
$$ 409813485 373702615 338230789 304476258 273041602 244241764 218202097 194890497
55868A94890497k0718389j8294460j6056925j4037595j2250697j0674065r285898
$$ 194890497 174172108 155877648 139820723 125783128 113532431 102858366 93572468
55861I3572468q087658p074620o216979n487490m879340m381169l960903l590070
$$ 93572468 85484810 78410190 72193211 66705721 61826381 57445212 53484309 49894239
55853D9894239l262159k974782k715724k478382k269967k092117j931422j779074
$$ 49894239 46632080 43657298 40941574 38463192 36193225 34101108 32169686 30390612
55845C0390612j641686j523072j413258j305723j208780j129521j061408r97309
$$ 30390612 28748926 27225854 25812596 24506873 23298093 22168572 21107164 20109855
55837B0109855r40373q92770q47085p98083p50866p09409o68909o26930n90235
$$ 20109855 19169482 18276712 17429627 16631544 15880678 15171269 14502360 13875430 13285195
55828A3285195n62993n39245n13956m90495m70475m47574m18716l90816l69134
$$ 13285195 12722202 12182957 11669001 11178506 10708031 10260457 9841741 9450925 9081791
55819I081791l48964l25855l04321k88955k75953k60599k44959k31463k17023
$$ 9081791 8732827 8406972 8102651 7813696 7537743 7277144 7032185 6800722 6583699
55810F583699k00034j85464j76623j69285j59914j52401j50710j52066j53197
$$ 6583699 6383665 6198201 6021578 5852293 5692379 5539978 5389268 5237202 5084005
55801E084005j56228j62468j67152j66374j63019j60361j55917j47283j37979
$$ 5084005 4927777 4765309 4598157 4431783 4268764 4108403 3952486 3805203 3667224
55792C667224j31937j27702j23314j21341j23801j27226j27796j26504j24837
$$ 3667224 3535287 3407585 3284271 3162930 3039129 2911903 2784107 2657603 2532766
55783B532766j20579j12463j03922r7593r0990q1930p3117o7010o1176n3311m6029
$$ 2532766 2412187 2299724 2195802 2098209 2007219 1925289 1852172 1785162 1723986 1670675 1624646
55772A624646m2027l9080l4332k9167k5548k1870j6701j2335j0558r094o278m866
$$ 1624646 1582619 1543539 1509207 1480040 1454492 1432622 1415921 1403586 1393028 1383934 1377656 1372790
55760A372790p091j0250j1430j2399j5441j8516j9097j9034k1049k3768k4695
$$ 1372790 1365699 1355449 1344019 1331620 1316179 1297663 1278566 1259532 1238483 1214715 1190020
55749A190020k4768k5878k6836k5948k4624k4664k4838k3686k2610k2665k1500
$$ 1190020 1165252 1139374 1112538 1086590 1061966 1037302 1012464 988778 966168 943503 922003
55738I22003j7315j2764j1080j1087r816p406n814n026m060l426l547k910o86
$$ 922003 904688 891924 880844 869757 859941 852535 846721 841695 837635 834209 830662 827752 827066
55725H27066J279J621J986L772N229M470K571J125l01j811j580M34N74l544r195
$$ 827066 828345 829966 831952 835724 840953 845423 847994 849119 848818 847007 845427 845861 846435 842891 833696
55710H33696j2682j4334j6178j7777j7817j7194j7138j6543j4214j1338r132o739
$$ 833696 821014 806680 790502 772725 754908 737714 720576 704033 689819 678481 669349 662610
55698F62610m131m001p656j1886j3133j2176j1555j1188r695p566n856m165k695
$$ 662610 658479 654478 646822 634936 621803 609627 598072 586884 577189 569623 563767 559602 556907
55685E56907l684p868j2309j4476j5589j7110j7395j5199j2999j3022j3112j0597
$$ 556907 553223 545355 533046 518570 502981 485871 468476 453277 440278 427256 414144 403547
55673D03547p313o464p145o386m440l572l617l017k580m008o268p264p576q703
$$ 403547 396234 389770 382625 376239 371799 368227 364610 361593 359013 355005 348737 341473 333897 325194
55659C25194r394p726n241m772n552m609j964l52n41q44n97n05j05J544L149K494
$$ 325194 315800 308074 302833 298061 292509 287900 285936 285584 285043 284199 283602 283097 282992 284536 287685 290179
55643B90179J66j088l30R11J329Q18o01k459l486l524m298o262o778m077p88l07
$$ 290179 290345 289257 288927 289838 291167 291985 291384 288925 285439 281915 277617 271355 264577 260500 259712 259405
55627B59405j736j843j58J514K892M691N780M735L013K924L787L695L584N418
$$ 259405 257669 255826 255668 257182 260074 264765 270545 275280 278293 281217 285004 288699 292283 297701
55613B97701P738P417M933L414L243K182L68K94J773J584j228m052n357o588q387
$$ 297701 305439 312856 317789 321203 324446 326628 326996 327290 329063 330647 329419 325367 320010 313422 305035
55598C05035q925p399n831n654n419l288L63L961O439P199O263M850M055L053
$$ 305035 296110 288711 282880 277226 271807 268519 268882 272843 279282 286481 292744 297594 301649 304702
55584C04702N89k138k585o58J209J700J654J544O77q06j812k412l665n161n206
$$ 304702 305291 303153 300568 299910 301119 302819 304473 306017 306694 305888 304076 301664 297999 292838 287632
55569B87632l772k777l250m413n646o932p546o777n919o780q343p890n545m347
$$ 287632 283860 281083 277833 273420 267774 260842 253296 246519 240600 233820 225477 217587 212042 207695
55555B07695n323n852m051j706j318k605l544l100j606k7K47j532l951m466k533
$$ 207695 202372 196520 192469 190763 189445 186840 183296 180196 178590 178563 178810 177278 173327 168861 166328
55540A66328j40J099J574K045K253J842J031n4j355k033j219L94J278J329J459
$$ 166328 166188 167287 168861 170906 173159 175001 176032 175978 174623 172590 171371 171765 173043 174372 175831
55525A75831J304k73k366k280O64L922N057M411L706L805M619N623N816M632L268
$$ 175831 177135 176862 174496 172216 172880 176802 181859 186270 189976 193781 198400 204023 209839 214471 217739
55510B17739L685O068Q773J0826J2711J4655J6043J6750J7199J6861J4639J0939
$$ 217739 221424 227492 236265 247091 259802 274457 290500 307250 324449 341310 355949 366888
55498C66888P475M721J502k682o906j0674j4338j7380j8333j7075j5337j4449
$$ 366888 374363 379084 380586 377904 370998 360324 345986 328606 310273 293198 277861 263412
55486B63412j4261j4503j5140j5180j3245r919p417o593o251n798o097p093p038
$$ 263412 249151 234648 219508 204328 191083 181164 173747 167154 160903 155105 149008 141915 134877
55473A34877n216l210k439k278j702q75j06R56K100K218J215N72J085J716J482
$$ 134877 129661 126451 124012 121734 120032 119157 119051 120007 122107 124325 125540 126112 127197 128913 130395
55458A30395P56j09j476k765k188M86K775K529O00j030k156l700n436o126n202
$$ 130395 131151 131042 129566 126801 124613 125099 127874 130403 131003 129973 127817 124117 118681 112555 107353
55443A07353l034k59J982K205K61j881k298j446j128j713j831o57P10N77j248
$$ 107353 104319 104060 106042 108247 108508 106627 104329 102883 101755 100042 98211 97554 98264 98841 97593
55428I7593l220l816l107k255j723j003k33o00k290l568l219k592l406m750m454
$$ 97593 94373 90557 87450 85195 83472 82469 82236 81636 79346 75778 72559 69967 66561 61811 57357
55413E7357k550q88L3J134K014R96j800m073m488l933l210j917k51N06o9r68j604
$$ 57357 54807 53919 53952 55086 57100 58096 56296 52223 47735 43802 40592 38675 38424 38930 38861 37893 36289
55396C6289k097j639Q64M128N218L647K069J977J687j99k177k446j684j369j368
$$ 36289 34192 32553 33417 37545 42763 46410 48479 50456 52143 51944 49767 47321 45637 44268 42900
55381D2900r99n93l99L39J725K407J740R22O90n9j887l156k507j074m08j17O19
$$ 42900 41901 41308 40909 41248 42973 45380 47120 48042 48732 48673 46786 43630 41123 40049 39641 39524 40143
55364D0143J085O52M90J558K461J572j79q98p18r39j331q31P9L0p55q19K09J571
$$ 40143 41228 41880 42370 43928 46389 47961 47782 46884 46166 45227 43896 43065 43144 43174 42419 41600 41809 43380
55346D3380L042M697N559M531K407J095J017Q49k16j380j489l94Q98R12q49k784
$$ 43380 46422 51119 56678 61209 63616 64711 65728 66577 66361 64981 63492 63098 63996 64908 64059 61275
55330F1275k698q97j37j514k478o11K572L903L114K405K545K229R95N6N1K28Q6
$$ 61275 58577 57680 57543 56029 53551 52940 55512 59415 62529 64934 67479 69708 70703 70759 70810 71038 71124
55313G1124o0l33j289k401k283q96j7r76l021m362l936k035M6Q51J8j350k149
$$ 71124 71064 70731 69442 67041 64758 63862 63845 62869 59848 55486 51550 49515 49561 50412 50430 49080 46931
55296D6931k521k897k661j076Q69J216l91k229k701j925r29l32j04QJ36M6n76
$$ 46931 44410 41513 38852 37776 38645 39861 39470 37241 34540 32615 31686 31354 31250 31258 31394 31440 30864
55279C0864j370j295Q0J874L021L474L588L081J586k42j203r23j40J33o37k018
$$ 30864 29494 28199 28279 30153 33174 36648 40236 43317 44903 44661 43458 42535 42395 42528 41891 39873
55263C9873k620j483L82R95K87L12J917L171K469J154J092J379j8k491l459k237
$$ 39873 37253 35770 36152 37147 37434 37746 39663 42834 45303 46457 47549 48928 48910 46419 42960 40723
55247D0723o44J05N52Q58o7k435m483m448k384M77K915L878K741L21j343q90J066
$$ 40723 40079 40184 40736 41594 41527 39092 34609 30161 27777 28254 31169 35047 37788 38109 36766 35876 36942
55230C6942K749K841J312o38j438o03P08J142Q83J164K336L315K873Q51j770l417
$$ 36942 39691 42532 43844 43206 41768 41165 41873 43015 43898 45062 47398 50713 53586 54437 52667 49250
55214D9250l012j162J28k68j214j030J39P99L46m58r29r74m17Q97K301K767K144
$$ 49250 46238 45076 45204 44936 43722 42692 42831 43630 43976 43518 42589 41615 41198 42095 44396 47163 49307
55197D9307J025l39j930l018k664j217j86l52r58r50k19O25J122J291J345J190
$$ 49307 50332 49993 48063 45045 42381 41164 40978 40626 39668 38718 38499 39124 40246 41537 42882 44072
55181D4072L09j354k605k084l62M16n39j558j152j36J69K19J079K282K765K873
$$ 44072 44381 43027 40422 38338 37976 38392 37853 36295 35143 35007 35176 35395 36474 38756 41521 44394
55165D4394L394L620K427N52l69m76j099k059j958q84m30r47j127n03l2Q2Q36
$$ 44394 47788 51408 53835 54387 54018 53542 52443 50384 48426 47542 47112 46165 45038 44535 44503 44585 45421
55148D5421K172K490J291K07N39J419J463P49J83J16M10R02J169P80N6l50n28
$$ 45421 47593 50083 51374 51581 52120 53539 55002 55751 55934 56050 56460 57362 58531 59311 59367 59017 58489
55131E8489r07j020l39Q0j141k914k578J2J937J447J41k81o73j997k652q49J980
$$ 58489 57582 56562 56223 56303 55162 52248 49670 49682 51619 53066 53207 52926 52253 50256 47604 46755 48735
55114D8735K800J148p20j333j375j610j513n57O90J337J199N99j45p17p77l19
$$ 48735 51535 52683 51963 50630 49255 47645 46132 45575 46265 47602 48801 49400 49255 48538 47761 47442
55098D7442J35r2j072j947j673l98L95k20j175q86K94N41o18j564j065J44P87
$$ 47442 47577 47485 46413 44466 42793 42395 42790 42570 41395 40509 40803 41344 40726 39162 38097 38241 39028
55081C9028O69J29o81j211n34J122K138J795J365J914K404J579L65M87J558J663
$$ 39028 39697 39826 39145 37934 37400 38522 40660 42455 43820 45734 48138 49717 50082 50569 52127 53790
55065E3790N23j07O74J596J355N66O03J588K511K807K781K642J928K57j715k554
$$ 53790 54313 54206 54880 56476 57831 58397 59000 60588 63099 65906 68687 71329 73257 73514 71799 69245
55049F9245j428J046L446M876N262M705L306J640O01M00L89J18p0N8r6j088k264
$$ 69245 67817 68863 72309 77185 82447 87152 90458 92098 92699 93099 93488 93606 93536 93594 93498 92410 90146
55032I0146k318r03Q79J683J178J21n32m73j73l48j309k637l324k414m0K189K599
$$ 90146 87828 86925 87804 89487 90665 90786 90254 89781 89608 89260 87951 85314 81990 79576 79536 81725 84324
55015H4324J495Q75J644K368J621L26J10M51l23j767j639M23K056J687N41J05
$$ 84324 85819 86694 88338 90706 92327 92653 92763 93214 92891 91124 89485 89908 91964 93651 94192 94297
54999I4297j57j163k069j614l03M11J34p19k028l335l212j109J121J375L07J82
$$ 94297 94140 92977 90908 89294 88991 89402 89536 88817 86789 83454 80242 79133 80254 81629 81936 82118
54983H2118J272J583J33j642k175j531l20J423L381M261L194R78p83j295o96N55
$$ 82118 83390 84973 85106 83464 81289 79758 79438 80861 84242 88503 91697 92675 91892 90597 89901 90456
54967I0456J733J905Q21n42j032o31k25k70l07K35J324K388K767K176J044K89
$$ 90456 92189 94094 94915 94373 93341 92710 92485 92215 91908 92143 93467 95855 98622 100798 101842 102131
54951A02131L99P98O66K17M66J593K358J802P56P45J757K371K003J676K176K775
$$ 102131 102530 103328 103994 104211 104677 106270 108628 110430 111186 111931 113688 116059 118062 119738 121914 124689
54935A24689K535J756J173O94R8N8J066K005J438q2o62J22P65K11r90k154l364
$$ 124689 127224 128980 130153 130847 130945 131003 132069 134074 135512 135430 134768 134890 135655 135866 134876 132722 129358
54918A29358m439m665m164l972m080l115q09R99J059P36J665K910K429L88j147
$$ 129358 124919 120254 116090 112118 108038 104923 104114 105113 106172 106908 108573 111483 113912 114300 113153
54903A13153j358j247j284n43J304L009L436K928K299J651J000R93K007L217L620
$$ 113153 111795 110548 109264 108721 110025 113034 116470 119398 121697 123348 124348 125341 127348 130565 134185
54888A34185L522L976M982N461N173N409O948Q322P519N092L940N526P967Q867
$$ 134185 137707 141683 146665 152126 157299 162708 169656 177978 185497 190589 194529 200055 208022 216889
54874B16889Q707R616J1708J2846J2003J0651J0171R755P902M627J113j864m107
$$ 216889 225596 235212 246920 259766 271769 282420 292591 302346 310248 314875 315988 314124 310017
54861C10017n595o864q926j1835j4072j4276j2859j1043r196p260n959o174p495
$$ 310017 304422 297558 288632 276797 262725 248449 235590 224547 215351 208091 202132 195958 188463
54848A88463q593q728q016o612m675k777j411l35Q17J767K330L243N149P339Q662
$$ 188463 179870 171142 163126 156514 151839 149062 147651 147316 148133 149900 152230 155473 160622 167961 176623
54833A76623R247R986J0740J0619R878R901J1134J2366J2433J1329R332O221K059
$$ 176623 185870 195856 206596 217215 227093 236994 248128 260494 272927 284256 293588 299809 301868
54820C01868k168n425p639r384j0945j1964j1869j0643r374r494j0969j1892j0729
$$ 301868 299700 294275 286636 277252 266307 254343 242474 231831 222457 212963 201994 190102 179373
54807A79373q403o991o828o410m926l229k127j388q70j118k046k398j365K61J335
$$ 179373 170970 163979 157151 150741 145815 142586 140459 139071 138201 137083 135037 132639 131274 131535 132870
54792A32870J743J723J011l85j391j099k03l3o64j129j193j668k922m127m345
$$ 132870 134613 136336 137347 136962 135571 134472 134269 134236 133572 132443 131250 129582 126660 122533 118188
54777A18188l586k583j965j859j972j959j819j828j948j679q20l0j41j158k388
$$ 118188 114602 112019 110054 108195 106223 104264 102445 100617 98669 96990 96170 96140 95999 94841 92453
54762I2453l212l267k307o19O29M77n09q25M2J154J674J803J814J353M81M49K183
$$ 92453 89241 85974 83667 83048 83677 84154 83645 82820 82862 84016 85690 87493 89307 90660 91141 91590 93773
54745I3773M623N744M992L521K191Q31l38j16J877L979M242K813J525J540K469
$$ 93773 98396 104140 109132 112653 114844 115675 115337 115221 117098 121077 125319 128132 129657 131197 133666
54730A33666L523M355M721M421L937M291N869P972R772J1119J2135J2677J2686
$$ 133666 137189 141544 146265 150686 154623 158914 164783 172755 182527 193646 205781 218458 231144
54717B31144J2611J2994J3870J4772J5020J3918J1172P496M233K047L21j748l974
$$ 231144 243755 256749 270619 285391 300411 314329 325501 332997 337230 339277 339598 337850 333876
54704C33876n583o419p080p866q255p618o215n118n005n174m127j426J510K931
$$ 333876 328293 321874 314794 306928 298673 291055 284840 279722 274717 269543 265416 263990 265500 268431
54690B68431K801K637L466M810N826O485P304Q464R707J0511J0226Q611O511N258
$$ 268431 271232 273869 277335 282145 287971 294456 301760 310224 319931 330442 340668 349279 355790 361048
54676C61048N157N235M901M908N953P074O401L258j127m783o547o785p059q763
$$ 361048 366205 371440 376341 381249 387202 394276 400677 403935 402808 398025 391478 384693 377634 368871
54662C68871j1822j4957j7199j8463j8638j7290j4703j2258j0942j0370r888r579
$$ 368871 357049 342092 324893 306430 287792 270502 255799 243541 232599 222229 212341 202762
54650B02762r411q469o282m012l009k867k366j659j940l180l896l264k051j180
$$ 202762 193351 184882 178600 174588 171579 168712 166346 164687 162747 159567 155671 152407 150356 149176
54636A49176o44q9N56J328K211K686K164J018K75K17J36m06j071j492j602j059
$$ 149176 148532 148443 148999 150327 152538 155224 157388 158406 158681 158898 159034 158628 157557 156065 154463 153404
54620A53404M12J898J883L91o43R7J541J901J210R95K042L642M823N267N000M126
$$ 153404 153816 155714 157597 157988 157345 157442 158983 160884 162094 163089 165131 168773 173596 178863 183863 187989
54604A87989L101K632K969L628L971L801L212K297J233N16P19J875L350M459N045
$$ 187989 191090 193722 196691 200319 204290 208091 211303 213600 214833 215349 216068 217943 221293 225752 230797
54589B30797N286N174M600L886L733M426N548O661P922R604J1448J2896J3912
$$ 230797 236083 241257 245857 249743 253476 257902 263450 270111 278033 287637 299085 311981 325893
54576C25893J5021J6507J7853J8136J7047J5339J3958J2670J0141N778R02k887
$$ 325893 340914 357421 375274 393410 410457 425796 439754 452424 462565 468343 469245 466358
54564D66358n877r430j3327j5733j5959j5415j5157j4396j2598j1130j1212j1710
$$ 466358 460481 451051 437724 421991 406032 390617 375460 361064 348466 337336 326124 314414
54552C14414j0926r345q547q320p086m806l169l044l719m701o186p513p274n462
$$ 314414 303488 294143 285596 277276 270190 265384 262215 259171 255452 250751 244565 237052 229778 224316
54538B24316l815l529m148n042o262p311o864m671k213o53M34J438J459q0j824
$$ 224316 220501 216972 212824 207782 201520 194209 187345 182674 180461 179808 180242 181680 183139 183059 181235
54523A81235k043j014n11j355k568k631r21J687L119J712j776m462m253j870N83
$$ 181235 179192 178178 177667 176312 173744 171113 170192 171879 174998 176710 174934 170472 166219 164349 164932
54508A64932K036K559K197J022j31l56M7K4o63j177p95M14J918K917K477M41j786
$$ 164932 166968 169527 171724 172746 172615 172259 172306 172330 171667 170490 169695 170109 172027 174944 177421 177862 176076
54491A76076k254m94K108L890M266L507K138R83R22J939K822K531J584J348K098
$$ 176076 173822 173328 175436 179326 183592 187099 189237 190220 191142 193081 195903 198434 200018 201366 203464
54476B03464K750K789L228M891O635O781N824N943P625Q712P607N649M895N098
$$ 203464 206214 209003 212231 217122 223757 230538 236362 242305 249930 258642 266249 271898 276793 281891
54462B81891M794M101M187M516L208K04k272k990l300m682o555p618p804p703
$$ 281891 286685 290786 294973 299489 302697 302901 300629 297639 294339 289657 283102 275484 267680 259977
54448B59977p240o205n153m704m530l951k906j793r67q18j441j916j000R45J979
$$ 259977 252737 246532 241379 236675 232145 228194 225288 223495 222528 221710 220269 218353 217353 218298 220277
54433B20277J218J43L52J398J884J508P47l69j727k354j710q77r57j031N23L153
$$ 220277 221495 221638 221990 223388 225272 226780 227527 227158 225431 223077 221367 220490 219533 218502 219025 222178
54417B22178M476L496J764J187J960K925K907J532l29r18O26K890L609K383R12
$$ 222178 226654 230150 231914 233101 235061 237986 240893 242425 242096 241178 241804 244694 248303 250686 251598
54402B51598N89J047J275Q86j17j707l355m036l344k108j404j397j486j126k07
$$ 251598 252187 253234 254509 255395 255278 253571 250216 246180 242836 240728 239324 237927 236441 235315 235108
54387B35108R45J613J128l80j874k385j963j580k111l393m300l902k593j644j512
$$ 235108 236053 237666 238794 238414 236540 234155 232192 230612 228501 225108 220808 216906 214313 212669 211157
54372B11157j260j37R30M68j227k090r04J073J614J51j719k168j036K90N94J20
$$ 211157 209897 209760 210690 211158 209931 207841 206937 208010 209624 209775 208056 205888 204852 205142 205736 205856
54356B05856K5P88J668J724R64K01P9N83J185J303Q36M62R67K189L161L456L735
$$ 205856 205881 206669 208337 210061 211025 211226 211305 211888 213073 214376 215212 215674 216641 218830 221991 225447 229182
54339B29182M528N264N145M451M072M149L975L108J925J084Q87J104J155P06K61
$$ 229182 233710 238974 244119 248570 252642 256791 260766 263874 265799 266883 267770 268874 270029 270735 270996
54324B70996O36J479J201j008l780n154n002m794n283n610m802l168j970k269
$$ 270996 271632 273111 274312 273304 269524 264370 259368 254574 249291 243681 238879 235711 233741 231472
54310B31472m042n910o027l982j580r09j750j937l50J596J854L30j153j061K62
$$ 231472 227430 221520 215493 211511 209931 209022 207272 205335 204985 206581 208435 208765 207612 206551 206813
54295B06813J200P74k55k95J148K919L615K943J475j35r86M7K924N634N987M112
$$ 206813 208013 208787 208532 208237 209385 212304 215919 218862 220337 220202 219216 219263 222187 227821 233808 237920
54279B37920K015Q27p1j101j385m60J61j464m983p716p485m840k260j555k413
$$ 237920 239935 240762 240691 239590 238205 237745 237906 236442 231459 223743 216258 211418 209158 207603 205190
54264B05190l302l366l062l135l569l819l662l312k921k354j551q11o59j334k372
$$ 205190 201888 198522 195460 192325 188756 184937 181275 177963 175042 172688 171137 170326 169667 168333 165961
54249A65961k859k477k001k099k111j016M77M46j403l070l171k744l029l193k075
$$ 165961 163102 160625 158624 156525 154414 153398 153875 154321 152918 149848 146677 143933 140904 137711 135636
54234A35636o58o48j560j612q27o93j130n01J118J517q6j567j249m31r92k338
$$ 135636 134978 134330 132770 131158 130331 129638 128508 128007 129125 130642 130556 128989 127740 127309 126317 123979
54218A23979k611j670r36j041j310j188p93k99J44K00j06j9R13J918K030J491
$$ 123979 121368 119698 118762 117721 116411 115223 114430 114131 114275 114475 114369 114350 115263 117181 119211 120702
54202A20702J216J250R57L65J73N25Q34Q50R57J264J337J092J083J613K148K086
$$ 120702 121918 123168 124125 124490 124663 125188 126022 126872 127829 129093 130430 131522 132605 134218 136366 138452
54186A38452J448N02q24k534l902l870k262k05Q88N89l79r39n66N20J547J627
$$ 138452 139900 140402 139578 137044 133142 129272 127010 126805 127693 128282 127903 126964 126398 126918 128465 130092
54170A30092M57j184k013j574p32m74o39l85L96Q72N69N4K05J134K110K198R16
$$ 130092 130549 129365 127352 125778 125046 124572 123933 123548 123944 124816 125385 125439 125644 126778 128888 131086 132002
54153A32002j296l108l206j561M10J006k59k255l183k179k09Q83M51l04p1P84
$$ 132002 130706 127598 124392 122831 123241 124247 123988 121733 118550 116371 116162 117045 117496 117192 117121 117905
54137A17905R65K47l39j53L28N58O94R39R24K73p81j667k081k051j734j387j225
$$ 117905 118870 119117 118778 118625 118953 119511 120205 121144 122068 122341 121560 119893 117812 115761 114027 112640 111415
54120A11415j281j504j779j685p18P71J536J009L00N31R23lj729k128o87N23j78
$$ 111415 110134 108630 106851 105166 104448 105219 106755 107764 108064 108595 109518 109515 107786 105658 104971 105494 105316
54103A05316j706j853k28J543J926R25j98k35O49R70j98j695j738n90j98j194
$$ 105316 103610 101757 101529 103072 104998 105923 105725 105490 106139 107109 106911 105216 103478 102888 102690 101496
54087A01496k148k198k255k689k094J24J745M71k568m092k634N01L423M942M339
$$ 101496 99348 97150 94895 92206 90112 90236 91981 92452 89884 85792 83158 83659 87082 92024 96363
54072I6363J966j28j6J684K768K508J958J428j48k839m793m599l135k104j912
$$ 96363 98329 98201 98185 99869 102637 105145 107103 108531 108383 105544 100751 96152 93017 90913 89001
54057H9001j864j496p48L58J415J587N32r96j991k145j662p88N8M31N68J344K911
$$ 89001 87137 85641 84893 85251 86666 88253 88785 87789 85798 83653 81991 81203 81261 81692 82260 83604 86515
54040H6515M098L835K591J589J107O04J72O07J811K238P97j383k081p27R60J369
$$ 86515 90613 94448 97039 98628 99735 100339 100511 101118 102929 105167 105964 104581 102500 101773 102733 104102
54024A04102J059J608L059L860L229K235J939J831J043J49L40J345J629O50m99
$$ 104102 105161 106769 109828 113688 116917 119152 121091 122922 123965 124114 124454 125799 127428 128078 127579
54009A27579q48p27p82r25q78q67j021q46N0J146J589J244O71L41M17R28J619
$$ 127579 126731 126004 125222 124297 123419 122552 121531 120685 120735 121881 123470 124714 125385 125726 126143 127071 128690
53992A28690J843J143j31j112j211m69O06J329J431J575K726M570N317L822J341
$$ 128690 130533 131676 131545 130433 129222 128753 129359 130688 132119 133694 136420 140990 146307 150129 151470
53977A51470J68R95K741M590O639Q429Q670P196N833O060O943O753N740N585O584
$$ 151470 151638 152633 155374 159964 166603 175032 183702 190898 196731 202791 209734 216487 222227 227812 234396
53962B34396P283O933O440O404N975M658L647M045M897M453K715J200N77J40n59
$$ 234396 241679 248612 255052 261456 267431 272089 275736 279781 284678 289131 291846 293046 293623 293763 293204
53947B93204j051j036r39j086j398k032l317m762n400n358n806o886p080n517
$$ 293204 292153 291117 290178 289092 287694 285662 282345 277583 272183 266825 261019 254133 247053 241536
53933B41536l548k901l293l378l210l917n350n914n008l935l696l392j952k93
$$ 241536 237988 235087 231794 228416 225206 221289 215939 210025 205017 201082 197386 193994 192042 191749
53919A91749j85j486k144j155J3k98j466j654o32K5m84j076p46j68k54k90R81
$$ 191749 191564 190078 187934 186779 186792 186494 185028 183374 182742 182767 182283 181207 180461 180293 180039 179749 180730
53902A80730K964L567J946m72j870j766o36R32K215K443J587M71j65j49N95J995
$$ 180730 183694 187261 189207 188735 186865 185099 184463 185395 187610 190053 191640 192111 191946 191797 192392 194387
53886A94387L157K964J808J531K995M839N453N077M888N122N262N322N599N746
$$ 194387 197544 200508 202316 203847 206842 211681 217134 222211 227099 232221 237483 242805 248404 254150
53872B54150N328M954N546O748P254O621N664N053M502L472J901J54j130j322
$$ 254150 259478 264432 269978 276726 283980 290601 296265 301318 305820 309292 311193 311347 310217 308895
53858C08895m91M82J109K097M065O053O617O117O354P876R158Q900P775P159P240
$$ 308895 308404 308886 309995 312092 316157 322210 328827 334944 341298 349174 358332 367232 375007 382166 389406
53843C89406P320P152O964O561N455L786K313J374N22n80j433j384q06q79k013
$$ 389406 396726 403878 410842 417403 422858 426644 428957 430331 430853 430273 428840 427456 426650 425771 423758
53828D23758l265l799m260n616p134p070n414m265m806n647n295m590n081o283
$$ 423758 420493 416694 412434 406818 399684 392614 387200 382935 378129 372482 367187 362597 357516 351233
53814C51233o699o601p509r201r677q304o708o054n608m783m608n898p638q582
$$ 351233 344534 337933 330424 321223 311546 303242 296534 290480 284872 280089 275481 269583 261945 253363
53800B53363q966r244q439n590j987nr1n72l72k73j177k639l652l887l540k793
$$ 253363 244397 235153 226714 221124 219137 219132 219041 218469 218097 217824 216647 214008 210356 206469 202929 200136
53784B00136j949j538j688j814j368n53R1L67L25j94j163j840j396j89M10k03
$$ 200136 198187 196649 194961 193147 191779 191226 191317 191684 192009 191815 190652 188812 187416 187227 187637 187434
53768A87434r39m27J093K061J562K41o92o02L82J566J961J215M11R45K520L289
$$ 187434 186495 186068 187161 189222 190784 191025 190333 189731 190113 191679 193640 194855 195266 196211 198731 202020
53752B02020K536J825K574L785L574K083J243K008L459M498M950M942M590M495
$$ 202020 204556 206381 208955 212740 216314 218397 219640 221648 225107 229605 234555 239497 244087 248582
53738B48582N325O589P010O295N372M768M017L099L021M217N576N935N527N146
$$ 248582 253907 260496 267506 273801 279173 283941 287958 291057 294078 298295 303871 309806 315333 320479
53724C20479M677L530J985J070J240J825J694K43j917l142k221Q6J625J134p14
$$ 320479 325156 328686 330671 331741 332981 334806 336500 336743 334826 331684 329463 329549 331174 332308 331594
53709C31594k716m399n435n107l436j955k180l766n192n713n536m531k237P55
$$ 331594 328878 324479 319044 313937 310501 308546 306366 302600 297408 291695 286159 281628 279391 280146
53695B80146K642K122m03l424n566o120n199l850l421m259n245n044l659k350
$$ 280146 282788 284910 284507 281083 275517 269397 264198 260348 256927 252668 247423 242379 238720 236370
53681B36370k045k337k224j453n84O6P60J513J686J019K39q1n77j963l292k771
$$ 236370 234325 231988 229764 228311 227727 227793 228553 230066 231752 232771 233010 232929 232352 230389 227097 224326
53665B24326l07K133K862K035O73n32r70j19J407K003J170M46J180K497K658J601
$$ 224326 224019 226152 229014 231049 231722 231190 230220 230101 231508 233511 234681 235127 236307 238804 241462 243063
53649B43063P66Q14J099J187J500K233K746K541K089K211K978L580L271K321J871
$$ 243063 243829 244643 245742 246929 248429 250662 253408 255949 258038 260249 263227 266807 270078 272399 274270
53634B74270K571L571L551K696K587L911N432N871N615N598N600N010M436N013
$$ 274270 276841 280412 283963 286659 289246 293157 298589 304460 310075 315673 321273 326283 330719 335732
53620C35732O468P348O991N945M636L030J647J483K534L516L405K412J258M14
$$ 335732 342200 349548 356539 362484 367120 370150 371797 373280 375814 379330 382735 385147 386405 386819
53606C86819K18P85J545J726J402J211J006L4j369j698m47R37J101O16P75J556
$$ 386819 387037 387822 389367 391093 392495 393706 394712 394746 393377 391679 391232 392169 393270 393886 394661 396217
53590C96217J949J636J081L97n94j387j104L8O39j73j696k644k518j676o26J73
$$ 396217 398166 399802 400883 401280 400686 399299 398195 398233 398872 398699 397003 394359 391841 390165 389539 389712
53574C89712K90k10m86K71J640K220J331n0n00J76J152K106L496N141N675M304
$$ 389712 390002 389792 389306 389577 391217 393437 394768 394718 394218 394394 395546 397652 401148 406289 411964 416268
53558D16268K359K039L740N706O337N855N371N272N235N246N692O411O512N486
$$ 416268 418627 420666 424406 430112 436449 442304 447675 452947 458182 463428 469120 475531 482043 487529
53544D87529M192M113N691P735Q796Q819Q877R489R856R078P458O099N678O111
$$ 487529 491721 495834 501525 509260 518056 526875 535752 545241 555097 564175 571633 577732 583410 589521
53530E89521P022P929Q229P623O477N317M227L189K583K704L093L098K864K954
$$ 589521 596543 604472 612701 620324 626801 632118 636345 639534 642117 644821 647914 651012 653876 656830
53516F56830L279L339L226L306L058J550p53k044j539o19r25k365l611l699k407
$$ 656830 660109 663448 666674 669980 673038 674588 673835 671791 670252 669633 668708 666343 662732 659033 656626
53501F56626q7K004K206L83j474j689j190j939l747m371k719k39J249J601J644
$$ 656626 656539 658543 660749 661132 659658 657969 656779 654840 651093 646722 644003 643764 645013 646614 648258
53486F48258J679J552J369J304J281J457K394M028N165M899M109M486O227P850
$$ 648258 649937 651489 652858 654162 655443 656900 659294 663322 668487 673386 677495 681981 688208 696058
53472F96058Q357Q557R621J1226J2099J1998J2153J3544J5503J6561J6371J6156
$$ 696058 704415 712972 722593 733819 745918 757916 770069 783613 799116 815677 832048 848204
53460H48204J7268J9776K2599K4730K5963K6675K7308K8119K9194L0492L1932
$$ 848204 865472 885248 907847 932577 958540 985215 1012523 1040642 1069836 1100328 1132260
53449A132260L3440L4953L6481L8248M0530M3190M5562M7195M8506N0231N2250
$$ 1132260 1165700 1200653 1237134 1275382 1315912 1359102 1404664 1451859 1500365 1550596 1602846
53438A602846N3684N4345N5293N7362N9649O0426N9406N8160N8010N8454N8273
$$ 1602846 1656530 1710875 1766168 1823530 1883179 1943605 2003011 2061171 2119181 2177635 2235908
53427B235908N7561N7735N9578O2021O3363O3224O2886O3630O5165O5897O4703
$$ 2235908 2293469 2351204 2410782 2472803 2536166 2599390 2662276 2725906 2791071 2856968 2921671
53416B921671O2086N9469N7596N5963N3703N0619M7237M4201M1804L9785L7452
$$ 2921671 2983757 3043226 3100822 3156785 3210488 3261107 3308344 3352545 3394349 3434134 3471586
53405C471586L4248L0476K7265K5505K4896K4232K2543J9749J6359J2795R013
$$ 3471586 3505834 3536310 3563575 3589080 3613976 3638208 3660751 3680500 3696859 3709654 3718667
53394C718667M728n9m924r621j4494j9802k4846k8621l1518l5170m0163m4855
$$ 3718667 3723395 3723336 3718412 3708791 3694297 3674495 3649649 3621028 3589510 3554340 3514177 3469322
53382C469322m7519m8787n0665n3568n5836n6191n5262n4293n3636n3054n2610
$$ 3469322 3421803 3373016 3322351 3268783 3212947 3156756 3101494 3047201 2993565 2940511 2887901
53371B887901n2418n2131n1278m9853m8091m6051m3585m0517l6735l2521k8708
$$ 2887901 2835483 2783352 2732074 2682221 2634130 2588079 2544494 2503977 2467242 2434721 2406013
53360B406013k5796k2939j8640j2707o599j609K377O000R443J2994J7464K3174
$$ 2406013 2380217 2357278 2338638 2325931 2319332 2317723 2320100 2326100 2335543 2348537 2366001 2389175
53348B389175K9236L4699L9727M4789M9450N3024N5733N8138O0055O1274O2908
$$ 2389175 2418411 2453110 2492837 2537626 2587076 2640100 2695833 2753971 2814026 2875300 2938208
53337B938208O6475P1727P6702Q0173Q2862Q6035Q9984R4431R9355J04745J10082
$$ 2938208 3004683 3076410 3153112 3233285 3316147 3402182 3492166 3586597 3685952 3790697 3900779
53326C900779J14694J18293J21059J23458J26144J29465J32970J35806J37701
$$ 3900779 4015473 4133766 4254825 4378283 4504427 4633892 4766862 4902668 5040369
53317E040369J39033J39894J39684J37949J35067J31762J28279J24297J19299
$$ 5040369 5179402 5319296 5458980 5596929 5731996 5863758 5992037 6116334 6235633
53308F235633J12871J04926R5971Q7008P9000P2397O6913O1704N6030N0070M4562
$$ 6235633 6348504 6453430 6549401 6636409 6715409 6787806 6854719 6916423 6972453 7022523 7067085
53297G067085L9218L2123K1731R200k536j2210k1686l3594m8428o4683q0906r6575
$$ 7067085 7106303 7138426 7160157 7169357 7166821 7154611 7132925 7099331 7050903 6986220 6905314 6808739
53285F808739j11234j23928j33805j40794j45488j48538j50333j51102j51088
$$ 6808739 6697505 6573577 6439772 6298978 6153490 6004952 5854619 5703517 5552429
53276E552429j50670j50202j49730j48815j46739j43229j39096j35883j34335
$$ 5552429 5401759 5251557 5101827 4953012 4806273 4663044 4523948 4388065 4253730
53267D253730j33279j30701j26069j20885j16691j13141j08723j02687r5564q8221
$$ 4253730 4120451 3989750 3863681 3742796 3626105 3512964 3404241 3301554 3205990 3117769
53257C117769q1246p4943o9105o3007n6343m9920m4696m0344l5639k9994k3921
$$ 3117769 3036523 2961580 2892475 2829468 2773125 2723205 2678509 2638165 2602526 2572532 2548611
53246B548611j8299j4065j2043j1783j0897p220j590K957M978N927P435R217J0655
$$ 2548611 2530312 2516247 2504204 2492421 2481524 2474304 2472714 2475671 2480649 2486576 2494011 2503228 2513883
53233B513883J2588J6000K0106K3373K5807K8757L2809L7260M1363M4999M8182
$$ 2513883 2526471 2542471 2562577 2585950 2611757 2640514 2673323 2710583 2751946 2796945 2845127
53222B845127N0927N3540N6214N8446N9588N9811N9770N9510N8611N7291N6321
$$ 2845127 2896054 2949594 3005808 3064254 3123842 3183653 3243423 3302933 3361544 3418835 3475156
53211C475156N5707N4337N1301M6973M2566L9056L6631L4714L2348K8954K4854
$$ 3475156 3530863 3585200 3636501 3683474 3726040 3765096 3801727 3836441 3868789 3897743 3922597
53200C922597K0832J7193J3630R864N826J177m651j1673j9218k6816l4779m3377
$$ 3922597 3943429 3960622 3974252 3984116 3989942 3991119 3986468 3974795 3955577 3928761 3893982 3850605
53188C850605n1849n8827o3819o7767p1983p6768q1311q4745q6966q8324q8837
$$ 3850605 3798756 3739929 3676110 3608343 3536360 3459592 3378281 3293536 3206570 3118246 3029409
53177C029409q8047q5782q2742q0086p8397p7128p5247p2450o9641o8091o8110
$$ 3029409 2941362 2855580 2772838 2692752 2614355 2537227 2461980 2389530 2319889 2251798 2183688
53166B183688o8737o8717o7546o5654o3928o3095o3011o2441o0098n6216n2295
$$ 2183688 2114951 2046234 1978688 1913034 1849106 1786011 1723000 1660559 1600461 1544245 1491950
53155A491950m9016m5390m0856l6957l5337l4857l2736k8533k4974k4268k5414
$$ 1491950 1442934 1397544 1356688 1319731 1284394 1249537 1216801 1188268 1163294 1139026 1113612
53144A113612k6050k5289k3647k1515j9223j7638j7306j7549j7482j7298j7539
$$ 1113612 1087562 1062273 1038626 1017111 997888 980250 962944 945395 927913 910615 893076
53133H93076j7889j7877j8005j8680j8757j6870j3955j2602j3711j5477j5973
$$ 893076 875187 857310 839305 820625 801868 784998 771043 758441 744730 729253 713280
53122G13280j5227j4187j3215j2407j2277j2926j3329j2489j0910j0057j0525
$$ 713280 698053 683866 670651 658244 645967 633041 619712 607223 596313 586256 575731
53111E75731j1405j1339r891p995p206q217r940j0404q803o181m097l213l395
$$ 575731 564326 552987 543096 535101 527895 519678 509738 499334 490531 484350 480253 477040 473645
53098D73645m362n610o261n836m930m543m977n810o570o875o286m923l922m330
$$ 473645 469283 463673 457412 451576 446646 442103 437126 431316 424746 417871 411585 406662 402740 398410
53084C98410n528n722m394l159l577m993n503m547l356k914k830k554k478k984
$$ 398410 392882 387160 382766 379607 376030 371037 365534 360987 357631 354717 351887 349333 346855 343871
53070C43871l222k018K87J949J896P80m5oM95O77p2j537k468j712J98J369Q31
$$ 343871 340649 338631 338918 340867 342763 343543 343498 343492 343987 344664 344592 343055 340587 338875 339073 340442 341273
53053C41273l84r87j216j954k928l144k738k961m228n445n574m904m299l981l593
$$ 341273 340889 339902 338686 336732 333804 330660 327922 324961 320733 315288 309714 304810 300511 296530 292937
53038B92937k885j899q60k39m68j367k214k734l437m650n689n582m324k910k163
$$ 292937 290052 288153 287293 287054 286586 285219 283005 280271 276834 272184 266495 260913 256589 253679 251516
53023B51516k014j831j184j84P89J549K165K458J781k7j683j418P45K539K060
$$ 251516 249502 247671 246487 246303 247092 248641 250806 253264 255045 255018 253335 251917 252662 255201 257261
53008B57261J73o47N37K206K594J721R00J147K548M429N557M824K510M89L45J455
$$ 257261 257434 256787 257324 259530 262124 263845 264745 265892 268440 272869 278426 283250 285760 286249 286594 288049
52992B88049J802N83q32q62K10P18l63k458m277n110n141m895m636m343m170m619
$$ 288049 289851 290434 289602 288740 288950 289668 289305 286847 282570 277460 272319 267424 262788 258445 254275 249656
52976B49656n813o851o510m853l378l102l200k361r93r21k753m724m687k625n53
$$ 249656 243843 236992 230482 225629 222251 219149 215949 213588 212595 211674 208921 204197 199510 196885 196332
52961A96332l59k128m362n280m104j624M52R68J94q45j708k753m055m740l829
$$ 196332 195973 193845 189483 184203 180099 178475 178927 179895 180089 179244 177536 174783 170728 165988 162159
52946A62159j580N29J281P90l8o65j069j181r11o61j016j794k172j914j595j332
$$ 162159 160579 161108 162389 163179 163141 162476 161407 160226 159315 158654 157638 155844 153672 151758 150163 148831
52930A48831l43J456K509J376j157k872k625r90J127L133M266L891K537J478J167
$$ 148831 148488 149944 152453 153829 152672 149800 147175 146185 147312 150445 154711 158602 161139 162617 163784
52915A63784J026Q48J157J938K194J204o25k367l272k819j188L30N75J40M88J512
$$ 163784 164810 165658 166815 168753 170947 172151 171526 169159 165887 163068 161880 162210 162785 162925 163413 164925
52899A64925J705Q51N82J558K157J057o50j174m16O46J589K222J993J050O35J154
$$ 164925 166630 167481 168063 169621 171778 172835 172185 171011 170595 171241 172830 175052 177045 178095 178730 179884
52883A79884J276K37m65N89K305K958K952L512L917K743R29O75J825K195J274
$$ 179884 181160 181397 180932 181521 183826 186784 189736 193248 197165 199908 200837 201512 203337 205532 206806
52868B06806Q08J535K064J555R59R36Q37M19N18J270J766K029L200N077N757M721
$$ 206806 207614 209149 211213 212768 213727 214663 215500 215919 216437 217707 219473 221502 224702 229779 235536 240257
52852B40257L952M807N958N908N363N368N031L260J122K83K26p01k328k954k208
$$ 240257 244209 249016 254974 260882 266245 271613 276644 279904 281026 281309 281535 280834 278506 275552 273344
52837B73344j622k420m256o052o817n893l597j360k77O0L02j34j839l500l115
$$ 273344 271722 269302 265046 258994 252177 246284 242687 241327 241050 241110 241412 241278 239439 235939 232824
52822B32824r18Q10R03M38M25J29j452l709n060m687k989r17N75R04K80n16r88
$$ 232824 231906 232716 233619 234057 234482 234611 233159 229450 224390 219703 216714 215797 216372 217276 217556 217040 216052
52805B16052j242j426j467j437j540j572j118m92o67j661j868RK778L678J673
$$ 216052 214810 213384 211917 210480 208940 207368 206250 205758 205091 203430 201562 201571 204349 208027 209700
52790B09700j196k304j468o09p82q89M31K694M310M676M556M628M695M351L508
$$ 209700 208504 206200 204732 204123 203341 202452 202883 205577 209887 214563 219119 223747 228442 232793 236301
52775B36301K089P7j871k655j990q00j69l40r67j682k077j826j193q31q72p64
$$ 236301 238390 238467 236596 233941 231951 231151 230982 230642 229675 227993 225916 224090 222897 222066 221194 220430
52759B20430k99N1P6K26P42J129J019O67J74q29k157k807k450k109k441k432j053
$$ 220430 220131 220182 220258 220484 221226 222355 223374 224041 224215 223386 221229 218422 215972 213863 211422 208990 207937
52742B07937P82J360O16j57n59j340k405k346m55K005L242K874J912J362J301
$$ 207937 208719 210079 210695 210538 209979 208639 206234 203888 203433 205438 208680 211554 213466 214828 216129
52727B16129J176O61K10N13J451K024J577M30r88k727m418m878l721k448k579
$$ 216129 217305 217966 218176 218689 220140 222164 223741 224171 223183 220456 216038 211160 207439 204991 202412
52712B02412l311k635m36J194P32j259l493n227n836m737k499r33j228k780m240
$$ 202412 199101 196466 196030 197224 197956 196697 193204 187977 182141 177404 174905 173972 172744 169964 165724
52697A65724m893m612l520k402k362l298l580k105K2Q67R8r63j389j564k082k698
$$ 165724 160831 156219 152699 150297 147935 144637 141057 138952 138974 139841 139939 138976 137587 136023 133941 131243
52681A31243k787k299j745j433j045j07J209K023J733Q16K85L63K43p14j964k415
$$ 131243 128456 126157 124412 122979 121934 121827 123036 125059 126792 127608 127893 128256 128499 127785 125821 123406
52665A23406j777r30q93j630k100j543m67M2j68j00R02K223K927K862K143M14
$$ 123406 121629 120699 119806 118176 116076 114533 114066 114108 113940 113840 114742 116965 119892 122754 124897 125311
52649A25311k197m034l397r75O39J82q84o42Q83K318K857K619J767K90j528l098
$$ 125311 123114 119080 115683 114708 115347 115529 114645 114003 114886 117204 120061 122680 124447 124737 123209 120111
52633A20111l892l621k389q91OK29N06J113J255J79j630k845k641j177P54K116
$$ 120111 116219 112598 110209 109318 109324 109553 110059 111172 112427 112606 110976 108131 105490 104313 105067 107183
52617A07183K166J154K42K37P16P31Q6n69n46L40J764K923L013K053R78N26M38
$$ 107183 109349 110503 110745 110982 111698 112429 112515 111946 111400 111740 113504 116427 119440 121493 122471 122997 123435
52600A23435K05P1N90J502J908J480Q23N92Q24J249J640J772J477R85Q29J154
$$ 123435 123640 123711 124301 125803 127711 129191 130014 130606 131430 132679 134319 136091 137568 138553 139382 140536
52584A40536J496J448J372K015L398M408L856J962M36P56K538L915L489J518p63
$$ 140536 142032 143480 144852 146867 150265 154673 158529 160491 160927 161683 164221 168136 171625 173143 172380
52569A72380k312k638j795m95J61k33p24q5J501K350J141j539l731m108l158k367
$$ 172380 170068 167430 165635 165140 165301 165068 164344 164259 165760 168110 169251 167712 163981 159873 156715 154348
52553A54348k367k327j229O20J888J815R16N6m82p89q34o71o95j044j095j48J502
$$ 154348 151981 149654 148425 149045 150933 152748 153664 153720 153238 152449 151615 150944 150249 149205 148110 147962 149464
52536A49464K696K668J779R53P39R93J211J071P47P51J312K011K196J723J128
$$ 149464 152160 154828 156607 157560 158299 159292 160503 161574 162321 163072 164384 166395 168591 170314 171442
52521A71442R29R52N31n14j438j460r07q70j509j550m6K023K938K547K224K625
$$ 171442 172371 173323 173854 173340 171902 170442 169535 168665 167156 165606 165560 167583 170521 173068 175292 177917
52505A77917K984K923L332M586N172L481K10k400l309l322l224k754j731r39j063
$$ 177917 180901 183824 187156 191742 196914 200395 200605 198205 194896 191574 188350 185596 183865 182926 181863
52490A81863j528j122M14K012K508J883J140J079J444J454R41L88j08j067k448
$$ 181863 180335 179213 179627 181639 184147 186030 187170 188249 189693 191147 192088 192476 192368 191301 188853
52475A88853l120k353j170j153k140k348p94J514L021L303K898K349J993J999
$$ 188853 185733 183380 182210 181057 178917 176569 175775 177289 180310 183613 186511 188860 190853 192852
52461A92852K057J575O79M36J466K863L175K090N44m90n72M00J986K876J869n91
$$ 192852 194909 196484 197163 197599 199065 201928 205103 207193 207737 207247 206675 207075 209061 211937 213806 213215
52445B13215k619l044k558k350k395j859p11J02K7l11LJ051K019J946M80j675
$$ 213215 210596 207552 204994 202644 200249 198390 197679 197781 197808 197497 197500 198551 200570 202516 202996 201321
52429B01321l120k988j983j573k030j961k76K139L416K895J481J58p80j091l81
$$ 201321 198201 195213 193230 191657 189627 187666 187390 189529 192945 195840 197321 197479 196699 195608 195227
52414A95227J036J978J634N01m19q00r51j039j062j131j242r36J70J602K329J895
$$ 195227 196263 198241 199875 200376 199957 199157 198206 197167 196105 194974 193732 192796 192966 194568 196897 198792
52398A98792Q39N3n7K06K06l22p50o6J742L213K924J246j26k54K77O87J078J661
$$ 198792 199631 199684 199627 199833 200039 199717 198967 198901 200643 203856 206780 208026 207900 207646 207923 208610 209688 211349
52380B11349J847J068Q4L94K256M143M478L317J928J154Q14M62j3n93j303j900
$$ 211349 213196 214264 214348 214742 216998 221141 225619 228936 230864 232018 232832 233294 233281 232688 231385 229485
52364B29485j965j638j836k989m026l462j476M0j06r26p98K43Q77P70J088K484
$$ 229485 227520 225882 224046 221057 217031 213569 212093 212133 212027 211101 210303 210546 211423 212193 213281 215765
52348B15765L774L465J888P77R52J429J035po02k47O00J318J618J383P24J49J37
$$ 215765 219539 223004 224892 225669 226621 228050 229085 229078 228476 228229 228829 230147 231765 233148 233872 234021 234158
52331B34158N04P15Q46J320J710Q04j367k720j374J870M489N237M846M010K499
$$ 234158 234662 235377 236223 237543 239253 240057 238690 235970 234596 236466 240955 246192 251038 255048 257547
52316B57547O57N7J459L130K632m0k306j969M42K473K382P61k45P37K790L805
$$ 257547 258204 258261 259720 262850 265482 265442 263136 261167 261609 264082 266464 267225 266980 267717 270507 274312
52300B74312L026J969K449M341N822N468L485J138m08o56K24J634K912L585L430
$$ 274312 277338 279307 281756 286097 291919 297387 300872 302010 301602 300946 301170 302804 305716 309301 312731
52285C12731K652J873J470R09m51j820j396J143L601L776K162R21Q44Q75L89J63
$$ 312731 315383 317256 318726 319635 319184 317364 315968 317111 320712 324488 326650 327571 328415 329290 329679 329842
52269C29842P11J202Q93N74J547L692N564O103N664N275N450N770N527M655M031
$$ 329842 330553 331755 332648 333222 334769 338461 344025 350128 355792 361067 366517 372287 377814 382469 386500
52254C86500M630O350P990Q397P548O513O583Q235J0515J1620J0608Q589P659
$$ 386500 391130 397480 405470 413867 421415 427928 434511 442746 453261 464881 475489 484078 491737
52241D91737Q652J0509J1850J2340J2271J1772J1127J1234J2780J5065J6454J6086
$$ 491737 500389 510898 522748 535088 547359 559131 570258 581492 594272 609337 625791 641877
52229F41877J4695J3686J3826J4858J5968J6339J5614J4129J2735J2169J2576
$$ 641877 656572 670258 684084 698942 714910 731249 746863 760992 773727 785896 798472
52218G98472J3546J4438J4676J3915J2234J0163Q343P036O135N610N613N973N939
$$ 798472 812018 826456 841132 855047 867281 877444 885787 892823 898958 904568 910181 916154 922093
52205I22093M894L129J445J71q30j337q55L04R16L04q13j494j758j945j534J95
$$ 922093 926987 930116 931561 931732 930902 929565 928710 929014 929930 930234 929421 927927 926169 924224 922690 922885
52189I22885K647M164L900K700K010K557M095N831O940P217P334Q115R596J1118
$$ 922885 925532 929696 933596 936296 938306 940863 944958 950789 957729 964946 972280 980395 989991 1001109
52175A001109J2112J2331J1762J0903J0828J2105J3817J4499J3779J2273J0292
$$ 1001109 1013221 1025552 1037314 1048217 1059045 1071150 1084967 1099466 1113245 1125518 1135810
52164A135810P882N904N496O160O002M429L149L618M692M075J245k254m874o349
$$ 1135810 1143692 1149596 1155092 1161252 1167254 1171683 1174832 1178450 1183142 1187217 1188462 1186208 1181334 1174985
52150A174985p098p385p126o103m511l379l920o003q007q578p996p171o191m724
$$ 1174985 1167887 1160502 1153376 1147273 1142762 1139383 1135463 1129460 1121453 1112875 1104879 1097708 1091517 1086793
52136A086793l286k971m047n599o503o207m890l442k911l322l453k412r26k44
$$ 1086793 1083507 1080536 1076489 1070890 1064387 1058180 1053290 1049848 1046937 1043615 1040162 1037750 1036824 1036580
52122A036580k84n8M38J70j146k425k810k747l035l556l604k941j949j126p76
$$ 1036580 1036296 1036238 1036676 1036846 1035700 1033275 1030465 1027718 1024683 1021127 1017523 1014582 1012633 1011507 1010731
52107A010731j007j774k977m468n752o043n014l379k191j765j870k592m085n562
$$ 1010731 1009724 1007950 1004973 1000505 994753 988710 983696 980317 978126 976361 974491 971899 967814 962252
52093I62252n654m243k864k794l455l480k767k552l644n355o343o024m961m110
$$ 962252 956598 952355 949491 946697 943242 939762 936995 934443 930799 925444 919101 913077 908116 904006
52079I04006l939m289m792n071m615l116j302p90k278m273m669l471k696l330
$$ 904006 900067 895778 890986 885915 881300 878184 876882 876092 873814 869541 864872 861401 858705 855375
52065H55375l840k550l13N71m62j663j603r57j076j800j732l34J261J756J314
$$ 855375 851535 848985 848672 849243 848781 847118 845515 844558 843482 841682 839950 839616 840877 842633 843947
52050H43947J250K362M136N581O338O742P222Q011R180J0554J1702J2407J2949
$$ 843947 845197 847559 851695 857276 863614 870356 877578 885589 894769 905323 917025 929432 942381
52037I42381J3662J4374J4788J5210J6192J7589J8679J9286J9950K0743K0796
$$ 942381 956043 970417 985205 1000415 1016607 1034196 1052875 1072161 1092111 1112854 1133650
52026A133650J9585J8040J7565J8327J9213J9294J8575J7404J5754J3468J0753
$$ 1133650 1153235 1171275 1188840 1207167 1226380 1245674 1264249 1281653 1297407 1310875 1321628
52015A321628Q248O630O159O411O414N346L275J072m63j423k549m138n376n221
$$ 1321628 1329876 1336506 1342665 1349076 1355490 1360836 1364111 1365183 1364720 1363297 1360748 1356610 1351234 1346013
52001A346013m038l674n365p930q956p664n730n044n643o344o529o397n886m474
$$ 1346013 1341975 1338301 1332936 1325006 1316050 1308386 1302656 1297612 1291969 1285625 1279096 1272699 1266813 1262339
51987A262339k160J12J353J514J331J330J247N49n69j061j18J811L653N009O151
$$ 1262339 1260179 1260291 1261644 1263158 1264489 1265819 1267066 1267615 1267046 1265985 1265867 1267678 1271331 1276340 1282491
51972A282491O832O218M278K296J353J016K19j266k853l984m239l326j912j764
$$ 1282491 1289323 1295541 1299819 1302115 1303468 1304484 1304703 1303437 1300584 1296600 1292361 1289035 1287123 1285359
51958A285359l902p017q884r041q881r345r918j0097j0376j1392j2997j4655j6063
$$ 1285359 1281457 1274440 1265556 1256515 1247634 1238289 1228371 1218274 1207898 1196506 1183509 1168854 1152791
51945A152791j7080j7692j8208j8872j9298j9082j8808j9417k0650k1328k1218
$$ 1152791 1135711 1118019 1099811 1080939 1061641 1042559 1023751 1004334 983684 962356 941138
51934I41138k1272k1799k2027k1867k2411k3824k4501k3473k2120k1971k2187
$$ 941138 919866 898067 876040 854173 831762 807938 783437 759964 737844 715873 693686
51923F93686k1114j9242j8480j9024j9076j7704j6009j5161j4832j4118j2766
$$ 693686 672572 653330 634850 615826 596750 579046 563037 547876 533044 518926 506160
51912E06160j1112r737r455j0586j2062j2308j1137r745q741p616o377o161p451
$$ 506160 495048 485311 475856 465270 453208 440900 429763 420018 411277 403661 397284 391123 383672
51899C83672q989r357q699p943p278o323n088l849k633j620j349j770j879j229
$$ 383672 374683 365326 356627 348684 341406 335083 329995 326146 323513 321893 320544 318774 316895 315666
51885C15666j062k616m939n787m616l256l421m697n395m542k575p60l17j520l207
$$ 315666 314604 311988 307049 301262 296646 293390 289969 285272 279877 275335 272760 272000 271683 270163 266956
51870B66956l650k206J9J294P37j232l307m035k872j000m64j939l662l361j092
$$ 266956 263306 261100 261119 262413 263150 261918 258611 254576 251704 250704 250240 248301 244639 241278 240186
51855B40186P07J48j921l259l068k370j834p29J226K338Q53k155l571k157n7L45
$$ 240186 240893 241041 239120 235861 232793 230423 228589 227860 229086 231424 232277 230122 226551 224394 224337 224682
51839B24682n30p98k76m13j520j997q18P87J024k7p07o5J138J628J090J31o85
$$ 224682 224152 223354 223078 222665 221145 219148 218330 219117 220141 220114 219407 219342 220480 222108 223198 223329 222644
51822B22644j274j570j235j58J040J622J708J987K340J743j5j440j139J23L96
$$ 222644 221370 219800 218565 218407 219447 221069 222777 224764 227104 228847 228832 227392 226253 226376 226772
51807B26772p28j645j140O6O34N14P61J937L455M189L356J142j160j969q58R48
$$ 226772 226044 224399 223259 223325 223959 224473 225234 227171 230626 234815 238171 239313 238153 236184 235326 236274
51791B36274J777J107k20j062r83m43k73p81j258n57J548L793M519L192Q42q63
$$ 236274 238051 239158 238938 237876 236893 236450 236177 235396 234138 233581 235129 238922 243441 246633 247475 246612
51775B46612q86M26J731J955J362J119J823K786K882J778J71p68j83J695L349
$$ 246612 245726 246152 247883 249838 251200 252319 254142 256928 259810 261588 261759 260991 260808 262503 265852
51760B65852L182J291m28m24P85J632J583J329J273R91L09j23J66O85O94K50p2
$$ 265852 269034 270325 269897 269473 270258 271890 273473 274802 276075 277066 277375 277252 277418 278103 278797 279047 278975
51743B78975p5J01N89J636K853L415L185L033L646M504M659M055L583L906M950
$$ 278975 278900 279001 279590 281226 284079 287494 290679 293712 297358 301862 306521 310576 314159 318065 323015
51728C23015O372P852Q801Q677P829P362P694P985P474O658O282N815M088J237
$$ 323015 329387 337239 346040 354717 362546 369908 377602 385587 393061 399719 406001 411816 415904 417141
51714D17141j216k423l074l909m394l760k625k436l519m566m326l112k224k197
$$ 417141 415925 413502 410428 406519 402125 398365 395740 393304 389785 385219 380893 377781 375557 373360
51700C73360k250j566n83m50j429k530k888k748k674k444j411M07K295L503L479
$$ 373360 371110 369544 368961 368511 367082 364552 361664 358916 356242 353798 352387 352794 355089 358592 362071
51685C62071J961m37k215k630k766l899n115m300j354J249J615N09m01q55j382
$$ 362071 364032 363595 361380 358750 355984 352085 346970 342670 341316 342565 344180 344689 344288 343433 342051
51670C42051j565n19J428K764K521J197R6R3R06J393R15K80N44J105M10j335j911
$$ 342051 340486 339967 341395 344159 346680 347877 347973 348066 348972 350365 351280 351560 352104 353209 353619 352284 350373
51653C50373l71J274R57m47q05l3L98M02J240K864L527K452R09J81L9k50p17j045
$$ 350373 350002 351276 352233 351786 350981 350948 351346 351748 352988 355852 359379 361831 362740 362921 362960 362710 361993 360948
51635C60948r51K8J872L042J592k067n017n164l446k020j586j556j599j667j221
$$ 360948 359997 360025 361897 364939 366531 364464 359447 354283 350837 348817 347231 345675 344076 342409 341188
51620C41188J55J704K214J673J054O01o42l244o121p420o447m411l184l527m628
$$ 341188 341343 343047 345261 346934 347988 348589 347947 344703 338582 331162 324715 320304 317120 313593 308965
51605C08965n291n107m221k645n86Q41L53j799l662l483j366J069K072Q99j625
$$ 308965 303674 298567 294346 291701 291115 291956 292309 290510 286848 283365 281999 283068 285140 286039 284414
51590B84414l453l088j231N0q4l70N32K187L158K722J192p27k164k285j081M68
$$ 284414 280961 277873 276642 276692 276608 276238 276770 278957 282115 284837 286029 285302 283138 280853 279772 280240
51574B80240J478J983K276K222J753J290R71J84j426l056l682l197j898K60K983
$$ 280240 281718 283701 285977 288199 289952 291242 292213 292397 290971 287915 284233 281036 279138 279398 282381
51559B82381M943N118M289L934M105L772K989L072M437N754N647M178K283Q38
$$ 282381 287324 292442 296731 300665 304770 308542 311531 314603 319040 324794 330441 334619 336902 337740
51545C37740O79K297M718N756M239J430n14r50r01j344k214k881k907k218j126
$$ 337740 338419 340716 345434 351190 355429 356859 356345 355395 354494 353150 350936 348055 345148 342930 341804
51530C41804j96K46M50Q07J200J177P01L18N37J373K534L734M632M815M179L174
$$ 341804 341608 341854 342304 343111 344311 345488 346189 346507 347044 348417 350951 354685 359317 364132 368311 371485
51514C71485K321J592O35m39j054j185j626k750l590l112j920j580k258k440j378
$$ 371485 373806 375398 376033 375594 374540 373355 371729 368979 365389 362277 360357 358777 356519 354079 352701
51499C52701m21r89k394k827j840n34J85K33n27k263m204m939m170l184l103l553
$$ 352701 352280 351291 348897 346070 344230 343696 343881 344114 343587 341324 337120 332181 328011 324827 321724 318171
51483C18171l541k885k083j274j07J434K498J936m35l069l679j476J896M224N034
$$ 318171 314630 311745 309662 308388 308281 309715 312213 314149 313714 310645 306966 305490 307386 311610 316644
51468C16644N213M972L742K020J541K857M257M031K643J614J339J272J454K191
$$ 316644 321857 326829 330571 332591 334132 336989 341246 345277 347920 349534 350873 352145 353599 355790
51454C55790K762K070N02k63N06J881K904L592L913L262J838J285K735M841N174
$$ 355790 358552 360622 361124 360861 361367 363248 366152 369744 373657 376919 378757 380042 382777 387618 392792
51439C92792L322J398J333K807M277N089N689O215N934M339K120O52O45J685K908
$$ 392792 396114 397512 398845 401652 405929 411018 416707 422922 428856 433195 435315 435967 436612 438297 441205
51424D41205L713L846L196J899M34o99j394j830k015j809j404j413k173l183l608
$$ 441205 444918 448764 451960 453859 454293 453594 452200 450370 448355 446546 445142 443729 441556 438373 434765
51409D34765l318l064l409l921l771k936k289k351k557k060r85l63r26k394l902
$$ 434765 431447 428383 424974 421053 417282 414346 412057 409706 407149 405089 404104 403741 402815 400421 396519
51394C96519m680m253k657p29L07R9k70M10J791K263J110m60q64j21M31J03m37
$$ 396519 391839 387586 384929 384200 384507 384606 384336 384746 386537 388800 389910 389450 388586 388465 388896 388999 388562
51377C88562n36o33j418k608l416l841m539n478n821n306m734m604m276l341k911
$$ 388562 388026 387393 385975 383367 379951 376110 371571 366093 360272 354966 350232 345628 341352 338011 335100
51362C35100m225o422p161n569l349k471k909l285k878k049j266o36k87m04r11
$$ 335100 330875 324453 317292 311723 308374 305903 302994 299709 296831 294782 293516 292880 292593 292189 291278
51347B91278j503j967k156j826r71r3K53M5m75j363k593l390k822j174jl53j518
$$ 291278 289775 287808 285652 283826 282855 282762 283015 283060 282585 281222 278629 275239 272417 271243 271242 270889 269371
51330B69371j944j039L84J195J040L10n83j732l369n035n528m154j949q62j586
$$ 269371 267427 266388 266772 267967 269007 269317 268734 267002 263633 258598 253070 248916 246967 246105 244519
51315B44519k743k596r31J128K563L005K404J143L44J060K898M176L719J981J88
$$ 244519 241776 239180 238249 239377 241940 244945 247349 248492 248836 249896 252794 256970 260689 262670 262858
51300B62858r41j395j403j214r29l25P12J372M86j670l039k143o2R34J18j501
$$ 262858 261917 260522 259119 257905 256976 256651 257363 258735 259221 257551 254512 252369 252307 253241 253359 251858
51284B51858l152m859o173o087m599l040k280j836j372j594k823l919l816l169
$$ 251858 248706 243847 237674 231587 226988 223948 221668 219832 218460 216866 214043 210124 206308 203139
51270B03139l189l688l623k891k098j137L79J616J168o61j839j287k03k14j322
$$ 203139 199950 196262 192639 189748 187650 186513 186892 188508 189676 189015 187176 185889 185686 185472 184150
51255A84150k254k017p20N62N62p67j764r29Q99J577Q03M43J475K518K283J602
$$ 184150 181896 179879 179159 179721 180283 179516 177752 176823 177722 179299 180102 180545 182020 184538 186821 188423
51239A88423J751K305K127J350P65J90j016k496l372l536l223k131l44Q16M63
$$ 188423 190174 192479 194606 195956 196721 196911 195895 193399 190027 186491 183268 181137 180793 181609 182072
51224A82072j12O30J647P01j824l057j804l1M50M12J133J982J649L52o78j024
$$ 182072 181960 182590 184237 184938 183114 180057 178253 178222 178672 179084 180217 182199 183848 184200 183522 182498
51208A82498j071r76p73q55j419j992k209k390k643k378j523j176j909k363r42
$$ 182498 181427 180451 179678 178823 177404 175412 173203 170813 168170 165792 164269 163093 161184 158821 157879
51193A57879J715L338K866J364K87OJ72M00L66M8J21J338L306M423L426Q43j360
$$ 157879 159594 162932 165798 167162 167449 167455 167627 168027 168393 168441 168562 169900 173206 177629 181055 181898 180538
51176A80538j483L53K288K610J472M47M40Q84J071J117J175P13m54j312p64R30
$$ 180538 179055 179408 181696 184306 185778 186225 186665 187549 188620 189737 190912 191625 191171 189859 189095 190025
51160A90025K633L586L407J776p38k322j782k45L28j11L9J368K673K811J860M08
$$ 190025 192658 196244 199651 201427 200689 198367 196585 196340 196668 196557 196596 197964 200637 203448 205308 205716
51144B05716r65j398m29R51J228N57N88J850K889K482J265M82L47M09M69M62K66
$$ 205716 204751 203353 202924 203875 205103 205660 206248 208098 210987 213469 214734 215216 215563 215972 216441 216903 217169
51127B17169J94P62J652J903J393R51P32n1j435k280k091j600r21Q13L091L505
$$ 217169 217363 218125 219777 221680 223073 224024 224756 224705 223270 220990 218899 217299 216378 217191 220282 223787
51111B23787J187j313j483m01n04j594j875j661k749m648m826k924j504j956k560
$$ 223787 224974 223661 222178 221777 221273 219679 217804 216143 213394 208746 203920 200996 199492 197536 194976
51096A94976j834j016j631k722k460q88P30K076L344L705K075r89l680m922m773
$$ 194976 193142 192126 190495 187773 185313 184425 185155 187231 190575 194280 196355 195366 191686 186764 181991
51081A81991l387j129O94Q11k64p41O5J147J631J791J802R89p71j963j090J194
$$ 181991 178604 177475 178169 178980 178716 177975 178040 179187 180818 182609 184411 185400 184629 182666 181576 182770
51065A82770K780K778K298K469K900K658J878J383J190M47j137k630k964k094
$$ 182770 185550 188328 190626 193095 195995 198653 200531 201914 203104 203551 202414 199784 196820 194726
51051A94726q00J08K45j52k29O61J794J639O7r05M67L140M527L819K749K925L786
$$ 194726 193926 194034 194279 194127 193898 194559 196353 197992 198059 197154 197621 200761 205288 209107 211856 214781 218567
51034B18567L782K566J291J104J986K846K569J207Q9M10J800K803K595J533K45
$$ 218567 222349 224915 226206 227310 229296 232142 234711 235918 236007 236417 238217 241020 243615 245148 245393
51019B45393q63j215l38J156J775R12m76j199j081m94L18P74pj875l191k732j341
$$ 245393 244530 243315 242977 244133 245908 246820 246344 245145 244064 243570 243888 244662 244655 242780 239589 236857 235516
51002B35516o87r98j220q79n08m45m81o51j226j834j743j123r91j585j892j270
$$ 235516 234829 233831 232611 231732 231224 230779 230298 229647 228421 226587 224844 223721 222730 221145 219253 217983
50986B17983m66l08l17M24J656K256J918J409J192P96ok89R49L204M781M707L626
$$ 217983 217517 217209 216892 217316 218972 221228 223146 224555 225747 226543 226537 226248 227197 230401 235182 239889 243515
50969B43515K653K028J398Q27O90P61K94q07j660j613j138r95r83l12J002J933
$$ 243515 246168 248196 249594 250421 251111 251872 252166 251359 249699 248086 246948 245953 244970 244658 245660 247593
50953B47593J792J177J209K183L417M248M703N010N046M662M329M686N533N980
$$ 247593 249385 250562 251771 253954 257371 261619 266322 271332 276378 281040 285369 290055 295588 301568
50939C01568N936O489Q052R021P556M373K203K426L744M694N793P985J0326J0946
$$ 301568 307504 313993 322045 331066 338622 342995 345198 347624 351368 356062 361855 369840 380166 391112
50925C91112R893R259J0406J2429J3717J3891J3561J3171J2964J3624J5827J9146
$$ 391112 401005 410264 420670 433099 446816 460707 474268 487439 500403 514027 529854 549000
50913E49000K2051K3323K3196K2961K3741K5824K8773L1690L3627L4421L5217
$$ 549000 571051 594374 617570 640531 664272 690096 718869 750559 784186 818607 853824
50902H53824L7513M1295M4818M6640M7277M8215M9903N1677N3071N4045N4159
$$ 853824 891337 932632 977450 1024090 1071367 1119582 1169485 1221162 1274233 1328278 1382437
50891A382437N2783N0138M7056M3705L9655L5219L1272K7586K2903J7116J1843
$$ 1382437 1435220 1485358 1532414 1576119 1615774 1650993 1682265 1709851 1732754 1749870 1761713
50880A761713Q115M939J011l546p913j1513j3283j1846p909m897n265p469q638
$$ 1761713 1769828 1774767 1775778 1772232 1764319 1752806 1739523 1727677 1719768 1714871 1709606 1702137 1693499
50867A693499q955j0923j5093j9397k2518k5258k8228l0762l2721l5215l8621
$$ 1693499 1684544 1673621 1658528 1639131 1616613 1591355 1563127 1532365 1499644 1464429 1425808
50856A425808m1709m3625m5012m6280m6534m5218m3302m1580l9204l5370l1257
$$ 1425808 1384099 1340474 1295462 1249182 1202648 1157430 1114128 1072548 1033344 997974 966717
50845I66717k8682k7513k5906k2802j8980j5807j3865j2709j1351r164o708n220
$$ 966717 938035 910522 884616 861814 842834 827027 813162 800453 789102 779938 773230 768010
50833G68010m931m496k663J40K506L742M156M215M218M455M967N300N067M546
$$ 768010 763079 758583 755920 756060 758566 762308 766464 770679 774897 779352 784319 789619 794686 799232
50819G99232M343M810N955P468Q574Q617Q078Q218R225R817R312R018J0453J3007
$$ 799232 803575 808385 814340 821808 830382 838999 847077 855295 864520 874337 883649 892667 903120 916127
50805I16127J4765J5101J5159J6000J7646J9888K2756K5941K8815L1339L4215
$$ 916127 930892 945993 961152 977152 994798 1014686 1037442 1063383 1092198 1123537 1157752
50794A157752L7825M1740M5421M8853N2266N5969O0526O6434P3279P9889Q5587
$$ 1157752 1195577 1237317 1282738 1331591 1383857 1439826 1500352 1566786 1640065 1719954 1805541
50783A805541R0765R5939J00863J05139J09193J13842J18832J22367J22483J18840
$$ 1805541 1896306 1992245 2093108 2198247 2307440 2421282 2540114 2662481 2784964 2903804
50773B903804J12990J06754J00428R2763Q2648P0433N7379M4270L1135J8283O897
$$ 2903804 3016794 3123548 3223976 3316739 3399387 3469820 3527199 3571469 3602604 3620887 3627784
50762C627784j819p938j2699j6905j9702j9385j5614j0433o649n400n771o646
$$ 3627784 3625965 3618027 3605328 3588423 3568721 3549336 3533722 3523289 3516640 3511240 3505469 3498823
50750C498823q213j1472j7001k4622l3698m3216n1961n9356o6010p2876p9895
$$ 3498823 3490610 3479138 3462137 3437515 3403817 3360601 3308640 3249284 3183274 3110398 3030503
50739C030503q5814q9326q9991q8056q3943p8182p1496o4443n6974m8605l9239
$$ 3030503 2944689 2855363 2765372 2677316 2593373 2515191 2443695 2379252 2322278 2273673 2234434
50728B234434k9592k0464j1687k452P179J5715K1835K6038K9961L4209L7709L9209
$$ 2234434 2204842 2184378 2172691 2170239 2177418 2193133 2214968 2241006 2270967 2305176 2342885 2382094
50716B382094L8652L6806L4223L0768K5850J9094J1254M123j146n514j0864j7502
$$ 2382094 2420746 2457552 2491775 2522543 2548393 2567487 2578741 2582864 2581718 2576204 2565340 2547838
50704B547838k3939k9157l3721l8280m2423m5743m8829n2141n4944n6370n6732
$$ 2547838 2523899 2494742 2461021 2422741 2380318 2334575 2285746 2233605 2178661 2122291 2065559
50693B065559n6711n5955n3731n0408m7083m3917l9953l4616k8530k2786j7960
$$ 2065559 2008848 1952893 1899162 1848754 1801671 1757754 1717801 1683185 1654655 1631869 1613909
50682A613909j3850r720m963K19N044R323J3842J9266K5278L1208L6844M2093
$$ 1613909 1600059 1590339 1585376 1585595 1590639 1599962 1613804 1633070 1658348 1689556 1726400 1768493
50670A768493M6688N0816N5348O0643O5851P0118P3659P6901P9374Q0320P9610
$$ 1768493 1815181 1865997 1921345 1981988 2047839 2117957 2191616 2268517 2347891 2428211 2507821
50659B507821P7217P2746O6528O0060N4116M7458L8843K9220K0186J1403J673
$$ 2507821 2585038 2657784 2724312 2784372 2838488 2885946 2924789 2954009 2974195 2985598 2987271
50648B987271q196j5985k1215k5213k8207k8881k7161k4855k2738j9437j4270
$$ 2987271 2979075 2963090 2941875 2916662 2888455 2859574 2832413 2807558 2784820 2765383 2751113
50637B751113r097n885m116k200k05L74j278m619q616j2328j5146j7233j9253
$$ 2751113 2742016 2736131 2732015 2729815 2729610 2729984 2728706 2724087 2715471 2703143 2687997 2670764 2651511
50624B651511k1294k2672k2883k1680j8264j1999m334J871N825R864J5979K3058
$$ 2651511 2630217 2607545 2584662 2562982 2544718 2532719 2528385 2530256 2536081 2545945 2561924 2584982
50612B584982K9065L4149L9634M5373N0522N6082O4150P4780Q5675R5029J02629
$$ 2584982 2614047 2648196 2687830 2733203 2783725 2839807 2903957 2978737 3064412 3159441 3262070
50601C262070J08090J10194J08692J05125J00805R5279Q7667P8497O9231O0672
$$ 3262070 3370160 3480354 3589046 3694171 3794976 3890255 3977922 4056419 4125650 4186322
50591D186322N2594M4575L6410K8072J9768J1849M409k713r290j4581j8269k1012
$$ 4186322 4238916 4283491 4319901 4347973 4367741 4379590 4383999 4381286 4371996 4357415 4339146 4318134
50579D318134k3537k5463k5679k3734k0327j6333j1946o970j590L567P856J0791
$$ 4318134 4294597 4269134 4243455 4219721 4199394 4183061 4171115 4164145 4162555 4166122 4173978 4184769
50567D184769J1968J1377R693P640N002Q80m857j1078j6724k1758k6276k9593
$$ 4184769 4196737 4208114 4217807 4225447 4230449 4231329 4226472 4215394 4198670 4176912 4150636 4121043
50555D121043l1221l1926l2435l1694k8136k2377j6713j1853o236Q49P553J1933
$$ 4121043 4089822 4057896 4025461 3993767 3965631 3943254 3926541 3914688 3908452 3909301 3916854 3928787
50543C928787J4259J5372J4396R947K581n915j4966k5241l6718m8485o0055p1298
$$ 3928787 3943046 3958418 3972814 3982761 3985342 3979427 3964461 3939220 3902502 3854017 3793962 3722664
50531C722664q1362q9370r5916j02070j07017j08682j06893j03883j01036r7107
$$ 3722664 3641302 3551932 3456016 3353946 3246929 3138247 3031354 2927471 2826435 2729328
50521B729328r0726q2872p5467o8905o2501n6320n0810m5250l8329l0183k2411
$$ 2729328 2638602 2555730 2480263 2411358 2348857 2292537 2241727 2196477 2158148 2127965 2105554
50510B105554j5991j0505n568j616J232L938P243J0482J2624J4014J5947J8779
$$ 2105554 2089563 2079058 2073490 2071874 2073106 2077044 2084287 2094769 2107393 2121407 2137354 2156133
50498B156133K1607K3950K6638L0428L4698L8452M2069M6872N3201O0043O6670
$$ 2156133 2177740 2201690 2228328 2258756 2293454 2331906 2373975 2420847 2474048 2534091 2600761
50487B600761P3524Q0987Q8342R4618R9745J04025J07111J08351J07832J06193
$$ 2600761 2674285 2755272 2843614 2938232 3037977 3142002 3249113 3357464 3465296 3571489
50477C571489J03697J00359R6812R4131R2772R2384R2593R3327R4365R5359R6370
$$ 3571489 3675186 3775545 3872357 3966488 4059260 4151644 4244237 4337564 4431929 4527288 4623658
50466D623658R7705R9249J00708J02541J05665J10117J14948J19657J24657J29825
$$ 4623658 4721363 4820612 4921320 5023861 5129526 5239643 5354591 5474248 5598905 5728730
50456E728730J33710J35111J34471J32548J28354J19910J06920R1139P3812N4131
$$ 5728730 5862440 5997551 6132022 6264570 6392924 6512834 6619754 6710893 6784705 6838836
50446F838836L1075N762j9321m2910o5513q7369j07146j23186j35234j44058j49792
$$ 6838836 6869911 6875673 6856352 6813442 6747929 6660560 6553414 6430228 6294994 6150936 6001144
50435F001144j51497j48182j39667j26438j09530r0656p1725n3695l6274j9165
$$ 6001144 5849647 5701465 5561798 5435360 5325830 5235174 5163449 5109754 5073480 5054315
50425E054315l347R327J7451K0482J7935Q942o752k7511n0159p2104r3020j13881
$$ 5054315 5050968 5060295 5077746 5098228 5116163 5125105 5118353 5090842 5040683 4968579 4875559 4761678
50413D761678j34319j51794j63861j70573j73799j74793j73492j69859j64349
$$ 4761678 4627359 4475565 4311704 4141131 3967332 3792539 3619047 3449188 3284839
50404C284839j56905j47058j35646j25049j16794j09900j02496r4108q5316p6240
$$ 3284839 3127934 2980876 2845230 2720181 2603387 2493487 2390991 2296883 2211567 2135327
50394B135327o6770n7664m9994m3663l7735l1972k6882k2446j8007j3469r453
$$ 2135327 2068557 2010893 1960899 1917236 1879501 1847529 1820647 1798201 1780194 1766725 1757272
50383A757272o184l208k57K519N263Q415J1917J5229J8102K0549K2326K3474K5149
$$ 1757272 1751088 1747880 1747623 1750142 1755405 1763820 1775737 1790966 1809068 1829617 1851943 1875417 1900566
50370A900566K8524L2901L6269L7952L9269M1326M3707M5833M8026N0404N2240
$$ 1900566 1929090 1961991 1998260 2036212 2075481 2116807 2160514 2206347 2254373 2304777 2357017
50359B357017N3435N5230N8181O0685O1074O0309O0907O3650O6927O9135P0258
$$ 2357017 2410452 2465682 2523863 2584548 2645622 2705931 2766838 2830488 2897415 2966550 3036808
50348C036808P1131P2499P5059P9214Q4208Q8231Q9751Q8507Q5264Q1116P6997
$$ 3036808 3107939 3180438 3255497 3334711 3418919 3507150 3596901 3685408 3770672 3851788 3928785
50337C928785P3084O8497O2114N3683M3780L2787K0543O983p452k2191l6834n1184
$$ 3928785 4001869 4070366 4132480 4186163 4229943 4262730 4283273 4290256 4282804 4260613 4223779 4172595
50325D172595o5285p9226r2371j02978j09369j11384j10169j06732j01595r5462
$$ 4172595 4107310 4028084 3935713 3832735 3723366 3611982 3501813 3395081 3293486 3198024
50315C198024q8904q1144p0543n7088m3301l1865k3027j5238p599o98M423O840
$$ 3198024 3109120 3027976 2957433 2900345 2857044 2825179 2802152 2786914 2779315 2778617 2783040 2789880
50303B789880N558N0q762j9110l0051m1588n3028o2571o9231p4003p8143q1149
$$ 2789880 2795438 2795488 2786726 2767616 2737565 2695977 2642949 2580378 2511147 2437144 2359001 2277852
50291B277852q1673p9792p6892p3576o9321o4323o0037n7111n4228n0062m5347
$$ 2277852 2196179 2116387 2039495 1965919 1896598 1832275 1772238 1715127 1660899 1610837 1565490
50280A565490m1709l9180l6290l2355k8189k4544k1140j7637j4392j1745r332
$$ 1565490 1523781 1484601 1448311 1415956 1387767 1363223 1342083 1324446 1310054 1298309 1288977
50269A288977o758m239k174n54P32J631K362L524N245O880Q116R757J2438J5127
$$ 1288977 1282219 1277980 1275806 1275252 1275984 1277615 1279977 1283501 1288746 1295626 1303742 1313499 1325937 1341064
50255A341064J6043J5088J4243J5216J7483J9196J9435J8905J8644J8785J8772
$$ 1341064 1357107 1372195 1386438 1401654 1419137 1438333 1457768 1476673 1495317 1514102 1532874
50244A532874J8371J8024J8212J8686J8596J7331J5188J3215J2354J2563J2638
$$ 1532874 1551245 1569269 1587481 1606167 1624763 1642094 1657282 1670497 1682851 1695414 1708052
50233A708052J1196Q068M446J416j322m704q641j1962j4091j5784j7939k0441
$$ 1708052 1719248 1727316 1731762 1733178 1731856 1727152 1718511 1706549 1692458 1676674 1658735 1638294
50221A638294k2713k4582k6111k7115k7530k7692k7668k6915k5363k4134k4101
$$ 1638294 1615581 1590999 1564888 1537773 1510243 1482551 1454883 1427968 1402605 1378471 1354370
50210A354370k4176k2400j8685j5215j3739j3595j3039j1623j0478j0585j1568
$$ 1354370 1330194 1307794 1289109 1273894 1260155 1246560 1233521 1221898 1211420 1200835 1189267
50199A189267j2162j1473r730p860o320m634k390m58l79k372m671n291l920j764
$$ 1189267 1177105 1165632 1155902 1148042 1141722 1137088 1134698 1134240 1133861 1131489 1126818 1121527 1117607 1115843
50185A115843r8M99Oj158k261k852l128l397l506l387l778n453p667q330o331
$$ 1115843 1115745 1116244 1116250 1115092 1112831 1109979 1106851 1103454 1099948 1096561 1092783 1087330 1079663 1071333 1065002
50170A065002l081j115j446k890l881m200m617n384n651m531k452j058j601l528
$$ 1065002 1061921 1060806 1059360 1056470 1052589 1048389 1043772 1038388 1032737 1028206 1025754 1024696 1023095 1019567
50156A019567m947m605l069j695q09M23K299L637L132J209k56K5J544K788K686
$$ 1019567 1014620 1010015 1006946 1005251 1004442 1004865 1007164 1010801 1013933 1015142 1014886 1014911 1016455 1019243 1021929
50141A021929J099j335l554m717m886m809m734m069k649j691k578m961o959p315
$$ 1021929 1023028 1021693 1018139 1013422 1008536 1003727 998993 994924 992275 990584 988006 983045 976086 968771
50127I68771o496n526m533l069j228J63L24p89k413l342k751j000N38Q16l0j199
$$ 968771 962275 956749 952216 949147 947919 948082 948406 947617 945204 941862 939111 938111 938649 939465 939435 938236
50111I38236k206k780k316l02K633M918N526M867M015L588L618L988M551N176
$$ 938236 936030 933250 930934 930632 933265 938183 943709 948576 952591 956179 959797 963785 968336 973512
50097I73512O029P510R434J0613R919P649N345M342M943O764R053J0710J0911
$$ 973512 979541 987051 996485 1007098 1017017 1024666 1030011 1034353 1039296 1046060 1055113 1065823 1076734
50084A076734J0225J0293J1897J3970J5179J5768J6862J8494J9538J9559J9476
$$ 1076734 1086959 1097252 1109149 1123119 1138298 1154066 1170928 1189422 1208960 1228519 1247995
50073A247995K0150K1329K2472K3638K4964K6068K6782K7797K9702L1786L2731
$$ 1247995 1268145 1289474 1311946 1335584 1360548 1386616 1413398 1441195 1470897 1502683 1535414
50062A535414L2329L1767L2277L4223L7299M0885M4267M7347N1137N6686O3523
$$ 1535414 1567743 1599510 1631787 1666010 1703309 1744194 1788461 1835808 1886945 1943631 2007154
50051B007154P0121P6075Q2730R1213J00960J10940J21411J33326J46701J60710
$$ 2007154 2077275 2153350 2236080 2327293 2428253 2539193 2660604 2793930 2940631 3101341
50041C101341J75015J89701K03901K15672K23469K26793K25154K17520K03575
$$ 3101341 3276356 3466057 3669958 3885630 4109099 4335892 4561046 4778566 4982141
50032D982141J84873J64117J43688J25298J10354R9463R1593Q4402P5648O3987
$$ 4982141 5167014 5331131 5474819 5600117 5710471 5809934 5901527 5985929 6061577 6125564
50022F125564M8530K8287K578k8271o2917r9625j36553j71223k00275k20677k31742
$$ 6125564 6174094 6202381 6204959 6176688 6113771 6014146 5877593 5706370 5506095 5285418 5053676
50011E053676k35422k34108k28478k18394k05224j91660j78847j65285j49579
$$ 5053676 4818254 4584146 4355668 4137274 3932050 3740390 3561543 3396258 3246679
50002C246679j32988j17969j05108r3254q2215p3380o7230o1945n5431m7889m1482
$$ 3246679 3113691 2995722 2890614 2797360 2715145 2641765 2574535 2512590 2457159 2409270 2367788
49991B367788l7813l6174l4102k9594k3225j7907j5907j6279j6148j4438j2809
$$ 2367788 2329975 2293801 2259699 2230105 2206880 2188973 2173066 2156787 2140639 2126201 2113392
49980B113392j2773j3496j3336j2132j0756r448p965o599n703m703k855n59J351
$$ 2113392 2100619 2087123 2073787 2061655 2050899 2041451 2033486 2026887 2021184 2016481 2013626 2013067 2014418
49967B014418L184N783Q687J0475J1059J2002J4201J6712J8550K0387K3484K7860
$$ 2014418 2017602 2023385 2032072 2042547 2053606 2065608 2079809 2096521 2115071 2135458 2158942 2186802
49955B186802L2443L6457L9724M1982M2936M3022M3559M5752M9659N4105N7684
$$ 2186802 2219245 2255702 2295426 2337408 2380344 2423366 2466925 2512677 2562336 2616441 2674125
49944B674125N9975O1818O4338O7864P2056P6743Q2165Q8482R5625J03553J12229
$$ 2674125 2734100 2795918 2860256 2928120 3000176 3076919 3159084 3247566 3343191 3446744 3558973
49933C558973J21466J31521J43511J58457J75803J93890K12171K31955K54255
$$ 3558973 3680439 3811960 3955471 4113928 4289731 4483621 4695792 4927747 5182002
49924E182002K77769K99845L19089L35858L49952L58802L58939L49326L32470
$$ 5182002 5459771 5759616 6078705 6414563 6764515 7123317 7482256 7831582 8164052
49915H164052L12020K90099K67797K47138K30407K17192K04106J88400J69997
$$ 8164052 8476072 8766171 9033968 9281106 9511513 9728705 9932811 10121211 10291208
49906A0291208J48667J21146Q3479L5301k0419q0697j42857k02400k54116k96179
$$ 10291208 10439875 10561021 10644500 10679801 10659382 10578685 10435828 10233428 9979312 9683133
49896I683133l30479l58361l78787l91369l98100m00409l97311l88367l75973
$$ 9683133 9352654 8994293 8615506 8224137 7826037 7425628 7028317 6639950 6263977
49887F263977l62284l46131l25579l01910k78271k55809k34022k13792j96730
$$ 6263977 5901693 5555562 5229983 4928073 4649802 4393993 4159971 3946179 3749449
49878C749449j81924j66601j50254j35361j23559j13572j03711r4235q6273q0110
$$ 3749449 3567525 3400924 3250670 3115309 2991750 2878178 2774467 2680232 2593959 2513849
49868B513849p5335p1401o7467o3016n8956n6746n6031n4733n1802m8368m5644
$$ 2513849 2438514 2367113 2299646 2236630 2177674 2120928 2064897 2010164 1958362 1909994 1864350
49857A864350m3370m0844l8013l4777l0707k6309k3123k1729k0782j8961j6573
$$ 1864350 1820980 1780136 1742123 1707346 1676639 1650330 1627207 1605478 1584696 1565735 1549162
$$ [...]
##END NTUPLES=NMR SPECTRUM
##END=
