##TITLE=coffee_type CCIN01-ROVE100_70-30%
COFFEE_meoh_noesyp64 COFFEE_meoh {C:\Bruker\TOPSPIN} Administrator 13
##JCAMPDX= 6.0         $$ Bruker NMR JCAMP-DX V2.0
##DATA TYPE= NMR SPECTRUM
##DATA CLASS= NTUPLES
##ORIGIN= Bruker BioSpin GmbH
##OWNER= Administrator
$$ 1.72 TOPSPIN		Version 2.1
$$ 2012-05-18 15:52:30.276 -0700  Administrator@X
$$ Compression mode = diff/dup
##.OBSERVE FREQUENCY= 400.13188235
##.OBSERVE NUCLEUS= ^1H
##.ACQUISITION MODE= SIMULTANEOUS (DQD)
##.ACQUISITION SCHEME= undefined
##.AVERAGES= 64
##.DIGITISER RES= 22
##SPECTROMETER/DATA SYSTEM= spect
##.PULSE SEQUENCE= noesygpps1d.comp
##.SOLVENT NAME= COFFEE_meoh
##.SHIFT REFERENCE= INTERNAL, COFFEE_meoh, 1, 14.98061
##AUDIT TRAIL= $$ (NUMBER, WHEN, WHO, WHERE, PROCESS, VERSION, WHAT)
$$ ##TITLE= Audit trail, TOPSPIN		Version 2.1
$$ ##JCAMPDX= 5.01
$$ ##ORIGIN= Bruker BioSpin GmbH
$$ ##OWNER= Administrator
$$ $$ C:\Bruker\TOPSPIN/data/Administrator/nmr/12-COFFEE-2502/232/pdata/1/auditp.txt
$$ ##AUDIT TRAIL=  $$ (NUMBER, WHEN, WHO, WHERE, PROCESS, VERSION, WHAT)
(   1,<2012-02-25 22:05:48.844 -0500>,<Administrator>,<TOPSPIN>,<go>,<TOPSPIN 2.1>,
      <created by zg
	started at 2012-02-25 21:54:18.672 -0500,
	POWCHK enabled, PULCHK disabled,
       configuration hash MD5:
       B0 76 FB 9C 50 81 44 7D 18 B3 26 32 4E 60 AD 96
       data hash MD5: 64K
       D8 E4 D7 E5 B4 70 EF 26 76 29 E7 CA 30 EA 2A 00>)
(   2,<2012-02-25 22:05:51.469 -0500>,<Administrator>,<TOPSPIN>,<proc1d>,<TOPSPIN 2.1>,
      <Start of raw data processing
       efp LB = 0.3 FT_mod = 6 PKNL = 1 PHC0 = 0 PHC1 = 0 SI = 128K 
       data hash MD5: 128K
       C1 3D B7 1D 60 57 44 22 58 EC 6A DD B2 5A E1 2D>)
(   3,<2012-02-25 22:05:52.750 -0500>,<Administrator>,<TOPSPIN>,<proc1d>,<TOPSPIN 2.1>,
      <pk PHC0 = 27.05933 PHC1 = 0 
       data hash MD5: 128K
       FF E1 3C 67 19 8E 9B 07 BA 69 88 67 B4 40 E7 7A>)
(   4,<2012-02-25 22:05:52.969 -0500>,<Administrator>,<TOPSPIN>,<proc1d>,<TOPSPIN 2.1>,
      <abs ABSG = 1 
       data hash MD5: 128K
       25 44 E2 79 CD 36 8B CC E0 2D B1 FD 39 A3 BB D5>)
(   5,<2012-02-25 22:05:53.047 -0500>,<Administrator>,<TOPSPIN>,<proc1d>,<TOPSPIN 2.1>,
      <abs ABSG = 2 
       data hash MD5: 128K
       5C FF 73 93 F1 FA CC 96 7F 40 EC 9A 80 AB 0A 82>)
(   6,<2012-02-25 22:05:53.109 -0500>,<Administrator>,<TOPSPIN>,<proc1d>,<TOPSPIN 2.1>,
      <abs ABSG = 3 
       data hash MD5: 128K
       CF FC 21 39 87 2F 58 69 B3 25 9E 6D 2E B6 2B 86>)
(   7,<2012-02-25 22:05:53.281 -0500>,<Administrator>,<TOPSPIN>,<proc1d>,<TOPSPIN 2.1>,
      <abs ABSG = 4 
       data hash MD5: 128K
       05 CF 3E 4D 87 0D 42 1A 16 13 00 AF 8D EF 83 E5>)
(   8,<2012-02-25 22:05:53.422 -0500>,<Administrator>,<TOPSPIN>,<proc1d>,<TOPSPIN 2.1>,
      <abs ABSG = 5 
       data hash MD5: 128K
       1B 8E A1 15 8D A7 7C 04 6D 5E 3E 79 C2 81 F2 50>)
(   9,<2012-02-25 22:05:53.547 -0500>,<Administrator>,<TOPSPIN>,<audit>,<TOPSPIN 2.1>,
      <user comment:
       ICON-NMR User ID: Administrator
$$ [...]
150 150 150 150 150 150 150 150
##$TP07= 0
##$TPNAME0= <>
##$TPNAME1= <>
##$TPNAME2= <>
##$TPNAME3= <>
##$TPNAME4= <>
##$TPNAME5= <>
##$TPNAME6= <>
##$TPNAME7= <>
##$TPOAL= (0..7)
0.5 0.5 0.5 0.5 0.5 0.5 0.5 0.5
##$TPOFFS= (0..7)
0 0 0 0 0 0 0 0
##$TUNHIN= 0
##$TUNHOUT= 0
##$TUNXOUT= 0
##$USERA1= <user>
##$USERA2= <user>
##$USERA3= <user>
##$USERA4= <user>
##$USERA5= <user>
##$V9= 5
##$VALIST= <valist>
##$VCLIST= <CCCCCCCCCCCCCCC>
##$VD= 0
##$VDLIST= <DDDDDDDDDDDDDDD>
##$VPLIST= <PPPPPPPPPPPPPPP>
##$VTLIST= <TTTTTTTTTTTTTTT>
##$WBST= 1024
##$WBSW= 4
##$XGAIN= (0..3)
0 0 0 0
##$XL= 0
##$YL= 0
##$YMAX_a= 12966042
##$YMIN_a= -6079264
##$ZGOPTNS= <>
##$ZL1= 120
##$ZL2= 120
##$ZL3= 120
##$ZL4= 120
##$ABSF1= 14.98061
##$ABSF2= -5.57192
##$ABSG= 5
##$ABSL= 3
##$ALPHA= 0
##$AQORDER= 0
##$ASSFAC= 0
##$ASSFACI= 0
##$ASSFACX= 0
##$ASSWID= 0
##$AUNMP= <proc_prof1d_extract>
##$AXLEFT= 0
##$AXNAME= <>
##$AXNUC= <1H>
##$AXRIGHT= 0
##$AXTYPE= 0
##$AXUNIT= <>
##$AZFE= 0.1
##$AZFW= 0.1
##$BCFW= 0
##$BC_mod= 0
##$BYTORDP= 0
##$COROFFS= 0
##$CY= 15
##$DATMOD= 1
##$DC= 0
##$DFILT= <>
##$DTYPP= 0
##$F1P= 0
##$F2P= 0
##$FCOR= 0.5
##$FTSIZE= 131072
##$FT_mod= 6
##$GAMMA= 0
##$GB= 0
##$INTBC= 1
##$INTSCL= 1
##$ISEN= 128
##$LB= 0.3
##$LEV0= 0
##$LPBIN= 0
##$MAXI= 10000
##$MC2= 0
##$MEAN= 0
##$ME_mod= 0
##$MI= 0
##$NCOEF= 0
##$NC_proc= -3
##$NLEV= 6
##$NOISF1= 0
##$NOISF2= 0
##$NSP= 0
##$NTH_PI= 0
##$NZP= 0
##$OFFSET= 14.98061
##$PC= 1
##$PHC0= 27.05933
##$PHC1= 0
##$PH_mod= 1
##$PKNL= yes
##$PPARMOD= 0
##$PPDIAG= 0
##$PPIPTYP= 0
##$PPMPNUM= 2147483647
##$PPRESOL= 1
##$PSCAL= 4
##$PSIGN= 0
##$PYNMP= <proc.py>
##$REVERSE= no
##$SF= 400.13
##$SI= 131072
##$SIGF1= 0
##$SIGF2= 0
##$SINO= 400
##$SIOLD= 131072
##$SPECTYP= <>
##$SREGLST= <1H.CDCl3>
##$SSB= 0
##$STSI= 131072
##$STSR= 0
##$SW_p= 8223.68421052632
##$SYMM= 0
##$S_DEV= 0
##$TDeff= 65536
##$TDoff= 0
##$TI= <>
##$TILT= no
##$TM1= 0
##$TM2= 0
##$TOPLEV= 0
##$USERP1= <user>
##$USERP2= <user>
##$USERP3= <user>
##$USERP4= <user>
##$USERP5= <user>
##$WDW= 1
##$XDIM= 131072
##$YMAX_p= 501232335
##$YMIN_p= -324182309
##$CURPLOT= <Network HP LaserJet P1505>
##$CURPRIN= <$Network HP LaserJet P1505>
##$DFORMAT= <normdp>
##$LAYOUT= <+/1D_H.xwp>
##$LFORMAT= <normlp>
##$PFORMAT= <normpl>
##$SURQMSG= 1
$$ End of Bruker specific parameters
$$ ---------------------------------
##NTUPLES= NMR SPECTRUM
##VAR_NAME=  FREQUENCY,     SPECTRUM/REAL,   SPECTRUM/IMAG
##SYMBOL=    X,             R,               I
##VAR_TYPE=  INDEPENDENT,   DEPENDENT,       DEPENDENT
##VAR_FORM=  AFFN,          ASDF,            ASDF
##VAR_DIM=   131072,        131072,          131072
##UNITS=     HZ,            ARBITRARY UNITS, ARBITRARY UNITS
##FACTOR=    0.0627417313425165, 1,          1
##FIRST=     8223.62146879498, 1276,         -95933
##LAST=      0,             5239,            -96166
##MIN=       0,             -324182309,      0
##MAX=       8223.62146879498, 501232335,    0
$$ Real data points
##PAGE= N=1
##DATA TABLE= (X++(R..R)), XYDATA
$$ [...]
63027I93581Q818R184Q100O698O171O798P893Q649R053R961J1977J4352J5586
63014A116821J5304J4800J5315J6373J6616J5729J4514J3481J2518J2052J3109
63003A276632J5736J8379J9529J9363J9131J9533K0385K1398K2555K3991K5929
62992A502561K8517L1381L3758L5473L7309L9876M2618M4614M5860M6989M8036
62981A936992M8374M7788M6789M5817M4873M4050M3840M4573M5889M6933M6956
62970B442874M5756M3821M1855L9921L7234L3022K7361K0787J3498N379l567j3289
62958B734652k3687l3839m1842m6494m8903n1285n4221n6255n6174n4412n1686
62947B215854m7582m1471l4113k7240k1790j7224j2583p644k988Q00L710O113
$$ y = [993581, 1002399, 1011583, 1019683, 1026381, 1032552, 1039350, 1047243, 1055892, 1064945, 1074906, 1086883, 1101235, 1116821, 1132125, 1146925, 1162240, 1178613, 1195229, 1210958, 1225472, 1238953, 1251471, 1263523, 1276632, 1292368, 1310747, 1330276, 1349639, 1368770, 1388303, 1408688, 1430086, 1452641, 1476632, 1502561, 1531078, 1562459, 1596217, 1631690, 1668999, 1708875, 1751493, 1796107, 1841967, 1888956, 1936992, 1985366, 2033154, 2079943, 2125760, 2170633, 2214683, 2258523, 2303096, 2348985, 2395918, 2442874, 2488630, 2532451, 2574306, 2614227, 2651461, 2684483, 2711844, 2732631, 2746129, 2751508, 2747941, 2734652, 2710965, 2677126, 2635284, 2588790, 2539887, 2488602, 2434381, 2378126, 2321952, 2267540, 2215854, 2168272, 2126801, 2092688, 2065448, 2043658, 2026434, 2013851, 2006207, 2003219, 2004019, 2007729, 2013842]
62935B013842Q069R358J0361J2268J5646J9279K1448K2097K2552K3138K2537J9884
62923B220479J6214J3123J1008R338P525M671m84q110j6451k3517k9204l4796
62911B169796m0901m6994n2496n7082o0226o1681o2318o3162o3622o1955n7829
62900A541530n3253n0356m9129m7840m4993m0470l5367l1171k8647k7186k5745
62889A107373k4376k3937k4113k3102k0047j6664j5164j5276j4897j3327j2137
62878I04333j2544j3513j3347j1999j0713j0059r457q412p210o434o509p621r309
62865G77206j0235r288p039n274m900n180n261n316n574n283l746j723p73j443
62851G06171k925m061l928k006J070L291L121J446M67P60Q95Nr35r82p39j074
$$ y = [2013842, 2021911, 2031269, 2041630, 2053898, 2069544, 2088823, 2110271, 2132368, 2154920, 2178058, 2200595, 2220479, 2236693, 2249816, 2260824, 2270162, 2277687, 2282358, 2281874, 2273764, 2257313, 2233796, 2204592, 2169796, 2128895, 2081901, 2029405, 1972323, 1912097, 1850416, 1788098, 1724936, 1661314, 1599359, 1541530, 1488277, 1437921, 1388792, 1340952, 1295959, 1255489, 1220122, 1188951, 1160304, 1133118, 1107373, 1082997, 1059060, 1034947, 1011845, 991798, 975134, 959970, 944694, 929797, 916470, 904333, 891789, 878276, 864929, 852930, 842217, 832158, 822701, 814289, 807079, 800645, 794136, 786515, 777206, 766971, 757683, 750644, 745370, 740470, 735290, 730029, 724713, 719139, 713856, 710110, 708387, 707614, 706171, 703246, 699185, 695257, 693251, 694321, 697612, 700733, 702179, 702646, 703406, 704301, 704306, 703371, 702389, 701650, 700576]
62835G00576j577j427p53q3P83K107L100K755J430L89R3O1J87R39K100K573J867
62818G15120Q70N57O20R9r49j166M43K942M099K728k6k129k947l299l609l342
62802G10011k423j828k028k155j649j542k798m381m588l700l421m029l979k560
62788F68930j052o31p12l06L16L86J52M54J384K319K936L258L110K383J663J671
62772F86261K104J809L28j360j915j057L41J345J836K387L461M715N143M095K227
62757G11720J151J803L329M043L449K672K638K653J575j98r98j37J294K082K343
62742G39419K763L332L586L514L543M015N178P175R630J1748J3222J4422J5416
62729H36963J5789J5906J7134J9962K3078K5410K7817L1331L4893L6813L7620
$$ y = [700576, 698999, 697572, 696819, 696736, 697519, 699626, 702726, 705481, 706911, 707300, 707393, 707454, 707641, 708580, 710680, 713253, 715120, 715990, 716547, 717167, 717266, 716317, 715151, 715594, 718536, 722635, 725363, 725337, 723208, 720261, 716962, 713353, 710011, 707588, 705760, 703732, 701577, 699928, 698386, 695588, 691207, 686619, 682919, 679498, 675469, 671490, 668930, 667878, 667247, 666535, 666229, 666545, 666931, 667083, 667537, 668921, 671240, 674176, 677434, 680544, 682927, 684590, 686261, 688365, 690174, 690502, 689142, 687227, 686170, 686511, 687856, 689692, 692079, 695540, 700255, 705398, 709493, 711720, 712871, 714674, 718003, 722046, 725495, 728167, 730805, 733458, 735033, 734835, 733837, 733700, 734994, 737076, 739419, 742182, 745514, 749100, 752614, 756157, 760172, 765350, 772525, 782155, 793903, 807125, 821547, 836963, 852752, 868658, 885792, 905754, 928832, 954242, 982059, 1013390, 1048283, 1085096, 1122716]
62718A122716L9295M2255M5378M8704N3436N9072O3239O5257O7449P1623P6350
62707A754774P9169P9608P8313P4865O8570O0373N1978M3552L3923K2598J0045
62696B357768l477j7766l1578m3197n2181n9390o5382p0021p3476p6359p8706
62685A786235p9881p9593p8044p5107p0506o4886n9736n5841n2705m9618m6415
62674A073903m2999l9151l5127l1608k8741k5967k3049k0395j8132j5888j3886
62663G78960j3007j3092j2346r619o365m912n308n353l652j111R56K656M735O987
62649G19529Q549R262R775J0581J1794J3714J6655K0075K2715K4003K4755K6095
62637I17502K8244L0827L3879L7721M2054M5918M8828N1342N4227N7326N9687
$$ y = [1122716, 1162011, 1204266, 1249644, 1298348, 1351784, 1410856, 1474095, 1539352, 1606801, 1678424, 1754774, 1833943, 1913551, 1991864, 2066729, 2135299, 2195672, 2247650, 2291202, 2325125, 2347723, 2357768, 2354291, 2336525, 2304947, 2261750, 2209569, 2150179, 2084797, 2014776, 1941300, 1864941, 1786235, 1706354, 1626761, 1548717, 1473610, 1403104, 1338218, 1278482, 1222641, 1169936, 1120318, 1073903, 1030904, 991753, 956626, 925018, 896277, 870310, 847261, 826866, 808734, 792846, 778960, 765953, 752861, 740515, 730896, 724531, 719619, 714311, 708958, 705306, 704195, 705151, 707807, 712542, 719529, 728078, 737340, 747115, 757696, 769490, 783204, 799859, 819934, 842649, 866652, 891407, 917502, 945746, 976573, 1010452, 1048173, 1090227, 1136145, 1184973, 1236315, 1290542, 1347868, 1407555]
62626A407555O0643O0381N9338N7331N3660M8065M1174L3704K5515J6025N437
62615A868828n083j4682k3660l2635m1399m9148n5371n9865o2228o2191o0512
62604A402054n8772n7965n7645n6652n4313n0810m6734m2630l8943l6086l4195
62593H67309l2663l0406k7099k3892k2080k1190j9595j7097j5431j5481j5636
62582F26739j4186j1854j0211q838o435l974l877o057p493o578n323o014p731
62569E28168p873n597k181P72K087J116j301k916k443j025j41O89K474M302M518
62554E20649L663L822N255O041N412N115O626Q878R955R672R197R093R079R153
62540F21610R830J1339J3403J5702J8035K0071K1459K2305K3257K5056K7869L1052
$$ y = [1407555, 1468198, 1528579, 1587917, 1645248, 1698908, 1746973, 1788147, 1821851, 1847366, 1863391, 1868828, 1863745, 1849063, 1825403, 1792768, 1751369, 1702221, 1646850, 1586985, 1524757, 1462566, 1402054, 1343282, 1285317, 1227672, 1171020, 1116707, 1065897, 1019163, 976533, 937590, 901504, 867309, 834646, 804240, 777141, 753249, 731169, 709979, 690384, 673287, 657856, 642375, 626739, 612553, 600699, 590488, 581650, 575215, 571241, 567364, 561307, 553814, 547236, 541913, 535899, 528168, 520295, 514698, 512517, 513289, 515376, 516492, 515191, 512275, 509832, 508807, 508666, 509355, 511829, 516131, 520649, 524312, 528134, 533389, 539430, 544842, 549957, 556583, 565461, 575416, 585088, 594285, 603378, 612457, 621610, 631440, 642779, 656182, 671884, 689919, 709990, 731449, 753754, 777011, 802067, 829936, 860988]
62528H60988L3662L5396L6785L8257L9389L9610L9277L9190L9072L7461L3343
62517A272430K7154J9950J2386M974j493o708j1567j7240k3515k8880l2404l4831
62505A180256l7320l9638m0359l8884l6501l5017l4760l4407l2623k9403k5870
62494G95474k3245k2009k1528k0421j7800j4307j1552j0453j0513j0618j0039
62483F22989q693p322p305r270j1714j2137j0010p412o192n811m918l602k687
62470E25916j888m47J151J876K143L262N072O021N665N334N960O978P857R084
62456E83984J0935J2726J4208J6245J9037K1023K0992K0327K1574K5139K8870
62445G95060L0808L1084L0979L1208L1580L1679L1275L0174K8053K4483J9213
$$ y = [860988, 894650, 930046, 966831, 1005088, 1044477, 1084087, 1123364, 1162554, 1201626, 1239087, 1272430, 1299584, 1319534, 1331920, 1336894, 1335401, 1328693, 1317126, 1299886, 1276371, 1247491, 1215087, 1180256, 1142936, 1103298, 1062939, 1024055, 987554, 952537, 917777, 883370, 850747, 821344, 795474, 772229, 750220, 728692, 708271, 690471, 676164, 664612, 654159, 643646, 633028, 622989, 614296, 606974, 599669, 590399, 578685, 566548, 556538, 549126, 542934, 537123, 532205, 528603, 525916, 524028, 523581, 524732, 526608, 528751, 532013, 537085, 543106, 548771, 554105, 560065, 567043, 574900, 583984, 594919, 607645, 621853, 638098, 657135, 678158, 699150, 719477, 741051, 766190, 795060, 825868, 856952, 887931, 919139, 950719, 982398, 1013673, 1043847, 1071900, 1096383, 1115596]
62434A115596J2488N106j855p435j1309j4161j7225k0893k4008k5261k5064k5152
62422I60827k6271k7320k7118k5940k4634k3214k1276j9129j7428j5946j3810
62411G18741j0974q656p989q725r459q872o758m121k317j821j899j571p24K7M09
62396F45291Q97K024L587M768M960M288L425L034L495M853O588P554O937N491
62382G07192N108O463P829P161M764K655J652O76r87k497l228m198o538r525j1308
62367G05219j1061r505p879p239q163j0146j1662j1601j0262q270n407j568J902
62354F04358L352L030K656K984L192K766K523L282M762O263P535Q544R189R660
62340F74096J0296J0865J0862J0663J1266J2601J3277J2622J1670J1363J1089
$$ y = [1115596, 1128084, 1133190, 1131335, 1123900, 1112591, 1098430, 1081205, 1060312, 1036304, 1011043, 985979, 960827, 934556, 907236, 880118, 854178, 829544, 806330, 785054, 765925, 748497, 732551, 718741, 707767, 699111, 691122, 682397, 672938, 664066, 657308, 653187, 650870, 649049, 647150, 645579, 644855, 644882, 645291, 646188, 648212, 651799, 656567, 661527, 665815, 669240, 672274, 675769, 680622, 687210, 694764, 701701, 707192, 712300, 718763, 726592, 733753, 738517, 741172, 742824, 743500, 742513, 740016, 736788, 732590, 726052, 716527, 705219, 694158, 684653, 676774, 669535, 661372, 651226, 639564, 627963, 617701, 609431, 604024, 602456, 604358, 607710, 610740, 613396, 616380, 619572, 622338, 624861, 628143, 632905, 639168, 646703, 655247, 664436, 674096, 684392, 695257, 706119, 716782, 728048, 740649, 753926, 766548, 778218, 789581, 800670]
62329H00670J0098R152R233R416P880M722K105J410J781J884J805K420L742M751
62315H71069M607L651L303M993Q822J3350J7076J9902K2635K5569K8530L2003
62303A055510L6803M2471M7409N1050N4535N8724O3030O7097P2032P8379Q4058
62292A711098Q6190Q4469Q0833P6183O9390N9768M8531L7114K5584J3739K440
62281B295339p334j6024k4951l4597m4243n2966o0216o5623o8941p0225o9738
62270A780481o7760o4714o1199n7580n3831n0047m6770m4405m2518m0035l6213
62259A215409l1412k7000k4299k3211k2093j9585j6333j4067j3109j1901r251
62248A003148n842l074j465q21q82j078o49K07L07n79j023l12j42k252n385o777
$$ y = [800670, 810768, 819920, 829153, 838569, 846449, 851171, 853276, 854686, 856467, 858351, 860156, 862576, 866318, 871069, 875676, 879327, 882630, 887623, 896445, 909795, 926871, 946773, 969408, 994977, 1023507, 1055510, 1092313, 1134784, 1182193, 1233243, 1287778, 1346502, 1409532, 1476629, 1548661, 1627040, 1711098, 1797288, 1881757, 1962590, 2038773, 2108163, 2167931, 2216462, 2253576, 2279160, 2292899, 2295339, 2288005, 2271981, 2247030, 2212433, 2168190, 2115224, 2055008, 1989385, 1920444, 1850219, 1780481, 1712721, 1648007, 1586808, 1529228, 1475397, 1425350, 1378580, 1334175, 1291657, 1251622, 1215409, 1183997, 1156997, 1132698, 1109487, 1087394, 1067809, 1051476, 1037409, 1024300, 1012399, 1003148, 997306, 994232, 992767, 991946, 991064, 989986, 989337, 989544, 989851, 989272, 988249, 987937, 987795, 985543, 980158, 973381]
62232I73381o043n324n590n333l493j515j179k013k204j158K55J356K310L434
62218I46884M778O358Q131R784J0975J1780J2623J3950J6041J8887K2120K5234
62206A107545K7841K9547L0059L0039L1446L5851M2375M8441N2852N6901O1912
62195A554809O7036P0646P2887P5337P8393Q0414P9668P5926O9601O0333M7641
62184B332691L2788J8747P598j627j1515k2853l3653m1942m8221n4132n9570o2766
62172B055545o3056o1945o0921n9605n6759n2229m7046m2182l7928l4216l0882
62161A508776k7816k5043k2527j9911j7000j4341j2601j1312r163n831k547l95
62149A340289J001K428L673M121M159M888O599Q394R407R803J0409J1754J3559
$$ y = [973381, 967338, 962014, 956424, 951091, 947598, 946083, 944904, 942891, 940687, 939529, 939784, 941140, 943450, 946884, 951662, 958020, 966151, 975935, 986910, 998690, 1011313, 1025263, 1041304, 1060191, 1082311, 1107545, 1135386, 1164933, 1194992, 1225031, 1256477, 1292328, 1334703, 1383144, 1435996, 1492897, 1554809, 1621845, 1692491, 1765378, 1840715, 1919108, 1999522, 2079190, 2155116, 2224717, 2285050, 2332691, 2365479, 2384226, 2391824, 2390197, 2378682, 2355829, 2322176, 2280234, 2232013, 2177881, 2118311, 2055545, 1992489, 1930544, 1869623, 1810018, 1753259, 1701030, 1653984, 1611802, 1573874, 1539658, 1508776, 1480960, 1455917, 1433390, 1413479, 1396479, 1382138, 1369537, 1358225, 1349062, 1343231, 1340684, 1340289, 1341290, 1343718, 1347391, 1351512, 1355671, 1360559, 1367158, 1375552, 1384959, 1394762, 1405171, 1416925, 1430484]
62136A430484J4999J5526J5448J5676J6929J9356K2579K5755K7847K8591K9015
62125A662205L0314L2316L3864L4460L4527L4202L3124L1460K9758K7644K4287
62114B008161K0496J8593J9403K1081K1981K3165K6596L2241L8495M4372M9554
62103B324138N3293N5158N6323N8185N9943N9364N5830N0909M5781L9804L2113
62092B890841K3380J5224Q673L553j055n943j1004j5441j8975k2163k4941k5862
62080B816287k3911k0299j7018j4299j0954o766k723P39L884O241O996O999Q248
62067B753424J0989J3295J4231J5354J8126K1652K4320K5975K7016K6900K5414
62056B976696K4415K6143L0171L3808L5514L6288L7541L9087L9945M0051M0291
$$ y = [1430484, 1445483, 1461009, 1476457, 1492133, 1509062, 1528418, 1550997, 1576752, 1604599, 1633190, 1662205, 1692519, 1724835, 1758699, 1793159, 1827686, 1861888, 1895012, 1926472, 1956230, 1983874, 2008161, 2028657, 2047250, 2066653, 2087734, 2109715, 2132880, 2159476, 2191717, 2230212, 2274584, 2324138, 2377431, 2432589, 2488912, 2547097, 2607040, 2666404, 2722234, 2773143, 2818924, 2858728, 2890841, 2914221, 2929445, 2938118, 2941671, 2940616, 2934673, 2923669, 2908228, 2889253, 2867090, 2842149, 2816287, 2792376, 2772077, 2755059, 2740760, 2729806, 2723040, 2720317, 2721056, 2724940, 2731181, 2738177, 2745176, 2753424, 2764413, 2777708, 2791939, 2807293, 2825419, 2847071, 2871391, 2897366, 2924382, 2951282, 2976696, 3001111, 3027254, 3057425, 3091233, 3126747, 3163035, 3200576, 3239663, 3279608, 3319659, 3359950]
62045C359950M1177M2198M2570M2281M2134M2785M4083M5611M7453M9765N2075
62034C852082N3972N6408O0824O6542P0327O9666O5591O1282N8610N7232N6513
62023D529049N6807N8683O2003O5945O9259P0426O8522O4289N9754N6495N4624
62012E215856N3469N2583N1784N0873M9923M9489M9990N0936N1266N0583M9588
62001E776340M9003M8348M6324M2428L7474L2191K5940J7721Q169n88p291j2864
61989F063195j8928k5825l2736l8954m4218m8293n1213n3669n6220n8188n8239
61978E576712n6160n3204n0407m7406m3417l8786l4808l2195l0256k7756k4349
61967E137968k1110j9473j9560j9808j8720j6871j6436j8465k1428k3088k3172
$$ y = [3359950, 3401127, 3443325, 3485895, 3528176, 3570310, 3613095, 3657178, 3702789, 3750242, 3800007, 3852082, 3906054, 3962462, 4023286, 4089828, 4160155, 4229821, 4295412, 4356694, 4415304, 4472536, 4529049, 4585856, 4644539, 4706542, 4772487, 4841746, 4912172, 4980694, 5044983, 5104737, 5161232, 5215856, 5269325, 5321908, 5373692, 5424565, 5474488, 5523977, 5573967, 5624903, 5676169, 5726752, 5776340, 5825343, 5873691, 5920015, 5962443, 5999917, 6032108, 6058048, 6075769, 6083938, 6083350, 6076059, 6063195, 6044267, 6018442, 5985706, 5946752, 5902534, 5854241, 5803028, 5749359, 5693139, 5634951, 5576712, 5520552, 5467348, 5416941, 5369535, 5326118, 5287332, 5252524, 5220329, 5190073, 5162317, 5137968, 5116858, 5097385, 5077825, 5058017, 5039297, 5022426, 5005990, 4987525, 4966097, 4943009, 4919837]
61956D919837k3214k4075k4934k4951k4718k5234k6220k6517k5829k5030k4797
61945D644318k4843k4630k3955k2645k0524j8119j6611j6496j7014j7552j8780
61934D423149k1414k4558k6628k7829l0191l4876m0717m5935n0066n3285n4910
61923D012740n4112n1773n0164n0392n1147n0473m8137m5544m3855m2893m1799
61912C482451m0056l7746l5332l3479l2685l2594l1958k9809k6733k4385k3658
61901C134016k3704k3098k1514j9793j8626j7716j6292j3994j1005p702m556k254
61889B953762j453j972k359p68L396Q891J4048J8474K2915K7714L2278L6190L9879
61876C150995M3640M6752M8375M9030N0333N3248N6979N9657N9918N8076N5997
$$ y = [4919837, 4896623, 4872548, 4847614, 4822663, 4797945, 4772711, 4746491, 4719974, 4694145, 4669115, 4644318, 4619475, 4594845, 4570890, 4548245, 4527721, 4509602, 4492991, 4476495, 4459481, 4441929, 4423149, 4401735, 4377177, 4350549, 4322720, 4292529, 4257653, 4216936, 4171001, 4120935, 4067650, 4012740, 3958628, 3906855, 3856691, 3806299, 3755152, 3704679, 3656542, 3610998, 3567143, 3524250, 3482451, 3442395, 3404649, 3369317, 3335838, 3303153, 3270559, 3238601, 3208792, 3182059, 3157674, 3134016, 3110312, 3087214, 3065700, 3045907, 3027281, 3009565, 2993273, 2979279, 2968274, 2960572, 2956016, 2953762, 2952309, 2950337, 2947978, 2947210, 2950606, 2959497, 2973545, 2992019, 3014934, 3042648, 3074926, 3111116, 3150995, 3194635, 3241387, 3289762, 3338792, 3389125, 3442373, 3499352, 3559009, 3618927, 3677003, 3733000]
61865C733000N5559N7001N9082O0792O2346O4237O6516O9580P4687Q2594R2410
61854D477804J02865J14118J27025J41320J56272J72717J92396K14988K37749
61845E937254K58903K79812L02890L28800L56805L86548M17990M50279M82003
61836I201284N12037N38839N59222N68861N63720N39992M93226M19494L18514
61827A3715189J95459N9600p8529k09440l26068m24213n01812n57906n92762o08684
61817A0670834o09418n98140n76544n46422n11267m75187m40243m05977l71709
61808F135927l38452l07838k79975k53567k28034k04342j83358j64396j46191
61799D029774j28629j12504r7937q4114p0538n7554m5540l4369k3963j4549o092
$$ y = [3733000, 3788559, 3845560, 3904642, 3965434, 4027780, 4092017, 4158533, 4228113, 4302800, 4385394, 4477804, 4580669, 4694787, 4821812, 4963132, 5119404, 5292121, 5484517, 5699505, 5937254, 6196157, 6475969, 6778859, 7107659, 7464464, 7851012, 8269002, 8719281, 9201284, 9713321, 10252160, 10811382, 11380243, 11943963, 12483955, 12977181, 13396675, 13715189, 13910648, 13970248, 13891719, 13682279, 13356211, 12931998, 12430186, 11872280, 11279518, 10670834, 10061416, 9463276, 8886732, 8340310, 7829043, 7353856, 6913613, 6507636, 6135927, 5797475, 5489637, 5209662, 4956095, 4728061, 4523719, 4340361, 4175965, 4029774, 3901145, 3788641, 3690704, 3606590, 3536052, 3478498, 3432958, 3398589, 3374626, 3360077, 3353985]
61788C353985J771Q877J4348J7728J9570K0429J9910J7396J3144P931K121m094
61776C493116r884j4140j6645j8080j8820j8404j6270j2460p359j314N203J1366
61764C376309J6187J8844J8868J6360J2093O990J430m641j0827j6064j9660k2111
61752C393778k4335k6165k6236k3538j8661j3095p604j636N641J4229K3290L1908
61740C327576L9723M6981N4300O2248P0966Q0205Q9700R9298J08790J18014J27341
61729D225142J37636J49366J62033J74846J87767K01555K16991K34407K53819
61720E943562K75139K98479L24443L53856L86832M22646M61078N03361N50996
61711I520392O03947O60961P21373P85281Q51571R16734R76226J026080J062407
$$ y = [3353985, 3355756, 3364633, 3378981, 3396709, 3416279, 3436708, 3456618, 3474014, 3487158, 3495089, 3497210, 3493116, 3483232, 3469092, 3452447, 3434367, 3415547, 3397143, 3380873, 3368413, 3361054, 3359740, 3364943, 3376309, 3392496, 3411340, 3430208, 3446568, 3458661, 3465651, 3467081, 3462440, 3451613, 3435549, 3415889, 3393778, 3369443, 3343278, 3317042, 3293504, 3274843, 3261748, 3254144, 3252508, 3258149, 3272378, 3295668, 3327576, 3367299, 3414280, 3468580, 3530828, 3601794, 3681999, 3771699, 3870997, 3979787, 4097801, 4225142, 4362778, 4512144, 4674177, 4849023, 5036790, 5238345, 5455336, 5689743, 5943562, 6218701, 6517180, 6841623, 7195479, 7582311, 8004957, 8466035, 8969396, 9520392, 10124339, 10785300, 11506673, 12291954, 13143525, 14060259, 15036485, 16062565, 17124972]
61702A7124972J079459J068989J021744R29986P89796O02767L77045J27183j28094
61693B2993847l70271n85220p64266r02468r97780j052509j073766j070094j047455
61684A5130018j009354r59771r03647q44368p82995p20711o60342o04400n52996
61675H091434n04953m60145m19559l83629l51554l22019k94134k67950k44354
61666D843137k23914k05720j88265j71643j57584j46705j37171j27105j17162
61657C367868j09257j03616r8681r3592q9091q5808q2992p9537p5415p1420o7836
61646B410623o3981n9244n4229n0368m8160m6294m3128l8732l4629l1851l0297
61635A909710k9808l0404l1300l1131k9725k8391k7948k7746k7102k6280k5350
$$ y = [17124972, 18204431, 19273420, 20295164, 21225150, 22014946, 22617713, 22994758, 23121941, 22993847, 22623576, 22038356, 21274090, 20371622, 19373842, 18321333, 17247567, 16177473, 15130018, 14120664, 13160893, 12257246, 11412878, 10629883, 9909172, 9248830, 8644430, 8091434, 7586481, 7126336, 6706777, 6323148, 5971594, 5649575, 5355441, 5087491, 4843137, 4619223, 4413503, 4225238, 4053595, 3896011, 3749306, 3612135, 3485030, 3367868, 3258611, 3154995, 3056314, 2962722, 2873631, 2787823, 2704831, 2625294, 2549879, 2478459, 2410623, 2346642, 2287398, 2233169, 2182801, 2134641, 2088347, 2045219, 2006487, 1971858, 1940007, 1909710, 1879902, 1849498, 1818198, 1787067, 1757342, 1728951, 1701003, 1673257, 1646155, 1619875, 1594525]
61624A594525k3749k1813k1062k1699k1718j9926j8189j8645k0264k0526j9321
61613A367613j8470j8098j6387j2947r785q504q664r441j0742j2095j2279j0934
61601A219267r095p449n519l216j667j678k545l170l244k683j077J496M027N728
61587A189175O872P896Q535Q390P630O595N381M146L078J805j36k115k787j982
61573A242483j135j382k451l756n160o064n255k688r2J219J916K940L589K792
61559A226956J097l25j764m243p214q992r286r459j0144j0356r405q149p624p726
61545A133366p961q449r298r799r173p629n936m350k733j379r26j411k033j932
61531A060357r26N69J971K953L646M491N696O951P878Q623R585J0698J1483J1858
$$ y = [1594525, 1570776, 1548963, 1527901, 1506202, 1484484, 1464558, 1446369, 1427724, 1407460, 1386934, 1367613, 1349143, 1331045, 1314658, 1301711, 1291926, 1283422, 1274758, 1265317, 1254575, 1242480, 1230201, 1219267, 1210172, 1202723, 1197204, 1193988, 1192321, 1190643, 1188098, 1184928, 1181684, 1179001, 1177924, 1179420, 1183447, 1189175, 1196047, 1203943, 1212478, 1220868, 1228498, 1235093, 1240474, 1244620, 1247698, 1249503, 1249367, 1247252, 1244465, 1242483, 1241348, 1239966, 1237515, 1233759, 1228599, 1222535, 1217280, 1214592, 1214500, 1215719, 1217635, 1220575, 1224164, 1226956, 1228053, 1227728, 1225964, 1221721, 1214507, 1205515, 1196229, 1186770, 1176626, 1166270, 1156865, 1148716, 1141092, 1133366, 1125405, 1116956, 1107658, 1097859, 1088686, 1081057, 1075121, 1070771, 1068038, 1066659, 1065733, 1064322, 1062289, 1060357, 1059431, 1060000, 1061971, 1064924, 1068570, 1073061, 1078757, 1085708, 1093586, 1102209, 1111794, 1122492, 1133975, 1145833]
61517A145833J2385J3562J5302J7366J9837K2781K5837K8643L1193L3274L4187
61506A400200L3890L3940L5964L9223M1031L9922L7191L4795L3012L1044K8826
61495A789038K7012K5780K4791K3970K3348K2462K0725J8177J5235J2148R328
61484B012014P524O788N992M396K965K823L177K239k54l164o115r435j2023j1552
61470B005375p650l010l13N97J588L674O705J0508J4986J9637K4032K8485L3572
61457B138186L9377M5644N2209N8852O5307P1797P8941Q6926R5510J04976J16038
61446B953763J28437J40749J52262J64032J77279J91668K05898K19113K30727
61437D563928K39579K44165K43329K36085K21466J99274J70409J35986R6953N5176
$$ y = [1145833, 1158218, 1171780, 1187082, 1204448, 1224285, 1247066, 1272903, 1301546, 1332739, 1366013, 1400200, 1434090, 1468030, 1503994, 1543217, 1584248, 1624170, 1661361, 1696156, 1729168, 1760212, 1789038, 1816050, 1841830, 1866621, 1890591, 1913939, 1936401, 1957126, 1975303, 1990538, 2002686, 2012014, 2019538, 2026326, 2032318, 2036714, 2039679, 2042502, 2045679, 2047918, 2047664, 2044500, 2038385, 2028950, 2016927, 2005375, 1997725, 1994715, 1994402, 1994999, 1996587, 2000261, 2006966, 2017474, 2032460, 2052097, 2076129, 2104614, 2138186, 2177563, 2223207, 2275416, 2334268, 2399575, 2471372, 2550313, 2637239, 2732749, 2837725, 2953763, 3082200, 3222949, 3375211, 3539243, 3716522, 3908190, 4114088, 4333201, 4563928, 4803507, 5047672, 5291001, 5527086, 5748552, 5947826, 6118235, 6254221, 6351174, 6406350]
61427F406350J3797k4640n9563r0926j17307j36772j49000j55233j56563j53650
61417E376493j47666j39973j30831j19679j06818r3650q1129o9048n7074m5576
61407D385049l5145k5964j7958j0946m514J737P755J3317J8684K4464L0884L7674
61395D425037M4461N0811N6139O0140O3081O5096O5669O4617O3076O2473O2806
61384E083406O2892O2141O0845N8798N4970M8957M1710L4453K7716K1774J7015
61373E574677J3354J0080O911M621L956M363M340K911M60j701k530k274k419m340
61359E612409q070j2735j7852k3360k8539l2014l3262l3246l3108l2894l2125
61348E325204l0940k9954k9394k8979k8555k8404k8962l0386l2122l3002l2234
$$ y = [6406350, 6420147, 6395507, 6335944, 6245018, 6127711, 5990939, 5841939, 5686706, 5530143, 5376493, 5228827, 5088854, 4958023, 4838344, 4731526, 4637876, 4556747, 4487699, 4430625, 4385049, 4349904, 4323940, 4305982, 4295036, 4290522, 4292259, 4300014, 4313331, 4332015, 4356479, 4387363, 4425037, 4469498, 4520309, 4576448, 4636588, 4699669, 4764765, 4830434, 4895051, 4958127, 5020600, 5083406, 5146298, 5208439, 5269284, 5328082, 5383052, 5432009, 5473719, 5508172, 5535888, 5557662, 5574677, 5588031, 5598111, 5605022, 5609643, 5613599, 5617962, 5622302, 5625213, 5625673, 5623972, 5621442, 5619168, 5616749, 5612409, 5604339, 5591604, 5573752, 5550392, 5521853, 5489839, 5456577, 5423331, 5390223, 5357329, 5325204, 5294264, 5264310, 5234916, 5205937, 5177382, 5148978, 5120016, 5089630, 5057508, 5024506, 4992272]
61337D992272l0320k8282k5834k1310j3879m845M187J3617K5169L9347N4797P0127
61325E075046Q5234J00690J16922J34229J52630J71215J88563K04343K19493K34023
61315F682388K45535K51183K50545K45097K34947K17663J91091J56064J15556
61306H590069P2093K7350j6366n6096r0363j20406j48418j74810j97668k14785
61296G670600k25816k32340k35992k36864k33922k26873k17111k06627j96425
61287E658630j86394j76216j65741j54862j43821j33354j23612j13292j01016
61278D360322q7541p5261o5207n5925m6014l6186k7629j9530j0019Q44J0746J7916
61266C966516K3079K8287L4691M1674M7471N0427N0181M7884M5024M2189L9319
$$ y = [4992272, 4961952, 4933670, 4907836, 4886526, 4872647, 4867802, 4871989, 4885606, 4910775, 4950122, 5004919, 5075046, 5160280, 5260970, 5377892, 5512121, 5664751, 5835966, 6024529, 6228872, 6448365, 6682388, 6927923, 7179106, 7429651, 7674748, 7909695, 8127358, 8318449, 8474513, 8590069, 8662162, 8689512, 8673146, 8617050, 8526687, 8406281, 8257863, 8083053, 7885385, 7670600, 7444784, 7212444, 6976452, 6739588, 6505666, 6278793, 6061682, 5855055, 5658630, 5472236, 5296020, 5130279, 4975417, 4831596, 4698242, 4574630, 4461338, 4360322, 4272781, 4197520, 4132313, 4076388, 4030374, 3994188, 3966559, 3947029, 3937010, 3937854, 3948600, 3966516, 3989595, 4017882, 4052573, 4094247, 4141718, 4192145, 4242326, 4290210, 4335234, 4377423, 4416742]
61255D416742L6595L4195L1496K7615K2809J8395J5081J2306R444O677M176J279
61243D636810k722p536j2356j7133k2655k9315l6198m1608m4426m5123m5428m6770
61231D285540m8980n0641n0595m8791m5898m2677l9796l7558l5527l2890k9426
61220C822761k5706k2236j9014j6134j4144j3270j2863j2233j1618j1768j2812
61209C650963j4147j5208j5584j4539j1266n932J13N652J0788J6525K3201K9802
61197C660368L4900L8117M0454M3150M6614N0773N6076O3313P2333Q1695R0103
61186D277896R7429J03578J07030J05700R9215Q9073P6316O0127L9285J4097j3785
61175E055961m2558p0324r4759j14127j28522j38988j45547j47254j44301j38651
$$ y = [4416742, 4453337, 4487532, 4519028, 4546643, 4569452, 4587847, 4602928, 4615234, 4624678, 4631355, 4635531, 4636810, 4634088, 4626552, 4614196, 4597063, 4574408, 4545093, 4508895, 4467287, 4422861, 4377738, 4332310, 4285540, 4236560, 4185919, 4135324, 4086533, 4040635, 3997958, 3958162, 3920604, 3885077, 3852187, 3822761, 3797055, 3774819, 3755805, 3739671, 3725527, 3712257, 3699394, 3687161, 3675543, 3663775, 3650963, 3636816, 3621608, 3606024, 3591485, 3580219, 3574287, 3574400, 3580052, 3590840, 3607365, 3630566, 3660368, 3695268, 3733385, 3773839, 3816989, 3863603, 3914376, 3970452, 4033765, 4106098, 4187793, 4277896, 4375325, 4478903, 4585933, 4691633, 4790848, 4879921, 4956237, 5016364, 5055649, 5069746, 5055961, 5013403, 4943079, 4848320, 4734193, 4605671, 4466683, 4321136, 4173882, 4029581, 3890930]
61165C890930j32139j25148j17734j10710j04541r8367r1544q5396q1602p9230
61155B864519p5233o8248o0206n3540m8318m3194l7976l3788l1071k8804k5681
61144B358460k1231j5764r997m853r07K218N582R885J4885J9722K3400K5075K4453
61131B430928K2128J9149J5946J1922O368l77o952j2137j5765j8485k0847k2938
61119B408940k4801k6721k8854l0989l2999l5178l7529l9050l8653l6912l5969
61108B041285l7187l9510m0781m0216l8931l8263l8372l8436l7675l6003l4038
61097A621873l2615l1980l1343k9443k5766k1201j7382j5267j4268j2987j1003
61086A378618r691j0781j4155j7797k0062k1252k2450k3524k3274k1284j8634
$$ y = [3890930, 3758791, 3633643, 3515909, 3405199, 3300658, 3202291, 3110747, 3025351, 2943749, 2864519, 2789286, 2721038, 2660832, 2607292, 2558974, 2515780, 2477804, 2444016, 2412945, 2384141, 2358460, 2337229, 2321465, 2311468, 2306615, 2305708, 2307926, 2313508, 2323393, 2338278, 2358000, 2381400, 2406475, 2430928, 2453056, 2472205, 2488151, 2500073, 2506441, 2506064, 2499112, 2486975, 2471210, 2452725, 2431878, 2408940, 2384139, 2357418, 2328564, 2297575, 2264576, 2229398, 2191869, 2152819, 2114166, 2077254, 2041285, 2004098, 1964588, 1923807, 1883591, 1844660, 1806397, 1768025, 1729589, 1691914, 1655911, 1621873, 1589258, 1557278, 1525935, 1496492, 1470726, 1449525, 1432143, 1416876, 1402608, 1389621, 1378618, 1368927, 1358146, 1343991, 1326194, 1306132, 1284880, 1262430, 1238906, 1215632, 1194348, 1175714]
61075A175714j6454j4557j1969q459m975k562j256k22J253L124M921O389P647
61062A138594Q919J0337J1877J3344J4401J4806J4473J3264J1161Q896P890Q864
61050A276826J0740J1653J1035R890R116Q421P166N445L775K248M54k072n607
61037A349090r953j4062j6418j6296j4518j2676j1769j1730j2003j2265j2662
61026A204738j3316j3690j2809j0525q110o901o686o307n553n304n757n753m344
61013A099683k040l6J027J160P24M82J131K402L307L559L907M744N420N336M830
60998A135636M472M399M779N895P233P596O773N997O146O686P177Q404J0838J3198
60984A235229J4061J4046J4885J6886J8803J9965K1125K3224K6235K9320L1633
$$ y = [1175714, 1159260, 1144703, 1132734, 1124275, 1119300, 1116738, 1115482, 1115260, 1116513, 1119637, 1124558, 1130947, 1138594, 1147513, 1157850, 1169727, 1183071, 1197472, 1212278, 1226751, 1240015, 1251176, 1260072, 1267962, 1276826, 1287566, 1299219, 1310254, 1320144, 1329260, 1337681, 1344847, 1350292, 1354067, 1356315, 1356769, 1354697, 1349090, 1339137, 1325075, 1308657, 1292361, 1277843, 1265167, 1253398, 1241668, 1229665, 1217400, 1204738, 1191422, 1177732, 1164923, 1154398, 1146288, 1139387, 1132701, 1126394, 1120841, 1115537, 1109780, 1104027, 1099683, 1097643, 1097607, 1098634, 1099794, 1100518, 1101000, 1102131, 1104533, 1107840, 1111399, 1115306, 1120050, 1125470, 1130806, 1135636, 1140108, 1144507, 1149286, 1155181, 1162414, 1170010, 1176783, 1182780, 1188926, 1195612, 1202789, 1211193, 1222031, 1235229, 1249290, 1263336, 1278221, 1295107, 1313910, 1333875, 1355000, 1378224, 1404459, 1433779, 1465412]
60973A465412L3052L4465L6802L9663M1663M2482M3495M5848M9118N2502N5975
60962A940477N9387O1810O3068O4656O7796P1693P5074P8345Q2613Q7550R1945
60951B744414R5728R9926J05132J11360J18863J27838J37847J48535J60175J72723
60941D022541J85389J97906K10688K23022K33298K42590K55553K75482L00575
60932F147044L27345L55490L86388M19115M51796M85694N24666N71856O30286
60923A0299680P04771P99015R11957J041004J187587J356196J551067J778414
60915A9629691K046439K354770K689799L042510L418724L794763M047719L969779
60907D4994194L414709K456454J383010N10767P40j59782n3807K23072N17510
$$ y = [1465412, 1498464, 1532929, 1569731, 1609394, 1651057, 1693539, 1737034, 1782882, 1832000, 1884502, 1940477, 1999864, 2061674, 2124742, 2189398, 2257194, 2328887, 2403961, 2482306, 2564919, 2652469, 2744414, 2840142, 2940068, 3045200, 3156560, 3275423, 3403261, 3541108, 3689643, 3849818, 4022541, 4207930, 4405836, 4616524, 4839546, 5072844, 5315434, 5570987, 5846469, 6147044, 6474389, 6829879, 7216267, 7635382, 8087178, 8572872, 9097538, 9669394, 10299680, 11004451, 11803466, 12715423, 13756427, 14944014, 16300210, 17851277, 19629691, 21676130, 24030900, 26720699, 29763209, 33181933, 36976696, 41024415, 44994194, 48408903, 50865357, 52248367, 52759134, 52759874, 52600092, 52546285, 52769357, 53286867]
60898E3286867N90850K23927o13346j707276k731726l444375l781193l812083
60890C8011645l648162l386024l094213k811373k547922k298173k055989j820645
60882A6349144j594560j382597j192298j029682q94524p82316o89380o13348n50515
60873G619924m96557m49342m08387l72403l39851l10718k85064k60997k36931
60864D459674k14700j97602j85967j77360j70115j63803j57120j48605j39070
60855B905332j30455j22597j14034j05461r9112r4776q9707q2879p6192p0887
60845A919232o5815o0105n4831n0890m7669m4854m3345m3091m2193l9388l5745
60834A391306l2680l0023k7175k4556k2656k1076j9615j8929j9070j8644j6710
$$ y = [53286867, 53877717, 54101644, 53488298, 51781022, 49049296, 45604921, 41823728, 38011645, 34363483, 30977459, 27883246, 25071873, 22523951, 20225778, 18169789, 16349144, 14754584, 13371987, 12179689, 11150007, 10255483, 9473167, 8783787, 8170439, 7619924, 7123367, 6674025, 6265638, 5893235, 5553384, 5242666, 4957602, 4696605, 4459674, 4244974, 4047372, 3861405, 3684045, 3513930, 3350127, 3193007, 3044402, 2905332, 2774877, 2652280, 2538246, 2432785, 2333673, 2238897, 2149190, 2066311, 1990119, 1919232, 1853417, 1793312, 1738481, 1687591, 1639922, 1595068, 1551723, 1508632, 1466439, 1427051, 1391306, 1358626, 1328603, 1301428, 1276872, 1254216, 1233140, 1213525, 1194596, 1175526, 1156882, 1140172]
60823A140172j4400j3344j3472j3576j3244j3005j3173j3612j4211j4642j4159
60812I89334j2553j0940j0617j1368j1751j1032r979r595r774r649q842p706o382
60799H59146m409j725P22K264L891O901J0274J1276R298P256P981J0728J2895
60786I36498J3778J4624J5882J6816J7420J8552K0002K0467J9632J8403J6711
60775A128785J3189P893L439K046K633K388M87j272j557j661l684p175r083p614
60761A128814m996m850p453r605r438q854j0070j2068j2533j1597j1081j1236
60749A015033j0794r650q861q198o269l238j125j021j912k557k664j988k19J834
60735I58371K762K746L484N510P437Q270Q691R454J0259J0959J2178J3929J5081
$$ y = [1140172, 1125772, 1112428, 1098956, 1085380, 1072136, 1059131, 1045958, 1032346, 1018135, 1003493, 989334, 976781, 965841, 955224, 943856, 932105, 921073, 911094, 901499, 891725, 882076, 873234, 865528, 859146, 854737, 853012, 853734, 855998, 859889, 866790, 877064, 888340, 897638, 904894, 912875, 923603, 936498, 950276, 964900, 980782, 997598, 1015018, 1033570, 1053572, 1074039, 1093671, 1112074, 1128785, 1141974, 1149867, 1153306, 1155352, 1157985, 1160373, 1160860, 1159588, 1158031, 1156370, 1152686, 1145511, 1136428, 1128814, 1123818, 1118968, 1111515, 1101910, 1092472, 1083618, 1073548, 1061480, 1048947, 1037350, 1026269, 1015033, 1004239, 994589, 985728, 977530, 971261, 968023, 966898, 965877, 963965, 961408, 958744, 956756, 956537, 958371, 961133, 963879, 967363, 972873, 980310, 988580, 997271, 1006725, 1016984, 1027943, 1040121, 1054050, 1069131]
60722A069131J4996J4402J4057J3775J3331J2909J2278J0941R472R142R763R590
60710A213787P985O364N742N157L570J713P51N39L08L2kK0p1j11l06j094j880
60693A242504j367K57J014j65j999k912k968k797k338j757k097l705n418o388
60679A209864p228q239q310o984n861o177o629n593m003l751m349l766k013j328
60665A135633k764m704n219m256l026k346k072j598p30k78j290l470n170n413
60651A093297m921m545m082l482l719n090n993m970k973k041k699m095n749p431
60637A031507q355q234q271r345j0277r803r108j0044j1825j2359j2068j3151
60625I08667j5135j4786j1246p992q034r836j0002p988n934n110m804m122l048
$$ y = [1069131, 1084127, 1098529, 1112586, 1126361, 1139692, 1152601, 1164879, 1175820, 1185292, 1194434, 1204197, 1213787, 1221772, 1228136, 1233878, 1239035, 1242605, 1244318, 1245069, 1245608, 1245916, 1245948, 1245946, 1245966, 1245895, 1245784, 1245478, 1244384, 1242504, 1241137, 1241394, 1242408, 1242243, 1240244, 1237332, 1234364, 1231567, 1229229, 1227472, 1225375, 1221670, 1216252, 1209864, 1202636, 1194397, 1186087, 1179103, 1173242, 1167065, 1160436, 1154843, 1150840, 1147089, 1142740, 1138974, 1136961, 1135633, 1132869, 1128165, 1122946, 1118690, 1115664, 1113318, 1111246, 1109648, 1108918, 1108640, 1107350, 1103880, 1098710, 1093297, 1088376, 1083831, 1079749, 1076267, 1072548, 1067458, 1061465, 1056495, 1053522, 1051481, 1048782, 1044687, 1038938, 1031507, 1023152, 1014918, 1006647, 997302, 987025, 977222, 968114, 958070, 946245, 933886, 921818, 908667, 893532, 878746, 867500, 859508, 851474, 841638, 831636, 823648, 817714, 812604, 807800, 803678, 800630]
60612H00630j917j195j633l439n235m865j616K865O099P042O723O805P712Q552
60598H26528Q749Q918R582R938R084Q024Q869J1929J4962J5866J4929J3840J3419
60585I74637J3256J2939J2670J2751J2996J2800J1712J0085R038R385J0745J2126
60573A115140J3247J4549J5978J6647J5973J4433J2859J1525J0251Q872P202N036
60561A261712K548L58j145k279l613n377p487r773j1837j2854j2099r801p278
60548A181075n953o017o255n393l506j694n65K71J174J879K327L004L777L305
60534A167429Q08k339m065m333m966o822q478q126n607k132J095L338M275M206
60520A134283M117M979O903R071J0366J0248R260Q481Q241P772O493N008M152
$$ y = [800630, 798713, 797518, 795885, 792446, 787211, 782346, 780730, 783595, 789694, 796736, 803459, 810264, 817976, 826528, 835277, 844195, 853777, 863715, 872799, 880823, 889692, 901621, 916583, 932449, 947378, 961218, 974637, 987893, 1000832, 1013502, 1026253, 1039249, 1052049, 1063761, 1073846, 1082884, 1092269, 1103014, 1115140, 1128387, 1142936, 1158914, 1175561, 1191534, 1205967, 1218826, 1230351, 1240602, 1249474, 1256676, 1261712, 1264260, 1264618, 1263473, 1261194, 1257581, 1252204, 1244717, 1234944, 1223107, 1210253, 1198154, 1188353, 1181075, 1175122, 1169105, 1162850, 1157457, 1153951, 1152257, 1151692, 1151963, 1153137, 1155016, 1157343, 1160347, 1164124, 1167429, 1168237, 1165898, 1161833, 1157500, 1152534, 1145712, 1137234, 1129108, 1123501, 1121369, 1122464, 1125802, 1130077, 1134283, 1138400, 1143379, 1150282, 1159353, 1169719, 1179967, 1189227, 1197708, 1205949, 1213721, 1220214, 1225222, 1229374]
60507A229374L615K567J149J51o10k182m646o668p232o671n726m647l706l397
60493A191371l558l232k067q57q2J011K990M870N461N456O819J0258J4490J8128
60479A251058K1268K4904K9544L4829M0176M5259N0143N5144O0537O6078P0687
60468A749627P2733P0955O5324N6736M5796L2371J6936J768j0178j7627k1322
60457B063119k2155k0286j6386j2077q141l585K168P153Q783P354N740N662O296
60444B023645O887Q603J2449J7116K0726K3761K8370L5161M2645M9853N7633O6749
60432B393598P6387Q5663R5301J06420J18261J28644J36509J42811J48951J55473
60422C588018J62801J72340J86116K05477K30362K59499K91156L23911L56664
$$ y = [1229374, 1232989, 1235556, 1236705, 1236856, 1236246, 1234064, 1229418, 1222750, 1215518, 1208847, 1203121, 1198474, 1194768, 1191371, 1187813, 1184581, 1182514, 1181657, 1181575, 1182586, 1185576, 1190446, 1195907, 1201363, 1208182, 1218440, 1232930, 1251058, 1272326, 1297230, 1326774, 1361603, 1401779, 1447038, 1497181, 1552325, 1612862, 1678940, 1749627, 1822360, 1893315, 1958639, 2015375, 2061171, 2093542, 2110478, 2112246, 2102068, 2084441, 2063119, 2040964, 2020678, 2004292, 1992215, 1984074, 1980489, 1982657, 1989810, 1998593, 2005947, 2011687, 2017349, 2023645, 2030532, 2039135, 2051584, 2068700, 2089426, 2113187, 2141557, 2176718, 2219363, 2269216, 2326849, 2393598, 2469985, 2555648, 2650949, 2757369, 2875630, 3004274, 3140783, 3283594, 3432545, 3588018, 3750819, 3923159, 4109275, 4314752, 4545114, 4804613, 5095769, 5419680, 5776344]
60413E776344L87365M11481M21984M11345L74138L08900K18808J11032n213j20787
60403H295397k27599l18595l88187m33500m55295m57625m46397m27173m03199
60394D737827l75302l44031l11552k80624k52323k25949k01140j78705j59108
60385B409093j41593j25520j11425r9875r0164q0978p1783o2875n4810m8395m4368
60374A477307m2212l9957l6137l1387k7326k4547k2679k1708k1908k2652k2655
60363A164139k1495k0027j9067j8398j7244j5274j2964j1173j0257r532q109o329
60351I94270n503n760n271k667N78J660n5k325k797j250R63K530K937K574K552
60336I82436L682N438O482O397O202O928Q257R092Q928Q165P203N826L832J996
$$ y = [5776344, 6163709, 6575190, 6997174, 7408519, 7782657, 8091557, 8310365, 8421397, 8416184, 8295397, 8067798, 7749203, 7361016, 6927516, 6472221, 6014596, 5568199, 5141026, 4737827, 4362525, 4018494, 3706942, 3426318, 3173995, 2948046, 2746906, 2568201, 2409093, 2267500, 2141980, 2030555, 1930680, 1840516, 1759538, 1687755, 1624880, 1570070, 1521675, 1477307, 1435095, 1395138, 1359001, 1327614, 1300288, 1275741, 1253062, 1231354, 1209446, 1186794, 1164139, 1142644, 1122617, 1103550, 1085152, 1067908, 1052634, 1039670, 1028497, 1018240, 1008708, 1000599, 994270, 988767, 983007, 977736, 975069, 975647, 977307, 977252, 974927, 972130, 970880, 971843, 974373, 977310, 979884, 982436, 986118, 991556, 998038, 1004435, 1010637, 1017565, 1025822, 1034914, 1043842, 1052007, 1059210, 1065036, 1068868, 1070864]
60322A070864J745L421N379N540L726J614N10K28K24M34N50k28j813k873k755
60307A086566k555l232l868l187j806j271j646j686r58r7O16J337J596P89l76
60292A070222m48P29K001K769L373L836L819L944N371P786R414R396Q639Q003
60278A138854P285O466O352P147P818P644P128O726N975M827M466N662P300P803
60264A231453P273P061P708Q413Q259P066N063K440o87m094p225r276r952j0079
60250A243423j0763j1923j2430j1791j0834j0343r869q443n962l338j650j430
60238A144647k418l750m632m783m114k492m05P34P1j252j318L4J177J093L62l39
60222A122615j113j770j250R96M180P205R707J1570J2543J2862J3315J4129J4710
$$ y = [1070864, 1072609, 1076030, 1081409, 1086949, 1090675, 1092289, 1092799, 1093027, 1093251, 1093685, 1094235, 1094007, 1092194, 1089321, 1086566, 1084011, 1080779, 1076911, 1073724, 1071918, 1070647, 1069001, 1067315, 1066357, 1066260, 1066876, 1068213, 1069809, 1070598, 1070222, 1069774, 1070503, 1072504, 1075273, 1078646, 1082482, 1086301, 1090245, 1095616, 1103402, 1112816, 1122212, 1130851, 1138854, 1146139, 1152605, 1158957, 1166104, 1173922, 1181566, 1188694, 1195420, 1201395, 1206222, 1210688, 1216350, 1223650, 1231453, 1238726, 1245787, 1253495, 1261908, 1270167, 1277233, 1282296, 1284736, 1284049, 1279955, 1272730, 1263454, 1253502, 1243423, 1232660, 1220737, 1208307, 1196516, 1185682, 1175339, 1165470, 1157027, 1151065, 1147727, 1146077, 1144647, 1142229, 1138479, 1133847, 1129064, 1124950, 1122458, 1122053, 1122787, 1122858, 1121606, 1120288, 1120322, 1121499, 1122592, 1122954, 1122615, 1121502, 1119732, 1118482, 1119478, 1123658, 1130863, 1140570, 1152140, 1164683, 1177545, 1190860, 1204989, 1219699]
60209A219699J4856J5164J5806J6054J5551J4998J4996J5326J5889J7115J8787
60198A394241J9789J9827K0224K1963K4145K5449K6144K7427K9668L2416L5426
60187A676719L8543M1276M3562M6457N1039N7050O3500O9955P6364Q2274Q7248
60176B333987R1755R6692J02484J09050J16117J22833J27902J30823J32248J32422
60166C496313J30297J25189J18249J10952J03074R3641Q3073P2571O1783M9074
60156D444216L4288J9627P296k493j0667j7529k2508k4975k4766k2150j7626j1634
60144D351079m438L663J2350K1699L2140M3618N5191O5982P6150Q6432R7135J07933
60132D948934J18011J25882J29754J28995J24829J18881J11438J01676Q9011P3528
$$ y = [1219699, 1234555, 1249719, 1265525, 1281579, 1297130, 1312128, 1327124, 1342450, 1358339, 1375454, 1394241, 1414030, 1433857, 1454081, 1476044, 1500189, 1525638, 1551782, 1579209, 1608877, 1641293, 1676719, 1715262, 1756538, 1800100, 1846557, 1897596, 1954646, 2018146, 2088101, 2164465, 2246739, 2333987, 2425742, 2522434, 2624918, 2733968, 2850085, 2972918, 3100820, 3231643, 3363891, 3496313, 3626610, 3751799, 3870048, 3981000, 4084074, 4177715, 4260788, 4333359, 4395142, 4444216, 4478504, 4498131, 4505427, 4502934, 4492267, 4474738, 4452230, 4427255, 4402489, 4380339, 4362713, 4351079, 4346641, 4350304, 4362654, 4384353, 4416493, 4460111, 4515302, 4581284, 4657434, 4743866, 4841001, 4948934, 5066945, 5192827, 5322581, 5451576, 5576405, 5695286, 5806724, 5908400, 5997411, 6070939]
60122F070939N5662L6375J7169r42j8116l4600m9509o1566p0433p6391p9278p8853
60110E710457p5644p0152o1755m9973l6471k3956j2935j332J2140K5818L7203
60099E453400M6001N3744O1180O7254P0551P0621O7813O2485N4924M5735L5845
60088F089553K6003J6431P215j105p609j1606j2924j1543p491j006P667J8793
60076F112378L2838M9397O7141Q5120J03584J23270J44621J67938J93335K19995
60066G299617K46440K72191K98055L23994L47862L67540L83443L97225M08517
60057A0344884M14632M13398M04767L89321L66668L36003K97492K52555K03029
60048A3422749J50061R3409L2248l2691r8082j59903k15968k65633l07514l39158
$$ y = [6070939, 6126601, 6162976, 6180145, 6179203, 6161087, 6126487, 6076978, 6015412, 5944979, 5868588, 5789310, 5710457, 5634813, 5564661, 5502906, 5452933, 5416462, 5392506, 5379571, 5378239, 5390379, 5416197, 5453400, 5499401, 5553145, 5614325, 5681579, 5752130, 5822751, 5890564, 5953049, 6007973, 6053708, 6089553, 6115556, 6131987, 6139202, 6138097, 6130488, 6118882, 6105958, 6094415, 6086924, 6085918, 6093585, 6112378, 6145216, 6194613, 6261754, 6346874, 6450458, 6573728, 6718349, 6886287, 7079622, 7299617, 7546057, 7818248, 8116303, 8440297, 8788159, 9155699, 9539142, 9936367, 10344884, 10759516, 11172914, 11577681, 11967002, 12333670, 12669673, 12967165, 13219720, 13422749, 13572810, 13666219, 13698467, 13665776, 13567694, 13407791, 13191823, 12926190, 12618676, 12279518]
60038A2279518l59200l68459l68509l60237l44435l22658k96539k66784k33645
60029I359052j98011j61380j25008q9578n5593k3769M852K8957M7314N9369O5354
60018H911559O5557N9727M7630L0347J0669q326k5287m0984n6571p1836q5566
60007H836919r7261j07628j17394j26466j34496j41598j48014j53671j58353j61786
59997G490252j63296j62071j58110j52317j45293j36724j26226j13957r9972q3942
59987F148344o6251m8363l1262j4334L263K0992L7764N3627O9409Q5058R9546
59976F357793J11997J21859J28153J29734J26243J18113J05837R0021P1743N1844
59966G413337L0231O876j6934l9527o0843q2110j03353j22348j36465j44824j48312
$$ y = [12279518, 11920318, 11551859, 11183350, 10823113, 10478678, 10156020, 9859481, 9592697, 9359052, 9161041, 8999661, 8874653, 8785075, 8729482, 8705713, 8710565, 8739522, 8786836, 8846205, 8911559, 8977116, 9036843, 9084473, 9114820, 9125489, 9117163, 9091876, 9050892, 8994321, 8922485, 8836919, 8739658, 8632030, 8514636, 8388170, 8253674, 8112076, 7964062, 7810391, 7652038, 7490252, 7326956, 7164885, 7006775, 6854458, 6709165, 6572441, 6446215, 6332258, 6232286, 6148344, 6082093, 6033730, 6002468, 5988134, 5991397, 6012389, 6050153, 6103780, 6173189, 6258247, 6357793, 6469790, 6591649, 6719802, 6849536, 6975779, 7093892, 7199729, 7289750, 7361493, 7413337, 7443568, 7450444, 7433510, 7393983, 7333140, 7251030, 7147677, 7025329, 6888864, 6744040, 6595728]
59955F595728j48186j45013j38648j28857j16029j01111q4938o7969n0759l3901
59945E580317j7283j37J7729L5623N3230P1150Q9583J07676J24963J42079J58810
59934F363740J72765J81571J85412J85747J82352J73553J58884J39705J17488
59925G861217R3092O7449M1225J3989j4694m3582p0624r4995j16559j33760j44274
59914G458484j47774j46022j40096j29661j15270r9137q2744o5436m6273k5811
59904F460260n268J4671L3611N1332O8530Q6158J03333J17384J26875J33186J38146
59893G328218J41415J41478J38228J33185J27549J21177J13458J04630R6001Q8866
59883H534205Q3131P7688P2650P0409P3305Q0935R1280J03956J20526J41941J67617
$$ y = [6595728, 6447542, 6302529, 6163881, 6035024, 5918995, 5817884, 5732946, 5664977, 5614218, 5580317, 5563034, 5562897, 5580626, 5616249, 5669479, 5740629, 5830212, 5937888, 6062851, 6204930, 6363740, 6536505, 6718076, 6903488, 7089235, 7271587, 7445140, 7604024, 7743729, 7861217, 7954309, 8021758, 8062983, 8076972, 8062278, 8018696, 7948072, 7853077, 7736518, 7602758, 7458484, 7310710, 7164688, 7024592, 6894931, 6779661, 6680524, 6597780, 6532344, 6486071, 6460260, 6454992, 6469663, 6503274, 6554606, 6623136, 6709294, 6812627, 6930011, 7056886, 7190072, 7328218, 7469633, 7611111, 7749339, 7882524, 8010073, 8131250, 8244708, 8349338, 8445339, 8534205, 8617336, 8695024, 8767674, 8838083, 8911388, 8992323, 9083603, 9187559, 9308085, 9450026, 9617643]
59872I617643J96952K29366K62668K93817L21997L48517L72663L90141L96983
59863A2430747L92699L77668L49609L05309K44924J72342R2014P471p7442j57974
59853A4137367k29810k90131l37655l72442l95497m07661m09059m00115l82602
59844A0912395l59029l31426l01118k68977k35294k00066j63930j28113r3131
59835H831311n8601k4863O517L4708O0744Q5517J07807J25640J38562J46949J49681
59824I603972J44153J28591J03306O9908L0436j2882n8113j03984j49243j91803
59814I564341k28986k58469k78861k90180k94275k93972k91074k85828k78588
59805G064108k70712k62782k53131k39616k22363k03566j85068j67184j49484
$$ y = [9617643, 9814595, 10043961, 10306629, 10600446, 10922443, 11270960, 11643623, 12033764, 12430747, 12823446, 13201114, 13550723, 13856032, 14100956, 14273298, 14365312, 14372783, 14295341, 14137367, 13907557, 13617426, 13279771, 12907329, 12511832, 12104171, 11695112, 11294997, 10912395, 10553366, 10221940, 9920822, 9651845, 9416551, 9216485, 9052555, 8924442, 8831311, 8772710, 8747847, 8754364, 8789072, 8849816, 8935333, 9043140, 9168780, 9307342, 9454291, 9603972, 9748125, 9876716, 9980022, 10049930, 10080366, 10067484, 10009371, 9905387, 9756144, 9564341, 9335355, 9076886, 8798025, 8507845, 8213570, 7919598, 7628524, 7342696, 7064108, 6793396, 6530614, 6277483, 6037867, 5815504, 5611938, 5426870, 5259686, 5110202]
59796E110202j31572j13345r5423p9027o4781n2142m0672l1075k3919j8243j2656
59785D447347p340l599j766p52N81K682N655R188J2247J3823J3853J2729J0366
59772D515014O547J583m405j2168k1852l1433l8138m1378m2800m3597m3233m0952
59760D203188l7249l3524l1409l2275l6012m0065m1047l7807l1784k4297j5107
59749C842612m317N992J3447J7868K0940K3955K7011L0102L3707L8107M2780M6749
59737D138953M9124M9336M7328M3791L9881L6282L2709K8617K4487K1915K2143
59726D534566K4796K8599L3111L9099M7183N6964O7799P9615R2553J06525J21696
59715E232506J38854J58481J79894K02053K24928K49302K75341L02027L27848
$$ y = [5110202, 4978630, 4865285, 4769862, 4690835, 4626054, 4573912, 4533240, 4502165, 4478246, 4460003, 4447347, 4440007, 4436408, 4434642, 4433890, 4434471, 4437153, 4442808, 4451996, 4464243, 4478066, 4491919, 4504648, 4515014, 4521561, 4523144, 4518739, 4506571, 4484719, 4453286, 4415148, 4373770, 4330970, 4287373, 4244140, 4203188, 4165939, 4132415, 4101006, 4068731, 4032719, 3992654, 3951607, 3913800, 3882016, 3857719, 3842612, 3838295, 3844287, 3857734, 3875602, 3896542, 3920497, 3947508, 3977610, 4011317, 4049424, 4092204, 4138953, 4188077, 4237413, 4284741, 4328532, 4368413, 4404695, 4437404, 4466021, 4490508, 4512423, 4534566, 4559362, 4587961, 4621072, 4660171, 4707354, 4764318, 4832117, 4911732, 5004285, 5110810, 5232506, 5371360, 5529841, 5709735, 5911788, 6136716, 6386018, 6661359, 6963386, 7291234]
59706G291234L51291L70417L82251L82572L66301L28721K67732J85972R1277n035
59696A0012733r1505j60202k08641k38442k52236k52233k41193k22999k01006
59687H144276j76589j50185j22916r6090o9714m2998j6167R417L3005N5138P6534
59676G643711R7318J17800J38968J61471J84665K07374K29539K52578K78005L05945
59666I617374L35249L65023L95704M28446M63888N01951N42432N84800O27611
59657A3862478O69229P09303P48382P85525Q17523Q41267Q55913Q61776Q58176
59648B1009572Q43945Q19748P88684P54672P21283O91817O68944O53413O43527
59639B7595605O36185O28257O16934N99283N72000N31983M77582M09505L30479
$$ y = [7291234, 7642525, 8012942, 8395193, 8777765, 9144066, 9472787, 9740519, 9926491, 10017768, 10012733, 9921228, 9761026, 9552385, 9313943, 9061707, 8809474, 8568281, 8345282, 8144276, 7967687, 7817502, 7694586, 7598496, 7528782, 7485784, 7469617, 7479034, 7512039, 7567177, 7643711, 7741029, 7858829, 7997797, 8159268, 8343933, 8551307, 8780846, 9033424, 9311429, 9617374, 9952623, 10317646, 10713350, 11141796, 11605684, 12107635, 12650067, 13234867, 13862478, 14531707, 15241010, 15989392, 16774917, 17592440, 18433707, 19289620, 20151396, 21009572, 21853517, 22673265, 23461949, 24216621, 24937904, 25629721, 26298665, 26952078, 27595605, 28231790, 28860047, 29476981, 30076264, 30648264, 31180247, 31657829, 32067334, 32397813]
59630C2397813K44242J55090O7770j3418q5610j46840j94758k27102k43299k44177
59620C1709711k29982k00627j58283j07350n0397J3914Q7173J67227K50055L34197
59610C1815638M20639N08774N94907O74603P44203P99688Q35929Q47631Q29857
59601C8071869P77733O87515N58593L93731J97903k1250k51836m79021o89312
59592C9245925q73198j024176j137640j212132j250310j257271j238144j197728
59584C0055326j141290j074566j003115r32246q67279q13411p75411p57168p60337
59575B1930503p82454q16387q52139q79934q92933q88679q68705q36576p95884
59566A4316812p49682p00700o51031o01607n52682n04824m59084m16438l77551
$$ y = [32397813, 32642055, 32797145, 32864915, 32851497, 32765887, 32619047, 32424289, 32197187, 31953888, 31709711, 31479729, 31279102, 31120819, 31013469, 30963072, 30976986, 31064159, 31231386, 31481441, 31815638, 32236277, 32745051, 33339958, 34014561, 34758764, 35558452, 36394381, 37242012, 38071869, 38849602, 39537117, 40095710, 40489441, 40687344, 40666094, 40414258, 39935237, 39245925, 38372727, 37348551, 36210911, 34998779, 33748469, 32491198, 31253054, 30055326, 28914036, 27839470, 26836355, 25904109, 25036830, 24223419, 23448008, 22690840, 21930503, 21148049, 20331662, 19479523, 18599589, 17706656, 16817977, 15949272, 15112696, 14316812, 13567130, 12866430, 12215399, 11613792, 11061110, 10556286, 10097202, 9680764, 9303213]
59557I303213l42755l11759k83742k58110k34644k12607j90823j69494j50834
59548G148445j36674j26204j17426j09923j04662j01833j00762j01434j04143
59539F145384j07816j10716j12710j14826j16519j15619j11541j06344j01756
59530E147537r7002r0704q3227p5796o8532o0768n2489m4327l6626k9384k2501
59519D486181j5600q154l13P042J3487J9485K5267L0172L3689L6461L9727M4173
59507D711617M9549N4831N8755O0997O2840O5786O9749P3822P8560Q5762R5702
59496E467970J06415J16378J26183J36739J47614J58395J70154J83980J99065
59487F812893K13778K27749K41631K55428K68383K79914K89472K95955K98523
$$ y = [9303213, 8960458, 8648699, 8364957, 8106847, 7872203, 7659596, 7468773, 7299279, 7148445, 7011771, 6885567, 6768141, 6658218, 6553556, 6451723, 6350961, 6249527, 6145384, 6037568, 5926852, 5814142, 5699316, 5582797, 5467178, 5355637, 5249293, 5147537, 5050535, 4959831, 4876604, 4800808, 4732276, 4671508, 4619019, 4574692, 4538066, 4508682, 4486181, 4470581, 4462427, 4462114, 4469156, 4482643, 4502128, 4527395, 4557567, 4591256, 4627717, 4667444, 4711617, 4761166, 4815997, 4874752, 4935749, 4998589, 5064375, 5134124, 5207946, 5286506, 5372268, 5467970, 5574385, 5690763, 5816946, 5953685, 6101299, 6259694, 6429848, 6613828, 6812893, 7026671, 7254420, 7496051, 7751479, 8019862, 8299776, 8589248, 8885203, 9183726]
59478I183726K97592K93858K86743K74965K58464K38544K16038J90418J61002
59469A1401350J28452R4699O1752L0656J570k5135m8067o5690p7815q5254q7961
59458A1328557q4734p5140o0432m1590j7792J1772M5405P9758J12779J44270J73454
59447A1616307J97345K12007K14669K04480J81837J47478J01995M6335j7114q4355
59437A2820984j51252k14961k73599l24981l66558l96392m13701m18714m12834
59428I847992l98623l78727l54588l26767k96444k65724k36226k08135j81002
59419G201756j54732j29237j03678p7110m9969k4058n87K1228M2944O4751Q5572
59408F876880J05328J25678J47648J69473J88052K01889K11389K16663K16685
$$ y = [9183726, 9481318, 9775176, 10061919, 10336884, 10595348, 10833892, 11049930, 11240348, 11401350, 11529802, 11624501, 11686253, 11716909, 11718479, 11693344, 11645277, 11579587, 11501772, 11416518, 11328557, 11243823, 11168683, 11108251, 11066661, 11048869, 11060641, 11106046, 11185804, 11298583, 11442853, 11616307, 11813652, 12025659, 12240328, 12444808, 12626645, 12774123, 12876118, 12922453, 12905339, 12820984, 12669732, 12454771, 12181172, 11856191, 11489633, 11093241, 10679540, 10260826, 9847992, 9449369, 9070642, 8716054, 8389287, 8092843, 7827119, 7590893, 7382758, 7201756, 7047024, 6917787, 6814109, 6736999, 6687030, 6662972, 6662385, 6683613, 6726557, 6791308, 6876880, 6982208, 7107886, 7255534, 7425007, 7613059, 7814948, 8026337, 8243000, 8459685]
59399H459685K10729J98933J80896J55171J21209Q0743L6324j0696n9647j08723
59389I264624j54971j95903k30310k57695k77899k91370k98943l01221k98609
59380F957703k91971k82690k71831k59527k45372k29361k12410j95957j80856
59371D787728j66727j52632j38420j24915j12702j01247q9751p8482o8596o0581
59361C693675n3410m5532l6599k7887k0842j5364r858l048M778J2512J9676K6564
59349C544665L3232L9027M2995M4218M2105L7090L1162K7021K6457K9501L4938
59338C932411M1316M7987N5653O5324P5974Q3931Q5958Q2867P9139P9051Q3930
59327D713541R2770J03896J15803J27793J40569J55533J73036J91836K10351K28006
$$ y = [8459685, 8670414, 8869347, 9050243, 9205414, 9326623, 9407366, 9443690, 9432994, 9373347, 9264624, 9109653, 8913750, 8683440, 8425745, 8147846, 7856476, 7557533, 7256312, 6957703, 6665732, 6383042, 6111211, 5851684, 5606312, 5376951, 5164541, 4968584, 4787728, 4621001, 4468369, 4329949, 4205034, 4092332, 3991085, 3901334, 3822852, 3754256, 3693675, 3640265, 3594733, 3558134, 3530247, 3509405, 3494041, 3484183, 3481135, 3485913, 3498425, 3518101, 3544665, 3577897, 3616924, 3659919, 3704137, 3746242, 3783332, 3814494, 3841515, 3867972, 3897473, 3932411, 3973727, 4021714, 4077367, 4142691, 4218665, 4302596, 4388554, 4471421, 4550560, 4629611, 4713541, 4806311, 4910207, 5026010, 5153803, 5294372, 5449905, 5622941, 5814777, 6025128, 6253134]
59317F253134K45408K63998K85349L09861L36349L63675L92476M24264M59170
59308I333684M95824N32904N69118O01957O28441O47223O58048O59184O47787
59299A4774170O23715N90824N53454N13346M70978M27806L85564L44816L05703
59290A8990376K68680K32981J95565J53268J05123N1310q966p6730j51031k29093
59280A9531483l08186l85935m59253n24353n77835o17303o41799o52611o52723
59271A4711485o44220o26992o00950n68481n33204m97179m60792m24623l89600
59262I965444l55814l22865k91176k61426k33073k05068j77842j52988j30982
59253G834210j10893r2418p6556o3888n3644m5139l8891l5610l4931l5762l7326
$$ y = [6253134, 6498542, 6762540, 7047889, 7357750, 7694099, 8057774, 8450250, 8874514, 9333684, 9829508, 10362412, 10931530, 11533487, 12161928, 12809151, 13467199, 14126383, 14774170, 15397885, 15988709, 16542163, 17055509, 17526487, 17954293, 18339857, 18684673, 18990376, 19259056, 19492037, 19687602, 19840870, 19945993, 19997303, 19988337, 19911607, 19760576, 19531483, 19223297, 18837362, 18378109, 17853756, 17275921, 16658618, 16016819, 15364208, 14711485, 14067265, 13440273, 12839323, 12270842, 11737638, 11240459, 10779667, 10355044, 9965444, 9609630, 9286765, 8995589, 8734163, 8501090, 8296022, 8118180, 7965192, 7834210, 7723317, 7630899, 7554343, 7490455, 7436811, 7391672, 7352781, 7317171, 7282240, 7246478, 7209152]
59242G209152l9365m1887m5055m8923n3076n6901o0233o3284o5920o7426o7010
59231F600072o4137n8497n0315m0700l1203k2726j4886o310M419J7741L2755M8228
59219F414441O3968Q0538R7485J12928J25624J36564J47694J59609J71267J81208
59209G691326J88089J90639J88143J80495J66899J45338J14895P8306M0789O170
59199H991089k4797n2571p6937r7471j14575j29089j41394j51464j59368j65253
59189G878170j69110j70997j71318j70594j68884j65620j60135j52525j43896
59180F405091j35423j27234j18552j08928r8813q8719p8494o7664n6027m3579
59170E481658l0344j6616k867J0904K5248M0495N6492P3306R1583J11771J33515
$$ y = [7209152, 7169787, 7127900, 7082845, 7033922, 6980846, 6923945, 6863712, 6800428, 6734508, 6667082, 6600072, 6535935, 6477438, 6427123, 6386423, 6355220, 6332494, 6317608, 6311298, 6315717, 6333458, 6366213, 6414441, 6478409, 6558947, 6656432, 6769360, 6894984, 7031548, 7179242, 7338851, 7510118, 7691326, 7879415, 8070054, 8258197, 8438692, 8605591, 8750929, 8865824, 8944130, 8984919, 8991089, 8966292, 8913721, 8836784, 8739313, 8624738, 8495649, 8354255, 8202791, 8043423, 7878170, 7709060, 7538063, 7366745, 7196151, 7027267, 6861647, 6701512, 6548987, 6405091, 6269668, 6142434, 6023882, 5914954, 5816141, 5727422, 5648928, 5581264, 5525237, 5481658, 5451314, 5434698, 5431831, 5442735, 5467983, 5508478, 5564970, 5638276, 5729859, 5841630, 5975145]
59159E975145J56179J79534K03848K29733K57779K87475L16730L43438L67323
59150H317184L88727M05613M13647M09733L93639L65527L24087K68613K01294
59141A1488064J25782M4782l9235j22188j99327k67481l24921l69751m00328m16997
59131I518400m21890m17001m03703l83796l59667l33332l06138k79237k53584
59122F360052k29648k07659j87725j69405j52073j36195j23026j12276j01430
59113D940615q8576p4736o2120n1313m1579l2756k5023j7649r662j323O470J3553
59101D555901K0029K5390K9531L3673L8662M3293M5952M7049M7950M8481M7435
59090D983346M4838M1599L7552L1821K4625J6846Q415q58r568j5985k0519k4714
$$ y = [5975145, 6131324, 6310858, 6514706, 6744439, 7002218, 7289693, 7606423, 7949861, 8317184, 8705911, 9111524, 9525171, 9934904, 10328543, 10694070, 11018157, 11286770, 11488064, 11613846, 11658628, 11619393, 11497205, 11297878, 11030397, 10705476, 10335725, 9935397, 9518400, 9096510, 8679509, 8275806, 7892010, 7532343, 7199011, 6892873, 6613636, 6360052, 6130404, 5922745, 5735020, 5565615, 5413542, 5277347, 5154321, 5042045, 4940615, 4852039, 4777303, 4715183, 4663870, 4622291, 4589535, 4564512, 4546863, 4537201, 4535878, 4542348, 4555901, 4575930, 4601320, 4630851, 4664524, 4703186, 4746479, 4792431, 4839480, 4887430, 4935911, 4983346, 5028184, 5069783, 5107335, 5139156, 5163781, 5180627, 5189042, 5188184, 5178616, 5162631, 5142112, 5117398]
59078E117398k8311k9720k9058k8209k7951k7310k5735k3531k0282j5152q816
59067D853323k662L795J2219K2113L0955L7976M5037N3235O1458O9013P6929Q5571
59055E348962R3593J00504J07770J16101J24021J30604J37334J45496J53713J59964
59045F618062J64333J67927J70592J71593J71250J70149J67870J64085J59900
59036H125761J56272J51909J44317J32293J15920R4771O7795L4812l100m4576
59026H976174q8349j32779j75737k14977k48411k74628k93555l06065l12563l12669
59016F616441l06642k96330k84094k71310k58202k44477k29854k14595j99675
59007D311262j85827j72609j59305j46437j35031j24687j14062j03341r4359q7844
$$ y = [5117398, 5089087, 5059367, 5030309, 5002100, 4974149, 4946839, 4921104, 4897573, 4877291, 4862139, 4853323, 4850661, 4854456, 4866675, 4888788, 4919743, 4957719, 5002756, 5055991, 5117449, 5186462, 5263391, 5348962, 5442555, 5543059, 5650829, 5766930, 5890951, 6021555, 6158889, 6304385, 6458098, 6618062, 6782395, 6950322, 7120914, 7292507, 7463757, 7633906, 7801776, 7965861, 8125761, 8282033, 8433942, 8578259, 8710552, 8826472, 8921243, 8989038, 9023850, 9020750, 8976174, 8887825, 8755046, 8579309, 8364332, 8115921, 7841293, 7547738, 7241673, 6929110, 6616441, 6309799, 6013469, 5729375, 5458065, 5199863, 4955386, 4725532, 4510937, 4311262, 4125435, 3952826, 3793521, 3647084, 3512053, 3387366, 3273304, 3169963, 3075604, 2987760]
58997B987760q2411p6872p1648o6958o1518n4427m6922m0955l7135l5033l4274
58986B379607l3986l2490k9024k4971k2113k0460j8940j7309j5930j4365j1606
58975B138413p575l239O95M370Q173J2099J5450J6977J5879J3020J0459R212Q255
58962B242188O256L581J878K187M023N968O837O791P241R095J1296J2206J2240
58949B331787J3451J6216J8133J7138J4175J1530R723P328L191k418q397j3659
58937B418198j7726k1025k4254k7183k8802k8719k7465k5286k1977j8255j5736
58926B161770j4718j3409j0364o444l236p96J848M855P633R994J2093J3745J4830
58913B177801J5791J6937J7944J8913K0970K4601K8322L0367L1205L2784L5568
$$ y = [2987760, 2905349, 2828477, 2756829, 2689871, 2628353, 2573926, 2527004, 2486049, 2448914, 2413881, 2379607, 2345621, 2313131, 2284107, 2259136, 2237023, 2216563, 2197623, 2180314, 2164384, 2150019, 2138413, 2130838, 2127599, 2128294, 2132664, 2140837, 2152936, 2168386, 2185363, 2201242, 2214262, 2224721, 2233933, 2242188, 2248444, 2252025, 2253903, 2256090, 2260113, 2266081, 2272918, 2279709, 2286950, 2296045, 2307341, 2319547, 2331787, 2345238, 2361454, 2379587, 2396725, 2410900, 2422430, 2432153, 2439481, 2442672, 2440254, 2431857, 2418198, 2400472, 2379447, 2355193, 2328010, 2299208, 2270489, 2243024, 2217738, 2195761, 2177506, 2161770, 2147052, 2133643, 2123279, 2116835, 2113599, 2112803, 2114651, 2119506, 2127139, 2137133, 2149226, 2162971, 2177801, 2193592, 2210529, 2228473, 2247386, 2268356, 2292957, 2321279, 2351646, 2382851, 2415635, 2451203]
58902B451203L7840L8139L7112L6409L6604L6903L6447L5341L4457L4697L6596
58891B851748M0287M5286N0405N4509N7712O1213O5540O9683P2584P4690P7126
58880C520783Q0128Q3295Q6748R0852R5435J00557J07167J15528J23806J30179
58870D534478J35751J43205J53040J63412J73462J84244J96174K08186K19962
58861F111914K32574K46271K59893K73287K88055L05060L23360L42558L64010
58852H746982L88600M15328M43296M73125N05225N38393N71345O03858O35369
58843A3321521O64055O88256P07005P18245P18459P05068O77305O33973N72851
58834A9406738M93506L98313K89500J67974L7046r5406k21053l35812m38479n26896
$$ y = [2451203, 2489043, 2527182, 2564294, 2600703, 2637307, 2674210, 2710657, 2745998, 2780455, 2815152, 2851748, 2892035, 2937321, 2987726, 3042235, 3099947, 3161160, 3226700, 3296383, 3368967, 3443657, 3520783, 3600911, 3684206, 3770954, 3861806, 3957241, 4057798, 4164965, 4280493, 4404299, 4534478, 4670229, 4813434, 4966474, 5129886, 5303348, 5487592, 5683766, 5891952, 6111914, 6344488, 6590759, 6850652, 7123939, 7411994, 7717054, 8040414, 8382972, 8746982, 9135582, 9550910, 9994206, 10467331, 10972556, 11510949, 12082294, 12686152, 13321521, 13985576, 14673832, 15380837, 16099082, 16817541, 17522609, 18199914, 18833887, 19406738, 19900244, 20298557, 20588057, 20756031, 20793077, 20697671, 20476618, 20140806, 19702327, 19175431]
58824A9175431n98120o51018o86424p05702p11019p05635o92061o70960o43375
58815A3111117o12243n80095n47020n12854m79479m48743m19981l91876l65232
58806H753594l41406l19626k98435k78372k60497k43726k26533k10069j96552
58797F378378j85368j73845j61342j49643j39613j30231j20684j10982j00707
58788E105963q9516p8627o9467o1165n1752m1392l1942k3623j4816n026M563J3585
58776D656785K2971L2700M1615M9879N9186O9831P9916Q8339R6542J06258J17153
58765E421175J27850J37997J48313J59504J71802J84994J98522K12117K26350
58756F988624K41861K58277K74845K92011L11339L33707L58423L84275M10912
$$ y = [19175431, 18577311, 17926293, 17239869, 16534167, 15823148, 15117513, 14425452, 13754492, 13111117, 12498874, 11918779, 11371759, 10858905, 10379426, 9930683, 9510702, 9118826, 8753594, 8412188, 8092562, 7794127, 7515755, 7255258, 7011532, 6784999, 6574930, 6378378, 6193010, 6019165, 5857823, 5708180, 5568567, 5438336, 5317652, 5206670, 5105963, 5016447, 4937820, 4868353, 4807188, 4755436, 4714044, 4682102, 4658479, 4643663, 4638637, 4643200, 4656785, 4679756, 4712456, 4754071, 4803950, 4863136, 4932967, 5012883, 5101222, 5197764, 5304022, 5421175, 5549025, 5687022, 5835335, 5994839, 6166641, 6351635, 6550157, 6762274, 6988624, 7230485, 7488762, 7763607, 8055618, 8366957, 8700664, 9059087, 9443362, 9854274]
58747I854274M39155M70046N03277N36667N68067N97652O26681O53755O74346
58738A4923920O84884O85115O75025O51699O11322N52570M76008L82013K72030
58729A9914586J50664K3888j03964k29187l46091m48527n33781o02491o55148
58720A7169949o91171p11182p17648p13090o99532o79529o55635o28835n99202
58711A1074125n67865n36705n06528m77192m48912m21675l94264l65959l38563
58702G016462l14525k93711k74167k55399k38479k23405k08907j94670j81413
58693D831786j68904j56098j43144j31160j20249j09720r9821r1096q2550p2774
58683C656270o2455n3342m5239l6598k7779k0960j6919j4558j3593j5062j8938
$$ y = [9854274, 10293429, 10763475, 11266752, 11803419, 12371486, 12969138, 13595819, 14249574, 14923920, 15608804, 16293919, 16968944, 17620643, 18231965, 18784535, 19260543, 19642556, 19914586, 20065250, 20089138, 19985174, 19755987, 19409896, 18961369, 18427588, 17825097, 17169949, 16478778, 15767596, 15049948, 14336858, 13637326, 12957797, 12302162, 11673327, 11074125, 10506260, 9969555, 9463027, 8985835, 8536923, 8115248, 7720984, 7355025, 7016462, 6701937, 6408226, 6134059, 5878660, 5640181, 5416776, 5207869, 5013199, 4831786, 4662882, 4506784, 4363640, 4232480, 4112231, 4002511, 3902690, 3811594, 3729044, 3656270, 3593815, 3540473, 3495234, 3458636, 3430857, 3409897, 3392978, 3378420, 3364827, 3349765, 3330827]
58672C330827k3919k9713l6920m4261m8615m8692m6616m5239m5633m7506n0044
58661B863669n1988n2720n3498n6030n9837o2790o4002o4256o3968o2875o1516
58650B210189o0730n9867n7627n4421n1677m9193m5607m1120l7217l3898k9883
58639A688949k5394k2015j9950j8050j6371j5907j5984j5119j4336j6262k0546
58628A489015k3653k3951k3745k5153k6977k6961k4690k1066j7003j3485j1020
58617A251311q539m795q15J423K580N301R943J4107J6725J9213K1930K2902K1286
58604A372572J9014J7645J6285J3785J0394O215O94n264r278j0794j1932j4085
58592A405251j6138j6959j7015j6563j4801j2007r895q821p036l673k2L011O048
$$ y = [3330827, 3306908, 3277195, 3240275, 3196014, 3147399, 3098707, 3052091, 3006852, 2961219, 2913713, 2863669, 2811681, 2758961, 2705463, 2649433, 2589596, 2526806, 2462804, 2398548, 2334580, 2271705, 2210189, 2149459, 2089592, 2031965, 1977544, 1925867, 1876674, 1831067, 1789947, 1752730, 1718832, 1688949, 1663555, 1641540, 1621590, 1603540, 1587169, 1571262, 1555278, 1540159, 1525823, 1509561, 1489015, 1465362, 1441411, 1417666, 1392513, 1365536, 1338575, 1313885, 1292819, 1275816, 1262331, 1251311, 1242772, 1237977, 1237162, 1238585, 1241165, 1246466, 1256409, 1270516, 1287241, 1306454, 1328384, 1351286, 1372572, 1391586, 1409231, 1425516, 1439301, 1449695, 1455910, 1456604, 1451340, 1442062, 1431268, 1419336, 1405251, 1389113, 1372154, 1355139, 1338576, 1323775, 1311768, 1301873, 1293052, 1286016, 1282343, 1282321, 1285332, 1291380]
58579A291380R078J0943J1897J3826J6929J9186K0163K2199K6405L0554L2663
58568A505223L3851L5838L8311M0555M3340M7285N1484N5326N9702O5152P0792
58557B046859P6182Q2111Q8674R4817J00555J07302J15362J23689J32535J43325
58547C111411J55392J66124J75120J84488J94243K01247K03987K04152K01780
58538D797944J92993J75033J49825J20093Q5444M5135J602m1361q1294j15875
58528E329539j42264j60061j72037j79840j82111j78826j73671j69281j63685
58519C807763j54511j43334j32595j21431j08232r4511q2562p1718o0341m9351
58509B789177m0425l2875k5352j8435j2580o025K153R502J3865J6831J9888J9994
$$ y = [1291380, 1300458, 1311401, 1323298, 1337124, 1354053, 1373239, 1393402, 1415601, 1442006, 1472560, 1505223, 1539074, 1574912, 1613223, 1653778, 1697118, 1744403, 1795887, 1851213, 1910915, 1976067, 2046859, 2123041, 2205152, 2293826, 2388643, 2489198, 2596500, 2711862, 2835551, 2968086, 3111411, 3266803, 3432927, 3608047, 3792535, 3986778, 4188025, 4392012, 4596164, 4797944, 4990937, 5165970, 5315795, 5435888, 5521332, 5566467, 5568069, 5526708, 5445414, 5329539, 5187275, 5027214, 4855177, 4675337, 4493226, 4314400, 4140729, 3971448, 3807763, 3653252, 3509918, 3377323, 3255892, 3147660, 3053149, 2970587, 2898869, 2838528, 2789177, 2748752, 2715877, 2690525, 2672090, 2659510, 2653485, 2655638, 2665140, 2679005, 2695836, 2715724, 2735718]
58497B735718J3314J260j1521k3536l6475n0138o1736o9837p5393p9019q0303
58486B262334p9426p7019p3127o8360o4571o2172n8606n2199m5551m2002m0688
58475A598613l8537l5460l3727l3300l1770k8535k5457k3581k2174k0937k0414
58464A284721k0289j9533j8135j6790j5387j3570j1995j1372j1167j0758j0501
58453A125224j0269q654n372k549j663j230L44J857J699J105K161M334N759O486
58439A119232P796R571J0746J1216J1434J1598J2772J6647K2531K7079K8829L0104
58427A319555L2431L3603L1976K9949K9756K9150K5220J9278J3891P943p55j0506
58415A561491j8023k3598k9430l4826l7576l8408l9504m0197l8606l5906l4448
$$ y = [2735718, 2749032, 2750292, 2738771, 2715235, 2678760, 2628622, 2566886, 2497049, 2421656, 2342637, 2262334, 2182908, 2105889, 2032762, 1964402, 1899831, 1837659, 1779053, 1726854, 1681303, 1639301, 1598613, 1560076, 1524616, 1490889, 1457589, 1425819, 1397284, 1371827, 1348246, 1326072, 1305135, 1284721, 1264432, 1244899, 1226764, 1209974, 1194587, 1181017, 1169022, 1157650, 1146483, 1135725, 1125224, 1114955, 1106301, 1100929, 1098380, 1096717, 1095487, 1095831, 1097688, 1099387, 1100492, 1102653, 1106987, 1112746, 1119232, 1127028, 1136599, 1147345, 1158561, 1169995, 1181593, 1194365, 1211012, 1233543, 1260622, 1289451, 1319555, 1351986, 1385589, 1417565, 1447514, 1477270, 1506420, 1531640, 1550918, 1564809, 1572752, 1571997, 1561491, 1543468, 1519870, 1490440, 1455614, 1418038, 1379630, 1340126, 1299929, 1261323, 1225417, 1190969]
58404A190969l3179k9746k5684k4417k5087k3586j9290j5772j4779j4153j2184
58393I53092r939q548p572o521n345l467p43J305J543J407K463L560L192K841
58379I27268M565P139Q220Q443R637J0793R891Q159Q261R671R898Q867Q073O917
58365A045802M171J546J503K886K932K039K250K672R68k019l692m206m992m796
58351A047064k038O95l2k336j659J863M361N217O998R374R389P470P159Q727Q735
58336A110987O127L434J811Q3j336p62N97q7j982j758K97O09j380k623k204k374
58320A109439l814m766m882n065m143o53K876K886J041J735M475N135L990N338
58306A113592R284J1190R783Q845R859R944Q419Q717J2072J5289J6509J7546J9135
$$ y = [1190969, 1157790, 1128044, 1102360, 1077943, 1052856, 1029270, 1009980, 994208, 979429, 965276, 953092, 943153, 934605, 927033, 920512, 915167, 911700, 910957, 912262, 913805, 915212, 917675, 921235, 924427, 927268, 931833, 938972, 947192, 955635, 965272, 976065, 985956, 994115, 1002376, 1012047, 1021945, 1030812, 1038885, 1045802, 1049973, 1051519, 1053022, 1055908, 1058840, 1060879, 1063129, 1065801, 1066769, 1064750, 1061058, 1056852, 1051860, 1047064, 1045026, 1045721, 1045689, 1043353, 1041694, 1043557, 1047918, 1053135, 1060133, 1069507, 1078896, 1086366, 1093525, 1102252, 1110987, 1117114, 1120548, 1122359, 1122442, 1121106, 1120344, 1120941, 1120854, 1118872, 1117114, 1117411, 1118020, 1116640, 1114017, 1111813, 1109439, 1105625, 1100859, 1095977, 1090912, 1086769, 1086116, 1088992, 1091878, 1092919, 1094654, 1099129, 1104264, 1108254, 1113592, 1122876, 1134066, 1143849, 1152694, 1162553, 1172497, 1180916, 1189633, 1201705, 1216994, 1233503, 1251049, 1270184]
58293A270184J9424J8424J8581J9847J9517J7639J7083J7887J7286J5726J6497
58282A468095J8826J7980J3213R225Q464Q321P193P020Q274Q582P748Q399J0505
58269A601845J1067J0114J0946J3672J4823J4067J4893J7884J9834K0177K1561
58258A770883K3554K3029K1240K2949K7676K9755K8219K8401L2186L4940L4159
58247B076991L3152L3829L3653L2131L2670L5679L7234L6616L7629M0708M1636
58236B471928M0034M0774M4765M6777M4958M4189M7236N0712N2460N4914N8711
58225B997458O0972O2084O5963P1921P4893P5244P8967Q6685R2599R6090J03350
58214C866226J15033J23786J27304J32380J42005J49991J52718J54802J58270
$$ y = [1270184, 1289608, 1308032, 1326613, 1346460, 1365977, 1383616, 1400699, 1418586, 1435872, 1451598, 1468095, 1486921, 1504901, 1518114, 1527339, 1535803, 1544124, 1551317, 1558337, 1566611, 1575193, 1582941, 1591340, 1601845, 1612912, 1623026, 1633972, 1647644, 1662467, 1676534, 1691427, 1709311, 1729145, 1749322, 1770883, 1794437, 1817466, 1838706, 1861655, 1889331, 1919086, 1947305, 1975706, 2007892, 2042832, 2076991, 2110143, 2143972, 2177625, 2209756, 2242426, 2278105, 2315339, 2351955, 2389584, 2430292, 2471928, 2511962, 2552736, 2597501, 2644278, 2689236, 2733425, 2780661, 2831373, 2883833, 2938747, 2997458, 3058430, 3120514, 3186477, 3258398, 3333291, 3408535, 3487502, 3574187, 3666786, 3762876, 3866226, 3981259, 4105045, 4232349, 4364729, 4506734, 4656725, 4809443, 4964245, 5122515]
58205E122515J57477J50142J42602J38793J34706J28891J27505J33439J41161
58196F377231J47614J57564J73056J88695K02287K18849K39244K56688K69502
58187H230730K84988L05782L25115L40680L59626L84587M08728M30165M56479
58178A1526880M89228N19527N45394N77274O19533O63147P03804P49480Q02311
58169A7196578Q51713Q94428R42377J000905J058848J110562J167523J236891
58161B5459825J309246J379386J457751J549038J641820J732367J835108J956165
58153C8320706K081903K208306K354484K531163K724794K930276L168117L450138
58145E9769887L762426M104692M511045N008820N596957O290885P142011Q179526
$$ y = [5122515, 5279992, 5430134, 5572736, 5711529, 5846235, 5975126, 6102631, 6236070, 6377231, 6524845, 6682409, 6855465, 7044160, 7246447, 7465296, 7704540, 7961228, 8230730, 8515718, 8821500, 9146615, 9487295, 9846921, 10231508, 10640236, 11070401, 11526880, 12016108, 12535635, 13081029, 13658303, 14277836, 14940983, 15644787, 16394267, 17196578, 18048291, 18942719, 19885096, 20886001, 21944849, 23055411, 24222934, 25459825, 26769071, 28148457, 29606208, 31155246, 32797066, 34529433, 36364541, 38320706, 40402609, 42610915, 44965399, 47496562, 50221356, 53151632, 56319749, 59769887, 63532313, 67637005, 72148050, 77156870, 82753827, 89044712, 96186723, 104366249]
58137A04366249R381839J0742701J2310277J4117578J6139755J8378513K0926593
58130B06363505K3898075K7371997L1387591L5655238L8916519L8781875L2923951
58123D35298751K1025265N589151r409451k0848330k7725984l0731772l1134357
58116C42063273l0076282k8388630k6557238k4733233k2871329k0914679j8868501
58109A69653381j6776552j4707886j2756365j1000936r460900q110374o924094
58102H9916274n885514m964795m122518l338546k615641j948432j304397o43043
58094F5093388O2572Q37765J708063K613686L282073L260065K217959K97827j884528
58085G7488870l649747m680075n068398n060314m843345m533243m214948l925340
$$ y = [104366249, 113748088, 124490789, 136801066, 150918644, 167058399, 185436912, 206363505, 230261580, 257633577, 289021168, 324676406, 363592925, 402374800, 435298751, 456324016, 461913167, 452503716, 431655386, 403929402, 373197630, 342063273, 311986991, 283598361, 257041123, 232307890, 209436561, 188521882, 169653381, 152876829, 138168943, 125412578, 114411642, 104950742, 96840368, 89916274, 84030760, 79065965, 74943447, 71604901, 68989260, 67040828, 65736431, 65093388, 65155960, 65993725, 67701788, 70315474, 73597547, 76857612, 79075571, 79373398, 77488870, 73839123, 69159048, 64090650, 59030336, 54186991, 49653748, 45438800, 41513460]
58077D1513460l643604l342819l030163k723005k421907k129622j867264j648925
58069B0706151j462509j293840j148529j033726r39000q52453p78158p22128o77149
58060A1798659o35365o00470n74398n47018n11653m76827m50777m27982m01909
58051G172260l77141l57450l35528l06336k78324k59974k46656k31308k16667
58042D562876k06487j95877j80776j66610j57640j48049j33043j18406j09537
58033C146451j01421q9113p7929p3386p0829o5144o1148o4177o9345p0527p1496
58022B331936p7767q5263q7371q6048q5912q4288p7153o8590o4463o2323n6785
58011A495973m9454m4635m0585l3889k7640k6595k8580k8563k7035k6872k6306
$$ y = [41513460, 37869856, 34527037, 31496874, 28773869, 26351962, 24222340, 22355076, 20706151, 19243642, 17949802, 16801273, 15767547, 14828547, 13976094, 13197936, 12475808, 11798659, 11163294, 10562824, 9988426, 9441408, 8929755, 8452928, 8002151, 7574169, 7172260, 6795119, 6437669, 6102141, 5795805, 5517481, 5257507, 5010851, 4779543, 4562876, 4356389, 4160512, 3979736, 3813126, 3655486, 3507437, 3374394, 3255988, 3146451, 3045030, 2955917, 2877988, 2804602, 2733773, 2668629, 2607481, 2543304, 2473959, 2403432, 2331936, 2254169, 2168906, 2081535, 1995487, 1909575, 1825287, 1748134, 1679544, 1615081, 1552758, 1495973, 1446519, 1401884, 1361299, 1327410, 1299770, 1273175, 1244595, 1216032, 1188997, 1162125, 1135819]
58000A135819k2385j7404j5131j4573j3535j3841j7043j9727j8951j7556j8394
57989I47279j8596j5454j2457j3311j5290j4655j3270j3685j3326r923p145q159
57977G92008r164o066k089j699k499n49J445r07n215o553n923o947q120o010k461
57962G29251j267j113J091L509L107K401N157Q803Q556O014O187Q782R755Q986
57948G99219R258R994Q903P637R140J1672J1897J1373J3408J6197J6007J4531
57936I39236J5881J8497J7469J3179J0270R386P005K424j937o125j1832j6934
57924I96519j7662j5606j6075j9734k2196k1597k0509k0153j8608j5169j1502
57913G97708q319n292l723m772n974m102m52J509K265M892Q896J0971J0978J1716
$$ y = [1135819, 1113434, 1096030, 1080899, 1066326, 1052791, 1038950, 1021907, 1002180, 983229, 965673, 947279, 928683, 913229, 900772, 887461, 872171, 857516, 844246, 830561, 817235, 807312, 800167, 792008, 782844, 776778, 774689, 772990, 770491, 769942, 771387, 770480, 765265, 758712, 752789, 745842, 737722, 731712, 729251, 727984, 726871, 727962, 731471, 734578, 736979, 742136, 750939, 759495, 765509, 771696, 780478, 790233, 799219, 808477, 818471, 827374, 835011, 844151, 855823, 867720, 879093, 892501, 908698, 924705, 939236, 955117, 973614, 991083, 1004262, 1014532, 1023918, 1030923, 1033347, 1031410, 1025285, 1013453, 996519, 978857, 963251, 947176, 927442, 905246, 883649, 863140, 842987, 824379, 809210, 797708, 789389, 784097, 780374, 775602, 769628, 765526, 765074, 766583, 768848, 773740, 782636, 793607, 804585, 816301]
57899H16301J3483J4131J3666J3410J1496N012l845r509j0930j2287j5792j9145
57887H15991k0436k0449j9579j7171j4332j3042j2277r241m278l61J924M438P082
57874F98269Q078Q266J0178J2993J3253J0631Q163O770M377O00k743o010j1506
57861G61319j8302k2319k2500k2243k3653k4987k4886k4662k4880k3916k1292
57850E07679j8904j7563j5746j2814j0137q184n791l099j863k111j807l72O49
57837D09937R70K140M170N053M371M090N032N671N164M580M494M141L355K680
57823D65848J544q44l091l253k440l380n795p005o785p457r132r274p419o018
57809C95499n879m988k840j701k353k510q93P53J078J217K111L085M200O674R794
$$ y = [816301, 829784, 843915, 857581, 870991, 882487, 887499, 883654, 874145, 863215, 850928, 835136, 815991, 795555, 775106, 755527, 738356, 724024, 710982, 698705, 689464, 685186, 684825, 686749, 691187, 698269, 706347, 714613, 724791, 737784, 751037, 761668, 769831, 776601, 780978, 781578, 778835, 772825, 761319, 743017, 720698, 698198, 675955, 652302, 627315, 602429, 577767, 552887, 528971, 507679, 488775, 471212, 455466, 442652, 432515, 424331, 418540, 415441, 413578, 411467, 409660, 409288, 409937, 410907, 413047, 417217, 422270, 426641, 430731, 435763, 441434, 446598, 451178, 455672, 459813, 463168, 465848, 467392, 466548, 463457, 460204, 457764, 454384, 448589, 441584, 434799, 427342, 418210, 408936, 401517, 395499, 389620, 384632, 381792, 380091, 377738, 375228, 374335, 375088, 376166, 377383, 379494, 382579, 386779, 393453, 403247]
57794D03247J0730Q765O465N472M411K321P99J024J652J339O62Q8j304l607n144
57779D36920n098m734m875m568l253j884r80m7M48p64k917l438j990j258k643
57764C98919m181m046l254l348l978m428n192o607p853q478q926q952p659n792
57750C16225n565p405r332j0072j0307j0238q825o214m099k825r04J764L271L246
57736B48720L897O290Q544R162R257R996J0520J0043R436R347R141Q975J0429
57723C63757J3583J5963J5789J4055J2243J0398Q537P391O417L643j282o191r558
57710D54745j2045j3991j4413j3716j4317j6951j9244j9461j8873j8706j7666
57699B75362j4543j0749q266p192o840o928o344l395J269M576N322N579O612O789
$$ y = [403247, 413977, 422742, 429207, 434679, 439090, 441411, 442210, 443234, 444886, 446225, 446887, 446975, 445671, 442064, 436920, 431822, 427088, 422213, 417645, 414392, 412508, 411528, 411481, 411929, 411165, 408248, 404810, 402820, 401562, 398919, 394738, 390692, 387438, 384090, 380112, 375684, 370492, 363885, 356032, 347554, 338628, 329676, 322017, 316225, 310660, 303255, 293923, 283851, 273544, 263306, 254481, 248267, 244168, 241343, 240439, 242203, 245474, 248720, 252617, 258907, 267451, 276613, 285870, 295866, 306386, 316429, 325865, 335212, 344353, 353328, 363757, 377340, 393303, 409092, 423147, 435390, 445788, 454325, 461716, 468133, 471776, 470494, 464303, 454745, 442700, 428709, 414296, 400580, 386263, 369312, 350068, 330607, 311734, 293028, 275362, 260819, 250070, 241804, 234612, 227772, 220844, 214500, 211105, 212374, 216950, 222272, 227851, 234463, 241252]
57685B41252N476N280P831J0538J0563R126Q820R230Q512P041O245N589L962K463
57671C41928K851M416N106M681M309M254M148M323M876M828M093M540P121R815
57657D11289J0579J0451J1331J2709J3150J3162J3862J4535J4343J4695J6871
57646E56977J8848J7955J5541J5521J8779K2309K3748K3891K4628K6824L0311
57635G95332L3986L6045L5938L5631L7197L9829M1218M1214M1763M3782M6348
57624A228283M8885N2085N6557O2193O8918P6745Q5380R4821J05783J18446J31690
57613B129786J44760J58531J73774J89484K04473K19119K33573K45580K52220
57604C951300K52325K44305K22810J81338J19255M4461l1196r7724j49334j84402
$$ y = [241252, 246728, 252008, 259839, 270377, 280940, 290066, 298886, 308116, 316628, 323669, 329914, 335503, 339465, 341928, 344779, 349195, 354301, 358982, 363291, 367545, 371693, 376016, 380892, 385720, 389813, 394353, 401474, 411289, 421868, 432319, 443650, 456359, 469509, 482671, 496533, 511068, 525411, 540106, 556977, 575825, 593780, 609321, 624842, 643621, 665930, 689678, 713569, 738197, 765021, 795332, 829318, 865363, 901301, 936932, 974129, 1013958, 1055176, 1096390, 1138153, 1181935, 1228283, 1277168, 1329253, 1385810, 1448003, 1516921, 1593666, 1679046, 1773867, 1879650, 1998096, 2129786, 2274546, 2433077, 2606851, 2796335, 3000808, 3219927, 3453500, 3699080, 3951300, 4203625, 4447930, 4670740, 4852078, 4971333, 5015794, 4984598, 4886874, 4737540, 4553138]
57594D553138k04915k14861k17955k16483k11523k03348j92092j78716j64768
57585B748477j50785j36191j21387j08328r7848q8144p7508o6941n8257n1103
57575A791985m3945l6724l0302k4409j8420j3119r360n764k76O623J2668J7222
57563A646179K1619K6388L0743L4763L9809M6468N3936O1616O9630P7692Q5196
57552B194039R2452J00342J08680J16334J22789J28125J31599J31678J27316J17968
57542C371322J02850Q1747N6167K8247j131l1558o1071q6803j07638j24505j38070
57531C089557j47688j52747j53606j51118j46239j40055j33233j25596j17110
57522A822165j08615j00805r3277q5763p9141p3902o8707o2225n5508n0642m7773
$$ y = [4553138, 4348223, 4133362, 3915407, 3698924, 3487401, 3284053, 3091961, 2913245, 2748477, 2597692, 2461501, 2340114, 2231786, 2133938, 2045794, 1968286, 1901345, 1843088, 1791985, 1748040, 1711316, 1681014, 1656605, 1638185, 1625066, 1615706, 1609942, 1609666, 1616289, 1628957, 1646179, 1667798, 1694186, 1724929, 1759692, 1799501, 1845969, 1899905, 1961521, 2031151, 2108843, 2194039, 2286491, 2386833, 2495513, 2611847, 2734636, 2862761, 2994360, 3126038, 3253354, 3371322, 3474172, 3555919, 3612086, 3640333, 3639202, 3607644, 3546573, 3459770, 3352132, 3227627, 3089557, 2941869, 2789122, 2635516, 2484398, 2338159, 2198104, 2064871, 1939275, 1822165, 1713550, 1612745, 1519468, 1433705, 1354564, 1280662, 1211955, 1149730, 1094222, 1043580, 995807]
57511I95807m5252m2087l8419l4252k9638k5738k3708k2898k1788k0220j8980
57500F72827j7852j6011j3819j2228j0881q788o458n207m738l431r69J333K623
57487E76401L254L608L990N214P507R333R347Q959J0657J4306J7399J8779J9574
57474G08328K0681K1769K2911K4710K6678K7751K8606L1077L5179L9028M1898
57463A028616M4955M8707N2268N5590N9884O5249P0280P4685P9860Q6091R1580
57452A757765R4919R6390R5957R2310Q4737P3740N9124L9928J7294n176k5177
57441B381811m3464o0637p4779q4131q9689r3172r4367r2706q9619q6895q3956
57430A488396p9098p2513o5970o0130n4236m7989m1996l6544l1337k6315k1535
$$ y = [995807, 950555, 908468, 870049, 835797, 806159, 780421, 756713, 733815, 712027, 691807, 672827, 654975, 638964, 625145, 612917, 602036, 593248, 586790, 581583, 576845, 573414, 572445, 573778, 576401, 579655, 583263, 587253, 592467, 599974, 609307, 618654, 627613, 638270, 652576, 669975, 688754, 708328, 729009, 750778, 773689, 798399, 825077, 852828, 881434, 912511, 947690, 986718, 1028616, 1073571, 1122278, 1174546, 1230136, 1290020, 1355269, 1425549, 1500234, 1580094, 1666185, 1757765, 1852684, 1949074, 2045031, 2137341, 2222078, 2295818, 2354942, 2394870, 2412164, 2406988, 2381811, 2338347, 2277710, 2202931, 2118800, 2029111, 1935939, 1841572, 1748866, 1659247, 1572352, 1488396, 1409298, 1336785, 1270815, 1210685, 1156449, 1108460, 1066464, 1029920, 998583, 972268, 950733]
57419I50733j6721j2004q536p096o435m371l52M003O920Q211R212J1567J5879
57406I51010K1025K5159K7794L0351L4271L9414M4905N0714N7208O3688O8674
57395A414213P1785P4386P8016Q2530Q6138Q7017Q4499P8611O8945N4832L6681
57384B217653J6243m993k6681m8130o7151q1916r3073j02250j08973j11369j09839
57373A479521j07550j06395j04623r9697r2002q4241p8142p3156o7877o1669n5172
57362E48997m9779m6348m4157m1584l7975l4137l0967k8456k6193k3934k1440
57351A64027j8767j6814j6492j7195j7297j6396j5706j5784A4126D31a1044j0413
57339b1457j0653j0979j0386q813o837n332m995n689o515o650n835m185k307j184
$$ y = [950733, 934012, 922008, 913472, 906376, 899941, 895570, 895218, 899221, 906141, 914352, 923564, 935131, 951010, 972035, 997194, 1024988, 1055339, 1089610, 1129024, 1173929, 1224643, 1281851, 1345539, 1414213, 1485998, 1560384, 1638400, 1720930, 1807068, 1894085, 1978584, 2057195, 2126140, 2180972, 2217653, 2233896, 2228903, 2202222, 2154092, 2086941, 2005025, 1911952, 1809702, 1700729, 1589360, 1479521, 1371971, 1265576, 1160953, 1061256, 969254, 885013, 806871, 733715, 665838, 604169, 548997, 499218, 452870, 408713, 367129, 329154, 295017, 264050, 235594, 209401, 185467, 164027, 145260, 128446, 111954, 94759, 77462, 61066, 45360, 29576, 14126, 431, -11044, -21457, -32110, -43089, -53475, -62288, -69125, -74457, -79452, -85141, -91656, -98306, -104141, -108326, -110633, -111817]
57325a11817j082q61L42J206k19l276n070m422l267l400m073m044l931m732n535
57310a54181m745k789j700k314l423l699l250l087l685m298l648j546L73L32j196
57295a92856j906n59J788L651M776N367N282M913N478P318Q993R166Q290P451
57281a22848O672N589M733M833N505N933O118O355O146M962L523L181M265N962
57267d9071P388P988P561O749O799d723C647P240N847O358Q697J0880J1923J2727
57253F7319J3983J4964J4937J4451J4375J4587J4399J3871J3953J5326J7444J8795
57241B48404J8148J5684J2766J0686R751R621J0034J0929J2161J3408J4230J4297
57229D00119J3839J3762J4768J6422J7854J9332K2036K6014K9614L1651L3104
$$ y = [-111817, -112899, -113760, -113418, -112212, -112431, -115707, -120777, -125199, -128466, -131866, -135939, -139983, -143914, -148646, -154181, -158926, -161715, -163415, -165729, -169152, -172851, -176101, -179188, -182873, -187171, -190819, -192365, -191992, -191660, -192856, -194762, -195321, -193533, -189882, -185106, -179739, -174457, -169544, -164066, -156748, -147755, -138589, -130299, -122848, -116176, -110587, -105854, -101021, -95516, -89583, -83465, -77110, -70964, -66002, -62479, -59298, -55033, -49071, -41683, -33695, -26134, -19385, -12586, -4723, 3647, 10887, 16734, 23092, 31789, 42669, 54592, 67319, 81302, 96266, 111203, 125654, 140029, 154616, 169015, 182886, 196839, 212165, 229609, 248404, 266552, 282236, 295002, 305688, 315439, 325060, 335094, 346023, 358184, 371592, 385822, 400119, 413958, 427720, 442488, 458910, 476764, 496096, 518132, 544146, 573760, 605411, 638515]
57218F38515L5655L9323M2661M4760M5810M5817M4117M0546L6221L2488K9503
57207A075416K6232K1631J5519Q432J169n411j0519j3967j6418j8677k0608k1383
57195A041416k0808j9626j8301j6440j4050j2202j1578j1126r490o965m762k938
57183H93130o80J735L040L052K976L344L283K360J734K719M971O962P600P119
57169I43345O823Q026J0773J3692J5594J6765J8058J9492K0720K2174K4417K6951
57157A146830K9084L1208L3781L5965L7273L9671M5415N3208N9209O1936O3543
57146A637123O6011O8944P1687P4851P8592Q1749Q3861Q5908Q8073Q8937Q8016
57135B513752Q6938Q6951Q7350Q7632Q8951R1833R4359R4464R2556R0498Q9370
$$ y = [638515, 674170, 713493, 756154, 800914, 846724, 892541, 936658, 977204, 1013425, 1045913, 1075416, 1101648, 1123279, 1138798, 1147230, 1148399, 1142988, 1132469, 1118502, 1102084, 1083407, 1062799, 1041416, 1020608, 1000982, 982681, 966241, 952191, 939989, 928411, 917285, 907795, 900830, 896068, 893130, 892450, 894185, 897225, 900277, 903253, 906597, 909880, 912240, 913974, 916693, 921664, 928626, 936226, 943345, 950168, 958194, 968967, 982659, 998253, 1015018, 1033076, 1052568, 1073288, 1095462, 1119879, 1146830, 1175914, 1207122, 1240903, 1276868, 1314141, 1353812, 1399227, 1452435, 1511644, 1573580, 1637123, 1703134, 1772078, 1843765, 1918616, 1997208, 2078957, 2162818, 2248726, 2336799, 2425736, 2513752, 2600690, 2687641, 2774991, 2862623, 2951574, 3043407, 3137766, 3232230, 3324786, 3415284, 3504654]
57124C504654Q9397R0554R1830R1565Q9813Q8805Q9710R0571Q8952Q5083Q0776
57113D481710P6559P1675O5801N9170N1789M3880L6344K9853K4310J9863J7316
57102D978270J6775J7142J7718J8923K0870K2741K4278K6237K8619L0153L0174
57091E231900K9139K6672K1230J2664K902o910j7844l0692m4135n6645o8251p9578
57079E020452r1337j05520j24400j47030j69263j88522k06114k23711k40587k55950
57069C268018k71180k87867l06194l26975l52524l83708m18700m56486c4625n48265
57059e82890o03842o65172p33446q10107q96283r94853j109632j241275j387695
57050i025195j549881j733539j943837k183093k454868k765095l117127l510605
$$ y = [3504654, 3594051, 3684605, 3776435, 3868000, 3957813, 4046618, 4136328, 4226899, 4315851, 4400934, 4481710, 4558269, 4629944, 4695745, 4754915, 4806704, 4850584, 4886928, 4916781, 4941091, 4960954, 4978270, 4995045, 5012187, 5029905, 5048828, 5069698, 5092439, 5116717, 5142954, 5171573, 5201726, 5231900, 5261039, 5287711, 5308941, 5321605, 5324507, 5317597, 5299753, 5269061, 5224926, 5168281, 5100030, 5020452, 4929115, 4823595, 4699195, 4552165, 4382902, 4194380, 3988266, 3764555, 3523968, 3268018, 2996838, 2708971, 2402777, 2075802, 1723278, 1339570, 920870, 464384, -34625, -582890, -1186732, -1851904, -2585350, -3395457, -4291740, -5286593, -6396225, -7637500, -9025195, -10575076, -12308615, -14252452, -16435545, -18890413, -21655508, -24772635, -28283240]
57042b8283240l947255m432917m972508n568422o224812o947281p738021q598379
57034g6712835r534610j0550359j1633138j2758685j3904071j5037443j6095262
57027a66226403j6987612j7610962j7809604j7341719j6011357j3954652j1758437
57020b77700746j0130237r328826q917447q106590o336511l561552j00400L658323
57012c20523986P413657J0955088J4122637J6781755J8817105K0152219K0784190
57005b11497335K0790286K0289115J9395548J8208447J6820029J5318276J3780682
56998h6894952J2271448J0840007R516048Q309253P219493O246498N389366M642899
56990b2459940L999209L450089K984807K589030K249486J958003J709245J497037
$$ y = [-28283240, -32230495, -36663412, -41635920, -47204342, -53429154, -60376435, -68114456, -76712835, -86247445, -96797804, -108430942, -121189627, -135093698, -150131141, -166226403, -183214015, -200824977, -218634581, -235976300, -251987657, -265942309, -277700746, -287830983, -297159809, -306077256, -314183846, -320520357, -324081909, -324182309, -320523986, -313110329, -302155241, -288032604, -271250849, -252433744, -232281525, -211497335, -190707049, -170417934, -151022386, -132813939, -115993910, -100675634, -86894952, -74623504, -63783497, -54267449, -45958196, -38738703, -32492205, -27102839, -22459940, -18460731, -15010642, -12025835, -9436805, -7187319, -5229316, -3520071, -2023034]
56982b023034g08282D48828J019849Q99399P93835P02110O21770N49618M84771
56973E520180M28621L81477L41619L07488K77941K50432K22225J93716J67489
56964H091188J43759J19878R4653O9834M6464K3047j616k6592n0931p5183r9840
56953H334661j24471j49196j74934k01857k29825k60166k93756l26336l48483
56944F225637l51810l34051k98333k50263j96153j41126q7252l4858J3990N4654
56934D600435Q1904R0292P3845L0324l2260r6624j46538j75822j87755j88955
56924D048846j85078j79443j72830j64814j55935j47588j39896j31701j22977
56915B648584j15087j08211j00928r3013q6289q1709p7768p2912o7412o1725n5186
$$ y = [-2023034, -708282, 448828, 1468677, 2368076, 3161911, 3864021, 4485791, 5035409, 5520180, 5948801, 6330278, 6671897, 6979385, 7257326, 7507758, 7729983, 7923699, 8091188, 8234947, 8354825, 8449478, 8519312, 8565776, 8588823, 8587207, 8560615, 8509684, 8434501, 8334661, 8210190, 8060994, 7886060, 7684203, 7454378, 7194212, 6900456, 6574120, 6225637, 5873827, 5539776, 5241443, 4991180, 4795027, 4653901, 4566649, 4531791, 4545781, 4600435, 4682339, 4772631, 4846476, 4876800, 4844540, 4747916, 4601378, 4425556, 4237801, 4048846, 3863768, 3684325, 3511495, 3346681, 3190746, 3043158, 2903262, 2771561, 2648584, 2533497, 2425286, 2324358, 2231345, 2145056, 2063347, 1985579, 1912667, 1845255, 1783530, 1728344]
56904A728344m7668m0786l5937l2500k9130k5338k0843j5172r260o080q044j4574
56892A443012k2978l0770l6446l9351l9884l9030l7141l3917k9628k5209k0953
56881A087705j6591j2627r844p366l253K543P810J1213J3703J6213J8166J9069
56869A126741J9282J8080J3343M682n143j3470k0449k6879l1476l2572l1079k9424
56857I91636k8406k7134k5294k3503k1876j9916j7632j5488j3592j2028j1352
56846G75415j1616j1571j0037p473m990k571L72L275M901N293N840P311R088J0526
56832G73763J2024J4326J7493K0798K3230K4038K3178K1319J9054J6127J1718
56821I77068N545j450p656j2149j5400j8329k0624k0765j8217j4726j2368j0930
$$ y = [1728344, 1680676, 1639890, 1603953, 1571453, 1542323, 1516985, 1496142, 1480970, 1471710, 1465630, 1457586, 1443012, 1420034, 1389264, 1352818, 1313467, 1273583, 1234553, 1197412, 1163495, 1133867, 1108658, 1087705, 1071114, 1058487, 1048643, 1041277, 1038024, 1040567, 1048377, 1059590, 1073293, 1089506, 1107672, 1126741, 1146023, 1164103, 1177446, 1182128, 1176985, 1163515, 1143066, 1116187, 1084711, 1052139, 1021060, 991636, 963230, 936096, 910802, 887299, 865423, 845507, 827875, 812387, 798795, 786767, 775415, 763799, 752228, 742191, 734718, 729728, 727157, 727529, 730804, 735705, 740998, 746838, 754149, 763237, 773763, 785787, 800113, 817606, 838404, 861634, 885672, 908850, 930169, 949223, 965350, 977068, 982613, 981163, 973507, 961358, 945958, 927629, 907005, 886240, 868023, 853297, 840929, 829999]
56809H29999q519m363M66M998R338J3532J7062K0106K3967K9425L5373L9544L9778
56796A050706L4585K3941J0122l236j3616k0592k4501k5487k4182k1902j9402
56785I66436j6312j2215p365k030L751R591J5085K0889K8115L6448M4471N1970
56773A138834N9670O5769O5091N3654L3009Q784j3841l1940m3927m9507n0405
56762A235191m9240m7186m3644l8134l1486k4994j9220j3800q063j693N062J1799
56750I74592J8423K4936L0976L5989L9316L9433L3771K0991L440j4032k7880l7330
56738A142625m2448m3058m0302l7035l5062l3154k9153k3144j7216j2852r785
56727H19416p019l892k14L894Q209J2554J6552J9373K0124J8308J3459N164n458
$$ y = [829999, 821480, 817117, 817583, 822581, 831919, 845451, 862513, 882619, 906586, 936011, 971384, 1010928, 1050706, 1085291, 1109232, 1119354, 1116118, 1102502, 1081910, 1057409, 1031922, 1007740, 985838, 966436, 950124, 937909, 930544, 928514, 932265, 941856, 956941, 977830, 1005945, 1042393, 1086864, 1138834, 1198504, 1264273, 1329364, 1383018, 1416027, 1424811, 1410970, 1379030, 1335103, 1285596, 1235191, 1185951, 1138765, 1095121, 1056987, 1025501, 1000507, 981287, 967487, 959424, 957731, 962793, 974592, 993015, 1017951, 1048927, 1084916, 1124232, 1163665, 1197436, 1218427, 1221867, 1207835, 1179955, 1142625, 1100177, 1057119, 1016817, 979782, 944720, 911566, 882413, 859269, 842053, 829201, 819416, 812397, 808505, 808291, 812185, 820394, 832948, 849500, 868873, 888997, 907305, 920764, 925928, 920470]
56714I20470j5071k0689k2593k3136k3231k2121k0254j9500k0133k0251j8982
56703F94509j7626j6816j5183j2265j0075j0023j0534r644p939o894o185m899
56691E66426l826m130n028m931m025l643l943m059l779l375k529j059R5P4n55
56676E21713j010j662k816l480k978k484l068l535k187L24J958K062J285q8j601
56661E02433j732R8J626M81k062k735j075K80k74j710k840l644l855k731o86Q42
56645D82416J377J417P12j166k681j556J512L032J484o53n18J635L863N256N815
56630E01945N215L406J456M95M17M37K27n7k15m5L34K09q06j660r38R97K342K421
56612E16180K260K376J866M15n24L05K066L025K681J755R17M02K99L75J46m25
$$ y = [920470, 905399, 884710, 862117, 838981, 815750, 793629, 773375, 753875, 733742, 713491, 694509, 676883, 660067, 644884, 632619, 622544, 612521, 601987, 592343, 584404, 577510, 571325, 566426, 562600, 558470, 553442, 548511, 544486, 540843, 536900, 532841, 529062, 525687, 523158, 522099, 522194, 522268, 521713, 520703, 519041, 516225, 512745, 509767, 507283, 504215, 500680, 498493, 498817, 500775, 502837, 504122, 504034, 502433, 500701, 500799, 502425, 502906, 500844, 498109, 497034, 497314, 497040, 495330, 492490, 488846, 484991, 482260, 481574, 482416, 483793, 485210, 485922, 484756, 482075, 480519, 482031, 485063, 486547, 485894, 485376, 487011, 490874, 496130, 501945, 507160, 510566, 512022, 512517, 512934, 513371, 513598, 513541, 513326, 513281, 513615, 513824, 513018, 511358, 510420, 511417, 513759, 516180, 518440, 520816, 522682, 523097, 522573, 522878, 524944, 527969, 530650, 532405, 533322, 533724, 534023, 534398, 534544, 534119]
56596E34119p47n15j63j82o47j637l218m748n146m324l501l602m074l904l192
56581D94519l001l912n158n248l505j058R7n92j559j322m74l63o51J9J422J798
56565D71012O57n66j073j944l840n298m718k768j304p91l50K00Mj152k209k325
56549D43535j985k025k208j583q5J108J144P65J289K743L931M202M045L831L234
56534D61941K343K072K672K998K216J173R40J056N58k41m10n4J49L60R99J501
56518D80273J233R43J464J769M39j493j555N18K537L320L823M423L802J654J75
56503E03325J200L546M742M290L658L951M966O061O834P122P014O694O064M972
56489E74439L930L882M934O009O097N262M157L132K078Q29m77j277j205j006k062
$$ y = [534119, 533372, 532857, 532694, 532512, 531865, 530228, 527010, 522262, 517116, 512792, 509291, 505689, 501615, 497711, 494519, 491518, 487606, 482448, 477200, 473695, 472637, 472734, 472142, 470583, 469261, 468787, 468424, 467773, 467792, 469214, 471012, 471669, 471103, 470030, 468086, 464246, 458948, 454230, 451462, 450158, 449367, 449017, 449217, 449221, 448069, 445860, 443535, 441550, 439525, 437317, 435734, 435649, 436757, 437901, 438666, 439955, 442698, 446629, 450831, 454876, 458707, 461941, 464284, 466356, 469028, 472026, 474242, 475415, 476355, 477411, 477969, 477728, 477318, 477264, 477413, 477773, 478772, 480273, 481506, 482449, 483913, 485682, 486121, 484628, 483073, 483591, 486128, 489448, 493271, 497694, 501496, 503150, 503325, 504525, 508071, 512813, 517103, 520761, 524712, 529678, 535739, 542573, 549695, 556709, 563403, 569467, 574439, 578369, 582251, 587185, 593194, 599291, 604553, 608710, 611842, 613920, 614749, 614272, 612995, 611790, 610784, 608722]
56474F08722m454o450o863o841p986r628r824q366o913o404o198n621m594k975
56460E15605r86l0j205l254m067l881m605o206o473m761l098k816k698j699r12
56445D68914j333j795r25N38J039N52N3k53q14j605k269k674k614j700j12J327
56429D56329K104K174J197r32k776k405q3J787J818R85M60J66P2Q16K132K637
56413D66481K069J822K448K720K125K071L385M873N606O390P458P149M772K597
56399E21966K776M223M781M614N035N566M924L724L532M040L674K359J369R92
56385E73575N69L91J291K588K633J333J86j10k17l54J14R88R67l86j774k050j860
56368E77884k706m958p410q571q083o837n737m632k932r28L00L54j76q84j954
$$ y = [608722, 604268, 597818, 590955, 584114, 576128, 566500, 556676, 548310, 541397, 534993, 528795, 523174, 518580, 515605, 514619, 514589, 513384, 510130, 506063, 502182, 497577, 491371, 484898, 480137, 477039, 474223, 471525, 469826, 468914, 467581, 465786, 464861, 465399, 466438, 466990, 467043, 466790, 465976, 464371, 462102, 459428, 456814, 455114, 455002, 456329, 458433, 460607, 461804, 460872, 458096, 455691, 455608, 457395, 459213, 460198, 460658, 460824, 460896, 461712, 463844, 466481, 468550, 470372, 472820, 475540, 477665, 479736, 483121, 487994, 493600, 499990, 507448, 514597, 519369, 521966, 524742, 528965, 533746, 538360, 543395, 548961, 553885, 557609, 561141, 565181, 568855, 571214, 572583, 573575, 574144, 574535, 575826, 578414, 581047, 582380, 582566, 582456, 582239, 581885, 581999, 582987, 583954, 583568, 581794, 579744, 577884, 575178, 570220, 562810, 554239, 546156, 539319, 533582, 528950, 526018, 525090, 525390, 525744, 525568, 524684, 522730]
56353E22730l165l779l656l372k978k021r19o40p86P2J751K296J141Q9J66l4j430
56336E05465k374j434m1q7p95l09J073J709J450J345J422J061P99J765L780N671
56320E20500O855P243O631N594N693P088P467N228K318J569K533K525R10l50n6
56305E81748Q48J155O91k15r90p50N18J440J206J039K119L308L005K007K128K954
56289F02211K681J449J043J646J688R31R98K409L556L211K074J270J095J645L061
56274F30968M578M876L843K783K566K817L147L973N681P782R140Q672O234L325
56260G00385K303L995O718Q291Q278P564O927O919P996R627J0382R980R824J0630
56246H09819J1240J0942J1022J2383J3653J3488J2741J2355J1285Q951P480Q571
$$ y = [522730, 519565, 515786, 512130, 508758, 505780, 503759, 502840, 502200, 501414, 501486, 503237, 505533, 506674, 506763, 506929, 506895, 505465, 503091, 501657, 501616, 501529, 500734, 500425, 501498, 503207, 504657, 506002, 507424, 508485, 509284, 511049, 514829, 520500, 527355, 534598, 541229, 546823, 552516, 559604, 567071, 572299, 574617, 576186, 578719, 581244, 582154, 581804, 581748, 582596, 583751, 584442, 584227, 583237, 582487, 583005, 584445, 585651, 586690, 588809, 592117, 595122, 597129, 599257, 602211, 604892, 606341, 607384, 609030, 610718, 611649, 612647, 615056, 618612, 621823, 623897, 625167, 626262, 627907, 630968, 635546, 640422, 644265, 647048, 649614, 652431, 655578, 659551, 665232, 673014, 682154, 690826, 697060, 700385, 702688, 706683, 713401, 721692, 729970, 737534, 744461, 751380, 759376, 769003, 779385, 789365, 799189, 809819, 821059, 832001, 843023, 855406, 869059, 882547, 895288, 907643, 918928, 927879, 935359, 943930]
56234I43930J0112R135O466N077N277N162M651N276O743P378P459Q468R629Q950
56220A043713P463Q436J2166J5359J6274J6892J9155K2275K4836K6808K8545L0074
56208A271996L2133L5734M0294M4184M7220N0487N4086N7515O1768O8164P5413
56197A838994Q1039Q5613R2188J01253J09810J16032J21483J27720J33888J38992
56187B947012J43651J48147J50817J49824J44857J36372J24804J10997R5755P8808
56177D231044N9743L9599J9839M57j8746l5883m8740n7902o5408p1329p4889p7740
56165C900045q2115q6490q7433q5486q4690q6297q7668q7861q9244r2460r4578
56154B935723r4055r3162r3505r3195r0675q7592q5620q3604q0102p5917p2079
$$ y = [943930, 954042, 963177, 969643, 974720, 979997, 985159, 989810, 995086, 1001829, 1009207, 1016666, 1025134, 1034763, 1043713, 1051176, 1059612, 1071778, 1087137, 1103411, 1120303, 1139458, 1161733, 1186569, 1213377, 1241922, 1271996, 1304129, 1339863, 1380157, 1424341, 1471561, 1522048, 1576134, 1633649, 1695417, 1763581, 1838994, 1920033, 2005646, 2097834, 2199087, 2308897, 2424929, 2546412, 2674132, 2808020, 2947012, 3090663, 3238810, 3389627, 3539451, 3684308, 3820680, 3945484, 4056481, 4152236, 4231044, 4290787, 4330386, 4350225, 4350682, 4331936, 4296053, 4247313, 4189411, 4124003, 4052674, 3977785, 3900045, 3817930, 3731440, 3644007, 3558521, 3473831, 3387534, 3299866, 3212005, 3122761, 3030301, 2935723, 2841668, 2748506, 2655001, 2561806, 2471131, 2383539, 2297919, 2214315, 2134213, 2058296, 1986217]
56143A986217o8010o3374n9122n5287n0445m4655m0018l7111l3998k9967k7023
56132A477207k6197k5639k3919k2025k0492j7869j3712j0028q043o550m905m362
56120A293466m981m596k567j067j031l67J969L784L781M133O555R271J0464J1520
56106A330334J4160J7320J9484K1334K3627K5226K5586K6405K8563L0255L0316
56095A592610L0484L2037L3362L3244L3497L5637L7882L8153L7494L7741L8384
56084A980525L8215L7878L8486L9956M2581M7718N5325O3606P2591Q4705J00226
56073B601812J15987J30655J47199J67451J88061K04510K15493K20452K16914
56064D208534K04035J85738J67076J50207J36331J27478J22669J15534R9690P4483
$$ y = [1986217, 1918207, 1854833, 1795711, 1740424, 1689979, 1645324, 1605306, 1568195, 1534197, 1504230, 1477207, 1451010, 1425371, 1401452, 1379427, 1358935, 1341066, 1327354, 1317326, 1309283, 1302733, 1297828, 1293466, 1288485, 1283889, 1281322, 1280255, 1279224, 1278857, 1280826, 1284610, 1288391, 1292524, 1299079, 1308350, 1318814, 1330334, 1344494, 1361814, 1381298, 1402632, 1426259, 1451485, 1477071, 1503476, 1532039, 1562294, 1592610, 1623094, 1655131, 1688493, 1721737, 1755234, 1790871, 1828753, 1866906, 1904400, 1942141, 1980525, 2018740, 2056618, 2095104, 2135060, 2177641, 2225359, 2280684, 2344290, 2416881, 2501586, 2601812, 2717799, 2848454, 2995653, 3163104, 3351165, 3555675, 3771168, 3991620, 4208534, 4412569, 4598307, 4765383, 4915590, 5051921, 5179399, 5302068, 5417602, 5517292, 5591775]
56054E591775M3197R081k3946n0564o8150p9537q9224r9693j13251j32759j57024
56043D829905j79261j93857k01325k03779k00024j89038j74050j58747j42837
56034C186987j25466j09252r6569q5323p2789o0501n1083m3560l5945k9246k4892
56023B452361k1367j7373j4823j4870j4732j2437j0694j1818j3035j1305q553
56012B301354p347n756j564K749M494O039J0112J4136J4955J5030J8069K2513
56000B394784K5327K8183L3532L8506L9308L8112L9154M1516M2245M2909M6237
55989B809813M9720M9461M7273M7368M9181M9998N1147N4903N8778N9800O0790
55978C388232O5417P0812P2511P2900P7203Q4534R0522R5372J01644J07621J10651
$$ y = [5591775, 5634972, 5644053, 5620107, 5569543, 5501393, 5421856, 5332632, 5232939, 5119688, 4986929, 4829905, 4650644, 4456787, 4255462, 4051683, 3851659, 3662621, 3488571, 3329824, 3186987, 3061521, 2952269, 2855700, 2770377, 2697588, 2637087, 2586004, 2542444, 2506499, 2477253, 2452361, 2430994, 2413621, 2398798, 2383928, 2369196, 2356759, 2346065, 2334247, 2321212, 2309907, 2301354, 2294007, 2288251, 2286687, 2289436, 2293930, 2299969, 2310081, 2324217, 2339172, 2354202, 2372271, 2394784, 2420111, 2448294, 2481826, 2520332, 2559640, 2597752, 2636906, 2678422, 2720667, 2763576, 2809813, 2859533, 2908994, 2956267, 3003635, 3052816, 3102814, 3153961, 3208864, 3267642, 3327442, 3388232, 3453649, 3524461, 3596972, 3669872, 3747075, 3831609, 3922131, 4017503, 4119147, 4226768, 4337419]
55967D337419J13563J20124J27811J32739J37503J46194J56048J62499J68048
55958E601948J77333J88098J96217K04931K19332K36140K49071K59911K74144
55949G607125K90139L03064L15075L30966L48394L63170L79222M02133M27971
55940A0767259M50048M71182M97445N26048N52241N81609O21588O67242P09847
55931A5844509P52784Q03478Q56901R03901R49110J002731J061471J116320J172514
55922B4463719J241681J320607J398651J479723J574850J679380J780959J884193
55914C6823763K003305K136990K276102K429246K613111K824440L050899L302081
55906E7459937L598198L936684M305607M722991N226689N835632O561282P442929
$$ y = [4337419, 4450982, 4571106, 4698917, 4831656, 4969159, 5115353, 5271401, 5433900, 5601948, 5779281, 5967379, 6163596, 6368527, 6587859, 6823999, 7073070, 7332981, 7607125, 7897264, 8200328, 8515403, 8846369, 9194763, 9557933, 9937155, 10339288, 10767259, 11217307, 11688489, 12185934, 12711982, 13264223, 13845832, 14467420, 15134662, 15844509, 16597293, 17400771, 18257672, 19161573, 20110683, 21113414, 22174885, 23291205, 24463719, 25705400, 27026007, 28424658, 29904381, 31479231, 33158611, 34939570, 36823763, 38827068, 40964058, 43240160, 45669406, 48282517, 51106957, 54157856, 57459937, 61058135, 64994819, 69300426, 74023417, 79250106, 85085738, 91647020, 99089949]
55898I9089949Q520840R786017J1213608J2837906J4737178J6961435J9539832
55891A92686765K2518977K5885647K9483601L3131350L6706699L9731555M0730383
55884D20874977L7455957K8421965J4479436j281542j5349776k5611602l1749954
55877D27239461l4494855l4838586l3708396l1846955k9703512k7441696k5090076
55870B10115385k2669278k0218010j7798909j5512528j3461398j1686167j0165503
55863I8603592q871380p786898o878987o100228n423858m845321m350126l911751
55855E0435043l520572l184049k897491k641871k410379k210502k039527j882878
55847B9647774j737082j610714j502063j398288j297035j207339j128766j050766
$$ y = [99089949, 107610789, 117396806, 128610414, 141448320, 156185498, 173146933, 192686765, 215205742, 241091389, 270574990, 303706340, 340413039, 380144594, 420874977, 458330934, 486752899, 501232335, 499950793, 484601017, 458989415, 427239461, 392744606, 357906020, 324197624, 292350669, 262647157, 235205461, 210115385, 187446107, 167228097, 149429188, 133916660, 120455262, 108769095, 98603592, 89732212, 81945314, 75066327, 68966099, 63542241, 58696920, 54346794, 50435043, 46914471, 43730422, 40832931, 38191060, 35780681, 33570179, 31530652, 29647774, 27910692, 26299978, 24797915, 23399627, 22102592, 20895253, 19766487, 18715721]
55839A8715721r73364r07826q55360q04745p52668p07570o71344o35406n97312
55830A1810126n63978n35993n05188m70613m41104m19287l97921l74651l55598
55821G745793l41639l25583l06059k90336k80174k68357k52709k40412k34433
55812E206091k27953k16493k04030j93000j79184j60870j43129j29175j16822
55803C635435j06529j03147j06189j07810j04014r9133r6103r1382q3009p4927
55793B663192o9516o3791n6854n3447n6388o2121o6947p1202p4589p4199o9970
55782A944168o6005o4041o1413n7081n3421n0540m5325l7754l1724k8313k4501
55771A424050j9662j6448j4409r977l915j151j811n00L681M608n90o830r874j2244
$$ y = [18715721, 17742357, 16834531, 15979171, 15174426, 14421758, 13714188, 13042844, 12407438, 11810126, 11246148, 10710155, 10204967, 9734354, 9293250, 8873963, 8476042, 8101391, 7745793, 7404154, 7078571, 6772512, 6482176, 6202002, 5933645, 5680936, 5440524, 5206091, 4978138, 4761645, 4557615, 4364615, 4185431, 4024561, 3881432, 3752257, 3635435, 3528906, 3425759, 3319570, 3211760, 3107746, 3008613, 2912510, 2821128, 2738119, 2663192, 2593676, 2529885, 2473031, 2419584, 2363196, 2301075, 2234128, 2162926, 2088337, 2014138, 1944168, 1878163, 1814122, 1752709, 1695628, 1642207, 1591667, 1546342, 1508588, 1476864, 1448551, 1424050, 1404388, 1387940, 1373531, 1363554, 1359639, 1358488, 1356677, 1356177, 1359858, 1364466, 1363876, 1357046, 1347172, 1334928]
55757A334928j6711k1019k3209k5593k9351l1237k9764k8890l1291l3333l1005
55746A033525k6144k2704k1115j9928j9065j8114j5303j1064q625q710p877m514
55734H50362j751j740j879J46K171J773N13N79Q46m19k237l182l859m684m431
55719H32208l081k723l650l239o57J210M91j023k007m073p749j0248j0013r424
55705G76022j0321j0841r555q665r915j1117j0251r564j1933j6016j8511j8865
55693F30468j8757j9109k0235k2748k5993k7661k6795k4870k2552j8521j3074
55682C90153r323q643q362o256l937l294l050j559j3l1q62j461k462l774l330
55667C33796p29R50m23k849l978m787o555p544o037l887l548m097l458k288k249
$$ y = [1334928, 1318217, 1297198, 1273989, 1248396, 1219045, 1187808, 1158044, 1129154, 1097863, 1064530, 1033525, 1007381, 984677, 963562, 943634, 924569, 906455, 891152, 880088, 871463, 862753, 854876, 850362, 848611, 846871, 844992, 845138, 847309, 849082, 849595, 850174, 851020, 850601, 848364, 845182, 841323, 836639, 832208, 829127, 826404, 822754, 819515, 818858, 820068, 820559, 819536, 817529, 813456, 805707, 795459, 785446, 776022, 765701, 754860, 745305, 736640, 726725, 715608, 705357, 695793, 683860, 667844, 649333, 630468, 611711, 592602, 572367, 549619, 523626, 495965, 469170, 444300, 421748, 403227, 390153, 380830, 372187, 363825, 357569, 353632, 350338, 347288, 345729, 345716, 345685, 344823, 343362, 340900, 337126, 333796, 333067, 334017, 333594, 330745, 326767, 321980, 315425, 307881, 301844, 297957, 294409, 290312, 286854, 284566, 282317]
55652B82317k632j905p74o78j078r54j031j869j783N00L243M308M265M182K870
55637B88981n32l559l543j870j643k771k903j790j136j096l19J233K484L684N742
55622B80962P773Q024O850O269O838P197O442N121M029L419L051K090o2k229k319
55607C43455n74J35j631l850m490m330m434l758j660j95q91j589L31L507M783
55592C24809M180M271N779P131P603P798P578O414N151M917M870L516J400J51
55578C95568l50j321k541l031l435n009o903p197o096n548o059o482o601p333
55564C27662q560r038q489p644o633n308m765o158q408r335q865q695r033q303
55550B18428o318n128n914p039o361l951j653q43j305j792j325k59J43o18j615
$$ y = [282317, 279685, 277780, 277006, 276328, 275250, 274296, 273265, 271396, 269613, 270113, 273356, 277664, 281929, 286111, 288981, 288449, 284890, 281347, 279477, 277834, 275063, 272160, 270370, 269234, 268138, 267819, 269052, 271536, 275220, 280962, 288735, 296759, 303609, 309878, 316716, 323913, 330355, 335476, 339505, 342924, 345975, 348065, 348003, 345774, 343455, 342881, 343016, 341385, 337535, 333045, 328715, 324281, 320523, 318863, 318668, 317777, 316188, 316519, 320026, 324809, 328989, 333260, 339039, 346170, 353773, 361571, 369149, 375563, 380714, 385631, 390501, 394017, 395417, 395568, 395218, 393897, 391356, 388325, 384890, 379881, 372978, 365781, 359685, 354137, 348078, 341596, 334995, 327662, 319102, 310064, 301575, 293931, 287298, 281990, 277225, 271067, 262659, 253324, 244459, 235764, 226731, 218428, 212110, 206982, 201068, 194029, 187668, 183717, 182064, 181221, 179916, 178124, 176799, 176540, 176683, 176065, 174450]
55535A74450j820j231k59Q41J314J63k022l025j888k45M67J190L024M666M316
55520A79941K664J665J506J177J032K230M282N479N442N227N390N841P087R617
55506B38580J2496J4408J5593J6918J7736J6675J4046J1408R055N943J782k601
55494C72039o775j0787j4083j5959j6807j7386j7385j6307j5081j4908j5164j4294
55482A97103j2309j0476q997p025m757l435l339l500l315k898k098p84J40l48
55468A33962j713k528k424j926j022L44J053n9k094l017k353j326o63j1P68J466
55452A18457K437M027N477N878N745O026O206N182L408K254J723Q39k23m18Lk70
55436A66751j387k273k583k890l181l013k866l440m015l482k710l647o210q145
$$ y = [174450, 172630, 171399, 171140, 171981, 173295, 173458, 171436, 168411, 166523, 166278, 166745, 167935, 170959, 175625, 179941, 182605, 184270, 185776, 186953, 187985, 190215, 194497, 199976, 205418, 210645, 216035, 221876, 228963, 238580, 251076, 265484, 281077, 297995, 315731, 332406, 346452, 357860, 366915, 372858, 374640, 372039, 365264, 354477, 340394, 324435, 307628, 290242, 272857, 256550, 241469, 226561, 211397, 197103, 184794, 174318, 165321, 158296, 153539, 150104, 146765, 143265, 139950, 137052, 134954, 134170, 134310, 133962, 132249, 129721, 127297, 125371, 124349, 124693, 125746, 125687, 123593, 120576, 118223, 116897, 116234, 116223, 116991, 118457, 120894, 124921, 130398, 136276, 142021, 148047, 154253, 159435, 162843, 165097, 166820, 167659, 167436, 167018, 167021, 166751, 165364, 163091, 160508, 157618, 154437, 151424, 148558, 145118, 141103, 137621, 134911, 131264, 125054, 116909]
55422A16909q046o536m616k897k218l001l811k755l15J174Q23j27q28j699k599
55407G9458k481j438r59j527j857j088j9M79O41Q84J135J423J839J746M38j433
55391G7241k515k712k916l134k679k007k186k682j858R6J030J26q64k75J385K611
55375E8661K532R98j275k385q80J976L340K425J131Q70Q82K34o26j100j420j664
55359F3699j360o03l0O45K333M450M951L107N65r23j103l52R44J710R13m61r6
55342G8389K274M162L620J376j045l204m771m692k686j86J361J901J860J278N32
55327H0169M41R09Q77K51K44J260K050J665O11m81j627k281j306R80K462J849
55311H8073J15j361k309k636j936p74o45j732k533k358k170k276j626l73n19k485
$$ y = [116909, 108863, 102327, 97711, 94814, 92596, 89595, 85784, 83029, 82714, 83888, 84711, 84584, 83756, 82057, 79458, 76977, 75539, 74580, 73053, 71196, 70108, 70089, 70568, 71209, 72093, 73228, 74651, 76490, 78236, 78674, 77241, 74726, 72014, 69098, 65964, 63285, 61278, 59092, 56410, 54552, 54648, 55678, 55804, 54940, 54665, 56050, 58661, 61193, 62191, 60916, 58531, 57651, 59627, 62967, 65392, 66523, 67393, 68275, 68509, 67883, 66783, 65363, 63699, 62339, 61736, 61706, 62351, 64684, 69134, 74085, 77192, 77757, 76834, 75731, 75379, 76323, 78033, 78946, 78485, 78389, 80663, 84825, 88445, 89821, 88776, 85572, 80801, 76109, 73423, 73237, 74598, 76499, 78359, 79637, 80169, 80610, 81519, 82396, 82647, 82891, 84151, 86201, 87866, 88477, 87996, 86369, 84088, 82782, 83762, 86224, 88073, 88188, 86827, 84518, 81882, 79946, 79172, 78527, 76795, 74262, 71904, 69734, 67458, 65832, 65459, 64940, 62455]
55295F2455l631k097J76M34r10j639j345j136j035k73N97K30j285k566k954k788
55279D2233k180r57N62J875K893L330K473N76o11P0J474J773P71n24j604k341
55263D9813k327j677j532k373k892j904k44P87J554K871L756K676L36r22l75M25
55247D7972J93o24j094r58k55R66K233K711K010N00r81j458m50J144J562K64j268
55230E2467j497o97L4N63J276J758J387O82P60J671K393K194J121m84k142l146
55214E8340l147k554j904j268n68K68J506K958L155Q31k397l083n46J847J341
55199E4779n81j160n84n82p79K81J686J203p44j474m81r3j288j931m24J667K128
55182E1623J151K47k76r73j520r91N87K163K884K586J423k20j626k100j508k45
$$ y = [62455, 58824, 56727, 56903, 57337, 56427, 54788, 53443, 52307, 51272, 50999, 51596, 51826, 50541, 47975, 45021, 42233, 40053, 39096, 39658, 41533, 44426, 47756, 50229, 50805, 50194, 50264, 51738, 53511, 54282, 53758, 52154, 49813, 47486, 45809, 44277, 41904, 39012, 37108, 36864, 37651, 39205, 42076, 45832, 48508, 48844, 47922, 47547, 47972, 48165, 47541, 46447, 45489, 45234, 46200, 48433, 51144, 53154, 53654, 52673, 51215, 50765, 51909, 53471, 53735, 52467, 50970, 50273, 50307, 50870, 52146, 53904, 55291, 55973, 56733, 58404, 60797, 62991, 64112, 63628, 61486, 58340, 55193, 52639, 50735, 49467, 48899, 49167, 50673, 53631, 56786, 57617, 55220, 52137, 51591, 53438, 54779, 54198, 53038, 52454, 51872, 51093, 51374, 53060, 54263, 53519, 52045, 51564, 51471, 50183, 48252, 47828, 49495, 51623, 52774, 53021, 52745, 51772, 50252, 49261, 49848, 52011, 54895, 57481, 58904, 58684, 57058, 54958, 53450, 53205]
55166E3205J145K309L131L507L125J808K77j82O08J051k78k522l472k451r87n18
55150E9756n84J10J640K658K113O03k26L24J084M24j631l422l782l160k394j476
55134E2037j28J230J969K039J700J157R55J716K837K601N41j409j412j53N79O61
55118F6920J145J803J324j50p85K92J683J684L08j207j984k088k103k503l109
55103F1230l202k515j665j052l3J852L444L027P51j276j404n1J170J139L4r17
55087F0532o04N48Q11n40j962j671j95N66J94r0J79R5n80o37O46K168K553J911
55069F3924J262R70P08L93M54J218K452L430L491K665J708J237J160J288J884
55054H8244K966L671L338K744L007L613K988J023n35o05k34p73j934k547k372
$$ y = [53205, 54350, 56659, 59790, 63297, 66422, 68230, 68507, 68325, 68933, 69984, 69706, 67184, 63712, 61261, 60274, 59756, 59172, 59282, 60922, 63580, 65693, 66296, 66070, 66394, 67478, 67902, 66271, 62849, 59067, 55907, 53513, 52037, 51909, 53139, 55108, 57147, 58847, 60004, 60959, 62675, 65512, 68113, 68654, 67245, 65833, 65680, 66259, 66920, 68065, 69868, 71192, 71042, 70257, 70549, 72232, 73916, 74224, 73017, 71033, 68945, 66842, 64339, 61230, 58028, 55513, 53848, 52796, 52763, 54615, 58059, 61086, 61837, 60561, 59157, 59106, 60276, 61415, 61449, 60532, 59928, 60476, 61287, 60747, 58785, 57114, 56919, 57485, 57679, 57589, 57768, 57863, 57283, 56646, 57292, 59460, 62013, 63924, 65186, 66156, 66864, 67257, 67711, 68929, 71381, 74811, 78302, 80967, 82675, 83912, 85072, 86360, 88244, 91210, 94881, 98219, 100963, 103970, 107583, 110571, 111594, 111059, 110454, 110220, 109447, 107513, 104966, 102594]
55039A02594j981j516p84k90r53k475l097j595R94K429J851O56N89J764L045L718
55023A04949L831L318J876p1j446j808j701j425m99J135K396K291J117k45j404
55008A12314k131j904p03L55K24o81j146q32m45n83j160j670j542o14L94M52l57
54991I9971q07l24K21P5j75J49N32L07m9R9K52k51p65k98O90Q91Q8p59r06k23
54971I8718J230K935L807L399K583K112J526N68L96J767L186K786J181M40R20
54956A27554J226P05n4q47j875k472j886j131j829l364l354j075J697L448M308
54941A21051M460L476J840J097J621K012J380N96N09O56M97L59K61p70l074n178
54925A30793n335l530j235J76L96Q8J55O92P73j44j128j029j50M92R04J569J895
$$ y = [102594, 100613, 99097, 98313, 98023, 97070, 94595, 91498, 89903, 90897, 93326, 95177, 95833, 96422, 98186, 101231, 104949, 108780, 112098, 113974, 113903, 112457, 110649, 108948, 107523, 107024, 108159, 110555, 112846, 113963, 113718, 112314, 110183, 108279, 107576, 107931, 108155, 107474, 106328, 105496, 105051, 104468, 103308, 101638, 100096, 99482, 99876, 100328, 99971, 99164, 98840, 99061, 99136, 98961, 99110, 99642, 99949, 99900, 99999, 100251, 100000, 99235, 98937, 99627, 100518, 100606, 99847, 98941, 98718, 99948, 102883, 106690, 110089, 112672, 114784, 116310, 116878, 117274, 119041, 122227, 125013, 126194, 126634, 127554, 128780, 129485, 129431, 128584, 126709, 124237, 122351, 121220, 119391, 116027, 112673, 111598, 113295, 116743, 121051, 125511, 128987, 130827, 131924, 133545, 135557, 136937, 137533, 138042, 138698, 139195, 139554, 139815, 139045, 135971, 130793, 125458, 121928, 120693, 120869, 121265, 121353, 121508, 122200, 122973, 122829, 121701, 120672, 120522, 121014, 121918, 123487, 125382]
54908A25382J089N5L66J616K037J568J827K922K954J280k00pR46J334J371J668
54892A46208J907J860K129K965L640L827M154M880N502O113P422Q975R407Q878
54878B17867R191J0772J1806J1283J0497J0447J0167R013Q151Q081O952L317j387
54865C26157n088p942j0896j3224j3787j3300j3055j2600j0960r008q337q562
54853A99398q027o539n302m716m136l472l218l296l207k916k326p10K016M381
54839A57930N171N214N874O897P475Q167R763J1293J1415J0905J1491J2835J3102
54826B77532J1879J0095P467K795l148p650r494j0115j1025j2130j3109j4208
54814B28889j4980j4174j1724r190p470n757l512j756j507k258l026l609l952
$$ y = [125382, 126471, 126526, 126892, 128508, 130545, 132113, 133940, 136862, 139816, 141096, 140896, 140889, 141835, 143169, 144540, 146208, 148115, 149975, 152104, 155069, 158709, 162536, 166690, 171570, 177072, 183185, 190607, 199582, 208989, 217867, 227058, 237830, 249636, 260919, 271416, 281863, 292030, 301043, 309194, 317275, 324227, 327544, 326157, 321069, 313127, 302231, 289007, 275220, 261920, 248865, 236265, 225305, 216297, 207960, 199398, 191371, 184832, 179530, 174814, 170678, 167206, 163988, 160692, 157485, 154569, 152243, 151533, 153549, 157930, 163101, 168315, 174189, 181086, 188561, 196728, 206491, 217784, 229199, 240104, 251595, 264430, 277532, 289411, 299506, 306973, 309768, 306620, 298970, 289476, 279361, 268336, 256206, 243097, 228889, 213909, 199735, 188011, 178821, 171351, 165594, 162082, 160326, 158819, 156561, 153535, 149926, 145974]
54801A45974l507k202r90n37l91j95m75j269j256L61K162K196P41k26J5K07o35
54784A39973j792k227k119k176k269j797r13l81m03m74m79r71k104l098l333l185
54768A12252l148k852j839o56j53p6M32J210J275M61m39j156k146l164l159j906
54752I4936l16J222L147M999N271L870K823L316L865K908J406J035J261N33o91
54737A29585m39J594L586M182L762L207K991L542M962O374O793O571O882Q010
54723A91602R405J0975J2886J4406J4630J4141J4327J5057J4793J3010J0716Q316
54711C44264M944N44l147m818n430o726q780j0114r733q124o452n350m481l170
54697B73427j493m03k95j1J774M452N938N361M170M243N860P923R506J0553J1422
$$ y = [145974, 142467, 140265, 139275, 138738, 138347, 138152, 137677, 136408, 135152, 135513, 137675, 139871, 140612, 140386, 140401, 140608, 139973, 138181, 135954, 133835, 131659, 129390, 127593, 126680, 126299, 125896, 125422, 124943, 123972, 121868, 118770, 115437, 112252, 109104, 106252, 104413, 103757, 103604, 103528, 103960, 105170, 106445, 106906, 106467, 105311, 103165, 100001, 96842, 94936, 94620, 95842, 98989, 103988, 109259, 113129, 115952, 119268, 123133, 126041, 127447, 128482, 129743, 130276, 129585, 129146, 130740, 134326, 138508, 142270, 145477, 148468, 152010, 156972, 163346, 170139, 176710, 183592, 191602, 201007, 211982, 224868, 239274, 253904, 268045, 282372, 297429, 312222, 325232, 335948, 344264, 349208, 349752, 346605, 341787, 336357, 329631, 320851, 310737, 301004, 292880, 286428, 281078, 276597, 273427, 271934, 271531, 271236, 271225, 272999, 277451, 283389, 288750, 292920, 297163, 303023, 310946, 320452, 331005, 342427]
54682C42427J2041J1589R325O007L741L718M765N045M479M103L721J931j503n121
54668D06268p887j0203j2442j3981j4514j4960j6121j7356j7494j6326j4501j2601
54656B37882j0944r693q580p035n080l517k791k397j916j886k848m066m169k935
54642A70025j676j673k678l291k678j512j030j384j613j226q64r71q21J42Q62
54627A49612O2j442j386Q29L204L714K594J485J372J949K271J583J31n96O58L011
54611A69051M012K671P78N88K098L588M111M284M862N688O199O224N940N394M415
54596B29903L032J752J198J354J476J136J026K136M274O154P089P853R495J1811
54582B89689J3547J3837J3035J2200J2103J2807J4045J5651J7366J8486J8147
$$ y = [342427, 354468, 366057, 375382, 381389, 385130, 388848, 393613, 398658, 403137, 407240, 410961, 412892, 411389, 406268, 398381, 388178, 375736, 361755, 347241, 332281, 316160, 298804, 281310, 264984, 250483, 237882, 226938, 217245, 208665, 201630, 196550, 193033, 190242, 187845, 185929, 184043, 181195, 177129, 172960, 170025, 168349, 166676, 163998, 160707, 158029, 156517, 155487, 154103, 152490, 151264, 150400, 149429, 148608, 148750, 149612, 149674, 148232, 146846, 147675, 150879, 154593, 157187, 158672, 160044, 161993, 164264, 165847, 165978, 165382, 166040, 169051, 173063, 175734, 176512, 177100, 179198, 182786, 186897, 191181, 196043, 201731, 207930, 214154, 220094, 225488, 229903, 232935, 234687, 235885, 237239, 238715, 239851, 240877, 243013, 247287, 253441, 260530, 268383, 277878, 289689, 303236, 317073, 330108, 342308, 354411, 367218, 381263, 396914, 414280, 432766, 450913]
54571D50913J6007J2214O812J4o889j1953j4511j5749j6709j6811j5459j3987
54559C73892j4254j5715j5836j3573j0830r853j0413j0475q837o178l811k208
54547B51909j008j85n83k817n845p599p172n509l690j837k75j96j937l859m434
54532B04963m350m862n224l923j661n63p48l28J018J252n77k574k952k642l384
54517A73445m740m795k974o91M88K68n41r07m61K07M05L67P33J264J074J47n69
54500A62720p08r02j366j354m91M84Q35P39O91Q74J475K569L502L384K472J971
54484A76895K287K610K409K087J931J680J529K159L454M373M520M513M702M852
54470B20001N263O483P756P752P010P433Q865Q730O139L648L315L454J481k091
$$ y = [450913, 466920, 479134, 485946, 485960, 479071, 467118, 452607, 436858, 420149, 403338, 387879, 373892, 359638, 343923, 328087, 314514, 303684, 293831, 283418, 272943, 264106, 257928, 254117, 251909, 250901, 250716, 250133, 247316, 241471, 233872, 226700, 221191, 217501, 215664, 215389, 215193, 213256, 209397, 204963, 200613, 195751, 190527, 186604, 184943, 184380, 183632, 183304, 184322, 185574, 184997, 182423, 179471, 176829, 173445, 168705, 163910, 160936, 160245, 160733, 161001, 160460, 159553, 159092, 159299, 159704, 160071, 160804, 162068, 163142, 163289, 162720, 162012, 161110, 159744, 158390, 157899, 158383, 159218, 159957, 160648, 161522, 162997, 165566, 169068, 172452, 174924, 176895, 179182, 181792, 184201, 186288, 188219, 189899, 191428, 193587, 197041, 201414, 205934, 210447, 215149, 220001, 225264, 231747, 239503, 247255, 254265, 261698, 270563, 279293, 285432, 289080, 292395, 295849, 297330, 295239]
54456B95239m888o375p683q881q979q129p561p553p386o952o697o276m981l336
54442A99562k565k641k396j508q17o87m26M27J402J918J864J273K49o98r18k69
54426A93770Q33J784J957J157L12Q17K608L829L268K060J932K729K986K151Q91
54411B23084k49j116j472j391j574k144j826L13K956L846K529M75j053j783j559
54396B19036l80Q10Q87J68P2J181K645L362K741O82k092l992m066l114k439k113
54380B13388j715j877l308m838m400j973K43N95n90k197l312l051j156J037J747
54365A88593J062O10R77J180Q10P72J446J889J513J005Q51M38o60j779k249k183
54349A94275j584K8K402M151M386L711L129K966L334M367N369N069L523K462K932
$$ y = [295239, 290351, 283976, 276293, 267412, 258433, 250304, 242743, 235190, 227804, 220852, 214155, 207879, 202898, 199562, 196997, 194356, 191960, 190452, 189635, 188948, 188522, 188949, 190351, 192269, 194133, 195406, 195655, 194957, 194039, 193770, 194603, 196387, 198344, 199501, 199813, 200630, 203238, 207067, 210335, 212395, 214327, 217056, 220042, 222193, 223084, 222835, 221719, 220247, 218856, 217282, 215138, 213312, 213625, 216581, 220427, 222956, 223431, 222378, 220595, 219036, 218656, 219466, 220353, 220521, 220593, 221774, 224419, 227781, 230522, 231204, 229112, 225120, 221054, 217940, 215501, 213388, 211673, 209796, 206488, 201650, 197250, 195277, 195520, 196115, 195525, 193328, 190016, 186965, 185809, 186846, 188593, 189655, 190265, 191242, 192422, 193232, 194004, 195450, 197339, 198852, 199857, 200708, 201146, 200486, 198707, 196458, 194275, 192691, 192719, 195121, 199272, 203658, 207369, 210498, 213464, 216798, 221165, 226534, 231603, 235126, 237588, 240520]
54334B40520L843L853L374L458L782L265K023J196J081O72q87l246n231n767m718
54319B47218l235k884l897m722l964k161r67j116k012l015m008m674m188k222
54305B04153J32J076q2j994k596j438k64p93k456l139j870K73J942K931L440L128
54289B02443J861N80M50J437K504K960K960K763K251J357N12K81N96O75mq27o83
54272B22116L40P44l83j953k388j857j760k441k996l185l757m599m402k958k132
54257A88389l350n321n668l972j921r87j208j933k491k252j107J9j14j591l167
54242A53326l577k654j233l56m94j204j644j653j908k721l216k417q73l20j581
54227A27475l453l962k419k3J402J057k96j220r08L97J884K754K514J227l39j265
$$ y = [240520, 244363, 248216, 251590, 255048, 258830, 262095, 264118, 265314, 266395, 267067, 266180, 262934, 257703, 251936, 247218, 243983, 241099, 237202, 232480, 228516, 226355, 225388, 224272, 222260, 219245, 215237, 210563, 206375, 204153, 204285, 205361, 205279, 203285, 200689, 199251, 198987, 198194, 195738, 192599, 190729, 191002, 192944, 195875, 199315, 202443, 204304, 204884, 205334, 206771, 209275, 212235, 215195, 217958, 220209, 221566, 222078, 222359, 222955, 223630, 223626, 222799, 222116, 222456, 223200, 222817, 220864, 218476, 216619, 214859, 212418, 209422, 206237, 202480, 197881, 193479, 190521, 188389, 185039, 179718, 174050, 170078, 168157, 167170, 165962, 164029, 161538, 159286, 158179, 158198, 158084, 156493, 153326, 149749, 147095, 145862, 145506, 145012, 143808, 142164, 140511, 138603, 135882, 132666, 130249, 129376, 129056, 127475, 124022, 120060, 117641, 117618, 119020, 120077, 119781, 118561, 117653, 118050, 119934, 122688, 125202, 126429, 126090, 124825]
54211A24825j244o63M0P59J390J629J308O25j4j82M26J504J923O90j671l249k597
54194A25499j27K383L347K429O43n53o82p05j601k791k857j645m70j09J58J017
54178A23936J823J723J058P35P35K87q49k039k496j860m16Q45Q66k05q88j00J499
54161A24654K428K186J381O55K93N31J293J862J608R34P02Q46M54q45k338l210
54145A33434l393l287l262l502l738l152j210J289K688K307J226Q26J207J514
54131A22947J336J012P76L25o40j928l025l423k778j215L49P26k13j212j098k59
54115A11680P8k91l42M91J473J779J544J165M05r98k511l403l602l238j984P9
54099A02325J632J456K43j85P55J983K524K373J717P30L0M7q6j376k754k062L79
$$ y = [124825, 123581, 122918, 122958, 123717, 125107, 126736, 128044, 128669, 128655, 128473, 128899, 130403, 132326, 133016, 131345, 128096, 125499, 125372, 127755, 131102, 133531, 134174, 133621, 132939, 132234, 130633, 127842, 124985, 123340, 122870, 122761, 122919, 123936, 125759, 127482, 128540, 129275, 130010, 130297, 129448, 127409, 124913, 123053, 122637, 123482, 124348, 124143, 123255, 123155, 124654, 127082, 129268, 130649, 131304, 131597, 132128, 133421, 135283, 136891, 137825, 138527, 139373, 139827, 138982, 136644, 133434, 130041, 126754, 123492, 119990, 116252, 113100, 111890, 113179, 115867, 118174, 119400, 120226, 121433, 122947, 124283, 125295, 126071, 126396, 125756, 123828, 120803, 117380, 114602, 113387, 113736, 114462, 114249, 113037, 111939, 111680, 111758, 111467, 111125, 111616, 113089, 114868, 116412, 117577, 117982, 116984, 114473, 111070, 107468, 104230, 102246, 102325, 103957, 105413, 105656, 105471, 106226, 108209, 110733, 113106, 114823, 115553, 115583, 115630, 115544, 114168, 111414, 109352, 109731]
54082A09731J448m69k889k655j84J567J266K01k82k83m04q10j407j827j372L0
54066A01661J133P62m13q52n67j001k424l093j746M90J538R31o1l43q1N2KL19
54048I6307J217K032J879Q46K2J04M50M8r49j439r05p1J10m52j080j064j62J195
54030I8088K095J846O93m00p74o28m98m69k26K58M61K3n57l63O83J642J891J960
54012A05725K385K509J547L68P09K597M053L743K406J135j72j681k397j503J42
53997A21566J213J760K458K903K295J247J067J525J204M4l18Q45K195K379J822
53982A44205J546J518J251J090J680K701L265L351L710M428M590L838L434M997
53968A85604Q272J1057J1588J0387R303R246R647R698R001P139M041J183P78K921
$$ y = [109731, 111179, 110710, 107821, 105166, 104982, 106549, 107815, 108016, 107734, 107451, 107047, 106237, 104830, 103003, 101631, 101661, 102794, 103556, 103143, 102291, 101724, 100723, 98299, 95206, 93460, 93950, 95488, 96419, 96358, 96015, 95934, 95986, 95988, 96307, 97524, 99556, 101435, 102281, 102303, 102407, 102857, 102905, 101956, 100517, 99612, 99541, 99651, 99199, 98119, 97055, 96893, 98088, 100183, 102029, 102722, 102322, 101548, 100920, 100422, 99953, 99727, 99985, 100446, 100469, 99912, 99549, 100232, 101874, 103765, 105725, 108110, 110619, 112166, 112534, 113243, 115840, 119893, 123636, 126042, 127177, 127005, 125324, 122927, 121424, 121566, 122779, 124539, 126997, 129900, 132195, 133442, 134509, 136034, 137238, 137282, 136964, 137809, 140004, 142383, 144205, 145751, 147269, 148520, 149610, 151290, 153991, 157256, 160607, 164317, 168745, 173335, 177173, 180607, 185604, 193876, 204933, 216521, 226908, 236211, 245457, 255104, 264802, 273803, 280942, 284983, 286166, 286944, 289865]
53954B89865M915M657L401L487M507L994J474o40p25k55j392l859n562n392m074
53939B94401k735j844j510j981l531n918q114q797p636n910n221n571n461m039
53925B26133k269j550j934k406k499k766l725m870n021l640j592m35q09j783j993
53910A88841j153j37K29N0J24J047K334K448L94k508l482j499J337K595K459K474
53894A95553K559J483j82k46J656L217K876J932K132K976L008K332K137K681L353
53879B27467L994M737N109M681M132M450N466O330O916P464P430O117M174K897
53865C01364K264J330M45J102L128M035K346m8l08J647L516M058M304N336O538
53850C41057O777O197N869O259O918P423P857Q349Q780R026Q993Q281O406L719
$$ y = [289865, 294780, 299437, 302838, 306325, 310832, 314826, 316300, 315660, 314935, 314680, 313288, 309429, 303867, 298475, 294401, 291666, 289822, 288312, 286331, 282800, 276882, 268768, 259971, 252335, 246425, 241204, 235633, 230172, 226133, 223864, 222314, 220380, 217974, 215475, 212709, 208984, 204114, 199093, 195453, 193861, 193426, 192617, 190834, 188841, 187688, 187551, 187780, 187830, 187954, 189001, 191335, 193783, 194177, 191669, 188187, 186688, 188025, 190620, 193079, 195553, 198112, 199595, 199413, 199167, 200823, 204040, 206916, 208848, 210980, 213956, 216964, 219296, 221433, 224114, 227467, 231461, 236198, 241307, 245988, 250120, 254570, 260036, 266366, 273282, 280746, 288176, 294293, 298467, 301364, 303628, 304958, 305403, 306505, 309633, 313668, 316014, 315966, 315658, 317305, 320821, 324879, 329183, 334519, 341057, 347834, 354031, 359900, 366159, 373077, 380500, 388357, 396706, 405486, 414512, 423505, 431786, 438192, 441911]
53836D41911J565R51J332J216j51k235m157n448n924n536m789m605n298n995n776
53821C97061n041n102o353p561p406o267n844p080r075j0307j0319r630q461o601
53807B92014m556l651m439n784o247n711m906m085l308l352m810o527o487m466
53793B23685k444j876k027j698j275j879l342m326m033k860j596p74o07q43r31
53778A93174q19j231k524l780l851k901j963j285k36J146J749R92mM60K614M820
53762A86361N131L179N66o74r2R22J007M18K87Q29J294J396J700K413K946L029
53746B10712L234L809L904K886J660J672K985M462N544O592P518P477O459N937
53732B74851O976Q526Q680P252N914N881O535O614N804M659L612K682J863J234
$$ y = [441911, 443476, 444427, 445759, 446975, 446824, 444589, 440432, 434984, 429060, 423524, 418735, 414130, 408832, 402837, 397061, 392020, 386918, 380565, 373004, 365598, 359331, 353487, 346407, 337332, 327025, 316706, 307076, 298615, 292014, 287458, 283807, 279368, 273584, 267337, 261626, 256720, 252635, 249327, 245975, 241165, 234638, 228151, 223685, 221241, 219365, 217338, 215640, 214365, 212486, 209144, 204818, 200785, 197925, 196329, 195555, 194948, 194105, 193174, 192355, 191124, 188600, 184820, 180969, 178068, 176105, 174820, 174584, 175730, 177479, 178471, 178467, 178927, 181541, 186361, 191492, 194671, 195237, 194563, 194471, 195393, 196400, 196818, 197105, 197934, 199228, 200624, 202324, 204737, 207683, 210712, 213946, 217755, 221659, 224545, 226205, 227877, 230862, 235324, 240868, 247460, 254978, 262455, 268914, 274851, 281827, 290353, 299033, 306285, 312199, 318080, 324615, 331229, 337033, 341692, 345304, 347986, 349849, 351083]
53718C51083Q07M76L9p79k057l346l999l972l887m148m488m586m578m601m382
53703C07582l716k866k119j521j326k042l412m243l989l714m490n567n414m041
53689B59122k901k731k838k451j512j92J129J520M80q54r59l70j008k927l842
53674B39666k592r96r61j671j224L46J508J677J378P14n32j636j402Q7J467J670
53658B37499O40j107k545k294l5K492L219K098O60k76q61o55J190L970N482M676
53642B54153K865J707J292R34O36Q78J747K968M229N052N025M524M420M814M996
53627C00240M919N454O576O654M646J971R89K188L998N034N169M742L867K836
53613C59283K257K299K344J718O24M3P13K211L118K406N55j075j785j815j224
$$ y = [351083, 351890, 352366, 352405, 351626, 349569, 346223, 342224, 338252, 334365, 330217, 325729, 321143, 316565, 311964, 307582, 303866, 301000, 298881, 297360, 296034, 293992, 290580, 286337, 282348, 278634, 274144, 268577, 263163, 259122, 256221, 253490, 250652, 248201, 246689, 246497, 247626, 249146, 249626, 248772, 247813, 247443, 246435, 243508, 239666, 237074, 236078, 235117, 233446, 232222, 232568, 234076, 235753, 237131, 237845, 237313, 235677, 234275, 234362, 235829, 237499, 238139, 237032, 234487, 232193, 232158, 234650, 237869, 239967, 240627, 240351, 239490, 238835, 240025, 243995, 249477, 254153, 257018, 258725, 260017, 260951, 261587, 262465, 264212, 267180, 271409, 276461, 281486, 286010, 290430, 295244, 300240, 305159, 310613, 317189, 323843, 328489, 330460, 331449, 333637, 337635, 342669, 347838, 352580, 356447, 359283, 361540, 363839, 366183, 367901, 368525, 368568, 369281, 371492, 374610, 377016, 377571, 376496, 374711, 372896, 371672]
53598C71672L57K496L579K611N95q08j307j620j708q50P02J593J187L29j65o07
53582C78056j364j695p40Q27J291N6j587k102j474q27p26n13N46K069K949K680
53566C77446J796R55L79K94J282L429N515N884M262K261J856L638O470Q535Q677
53551D32679P194N543N064N808O698O790O248O045O912Q553R816R774Q730P861
53537E33715P746P622O580M995M119M438N196N543N423N259N343N764O303O405
53523F14451N745M916M853N516O015O055O268O727O327M414K048O45Q1p25j846
53508F71490k180j161L90J235Q26m77j704j892j017j21k9k74J8O99R53O37K45
53491F67638j79q73j343q62O2J07p77j140k24J049J806K471L599M722N327N767
$$ y = [371672, 372029, 374525, 378104, 380715, 381310, 380502, 379195, 377575, 375867, 375017, 375719, 377312, 378499, 378828, 378663, 378056, 376692, 374997, 374257, 375084, 376375, 376431, 374844, 372742, 371268, 370441, 369715, 369202, 369748, 371817, 374766, 377446, 379242, 380197, 380576, 380870, 382152, 385581, 391096, 396980, 401242, 403503, 405359, 408997, 415467, 424002, 432679, 439873, 445416, 450480, 456288, 462986, 469776, 476024, 482069, 488981, 497534, 507350, 517124, 525854, 533715, 541461, 549083, 555663, 560658, 564777, 569215, 574411, 579954, 585377, 590636, 595979, 601743, 608046, 614451, 620196, 625112, 629965, 635481, 641496, 647551, 653819, 660546, 666873, 671287, 673335, 673980, 674061, 673336, 671490, 669310, 668149, 668539, 669774, 670600, 670123, 668419, 666527, 665510, 665389, 665360, 665086, 665104, 665803, 666756, 667393, 667638, 667459, 666586, 665243, 664381, 664443, 664550, 663773, 662633, 662409, 663458, 665264, 667735, 671334, 676056, 681383, 687150]
53475F87150O190N809M341L278M201O518Q217Q509Q435R112J0506J1938J2939
53462G87143J3629J4778J7148K0304K2689K3506K3738K4466K5181K5002K4641
53451A022225K5543K7651K9728L1485L3645L6062L7665L8447L9697M1819M3593
53440A407560M4198M4500M5496M6894M8123M9598N1951N4675N6491N6640N5413
53429A961539N3903N3363N4097N4805N3888N1663N0270N1086N3300N5318N6407
53418B549639N6474N5550N4232N3606N3886N3945N2726N0254M6854M2663L8558
53407C108387L6148L5705L5174L2474K8004K3912K1658K1148K1316K0531J7412
53396C401869J2326P330L725O04l260p424j1008j4534j8728k2639k5051k7055
$$ y = [687150, 693340, 699149, 703490, 706768, 710969, 717487, 725704, 734213, 742648, 751760, 762266, 774204, 787143, 800772, 815550, 832698, 853002, 875691, 899197, 922935, 947401, 972582, 997584, 1022225, 1047768, 1075419, 1105147, 1136632, 1170277, 1206339, 1244004, 1282451, 1322148, 1363967, 1407560, 1451758, 1496258, 1541754, 1588648, 1636771, 1686369, 1738320, 1792995, 1849486, 1906126, 1961539, 2015442, 2068805, 2122902, 2177707, 2231595, 2283258, 2333528, 2384614, 2437914, 2493232, 2549639, 2606113, 2661663, 2715895, 2769501, 2823387, 2877332, 2930058, 2980312, 3027166, 3069829, 3108387, 3144535, 3180240, 3215414, 3247888, 3275892, 3299804, 3321462, 3342610, 3363926, 3384457, 3401869, 3414195, 3421525, 3425250, 3425854, 3422594, 3415170, 3404162, 3389628, 3370900, 3348261, 3323210, 3296155]
53384C296155l0900l6533m1458m4022m4910m5186m4931m4319m4364m5664m7564
53373B826304m9079m9726m9339m8088m6821m6240m5715m4034m1275l8555l5988
53362B331444l2522k8025k3787k0513j7431j3898j0307o775k635J901N274O983
53350B189709R079J3808K0774K7652L2912L6646L9513M2128M4932M7742M9860
53339B554755N1392N3606N7177O1097O4335O7567P1797P6252P9341Q1318Q4173
53328C302810Q8896R4359R9118J02884J05934J08275J10079J11974J14275J16480
53318D355084J18067J19307J20811J22592J23864J23806J22271J19772J16682
53309E442256J12566J06781R9742R2879Q6932Q0966P3829O5937N8634N2255M5898
$$ y = [3296155, 3265255, 3228722, 3187264, 3143242, 3098332, 3053146, 3008215, 2963896, 2919532, 2873868, 2826304, 2777225, 2727499, 2678160, 2630072, 2583251, 2537011, 2491296, 2447262, 2405987, 2367432, 2331444, 2298922, 2270897, 2247110, 2226597, 2209166, 2195268, 2184961, 2178186, 2175551, 2177452, 2182726, 2189709, 2198788, 2212596, 2233370, 2261022, 2293934, 2330580, 2370093, 2412221, 2457153, 2504895, 2554755, 2606147, 2659753, 2716930, 2778027, 2842362, 2909929, 2981726, 3057978, 3137319, 3218637, 3302810, 3391706, 3486065, 3585183, 3688067, 3794001, 3902276, 4012355, 4124329, 4238604, 4355084, 4473151, 4592458, 4713269, 4835861, 4959725, 5083531, 5205802, 5325574, 5442256, 5554822, 5661603, 5761345, 5854224, 5941156, 6022122, 6095951, 6161888, 6220522, 6272777, 6318675]
53298F318675L9059L2311K6148K0053J3131N024m084j3776k3562l3386m4138n7021
53286F278434p1909q6846r9601j09413j16902j22694j26730j28884j29647j29869
53276E155939j29891j29325j27846j25982j24682j24071j23244j21431j18791
53267D030676j15804j12563j09156j06040j03283j00090r5968r1713q8066q3942
53257C024051p7644o9785o3201n9372n6494n2086m6242m1028l7500l4739l1568
53246B454392k7929k4305k0683j6532j1640o721l008q65R32L806P209R029Q596
53233B372281Q093R798J3122J5863J7638K0077K3878K7748L0812L4073L8365M2474
53221B654222M4841M6125M8401N2164N5634N7039N6335N4505N2320N0245M8670
$$ y = [6318675, 6357734, 6390045, 6416193, 6436246, 6449377, 6454401, 6450317, 6436541, 6412979, 6379593, 6335455, 6278434, 6206525, 6119679, 6020078, 5910665, 5793763, 5671069, 5544339, 5415455, 5285808, 5155939, 5026048, 4896723, 4768877, 4642895, 4518213, 4394142, 4270898, 4149467, 4030676, 3914872, 3802309, 3693153, 3587113, 3483830, 3383740, 3287772, 3196059, 3107993, 3024051, 2946407, 2876622, 2813421, 2754049, 2697555, 2645469, 2599227, 2558199, 2520699, 2485960, 2454392, 2426463, 2402158, 2381475, 2364943, 2353303, 2346582, 2343574, 2342709, 2343641, 2347447, 2354656, 2363685, 2372281, 2380374, 2390172, 2403294, 2419157, 2436795, 2456872, 2480750, 2508498, 2539310, 2573383, 2611748, 2654222, 2699063, 2745188, 2793589, 2845753, 2901387, 2958426, 3014761, 3069266, 3121586, 3171831, 3220501]
53210C220501M7583M6293M4049M0697L6702L2799K9696K7675K6171K4182K1256
53199C597604J7854J4509J0977O609J311m196r107j3308j7505k2570k8664l5062
53187C518452m1044m6812n3099n9771o5491o9050p0694p1734p3158p4989p6610
53176B816000p7247p6307p3843p0606o7373o4311o1387n9055n7941n7915n8016
53165B091999n7498n6444n5425n5052n5815n7535n8746n7425n3018m7321m2747
53154A494973l9943l7689l4861l1767k9467k8430k8159k7760k6614k4881k3587
53143A161815k3836k5517k6911k6148k3197j9967j8270j8067j8070j7690j7649
53132I26493j8577j9781k0035j9113j7995j7545j7683j7985j8423j9086j9536
$$ y = [3220501, 3268084, 3314377, 3358426, 3399123, 3435825, 3468624, 3498320, 3525995, 3552166, 3576348, 3597604, 3615458, 3629967, 3640944, 3647553, 3648864, 3644668, 3635561, 3622253, 3604748, 3582178, 3553514, 3518452, 3477408, 3430596, 3377497, 3317726, 3252235, 3183185, 3112491, 3040757, 2967599, 2892610, 2816000, 2738753, 2662446, 2588603, 2517997, 2450624, 2386313, 2324926, 2265871, 2207930, 2150015, 2091999, 2034501, 1978057, 1922632, 1867580, 1811765, 1754230, 1695484, 1638059, 1585041, 1537720, 1494973, 1455030, 1417341, 1382480, 1350713, 1321246, 1292816, 1264657, 1236897, 1210283, 1185402, 1161815, 1137979, 1112462, 1085551, 1059403, 1036206, 1016239, 997969, 979902, 961832, 944142, 926493, 907916, 888135, 868100, 848987, 830992, 813447, 795764, 777779, 759356, 740270, 720734]
53121G20734j9021j7350j5176j3380j2443j2352j2752j3023j2648j1777j1217
53110E69595j1502j2102j1961j0779r386q691q708q781q402p509o277n119m656
53097D55722n190o253p025p276p455p897q328q222p242n331k916j018n93j442
53083C79534k371k689k896l491l891l409k695l038m363n090m317l028k552k631
53069C33073k023n67N04M35N3M67J340J316q2j811k651k497k042j831j997k430
53053C19257k749k509j811j356j382j190l18N09M85J15K86M82n46k447l370k634
53037C00822j628j517j761j711j981l077m062l983l494l562l647k752j381p42
53023B65524o06J17J137R93m24j348m96J444K962L283K593J721J635K351K652
$$ y = [720734, 701713, 684363, 669187, 655807, 643364, 631012, 618260, 605237, 592589, 580812, 569595, 558093, 545991, 534030, 523251, 513865, 505174, 496466, 487685, 479283, 471774, 465497, 460378, 455722, 450532, 444279, 437254, 429978, 422523, 414626, 406298, 398076, 390834, 385503, 382587, 381569, 380976, 379534, 377163, 374474, 371578, 368087, 364196, 360787, 358092, 355054, 350691, 345601, 341284, 338256, 335704, 333073, 331050, 330483, 330987, 331422, 331475, 331942, 333282, 334598, 334516, 332705, 330054, 327557, 325515, 323684, 321687, 319257, 316508, 313999, 312188, 310832, 309450, 308260, 307942, 308451, 308936, 309051, 309337, 309819, 309273, 306826, 303456, 300822, 299194, 297677, 295916, 294205, 292224, 289147, 285085, 281102, 277608, 274046, 270399, 267647, 266266, 265524, 264918, 265035, 266172, 267165, 266741, 265393, 264897, 266341, 269303, 272586, 275179, 276900, 278535, 280886, 283538]
53008B83538J817J070J816L119K859J104M0L29L8k043m372n087m470l564k240
52993B73954l97M84r59l599n127n120m982n239m835l246j616j260k099l129l666
52978B29164l621l095k187j205p07j140k297l350l737l791l984l939l058j842
52964A91211j390j662j616j236j679k937l210j698k96r01k430k386n36R52O17
52949A70803q17k008k448k179j363m12K77Q37J419J515N76q86j718j479n89M95
52933A62023J471J930J898K149K985L273J947o0p75O0Q42N37k33p16j028j277
52917A75026j057m03k4o7K13J066J519P61o56j592j543o37P16J653J228l25j439
52900A74439j028J41O07J82l1P02J931K713K559J710Q26N21Q91J496J822J737
$$ y = [283538, 285355, 286425, 288241, 291360, 294219, 295323, 295363, 295692, 295730, 293687, 289315, 284228, 279758, 276194, 273954, 273557, 274041, 273082, 269483, 264356, 259236, 254254, 249015, 244180, 240934, 239318, 238058, 235959, 232830, 229164, 225543, 222448, 220261, 219056, 218349, 217209, 214912, 211562, 207825, 204034, 200050, 196111, 193053, 191211, 189821, 188159, 186543, 185307, 183628, 180691, 177481, 175783, 175487, 174586, 172156, 169770, 169234, 170186, 170803, 169986, 167978, 165530, 163351, 161988, 161576, 161853, 162690, 164109, 165624, 166200, 165314, 163596, 162117, 161528, 162023, 163494, 165424, 167322, 169471, 172456, 175729, 177676, 177616, 176841, 176901, 177743, 178280, 178047, 177331, 176303, 175026, 173969, 173566, 173542, 173475, 173688, 174754, 176273, 177034, 176378, 174786, 173243, 172606, 173322, 174975, 176203, 175878, 174439, 173411, 173552, 174159, 174341, 174310, 175012, 176943, 179656, 182215, 183925, 184751, 185272, 186163, 187659, 189481, 191218]
52884A91218J470J407J826K565K941K371J117K28N61K041L769M757M658L951L333
52869B28213K985K742K837L683M778M899L890L127L456L829L161K327K638L211
52855B75776K095m10j845j217k86p03j834k324k024j270R3J700K099O74r99j194
52839B68331n96j192l127m418l702j871o80p43j409j949k276k647k907k446j176
52824B37192j96o40j946k252q09R73J398M37p70j467j581j288j072j486k131j719
52808B22643qJ330R39m7M04K070K707J299o35j324q51k80J01P38J717K561K855
52791B36219K534J709N54o52j549j702p88R63K626L312L019K392J805J206P87
52776B52435R52J461J272j11j627j611K41K428L228K323O65p79j587j539n96M62
$$ y = [191218, 192688, 194095, 195921, 198486, 201427, 203798, 204915, 205143, 205704, 207745, 211514, 216271, 220929, 224880, 228213, 231198, 233940, 236777, 240460, 245238, 250137, 254027, 257154, 260610, 264439, 267600, 269927, 272565, 275776, 277871, 277461, 275616, 274399, 274113, 273410, 271576, 269252, 267228, 265958, 266051, 267751, 269850, 270524, 269525, 268331, 267735, 266543, 263416, 258998, 255296, 253425, 252745, 252002, 250593, 248644, 246368, 243721, 240814, 238368, 237192, 236996, 236356, 234410, 232158, 231349, 232322, 233720, 234157, 233387, 231920, 230339, 229051, 227979, 226493, 224362, 222643, 222635, 223965, 224904, 224857, 225261, 227331, 230038, 231337, 230702, 229378, 228527, 228247, 228348, 229086, 230803, 233364, 236219, 238753, 240462, 241016, 240364, 238815, 237113, 236325, 237288, 239914, 243226, 246245, 248637, 250442, 251648, 252435, 253387, 254848, 256120, 256009, 254382, 252771, 253012, 255440, 258668, 260991, 261656, 260877, 259290, 257751, 257155, 257617]
52760B57617K94j422l224l609k990k856l216k532m41J187Q28m26m80Q44K020K401
52744B43995K814L615L770K476N52n14l13K79K59o43j971l003l229k600j478l96
52728B43613Q8l53j475k604l258l458l337k968k813l567n010n683m687l195l038
52713A98255m120m613l675k562k513k953k670j768j293j483j577j214r22j089
52699A65803j347j297j153j237j293r20m43p49k133l695m150l117j430l29m11
52684A42099j241j807j570j196j871l665m931m061j545N42J038O81L93j54j381
52669A21331k281j414Q65K555K494J574J131J148P51k34j055j131n77J97Q83J124
52653A27361N73n78j478j447q07m59o60p12m1R27J390J259J048Q29J90r05j789
$$ y = [257617, 257911, 256489, 253265, 249656, 246666, 243810, 240594, 238062, 237621, 238808, 239636, 239210, 238730, 239574, 241594, 243995, 246809, 250424, 254194, 256670, 257222, 256708, 256395, 256674, 256933, 256290, 254319, 251316, 248087, 245487, 244009, 243613, 243701, 243348, 241873, 239269, 236011, 232553, 229216, 226248, 223435, 219868, 214858, 209175, 204488, 201293, 198255, 194135, 189522, 185847, 183285, 180772, 177819, 175149, 173381, 172088, 170605, 169028, 167814, 166892, 165803, 164456, 163159, 162006, 160769, 159476, 158556, 158113, 157364, 155231, 151536, 147386, 144269, 142839, 142510, 142099, 140858, 139051, 137481, 136285, 134414, 130749, 125818, 121757, 120212, 120754, 121792, 122473, 122866, 122712, 121331, 119050, 117636, 118501, 121056, 123550, 125124, 126255, 127403, 128154, 127920, 126865, 125734, 125157, 125354, 126237, 127361, 127934, 127356, 125878, 124431, 123624, 123165, 122505, 121793, 121752, 122679, 124069, 125328, 126376, 127205, 127395, 126490, 124701]
52636A24701j968j655j209p00k61k88p44q77n9J355K418K444J267p08k327k283
52620A19106o14J035J295N69m9m94j152j337O0K489L999L831L204L029K470P70
52604A38211q37n41J363K773K609J948K114K849L048K498J941J763J414M15p47
52589A60821j050p8J618L069L484K548O48j078j480n51M52K95j010k403k944k532
52573A59809j764j317j338j241m17P69J192M17o31r28p18r18j583j882j454r07
52557A47089q98j401k076k679k907k397j241j68J51l00r83j344j065j39J137K308
52541A33087K980K944K268J410R94J210J588J601J281J047J207J782K420K196
52527A58015L36k293l176q26K988M920L944K286K257L389L485J537j234k901k693
$$ y = [124701, 122733, 121078, 119869, 119169, 118908, 118620, 117876, 116999, 116940, 118295, 120713, 123157, 124424, 123716, 121389, 119106, 118492, 119527, 120822, 121391, 121342, 120848, 119696, 118359, 118419, 120908, 124907, 128738, 131942, 134971, 137441, 138211, 137374, 136833, 138196, 140969, 143578, 145526, 147640, 150489, 153537, 156035, 157976, 159739, 161153, 161568, 160821, 159771, 159693, 161311, 164380, 167864, 170412, 171060, 169982, 168502, 167951, 168403, 168698, 167688, 165285, 162341, 159809, 158045, 156728, 155390, 154149, 153732, 154501, 155693, 156110, 155479, 154551, 153833, 152915, 151332, 149450, 147996, 147089, 146191, 144790, 142714, 140035, 137128, 134731, 133490, 133322, 133473, 133173, 132190, 130846, 129781, 129642, 130779, 133087, 136067, 139011, 141279, 142689, 143683, 144893, 146481, 148082, 149363, 150410, 151617, 153399, 155819, 158015, 158351, 156058, 152882, 152056, 155044, 159964, 163908, 166194, 168451, 171840, 175325, 176862, 175628, 172727, 170034]
52512A70034j388k56K99R48K151L114K782J547R51J505J893R18p23j414p27L39
52496A81973Q62Q68P43O45O58R45J450J695J244L12l82l91k2J35l7j27P3K96K82
52477A91222J52K9j36j41M55J405J645P59k07k73j47r70j999j316J234L511L781
52460A99004K408N03j462k852k468j99K073K564J725J078Q29J91o32n52M03Q65
52444B03478J87n49j69J025J974K366K608K665J758n31l266m704m057k346j121
52429A99318m89P39K870M268L255M49j802k093j211p12j102j668j622r67l72l57
52413A98504o32m43M35J343J534R56Qr72j609j376j43J426K556L123L282K783
52397B10775J510L57N56J946K809J856j82j505j399q20r40j669j951j256j82M93
$$ y = [170034, 168646, 168390, 168689, 169637, 171788, 174902, 177684, 179231, 180182, 181687, 183580, 184498, 183775, 182361, 181634, 181973, 182835, 183703, 184446, 185091, 185749, 186694, 188144, 189839, 191083, 191395, 191013, 190622, 190600, 190735, 190698, 190571, 190644, 190940, 191222, 191374, 191403, 191267, 191126, 191581, 192986, 194631, 195390, 195183, 194910, 194763, 193793, 191794, 190478, 191712, 195223, 199004, 201412, 201915, 200453, 197601, 195133, 194934, 197007, 199571, 201296, 202374, 203203, 203394, 202762, 202210, 202613, 203478, 203665, 203116, 202947, 203972, 205946, 208312, 210920, 213585, 215343, 214812, 211546, 206842, 202785, 200439, 199318, 198829, 199568, 202438, 206706, 209961, 210410, 208608, 206515, 205304, 204592, 203490, 201822, 200200, 199233, 198861, 198504, 197872, 197429, 197864, 199207, 200741, 201697, 201705, 200733, 199124, 197748, 197605, 199031, 201587, 204710, 207992, 210775, 212285, 212642, 213198, 215144, 217953, 219809, 219627, 218122, 216723, 215903, 214963, 213294, 211343, 210087, 209905, 210398]
52381B10398P92J102J286J037Q40J527K698K756J055q49r77P49K614L135K230
52366B30393Q71K74J063K497K855J246j288k998l322k914k313j550o55K91J330
52351B25780K128J739j34k130k539j359P0J096J972K430J736M01K29J940M028
52336B37387M698L840K479J327P15Q99J531J441M3j498j383O63L036L966L100
52321B62244J557P14R57J502J530J208J156J327J273J297K105L248L239J744L39
$$ y = [210398, 211190, 212292, 213578, 214615, 215455, 216982, 219680, 222436, 223491, 222642, 221665, 222414, 225028, 228163, 230393, 231264, 231538, 232601, 235098, 237953, 239199, 237911, 234913, 231591, 228677, 226364, 224814, 224159, 224450, 225780, 227908, 229647, 229513, 227383, 224844, 223485, 223555, 224651, 226623, 229053, 230789, 231190, 231419, 233359, 237387, 242085, 245925, 248404, 249731, 250446, 251345, 252876, 254317, 254360, 252862, 251479, 252142, 255178, 259144, 262244, 263801, 264515, 265472, 266974, 268504, 269712, 270868, 272195, 273468, 274765, 276870, 280118, 283357, 285101, 285440]
$$ [...]
##END NTUPLES=NMR SPECTRUM
##END=
