##TITLE=coffee_type CCIN01-ROVE100_80-20%
COFFEE_meoh_noesyp64 COFFEE_meoh {C:\Bruker\TOPSPIN} Administrator 1
##JCAMPDX= 6.0         $$ Bruker NMR JCAMP-DX V2.0
##DATA TYPE= NMR SPECTRUM
##DATA CLASS= NTUPLES
##ORIGIN= Bruker BioSpin GmbH
##OWNER= Administrator
$$ 1.72 TOPSPIN		Version 2.1
$$ 2012-05-18 15:50:25.620 -0700  Administrator@X
$$ Compression mode = diff/dup
##.OBSERVE FREQUENCY= 400.13188235
##.OBSERVE NUCLEUS= ^1H
##.ACQUISITION MODE= SIMULTANEOUS (DQD)
##.ACQUISITION SCHEME= undefined
##.AVERAGES= 64
##.DIGITISER RES= 22
##SPECTROMETER/DATA SYSTEM= spect
##.PULSE SEQUENCE= noesygpps1d.comp
##.SOLVENT NAME= COFFEE_meoh
##.SHIFT REFERENCE= INTERNAL, COFFEE_meoh, 1, 14.98061
##AUDIT TRAIL= $$ (NUMBER, WHEN, WHO, WHERE, PROCESS, VERSION, WHAT)
$$ ##TITLE= Audit trail, TOPSPIN		Version 2.1
$$ ##JCAMPDX= 5.01
$$ ##ORIGIN= Bruker BioSpin GmbH
$$ ##OWNER= Administrator
$$ $$ C:\Bruker\TOPSPIN/data/Administrator/nmr/12-COFFEE-2502/112/pdata/1/auditp.txt
$$ ##AUDIT TRAIL=  $$ (NUMBER, WHEN, WHO, WHERE, PROCESS, VERSION, WHAT)
(   1,<2012-02-25 17:26:36.156 -0500>,<Administrator>,<TOPSPIN>,<go>,<TOPSPIN 2.1>,
      <created by zg
	started at 2012-02-25 17:15:05.984 -0500,
	POWCHK enabled, PULCHK disabled,
       configuration hash MD5:
       B0 76 FB 9C 50 81 44 7D 18 B3 26 32 4E 60 AD 96
       data hash MD5: 64K
       89 F7 B4 93 2E B0 FF 13 9B 84 67 FA 14 13 BD BA>)
(   2,<2012-02-25 17:26:38.875 -0500>,<Administrator>,<TOPSPIN>,<proc1d>,<TOPSPIN 2.1>,
      <Start of raw data processing
       efp LB = 0.3 FT_mod = 6 PKNL = 1 PHC0 = 0 PHC1 = 0 SI = 128K 
       data hash MD5: 128K
       A1 51 4D 11 31 06 82 7E 5D 1C 56 36 92 65 7C 79>)
(   3,<2012-02-25 17:26:40.156 -0500>,<Administrator>,<TOPSPIN>,<proc1d>,<TOPSPIN 2.1>,
      <pk PHC0 = 24.47754 PHC1 = 0 
       data hash MD5: 128K
       04 03 EA 63 08 E1 D0 4B 41 D3 CE F6 CA 49 A0 84>)
(   4,<2012-02-25 17:26:40.406 -0500>,<Administrator>,<TOPSPIN>,<proc1d>,<TOPSPIN 2.1>,
      <abs ABSG = 1 
       data hash MD5: 128K
       AF 24 2F 7E 8E D6 5A BF E6 19 C9 0E 28 39 85 55>)
(   5,<2012-02-25 17:26:40.484 -0500>,<Administrator>,<TOPSPIN>,<proc1d>,<TOPSPIN 2.1>,
      <abs ABSG = 2 
       data hash MD5: 128K
       01 06 86 31 EB 99 FA F2 5F 6B 8B 46 F7 E2 70 4A>)
(   6,<2012-02-25 17:26:40.547 -0500>,<Administrator>,<TOPSPIN>,<proc1d>,<TOPSPIN 2.1>,
      <abs ABSG = 3 
       data hash MD5: 128K
       03 23 58 B3 1B EA 6C 97 5D 83 72 3B 03 A5 C4 74>)
(   7,<2012-02-25 17:26:40.797 -0500>,<Administrator>,<TOPSPIN>,<proc1d>,<TOPSPIN 2.1>,
      <abs ABSG = 4 
       data hash MD5: 128K
       7F 36 F4 19 6D CE 54 93 19 F9 17 9F 60 89 88 8E>)
(   8,<2012-02-25 17:26:40.859 -0500>,<Administrator>,<TOPSPIN>,<proc1d>,<TOPSPIN 2.1>,
      <abs ABSG = 5 
       data hash MD5: 128K
       8E 94 7A EA F8 8A 16 C0 72 F8 92 FF D9 12 4B E0>)
(   9,<2012-02-25 17:26:40.984 -0500>,<Administrator>,<TOPSPIN>,<audit>,<TOPSPIN 2.1>,
      <user comment:
       ICON-NMR User ID: Administrator
$$ [...]
150 150 150 150 150 150 150 150
##$TP07= 0
##$TPNAME0= <>
##$TPNAME1= <>
##$TPNAME2= <>
##$TPNAME3= <>
##$TPNAME4= <>
##$TPNAME5= <>
##$TPNAME6= <>
##$TPNAME7= <>
##$TPOAL= (0..7)
0.5 0.5 0.5 0.5 0.5 0.5 0.5 0.5
##$TPOFFS= (0..7)
0 0 0 0 0 0 0 0
##$TUNHIN= 0
##$TUNHOUT= 0
##$TUNXOUT= 0
##$USERA1= <user>
##$USERA2= <user>
##$USERA3= <user>
##$USERA4= <user>
##$USERA5= <user>
##$V9= 5
##$VALIST= <valist>
##$VCLIST= <CCCCCCCCCCCCCCC>
##$VD= 0
##$VDLIST= <DDDDDDDDDDDDDDD>
##$VPLIST= <PPPPPPPPPPPPPPP>
##$VTLIST= <TTTTTTTTTTTTTTT>
##$WBST= 1024
##$WBSW= 4
##$XGAIN= (0..3)
0 0 0 0
##$XL= 0
##$YL= 0
##$YMAX_a= 13837514
##$YMIN_a= -6526253
##$ZGOPTNS= <>
##$ZL1= 120
##$ZL2= 120
##$ZL3= 120
##$ZL4= 120
##$ABSF1= 14.98061
##$ABSF2= -5.57192
##$ABSG= 5
##$ABSL= 3
##$ALPHA= 0
##$AQORDER= 0
##$ASSFAC= 0
##$ASSFACI= 0
##$ASSFACX= 0
##$ASSWID= 0
##$AUNMP= <proc_prof1d_extract>
##$AXLEFT= 0
##$AXNAME= <>
##$AXNUC= <1H>
##$AXRIGHT= 0
##$AXTYPE= 0
##$AXUNIT= <>
##$AZFE= 0.1
##$AZFW= 0.1
##$BCFW= 0
##$BC_mod= 0
##$BYTORDP= 0
##$COROFFS= 0
##$CY= 15
##$DATMOD= 1
##$DC= 0
##$DFILT= <>
##$DTYPP= 0
##$F1P= 0
##$F2P= 0
##$FCOR= 0.5
##$FTSIZE= 131072
##$FT_mod= 6
##$GAMMA= 0
##$GB= 0
##$INTBC= 1
##$INTSCL= 1
##$ISEN= 128
##$LB= 0.3
##$LEV0= 0
##$LPBIN= 0
##$MAXI= 10000
##$MC2= 0
##$MEAN= 0
##$ME_mod= 0
##$MI= 0
##$NCOEF= 0
##$NC_proc= -3
##$NLEV= 6
##$NOISF1= 0
##$NOISF2= 0
##$NSP= 0
##$NTH_PI= 0
##$NZP= 0
##$OFFSET= 14.98061
##$PC= 1
##$PHC0= 24.47754
##$PHC1= 0
##$PH_mod= 1
##$PKNL= yes
##$PPARMOD= 0
##$PPDIAG= 0
##$PPIPTYP= 0
##$PPMPNUM= 2147483647
##$PPRESOL= 1
##$PSCAL= 4
##$PSIGN= 0
##$PYNMP= <proc.py>
##$REVERSE= no
##$SF= 400.13
##$SI= 131072
##$SIGF1= 0
##$SIGF2= 0
##$SINO= 400
##$SIOLD= 131072
##$SPECTYP= <>
##$SREGLST= <1H.CDCl3>
##$SSB= 0
##$STSI= 131072
##$STSR= 0
##$SW_p= 8223.68421052632
##$SYMM= 0
##$S_DEV= 0
##$TDeff= 65536
##$TDoff= 0
##$TI= <>
##$TILT= no
##$TM1= 0
##$TM2= 0
##$TOPLEV= 0
##$USERP1= <user>
##$USERP2= <user>
##$USERP3= <user>
##$USERP4= <user>
##$USERP5= <user>
##$WDW= 1
##$XDIM= 131072
##$YMAX_p= 500072044
##$YMIN_p= -340413449
##$CURPLOT= <Network HP LaserJet P1505>
##$CURPRIN= <$Network HP LaserJet P1505>
##$DFORMAT= <normdp>
##$LAYOUT= <+/1D_H.xwp>
##$LFORMAT= <normlp>
##$PFORMAT= <normpl>
##$SURQMSG= 1
$$ End of Bruker specific parameters
$$ ---------------------------------
##NTUPLES= NMR SPECTRUM
##VAR_NAME=  FREQUENCY,     SPECTRUM/REAL,   SPECTRUM/IMAG
##SYMBOL=    X,             R,               I
##VAR_TYPE=  INDEPENDENT,   DEPENDENT,       DEPENDENT
##VAR_FORM=  AFFN,          ASDF,            ASDF
##VAR_DIM=   131072,        131072,          131072
##UNITS=     HZ,            ARBITRARY UNITS, ARBITRARY UNITS
##FACTOR=    0.0627417313425165, 1,          1
##FIRST=     8223.62146879498, -712,         -91134
##LAST=      0,             1015,            -93778
##MIN=       0,             -340413449,      0
##MAX=       8223.62146879498, 500072044,    0
$$ Real data points
##PAGE= N=1
##DATA TABLE= (X++(R..R)), XYDATA
$$ [...]
62988A926074M9076N0124M9964N0667N3470N6985N8746N8026N6300N5313N5476
62977B520221N6123N6519N6222N4992N2995N1014M9866M9429M8614M6546M3480
62966C086021M0093L6212L0751K3003J3455L126p440j8276k9349m0106m9566n6756
62954C031168o1303o3637o4490o4198o2706o0162n6946n3125m8433m2890l6847
62943B416431l0379k3327j6153r869m728J21N149R557J2661J5233J8312K1408
62931B414416K3221K3793K4468K5789K6737K6218K4232K1365J8162J5176J2662
62920B656239R893N669k18o786j3286j9869k6746l3768m1075m8979n6688o2370
62908B362016o5288o6901o9019p1673p3555p3743p2083o8663o4083n9741n6750
$$ y = [1926074, 1975150, 2025274, 2075238, 2125905, 2179375, 2236360, 2295106, 2353132, 2409432, 2464745, 2520221, 2576344, 2632863, 2689085, 2744077, 2797072, 2848086, 2897952, 2947381, 2995995, 3042541, 3086021, 3126114, 3162326, 3193077, 3216080, 3229535, 3232661, 3225221, 3206945, 3177596, 3137490, 3087924, 3031168, 2969865, 2906228, 2841738, 2777540, 2714834, 2654672, 2597726, 2544601, 2496168, 2453278, 2416431, 2386052, 2362725, 2346572, 2336703, 2331975, 2332096, 2337245, 2346802, 2359463, 2374696, 2393008, 2414416, 2437637, 2461430, 2485898, 2511687, 2538424, 2564642, 2588874, 2610239, 2628401, 2643577, 2656239, 2666132, 2671801, 2671583, 2664797, 2651511, 2631642, 2604896, 2571128, 2530053, 2481074, 2424386, 2362016, 2296728, 2229827, 2160808, 2089135, 2015580, 1941837, 1869754, 1801091, 1737008, 1677267, 1620517]
62897A620517n4666n2080m8287m3720l9145l5180l2243l0177k8133k5550k2966
62886A208370k1167j9960j8629j7208j6378j6177j5839j4859j3455j2016j0903
62875A031779j0689j1713j3266j4059j3610j2573j1734j1324j1306j1536j1587
62864H98382j1108j0360r651q546o608m718m410n685o779o448n267m160l032j678
62850H09932q95j395k394k420j157M62J553J811J123k83j494j601q11j80l58j126
62834H00767j927k179j303O83K654L277K496J405O97mj070j998k006r97L66J249
62818H02110J138K58m30j43O49P28j52p21P4J403J372p56l805o071o844o448n498
62801G76864m472l730l393l200k807k347k400l189m030l984l005k002j735k046
$$ y = [1620517, 1565851, 1513771, 1465484, 1421764, 1382619, 1347439, 1315196, 1285019, 1256886, 1231336, 1208370, 1187203, 1167243, 1148614, 1131406, 1115028, 1098851, 1083012, 1068153, 1054698, 1042682, 1031779, 1021090, 1009377, 996111, 982052, 968442, 955869, 944135, 932811, 921505, 909969, 898382, 887274, 876914, 867263, 858717, 852109, 847391, 842981, 837296, 830517, 824069, 818802, 814642, 811610, 809932, 809037, 807642, 805248, 802828, 801671, 802133, 803686, 805497, 806620, 806337, 804843, 803242, 802431, 802251, 801893, 800767, 798840, 796661, 795358, 796041, 798695, 801972, 804468, 805873, 806570, 806566, 805496, 803498, 801492, 800495, 800861, 802110, 803248, 803506, 803076, 802933, 803582, 804310, 804158, 803437, 803511, 804914, 806286, 805530, 801725, 795654, 788810, 782362, 776864, 772392, 768662, 765269, 762069, 759262, 756915, 754515, 751326, 747296, 743312, 740307, 738305, 736570, 734524]
62787G34524k409k686k881k630j572q7R14R43K27q27j864k344j710p3J795L251
62771G22571M185M573M214L219K221J741J671J730J946K397K761K628K062J563
62757G59482J558K105K915L505L550L263L117L125K862K344K349L333M607N127
62743H03242M867M769N437O474P135P270P592R148J2258J5786J7840J7723J6928
62730I36469J7663K0577K4371K7377K8964K9629L0453L2522L6176M0713M5174
62719A270088M9391N3820N8569O3217O7485P1399P4845P7730Q0611Q4309Q8612
62708B040076R2099R3556R2884R0387Q5977P9528P1286O1372M9502L5763K1104
62697B813534O474q024k2548l6630m9585o1380p2240q1634q8484r2347r3775r3529
$$ y = [734524, 732115, 729429, 726548, 723918, 722346, 722259, 723173, 724116, 724343, 723516, 721652, 719308, 717598, 717525, 719320, 722571, 726756, 731329, 735543, 738762, 740983, 742724, 744395, 746125, 748071, 750468, 753229, 755857, 757919, 759482, 761040, 763145, 766060, 769565, 773115, 776378, 779495, 782620, 785482, 787826, 790175, 793508, 798115, 803242, 808109, 812878, 818315, 824789, 831924, 839194, 846786, 855934, 868192, 883978, 901818, 919541, 936469, 954132, 974709, 999080, 1026457, 1055421, 1085050, 1115503, 1148025, 1184201, 1224914, 1270088, 1319479, 1373299, 1431868, 1495085, 1562570, 1633969, 1708814, 1786544, 1867155, 1951464, 2040076, 2132175, 2225731, 2318615, 2409002, 2494979, 2574507, 2645793, 2707165, 2756667, 2792430, 2813534, 2820008, 2811984, 2789436, 2752806, 2703221, 2641841, 2569601, 2487967, 2399483, 2307136, 2213361, 2119832]
62685B119832r2091q9938q7566q5032q1884p7738p2708o7255o2004n7580n4096
62674A291940n0772m6600m1627l7162l4370l2898l1243k8371k4717k1489j9204
62663I23487j7195j4678j1947j0031r234q611p168n086l273j994m94K001N247
62650H41024Q027R237R080R107J0701J3587J6316J8262K0244K3040K6387K9948
62638A034960L4187L9140M3380M5687M7185N0166N4927N9462O2391O4576O7190
62627A603251O9646P0382O8775O5472O1459N7349N2975M7249L9116K9026J8575
62616B183275Q267l256j7007l1670m4734n4801o1861o6251o8571p0055p1536p2363
62604A629437p1529o9571o7976o6827o4549o0257n4981n0096m5762m1596l7869
$$ y = [2119832, 2027741, 1937803, 1850237, 1765205, 1683321, 1605583, 1532875, 1465620, 1403616, 1346036, 1291940, 1241168, 1194568, 1152941, 1115779, 1081409, 1048511, 1017268, 988897, 964180, 942691, 923487, 906292, 891614, 879667, 869636, 860402, 851791, 844623, 839537, 836264, 834270, 833776, 835777, 841024, 849051, 858288, 867368, 876475, 887176, 900763, 917079, 935341, 955585, 978625, 1005012, 1034960, 1069147, 1108287, 1151667, 1197354, 1244539, 1294705, 1349632, 1409094, 1471485, 1536061, 1603251, 1672897, 1743279, 1812054, 1877526, 1938985, 1996334, 2049309, 2096558, 2135674, 2164700, 2183275, 2191542, 2188286, 2171279, 2139609, 2094875, 2040074, 1978213, 1911962, 1843391, 1773336, 1701800, 1629437, 1557908, 1488337, 1420361, 1353534, 1288985, 1228728, 1173747, 1123651, 1077889, 1036293, 998424]
62593I98424l5119l3128l1139k8827k6471k4463k3020k2077k1023j8948j5629
62582G18580j2124r873r405j0205j1512j2712j3122j2203j0254q411p567p369
62570E93823o703n126l497k901l245l435k921k412k605k864k002j47J254J448
62556E58667J453K587M660O281O598N929N079M744N497P539J0225J2404J3474
62543F45137J3695J3493J3083J3024J4397J7644K1475K3814K4002K3627K4845
62532H48236K8189L2285L5574L7882M0246M3388M6654M8559M8302M6560M4656
62521A300531M3186M1671L9366L5969L1479K5807J8835J0579J105r256j9311k7140
62509A492821l1645l3876l6032l9038m1818m3136m3352m3705m4349m3995m1529
$$ y = [998424, 963305, 930177, 899038, 870211, 843740, 819277, 796257, 774180, 753157, 734209, 718580, 706456, 696583, 687178, 676973, 665461, 652749, 639627, 627424, 617170, 608759, 601192, 593823, 587120, 581994, 578497, 575596, 572351, 568916, 565995, 563583, 560978, 558114, 556112, 555965, 557219, 558667, 560120, 562707, 567367, 573648, 580246, 586175, 591254, 595998, 601495, 609034, 619259, 631663, 645137, 658832, 672325, 685408, 698432, 712829, 730473, 751948, 775762, 799764, 823391, 848236, 876425, 908710, 944284, 982166, 1022412, 1065800, 1112454, 1161013, 1209315, 1255875, 1300531, 1343717, 1385388, 1424754, 1460723, 1492202, 1518009, 1536844, 1547423, 1548528, 1539272, 1519961, 1492821, 1461176, 1427300, 1391268, 1352230, 1310412, 1267276, 1223924, 1180219, 1135870, 1091875, 1050346]
62498A050346l7421l3276l0232k8101k6007k3671k1788k1026k0996k0624j9373
62487G67831j7603j5789j4095j2750j2034j1567j0495q908q144q855r559q402
62475F29630n826m108m270m903m352k680q55P65K188K937K763K686M069O653Q605
62460F33302Q892Q623R559J1890J4301J5895J7122J8651K0177K1113K1963K3948
62448H25436K7147L0042L1527L2478L4372L6951L8555L8548L7900L7012L4604
62437A204572K9728K3638J8244J3381P213q06q880j5070j9211k2179k4431k6205
62425A179994k8200l0777l2890l3031l1283k9260k7903k6343k3643k0630j9002
62414H77032j9026j9175j8038j5655j2898j0408q496p370o887o507n930n363m836
$$ y = [1050346, 1012925, 979649, 949417, 921316, 895309, 871638, 849850, 828824, 807828, 787204, 767831, 750228, 734439, 720344, 707594, 695560, 683993, 673498, 664590, 656446, 647591, 638032, 629630, 623804, 619696, 615426, 610523, 606171, 603491, 602636, 603401, 605589, 608526, 611289, 613975, 618044, 624697, 633302, 642194, 650817, 660376, 672266, 686567, 702462, 719584, 738235, 758412, 779525, 801488, 825436, 852583, 882625, 914152, 946630, 981002, 1017953, 1056508, 1095056, 1132956, 1169968, 1204572, 1234300, 1257938, 1276182, 1289563, 1296776, 1295970, 1287090, 1272020, 1252809, 1230630, 1206199, 1179994, 1151794, 1121017, 1088127, 1055096, 1023813, 994553, 966650, 940307, 916664, 896034, 877032, 858006, 838831, 820793, 805138, 792240, 781832, 773336, 765966, 759079, 752572, 746642, 741279, 736443]
62401G36443l771j840K09J316J450J532K181L186M176N152O188P114P622P462
62387G78420O691N929O040P087P917P448O036M917M621M774N007N023L987J200
62373H55097k637o120r045j2151j4923j5585j3956j2366j2525j3122j2069r704
62361G20894p972p436p070o361n696n012l937l033l053k999r80K731N542O070
62347F81688N927P018Q817R710R660R917J0892J1970J2888J3777J4049J2833J0726
62334H19872R813J1223J3500J4097J2141R144P165O760O806N990M159K219J038
62321I23927P77J126J800K620L378L935M380M995O037P643R864J2726J6106J9605
62307A018919K2737K5644K9366L4852M1516M7549N1925N5396N9112O3154O7229
$$ y = [736443, 732672, 730832, 731041, 732357, 733807, 735339, 737520, 740706, 744882, 750034, 756222, 763336, 770958, 778420, 785111, 791040, 797080, 804167, 812084, 819532, 825568, 830485, 835106, 839880, 844887, 849910, 853897, 855097, 852460, 846340, 837295, 825144, 810221, 794636, 780680, 768314, 755789, 742667, 730598, 720894, 712922, 705486, 698416, 692055, 686359, 681347, 677410, 674377, 671324, 668325, 667345, 670076, 675618, 681688, 687615, 694633, 703450, 713160, 722820, 732737, 743629, 755599, 768487, 782264, 796313, 809146, 819872, 829685, 840908, 854408, 868505, 880646, 889790, 896955, 903715, 910521, 916511, 920670, 922889, 923927, 924704, 925830, 927630, 930250, 933628, 937563, 941943, 946938, 952975, 960618, 970482, 983208, 999314, 1018919, 1041656, 1067300, 1096666, 1131518, 1173034, 1220583, 1272508, 1327904, 1387016, 1450170, 1517399]
62296A517399P1812P7259Q2329Q5086Q5199Q3845Q1393P6713O9106N9355M8369
62285B337865L6213K3276J0919kj0179k0330k9801l7898m5462n3586o1364o6632
62273B083019o8758o9190o9283o8936o7597o5283o2131n7898n2603m7105m2512
62262A411723l9205l6701l4243l1478k8759k6696k5293k3719k1233j8056j5068
62251A111272j2843j1320r989q196n702l322k260k365j926l7J795J647J6r21n39
62236A055310m32j818l896n279n611n152m043k813k454l158l663k758p24J398
62222A014907L236M858N795N487M582M690O501Q904J0427J1128J2497J5415J8778
62209A127205K0756K1237K2150K4983K8884L2103L4509L7327M0920M4421M7668
$$ y = [1517399, 1589211, 1666470, 1748799, 1833885, 1919084, 2002929, 2084322, 2161035, 2230141, 2289496, 2337865, 2374078, 2397354, 2408273, 2408271, 2398092, 2377762, 2347961, 2310063, 2264601, 2211015, 2149651, 2083019, 2014261, 1945071, 1875788, 1806852, 1739255, 1673972, 1611841, 1553943, 1501340, 1454235, 1411723, 1372518, 1335817, 1301574, 1270096, 1241337, 1214641, 1189348, 1165629, 1144396, 1126340, 1111272, 1098429, 1087109, 1077120, 1068924, 1063222, 1059900, 1057640, 1055275, 1053349, 1053312, 1055107, 1056754, 1056770, 1055849, 1055310, 1054878, 1053060, 1049164, 1043885, 1038274, 1033122, 1029079, 1026266, 1023812, 1020654, 1016991, 1014233, 1013509, 1014907, 1018143, 1023001, 1028796, 1034283, 1038865, 1043555, 1050056, 1058960, 1069387, 1080515, 1093012, 1108427, 1127205, 1147961, 1169198, 1191348, 1216331, 1245215, 1277318, 1311827, 1349154, 1390074, 1434495, 1482163]
62198A482163N1720N6924O1990O5845O9094P2626P5876P7655P7741P6325P2644
62187B240603O5638N5760M4684L3317K1301Q515m067j5455k5635l5083m3816n1358
62175B294404n7337o1744o4780o6515o6694o5043o1809n7749n3386m8713m3860
62164A646774l9446l5723l1938k7324k2412j8566j6369j5079j3633j1502q753
62153A406029n921l772k588j721m11J072J772J476J084J513K747M147N249O186
62139A416862P565R801J2321J3938J4435J5189J7390K0236K2000K2522K3262K5009
62127A620530K6999K8545L0091L2052L3873L5026L5851L6581L6416L4551L1425
62116A981940K8102K5051K2471K1166K1898K4103K6364K8146L0264L3669L8471
$$ y = [1482163, 1533883, 1590807, 1652797, 1718642, 1787736, 1860362, 1936238, 2013893, 2091634, 2167959, 2240603, 2306241, 2362001, 2406685, 2440002, 2461303, 2469818, 2465751, 2450296, 2424661, 2389578, 2345762, 2294404, 2237067, 2175323, 2110543, 2044028, 1977334, 1912291, 1850482, 1792733, 1739347, 1690634, 1646774, 1607328, 1571605, 1539667, 1512343, 1489931, 1471365, 1454996, 1439917, 1426284, 1414782, 1406029, 1400108, 1396336, 1393748, 1392027, 1391616, 1392688, 1394460, 1395936, 1397020, 1398533, 1401280, 1405427, 1410676, 1416862, 1424427, 1434228, 1446549, 1460487, 1474922, 1490111, 1507501, 1527737, 1549737, 1572259, 1595521, 1620530, 1647529, 1676074, 1706165, 1738217, 1772090, 1807116, 1842967, 1879548, 1915964, 1950515, 1981940, 2010042, 2035093, 2057564, 2078730, 2100628, 2124731, 2151095, 2179241, 2209505, 2243174, 2281645]
62105B281645M4049M9346N3118N4752N5055N5454N6172N5752N2596M6485L8512
62094B842936L0227K3074J7763J3568Q699K096n376j2064j7390k1812k5209k6564
62082B829948k5664k4021k3107k2321j9861j5432j0892p884n942l683q75J638
62070B671904L546N285O874P767Q126R171J1689J5003J7977K0389K2720K5148
62058B825599K7503K9804L1968L3308L3204L2330L2374L4286L7387M0423M2825
62047C201011M4532M5264M4828M3973M4013M5439M7497M9382N1178N3144N4806
62036C725067N5672N6526N8785O2404O5560O6913O7086O7212O7086O5943O4215
62025D422469O2981O2225O1345O1291O3876O8456P1435P0448O7435O5864O6127
$$ y = [2281645, 2325694, 2375040, 2428158, 2482910, 2537965, 2593419, 2649591, 2705343, 2757939, 2804424, 2842936, 2873163, 2896237, 2914000, 2927568, 2936267, 2938363, 2932987, 2920923, 2903533, 2881721, 2856512, 2829948, 2804284, 2780263, 2757156, 2734835, 2714974, 2699542, 2688650, 2680766, 2674824, 2671141, 2670266, 2671904, 2675450, 2680735, 2687609, 2695376, 2703502, 2712673, 2724362, 2739365, 2757342, 2777731, 2800451, 2825599, 2853102, 2882906, 2914874, 2948182, 2981386, 3013716, 3046090, 3080376, 3117763, 3158186, 3201011, 3245543, 3290807, 3335635, 3379608, 3423621, 3469060, 3516557, 3565939, 3617117, 3670261, 3725067, 3780739, 3837265, 3896050, 3958454, 4024014, 4090927, 4158013, 4225225, 4292311, 4358254, 4422469, 4485450, 4547675, 4609020, 4670311, 4734187, 4802643, 4874078, 4944526, 5011961, 5077825, 5143952]
62014E143952O5820O3855O1936O1749O2816O3926O4998O6489O8055O8946O9076
62003E861618O8845O8467O8167O8284O8293O6439O1481N4364M7000L9756L1585
61992F504299K2423J3710O094j626j0263j8345k3988k7807l2242l8260m4294m8387
61980F301314m9966m9318m6888m3764m1489m0515l9672l7864l5402l2984l0508
61969E852944k7832k5637k4205k2368j9322j6713j6906j9342k0754j9356j6825
61958E623684j5530j5564j5715j5699j5898j5940j5181j4108j3799j4207j4211
61947E457832j3334j2285j1750j1612j1584j1821j2517j3407j4005j4050j3648
61936E317819j3219j3374j4616j7037k0427k4584k9386l4577l9621m3733m6343
$$ y = [5143952, 5209772, 5273627, 5335563, 5397312, 5460128, 5524054, 5589052, 5655541, 5723596, 5792542, 5861618, 5930463, 5998930, 6067097, 6135381, 6203674, 6270113, 6331594, 6385958, 6432958, 6472714, 6504299, 6526722, 6540432, 6546526, 6544900, 6534637, 6516292, 6492304, 6464497, 6432255, 6393995, 6349701, 6301314, 6251348, 6202030, 6155142, 6111378, 6069889, 6029374, 5989702, 5951838, 5916436, 5883452, 5852944, 5825112, 5799475, 5775270, 5752902, 5733580, 5716867, 5699961, 5680619, 5659865, 5640509, 5623684, 5608154, 5592590, 5576875, 5561176, 5545278, 5529338, 5514157, 5500049, 5486250, 5472043, 5457832, 5444498, 5432213, 5420463, 5408851, 5397267, 5385446, 5372929, 5359522, 5345517, 5331467, 5317819, 5304600, 5291226, 5276610, 5259573, 5239146, 5214562, 5185176, 5150599, 5110978, 5067245, 5020902]
61925E020902m7819m9543n2547n6030n8009n7698n6406n5689n5440n4528n2609
61914D424584n0382m8517m7192m6401m5844m4726m2433l9345l6348l3823l1687
61903C957886l0090k9113k7991k5775k2873k1015k1186k2320k2461k0839j8340
61892C695883j6060j3868j0672o192j894N37J541L348O948J0698J2880J4445J7629
61879C715223K2576K7223L0396L3140L6570M0061M2459M3918M5538M7815N0211
61868D135130N2014N3101N4092N5799N8306O0750O2633O4981O9224P5148Q1281
61857D822459Q7418R5230J05930J18778J32846J48765J67433J87964K08539K28976
61847F304338K51034K76074L03536L31986L60921L91087M23388M57745M92972
$$ y = [5020902, 4973083, 4923540, 4870993, 4814963, 4756954, 4699256, 4642850, 4587161, 4531721, 4477193, 4424584, 4374202, 4325685, 4278493, 4232092, 4186248, 4141522, 4099089, 4059744, 4023396, 3989573, 3957886, 3927796, 3898683, 3870692, 3844917, 3822044, 3801029, 3779843, 3757523, 3735062, 3714223, 3695883, 3679823, 3665955, 3655283, 3649091, 3647197, 3647734, 3649275, 3652623, 3659571, 3670269, 3683149, 3697594, 3715223, 3737799, 3765022, 3795418, 3828558, 3865128, 3905189, 3947648, 3991566, 4037104, 4084919, 4135130, 4187144, 4240245, 4294337, 4350136, 4408442, 4469192, 4531825, 4596806, 4666030, 4741178, 4822459, 4909877, 5005107, 5111037, 5229815, 5362661, 5511426, 5678859, 5866823, 6075362, 6304338, 6555372, 6831446, 7134982, 7466968, 7827889, 8218976, 8642364, 9100109, 9593081]
61838I593081N27683N61060N92331O19575O39443O47972O40759O12404N57363
61829A4991671M72839L60878K27374P9829p3440k23176l60298m77830n71561o39478
61819A3786808o81652p00674p01069o87598o64021o33063n96755n56817n15203
61810H049956m74073m34725l96994l60535l26404k96256k69910k45084k20148
61801E025827j96165j75252j57640j41424j25115j09263r5280q3382p2463o1668
61791C808175n1302m1980l3562k5546j8174j2350q337n245k315j50k2k161n390
61778C601641q503j1355j4323j7120j8708j8374j6499j3958j0992p083k146K695
61766C465275O095Q104J0121J3058J6091J7534J6551J3598R599N233R25k899n762
$$ y = [9593081, 10120764, 10681824, 11274155, 11893730, 12533173, 13181145, 13821904, 14434308, 14991671, 15464510, 15825388, 16052762, 16132591, 16059151, 15835975, 15475677, 14997847, 14426286, 13786808, 13105156, 12404482, 11703413, 11015815, 10351794, 9718731, 9121976, 8565159, 8049956, 7575883, 7141158, 6744164, 6383629, 6057225, 5760969, 5491059, 5245975, 5025827, 4829662, 4654410, 4496770, 4355346, 4230231, 4120968, 4025688, 3942306, 3869843, 3808175, 3756873, 3714893, 3681331, 3655785, 3637611, 3625261, 3616924, 3611679, 3609364, 3609214, 3609192, 3607031, 3601641, 3593138, 3581783, 3567460, 3550340, 3531632, 3513258, 3496759, 3482801, 3471809, 3464726, 3462580, 3465275, 3471370, 3479474, 3489595, 3502653, 3518744, 3536278, 3552829, 3566427, 3576026, 3581259, 3582184, 3579285, 3573523]
61753C573523p240p178n816l569o37L009P374J2489J8664K6178L4584M2865N0555
61740C744801N8153O6251P4764Q3435R2492J02155J11969J21416J31005J41943
61730D728384J54603J67997J81068J94177K08853K26212K45853K66457K87377
61721F660981L09470L34296L62819L95188M31416M71621N15612N62985O13868
61712A0658256O69097P29275P93900Q61348R29267R95115J056987J113707J162913
61703A8969865J198601J211430J191902J132549J027350Q71663O65545M17335
61695B6686240J42950j38591m09191o53457q59846j021792j137698j209768j242838
61686B0156009j243363j218004j172629j112765j044201r72129q99838q29136
$$ y = [3573523, 3566283, 3559105, 3553289, 3549720, 3549083, 3552092, 3559466, 3571955, 3590619, 3616797, 3651381, 3694246, 3744801, 3802954, 3869205, 3943969, 4027404, 4119896, 4222051, 4334020, 4455436, 4586441, 4728384, 4882987, 5050984, 5232052, 5426229, 5635082, 5861294, 6107147, 6373604, 6660981, 6970451, 7304747, 7667566, 8062754, 8494170, 8965791, 9481403, 10044388, 10658256, 11327353, 12056628, 12850528, 13711876, 14641143, 15636258, 16693245, 17806952, 18969865, 20168466, 21379896, 22571798, 23704347, 24731697, 25603360, 26268905, 26686240, 26829190, 26690599, 26281408, 25627951, 24768105, 23746313, 22608615, 21398847, 20156009, 18912646, 17694642, 16522013, 15409248, 14365047, 13392918, 12493080, 11663944]
61678A1663944p61687o98885o40720n86147n34862m87660m44970m06170l70750
61669F732093l39040l11260k86630k64061k43198k24222k07133j91701j77840
61660D487008j65610j54975j45707j37391j29573j22187j15662j10246j05433
61651C300224j00535r5529r0632q5380p9145p2494o6909o2793n8883n4221m9800
61640B483903m7340m6810m6092m3268l8720l4750l3238l3959l5181l5575l5022
61629B053948l3812l2031l0075k8715k7991k6909k5163k4109k4833k6127k6058
61618A748125k4807k3985k3638k2182j9514j7668j7644j7721j6192j3879j2509
61607A538386j2156j1848j1454j1352j1234j0877j1148j2531j3367j1589p881
$$ y = [11663944, 10902257, 10203372, 9562652, 8976505, 8441643, 7953983, 7509013, 7102843, 6732093, 6393053, 6081793, 5795163, 5531102, 5287904, 5063682, 4856549, 4664848, 4487008, 4321398, 4166423, 4020716, 3883325, 3753752, 3631565, 3515903, 3405657, 3300224, 3199689, 3104160, 3013528, 2928148, 2849003, 2776509, 2709600, 2646807, 2587924, 2533703, 2483903, 2436563, 2389753, 2343661, 2300393, 2261673, 2226923, 2193685, 2159726, 2124545, 2088970, 2053948, 2020136, 1988105, 1958030, 1929315, 1901324, 1874415, 1849252, 1825143, 1800310, 1774183, 1748125, 1723318, 1699333, 1675695, 1653513, 1633999, 1616331, 1598687, 1580966, 1564774, 1550895, 1538386, 1526230, 1514382, 1502928, 1491576, 1480342, 1469465, 1458317, 1445786, 1432419, 1420830, 1412949]
61596A412949n207n140o306o677n751m046j899K49J554J687J551K300L905N333
61582A394502N839N700N700O168O503N658L277L38j663k173j955j973k354k564
61568A421003k200j268J8J281J902J426J54r79j489k062l632n809o950o166m653
61553A390576m450o198q842j1088j2464j2991j2759j1983j0881r509q204p820
61541A273387q689r539q688o279m156l344l085k634k483k963l086j926q4J380
61527A217811K586M166N830O867P512Q552J0019J1506J3242J5486J7257J7294
61515A338128J6231J6303J8683K2402K6083K9379L2129L3494L3043L2008L2395
61504A630278L4891L8226M0549M1144M0788M0677M1056M1072L9933L7915L5881
$$ y = [1412949, 1407742, 1402602, 1396296, 1389619, 1383868, 1379822, 1377923, 1378172, 1379726, 1381413, 1382964, 1385264, 1389169, 1394502, 1400341, 1406041, 1411741, 1417909, 1424412, 1430070, 1433347, 1433685, 1432022, 1429849, 1427894, 1425921, 1423567, 1421003, 1418803, 1417535, 1417553, 1418834, 1420736, 1422162, 1422316, 1421337, 1419848, 1417786, 1414154, 1408345, 1401395, 1395229, 1390576, 1386126, 1379928, 1371086, 1359998, 1347534, 1334543, 1321784, 1309801, 1298920, 1289411, 1281207, 1273387, 1264698, 1255159, 1246471, 1240192, 1236036, 1232692, 1229607, 1226973, 1224490, 1221527, 1218441, 1216515, 1216431, 1217811, 1220397, 1224563, 1230393, 1237260, 1244772, 1253324, 1263343, 1274849, 1288091, 1303577, 1320834, 1338128, 1354359, 1370662, 1389345, 1411747, 1437830, 1467209, 1499338, 1532832, 1565875, 1597883, 1630278, 1665169, 1703395, 1743944, 1785088, 1825876, 1866553, 1907609, 1948681, 1988614, 2026529, 2062410]
61493B062410L4148L2275K9821K6920K4143K2123K1093K0421J8851J5684J1570
61482B319459P792M942K739P65j144l087m974o339o706o166n312m677m426m244
61468B288622l333j016K280N295P610J0318J4430J9440K4337K9289L5150M1885
61456B474307M8789N5952O4163P3372Q2494R0920R9189J08053J17843J28817J41128
61445C485027J54321J67674J81175J95267K09687K23461K36102K47660K57453
61436E357827K63733K64837K59792K47635K27337J98875J63452J22411P6920K9146
61426G211965j7390n9497r5762j25956j49830j67102j77938j82777j82136j77107
61416E876470j69397j60246j49750j37667j24465j10995r7524q3758o9630n5625
$$ y = [2062410, 2096558, 2128833, 2158654, 2185574, 2209717, 2231840, 2252933, 2273354, 2292205, 2307889, 2319459, 2327251, 2332193, 2334932, 2335697, 2334553, 2331466, 2326492, 2320153, 2313447, 2307281, 2301969, 2297292, 2292866, 2288622, 2285289, 2284273, 2286553, 2291848, 2299458, 2309776, 2324206, 2343646, 2367983, 2397272, 2432422, 2474307, 2523096, 2579048, 2643211, 2716583, 2799077, 2889997, 2989186, 3097239, 3215082, 3343899, 3485027, 3639348, 3807022, 3988197, 4183464, 4393151, 4616612, 4852714, 5100374, 5357827, 5621560, 5886397, 6146189, 6393824, 6621161, 6820036, 6983488, 7105899, 7182819, 7211965, 7194575, 7135078, 7039316, 6913360, 6763530, 6596428, 6418490, 6235713, 6053577, 5876470, 5707073, 5546827, 5397077, 5259410, 5134945, 5023950, 4926426, 4842668, 4773038, 4717413]
61406D717413m2279k9690j7576n754N483J5765K5361L4962M4462N2571N8334O2531
61394D921583O6674P1100P4941P7600P9094P9278P8017P6010P4233P2597P0369
61383E741496O7753O5573O3416N9841N4657M9420M5160M1257L7002L2659K8272
61372F286506K3192J7611J3076J0375Q391O113M206L304K209n47m522q267j1545
61359F350102j5027j8537k1222k2955k4193k4969k5287k5848k7068k7845k6834
61348F090317k4459k2362k1303k1010k1661k3819k6960k9530l0695l0944l0937
61337E806637l0672k9663k6978k1406j2739k574P302J7227K9074M3604N9672P6106
61325E915590R3004J10979J30156J50220J70600J90487K09378K27482K44822K60191
$$ y = [4717413, 4675134, 4645444, 4627868, 4622114, 4627597, 4643362, 4668723, 4703685, 4748147, 4800718, 4859052, 4921583, 4988257, 5059357, 5134298, 5211898, 5290992, 5370270, 5448287, 5524297, 5598530, 5671127, 5741496, 5809249, 5874822, 5938238, 5998079, 6052736, 6102156, 6147316, 6188573, 6225575, 6258234, 6286506, 6309698, 6327309, 6340385, 6350760, 6359151, 6365264, 6369470, 6372774, 6374983, 6374436, 6369914, 6361647, 6350102, 6335075, 6316538, 6295316, 6272361, 6248168, 6223199, 6197912, 6172064, 6144996, 6117151, 6090317, 6065858, 6043496, 6022193, 6001183, 5979522, 5955703, 5928743, 5899213, 5868518, 5837574, 5806637, 5775965, 5746302, 5719324, 5697918, 5685179, 5682605, 5689907, 5707134, 5736208, 5779812, 5839484, 5915590, 6008594, 6119573, 6249729, 6399949, 6570549, 6761036, 6970414, 7197896, 7442718, 7702909]
61315G702909K71931K79439K82790K81095K72414K55223K29073J94232J52059
61306I921165J05468N7549R730l7498q2401j22446j56826j86734k12808k34148
61296I061051k50331k62384k70893k74806k73257k67255k58532k47995k36337
61287F719261k24862k14340k03916j92317j79432j65722j51082j35603j20711
61278E131276j07956r6891q5430p2326n8360m5090l3369k3208j4244n851K881
61267D591432J2773K3763L4328M2251M6695M9380N2701N6674N8813N7355N3374
61256E079539M9118M5498M2118L8727L5344L1515K6658K1032J5523J0673O530
61245E402275K998m26m807j0839j7894k4705l0731l6262m1526m6382n0632n3997
$$ y = [7702909, 7974840, 8254279, 8537069, 8818164, 9090578, 9345801, 9574874, 9769106, 9921165, 10026633, 10084182, 10093912, 10056414, 9974013, 9851567, 9694741, 9508007, 9295199, 9061051, 8810720, 8548336, 8277443, 8002637, 7729380, 7462125, 7203593, 6955598, 6719261, 6494399, 6280059, 6076143, 5883826, 5704394, 5538672, 5387590, 5251987, 5131276, 5023320, 4926429, 4840999, 4768673, 4710313, 4665223, 4631854, 4608646, 4594402, 4588551, 4591432, 4604205, 4627968, 4662296, 4704547, 4751242, 4800622, 4853323, 4909997, 4968810, 5026165, 5079539, 5128657, 5174155, 5216273, 5255000, 5290344, 5321859, 5348517, 5369549, 5385072, 5395745, 5402275, 5405273, 5404847, 5400040, 5389201, 5371307, 5346602, 5315871, 5279609, 5238083, 5191701, 5141069, 5087072]
61233E087072n6024n6690n6746n6934n7104n6657n5324n2947m9188m4442m0377
61222D504639l8249l7019l4512l0377k6432k3868k1751j9037j6711j6578j8556
61211D221549k0624k1377k1457k1996k2524k1371j7890j3346r225n331l26O194
61199D052276J3087J9145K4297K8995L3313L7305M1651M7112N3647O0736O8242
61188D479806P6328Q4748R2850J00142J06179J10043J10542J06832R8337Q4290
61178E450097O4178L8702R690k1093n2433q2962j10617j33289j49797j60144j65152
61167D687180j66088j64347j61071j56744j51007j43049j32683j21162j10499
61158C380530j01802r4606q7893q1077p3739o5450n6545m8427m2118l7048l2140
$$ y = [5087072, 5031048, 4974358, 4917612, 4860678, 4803574, 4746917, 4691593, 4638646, 4589458, 4545016, 4504639, 4466390, 4429371, 4394859, 4364482, 4338050, 4314182, 4292431, 4273394, 4256683, 4240105, 4221549, 4200925, 4179548, 4158091, 4136095, 4113571, 4092200, 4074310, 4060964, 4051739, 4046408, 4046082, 4052276, 4065363, 4084508, 4108805, 4137800, 4171113, 4208418, 4250069, 4297181, 4350828, 4411564, 4479806, 4556134, 4640882, 4733732, 4833874, 4940053, 5050096, 5160638, 5267470, 5365807, 5450097, 5514275, 5552977, 5562667, 5541574, 5489141, 5406179, 5295562, 5162273, 5012476, 4852332, 4687180, 4521092, 4356745, 4195674, 4038930, 3887923, 3744874, 3612191, 3491029, 3380530, 3278728, 3184122, 3096229, 3015152, 2941413, 2875963, 2819418, 2770991, 2728873, 2691825, 2659685]
61147B659685k7445k3584k0085j5807j0862o622l554m77L582Q045J1962J5312
61135B590150J8315K0410K0964K0368J9303J7335J3375P602J873k180m875p836
61123B714804j1813j5752j8251j9501k1121k3944k6886k8540k9207l0282l2098
61112B457409l3695l4695l5942l7826l9411l9989m0446m1862m3619m4068m2772
61101B023084m0962l9926l9813l9876l9156l7018l3708l0381k7918k5951k3619
61090A644756k1018j9021j7878j7044j6445j6886j8881k1845k4740k6829k7589
61079A416580k6809k5173k3830k2832k0850j7161j3096j0491r389q387o848n368
61067A226346m107k047J529N762R116J0907J1584J1961J2650J3861J5220J6090
$$ y = [2659685, 2632240, 2608656, 2588571, 2572764, 2561902, 2555280, 2551726, 2551249, 2554831, 2562876, 2574838, 2590150, 2608465, 2628875, 2649839, 2670207, 2689510, 2706845, 2720220, 2727822, 2729695, 2727515, 2722640, 2714804, 2702991, 2687239, 2668988, 2649487, 2628366, 2604422, 2577536, 2548996, 2519789, 2489507, 2457409, 2423714, 2389019, 2353077, 2315251, 2275840, 2235851, 2195405, 2153543, 2109924, 2065856, 2023084, 1982122, 1942196, 1902383, 1862507, 1823351, 1786333, 1752625, 1722244, 1694326, 1668375, 1644756, 1623738, 1604717, 1586839, 1569795, 1553350, 1536464, 1517583, 1495738, 1470998, 1444169, 1416580, 1389771, 1364598, 1340768, 1317936, 1297086, 1279925, 1266829, 1256338, 1246949, 1238562, 1231714, 1226346, 1222239, 1220192, 1221721, 1227483, 1236599, 1247506, 1259090, 1271051, 1283701, 1297562, 1312782, 1328872]
61055A328872J6253J6081J5873J5543J5134J4988J5096J4897J4111J3098J1955
61044A491901J0142P624N518M488L279K13m273q046j0031j1071j2057j2858j3456
61031A451373j4481j5763j5793j3744j0979r414r141q844p958p190p168p694q355
61018A314849r052r777j0239r830p868m424r83N66O4o34j49O42K20j078j582p07
61002A260018N45J264J507J537J413J501K340L830N259O198O711O929P141P941
60988A314134R344J0286J0098J0027J1850J5253J8193J9745K0885K2390K3787
60977A485992K4892K6508K8841L0844L2098L3813L6886M0414M3359M6366N0366
60966A880379N4445N6910N7866N9185O2147O6544P1856P7848Q3941Q9277R3757
$$ y = [1328872, 1345125, 1361206, 1377079, 1392622, 1407756, 1422744, 1437840, 1452737, 1466848, 1479946, 1491901, 1502043, 1509667, 1515185, 1519673, 1522952, 1523165, 1518892, 1510846, 1500815, 1489744, 1477687, 1464829, 1451373, 1436892, 1421129, 1405336, 1391592, 1380613, 1371199, 1362058, 1353214, 1345256, 1338066, 1330898, 1323204, 1314849, 1305797, 1296020, 1285781, 1275951, 1268083, 1263659, 1262676, 1263242, 1263306, 1262672, 1262523, 1263165, 1263385, 1262307, 1260725, 1260018, 1260563, 1261827, 1263334, 1264871, 1266284, 1267785, 1270125, 1273955, 1279214, 1285412, 1292123, 1299052, 1306193, 1314134, 1323478, 1333764, 1343862, 1353889, 1365739, 1380992, 1399185, 1418930, 1439815, 1462205, 1485992, 1510884, 1537392, 1566233, 1597077, 1629175, 1662988, 1699874, 1740288, 1783647, 1830013, 1880379, 1934824, 1991734, 2049600, 2108785, 2170932, 2237476, 2309332, 2387180, 2471121, 2560398, 2654155]
60955B654155R8018J02107J05180J07057J09299J13974J21542J30457J39025J47193
60945C828007J56266J66953J78311J88893J98461K08060K18794K31231K45803
60936E620779K62992K83221L07074L35140L66918M00611M35348M73017N16608
60927I001708N67828O28502P03066P96069R07092J031865J169060J322214J494399
60918A7621803J686410J902208K149799K433042K749736L100798L481784L837216
60910C8962796M024620L865756L280102K380470J421168O39227J41606p7193o2205
60901E4576347J12764K97938K75969j20470q79524j806557k655194l267230l610356
60892D2923687l725292l666765l484507l225610k930958k628148k332638k053918
$$ y = [2654155, 2752173, 2854280, 2959460, 3066517, 3175816, 3289790, 3411332, 3541789, 3680814, 3828007, 3984273, 4151226, 4329537, 4518430, 4716891, 4924951, 5143745, 5374976, 5620779, 5883771, 6166992, 6474066, 6809206, 7176124, 7576735, 8012083, 8485100, 9001708, 9569536, 10198038, 10901104, 11697173, 12604265, 13636130, 14805190, 16127404, 17621803, 19308213, 21210421, 23360220, 25793262, 28542998, 31643796, 35125580, 38962796, 42987416, 46853172, 50133274, 52513744, 53934912, 54574139, 54715745, 54638552, 54576347, 54689111, 54987049, 55263018, 55142548, 54263024, 52456467, 49801273, 46534043, 42923687, 39198395, 35531630, 32047123, 28821513, 25890555, 23262407, 20929769, 18875851]
60884A8875851j797991j567139j361820j182808j030282r02380p96126p08627
60876I528678o36431n75413n22458m75963m34106l94713l57743l25646k99708
60867E506497k78027k58565k41998k29533k19812k10317k00444j90802j80821
60858C496178j69629j58326j48759j40457j31317j21094j11797j04444r7731r0360
60848B222264q2799p6150p0731o6305o2362n7873n2092m5899m1150l8350l6212
60837A592341l3771l1623l0563l0125k9164k7072k3989k0537j7664j5996j5074
60826A316763j3910j2447j1686j2048j2517j1804r856p882p247q456j0694j2374
60814A185842j2569j1924j1630j1880j2074j2214j2963j4197j4618j3221j0555
$$ y = [18875851, 17077860, 15510721, 14148901, 12966093, 11935811, 11033431, 10237305, 9528678, 8892247, 8316834, 7794376, 7318413, 6884307, 6489594, 6131851, 5806205, 5506497, 5228470, 4969905, 4727907, 4498374, 4278562, 4068245, 3867801, 3676999, 3496178, 3326549, 3168223, 3019464, 2879007, 2747690, 2626596, 2514799, 2410355, 2312624, 2222264, 2139465, 2063315, 1992584, 1926279, 1863917, 1806044, 1753952, 1708053, 1666903, 1628553, 1592341, 1558570, 1526947, 1496384, 1466259, 1437095, 1410023, 1386034, 1365497, 1347833, 1331837, 1316763, 1302853, 1290406, 1278720, 1266672, 1254155, 1242351, 1232495, 1224613, 1217366, 1208910, 1198216, 1185842, 1173273, 1161349, 1149719, 1137839, 1125765, 1113551, 1100588, 1086391, 1071773, 1058552, 1047997]
60803A047997q199p309p675p817o245l202o63pj94O43K516L863M160M594O120
60788A028582Q504J1396J4693J7486J8456J7958J8179K0266K2717K3502K2487
60777A224226K0766J8836J6653J4506J2616J0668Q640P191O274M531J287j874
60765A344320l131l148m088o351q074p806o144m558l927m448n767o955p365p681
60751A264877r103j1329j2502j1580r719q651q636q746q473q176q200q319q162
60738A143281p685p127o679o279n609m359k554o46Q30J844L106N442Q697J1525
60724A133787J2866J3443J4989J7733J9618J8758J5996J4121J4760J6873J8292
60713A311236J7992J6682J5606J5075J4247J2449J0555J0207J1525J2522J1521
$$ y = [1047997, 1039798, 1032489, 1024814, 1016997, 1010752, 1007550, 1006887, 1006880, 1006686, 1007329, 1009845, 1013708, 1017868, 1022462, 1028582, 1037086, 1048482, 1063175, 1080661, 1099117, 1117075, 1135254, 1155520, 1178237, 1201739, 1224226, 1244992, 1263828, 1280481, 1294987, 1307603, 1318271, 1326911, 1334102, 1340376, 1344907, 1346194, 1344320, 1341189, 1338041, 1333953, 1327602, 1319528, 1311722, 1305578, 1301020, 1297093, 1292645, 1286878, 1279923, 1272558, 1264877, 1255774, 1244445, 1231943, 1220363, 1210644, 1201993, 1193357, 1184611, 1176138, 1167962, 1159762, 1151443, 1143281, 1135596, 1128469, 1121790, 1115511, 1109902, 1105543, 1102989, 1102343, 1103173, 1105017, 1108123, 1113565, 1122262, 1133787, 1146653, 1160096, 1175085, 1192818, 1212436, 1231194, 1247190, 1261311, 1276071, 1292944, 1311236, 1329228, 1345910, 1361516, 1376591, 1390838, 1403287, 1413842, 1424049, 1435574, 1448096, 1459617]
60702A459617R288P693O982N789L569J385J47n78j385j848j330k44L07j88j267
60687A487937k105k136j437q37j289k888m772o205p261q236r020r530j0218j1456
60673A410547j2591j2431j0698q501p145o797o597n865m883m344m343m241l526
60660A318585k473j720j487j510j437j027j73Q03J085J33j563k985l837m684n855
60645A291855o785o664n394l706k620k723l636m232l924l611m693p089r126r590
60631A218062r223r594j1158j3002j4087j4093j3309j2251j1396j0911j0662j0619
60619A077757j1070j2146j3357j3938j3488j2186j0526q946p618o462n495m995
60607I57530m920m424k656p3J890K746L620N454P419Q020P282O829P891J0031
$$ y = [1459617, 1468905, 1476598, 1483580, 1489369, 1492938, 1494323, 1494470, 1493892, 1492507, 1490659, 1489329, 1489085, 1489392, 1489204, 1487937, 1485832, 1483696, 1482259, 1481422, 1480133, 1477245, 1472473, 1466268, 1459007, 1450771, 1441751, 1432221, 1422003, 1410547, 1397956, 1385525, 1374827, 1366326, 1359181, 1352384, 1345787, 1339922, 1335039, 1330695, 1326352, 1322111, 1318585, 1316112, 1314392, 1312905, 1311395, 1309958, 1308931, 1308758, 1309561, 1310646, 1310779, 1309216, 1306231, 1302394, 1297710, 1291855, 1285070, 1278406, 1273012, 1269306, 1266686, 1263963, 1260327, 1256095, 1252171, 1248560, 1243867, 1236778, 1227652, 1218062, 1208839, 1199245, 1188087, 1175085, 1160998, 1146905, 1133596, 1121345, 1109949, 1099038, 1088376, 1077757, 1066687, 1054541, 1041184, 1027246, 1013758, 1001572, 991046, 982100, 974482, 968020, 962525, 957530, 952610, 948186, 945530, 945457, 947347, 950093, 953713, 959167, 966586, 974606, 981888, 988717, 996608, 1006639]
60593A006639J1781J1978J0642R086R038J0942J3250J3997J3000J1839J1768J2421
60581A146381J2642J1823J0184Q406P298P384Q475R921J1278J2356J2763J2165
60569A271076J1128J0938J2283J4568J6771J8244J8518J7304J5212J3573J2706
60558A432321J1169P842M011J995J941J641l48k882m207m335m458m936n221n182
60544A429351n269n496n386m938m659m626m488m543n722q055j0158j0811j0321
60531A344879r696r262q863q694q888q743p485n492l730k103M19L848O617P392
60517A290199O675O020O355P538Q861R554R258Q497Q201Q470Q423P567O505N772
60503A397895M912L475K139J774K058K076J809J742J500L28j120j167L88J611
$$ y = [1006639, 1018420, 1030398, 1041040, 1050126, 1059164, 1070106, 1083356, 1097353, 1110353, 1122192, 1133960, 1146381, 1159023, 1170846, 1181030, 1189436, 1196734, 1204118, 1212593, 1222514, 1233792, 1246148, 1258911, 1271076, 1282204, 1293142, 1305425, 1319993, 1336764, 1355008, 1373526, 1390830, 1406042, 1419615, 1432321, 1443490, 1451332, 1455343, 1457338, 1459279, 1460920, 1460572, 1457690, 1453483, 1449148, 1444690, 1439754, 1434533, 1429351, 1424082, 1418586, 1413200, 1408262, 1403603, 1398977, 1394489, 1389946, 1384224, 1376169, 1366011, 1355200, 1344879, 1335183, 1325921, 1317058, 1308364, 1299476, 1290733, 1283248, 1277756, 1274026, 1271923, 1272342, 1276190, 1282807, 1290199, 1296874, 1302894, 1309249, 1316787, 1325648, 1335202, 1344460, 1352957, 1361158, 1369628, 1378051, 1385618, 1392123, 1397895, 1402807, 1406282, 1408421, 1410195, 1412253, 1414329, 1416138, 1417880, 1419380, 1419708, 1418588, 1417421, 1417809, 1419420]
60489A419420R66o99j471o06J471M459Q263J2350J6170J9958K4254K8831L2999
60476A566365L6807M1021M5902N0904N5602N9967O3322O4007O0786N4196M5845
60465B144724L6523K5620J2627j155j2924k0553k4247k5653k5504k2928j7279
60454B069251r694k111M537J0138J4029J5365J4855J4580J5574J6894J7704J8975
60442B200097K1993K6273L0414L4459L9946M7824N7566O8324P9651R0867J01136
60431B798550J10714J21201J33747J47613J61051J73169J84417J95873K08674
60422D235009K23851K42045K63253K87080L13069L40516L67806L91571M06095
60413G070295M04025L79074L28943K55593J63043N6138n8168j70035k69285l49109
$$ y = [1419420, 1420386, 1419687, 1418216, 1417610, 1419081, 1423540, 1431803, 1444153, 1460323, 1480281, 1504535, 1533366, 1566365, 1603172, 1644193, 1690095, 1740999, 1796601, 1856568, 1919890, 1983897, 2044683, 2098879, 2144724, 2181247, 2206867, 2219494, 2218339, 2205415, 2184862, 2160615, 2134962, 2109458, 2086530, 2069251, 2059557, 2057446, 2061983, 2072121, 2086150, 2101515, 2116370, 2130950, 2146524, 2163418, 2181122, 2200097, 2222090, 2248363, 2278777, 2313236, 2353182, 2401006, 2458572, 2526896, 2606547, 2697414, 2798550, 2909264, 3030465, 3164212, 3311825, 3472876, 3646045, 3830462, 4026335, 4235009, 4458860, 4700905, 4964158, 5251238, 5564307, 5904823, 6272629, 6664200, 7070295, 7474320, 7853394, 8182337, 8437930, 8600973, 8657111, 8598943, 8428908, 8159623, 7810514]
60403G810514m07003m42991m58385m56219m41280m18548l91576l62290l31790
60394D100432l01037k71052k42833k17051j93998j73802j56393j41079j26757
60385B276430j12949j00236q9184p9427p0405o2407n5989n0867m6451m2965m0828
60374A524722l9204l6679l3378l0858k9595k8075k5109k1714j9696j9336j9432
60363A221646j8973j7906j6677j5740j5131j4206j2310r930q337p779p151n881
60351A071625m808m430l747k080o96j006k142k188r94J66J196L117N490O326N090
60336A070919L745L952N038N693N987O409O477N803N416O377P719P521N645L886
60322A150587L388L441L011K197J581J153N12l82j262j992k522k630k140j269
$$ y = [7810514, 7403511, 6960520, 6502135, 6045916, 5604636, 5186088, 4794512, 4432222, 4100432, 3799395, 3528343, 3285510, 3068459, 2874461, 2700659, 2544266, 2403187, 2276430, 2163481, 2063245, 1974061, 1894634, 1824229, 1761822, 1705833, 1654966, 1608515, 1565550, 1524722, 1485518, 1448839, 1415461, 1384603, 1355008, 1326933, 1301824, 1280110, 1260414, 1241078, 1221646, 1202673, 1184767, 1168090, 1152350, 1137219, 1123013, 1110703, 1100773, 1092436, 1084657, 1077506, 1071625, 1066817, 1062387, 1058640, 1056560, 1055864, 1054858, 1052716, 1050528, 1049534, 1049700, 1050896, 1054013, 1059503, 1065829, 1070919, 1074664, 1078616, 1083654, 1089347, 1095334, 1101743, 1108220, 1114023, 1119439, 1125816, 1133535, 1141056, 1146701, 1150587, 1153975, 1157416, 1160427, 1162624, 1164205, 1165358, 1165870, 1165488, 1164226, 1162234, 1159712, 1157082, 1154942, 1153673]
60308A153673n39k83m24p01j014j454j957k094j443j71J003J562J699J967K736
60293A152560M042N635O927P342P098P245Q453R997J0542R742Q470P593P226P201
60279A260073P507P950Q031P598P087O680N667L344L31j660j450N82L052M754
60265A319546N249M918M685N283O479P129O273M098J669j46j323k491m285o786
60251A350298r317j0815j0678r295p647o436n740n422n598o395p361p453o046
60238A252095l940k785l079l248j631R64J964O04p02M16K970M054K887J443J269
60223A253281J733J898K194L185M164M333M419N721Q213J0709J2430J3301J3336
60210A338917J2903J3167J4923J7191J8180J7555J6595J6252J6269J6262J6466
$$ y = [1153673, 1153134, 1152851, 1152427, 1151726, 1150712, 1149258, 1147301, 1145207, 1143764, 1143593, 1144596, 1146158, 1147857, 1149824, 1152560, 1156602, 1162237, 1169164, 1176506, 1183604, 1190849, 1199302, 1209299, 1219841, 1229583, 1238053, 1245646, 1252872, 1260073, 1267580, 1275530, 1283561, 1291159, 1298246, 1304926, 1310593, 1313937, 1314268, 1312608, 1311158, 1311740, 1314792, 1319546, 1324795, 1329713, 1334398, 1339681, 1346160, 1353289, 1359562, 1363660, 1365329, 1365183, 1363860, 1361369, 1357084, 1350298, 1340981, 1330166, 1319488, 1310193, 1302546, 1296110, 1290370, 1284948, 1279350, 1272955, 1265594, 1258141, 1252095, 1248155, 1245370, 1242291, 1239043, 1237412, 1238376, 1240340, 1240944, 1240242, 1240658, 1243628, 1247682, 1250569, 1252012, 1253281, 1255014, 1256912, 1259106, 1262291, 1266455, 1270788, 1275207, 1280928, 1289141, 1299850, 1312280, 1325581, 1338917, 1351820, 1364987, 1379910, 1397101, 1415281, 1432836, 1449431, 1465683, 1481952, 1498214, 1514680]
60199A514680J7118J8196J9887K2393K5081K6974K8236L0074L2894L5773L8255
60188A809561M1298M5769N1034N5999O0658O5673P1112P6519Q1779Q7164R2968
60177B539534R9583J07308J15548J22959J29030J34713J40663J45784J48597J49211
60167C832930J48684J46946J42790J35670J26223J15064J02298Q8196P3268N7654
60157D969723M1396K5357J0764k116j3742k3753l0888l4570l5343l3527k8827
60146D844474k1684j3629n468L673J4630K6627L8526N0629O3893P7951R1273J03157
60134E274052J14320J25413J35798J43926J48222J47615J41998J32317J19877
60125F483538J05408Q9140P1453N2915L3787J4118n735k5122m3402n9641p2422
$$ y = [1514680, 1531798, 1549994, 1569881, 1592274, 1617355, 1644329, 1672565, 1702639, 1735533, 1771306, 1809561, 1850859, 1896628, 1947662, 2003661, 2064319, 2129992, 2201104, 2277623, 2359402, 2446566, 2539534, 2639117, 2746425, 2861973, 2984932, 3113962, 3248675, 3389338, 3535122, 3683719, 3832930, 3981614, 4128560, 4271350, 4407020, 4533243, 4648307, 4750605, 4838801, 4912069, 4969723, 5011119, 5036476, 5047240, 5045124, 5031382, 5007629, 4976741, 4942171, 4906828, 4873301, 4844474, 4822790, 4809161, 4803693, 4807366, 4821996, 4848623, 4887149, 4937778, 5001671, 5079622, 5170895, 5274052, 5388372, 5513785, 5649583, 5793509, 5941731, 6089346, 6231344, 6363661, 6483538, 6588946, 6678086, 6749539, 6802454, 6836241, 6850359, 6844624, 6819502, 6776100, 6716459, 6644037]
60114F644037q0804q5401q7553q7452q3989p6638o6372n4427m1068k6306j0865
60103E943162M297J8927L3183M6854N9532P0986Q0627Q6982Q8795Q6612Q2404
60092F602361P7449P1206O2444N0958L8035K5653J5300P226Q52l896n928m086
60080F937574J458R685K0286L3767N0075O8337Q8263J10631J35692J62135J88545
60069G806448K15080K42726K71430L00114L28163L55745L82582M07393M28780
60060A0738461M46004M58807M67058M70500M68104M57658M37021M06206L67573
60051A4717392L23545K74672K20196J59806R4222K4630m7458j19669j88648k50932
60041A5207756l04106l47233l80252m02975m14875m15904m07052l89620l64271
$$ y = [6644037, 6563233, 6477832, 6390279, 6302827, 6218838, 6142200, 6075828, 6021401, 5980333, 5954027, 5943162, 5947459, 5966386, 5999569, 6046423, 6105955, 6176941, 6257568, 6344550, 6433345, 6519957, 6602361, 6679810, 6751016, 6813460, 6864418, 6902453, 6928106, 6943406, 6950632, 6951484, 6947588, 6941660, 6937574, 6939032, 6948717, 6969003, 7002770, 7052845, 7121182, 7209445, 7320076, 7455768, 7617903, 7806448, 8021528, 8264254, 8535684, 8835798, 9163961, 9519706, 9902288, 10309681, 10738461, 11184465, 11643272, 12110330, 12580830, 13048934, 13506592, 13943613, 14349819, 14717392, 15040937, 15315609, 15535805, 15695611, 15789833, 15814463, 15767005, 15647336, 15458688, 15207756, 14903650, 14556417, 14176165, 13773190, 13358315, 12942411, 12535359, 12145739, 11781468]
60032A1781468l31689k94078k54859k16252j77869j38388r8158n9623k5584K396
60022A0187364K4248M0824N2885O0177O1530N6312M5452L0616J2890o917k7234
60011A0538147m6195o3343p9683r5687j10249j22357j32941j43931j55670j66361
60001I421730j74216j79482j83724j87564j89662j88137j82574j74299j64689
59992G797383j53618j40042j23900j06687q9800p2867n4448l3982j2333R531L1315
59981G050552N2495P1795Q8519J03684J18468J31631J39968J41767J38592J32863
59971H170334J24722J12500R5508P4887N1855K6665l22k7784n4348p9532j03093
59960H391392j24058j41153j53728j61759j65303j64649j60457j53135j42350
$$ y = [11781468, 11449779, 11155701, 10900842, 10684590, 10506721, 10368333, 10270175, 10210552, 10184968, 10187364, 10211612, 10252436, 10305321, 10365498, 10427028, 10483340, 10528792, 10559408, 10572298, 10565381, 10538147, 10491952, 10428609, 10348926, 10253239, 10142990, 10020633, 9887692, 9743761, 9588091, 9421730, 9247514, 9068032, 8884308, 8696744, 8507082, 8318945, 8136371, 7962072, 7797383, 7643765, 7503723, 7379823, 7273136, 7183336, 7110469, 7056021, 7022039, 7009706, 7019237, 7050552, 7103047, 7174842, 7263361, 7367045, 7485513, 7617144, 7757112, 7898879, 8037471, 8170334, 8295056, 8407556, 8503064, 8577951, 8629806, 8656471, 8656149, 8628365, 8574017, 8494485, 8391392, 8267334, 8126181, 7972453, 7810694, 7645391, 7480742, 7320285, 7167150, 7024800]
59951G024800j27866j10551r1814p2376n2426l2685j4032M109K3691M5704O8765
59940F665319R0868J11721J32241J52207J69904J84213J95669K04669K09709K08561
59930H325081K00822J88135J71846J51663J27025R8794O8769L8056O727k5090
59920I351828n6509q6234j12984j35560j52894j64121j68489j65640j56510j43453
59910H009434j28605j12135r2938p0909m7478k3966o65K2207M3933O4374Q4315
59899G747567J03773J20970J34206J44039J52167J58725J62187J61846J58745
59890I044225J53832J46633J36658J25158J14464J05883R8925R2551Q6749Q2993
59880A0188071Q3399Q9293J00425J15599J33988J55664J80894K09428K40545K73491
$$ y = [7024800, 6896934, 6786383, 6694569, 6622193, 6569767, 6537082, 6523050, 6527159, 6550850, 6596554, 6665319, 6756187, 6867908, 7000149, 7152356, 7322260, 7506473, 7702142, 7906811, 8116520, 8325081, 8525903, 8714038, 8885884, 9037547, 9164572, 9263366, 9332135, 9370191, 9376918, 9351828, 9295319, 9209085, 9096101, 8960541, 8807647, 8643526, 8475037, 8309397, 8152887, 8009434, 7880829, 7768694, 7675756, 7604847, 7557369, 7533403, 7532738, 7554945, 7598878, 7663252, 7747567, 7851340, 7972310, 8106516, 8250555, 8402722, 8561447, 8723634, 8885480, 9044225, 9198057, 9344690, 9481348, 9606506, 9720970, 9826853, 9925778, 10018329, 10105078, 10188071, 10271470, 10360763, 10461188, 10576787, 10710775, 10866439, 11047333, 11256761, 11497306, 11770797]
59870A1770797L07469L41347L73552M02161M25058M40052M44891M37305M15392
59861A5358024L78279L26299K60532J82573R5164K638r0041j78584k59429l28986
59851A5746469l84107m23664m48858m61406m62087m51597m32176m07040l78028
59842A1897506l44594l05880k63331k20533j80306j42553j05378o7748l0381N615
59832A0242417L9685P1109R8466J20707J37971J50432J56805J55120J44600J25631
59822A1442943R8087O1222J5637l5755q9351j42495j93097k38850k77997l10228
59812A0330116l35684l53396l61901l61500l54836l44852l32766l18293l01183
59803G265705k81929k61315k39969k18461j97461j77526j58812j41055j23774
$$ y = [11770797, 12078266, 12419613, 12793165, 13195326, 13620384, 14060436, 14505327, 14942632, 15358024, 15736303, 16062602, 16323134, 16505707, 16600871, 16603509, 16513468, 16334884, 16075455, 15746469, 15362362, 14938698, 14489840, 14028434, 13566347, 13114750, 12682574, 12275534, 11897506, 11552912, 11247032, 10983701, 10763168, 10582862, 10440309, 10334931, 10267183, 10236802, 10242417, 10282102, 10353211, 10451677, 10572384, 10710355, 10860787, 11017592, 11172712, 11317312, 11442943, 11541030, 11602252, 11617889, 11582134, 11492783, 11350288, 11157191, 10918341, 10640344, 10330116, 9994432, 9641036, 9279135, 8917635, 8562799, 8217947, 7885181, 7566888, 7265705, 6983776, 6722461, 6482492, 6264031, 6066570, 5889044, 5730232, 5589177, 5465403]
59794E465403j06591q9632p3760o0088m8930l9476l1089k4619k1626k2034k3519
59783D924039k3800k2859k2195k2489k3036k3166k3077k3198k3786k5395k8773
59772D662265l3864l9480m4380m8068n0378n1130n0636m9636m7988m4098l6758
59761D165849k7289j8886j3758j1610j0906j0551r879p706k656N355J4576K2831
59749D095370K9185L3902L7217L9207M0925M4368N0373N7163O2078O4445O5703
59738D619936O6892O7283O5697O1983N6733N0554M4268L8980L5250L2789L1485
59727E171850L2054L5013L9779M5617N2889O2531P4631Q8375J03057J18398J34292
59716E958486J51175J70359J92936K18374K45041K72010K99541L27708L55586
$$ y = [5465403, 5358812, 5269180, 5195420, 5135332, 5086402, 5046926, 5015837, 4991218, 4969592, 4947558, 4924039, 4900239, 4877380, 4855185, 4832696, 4809660, 4786494, 4763417, 4740219, 4716433, 4691038, 4662265, 4628401, 4588921, 4544541, 4496473, 4446095, 4394965, 4344329, 4294693, 4246705, 4202607, 4165849, 4138560, 4119674, 4105916, 4094306, 4083400, 4072849, 4062970, 4055264, 4052608, 4057963, 4072539, 4095370, 4124555, 4158457, 4195674, 4234881, 4275806, 4320174, 4370547, 4427710, 4489788, 4554233, 4619936, 4686828, 4754111, 4819808, 4881791, 4938524, 4989078, 5033346, 5072326, 5107576, 5140365, 5171850, 5203904, 5238917, 5278696, 5324313, 5377202, 5439733, 5514364, 5602739, 5705796, 5824194, 5958486, 6109661, 6280020, 6472956, 6691330, 6936371, 7208381, 7507922, 7835630, 8191216]
59707H191216L81864M05114M22853M30924M24297L98260L49300K76670J84593
59698A1465091Q2502j8202j08323j82311k37120k71525k86881k87105k76469k57434
59688I622223k31129j99483j65732j32519j00285o8271l6596o420K1740M8757
59678H752285P5604J02050J27309J51445J75550K00777K27657K56141K85703L15661
59668A0670182L45967L77632M11779M48318M86162N24778N64893O07396O52225
59659A5089332O98585P45791P93180Q39559Q83289R22819R56616R82539R98018
59650B2909728J001390R92957R74487R47856R14758Q77826Q41260Q09366P84034
59641C1053662P64006P46789P30804P15032O96996O72177O36032N86315N23132
$$ y = [8191216, 8573080, 8978194, 9401047, 9831971, 10256268, 10654528, 11003828, 11280498, 11465091, 11547593, 11529391, 11421068, 11238757, 11001637, 10730112, 10443231, 10156126, 9879657, 9622223, 9391094, 9191611, 9025879, 8893360, 8793075, 8724804, 8688208, 8681788, 8703528, 8752285, 8827889, 8929939, 9057248, 9208693, 9384243, 9585020, 9812677, 10068818, 10354521, 10670182, 11016149, 11393781, 11805560, 12253878, 12740040, 13264818, 13829711, 14437107, 15089332, 15787917, 16533708, 17326888, 18166447, 19049736, 19972555, 20929171, 21911710, 22909728, 23911118, 24904075, 25878562, 26826418, 27741176, 28619002, 29460262, 30269628, 31053662, 31817668, 32564457, 33295261, 34010293, 34707289, 35379466, 36015498, 36601813, 37124945]
59632C7124945M47502L60893K66225J68343P2710j6217r5177j61291k11858k44948
59622C7711127k59649k55838k34313j97244j47596q7541j7823O1003J47300K38785
59612C6958211L33617M30227N26364O19267P06525P85809Q53467R04235R32506
59603D3050228R33245R01454Q31949P20972N68289L77727J56279q6570l39004
59594D7114569n87522q18595j020683j185627j309151j390606j432392j439227
59586C7930766j417125j372174j310004j236311j157466j079996j009706r51841
59578B8396143r11686q93571q98222r21140r53848r86740j011475j022340j016898
59569A9780223r95736r61295r16650q64900q08907p51173o93973o39262n87866
$$ y = [37124945, 37572447, 37933340, 38199565, 38367908, 38440618, 38424401, 38329224, 38167933, 37956075, 37711127, 37451478, 37195640, 36961327, 36764083, 36616487, 36528946, 36511123, 36572126, 36719426, 36958211, 37291828, 37722055, 38248419, 38867686, 39574211, 40360020, 41213487, 42117722, 43050228, 43983473, 44884927, 45716876, 46437848, 47006137, 47383864, 47540143, 47453573, 47114569, 46527047, 45708452, 44687769, 43502142, 42192991, 40802385, 39369993, 37930766, 36513641, 35141467, 33831463, 32595152, 31437686, 30357690, 29347984, 28396143, 27484457, 26590886, 25692664, 24771524, 23817676, 22830936, 21819461, 20797121, 19780223, 18784487, 17823192, 16906542, 16041642, 15232735, 14481562, 13787589, 13148327, 12560461]
59560A2560461n39030m91689m46401m05141l68935l36646l06566k78328k52578
59551I135147k29510k08618j89488j72122j56860j44473j35887j31150j29056
59542G637983j28266j28426j29630j31450j33216j34800j36259j36958j35932
59533F443046j33019j28965j24393j19005j11774j01836q9707p7737o8445o1804
59523E426361n4994m5688l4702k4472j5902q116o74N879J1645J7839K5105L2575
59511E334856L9090M4455M9048N3013N6313N9012O1316O3775O7373P2706P9107
59500E980064Q5483R2059J00318J10978J22980J34867J46328J58018J70625J84693
59490G286413K00618K18126K35947K52629K67739K82199K97393L13490L28442
$$ y = [12560461, 12021431, 11529742, 11083341, 10678200, 10309265, 9972619, 9666053, 9387725, 9135147, 8905637, 8697019, 8507531, 8335409, 8178549, 8034076, 7898189, 7767039, 7637983, 7509717, 7381291, 7251661, 7120211, 6986995, 6852195, 6715936, 6578978, 6443046, 6310027, 6181062, 6056669, 5937664, 5825890, 5724054, 5634347, 5556610, 5488165, 5426361, 5371367, 5325679, 5290977, 5266505, 5250603, 5242487, 5241813, 5247692, 5259337, 5277176, 5302281, 5334856, 5373946, 5418401, 5467449, 5520462, 5576775, 5635787, 5697103, 5760878, 5828251, 5900957, 5980064, 6065547, 6157606, 6257924, 6368902, 6491882, 6626749, 6773077, 6931095, 7101720, 7286413, 7487031, 7705157, 7941104, 8193733, 8461472, 8743671, 9041064, 9354554, 9682996]
59481I682996L39049L43796L44128L42045L36993L26519L09887K89332K67266
59472A2582011K43566K16425J84887J49795J13112P7237M4290J5326r639l0544
59462A3586466m6755n7875o4128o5489o1081n0179l3089j0492J7471N0521Q7023
59451A3352393J24082J58747J88680K12043K27088K31795K23942K02105J66652
59442A5087527J19053O0393q222q3549j60075k32990l00167l60355m10780m48164
59432A3262671m71408m81768m80860m69971m50901m25823l96135l62738l27363
59423I395704k92258k58352k24957j91679j59379j28840r9595p0828m2623j5567
59413G911626J0216L5144N9662Q4087J08415J32007J53942J74000J92668K09800
$$ y = [9682996, 10022045, 10365841, 10709969, 11052014, 11389007, 11715526, 12025413, 12314745, 12582011, 12825577, 13042002, 13226889, 13376684, 13489796, 13567033, 13611323, 13626649, 13617010, 13586466, 13539711, 13481836, 13417708, 13352219, 13291138, 13240959, 13207870, 13197378, 13214849, 13265370, 13352393, 13476475, 13635222, 13823902, 14035945, 14263033, 14494828, 14718770, 14920875, 15087527, 15206580, 15266973, 15258751, 15175202, 15015127, 14782137, 14481970, 14121615, 13710835, 13262671, 12791263, 12309495, 11828635, 11358664, 10907763, 10481940, 10085805, 9723067, 9395704, 9103446, 8845094, 8620137, 8428458, 8269079, 8140239, 8040644, 7969816, 7927193, 7911626, 7921842, 7956986, 8016648, 8100735, 8209150, 8341157, 8495099, 8669099, 8861767, 9071567]
59403I071567K24031K34014K39432K39943K33787K18719J94205J61688J22613
59394A0939999P7451K7172k5443p7210j26873j74919k20907k62070k95163l19047
59384I542990l34735l43478l45827l42478l34829l24157l10957k95574k78892
59375F632063k61739k44186k26200k08528j92057j76538j60981j45390j30962
59366D885482j18342j06633r4704q2664p1253o0467m9876l9856l1422k4682j8463
59355D187120j1809n037J185P201J4066K2235L1114L9617M6403M9809M8559M3146
59343D473609L6193L1023K9737L2447L7748M3999N0826N9571P1514Q5134R6048
59332E047849J00697R9907R8062R9138J04372J13358J25621J40443J56388J72271
$$ y = [9071567, 9295598, 9529612, 9769044, 10008987, 10242774, 10461493, 10655698, 10817386, 10939999, 11017450, 11044622, 11019179, 10941969, 10815096, 10640177, 10419270, 10157200, 9862037, 9542990, 9208255, 8864777, 8518950, 8176472, 7841643, 7517486, 7206529, 6910955, 6632063, 6370324, 6126138, 5899938, 5691410, 5499353, 5322815, 5161834, 5016444, 4885482, 4767140, 4660507, 4565803, 4483139, 4411886, 4351419, 4301543, 4261687, 4230265, 4205583, 4187120, 4175311, 4170274, 4171459, 4178660, 4192726, 4214961, 4246075, 4285692, 4332095, 4381904, 4430463, 4473609, 4509802, 4540825, 4570562, 4603009, 4640757, 4684756, 4735582, 4795153, 4866667, 4951801, 5047849, 5148546, 5248453, 5346515, 5445653, 5550025, 5663383, 5789004, 5929447, 6085835, 6258106]
59322F258106J88440K06336K26938K50166K75609L03135L32617L63485L95023
59313H799855M27150M60771M97149N36583N77778O18628O57473O93166P24101
59304A3992654P47851P61994P64734P54649P31016O95223O51307O03696N54358
59295B0257482N02992M50008L97998L49454L03958K58714K11500J61793J08921
59286B3002820N0558j5772r0180j70368k53695l38223m21730n01008n72781o34705
59276B0054916o84998p21901p44345p52780p48769p34132p11024o82051o49213
59267A3625703o12961n73235n31239m89172m48377m08790l70369l33944l00276
59258I557340k69106k39665k11593j84961j59956j36754j15361r5462p6935o0402
$$ y = [6258106, 6446546, 6652882, 6879820, 7129986, 7405595, 7708730, 8041347, 8404832, 8799855, 9227005, 9687776, 10184925, 10721508, 11299286, 11917914, 12575387, 13268553, 13992654, 14740505, 15502499, 16267233, 17021882, 17752898, 18448121, 19099428, 19703124, 20257482, 20760474, 21210482, 21608480, 21957934, 22261892, 22520606, 22732106, 22893899, 23002820, 23053378, 23037606, 22947426, 22777058, 22523363, 22185140, 21763410, 21262402, 20689621, 20054916, 19369918, 18648017, 17903672, 17150892, 16402123, 15667991, 14956967, 14274916, 13625703, 13012742, 12439507, 11908268, 11419096, 10970719, 10561929, 10191560, 9857616, 9557340, 9288234, 9048569, 8836976, 8652015, 8492059, 8355305, 8239944, 8144482, 8067547, 8007145]
59248H007145m6662l5524k5877j6828q162k2O836J0754J0649P812M803K243j593
59235G915574p501j3639j8183k1859k6140l0347l2589l2645l1664k9398k3966
59224G647643j4652l076Q959K1271L4393M8312O2930P8718R5753J12726J27876
59213H220853J40730J52249J63289J73384J80952J84247J81781J72184J54400
59204I724069J28807R8090O6160L5510O056k2926n0240p3086q9779j01347j10214
59193I611100j17905j24323j28715j30807j31061j30111j28355j26143j24121
59184H469559j22740j21512j19393j16165j12747j09786j06708j02660r7607r1796
59174G368445q4780p5965o5640n4497m2366k8423j2469M781K2627M0940O0056
$$ y = [8007145, 7960483, 7924959, 7899082, 7882254, 7874092, 7874070, 7880906, 7891660, 7902309, 7910121, 7914924, 7917167, 7915574, 7908073, 7894434, 7876251, 7854392, 7828252, 7797905, 7765316, 7732671, 7701007, 7671609, 7647643, 7632991, 7629915, 7638874, 7660145, 7694538, 7742850, 7805780, 7884498, 7980251, 8092977, 8220853, 8361583, 8513832, 8677121, 8850505, 9031457, 9215704, 9397485, 9569669, 9724069, 9852876, 9950966, 10017126, 10052636, 10058692, 10035766, 9985526, 9912440, 9822661, 9721314, 9611100, 9493195, 9368872, 9240157, 9109350, 8978289, 8848178, 8719823, 8593680, 8469559, 8346819, 8225307, 8105914, 7989749, 7877002, 7767216, 7660508, 7557848, 7460241, 7368445, 7283665, 7207700, 7142060, 7087563, 7045197, 7016774, 7004305, 7009086, 7031713, 7072653, 7132709]
59163G132709Q0842J04433J31020J59234J87760K17103K48545K81582L13997L44447
59153I201672L73208L99813M21635M35806M41230M37412M22373L93347L49225
59144A2875721K91084K20567J39195M9524m4211j37276k25664l05814l74156m28140
59134A2060830m67620m94130n08534n10244m99376m78885m53395m25997l97041
59125G825608l66099l34099l03109k74876k49986k27758k06498j84700j62777
59116E515706j42880j26385j12272r8778q5749p4143o3877n3766m3406l3672k5157
59105D655621j7306r411j475O182J3327J9618K4861K9646L5003M1185M7480N3341
59093D898072N8831O3882O7995P0944P2982P4156P4239P3409P2065O9774O5475
$$ y = [7132709, 7213551, 7317984, 7449004, 7608238, 7795998, 8013101, 8261646, 8543228, 8857225, 9201672, 9574880, 9974693, 10396328, 10832134, 11273364, 11710776, 12133149, 12526496, 12875721, 13166805, 13387372, 13526567, 13576091, 13531880, 13394604, 13168940, 12863126, 12488970, 12060830, 11593210, 11099080, 10590546, 10080302, 9580926, 9102041, 8648646, 8222649, 7825608, 7459509, 7125410, 6822301, 6547425, 6297439, 6069681, 5863183, 5678483, 5515706, 5372826, 5246441, 5134169, 5035391, 4949642, 4875499, 4811622, 4757856, 4714450, 4680778, 4655621, 4638315, 4628904, 4627429, 4633611, 4646938, 4666556, 4691417, 4721063, 4756066, 4797251, 4844731, 4898072, 4956903, 5020785, 5088780, 5159724, 5232706, 5306862, 5381101, 5454510, 5526575, 5596349, 5661824]
59082E661824N9080N1780M4343L6208K6975J7550Q904P43p461j4886k0115k3044
59070E841901k4637k5010k3194j9058j4143r813n438P30R230J8844K8359L8007
59058E815778M8837O1108P3955Q6371R7898J08361J17719J26494J35636J45412
59048F817569J54844J62906J70013J77702J86929J97105K06593K13804K18212
59039H505677K20816K23280K26041K27478K25347K18362K05873J86939J60867
59030A0400680J28034Q8846M2575j1020o9061j26259j78549k24801k65049k98854
59020I486542l25737l45500l57506l61217l57955l50498l40202l26341l09140
59011F412446k91353k75299k59953k43043k24777k07608j93027j80610j69591
$$ y = [5661824, 5720904, 5772684, 5817027, 5853235, 5880210, 5897760, 5906664, 5907407, 5899946, 5885060, 5864945, 5841901, 5817264, 5792254, 5769060, 5750002, 5735859, 5726046, 5720608, 5721338, 5730568, 5749412, 5777771, 5815778, 5864615, 5925723, 5999678, 6086049, 6183947, 6292308, 6410027, 6536521, 6672157, 6817569, 6972413, 7135319, 7305332, 7483034, 7669963, 7867068, 8073661, 8287465, 8505677, 8726493, 8949773, 9175814, 9403292, 9628639, 9847001, 10052874, 10239813, 10400680, 10528714, 10617560, 10660135, 10649115, 10580054, 10453795, 10275246, 10050445, 9785396, 9486542, 9160805, 8815305, 8457799, 8096582, 7738627, 7388129, 7047927, 6721586, 6412446, 6121093, 5845794, 5585841, 5342798, 5118021, 4910413, 4717386, 4536776, 4367185]
59002D367185j59461j49262j38218j27070j17274j08924j01002r3415q6983q1416
58992C204160p5308o8538o2679n8287n3864m8712m4916m4394m5254m3539l8325
58981B620344l2813k9988k9213k8057k5761k3212k0511j6594j1351o356k831j24
58969B393533K869N704P003O554N503M542L180J058j119k527l298l940m346m079
58955B410637l300k620k130j271K09J657K163J672J122J404K307K769K166R72
58941B417757L4l64m36m75j049l039o578j0266j2339j2479j1690j0621r083p151
58927B332221n542m599l827k639p47K088N685Q845J0389J0907J2089J4189J5860
58914B394919J6747J8318K1313K4380K6451K8602L1873L5035L6570L7523L9898
$$ y = [4367185, 4207724, 4058462, 3920244, 3793174, 3675900, 3566976, 3465974, 3372559, 3285576, 3204160, 3128852, 3060314, 2997635, 2939348, 2885484, 2836772, 2791856, 2747462, 2702208, 2658669, 2620344, 2587531, 2557543, 2528330, 2500273, 2474512, 2451300, 2430789, 2414195, 2402844, 2396488, 2393657, 2393533, 2396402, 2402106, 2409109, 2415663, 2421166, 2425708, 2428888, 2429946, 2428827, 2426300, 2423002, 2419062, 2414716, 2410637, 2407337, 2404717, 2402587, 2401316, 2401525, 2403182, 2405345, 2407017, 2408139, 2409543, 2411850, 2414619, 2416785, 2417757, 2417791, 2417427, 2416991, 2416516, 2415467, 2412428, 2405850, 2395584, 2383245, 2370766, 2359076, 2348455, 2339372, 2332221, 2326679, 2322080, 2318253, 2315614, 2314867, 2316955, 2322640, 2331485, 2341874, 2352781, 2364870, 2379059, 2394919, 2411666, 2429984, 2451297, 2475677, 2502128, 2530730, 2562603, 2597638, 2634208, 2671731, 2711629]
58903B711629M3126M4707M4153M3691M4772M6127M6066M4872M3888M3703M4329
58892C201063M6202M9831N4815N9897O3910O6597O8836P2049P6791Q2030Q6473
58881C928494R0359R4970J00535J05867J10331J14875J20515J26913J33308J40055
58871E066222J48192J57916J68384J78962J89972K02135K15761K30583K46098
58862F804225K61979K78313K95526L14065L34179L55997L79773M05944M34770
58853I864771M65720M97471N29054N61091N95231O32023O69822P06108P39225
58844A5260516P68330P92360Q09901Q19552Q19419Q06612P78197P32524O68803
58835B2256214N85803M82588L60965K26100Q4263n9280j99987l33019m53684n58528
$$ y = [2711629, 2754755, 2799462, 2843615, 2887306, 2932078, 2978205, 3024271, 3069143, 3113031, 3156734, 3201063, 3247265, 3297096, 3351911, 3411808, 3475718, 3542315, 3611151, 3683200, 3759991, 3842021, 3928494, 4018853, 4113823, 4214358, 4320225, 4430556, 4545431, 4665946, 4792859, 4926167, 5066222, 5214414, 5372330, 5540714, 5719676, 5909648, 6111783, 6327544, 6558127, 6804225, 7066204, 7344517, 7640043, 7954108, 8288287, 8644284, 9024057, 9430001, 9864771, 10330491, 10827962, 11357016, 11918107, 12513338, 13145361, 13815183, 14521291, 15260516, 16028846, 16821206, 17631107, 18450659, 19270078, 20076690, 20854887, 21587411, 22256214, 22842017, 23324605, 23685570, 23911670, 23995933, 23936653, 23736666, 23403647, 22949963, 22391435]
58825B2391435o45422p13093p61303p91243q05014q04817p92887p71911p44655
58816A5561090p13039o77982o40334o01671n63908n28343m95108m63563m33131
58807A0444011m03972l76929l52763l31263l11252k91647k72425k54306k37539
58798G611915k21601k06216j91932j79089j66862j54199j41480j30069j20140
58789F100327j10026r8125q4750p1575n9814m9319l9083k8296j7242p150J349
58778E536296R512J9302L0961M2836N3760O4333P5405Q6719R7741J08658J19557
58767F245080J29891J39732J50514J63240J77007J90559K04398K19837K36763
58758G857021K54046K71766K91411L13976L39145L66158L94285M22700M51221
$$ y = [22391435, 21746013, 21032920, 20271617, 19480374, 18675360, 17870543, 17077656, 16305745, 15561090, 14848051, 14170069, 13529735, 12928064, 12364156, 11835813, 11340705, 10877142, 10444011, 10040039, 9663110, 9310347, 8979084, 8667832, 8376185, 8103760, 7849454, 7611915, 7390314, 7184098, 6992166, 6813077, 6646215, 6492016, 6350536, 6220467, 6100327, 5990301, 5892176, 5807426, 5735851, 5676037, 5626718, 5587635, 5559339, 5542097, 5534947, 5536296, 5545808, 5565110, 5596071, 5638907, 5692667, 5757000, 5832405, 5919124, 6016865, 6125523, 6245080, 6374971, 6514703, 6665217, 6828457, 7005464, 7196023, 7400421, 7620258, 7857021, 8111067, 8382833, 8674244, 8988220, 9327365, 9693523, 10087808, 10510508, 10961729]
58749A0961729M80912N12861N46651N81244O16697O53420O90020P23544P51676
58740A6518754P73051P85641P86859P75406P50973P11650O53539N73940M73653
58731B2803466L55749K23882Q2733o1515k02686l36128m58261n65755o55949p27351
58721B0458185p79195q11547q26450q27709q18662q00797p75119p43747p09415
58712A3365544o74240o39567o06080n73285n39985n06023m72775m41318m11458
58703H500813l83218l57745l35324l13950k91789k70198k52213k38298k25627
58694E832451k11651j96590j82003j68550j55998j44180j32907j21678j10417
58685D408477r9966r1001q2842p4245o5227n7229n1160m6179m1033l6157l3441
$$ y = [10961729, 11442641, 11955502, 12502153, 13083397, 13700094, 14353514, 15043534, 15767078, 16518754, 17291805, 18077446, 18864305, 19639711, 20390684, 21102334, 21755873, 22329813, 22803466, 23159215, 23383097, 23465830, 23404315, 23201629, 22865501, 22407240, 21841485, 21185536, 20458185, 19678990, 18867443, 18040993, 17213284, 16394622, 15593825, 14818706, 14074959, 13365544, 12691304, 12051737, 11445657, 10872372, 10332387, 9826364, 9353589, 8912271, 8500813, 8117595, 7759850, 7424526, 7110576, 6818787, 6548589, 6296376, 6058078, 5832451, 5620800, 5424210, 5242207, 5073657, 4917659, 4773479, 4640572, 4518894, 4408477, 4308511, 4217510, 4134668, 4060423, 3995196, 3937967, 3886807, 3840628, 3799595, 3763438, 3729997]
58674C729997l3924l6568l9786m3420m8417n4922o1477o6066o7405o5498o1627
58663C150887n7718n5094n3778n3327n3844n5353n6722n6533n5008n3815n3813
58652B545882n4306n4688n5282n5872n5010n2026m8656m7134m7201m6451m3421
58641A985835l9124l5402l2908l1080k9288k7383k5432k3502k1826k0913k1172
58630A677805k2340k3559k4209k4357k4033k2608j9650j6078j3418j1896j0253
58619A465404p665m874k964j986j208M4K273N650R375J2113J3710J5545J8422
58606A523839K1042K1693K0629J9322J7851J4713R319L314j216l900n883q149
58594A632574j0615j2516j3128j2398j1102j0273j0168j0038r082p329n252k803
$$ y = [3729997, 3696073, 3659505, 3619719, 3576299, 3527882, 3472960, 3411483, 3345417, 3278012, 3212514, 3150887, 3093169, 3038075, 2984297, 2930970, 2877126, 2821773, 2765051, 2708518, 2653510, 2599695, 2545882, 2491576, 2436888, 2381606, 2325734, 2270724, 2218698, 2170042, 2122908, 2075707, 2029256, 1985835, 1946711, 1911309, 1878401, 1847321, 1818033, 1790650, 1765218, 1741716, 1719890, 1698977, 1677805, 1655465, 1631906, 1607697, 1583340, 1559307, 1536699, 1517049, 1500971, 1487553, 1475657, 1465404, 1457739, 1452865, 1449901, 1447915, 1446707, 1446751, 1449024, 1454674, 1464049, 1476162, 1489872, 1505417, 1523839, 1544881, 1566574, 1587203, 1606525, 1624376, 1639089, 1648408, 1651722, 1650506, 1646606, 1640723, 1632574, 1621959, 1609443, 1596315, 1583917, 1572815, 1562542, 1552374, 1542336, 1533254, 1525925, 1520673, 1517870]
58582A517870N06M557Q329J1079J3340J6051J8978K0936K1770K3123K6525L1389
58570A714453L5677L8331M0179M2544M5747M9198N2502N6120O1009O7519P4687
58559B277966Q1003Q6047R0894R6630J03274J10645J19409J30207J42276J54167
58549C392518J65559J77282J89648K01758K12425K20882K26736K30099K31394
58540E248301K29890K22759K06994J82377J51126J14740P2966K6478k1215o5653
58530F368763j04379j37121j64071j85028j99723k08125k10686k08707k04012
58521D746911j97664j89385j78572j65594j51683j37895j24498j11214r7862q4886
58511C307658p3116o2861n3581m4738l6583k9626k3887j9105j5119j1465p495
$$ y = [1517870, 1518376, 1522933, 1531262, 1542341, 1555681, 1571732, 1590710, 1611646, 1633416, 1656539, 1683064, 1714453, 1750130, 1788461, 1828640, 1871184, 1916931, 1966129, 2018631, 2074751, 2135760, 2203279, 2277966, 2358969, 2445016, 2535910, 2632540, 2735814, 2846459, 2965868, 3096075, 3238351, 3392518, 3558077, 3735359, 3925007, 4126765, 4339190, 4560072, 4786808, 5016907, 5248301, 5478191, 5700950, 5907944, 6090321, 6241447, 6356187, 6429153, 6455631, 6434416, 6368763, 6264384, 6127263, 5963192, 5778164, 5578441, 5370316, 5159630, 4950923, 4746911, 4549247, 4359862, 4181290, 4015696, 3864013, 3726118, 3601620, 3490406, 3392544, 3307658, 3234542, 3171681, 3118100, 3073362, 3036779, 3007153, 2983266, 2964161, 2949042, 2937577, 2930082]
58500B930082l752k157l709p085j0912j6273k4924l5898m6199n4449o1409o7298
58488B596017p1113p2813p3546p3355p1030o6794o2650n9394n5554n0108m3998
58477A895662l8255l2933k8674k6823k6836k6100k3552k1121k0261j9643j7972
58466A613492j6469j6497j6987j6621j6479j8063k0373k1607k2161k3404k4627
58455A400204k3860k0990j7663j4778j2188j0200r240q561p177n534m525l574
58443A261914j574R42K505L020L678N006O579Q141R604J0565J1223J2865J5972
58430A350440J8934K0327K1252K3458K6234K7363K6323K4232K1375J7215J2418
58419A589571Q535N641K320k133p133j2105j6584j9524k0374k0402k1160k2234
$$ y = [2930082, 2926330, 2924173, 2920464, 2913379, 2902467, 2886194, 2861270, 2825372, 2779173, 2724724, 2663315, 2596017, 2524904, 2452091, 2378545, 2305190, 2234160, 2167366, 2104716, 2045322, 1989768, 1939660, 1895662, 1857407, 1824474, 1795800, 1768977, 1742141, 1716041, 1692489, 1671368, 1651107, 1631464, 1613492, 1597023, 1580526, 1563539, 1546918, 1530439, 1512376, 1492003, 1470396, 1448235, 1424831, 1400204, 1376344, 1355354, 1337691, 1322913, 1310725, 1300525, 1291285, 1282724, 1275547, 1270013, 1265488, 1261914, 1260340, 1261282, 1263787, 1266807, 1270485, 1275491, 1282070, 1290211, 1299815, 1310380, 1321603, 1334468, 1350440, 1369374, 1389701, 1410953, 1434411, 1460645, 1488008, 1514331, 1538563, 1559938, 1577153, 1589571, 1598106, 1603747, 1606067, 1603934, 1596801, 1584696, 1568112, 1548588, 1528214, 1507812, 1486652, 1464418]
58407A464418k2357k2077k2924k4505k4891k3820k2980k2993k2471k0471j7857
58396A217072j5654j3838j2200j0926r946q991q343q270p953o463m487l429l083
58383A103489j997M5J674K108K005K180K898M262N818O264N191M552O407R675
58369A154571J1315J0330Q402O707M610J823n06j448j296n74L85Q05J41o24q4
58354A194557J382K304K702L819N548O539O897Q210J0538J1879J1258J0003R313
58341A284949Q717P782P237P383P111N565L362J364n24k719n154p428q699p727
58327A301219m444j195m78j575j371J518N418Q431J0327J1312J1127J0039R034
58314A359362Q452P992Q002Q959R673Q255N101K747K393K730K754L462N837R027
$$ y = [1464418, 1442061, 1419984, 1397060, 1372555, 1347664, 1323844, 1300864, 1277871, 1255400, 1234929, 1217072, 1201418, 1187580, 1175380, 1164454, 1154508, 1145517, 1137174, 1128904, 1120951, 1114488, 1110001, 1106572, 1103489, 1101492, 1101537, 1103211, 1105319, 1107324, 1109504, 1112402, 1116664, 1122482, 1128746, 1133937, 1138489, 1144896, 1154571, 1165886, 1176216, 1184618, 1191325, 1195935, 1197758, 1197252, 1195804, 1194508, 1193934, 1194319, 1195124, 1195265, 1194641, 1194557, 1195939, 1198243, 1200945, 1204764, 1210312, 1216851, 1223748, 1231958, 1242496, 1254375, 1265633, 1275636, 1284949, 1293666, 1301448, 1308685, 1316068, 1323179, 1328744, 1332106, 1333470, 1332946, 1330227, 1325073, 1317645, 1308946, 1301219, 1296775, 1295580, 1295102, 1293527, 1292156, 1293674, 1299092, 1307523, 1317850, 1329162, 1340289, 1350328, 1359362, 1367814, 1375806, 1383808, 1392767, 1402440, 1410695, 1415796, 1418543, 1420936, 1423666, 1426420, 1429882, 1435719, 1444746]
58300A444746J1540J3008J3974J5014J6372J7597J7742J6882J6674J8043J9331
58289A620923J8657J6917J6201J6363J5905J5233J5733J6361J4724J1333R258
58278A787608R456J0010J0080J0932J2520J2840J1669J1489J3506J5812J6672
58267A922594J6769J7165J7808J8889K1018K3335K4146K4002K5224K8077L0497
58256B169524L1999L4265L7315L8791L8053L7354L7827L7854L6666L5945L6516
58245B572109L6809L6045L5715L6566L7294L7436L8273L9781M0069L8987L8827
58234B987911M0343M1694M2337M4235M7950N1441N3949N7337O2211O6603O9694
58223C565705P2953P6579P9031Q0948Q5010R0948R5629R9058J04907J13703J21315
$$ y = [1444746, 1456286, 1469294, 1483268, 1498282, 1514654, 1532251, 1549993, 1566875, 1583549, 1601592, 1620923, 1639580, 1656497, 1672698, 1689061, 1704966, 1720199, 1735932, 1752293, 1767017, 1778350, 1787608, 1797064, 1807074, 1817154, 1828086, 1840606, 1853446, 1865115, 1876604, 1890110, 1905922, 1922594, 1939363, 1956528, 1974336, 1993225, 2014243, 2037578, 2061724, 2085726, 2110950, 2139027, 2169524, 2201523, 2235788, 2273103, 2311894, 2349947, 2387301, 2425128, 2462982, 2499648, 2535593, 2572109, 2608918, 2644963, 2680678, 2717244, 2754538, 2791974, 2830247, 2870028, 2910097, 2949084, 2987911, 3028254, 3069948, 3112285, 3156520, 3204470, 3255911, 3309860, 3367197, 3429408, 3496011, 3565705, 3638658, 3715237, 3794268, 3875216, 3960226, 4051174, 4146803, 4245861, 4350768, 4464471, 4585786]
58212D585786J26074J31371J38929J45602J49558J53470J58276J59850J55750
58203E904666J49869J46511J45015J43871J44944J49721J56326J63822J74652
58194G279397J89631K05859K22571K43227K68591K94129L17638L42705L70789
58185I734537L97220M19530M42442M69658M98015N24993N54510N89455O26043
58176A4256403O61532P00075P44516P89911Q31591Q72138R13939R53054R87476
58167B1710635J023434J066518J115095J168979J234356J312084J391860J467152
58159C1490113J545393J634383J730626J831648J946914K084163K237687K403569
58151D6904496K593194K816670L066234L332694L625447L959654M338482M767417
$$ y = [4585786, 4711860, 4843231, 4982160, 5127762, 5277320, 5430790, 5589066, 5748916, 5904666, 6054535, 6201046, 6346061, 6489932, 6634876, 6784597, 6940923, 7104745, 7279397, 7469028, 7674887, 7897458, 8140685, 8409276, 8703405, 9021043, 9363748, 9734537, 10131757, 10551287, 10993729, 11463387, 11961402, 12486395, 13040905, 13630360, 14256403, 14917935, 15618010, 16362526, 17152437, 17984028, 18856166, 19770105, 20723159, 21710635, 22734069, 23800587, 24915682, 26084661, 27319017, 28631101, 30022961, 31490113, 33035506, 34669889, 36400515, 38232163, 40179077, 42263240, 44500927, 46904496, 49497690, 52314360, 55380594, 58713288, 62338735, 66298389, 70636871, 75404288]
58143G5404288N272027N881893O611726P476682Q504913R709723J1070152J2565970
58135A42497374J4208358J6009475J7959107K0077140K2460972K5240221K8509998
58128B86962645L2273176L6193164L9126393L9026447L3887646K3319803R282770
58121E00072044m933474j6625083k4784782k9763108l2321470l3087601l2531408
58114C26025118l1040902k8918590k6401127k3710900k1043785j8519409j6191802
58107A60198603j4095105j2239558j0588377r092377p740849o543290n479680
58100I4419367m510359l618677k801184k029878j265333m88151L24950J209852
58092H1240587K093473K655572K442968J243794o51873k617333m122599n006459
$$ y = [75404288, 80676315, 86558208, 93169934, 100646616, 109151529, 118861252, 129931404, 142497374, 156705732, 172715207, 190674314, 210751454, 233212426, 258452647, 286962645, 319235821, 355428985, 394555378, 433581825, 467469471, 490789274, 500072044, 495138570, 478513487, 453728705, 423965597, 391644127, 358556526, 326025118, 294984216, 266065626, 239664499, 215953599, 194909814, 176390405, 160198603, 146103498, 133863940, 123275563, 114183186, 106442337, 99899047, 94419367, 89909008, 86290331, 83489147, 81459269, 80193936, 79705785, 80030735, 81240587, 83334060, 85989632, 88432600, 89676394, 89024521, 86407188, 82284589, 77278130]
58084G7278130n398813n487802n389207n158952m837924m462193m058047l646212
58076C8838980l247059k877245k545397k253464j999622j779094j585811j416285
58068B1135003j271108j151012j052173r66997q89478q18387p55277p01253o56211
58059A2873107o19302n88521n60792n33567n05660m76095m43873m09996l77931
58050H357370l50447l27391l07849k92625k82384k74825k66284k55536k43910
58041E756119k32342k20513k08528j97290j87075j77329j67946j59404j51481
58032D054211j43011j33140j22294j11932j03685r8367r5482r4010r3524r3813
58022B964953r3861r2567r0394q8659q7220q4700q1104p7915p5299p1561o6196
$$ y = [77278130, 71879317, 66391515, 61002308, 55843356, 51005432, 46543239, 42485192, 38838980, 35591921, 32714676, 30169279, 27915815, 25916193, 24137099, 22551288, 21135003, 19863895, 18712883, 17660710, 16693713, 15804235, 14985848, 14230571, 13529318, 12873107, 12253805, 11665284, 11104492, 10570925, 10065265, 9589170, 9145297, 8735301, 8357370, 8006923, 7679532, 7371683, 7079058, 6796674, 6521849, 6255565, 6000029, 5756119, 5523777, 5303264, 5094736, 4897446, 4710371, 4533042, 4365096, 4205692, 4054211, 3911200, 3778060, 3655766, 3543834, 3440149, 3341782, 3246300, 3152290, 3058766, 2964953, 2871092, 2778525, 2688131, 2599472, 2512252, 2427552, 2346448, 2268533, 2193234, 2121673, 2055477]
58011B055477o1005n7197n3687m9478m5398m2161l8989l5605l3287l2476l1556
58000A574638k9674k8337k8389k7829k4943k1405j9689j9334j8443j7284j7401
57989A321910j8320j7998j6095j4309j3765j4015j4306j4053j2646j0236q222
57978A167945p585p490o694n343m203l274k521k672l821m605m299m228n483o812
57964A098915o696n895n744n484l767j463k86K59J697L210K586K46p76P24K486
57949A080012K293P97k70p85j861l779n397n357l471j029M90J183K585N356Q073
57934A078840R104Q634P827O905N371L328J218j208m374p715j0107j1067j0856
57921A075900j0074r731j0783j2765j3968j3731j3245j3220j2451r940o837m681
$$ y = [2055477, 1994472, 1937275, 1883588, 1834110, 1788712, 1746551, 1707562, 1671957, 1638670, 1606194, 1574638, 1544964, 1516627, 1488238, 1460409, 1435466, 1414061, 1394372, 1375038, 1356595, 1339311, 1321910, 1303590, 1285592, 1269497, 1255188, 1241423, 1227408, 1213102, 1199049, 1186403, 1176167, 1167945, 1160360, 1152870, 1146176, 1140833, 1136630, 1133356, 1130835, 1128163, 1124342, 1119737, 1115438, 1111210, 1105727, 1098915, 1092219, 1086324, 1080580, 1075096, 1071329, 1069866, 1069580, 1069839, 1071536, 1074746, 1077332, 1077578, 1076802, 1077526, 1080012, 1082305, 1083102, 1082832, 1082047, 1080186, 1076407, 1071010, 1065653, 1062182, 1061153, 1061643, 1062826, 1065411, 1070767, 1078840, 1087944, 1096578, 1104405, 1111310, 1116681, 1120009, 1121227, 1120019, 1115645, 1107930, 1097823, 1086756, 1075900, 1065826, 1056095, 1045312, 1032547, 1018579, 1004848, 991603, 978383, 965932, 955992, 949155, 944474]
57909I44474l183j419J36O92Q98J619K113J373R1o15j201k295k678j114Q04M10
57893I40105k178m507n512o196o959p041o543o548p065p040o431o069n557l575
57879H58884m00K111L214L873M561M650M243M368M877M157J483k022n144p598
57865H81257r239j0049j1060j3318j5845j6589j5552j4747j4851j4391j2795j1630
57853G21191j1648j0977p862l455l15O06K68j43o3M83J017J337K264M407O399
57838G03509O120M013L017M530O612P238P091P576P962O684M219K542K280K209
57824G75602J301j69j526k603l730n492q151j0860j2009j0977r059p941p867p905
57810F88614p445o553n299l519j152J493L782N052N334N658O849Q143Q102O968
$$ y = [944474, 941291, 939872, 940008, 940700, 941598, 943217, 945330, 946703, 946794, 946179, 944978, 942683, 940005, 938891, 939695, 940105, 937927, 933420, 927908, 921712, 914753, 907712, 901169, 894621, 887556, 880516, 874085, 868016, 862459, 858884, 858484, 860595, 863809, 867682, 872243, 876893, 881136, 885504, 890381, 894538, 896021, 893999, 888855, 881257, 872018, 861969, 850909, 837591, 821746, 805157, 789605, 774858, 760007, 745616, 732821, 721191, 709543, 698566, 690704, 687249, 686934, 687540, 687808, 687665, 687602, 688085, 689102, 690439, 692703, 697110, 703509, 709629, 713642, 716659, 721189, 727801, 735039, 742130, 749706, 757668, 764352, 768571, 771113, 773393, 775602, 776903, 776734, 775208, 772605, 768875, 763383, 755232, 744372, 732363, 721386, 712327, 704386, 696519, 688614, 681169, 674616, 669317, 665798, 664646, 666139, 669921, 674973, 680307, 685965, 692814, 700957, 709059, 716027]
57796G16027O781Q596J0861J1310R485O719M490L500L368K547m87n096q423q465
57782G61213o365m732m560n038n534o192o853o834n991m963m273l954m099m884
57768F86941n909o257n578m625m443n274o402o857o317n436n238o005p027p586
57754F03987p879q538r488r887r241q086p293o982o425n043l159j656r92q41o57
57739E17820k04M76J374K545M092O087Q235R612R388P897O318N101L689K194K055
57724E86679L989O355P008O121N651O375P136O940O130N140L577J140j573l863
57710F46805n690p281q581r455r823r511q560p618p315p360p098o696o712o739
57696E38366n876m422l635l583k818o94J552K587K538K127J659J640K995N599
$$ y = [716027, 722808, 731404, 742265, 753575, 763060, 769779, 774269, 777769, 781137, 783684, 783197, 778101, 769678, 761213, 754848, 750116, 745556, 740518, 734984, 728792, 721939, 715105, 709114, 704151, 699878, 695924, 691825, 686941, 681032, 674775, 669197, 664572, 660129, 654855, 648453, 641596, 635279, 629843, 624605, 618600, 611573, 603987, 596108, 587570, 578082, 568195, 558954, 550868, 543575, 536593, 530168, 525125, 521966, 520310, 519318, 518477, 517820, 517616, 518092, 519466, 522011, 526103, 532190, 540425, 550037, 559425, 567322, 573640, 578741, 582430, 584624, 586679, 590668, 597023, 604031, 610152, 615803, 622178, 629314, 636254, 642384, 647524, 651101, 652241, 650668, 646805, 641115, 633834, 625253, 615798, 605975, 596464, 587904, 580286, 572971, 565611, 558513, 551817, 545105, 538366, 532490, 528068, 524433, 520850, 518032, 517338, 518890, 521477, 524015, 526142, 527801, 529441, 532436, 538035]
57682E38035P643P604O006M462L849M321N985Q321R725Q941O632M621L928M364
57668F24437N383O449P049P256P941R599J1435J2383J2582J2966J3800J4525J4824
57655G60629J4981J5306J5886J6762J7840J8741J9279J9687K0073K0076J9652
57644I58912J9627K0820K3043K5596K8267L0977L3006L3735L4048L5913M0139
57633A284083M5193M8688M9837N0084N1448N4520N8323O1893O5422O9610P4685
57622A913786Q0854Q8968R9443J10943J21775J32533J45506J61155J77169J91853
57612C223985K06452K22713K39794K55326K68181K78390K85294K87473K83198
57603E550806K68668K36932J82211J06580K0838o1929j32724j87575k25726k48769
$$ y = [538035, 545678, 553282, 559288, 563750, 567599, 571920, 577905, 586226, 595951, 604892, 611524, 616145, 620073, 624437, 629820, 636269, 643318, 650574, 658515, 668114, 679549, 691932, 704514, 717480, 731280, 745805, 760629, 775610, 790916, 806802, 823564, 841404, 860145, 879424, 899111, 919184, 939260, 958912, 978539, 999359, 1022402, 1047998, 1076265, 1107242, 1140248, 1173983, 1208031, 1243944, 1284083, 1329276, 1377964, 1427801, 1477885, 1529333, 1583853, 1642176, 1704069, 1769491, 1839101, 1913786, 1994640, 2083608, 2183051, 2293994, 2415769, 2548302, 2693808, 2854963, 3032132, 3223985, 3430437, 3653150, 3892944, 4148270, 4416451, 4694841, 4980135, 5267608, 5550806, 5819474, 6056406, 6238617, 6345197, 6366035, 6304106, 6171382, 5983807, 5758081, 5509312]
57593E509312k60095k62994k59220k49877k36809k22147k06865j90726j73471
57584C447108j55710j38732j23743j10962r9478q8324p7768o8831o1475n4105
57574B467980m5400l5874k7032j9433j2362n110K174Q938J4956K0383K5438L0268
57562B424926L5146M0586M7041N4467O2421P0753P9949R0424J01680J12634J22762
57551C242789J32348J41524J49570J55419J58464J58463J54818J46304J31579
57542D571278J10036Q2243M9710J4190k2730n9384r3635j23154j46246j62483
57532D219825j72673j78353j81042j81464j79357j74121j65786j55442j44691
57523B686896j34777j25989j17800j09600j01286r3144q5338p7854p0835o4533
$$ y = [5509312, 5249217, 4986223, 4727003, 4477126, 4240317, 4018170, 3811305, 3620579, 3447108, 3291398, 3152666, 3028923, 2917961, 2818483, 2730159, 2652391, 2583560, 2522085, 2467980, 2422580, 2386706, 2359674, 2340241, 2327879, 2322769, 2324943, 2333881, 2348837, 2369220, 2394658, 2424926, 2460072, 2500658, 2547699, 2602166, 2664587, 2735340, 2815289, 2905713, 3007393, 3120027, 3242789, 3375137, 3516661, 3666231, 3821650, 3980114, 4138577, 4293395, 4439699, 4571278, 4681314, 4763557, 4813267, 4827457, 4804727, 4745343, 4651708, 4528554, 4382308, 4219825, 4047152, 3868799, 3687757, 3506293, 3326936, 3152815, 2987029, 2831587, 2686896, 2552119, 2426130, 2308330, 2198730, 2097444, 2004300, 1918962, 1841108, 1770273, 1705740]
57513A705740n8956n4021m9994m7063m4447m0912l6536l3000l1283k9983k7019
57502A252526k2476j8455j6281j5147j3714j1846j0193q879p342n120k386Q2J336
57489A122105J124M36P55K579N092P417R556J1859J4194J6229J8116K0323K2885
57476A252670K5394K7609K9688L1840L4041L6175L8230M0434M3237M7046N1739
57465A658103N6634O1246O5947P1502P7997Q4589R0432R5512J00342J05209J09882
57454B577395J13882J16635J17483J15819J11209J03106R0701P3465N1950K7670
57444C499315K199k3292m7582o9180q6876j00206j09214j14293j16528j17379
57434B716964j17334j15296j10046j01907r2321q2265p2125o2751n5263m9638
$$ y = [1705740, 1646784, 1592763, 1542769, 1495706, 1451259, 1410347, 1373811, 1340811, 1309528, 1279545, 1252526, 1230050, 1211595, 1195314, 1180167, 1166453, 1154607, 1144414, 1135535, 1128193, 1123073, 1120687, 1120769, 1122105, 1123229, 1123665, 1124420, 1126999, 1132091, 1139508, 1149064, 1160923, 1175117, 1191346, 1209462, 1229785, 1252670, 1278064, 1305673, 1335361, 1367201, 1401242, 1437417, 1475647, 1516081, 1559318, 1606364, 1658103, 1714737, 1775983, 1841930, 1913432, 1991429, 2076018, 2166450, 2261962, 2362304, 2467513, 2577395, 2691277, 2807912, 2925395, 3041214, 3152423, 3255529, 3346230, 3419695, 3471645, 3499315, 3501514, 3478222, 3430640, 3361460, 3274584, 3174378, 3065164, 2950871, 2834343, 2716964, 2599630, 2484334, 2374288, 2272381, 2180060, 2097795, 2025670, 1962919, 1907656, 1858018]
57424A858018m4628l9368l4064k8892k3444j7752j2661q441m002J484P112J1448
57412A664810J4509J7269J9776K1252K2043K4014K8468L4556M0280M4506M7711
57401A979194N1280N6404O3235P0729P7552Q3367Q8910R4652R9822J03104J03879
57390B872128J02200R7540Q8450P3929N4804L3004R557j5755m2386o7754q9093
57379C116624j06018j19897j30849j37070j37667j34561j30423j25822j19731
57370A974586j12146j04567r8090r2409q6769q0744p3932o6062n7911n1128m6540
57359A104288m3301m0165l6927l4019l1330k8346k5163k2575k0985j9757j7829
57348G83891j4749j1031p702n552m529l821k618q09J122K644L405L045J442o94
$$ y = [1858018, 1813390, 1774022, 1739958, 1711066, 1687622, 1669870, 1657209, 1648768, 1644766, 1646250, 1653362, 1664810, 1679319, 1696588, 1716364, 1737616, 1759659, 1783673, 1812141, 1846697, 1886977, 1931483, 1979194, 2030474, 2086878, 2150113, 2220842, 2298394, 2381761, 2470671, 2565323, 2665145, 2768249, 2872128, 2974328, 3071868, 3160318, 3234247, 3289051, 3322055, 3331612, 3315857, 3273471, 3205717, 3116624, 3010606, 2890709, 2759860, 2622790, 2485123, 2350562, 2220139, 2094317, 1974586, 1862440, 1757873, 1659783, 1567374, 1480605, 1399861, 1325929, 1259867, 1201956, 1150828, 1104288, 1060987, 1020822, 983895, 949876, 918546, 890200, 865037, 842462, 821477, 801720, 783891, 769142, 758111, 750409, 744857, 740328, 736507, 733889, 733080, 734202, 736846, 740251, 743296, 744738, 744044]
57334G44044j977j630l56N48P51J030K024L524N119O651P874Q308P882P120O308
57319G97220N194L894L220L411L539L127L368N260P416P596O021N117N909O882
57305H67174O902P141Q882J1201J2454J2813J3589J4815J5144J3956J2189J1108
57293A007368J1212J2277J3660J4541J4494J3782J2842J1800J0896J0829J1980
57282A145681J3694J4924J5295J5073J4644J4495J5179J6530J7449J7125J6090
57271A316179J5502J5860J6978J8554K0117K0983K1013K0750K0302J9028J7148
57260A522414J6386J7731J9623K0100J9843K0978K3380K4583K3659K2778K4064
57249A755539K6806K9024L0355L1821L3773L5506L6515L6791L6138L4335L1986
$$ y = [744044, 742067, 740437, 740081, 740629, 741380, 742410, 744434, 747958, 753077, 759728, 767602, 775910, 783792, 790912, 797220, 802414, 806308, 809528, 812939, 816478, 819605, 822973, 828233, 835649, 843245, 849266, 854383, 860292, 867174, 874076, 881217, 890099, 901300, 913754, 926567, 940156, 954971, 970115, 984071, 996260, 1007368, 1018580, 1030857, 1044517, 1059058, 1073552, 1087334, 1100176, 1111976, 1122872, 1133701, 1145681, 1159375, 1174299, 1189594, 1204667, 1219311, 1233806, 1248985, 1265515, 1282964, 1300089, 1316179, 1331681, 1347541, 1364519, 1383073, 1403190, 1424173, 1445186, 1465936, 1486238, 1505266, 1522414, 1538800, 1556531, 1576154, 1596254, 1616097, 1637075, 1660455, 1685038, 1708697, 1731475, 1755539, 1782345, 1811369, 1841724, 1873545, 1907318, 1942824, 1979339, 2016130, 2052268, 2086603, 2118589]
57238B118589L0400L0266L1035L1733L1960L1905L1855L2077L3004L5066L8088
57227B475978M1121M3177M4168M4912M6209M8137N0219N1920N2953N3401N3686
57216C005881N4196N4952N5939N7532N9966O2420O3404O2247N9472N5624N0661
57205C642294M4854L9184L4281K9789K5557K2457K1096K0453J9096J7292J6808
57194C933161J8597K1511K3382K2998K1195K0307K2063K5646K8492K9365K9688
57183D196405L1132L3125L4021L3927L4701L7354M0889M3874M6066M8196N0840
57172D630530N3681N5587N5712N4896N5329N8132O1949O4869O7044P0125P4558
57161E302412P8911Q1914Q3865Q5622Q7083Q7190Q5095Q1127P6624P2502O7955
$$ y = [2118589, 2148989, 2179255, 2210290, 2242023, 2273983, 2305888, 2337743, 2369820, 2402824, 2437890, 2475978, 2517099, 2560276, 2604444, 2649356, 2695565, 2743702, 2793921, 2845841, 2898794, 2952195, 3005881, 3060077, 3115029, 3170968, 3228500, 3288466, 3350886, 3414290, 3476537, 3536009, 3591633, 3642294, 3687148, 3726332, 3760613, 3790402, 3815959, 3838416, 3859512, 3879965, 3899061, 3916353, 3933161, 3951758, 3973269, 3996651, 4019649, 4040844, 4061151, 4083214, 4108860, 4137352, 4166717, 4196405, 4227537, 4260662, 4294683, 4328610, 4363311, 4400665, 4441554, 4485428, 4531494, 4579690, 4630530, 4684211, 4739798, 4795510, 4850406, 4905735, 4963867, 5025816, 5090685, 5157729, 5227854, 5302412, 5381323, 5463237, 5547102, 5632724, 5719807, 5806997, 5892092, 5973219, 6049843, 6122345, 6190300]
57150F190300O1400N2940M4874L9150L5459L2859L1894L3606L7304M1302M5479
57139F646567N1334N9465O8597P7323Q5539R3764J02083J10046J16986J22220
57129G533924J25540J27394J28116J27290J24548J20435J15633J09667J01376
57120H613923R0641P9059O9008O2222N8720N6773N4540N1995N0276M9188M6907
57109I283252M2744L8404L5614L4255L3869L5016L7456L8975L7992L5798L4213
57098I687588L2691L0064K7593K7598L0076L3123L5739L7899L8857L8008L6685
57087A0055921L6664L7494L7537L6702L5823L4043K9230K0201O499j2835l7894
57076A0279385o6511r6626j28610j62782j96709k28203k59411k94353l33977l77255
$$ y = [6190300, 6251700, 6304640, 6349514, 6388664, 6424123, 6456982, 6488876, 6522482, 6559786, 6601088, 6646567, 6697901, 6757366, 6825963, 6903286, 6988825, 7082589, 7184672, 7294718, 7411704, 7533924, 7659464, 7786858, 7914974, 8042264, 8166812, 8287247, 8402880, 8512547, 8613923, 8704564, 8783623, 8852631, 8914853, 8973573, 9030346, 9084886, 9136881, 9187157, 9236345, 9283252, 9325996, 9364400, 9400014, 9434269, 9468138, 9503154, 9540610, 9579585, 9617577, 9653375, 9687588, 9720279, 9750343, 9777936, 9805534, 9835610, 9868733, 9904472, 9942371, 9981228, 10019236, 10055921, 10092585, 10130079, 10167616, 10204318, 10240141, 10274184, 10303414, 10323615, 10330114, 10317279, 10279385, 10212874, 10116248, 9987638, 9824856, 9628147, 9399944, 9140533, 8846180, 8512203, 8134948]
57066H134948m25515m81165n43127o07762o73795p42534q14217q88156r65520
57057A993157I45265a88939j223391j318563j424372j541742j670228j813804
57049i181039j979025k169360k386920k637483k927182l256094l621822m027428
57041c2186353m479104m979550n532479o150194o845900p620279q465241r376636
57033h5635736j0350563j1371764j2420627j3485279j4546373j5555692j6453456
57026a79819490j7191383j7688262j7767871j7239010j6124546j4774163j3628026
57019b94232751j2793119j1867928j0224669p490847l804135L23537M351477P977657
57011c27760778J1172482J4021589J6544470J8636803K0147542K0983015K1146039
$$ y = [8134948, 7709433, 7228268, 6685141, 6077379, 5403584, 4661050, 3846833, 2958677, 1993157, 945265, -188939, -1412330, -2730893, -4155265, -5697007, -7367235, -9181039, -11160064, -13329424, -15716344, -18353827, -21281009, -24537103, -28158925, -32186353, -36665457, -41645007, -47177486, -53327680, -60173580, -67793859, -76259100, -85635736, -95986299, -107358063, -119778690, -133263969, -147810342, -163366034, -179819490, -197010873, -214699135, -232467006, -249706016, -265830562, -280604725, -294232751, -307025870, -318893798, -329118467, -336609314, -340413449, -340089912, -335738435, -327760778, -316588296, -302566707, -286022237, -267385434, -247237892, -226254877, -205108838]
57004b05108838K0716580J9822424J8611752J7218751J5738821J4234422J2755328
56997h6010760J1343331J0024420Q810714P710814O730958N868799N115181M461278
56989b5945265L897526L408333K976612K593719K258898J970052J721131J507310
56981e611684J325877J171884J038465R21650c33436C98908O54402N85988N27718
56972B167016M77041M29859L85695L46876L13262K82221K53157K27492K04525
56963E087144J81511J57774J34718J12015Q7862O3184M1787K5896J4671P036K688
56952E916286K85k200m949o629o987o661n040j037M606J0402J6723K4543L2745
56939E972087L9566M5392N0361N0215L8467J2154k8190q2922j52028k28596k98467
$$ y = [-205108838, -184392258, -164569834, -145958082, -128739331, -113000510, -98766088, -86010760, -74667429, -64643009, -55832295, -48121481, -41390523, -35521724, -30406543, -25945265, -22047739, -18639406, -15662794, -13069075, -10810177, -8840125, -7118994, -5611684, -4285807, -3113923, -2075458, -1153808, -333436, 398908, 1053310, 1639298, 2167016, 2644057, 3073916, 3459611, 3806487, 4119749, 4401970, 4655127, 4882619, 5087144, 5268655, 5426429, 5561147, 5673162, 5761024, 5824208, 5865995, 5891891, 5906562, 5913598, 5916286, 5916571, 5914371, 5909422, 5902793, 5895806, 5889145, 5884105, 5883068, 5887674, 5898076, 5914799, 5939342, 5972087, 6011653, 6057045, 6107406, 6157621, 6196088, 6208242, 6180052, 6097130, 5945102, 5716506, 5418039]
56928E418039l49066l76410l83298l74540l55384l31077l04968k78169k51811
56919B413316k27856k07183j88952j72625j58544j46176j34071j22233j12271
56910I43405j04379r6480q7255p8075p0714o4886n9070n2315m4344l5167k5500
56899B25220j6608r127k858K103N001N183K384l282j0533j6706j9847k0533k0252
56886A20145j8950j6005j2595j0556r325o675k335J633M099O052Q269J0273J1972
56873H6002J4025J6214J7509J7964J8335J7674J3867O972m64o933j3147j9037
56861A68981k2386k1884j9152j6444j4188j2038j0307q942o857l791j286m61k18
56848C1027J016L101M924O091O792P088P373Q341R643R787Q258O420N517N232
$$ y = [5418039, 5068973, 4692563, 4309265, 3934725, 3579341, 3248264, 2943296, 2665127, 2413316, 2185460, 1978277, 1789325, 1616700, 1458156, 1311980, 1177909, 1055676, 943405, 839026, 742546, 655291, 577216, 506502, 441616, 382546, 330231, 285887, 250720, 225220, 208612, 199485, 196627, 198730, 203731, 208914, 211298, 208016, 197483, 180777, 160930, 140397, 120145, 101195, 85190, 72595, 62039, 52714, 46039, 43704, 45337, 49436, 55488, 63757, 74030, 86002, 100027, 116241, 133750, 151714, 170049, 187723, 201590, 208562, 208098, 201165, 188018, 168981, 146595, 124711, 105559, 89115, 74927, 62889, 52582, 43640, 36783, 32992, 31706, 31245, 31027, 32043, 35144, 40068, 46159, 52951, 60039, 67412, 75753, 85396, 95183, 103441, 109861, 115378, 120610]
56834A20610N140N852P277P378M635O50j629j788k193m599q224j1558j4547j8166
56820H8838k2495k6158A2456a4678k5267k2481j8389j3264q490m870j358L391
56808a05406Q895J3601J7233K0901a9618I756L2948L5824L7997L9558M0898M1484
56796B38465L9086L1915K1302J0575J648n430j0298j2142j1693j0726r243n663
56784B77796k22M503P330J0194J4848K0282K4877K9083L4283M0588M7273N3827
56772E64662N8872N9373N2747L9163K0936P76j8262l2675m0209m1593l9639l6922
56760E87229l4547l2084k8168k2036j4884q735l887J037O432J1037J4520J8615
56748D94529K4593L1182L5952L7168L3443K3748R193o625k0425l1109l8148m0480
$$ y = [120610, 125750, 131602, 138879, 146257, 150892, 151542, 149913, 148125, 145932, 141333, 133109, 121551, 107004, 88838, 66343, 40185, 12456, -14678, -39945, -62426, -80815, -94079, -102569, -107439, -108797, -105406, -96511, -82910, -65677, -44776, -19618, 9756, 42704, 78528, 116525, 156083, 196981, 238465, 277551, 309466, 330768, 341343, 342991, 337561, 327263, 315121, 303428, 292702, 283459, 277796, 277574, 282077, 289407, 299601, 314449, 334731, 359608, 388691, 422974, 463562, 510835, 564662, 623534, 682907, 735654, 774817, 795753, 796529, 778267, 745592, 705383, 663790, 624151, 587229, 552682, 520598, 492430, 470394, 455510, 446775, 442888, 443925, 450357, 461394, 475914, 494529, 519122, 550304, 586256, 623424, 656867, 680615, 689808, 683183, 662758, 631649, 593501, 553021]
56736E53021l8676l6030l5185l4947l2522k7583k2025j6842j1648o609k453J152
56724B89653N215R560J3141J5907J8558K0366J9158J3950O406p93o173r929j2996
56711C82023j6043j8921k0973k1855k1720k0585j8265j5200j2544j0927r992r396
56699A85602r351r694r503q296o750n710n424o008p318q029o457l010k31L94n
56684A00210r2l09j161j542o02L64j12j136r52J47M88k80j162j867k827l575k982
56667H2610j120N89J050L45p64j328p62K37J58j249k474k651k826l637l597j565
56651F3016P54J137L72R22K936M280L978L153K715K537K875M311O031O253M689
56636A09959K946K296K561L274M292N104N084M500M057L563K414J049L66j1j240
$$ y = [553021, 514345, 478315, 443130, 408183, 375661, 348078, 326053, 309211, 297563, 290954, 288501, 289653, 294868, 304428, 317569, 333476, 352034, 372400, 391558, 405508, 411914, 411121, 404948, 395019, 382023, 365980, 347059, 326086, 304231, 282511, 261926, 243661, 228461, 215917, 204990, 194998, 185602, 176251, 166557, 157054, 148758, 142008, 136298, 130874, 124866, 117548, 109519, 103062, 100052, 99821, 100215, 100210, 100118, 99809, 98648, 97106, 96504, 96868, 96756, 95620, 94668, 94815, 95303, 95023, 93861, 91994, 89167, 85592, 82610, 81490, 82079, 83129, 83474, 82710, 81382, 80620, 80857, 81015, 79766, 77292, 74641, 71815, 68178, 64581, 63016, 63770, 64907, 65279, 66201, 69137, 73417, 77395, 80548, 83263, 85800, 88675, 92986, 99017, 105270, 109959, 112905, 115201, 117762, 121036, 125328, 130432, 135516, 140016, 144073, 147636, 150050, 151099, 151465, 151454, 150214]
56621A50214l179m532m979n467o337o803o416n578m429k819j430j446k824m092
56607H9883m006k395L63L408N221M879L427K698K993L233K979K724K540K094J892
56592A21933K752M144M686M274M129M799N765O796Q090R103R012Q155P378O176
56578B07192L442j01k253k254j418q20l65k74j306l070m035l697k980k338j367
56563A84356m80p81j859j914o82o9j115k382k346j516j054r72o88j60L80O92J63
56546A69573j459k887k464o43N50O24R29J707J495J98K1J963L886L619J919P00
56530A79731K47q4j46K98N35K18L81J721L087L127K127R71k55j340j180M80J959
56513A91877J961J578K354L573L408J845N79O54J763L226M351M434L655L256L850
$$ y = [150214, 147035, 142503, 137524, 132057, 125720, 118917, 112501, 106923, 102494, 99675, 98245, 96799, 93975, 89883, 85877, 83482, 83845, 87253, 92474, 97353, 100780, 103478, 106471, 109704, 112683, 115407, 117947, 120041, 121933, 124685, 128829, 133515, 137789, 141918, 146717, 152482, 159278, 167368, 176471, 185483, 193638, 201016, 207192, 210634, 210533, 208280, 206026, 204608, 203788, 203423, 203149, 201843, 198773, 194738, 191041, 188061, 185723, 184356, 183876, 183095, 181236, 179322, 178640, 178571, 177456, 175074, 172728, 171212, 170158, 169186, 168498, 168338, 168718, 169410, 169573, 168114, 165227, 162763, 162120, 162670, 163294, 164223, 165930, 167425, 167623, 167644, 169607, 173493, 177112, 179031, 179731, 179978, 179894, 179748, 180046, 180581, 180799, 181180, 182901, 185988, 189115, 191242, 192213, 191958, 190618, 189438, 189918, 191877, 193838, 195416, 197770, 201343, 204751, 206596, 207175, 207829, 209592, 212818, 217169, 221603, 225258, 228514, 232364]
56498B32364M496M411M384N174N977N920N816O644P433O703N002M036L976L714
56484C06050L230L496M236L904K061o4j603k930m237m745m028k999k825l538m109
56469B91899l546j852k28j35j725l412l536k085l27O29M28q09k424l292k817j673
56453B65095j092j648l090m796n880n545l960k433k111k886l798m038l336k038
56439B18444j067j046j371j018k08m2n04l53O66J349J258J592K971M187M193L572
56423B32623K960J890N02L66J880K824J604J96J352M289N776M697K827J633R34
56408B66353P20J765L981N915O428N694M428L361L335M656O336P029O547N636
56394C32184M784M172M225M936N287M479L160K326J789R62J82j17o34j913k851
$$ y = [232364, 236860, 241271, 245655, 250829, 256806, 262726, 268542, 275186, 282619, 289322, 294324, 298360, 302336, 306050, 309280, 312776, 317012, 320916, 322977, 322913, 321310, 318380, 314143, 309398, 305370, 302371, 299546, 296008, 291899, 288353, 286501, 286273, 286138, 284413, 281001, 277465, 275380, 275053, 275682, 276110, 275301, 272877, 269585, 266768, 265095, 264003, 262355, 259265, 254469, 248589, 243044, 239084, 236651, 234540, 231654, 227856, 223818, 220482, 218444, 217377, 216331, 214960, 213942, 213734, 213692, 213188, 212835, 213501, 214850, 216108, 217700, 220671, 224858, 229051, 232623, 235583, 237473, 237975, 238341, 240221, 243045, 244649, 244845, 246197, 250486, 256262, 260959, 263786, 265419, 266353, 267073, 268838, 272819, 278734, 285162, 290856, 295284, 298645, 301980, 306636, 312972, 320001, 326548, 332184, 336968, 341140, 345365, 350301, 355588, 360067, 363227, 365553, 367342, 368304, 368486, 368369, 367735, 365822, 362971]
56379C62971k253r07k78k7R31J796P85j720l542m085m800o156o682n662m427m061
56363C21883l762k540j027n07j095j728j411p7J289J413J90j047j400j629k408
56348C06144k532o67J921K695J438K36P1j20r35j465j351j494k038j730k28Q58
56332C00803K59j234k300k796k923k197l86J567K647K954L088L161L043K712J957
56317C10355N98o35n20R55K351K602K099J585J133O75N08P62J222J916K992L892
56301C32490L812L090K868L153K710J311N54J627L627M883M929M345L632L147
56287C76178L281L869L974K990J585R66J593K831L625L440K875L063L960L951
56273D18181K071l7Q6K321M129M156L833M872O828Q071Q003P380P213P953R259
$$ y = [362971, 360718, 359811, 359533, 359506, 360437, 362233, 363018, 361298, 357756, 353671, 348871, 342715, 336033, 330371, 325944, 321883, 318121, 315581, 314554, 314047, 312952, 311224, 309813, 309736, 311025, 312438, 312628, 311581, 310181, 308552, 306144, 303612, 302945, 304866, 307561, 308999, 309235, 309306, 309186, 308251, 306786, 305435, 303941, 301903, 300173, 299945, 300803, 301062, 299828, 297528, 294732, 291809, 289612, 289226, 290793, 293440, 296394, 299482, 302643, 305686, 308398, 310355, 310953, 310318, 309798, 310753, 313104, 315706, 317805, 319390, 320523, 321198, 321706, 322468, 323690, 325606, 328598, 332490, 336302, 339392, 342260, 345413, 348123, 349434, 349988, 351615, 355242, 360125, 365054, 369399, 373031, 376178, 379459, 383328, 387302, 390292, 391877, 392843, 394436, 397267, 400892, 404332, 407207, 410270, 414230, 418181, 420252, 420215, 420301, 422622, 426751, 430907, 434740, 439612, 446440, 454511, 462514, 469894, 477107, 485060, 494319]
56258D94319J0207J0244R819R610R468R053R011J0182J2033J3300J3859J4444
56246F25549J4785J3959J2459J1880J2329J2205J1033J0427J1442J2860J3122
56235G62050J2396J1625J0959J0201R689R635R471Q729P925P891Q845J0402J1872
56222H91690J2570J2683J3547J5908J8288J8725J7849J8326K1104K4433K6947
56211A092070K9483L2962L6609L9495M2248M5978N0673N5652O0456O4719O8323
56200A618668P2349P8472Q6827R5754J04065J12041J19868J26950J33506J40841
56190B689341J49008J55971J60170J62295J63387J62854J59605J53603J44986
56181D101220J33022J17372R9272Q0119N9916L8292J6174m663k3090l8884n2294
$$ y = [494319, 504526, 514770, 524589, 534199, 543667, 552720, 561731, 571913, 583946, 597246, 611105, 625549, 640334, 654293, 666752, 678632, 690961, 703166, 714199, 724626, 736068, 748928, 762050, 774446, 786071, 797030, 807231, 816920, 826555, 836026, 844755, 852680, 860571, 869416, 879818, 891690, 904260, 916943, 930490, 946398, 964686, 983411, 1001260, 1019586, 1040690, 1065123, 1092070, 1121553, 1154515, 1191124, 1230619, 1272867, 1318845, 1369518, 1425170, 1485626, 1550345, 1618668, 1691017, 1769489, 1856316, 1952070, 2056135, 2168176, 2288044, 2414994, 2548500, 2689341, 2838349, 2994320, 3154490, 3316785, 3480172, 3643026, 3802631, 3956234, 4101220, 4234242, 4351614, 4450886, 4531005, 4590921, 4629213, 4645387, 4640724, 4617634, 4578750, 4526456]
56170D526456o3907p4106q2308q7764r1131r3928r6324r7327r7296r8193j00727
56159C543445j03474j05491j07471j09300j09082j06284j03559j03348j04334
56150B591102j03367r9642r5012r1144q8153q5423q2294p8264p3412o8166o2468
56139A663757n6162n0323m6390m3675l9833l4569l0552k9438k9134k6648k1914
56128A255119j7214j4267j3298j3550j3570j2300j0639j0267j0461q531m142l36
56116A126544J083K107M636P148P740P681R006J0974J2045J3384J6863K1110K3047
56103A263368K2531K2287K3697K5564K6840K7977K9485L1138L2590L3399L2876
56092A571752L1212K9955L0020L0382L0052L0033L1618L4183L6541L9226M3548
$$ y = [4526456, 4462549, 4388443, 4306135, 4218371, 4127240, 4033312, 3936988, 3839661, 3742365, 3644172, 3543445, 3439971, 3334480, 3227009, 3117709, 3008627, 2902343, 2798784, 2695436, 2591102, 2487735, 2388093, 2293081, 2201937, 2113784, 2028361, 1946067, 1867803, 1794391, 1726225, 1663757, 1607595, 1557272, 1510882, 1467207, 1427374, 1392805, 1362253, 1332815, 1303681, 1277033, 1255119, 1237905, 1223638, 1210340, 1196790, 1183220, 1170920, 1160281, 1150014, 1139553, 1131022, 1126880, 1126544, 1127627, 1129734, 1134370, 1141518, 1149258, 1156939, 1165945, 1176919, 1188964, 1202348, 1219211, 1240321, 1263368, 1285899, 1308186, 1331883, 1357447, 1384287, 1412264, 1441749, 1472887, 1505477, 1538876, 1571752, 1602964, 1632919, 1662939, 1693321, 1723373, 1753406, 1785024, 1819207, 1855748, 1894974, 1938522]
56081A938522M9524N6546O4845P4503Q4345R3727J04165J17219J32114J47324
56071B862834J63002J79470J94454K04122K06309K01139J89773J74320J57831
56062D533254J42441J28284J15113J03211R1362P6262N6083L2736R033j4144l5876
56051E237759n3485o5725p5637q7288j01620j17880j36447j56778j74737j85784
56041D082378j89482j87895j81577j70563j57243j44225j30721j14868r8193q3897
56031B623714p1882n9660m7350l7717l1600k7037k2694j8878j5447j1867q989
56020B270593q019q126p672o904o906p022o000m357k923n88L528P391Q662Q318
56006B239975Q721R952J1268J3889J8685K3251K5224K6265K8967L2112L3346L3934
$$ y = [1938522, 1988046, 2044592, 2109437, 2183940, 2268285, 2362012, 2466177, 2583396, 2715510, 2862834, 3025836, 3205306, 3399760, 3603882, 3810191, 4011330, 4201103, 4375423, 4533254, 4675695, 4803979, 4919092, 5022303, 5113665, 5189927, 5246010, 5278746, 5287779, 5273635, 5237759, 5184274, 5118549, 5042912, 4955624, 4854004, 4736124, 4599677, 4442899, 4268162, 4082378, 3892896, 3705001, 3523424, 3352861, 3195618, 3051393, 2920672, 2805804, 2707611, 2623714, 2551832, 2492172, 2444822, 2407105, 2375505, 2348468, 2325774, 2306896, 2291449, 2279582, 2270593, 2262574, 2254448, 2246776, 2239872, 2232966, 2225944, 2219944, 2215587, 2212664, 2212076, 2215604, 2222995, 2231657, 2239975, 2248696, 2258648, 2269916, 2283805, 2302490, 2325741, 2350965, 2377230, 2406197, 2438309, 2471655, 2505589]
55994B505589L6223L8841L9533M0307M4105M8604M9347M7381M7624N0969N4146
55983C002669N6316N9473O3106O4736O5342O8112P2250P4151P4260P6554Q1387
55972C758356Q5187Q7298R0835R6499J01593J05580J10788J17348J23012J28065
55962D804561J34947J43235J50607J58026J68230J79934J89841J99230K11897
55953F340508K26795K39981K52686K69615K90147L09525L28127L50797L76996
55944H985177M00633M20292M40916M64689M88851N13309N41842N74774O08674
55935A3439157O43692O82808P23968P61986P97792Q36283Q75759R09957R40304
55926B0611706R75271J018019J065881J120960J188249J263523J336819J408329
$$ y = [2505589, 2541812, 2580653, 2620186, 2660493, 2704598, 2753202, 2802549, 2849930, 2897554, 2948523, 3002669, 3058985, 3118458, 3181564, 3246300, 3311642, 3379754, 3452004, 3526155, 3600415, 3676969, 3758356, 3843543, 3930841, 4021676, 4118175, 4219768, 4325348, 4436136, 4553484, 4676496, 4804561, 4939508, 5082743, 5233350, 5391376, 5559606, 5739540, 5929381, 6128611, 6340508, 6567303, 6807284, 7059970, 7329585, 7619732, 7929257, 8257384, 8608181, 8985177, 9385810, 9806102, 10247018, 10711707, 11200558, 11713867, 12255709, 12830483, 13439157, 14082849, 14765657, 15489625, 16251611, 17049403, 17885686, 18761445, 19671402, 20611706, 21586977, 22604996, 23670877, 24791837, 25980086, 27243609, 28580428, 29988757]
55918B9988757J487263J575471J667361J766012J882711K019792K171209K340881
55910D4899457K541482K773420L025119L297026L605160L959080M359454M821123
55902G3281321N375222O044752O841172P783934Q891885J0153700J1542994J3069026
55894A42984006J4778158J6706279J8874049K1322416K4087234K7134156L0373336
55887B96259634L3653172L6470226L7560337L5089647K7785569J6161859K548570
55880D85529014j0237276k0348472k7310752l1464010l3335031l3429990l2244858
55873B97158625l0227645k7726179k5007327k2286093j9708630j7344914j5225037
55866A39632800j3362907j1742843j0323245r074331p991939p067597o271329
$$ y = [29988757, 31476020, 33051491, 34718852, 36484864, 38367575, 40387367, 42558576, 44899457, 47440939, 50214359, 53239478, 56536504, 60141664, 64100744, 68460198, 73281321, 78656543, 84701295, 91542467, 99326401, 108218286, 118371986, 129914980, 142984006, 157762164, 174468443, 193342492, 214664908, 238752142, 265886298, 296259634, 329912806, 366383032, 403943369, 439033016, 466818585, 482980444, 485529014, 475291738, 454943266, 427632514, 396168504, 362833473, 329403483, 297158625, 266930980, 239204801, 214197474, 191911381, 172202751, 154857837, 139632800, 126269893, 114527050, 104203805, 95129474, 87137535, 80069938, 73798609]
55859G3798609n573426m960141m420016l938151l513658l161883k888277k675747
55851D2667310k503943k363320k243378k125682j999032j868247j740355j614858
55843B6208495j493405j384702j291871j206711j123172j045373r76545r11775
55835A6774941q48108p90749p42543o97440o50957o07689n72114n40738n09534
55826A0815069m80806m56701m33658m09007l85796l65868l45309l21920l00173
55817G315831k83710k69441k54001k39556k28246k16929k02496j86977j73060
55808E261415j59821j46927j37630j33502j31284j28528j27145j27989j27570
55799D041019j23849j19943j18337j16682j12874j08932j06220j02297r6450r2935
$$ y = [73798609, 68225183, 63265042, 58845026, 54906875, 51393217, 48231334, 45343057, 42667310, 40163367, 37800047, 35556669, 33430987, 31431955, 29563708, 27823353, 26208495, 24715090, 23330388, 22038517, 20831806, 19708634, 18663261, 17686716, 16774941, 15926833, 15136084, 14393541, 13696101, 13045144, 12437455, 11865341, 11324603, 10815069, 10334263, 9877562, 9443904, 9034897, 8649101, 8283233, 7937924, 7616004, 7315831, 7032121, 6762680, 6508679, 6269123, 6040877, 5823948, 5621452, 5434475, 5261415, 5101594, 4954667, 4817037, 4683535, 4552251, 4423723, 4296578, 4168589, 4041019, 3917170, 3797227, 3678890, 3562208, 3449334, 3340402, 3234182, 3131885, 3035435, 2942500]
55789B942500r4396r7046r6712r4876r4338r3554q9950q4701p9739p3904o6329
55778A976955n9865n6806n4700n0534m5582m2108l8811l3772k8537k5022k1558
55767A519660j6296j1515j0204j1066j1189j1177j3273j6736j9254k1017k3413
55756A354520k5646k6496k7493l0383l3182l2790k9919k7554k5883k2934j9227
55745A053013j7571j8386j8930j7363j4695j2330j0275q163o161m495l242k495
55733I18907j913q43L80M02j074k533k875k789k958k861k443l013n079p206q402
55718H75700r592j1187j1430r078n948m779o083q716j1930j5266j7929j9759k1378
55705G22625k2358k1217j8384j6698j7431j8201j6574j3482j1167j0091r874j0842
$$ y = [2942500, 2848104, 2751058, 2654346, 2559470, 2465132, 2371578, 2281628, 2196927, 2117188, 2043284, 1976955, 1917090, 1860284, 1805584, 1755050, 1709468, 1667360, 1628549, 1594777, 1566240, 1541218, 1519660, 1503364, 1491849, 1481645, 1470579, 1459390, 1448213, 1434940, 1418204, 1398950, 1377933, 1354520, 1328874, 1302378, 1274885, 1244502, 1211320, 1178530, 1148611, 1121057, 1095174, 1072240, 1053013, 1035442, 1017056, 998126, 980763, 966068, 953738, 943463, 935300, 929139, 924644, 921402, 918907, 916994, 916151, 916531, 916933, 915859, 913326, 910451, 907662, 904704, 901843, 899400, 896387, 891308, 884102, 875700, 866108, 854921, 843491, 834413, 828465, 823686, 817603, 808887, 796957, 781691, 763762, 744003, 722625, 700267, 679050, 660666, 643968, 626537, 608336, 591762, 578280, 567113, 557022, 547148, 536306]
55693E36306j2333j1680p658l079j457k607l936m411m694m811m434m405n601p050
55679D58150p220o339n652n454n514o114o996o648m494k476k668m594o564q187
55665C79230r689j0339r571q383p723o823m867k897k118j892j266j030k198l934
55651C06500m976n589o152n463k682N19K024K125K187J974P37n14m36J33m61j874
55635B88052k659k878l497m210m164l853m066l956k327K74K728N147P453P905
55621B79949N765L718M636P348Q705Q421Q450Q729P440M868L223K701J331j154
55607C54130k789k987l376m398m315k478p59o43j372j837k133k250j384M84K072
55592C25965K548K338J761N75p22r45q9M39l6o00n04l00p08j494j954j728j088
$$ y = [536306, 523973, 512293, 504635, 501556, 500099, 497492, 493556, 489145, 484451, 479640, 475206, 470801, 465200, 458150, 450930, 444591, 438939, 433485, 427971, 421857, 414861, 408213, 403719, 401243, 398575, 393981, 387417, 379230, 369541, 359202, 349631, 341248, 333525, 326702, 321835, 318938, 316820, 314928, 313662, 312632, 310434, 306500, 301524, 295935, 289783, 284320, 281638, 282157, 284181, 286306, 288493, 290467, 291204, 290690, 290254, 290387, 289926, 288052, 285393, 282515, 279018, 274808, 270644, 266791, 262725, 258769, 256442, 256716, 259444, 264591, 272044, 279949, 285714, 289432, 294068, 301416, 310121, 318542, 326992, 335721, 343161, 348029, 351252, 353953, 355284, 354130, 351341, 348354, 344978, 340580, 336265, 333787, 333028, 332385, 331013, 329176, 327043, 324793, 323409, 323893, 325965, 328513, 330851, 332612, 333187, 332465, 331520, 331431, 331870, 331834, 331234, 330730, 330430, 329722, 328228, 326274, 324546, 323458]
55575C23458j007k545n312p392p756p584q033q267p469o952p831q306o352l802
55561B34850m167p174r196q737p640o927n535l803m012o098o734m406k012k379
55547A56030m267n094m878m915m803l527j786p86l9J361K488J848k5j235j115
55532A29257m16L73J218J612J097M24P36J814K231J156q17k310k112p9K339L130
55516A39653J949N13K11L22m34j568j319R96M301P172Q935R533R205Q436P821
55501A95726P752Q185Q468P485M667R00k131l726m714o157q188j0207j1548j1848
55487A74664j1370j0955j1031j0824r458p497o316o006n282l541j697o09l1M72
55473I0519P43P54R83J532J757J341Q24O82P17O35M53Q8m88o51K37J524J911J506
$$ y = [323458, 322451, 319906, 314594, 307202, 299446, 291862, 283829, 275562, 268093, 261141, 253310, 245004, 238652, 234850, 230683, 223509, 214313, 205576, 197936, 191009, 185474, 181671, 177659, 171561, 164827, 160421, 158409, 156030, 151763, 146669, 141791, 136876, 132073, 128546, 126760, 125974, 125935, 127296, 129784, 131632, 131607, 130372, 129257, 128841, 129214, 130432, 132044, 133141, 133565, 134301, 136115, 138346, 139502, 138685, 136375, 134263, 134184, 136523, 139653, 141602, 142115, 142326, 142648, 142214, 140646, 139327, 140323, 144624, 151796, 160731, 170264, 179469, 187905, 195726, 203478, 211663, 220131, 227616, 232283, 233183, 231052, 227326, 222612, 216455, 208267, 198060, 186512, 174664, 163294, 152339, 141308, 130484, 121026, 113529, 107213, 101207, 95925, 92384, 90687, 90078, 90047, 90519, 91262, 92016, 92999, 94531, 96288, 97629, 98453, 99135, 99852, 100487, 100940, 101028, 100540, 99889, 100126, 101650, 103561, 105067]
55455A05067J706K765L209K241R93N60M08k00p85r41j611l467n153m924l303k452
55439I4113l252m539n135n161n133m957m341l521l049l077l149k775k207k256
55425D1561l121l718k914j124J43K62j5m4o2k71l20k41p83k156l368l428k583
55408A7818j745j383j382j330p19M47J149L98j105j659j081r11j662j757k64J079
55392E893K52j909A393c54j28B13Q74Q50N69O8l36p32d1k463k338o42J611a026
55373A423J159O9l53l65l14k27j24k86B45e34J95A241K155J813J642K059K039
55356A0949Q53n17o68K92J162J589K300L498M092L124J269J89M87J011N24m93
55340B9661n16P12J713J355K32o90j522k481k746j816j000j674k791k255l17Q30
$$ y = [105067, 106773, 109538, 112747, 114988, 115981, 116541, 116949, 116749, 115964, 115023, 113412, 109945, 104792, 99868, 96565, 94113, 90861, 86322, 81187, 76026, 70893, 65936, 61595, 58074, 55025, 51948, 48799, 46024, 43817, 41561, 38440, 34722, 31808, 30684, 30827, 31089, 31074, 31030, 30968, 30697, 30377, 30136, 29353, 27197, 23829, 20401, 17818, 16073, 14690, 13308, 11978, 11259, 11706, 12855, 13253, 12148, 10489, 9408, 8497, 6835, 5078, 4814, 5893, 6145, 4236, 1393, -354, -482, 213, 1087, 1937, 2506, 2574, 2238, 1506, -41, -2504, -4842, -5484, -3873, -1026, 1423, 2582, 2651, 2298, 1933, 1619, 1392, 1268, 982, 245, -534, -339, 1241, 3396, 5209, 6851, 8910, 10949, 11802, 11285, 10617, 10909, 12071, 13660, 15960, 19458, 23550, 26674, 27943, 28132, 28619, 29630, 30154, 29661, 29145, 29857, 31570, 32925, 33157, 32467, 30945, 28464, 25718, 23902, 22902, 21228, 18437, 16182, 15865, 16695]
55324A6695O89J075K692L730K874J285L82k07j014j133J4Q87j59k320l461k889
55308A9140j433J13J087N31j472k807j615R59J956L74j858k543j497j09K57o58
55292A0425j816j827n53P33J150J225J448J043o25k487l028k313j326j60J494
55277C383K673J923l84k182k290j504E05a028k515l418l252j509Q59K224K057
55262f582J104J70l45M3J489a141A923J614j68j329A47a870j668j122q53o77J1
55245f179J137J892a209E89J844J793J316M94m21j045q65O5O03k85j851H2d18
55227A208K415J722Q23P23J157J091P7r90p80O10J428M90j087j200N42K442K785
55210A3456J413o77k365l017k715j975r31O97K461K884J264q99j457j99J279J847
$$ y = [16695, 17384, 18459, 21151, 24881, 27755, 29040, 29422, 29215, 28201, 27068, 27082, 27969, 27810, 25490, 22029, 19140, 17707, 17820, 18907, 19438, 17966, 15159, 13544, 14503, 16459, 16833, 14975, 12432, 10935, 10826, 11083, 10425, 8609, 6782, 6229, 6962, 8112, 9337, 10785, 11828, 11203, 8716, 5688, 3375, 2049, 1889, 3383, 6056, 7979, 7595, 5413, 3123, 1619, 505, -1028, -3543, -6961, -10213, -11722, -10863, -8639, -6582, -5478, -5308, -5653, -5610, -4121, -1141, 1923, 3537, 3369, 2040, 147, -1870, -3538, -4660, -5513, -6190, -6179, -5042, -3150, -1209, 589, 2433, 4226, 5542, 6036, 5615, 4570, 3705, 3770, 4373, 4088, 2237, 82, -418, 1208, 3623, 5345, 6168, 6891, 8048, 9139, 9216, 8226, 7446, 8056, 9484, 9974, 8887, 7687, 8229, 10671, 13456, 14869, 14192, 11827, 8810, 6095, 4120, 3189, 3886, 6347, 9231, 10495, 9596, 8139, 7940, 9219, 11066]
55194A1066J740J450J096Q99J120J445J365J037P89J48j441l126l360k026n50
55179A1652J77M62L95n55k033k492j311K6j35j409k032j185K27Q40K51o99q38
55162A341M2R65J041N88M03N00N39R44K231L458K925N94j628k368k092j584o21
55145G278J006K452K854K481K042J650J191R30Q78M09o66j349p38M52O86m29j822
55128A9305k400k021j136j67O15J036J006N14k40o70j97R27J610J031l82j411
55112A7420j329n61j7NQ9P02J288R50o0n38k72o21k314l903l641k025r19q78j027
55093B349j002B61c90I51M039N044L583J442K24l48o76m8J586K475J354n17j105
55076A8004k93O08R14P06o6j079j154K60J880K240J750J561J349M9j770k253q53
$$ y = [11066, 12806, 14256, 15352, 16251, 17371, 18816, 20181, 21218, 22007, 22155, 20714, 17588, 14228, 12202, 11652, 11829, 12291, 12686, 12131, 10098, 7606, 6295, 6321, 6186, 4777, 2745, 1560, 1787, 2627, 2878, 2179, 1341, 1383, 2348, 3389, 3977, 4380, 4880, 5419, 6363, 8594, 12052, 14977, 15571, 13943, 11575, 9483, 7899, 7278, 8284, 10736, 13590, 16071, 18113, 19763, 20954, 21884, 22762, 23171, 22505, 21156, 20418, 20870, 21556, 21127, 19305, 16905, 14884, 13748, 13581, 14196, 15232, 16238, 16752, 16512, 15842, 15645, 16572, 18182, 19213, 18831, 17420, 16091, 15530, 15513, 15518, 15607, 16309, 17597, 18547, 18487, 17949, 17677, 17056, 14742, 10839, 7198, 5173, 4254, 3376, 2349, 1347, 261, -390, 951, 4990, 10034, 13617, 15059, 15283, 14935, 14259, 14211, 15797, 18272, 19626, 19109, 18004, 17711, 18319, 19233, 19939, 19873, 18794, 17640, 17900, 19780, 22020, 23770, 25331, 26680, 26729, 24959, 22706, 21853]
55059B1853J164K713L740M149L598K634K509L495M570N086N356N366M310K018
55045G2561l25j478j314l79O52P44r26l515m761l640j762j205j860k068j184r3
55029D9447M12N12N39L71m3l35j61M05J036J333J022M56O17J775K398O81k670
55012E7795m484k715J095L873M516M026L047J262q16j463O5K280L255K598R56
54997G5290j187l153l617k088j48K30p84j407q58M6P41J573K464K518J445J47
54981G1212o01q53o42K07J007N51q45j266n5Q92Lj389j092O15J688J545J304J353
54963G3634R61L57Q10K116K114q8k225j687R30K750K334R20J49J02ll03j83P54
54945H3442K219L580M301M060K741N97j541k519j747J8J097M40j309k526k353
$$ y = [21853, 23017, 25730, 29470, 33619, 37217, 39851, 42360, 45855, 50425, 55511, 60867, 66233, 70543, 72561, 72236, 70758, 69444, 69065, 69717, 70461, 69535, 66020, 61259, 57619, 55857, 54652, 52792, 50724, 49540, 49447, 49859, 50371, 50910, 51281, 51238, 50903, 50742, 51147, 52183, 53516, 54538, 54994, 55611, 57386, 59784, 60465, 57795, 53311, 50596, 51691, 55564, 60080, 64106, 67153, 68415, 67599, 66136, 66201, 68481, 71736, 74334, 75290, 74103, 70950, 67333, 65245, 65097, 65327, 64543, 63136, 62278, 62324, 63065, 64638, 67102, 69620, 71065, 71212, 70611, 69758, 69116, 69323, 70330, 70881, 70036, 68770, 68715, 69607, 69610, 68221, 67129, 67744, 69432, 70977, 72281, 73634, 74595, 74952, 75762, 77878, 79992, 79904, 77679, 75992, 76922, 79672, 82006, 82926, 83075, 83177, 83174, 82871, 82688, 83442, 85661, 89241, 93542, 97602, 100343, 100940, 99399, 96880, 95133, 95151, 96248, 96688, 95379, 92853, 90500]
54930I0500j459j087j625k376k479j711m40Q46J714J820J162K93p4J75M22O6o78
54913H5069j026n45L40Q58P58M98O95J623L163M839N726M880K454J15m15P12J743
54896A11487J562P84M10L60J69K51J383L383N272O522P188P084N988M663M574
54881A61080O181Q289R478R593R559J0227J1649J3127J3866J3753J3266J2315
54869B92383R846N318L7m100o832r373j2235j4678j6183j6908j6561j4452j1207
54856A85055q808q198q200p526o444n533m394k802j719j755j680k04J721K088
54842A31601Q48r7M34J886L557N497P575R098R933J0857J2306J3601J3917J3246
54828B34259J1944R960P130L909J228m67j866m262q129j2251j4783j5213j4622
$$ y = [90500, 89041, 87954, 86329, 83953, 81474, 79763, 79323, 80169, 81883, 83703, 84865, 85158, 85084, 85259, 85681, 85747, 85069, 84043, 83498, 83838, 84696, 85454, 85952, 86647, 88270, 91433, 96272, 101998, 106878, 109332, 109447, 109032, 109744, 111487, 113049, 113833, 114243, 114603, 114772, 115023, 116406, 119789, 125061, 131583, 138771, 145855, 151843, 156506, 161080, 167261, 175550, 185028, 194621, 204180, 214407, 226056, 239183, 253049, 266802, 280068, 292383, 302229, 307547, 307584, 303484, 296652, 287279, 275044, 260366, 244183, 227275, 210714, 196262, 185055, 176247, 168049, 159849, 152323, 145879, 140346, 135952, 133150, 131431, 129676, 127996, 127792, 129513, 131601, 132449, 132352, 132786, 134672, 138229, 143726, 151301, 160399, 170332, 181189, 193495, 207096, 221013, 234259, 246203, 256163, 263293, 267202, 268430, 267963, 266097, 261835, 253706, 241455, 226672, 211459, 196837]
54815A96837j3865j2571j0542q998r045r620q637o047m189m674o315o872n837
54802H9625m491l673k684n67K194L910L605K152J045M96l91j651j981p57O62P23
54786H8217j06k55M07M21r59k728l599l396k612j664r71r38j386j614j345j090
54770F6382j234j410j154n97j21K12M84N65L52R6J92O39J015R51N75M97J170K198
54752G0812K557J806P28L38O53R81J256K064L273L587K111j21r50N76L109M496
54736I7276M139L450L874N042N449M668L971M624O470Q522J0190J1285J1661J1573
54722A92194J1789J2602J3248J3008J2409J2398J2849J2706J1263Q521M741N90
54710C18318k769m798o364q411j0262j0555r410q257p636o722n175l866l375l057
$$ y = [196837, 182972, 170401, 159859, 150861, 141816, 132196, 123559, 117512, 113323, 108649, 102334, 95462, 89625, 85134, 81461, 78777, 78210, 80404, 84314, 87919, 90071, 91116, 91612, 91221, 89570, 87589, 86832, 87494, 88217, 88111, 87856, 88263, 88684, 87725, 84997, 81398, 78002, 75390, 73726, 72755, 71817, 70431, 68817, 67472, 66382, 65148, 63738, 62584, 61987, 61866, 62078, 62562, 63127, 63479, 63575, 63767, 64406, 65421, 66372, 66947, 67444, 68614, 70812, 73369, 75175, 75903, 76241, 76894, 77875, 79131, 81195, 84468, 88055, 90166, 90045, 89095, 89671, 92780, 97276, 101415, 104865, 108739, 113781, 119230, 123898, 127869, 132493, 138963, 147485, 157675, 168960, 180621, 192194, 203983, 216585, 229833, 242841, 255250, 267648, 280497, 293203, 304466, 312987, 317728, 318318, 315549, 310751, 304387, 295976, 285714, 275159, 265749, 257492, 249856, 243134, 237959, 234093, 230718, 227661]
54696B27661k161p59Q31K557M095M900N210N958P241P975P670P465Q557J0553
54682B97753J2267J3336J4132J4586J4121J2501J0117P631N693M603L811K183
54670D12734q50m833r124j3450j7340j9817k0440k0024j9679j9499j8834j7371
54658B31473j5317j2972j0746r202q461p865o784n389m191l280k615k521l058
54645A39072l366k557j119l56n41o02J15P14J8j741l141l201k128o42P46J683
54629A22954J815J175M12J69M17Q26J515K708L691L124Q33j515k188j200L02J647
54613A36685K716L077K393J451J520K571L368L372L374L935M474M368M012M040
54599A81356M286M132L380K333J525J627K980M896O120O220N926N934O256O799
$$ y = [227661, 225500, 224741, 225572, 228129, 232224, 237124, 242334, 248292, 255533, 263508, 271178, 278643, 287200, 297753, 310020, 323356, 337488, 352074, 366195, 378696, 388813, 396444, 402137, 406740, 410551, 412734, 411884, 407051, 397927, 384477, 367137, 347320, 326880, 306856, 287177, 267678, 248844, 231473, 216156, 203184, 192438, 183236, 174775, 166910, 160126, 154737, 150546, 147266, 144651, 142130, 139072, 135706, 133149, 132030, 131674, 131133, 130531, 130646, 131360, 131378, 129637, 126496, 123295, 121167, 120525, 121271, 122954, 124769, 125944, 126356, 126525, 126942, 127768, 129283, 131991, 135682, 138806, 139639, 138124, 135936, 134736, 135038, 136685, 139401, 142478, 144871, 146322, 147842, 150413, 153781, 157153, 160527, 164462, 168936, 173304, 177316, 181356, 185642, 189774, 193154, 195487, 197012, 198639, 201619, 206515, 212635, 218855, 224781, 230715, 236971, 243770]
54585B43770P568Q001P302N996N904P763J0029J0985J1007J1624J3246J5123J6852
54572C75170J8449J9199J7895J4309R517M739N90k741n484q394j2005j5696j8222
54559C97326j9121j8927j8085j6477j4214j2140j1149j1236j1409j0510q321n969
54547B39768m823m741m092k047j87q15m004p300q285o661l885j720j290k594m429
54532A82895n285m715l575k853k654k536k356k389k809l388l727l651l267k746
54518A36944k156j597j357j573j889j851j598j648j990j950j163j50L62J59o11
54503A17932j707k653k892k394j631p76L69J545K077K069K470L407L653K580J419
54488A25468J571K596L147K905K333J394J33k44J228L202L304J342m82n26R61
$$ y = [243770, 251338, 259339, 266641, 272637, 278541, 286304, 296333, 307318, 318325, 329949, 343195, 358318, 375170, 393619, 412818, 430713, 445022, 454539, 459278, 459868, 457127, 451643, 443249, 431244, 415548, 397326, 378205, 359278, 341193, 324716, 310502, 298362, 287213, 275977, 264568, 254058, 245737, 239768, 234945, 230204, 226112, 224065, 223878, 223063, 219059, 211759, 203474, 196813, 192928, 191208, 189918, 187324, 182895, 177610, 172895, 169320, 166467, 163813, 161277, 158921, 156532, 153723, 150335, 146608, 142957, 139690, 136944, 134788, 133191, 131834, 130261, 128372, 126521, 124923, 123275, 121285, 119335, 118172, 118022, 118384, 118543, 117932, 116225, 113572, 110680, 108286, 106655, 105879, 106248, 107793, 109870, 111939, 114409, 117816, 121469, 124049, 125468, 127039, 129635, 132782, 135687, 138020, 139414, 139547, 139303, 140531, 143733, 147037, 148379, 147897, 147371, 148332]
54473A48332L446O699R387R433P007N196O224Q540R257Q212P579Q243Q695P474
54459B53724M986K495N61j010k536m212o013p591q670r466j0230j0494r584p837
54445A84123o473n981n443l929j930p76r41j617j814j288m29K65M84K56j19m44
54429A53944q94j522j674o30J061J764P60o02n03J043K365K229Q34j009k487k567
54413A52112o12K364M161L872K934K994L640L256J429o11j663j640j121p07p86
54398A69622j224j335o73K90Q04Q30Q51J022J102R90N51n97k275l108j937K49
54382A65162J016n29k592l005j812q06j144k271k991k890k394j889j293o41n10
54367A41411j172j650n59J827L512L301K286J928J895J112Kj29N34M82n84j204
$$ y = [148332, 151778, 158477, 167864, 177297, 184304, 189500, 195724, 204264, 213521, 221733, 229312, 237555, 246250, 253724, 258710, 261205, 261766, 260756, 258220, 254008, 247995, 240404, 231734, 222268, 212038, 201544, 191960, 184123, 177650, 171669, 166226, 162297, 160367, 159591, 158650, 157033, 155219, 153931, 153502, 153767, 154251, 154507, 154388, 153944, 153050, 151528, 149854, 149224, 150285, 152049, 152809, 152207, 151704, 152747, 155112, 157341, 158175, 157166, 154679, 152112, 151500, 153864, 158025, 161897, 164831, 167825, 171465, 174721, 176150, 175539, 173876, 172236, 171115, 170408, 169622, 168398, 167063, 166390, 166680, 167484, 168314, 169165, 170187, 171289, 172279, 172830, 172233, 169958, 166850, 164913, 165162, 166178, 165649, 163057, 160052, 158240, 157434, 156290, 154019, 151028, 148138, 145744, 143855, 142562, 141921, 141411, 140239, 138589, 138030, 139857, 143369, 146670, 148956, 150884, 152779, 153891, 153893, 153764, 154298, 154780, 154196, 152992]
54351A52992n17N78J245K083L762N494N997N139L688K126O44j58L67J960L521
54336A88921M232M328M674N650O453N851L788J700O70Q4r58j776j270m15j422
54321B20510m212n978n036l132k748l876m937n283n058l771j172J060O69k179
54307A74857m845n358m299l324l024k639j274R41K624K355M63j004o97L96O27
54292A55799J61L24J161J397P51N36J520K728L033K631K219J775J077O89J417
54277A77218L119M730N232M193J846r38l005l743l350k259q07L45K52j188k699
54262A78946k982k297k000k683l562l813l678l898m597n239n393m995m069k731
54248A27009j568j396k301l304l431k853k395k239j811j005n42p66r04k13P05
$$ y = [152992, 152475, 153053, 154298, 156381, 160143, 165637, 171634, 176773, 180461, 182587, 183231, 183073, 183440, 185400, 188921, 193153, 197481, 202155, 207805, 214258, 220109, 223897, 225597, 226267, 226351, 225393, 223617, 222347, 221932, 220510, 216298, 210320, 205284, 202152, 199404, 195528, 190591, 185308, 180250, 176479, 175307, 176367, 177036, 174857, 170012, 164654, 160355, 157031, 154007, 151368, 150094, 151035, 153659, 156014, 156477, 155473, 154776, 155172, 155799, 155960, 156284, 157445, 158842, 159593, 160129, 161649, 164377, 167410, 170041, 172260, 174035, 175112, 175801, 177218, 180337, 185067, 190299, 194492, 196338, 195400, 192395, 188652, 185302, 183043, 182236, 182581, 182833, 181645, 178946, 175964, 173667, 171667, 168984, 165422, 161609, 157931, 154033, 149436, 144197, 138804, 133809, 129740, 127009, 125441, 124045, 121744, 118440, 115009, 112156, 109761, 107522, 105711, 104706, 104164, 103398, 102494, 102281, 102986]
54233A02986N77q45k574l726m253m302l650k186n12M43L32l38p50n49o4K09K26
54216H1024K70L42J65j22P1P75J110N66j8M13J481J922J445R29P90M87j74m95
54198I0981r4M28O37R76J622J694O81l17j7J075J501J205J413K238K132K78j980
54181A04453k892k413j581p87J97J042J085N44L34O24O29K2m52k27J26j23o09
54164I9972m80J80M28j21p69q41n49m39m78j67O70J638K300K542K382J643J84
54147A08095j618k858k851j831o59J09O08J031J137O60m7k71K93J305K157K256
54131A07516J223o70k394l010k753k667l154l550l297k865l021l660l878l037
54117G0783j293O64K049K334J557L62n76j049j201j172j046r38q00l29O16J595
$$ y = [102986, 103563, 102718, 100144, 96418, 92165, 87863, 84213, 82027, 81515, 81958, 82290, 81952, 81202, 80653, 80589, 80798, 81024, 81294, 81636, 81801, 81679, 81750, 82525, 83635, 84201, 84183, 84596, 86077, 87999, 89444, 90373, 91163, 91650, 91476, 90981, 90887, 91315, 91952, 92928, 94550, 96244, 96925, 96608, 96591, 97666, 99167, 100372, 101785, 104023, 106155, 106433, 104453, 101561, 99148, 97567, 96780, 96977, 98019, 99104, 99648, 99982, 100606, 101235, 101257, 100805, 100578, 100704, 100581, 99972, 99492, 99672, 100100, 99979, 99210, 98369, 97820, 97381, 96903, 96736, 97406, 99044, 101344, 103886, 106268, 107911, 108095, 106477, 103619, 100768, 98937, 98278, 98387, 98995, 100026, 101163, 101823, 101776, 101505, 101798, 103103, 105260, 107516, 108739, 108069, 105675, 102665, 99912, 97245, 94091, 90541, 87244, 84379, 81358, 77698, 73820, 70783, 69490, 70154, 72203, 74537, 76094, 76456, 75880, 74831, 73630, 72458, 71412, 70474, 69674, 69345, 69961, 71556]
54101G1556J905J295J62p93r69j57J198K161K081J133j7r91j755k105j696o21
54085G2387L72N38r5q23j008o45k32j61m14q79j656k695l244k373l06J366J427
54068F1559M95K09J142K251K330J276j45j050p85O82K235K196J47k201k803j786
54052F5752j235k396m043m113k362m72J81L4M02J684K911K749P59k141m123l691
54036D9896r64K298M174M170L274K655K615K707K510K091J804J676J252L15m04
54021H0069J35J767K973K684J500M72n61k226l757l440j087J292J853R08Nk0O42
54004H3209J608K541K957K643K053J851K127K453K348J486o1j412j280O62L186
53989A06371M711M728L687K090L54q34q19M16K203L601L791K734J638K000L759
$$ y = [71556, 73461, 74756, 74918, 74125, 73156, 72999, 74197, 76358, 78439, 79572, 79555, 78564, 76809, 74704, 73008, 72387, 72759, 73297, 73202, 72379, 71371, 70726, 70494, 70333, 69919, 69040, 67384, 64689, 61445, 59072, 58766, 60132, 61559, 62054, 62263, 63405, 65656, 67986, 69262, 69117, 68067, 67282, 67964, 70199, 72395, 72542, 70341, 67538, 65752, 64517, 62121, 58078, 53965, 51603, 51131, 51312, 51346, 51748, 53432, 56343, 59092, 59851, 57710, 53587, 49896, 48932, 51230, 55404, 59574, 62848, 65503, 68118, 70825, 73335, 75426, 77230, 78906, 80158, 80473, 80069, 80204, 81971, 84944, 87628, 89128, 89600, 89039, 86813, 83056, 79616, 78529, 79821, 81674, 82582, 82587, 82567, 83209, 84817, 87358, 90315, 92958, 95011, 96862, 98989, 101442, 103790, 105276, 105215, 103803, 102523, 103185, 106371, 111082, 115810, 119497, 121587, 121941, 121107, 120288, 120704, 122907, 126508, 130299, 133033, 134671, 136671, 140430]
53974A40430N237N433N289N953O939P306P492Q289Q786P346M458K536K724L758
53960B21976M517N721Q093J0356J0541Q468N752L824K871K319J529K61r94j401
53946B83833r05m26o34j137j365j559k111k632k597k418k912m070n214o141o953
53931B42759p086n731l524k439l380m838m861l612k950l713m679m379l049k200
53917A86318k713l892m250k895m21J424J312j00o14R12K905K864N60j634j683
53902A78093O2J957K973K757J177j103k436j932p95o33j023l85J101J371l64k133
53886A78687j770M64K758M171M939N196M708L676K791K511K918M055N783P477
53872B28364Q556R146R529R152P099L782J216R97K396L218K383J007P08J669K922
$$ y = [140430, 145667, 151100, 156389, 162342, 169281, 176587, 184079, 192368, 201154, 208500, 212958, 215494, 218218, 221976, 226493, 232214, 240307, 250663, 261204, 269672, 275424, 279248, 282119, 284438, 285967, 286228, 285234, 283833, 282928, 282502, 281868, 280731, 279366, 277807, 275696, 273064, 270467, 268049, 265137, 261067, 255853, 249712, 242759, 235673, 229942, 226418, 223979, 220599, 215761, 210900, 207288, 204338, 200625, 195946, 191567, 188518, 186318, 183605, 179713, 175463, 172568, 172147, 173571, 174883, 174783, 174169, 175081, 177986, 180850, 181410, 179776, 178093, 178155, 180112, 183085, 185842, 187019, 185916, 183480, 181548, 180753, 180120, 179097, 178712, 179813, 181184, 180820, 178687, 176917, 177381, 180139, 184310, 189249, 194445, 199153, 202829, 205620, 208131, 211049, 215104, 220887, 228364, 236920, 246066, 255595, 264747, 271846, 275628, 276844, 277841, 280237, 283455, 285838, 286845, 287553, 289222, 292144]
53857B92144L956M970N635N085L568K840L883N272N273M684N765Q671J1045J1306
53843C74097J0386R545Q437O577N034M945N419M648K542P05O9k7m33j141j767
53828D29036k193k558l205m525o333p677p989p978q577r536j0025j0147j0526
53815C37767j0796r954q182o815o351o004n589o113p779q893p940n665l918l357
53801B40411l532m311n706o737o196m602l828m489m978l809j770q01j445k540
53787A85667l058l165l256l023k091j043r22j762k350j814q59q45j961l040l206
53772A53272k751k157j196K14R98Q0j623j830J35K320K835K345K501K941J873
53757A59957m64j266R93M024M523K304n8r00p33j87J082K920M004L598K691K351
$$ y = [292144, 296100, 301070, 306705, 311790, 315358, 318198, 322081, 327353, 332626, 337310, 343075, 351746, 362791, 374097, 384483, 394028, 402465, 409042, 414076, 419021, 424440, 429088, 431630, 432335, 432404, 432377, 431944, 430803, 429036, 426843, 424285, 421080, 416555, 410222, 402545, 394556, 386578, 378001, 368465, 358440, 348293, 337767, 326971, 317017, 308835, 302020, 295669, 289665, 284076, 277963, 270184, 261291, 253351, 247686, 243768, 240411, 236879, 232568, 226862, 220125, 213929, 209327, 205499, 201010, 196032, 192223, 190453, 189652, 188207, 185667, 182609, 179444, 176188, 173165, 171074, 170031, 169109, 167347, 164997, 163183, 162324, 161479, 159518, 156478, 153272, 150521, 148364, 147168, 147382, 148380, 148460, 146837, 145007, 145142, 147462, 150297, 152642, 155143, 158084, 159957, 159493, 158227, 159220, 163244, 167767, 170071, 170013, 169113, 168380, 168193, 169275, 172195, 176199, 179797, 182488, 184839]
53741A84839K251J871K011L626O026P704Q381Q765Q742P643O137N900P029P612
53727B68537O599N474O013P657Q558Q247P689P184N856L377Q60m54n55k98k36
53712C34508k91l03n27j564l696o188p608p271o083n355n158m667l971m242n740
53697B71844o859o087m179l270m190n722o364n828m639l237j981j275j184j313
53683B15716j440j768k234k178j280l06j84o82q50m96k48j96L76J561K168J164
53667B09123q02k079j866o84O18J602K103K075J760J473J122L68o63j257q29M81
53651B12545K028L166L476L007K465K652L466L808K906J439Q29J524K539K694
53637B48544J873Q62L08K17M27J142K728M937O632O672N246L959M191N443N888
$$ y = [184839, 187090, 188961, 190972, 194598, 200624, 208328, 216709, 225474, 234216, 241859, 247996, 253896, 260925, 268537, 275136, 280610, 286623, 294280, 302838, 311085, 318774, 325958, 331814, 335191, 336051, 335597, 335042, 334744, 334508, 334217, 333914, 333387, 331823, 328127, 321939, 314331, 307060, 300977, 295622, 290464, 285797, 281826, 277584, 271844, 264985, 258898, 254719, 251449, 247259, 241537, 235173, 229345, 224706, 221469, 219488, 218213, 217029, 215716, 214276, 212508, 210274, 208096, 206816, 206510, 206326, 205644, 204794, 204298, 204050, 203854, 204230, 205791, 207959, 209123, 208321, 206242, 204376, 203692, 204310, 205912, 208015, 210090, 211850, 213323, 214445, 214813, 214150, 212893, 212064, 212545, 214573, 217739, 221215, 224222, 226687, 229339, 232805, 236613, 239519, 240958, 241787, 243311, 245850, 248544, 250417, 251279, 251587, 251804, 252231, 253373, 256101, 261038, 267670, 274342, 279588, 283547, 287738, 293181, 299069]
53622B99069M562K446J145J155J898K918M109M989M840L795K929K787K593J531
53608C40766K25OJ047K134K222J443M29n05j173j216n43K44L29m45j417j689q47
53591C41010O55J685J302l08j998k719k259r56O91J986K199J312K62n2K16K87
53575C43313l2r5O18J728K354K068J400J385K462L781L949K679J368J515K946
53560C71439M231M572M522M724M892M584M236M583N364N516M688L774L641M027
53546D34793M231M310M884O018P133P961Q648Q903Q109O801O826Q961J1169J0752
53532E39499P872N437N308O220O169N327N318O469P379P045O084N480N203M675
53518F23485L983L746L879L305J363q62j436P7J849J990Q85L73R49J113k74k199
$$ y = [299069, 303631, 306077, 307222, 308377, 310275, 313193, 317302, 322291, 327131, 330926, 333855, 336642, 339235, 340766, 340991, 340997, 342044, 344178, 346400, 347843, 348272, 347767, 346594, 345378, 344835, 345079, 345408, 344963, 343546, 341857, 341010, 341665, 343350, 344652, 344344, 342346, 339627, 337368, 336412, 337103, 339089, 341288, 342600, 342862, 342810, 343026, 343313, 343281, 343186, 343804, 345532, 347886, 349954, 351354, 352739, 355201, 358982, 362931, 365610, 366978, 368493, 371439, 375670, 380242, 384764, 389488, 394380, 398964, 403200, 407783, 413147, 418663, 423351, 427125, 430766, 434793, 439024, 443334, 448218, 454236, 461369, 469330, 477978, 486881, 494990, 501791, 508617, 517578, 528747, 539499, 547371, 552808, 558116, 564336, 570505, 575832, 581150, 587619, 594998, 602043, 608127, 613607, 618810, 623485, 627468, 631214, 635093, 638398, 639761, 638899, 637463, 637540, 639389, 641379, 642264, 642637, 643586, 644699, 644425, 642226]
53502F42226k855j833k40P74P58j02j001q82L36J369J170M43N59J480J972J633
53486F45807J292J394J383J191J884L936N921O095M772M007N047P086Q626R146
53472G07587Q967Q214O821N455N433P259R748J1360J2087J3168J5092J6890J7720
53459H45801J8053J8694J9602K0451K1590K3343K4995K5746K6187K7583K9847
53448A101892L1631L2385L2983L4138L5592L7244L9620M2557M4752M5520M6017
53437A524331M7592M9751N0947N0862N0741N1522N2727N3257N2628N1240M9893
53426B085491M9200M9171M9359M9451M9608N0026N0685N1591N2783N3680N3125
53415B644170N0764M8039M6832M7217M7281M5420M2087L8915L6575L4161L0796
$$ y = [642226, 639371, 637538, 637298, 638072, 638830, 638728, 637727, 636845, 637181, 638550, 639720, 640163, 640722, 642202, 644174, 645807, 647099, 648493, 649876, 651067, 652951, 656887, 662808, 668903, 673675, 677682, 682729, 689815, 698441, 707587, 716554, 724768, 731589, 737044, 742477, 749736, 759484, 770844, 782931, 796099, 811191, 828081, 845801, 863854, 882548, 902150, 922601, 944191, 967534, 992529, 1018275, 1044462, 1072045, 1101892, 1133523, 1165908, 1198891, 1233029, 1268621, 1305865, 1345485, 1388042, 1432794, 1478314, 1524331, 1571923, 1621674, 1672621, 1723483, 1774224, 1825746, 1878473, 1931730, 1984358, 2035598, 2085491, 2134691, 2183862, 2233221, 2282672, 2332280, 2382306, 2432991, 2484582, 2537365, 2591045, 2644170, 2694934, 2742973, 2789805, 2837022, 2884303, 2929723, 2971810, 3010725, 3047300, 3081461, 3112257]
53404C112257K7240K5168K4844K4311K1537J6921J2659R886P620M665J239j943
53392C286404n022q419j1816j4778j7855k1702k5648k8363k9840l1369l3612l5911
53380C022069l7801l9747m1931m3490m3750m3372m3469m4165m4770m4780m4007
53369B550787m2255l9685l7171l5550l4628l3493l1484k8356k4010j8959j4690
53358B210506j2395j1348r472n674q08L748P454J0325J2449J4380J7131K1025
53346B257321K5269K9237L3336L7886M2054M5055M7616N0944N4756N7741N9647
53335B740862O1427O3459O5328O7481P1271P6777Q2140Q5933Q8791R1849R4926
53324C590244R7433R9820J02826J06178J09227J11931J13962J14031J11830J09644
$$ y = [3112257, 3139497, 3164665, 3189509, 3213820, 3235357, 3252278, 3264937, 3274823, 3282443, 3287108, 3288347, 3286404, 3281382, 3272963, 3261147, 3246369, 3228514, 3206812, 3181164, 3152801, 3122961, 3091592, 3057980, 3022069, 2984268, 2944521, 2902590, 2859100, 2815350, 2771978, 2728509, 2684344, 2639574, 2594794, 2550787, 2508532, 2468847, 2431676, 2396126, 2361498, 2328005, 2296521, 2268165, 2244155, 2225196, 2210506, 2198111, 2186763, 2177291, 2171617, 2170809, 2174557, 2182011, 2192336, 2204785, 2219165, 2236296, 2257321, 2282590, 2311827, 2345163, 2383049, 2425103, 2470158, 2517774, 2568718, 2623474, 2681215, 2740862, 2802289, 2865748, 2931076, 2998557, 3069828, 3146605, 3228745, 3314678, 3403469, 3495318, 3590244, 3687677, 3787497, 3890323, 3996501, 4105728, 4217659, 4331621, 4445652, 4557482, 4667126]
53314D667126J09975J11952J12248J09388J05086J01094R6932R1460Q4889P8186
53304E668336P1712O5328N8862N1811M3649L5108K7913K2468J7001R873J728n751
53292F068038j2346j9351k7674l6968m6455n5794o5286p5604q6830r7448j05077
53281E439205j08835j10327j11646j13183j14106j14157j13806j13211j12092
53272D427842j10479j08706j06861j04947j03354j02414j01711j00445r8244r5086
53262C395595r0908q5878q0684p5844p1128o6202o1332n6894n2752m8864m5741
53251B659368m3406m0647l6483l1709k7815k4809k1567j7964j5011j2903j0553
53240B376501p403m362k313q60R04L254N956Q778J1417J3519J5252J7193J9490
$$ y = [4667126, 4777101, 4889053, 5001301, 5110689, 5215775, 5316869, 5413801, 5505261, 5590150, 5668336, 5740048, 5805376, 5864238, 5916049, 5959698, 5994806, 6022719, 6045187, 6062188, 6072061, 6073789, 6068038, 6055692, 6036341, 6008667, 5971699, 5925244, 5869450, 5804164, 5728560, 5641730, 5544282, 5439205, 5330370, 5220043, 5108397, 4995214, 4881108, 4766951, 4653145, 4539934, 4427842, 4317363, 4208657, 4101796, 3996849, 3893495, 3791081, 3689370, 3588925, 3490681, 3395595, 3304687, 3218809, 3138125, 3062281, 2991153, 2924951, 2863619, 2806725, 2753973, 2705109, 2659368, 2615962, 2575315, 2538832, 2507123, 2479308, 2454499, 2432932, 2414968, 2399957, 2387054, 2376501, 2369098, 2364736, 2362423, 2361563, 2362467, 2365721, 2371677, 2380455, 2391872, 2405391, 2420643, 2437836, 2457326]
53227B457326K1760K4016K6885L0606L4533L8066M1365M4657M7512M9245M9699
53216B865670M9224M8287M7377M6785M6200M4953M2923M0657L8423L5847L2855
53205C339201L0195K8256K5955K1808J6070J0836P693N867L275q55n234q436j0852
53192C463779j4072j8719k3945k8935l3831l8766m3082m6375m9515n3634n8558
53181C054347o3042o6206o7915o8229o7490o6516o5763o4676o2763o0689n9192
53170B341866n7614n5106n2674n1991n2427n1570m8969m7041m7372m8403m8075
53159A780624m6805m6083m5605m3888m0834l7682l4937l2172k9572k7975k7341
53148A367730k6676k5651k4860k4340k3267k1644k0915k1915k3278k3035k1279
$$ y = [2457326, 2479086, 2503102, 2529987, 2560593, 2595126, 2633192, 2674557, 2719214, 2766726, 2815971, 2865670, 2914894, 2963181, 3010558, 3057343, 3103543, 3148496, 3191419, 3232076, 3270499, 3306346, 3339201, 3369396, 3397652, 3423607, 3445415, 3461485, 3472321, 3480014, 3485881, 3489156, 3488301, 3483067, 3474631, 3463779, 3449707, 3430988, 3407043, 3378108, 3344277, 3305511, 3262429, 3216054, 3166539, 3112905, 3054347, 2991305, 2925099, 2857184, 2788955, 2721465, 2654949, 2589186, 2524510, 2461747, 2401058, 2341866, 2284252, 2229146, 2176472, 2124481, 2072054, 2020484, 1971515, 1924474, 1877102, 1828699, 1780624, 1733819, 1687736, 1642131, 1598243, 1557409, 1519727, 1484790, 1452618, 1423046, 1395071, 1367730, 1341054, 1315403, 1290543, 1266203, 1242936, 1221292, 1200377, 1178462, 1155184, 1132149, 1110870]
53137A110870j9936j9980k0268j9523j8349j8200j9109j9845k0059k0559k1184
53126H93858k0309j7582j5479j6270j8607j9291j7758j6418j6687j7299j6928
53115G01230j5990j4996j3434j1607j1354j3225j4821j3841j1336r896r796r364
53103E51570q278q008r037r837r120p443o136n758o071o639p157p603q065q125
53089D44293o980m736k872k679l956n889q049r538q682n366k413k536m724n858
53075C70015n145m378m181l083p43P49m7j697k086j079J33Q06O73n35k409l688
53059C43305l661k932k319k145k759m340n779n463l664k455k562k493j588j497
53045B99648l038l910j899J411K628J091j017k210k833l201l102l060l823m562
$$ y = [1110870, 1090934, 1070954, 1050686, 1031163, 1012814, 994614, 975505, 955660, 935601, 915042, 893858, 873549, 855967, 840488, 824218, 805611, 786320, 768562, 752144, 735457, 718158, 701230, 685240, 670244, 656810, 645203, 633849, 620624, 605803, 591962, 580626, 570730, 560934, 551570, 543292, 535284, 526247, 516410, 507290, 499847, 493711, 487953, 481882, 475243, 468086, 460483, 452418, 444293, 437313, 432577, 429705, 427026, 423070, 417181, 409132, 399594, 390912, 385546, 383133, 380597, 375873, 370015, 364870, 360492, 356311, 353228, 352485, 353234, 353187, 351490, 349404, 348325, 348458, 349264, 349937, 349402, 346993, 343305, 339644, 336712, 334393, 332248, 329489, 325149, 319370, 313907, 310243, 307788, 305226, 302733, 301145, 299648, 296610, 292700, 290801, 292212, 294840, 295931, 294914, 292704, 289871, 286670, 283568, 280508, 276685, 272123]
53031B72123l623j225N72Q50Q33J456J851J044l04q08l6J441K851L611L680L745
53015B88061M349M829M081K325Q47J04n08r93n46N22N07j168k733k605j710j904
52999B93458l100l670l114k702l520n156o473o824o292n406m711m273l665k688
52985B31864j730j172q95q11j295k463l596m033m145m596n033m548l207k057j627
52970A90656j429j071p77n72M4J071J545P68o99j985l163m618n598m815k536q44
52954A65977j072k043j732n1J325J559J566K088K254J014j036k364k409j780r84
52939A62312k36j35j157k534k923k264j643j227kJ955K763J452j47K22K055L015
52923A61506K350J537J708K158J747M34r62j640j224l4Q87Q29L42L41N19r4j125
$$ y = [272123, 268500, 267275, 267847, 268697, 269530, 270986, 272837, 273881, 273577, 272769, 272733, 274174, 277025, 280636, 284316, 288061, 292410, 297239, 301320, 303645, 304492, 304596, 304088, 303095, 302549, 303071, 303578, 302410, 299677, 297072, 295362, 293458, 290358, 286688, 283574, 280872, 277352, 272196, 265723, 258899, 252607, 247201, 242490, 238217, 234552, 231864, 230134, 228962, 228067, 227256, 225961, 223498, 219902, 215869, 211724, 207128, 202095, 197547, 194340, 192283, 190656, 189227, 188156, 187379, 186807, 186851, 187922, 189467, 190235, 189536, 187551, 184388, 179770, 174172, 169357, 166821, 165977, 164905, 162862, 161130, 161079, 162404, 163963, 165529, 167617, 169871, 170885, 169849, 167485, 165076, 163296, 162312, 162076, 161941, 160784, 158250, 155327, 153063, 151420, 150193, 150191, 152146, 154909, 156361, 156214, 156436, 158491, 161506, 163856, 165393, 167101, 169259, 171006, 171440, 170478, 168838, 167614, 167580, 168467, 169296, 169638, 169979, 170498, 170404, 169279]
52906A69279r48P86K265J959P13L07R52J448J192P41N74M93L22L26P30J378K059
52889A84576K788L564M093L944L011J845J348J764K203J731Q99J185K692L609
52875B19252K702J247J310K839L990L968L896M648N411N129M245M009M651N200
52861B72497M861L815K749K048J548Q17k33r72o17N80J179N6k178l821m055l677
52845B74597l798m386m397l124j090K90j89k487n120o106m536j407J310K409K151
52830B44117J341K75j042k053j872m55J005J293N02k56k73L5q3o36r27m95K37
52813B40713M14l22j500k296k134r25Q40K130K077J018L69Q97J642J266P3n19
52797B43743k81n06j713k496j588J21Q55L62j60L2O67J481K360K678J815M74K63
$$ y = [169279, 168331, 169117, 171382, 173341, 174054, 174361, 175313, 176761, 177953, 178694, 179268, 179761, 180083, 180409, 181139, 182517, 184576, 187364, 190928, 195021, 198965, 201976, 203821, 205169, 206933, 209136, 210867, 211766, 212951, 215643, 219252, 221954, 223201, 224511, 227350, 231340, 235308, 239204, 243852, 249263, 254392, 258637, 262646, 267297, 272497, 277358, 281173, 283922, 285970, 287518, 288335, 288102, 287130, 286513, 287093, 288272, 288328, 286150, 282329, 278274, 274597, 270799, 266413, 262016, 258892, 257802, 258092, 257903, 255416, 250296, 244190, 239654, 238247, 239557, 241966, 244117, 245458, 245733, 244691, 242638, 240766, 240311, 241316, 242609, 243111, 242855, 242582, 242617, 242534, 241898, 240971, 240476, 240713, 241127, 240805, 239305, 237009, 234875, 233950, 234790, 236920, 238997, 240015, 240384, 241281, 242923, 244189, 244262, 243743, 243462, 242956, 241243, 238747, 237159, 237280, 238135, 238497, 238337, 238369, 239036, 240517, 242877, 245555, 247370, 247844, 248107]
52780B48107J705L550M372L932K723J196k27j135j434j210l13J120J905Q72j277
52765B63886k436j833r14j024j675j914j940k191k122j219k65j32k18M88J492
52750B47983J599J087J299K404L264L370L276L022J922J91q77q61q60j642k566
52735B62611l002l293l566l020j497m47j060k432k947k609k625l331m004m361
52721B24417m698m828m267l431l270l600l245k047j402k268l831m822n124n206
52707A72378m960m092l008k276j689r22o25j610l082l175j603l51r80k367k376
52692A39262j001k61j160k350k271j187k49K78P49Q85K38n33l53L73P5j549k937
52675A28009l050k778l124l363k441j054n85o66K48K022K547Q65j161j209O10
$$ y = [248107, 249812, 253362, 257734, 261666, 264389, 265585, 265358, 264223, 262789, 261579, 261266, 262386, 264291, 265163, 263886, 261450, 259617, 258703, 257679, 256004, 254090, 252150, 249959, 247837, 246618, 246353, 246221, 246003, 246491, 247983, 249582, 250669, 251968, 254372, 257636, 261006, 264282, 267304, 269226, 269417, 268540, 267679, 266819, 265177, 262611, 259609, 256316, 252750, 249730, 248233, 247786, 246726, 244294, 241347, 238738, 236113, 232782, 228778, 224417, 219719, 214891, 210624, 207193, 203923, 200323, 197078, 195031, 193629, 191361, 187530, 182708, 177584, 172378, 167418, 163326, 160318, 158042, 156353, 155431, 154806, 153196, 150114, 146939, 145336, 144985, 144005, 141638, 139262, 138261, 138000, 136840, 134490, 132219, 131032, 130783, 131061, 131810, 132695, 132933, 132400, 132047, 132420, 132495, 130946, 128009, 124959, 122181, 119057, 115694, 113253, 112199, 111614, 110948, 111196, 113218, 115765, 116630, 115469, 114260, 114870]
52660A14870K266K380J309J51m32o32j269k881m680n017l325j076k1j81k96J36
52644A01302L99p1r09j477j533j061j34Q91J647K187K640K575J505P6k78Q12J929
52627A10500J548k13j928k423j521J22J423J522O05k68m59m42q05j230j029j67
52611A05235R54K167L299L748L236K552K591K999K811K186K209L015L436K818
52597A43256J939J612J510J115P87J028J365R26l38j719k668k985k580j700j005
52582A40543p13j58J042J874R84j384l461l972l177j953p28M35J393J960J980
52567A34665J319J72p62j008j175k229l877m516l212j026K08Rm65o8R43J388Q40
52550A21206L25R08J829J135j459l457k525L71K226J971J303J573J957J428O69
$$ y = [114870, 117136, 119516, 120825, 120976, 120544, 119912, 118643, 115762, 111082, 106065, 102740, 101664, 101643, 101462, 101166, 101302, 101701, 101630, 100721, 99244, 97711, 96650, 96516, 97407, 99054, 101241, 103881, 106456, 107961, 108037, 107759, 108571, 110500, 112048, 111835, 109907, 107484, 105963, 106085, 107508, 109030, 109635, 109367, 108908, 108466, 107661, 106431, 105402, 105235, 106189, 108356, 111655, 115403, 118639, 121191, 123782, 126781, 129592, 131778, 133987, 137002, 140438, 143256, 145195, 146807, 148317, 149432, 150219, 151247, 152612, 153538, 153200, 151481, 148813, 145828, 143248, 141548, 140543, 139830, 139672, 140714, 142588, 143572, 142188, 138727, 134755, 131578, 129625, 128897, 129332, 130725, 132685, 134665, 135984, 136156, 135394, 134386, 133211, 130982, 127105, 122589, 119377, 118351, 118559, 118568, 118103, 118035, 118978, 120366, 121206, 121531, 122439, 124268, 125403, 123944, 120487, 117962, 118333, 120559, 122530, 123833, 125406, 127363, 128791, 129460]
52535A29460O83R33L56p47j229q72k68M02J253J779J500J092J578K604K965K524
52519A44013K183K057J302k6n82L11J682K419K514K299J761J299J793K970L157
52504A69152J685L31R71K853L810L320K513J723J26k095l262k486q04O37K016
52489A80490L574M228K919N40q32l89Q03J525J617J447J141O44M8m43n92k51K27
52472A96696p9j657l502l924k498m78R28J771K391K295J049l99n87M62J276J000
52456A94744L09Q8L49Q45J542J841N03k468m866m577k302n81l74k23J016K386
52440A88232K406J252K48RJ38K02J72P3m0l1p2o54j619j762k59J896K901K434
52422A95526J808J902K083J579Q41P36J128J150N34j07k84j67qL35R24J209O32
$$ y = [129460, 130143, 131076, 131432, 130685, 129456, 128584, 128316, 128718, 129971, 131750, 133250, 134342, 135920, 138524, 141489, 144013, 146196, 148253, 149555, 149529, 148947, 149258, 150940, 153359, 155873, 158172, 159933, 161232, 163025, 165995, 169152, 170837, 171168, 172139, 174992, 178802, 182122, 184635, 186358, 186484, 184389, 181127, 178641, 177837, 178474, 180490, 184064, 188292, 191211, 191751, 190919, 190530, 191333, 192858, 194475, 195922, 197063, 197707, 197755, 197312, 196720, 196469, 196696, 196617, 194960, 191458, 187534, 185036, 184558, 185486, 187257, 189648, 191943, 192992, 192593, 192006, 192468, 193744, 194744, 195053, 195141, 195490, 196335, 197877, 199718, 200221, 197753, 192887, 188310, 186008, 185427, 185053, 184830, 185846, 188232, 190638, 191890, 192138, 192147, 192285, 192487, 192659, 192732, 192692, 192661, 192589, 191935, 190316, 188554, 188295, 190191, 193092, 195526, 197334, 199236, 201319, 202898, 203739, 204475, 205603, 206753, 207287, 207180, 206896, 206729, 206721, 207056, 207980, 209189, 209821]
52405B09821m21r03n08n4l8M19K099L669K782m31k698j572J178J833l51k461k085
52388B10279j50J024Q86N69P70J095J174J211J399J539J347P74j0o52p92m44m8
52371B19971P1K5j4r7r4M58J650K731K949K564K398K620K594J869O99m38j349
52354B38607k015k361k316j917j247m76J10K40j35q15j414j450o97M57J300J561
52338B27432J553J468J088M70L00J045K182K804K647K047J372R83J326K331L097
52323B52145K888K088J472R94R8j043j561j051J52J564K632K635J571Q68J807
52308B67259L521L989K991K376L075L791L327K474K401K730K653K648L457M279
52294C10971L864K754K536L117K701P71p38nK327M271M983N052N003M692M052
$$ y = [209821, 209400, 208497, 207989, 207935, 207897, 208316, 210415, 214084, 216866, 216435, 213737, 212165, 213343, 215176, 214825, 212364, 210279, 210129, 211153, 212039, 212608, 213378, 214473, 215647, 216858, 218257, 219796, 221143, 221917, 221907, 221255, 220463, 220019, 219971, 220042, 220067, 220053, 219956, 219862, 220320, 221970, 224701, 227650, 230214, 232612, 235232, 237826, 239695, 240394, 239956, 238607, 236592, 234231, 231915, 229998, 228751, 228275, 228385, 228625, 228490, 227675, 226261, 224811, 224114, 224571, 225871, 227432, 228985, 230453, 231541, 232011, 232311, 233356, 235538, 238342, 240989, 243036, 244408, 245391, 246717, 249048, 252145, 255033, 257121, 258593, 259587, 259685, 258642, 257081, 256030, 256182, 257746, 260378, 263013, 264584, 265452, 267259, 270780, 274769, 277760, 280136, 283211, 287002, 290329, 292803, 295204, 297934, 300587, 303235, 306692, 310971, 314835, 317589, 320125, 323242, 325943, 326714, 325976, 325971, 328298, 332569, 337552, 342604, 347607, 352299, 356351]
$$ [...]
##END NTUPLES=NMR SPECTRUM
##END=
