##TITLE=coffee_type CCIN01-ROVE100_85-15%
COFFEE_meoh_noesyp64 COFFEE_meoh {C:\Bruker\TOPSPIN} Administrator 9
##JCAMPDX= 6.0         $$ Bruker NMR JCAMP-DX V2.0
##DATA TYPE= NMR SPECTRUM
##DATA CLASS= NTUPLES
##ORIGIN= Bruker BioSpin GmbH
##OWNER= Administrator
$$ 1.72 TOPSPIN		Version 2.1
$$ 2012-05-18 15:51:48.448 -0700  Administrator@X
$$ Compression mode = diff/dup
##.OBSERVE FREQUENCY= 400.13188235
##.OBSERVE NUCLEUS= ^1H
##.ACQUISITION MODE= SIMULTANEOUS (DQD)
##.ACQUISITION SCHEME= undefined
##.AVERAGES= 64
##.DIGITISER RES= 22
##SPECTROMETER/DATA SYSTEM= spect
##.PULSE SEQUENCE= noesygpps1d.comp
##.SOLVENT NAME= COFFEE_meoh
##.SHIFT REFERENCE= INTERNAL, COFFEE_meoh, 1, 14.98061
##AUDIT TRAIL= $$ (NUMBER, WHEN, WHO, WHERE, PROCESS, VERSION, WHAT)
$$ ##TITLE= Audit trail, TOPSPIN		Version 2.1
$$ ##JCAMPDX= 5.01
$$ ##ORIGIN= Bruker BioSpin GmbH
$$ ##OWNER= Administrator
$$ $$ C:\Bruker\TOPSPIN/data/Administrator/nmr/12-COFFEE-2502/192/pdata/1/auditp.txt
$$ ##AUDIT TRAIL=  $$ (NUMBER, WHEN, WHO, WHERE, PROCESS, VERSION, WHAT)
(   1,<2012-02-25 20:32:49.609 -0500>,<Administrator>,<TOPSPIN>,<go>,<TOPSPIN 2.1>,
      <created by zg
	started at 2012-02-25 20:21:19.344 -0500,
	POWCHK enabled, PULCHK disabled,
       configuration hash MD5:
       B0 76 FB 9C 50 81 44 7D 18 B3 26 32 4E 60 AD 96
       data hash MD5: 64K
       DA 64 6A BD F3 CA F7 07 53 B7 37 46 97 B1 4A CA>)
(   2,<2012-02-25 20:32:52.203 -0500>,<Administrator>,<TOPSPIN>,<proc1d>,<TOPSPIN 2.1>,
      <Start of raw data processing
       efp LB = 0.3 FT_mod = 6 PKNL = 1 PHC0 = 0 PHC1 = 0 SI = 128K 
       data hash MD5: 128K
       3E DE BD DD FB 10 7F 16 1D 21 7C DF 34 52 54 1F>)
(   3,<2012-02-25 20:32:53.469 -0500>,<Administrator>,<TOPSPIN>,<proc1d>,<TOPSPIN 2.1>,
      <pk PHC0 = 22.85706 PHC1 = 0 
       data hash MD5: 128K
       C1 CE 40 B4 AD 67 EB E0 63 1E 10 0B 1C D2 61 42>)
(   4,<2012-02-25 20:32:53.734 -0500>,<Administrator>,<TOPSPIN>,<proc1d>,<TOPSPIN 2.1>,
      <abs ABSG = 1 
       data hash MD5: 128K
       C0 1E 2E B6 99 76 98 62 C4 53 6A 9D F2 D1 23 6D>)
(   5,<2012-02-25 20:32:53.812 -0500>,<Administrator>,<TOPSPIN>,<proc1d>,<TOPSPIN 2.1>,
      <abs ABSG = 2 
       data hash MD5: 128K
       E5 CF 83 29 BD CE FE 4B 9F E2 C6 1E 7A 6F BD 74>)
(   6,<2012-02-25 20:32:53.859 -0500>,<Administrator>,<TOPSPIN>,<proc1d>,<TOPSPIN 2.1>,
      <abs ABSG = 3 
       data hash MD5: 128K
       1D 89 19 66 44 87 28 E3 B0 0B 06 3B 47 08 1F 5D>)
(   7,<2012-02-25 20:32:53.937 -0500>,<Administrator>,<TOPSPIN>,<proc1d>,<TOPSPIN 2.1>,
      <abs ABSG = 4 
       data hash MD5: 128K
       49 0A 2D 75 98 C9 ED 45 F7 2C 64 C1 85 E6 59 66>)
(   8,<2012-02-25 20:32:54.062 -0500>,<Administrator>,<TOPSPIN>,<proc1d>,<TOPSPIN 2.1>,
      <abs ABSG = 5 
       data hash MD5: 128K
       85 53 A3 D7 52 13 B9 54 FC 9B C1 81 97 54 63 F5>)
(   9,<2012-02-25 20:32:54.297 -0500>,<Administrator>,<TOPSPIN>,<audit>,<TOPSPIN 2.1>,
      <user comment:
       ICON-NMR User ID: Administrator
$$ [...]
150 150 150 150 150 150 150 150
##$TP07= 0
##$TPNAME0= <>
##$TPNAME1= <>
##$TPNAME2= <>
##$TPNAME3= <>
##$TPNAME4= <>
##$TPNAME5= <>
##$TPNAME6= <>
##$TPNAME7= <>
##$TPOAL= (0..7)
0.5 0.5 0.5 0.5 0.5 0.5 0.5 0.5
##$TPOFFS= (0..7)
0 0 0 0 0 0 0 0
##$TUNHIN= 0
##$TUNHOUT= 0
##$TUNXOUT= 0
##$USERA1= <user>
##$USERA2= <user>
##$USERA3= <user>
##$USERA4= <user>
##$USERA5= <user>
##$V9= 5
##$VALIST= <valist>
##$VCLIST= <CCCCCCCCCCCCCCC>
##$VD= 0
##$VDLIST= <DDDDDDDDDDDDDDD>
##$VPLIST= <PPPPPPPPPPPPPPP>
##$VTLIST= <TTTTTTTTTTTTTTT>
##$WBST= 1024
##$WBSW= 4
##$XGAIN= (0..3)
0 0 0 0
##$XL= 0
##$YL= 0
##$YMAX_a= 16496876
##$YMIN_a= -8073971
##$ZGOPTNS= <>
##$ZL1= 120
##$ZL2= 120
##$ZL3= 120
##$ZL4= 120
##$ABSF1= 14.98061
##$ABSF2= -5.57192
##$ABSG= 5
##$ABSL= 3
##$ALPHA= 0
##$AQORDER= 0
##$ASSFAC= 0
##$ASSFACI= 0
##$ASSFACX= 0
##$ASSWID= 0
##$AUNMP= <proc_prof1d_extract>
##$AXLEFT= 0
##$AXNAME= <>
##$AXNUC= <1H>
##$AXRIGHT= 0
##$AXTYPE= 0
##$AXUNIT= <>
##$AZFE= 0.1
##$AZFW= 0.1
##$BCFW= 0
##$BC_mod= 0
##$BYTORDP= 0
##$COROFFS= 0
##$CY= 15
##$DATMOD= 1
##$DC= 0
##$DFILT= <>
##$DTYPP= 0
##$F1P= 0
##$F2P= 0
##$FCOR= 0.5
##$FTSIZE= 131072
##$FT_mod= 6
##$GAMMA= 0
##$GB= 0
##$INTBC= 1
##$INTSCL= 1
##$ISEN= 128
##$LB= 0.3
##$LEV0= 0
##$LPBIN= 0
##$MAXI= 10000
##$MC2= 0
##$MEAN= 0
##$ME_mod= 0
##$MI= 0
##$NCOEF= 0
##$NC_proc= -2
##$NLEV= 6
##$NOISF1= 0
##$NOISF2= 0
##$NSP= 0
##$NTH_PI= 0
##$NZP= 0
##$OFFSET= 14.98061
##$PC= 1
##$PHC0= 22.85706
##$PHC1= 0
##$PH_mod= 1
##$PKNL= yes
##$PPARMOD= 0
##$PPDIAG= 0
##$PPIPTYP= 0
##$PPMPNUM= 2147483647
##$PPRESOL= 1
##$PSCAL= 4
##$PSIGN= 0
##$PYNMP= <proc.py>
##$REVERSE= no
##$SF= 400.13
##$SI= 131072
##$SIGF1= 0
##$SIGF2= 0
##$SINO= 400
##$SIOLD= 131072
##$SPECTYP= <>
##$SREGLST= <1H.CDCl3>
##$SSB= 0
##$STSI= 131072
##$STSR= 0
##$SW_p= 8223.68421052632
##$SYMM= 0
##$S_DEV= 0
##$TDeff= 65536
##$TDoff= 0
##$TI= <>
##$TILT= no
##$TM1= 0
##$TM2= 0
##$TOPLEV= 0
##$USERP1= <user>
##$USERP2= <user>
##$USERP3= <user>
##$USERP4= <user>
##$USERP5= <user>
##$WDW= 1
##$XDIM= 131072
##$YMAX_p= 279219177
##$YMIN_p= -207709414
##$CURPLOT= <Network HP LaserJet P1505>
##$CURPRIN= <$Network HP LaserJet P1505>
##$DFORMAT= <normdp>
##$LAYOUT= <+/1D_H.xwp>
##$LFORMAT= <normlp>
##$PFORMAT= <normpl>
##$SURQMSG= 1
$$ End of Bruker specific parameters
$$ ---------------------------------
##NTUPLES= NMR SPECTRUM
##VAR_NAME=  FREQUENCY,     SPECTRUM/REAL,   SPECTRUM/IMAG
##SYMBOL=    X,             R,               I
##VAR_TYPE=  INDEPENDENT,   DEPENDENT,       DEPENDENT
##VAR_FORM=  AFFN,          ASDF,            ASDF
##VAR_DIM=   131072,        131072,          131072
##UNITS=     HZ,            ARBITRARY UNITS, ARBITRARY UNITS
##FACTOR=    0.0627417313425165, 1,          1
##FIRST=     8223.62146879498, 290,          -53809
##LAST=      0,             1303,            -54751
##MIN=       0,             -207709414,      0
##MAX=       8223.62146879498, 279219177,    0
$$ Real data points
##PAGE= N=1
##DATA TABLE= (X++(R..R)), XYDATA
$$ [...]
67328 663632 663577 663635 663627 663385 662805 662089 661661 661730 662148 662694 663260 663691 663767 663484 663123 662895 662706 662439 662303 662719 663904
67307 663904 665655 667488 668936 669881 670635 671585 672639 673224 672965 672179 671502 671201 671132 671201 671485 671952 672452 673057
67289 673057 674018 675225 676074 676111 675575 675073 674910 674979 675101 675164 675091 674973 675166 676031 677640 679910 682782 685939
67271 685939 688595 690041 690401 690425 690570 690699 690645 690558 690581 690656 690800 691134 691483 691440 691040 690874 691214 691532 691331 691022
67251 691022 691418 692637 694022 694942 695159 694622 693554 692673 692712 693600 694574 695181 695711 696541 697551 698412 699102 699849
67233 699849 700794 701855 702765 703165 702896 702248 701670 701200 700502 699554 698945 699295 700628 702516 704534 706413 707996
67216 707996 709295 710412 711223 711384 710839 710073 709601 709451 709443 709743 710714 712296 713903 714910 715035 714391 713539 713346
67198 713346 714254 715641 716375 716137 715728 715905 716454 716757 716747 716717 716584 716077 715551 715809 716898 717783 717611 716815 716490
67179 716490 717026 717825 718218 718225 718440 719471 721402 723576 725063 725614 725966 726883 728152 729035 729440 730006 731067
67162 731067 732285 733458 734959 736950 738734 739404 738849 737729 736767 736396 736778 737659 738390 738553 738473 738761 739484
67145 739484 740164 740570 741118 742351 744222 745982 746773 746452 745781 745622 745998 746282 746271 746465 747136 747794 747995 748071
67127 748071 748508 749149 749730 750668 752470 754652 756196 756958 757734 758937 760185 761273 762591 764246 765629 766343
67111 766343 766869 767793 768870 769391 769106 768393 767835 767933 768890 770348 771628 772497 773341 774452 775622 776668 777783
67094 777783 778938 779567 779473 779577 781029 783772 786615 788588 789591 789856 789497 788841 788647 789603 791732 794394
67078 794394 796776 798405 799420 800387 801789 803700 805934 808325 810749 813130 815557 818156 820664 822476
67064 822476 823398 824041 825063 826307 827113 827315 827420 827881 828691 829693 830853 832188 833776 835835 838434 841147
67048 841147 843396 845207 847258 850090 853569 857160 860364 862839 864515 865777 867204 868970 870770 872417
67034 872417 874120 876002 877780 879256 880815 883061 886147 889802 893819 898089 902281 905960 909128 912281
67020 912281 915794 919506 923055 926394 929773 933362 937147 941103 945210 949274 953016 956475 960150 964518
67006 964518 969430 974191 978288 981856 985391 989145 992977 996697 1000394 1004382 1008915 1013938 1019085 1023949
66992 1023949 1028408 1032664 1036929 1041190 1045422 1049952 1055370 1061927 1069151 1076223 1082745 1088986 1095363 1101852
66978 1101852 1108170 1114449 1121280 1128899 1136654 1143745 1150315 1157238 1164842 1172471 1179586 1186684 1194609 1203339
66964 1203339 1212120 1220539 1228727 1236548 1243520 1249887 1257050 1266205 1276883 1287447 1296920 1305747 1314782
66951 1314782 1324194 1333634 1343046 1352875 1363605 1375425 1388208 1401492 1414526 1426692 1438058 1449342
66939 1449342 1461197 1473679 1486450 1499320 1512357 1525635 1539052 1552414 1565542 1578372 1591103
66928 1591103 1604194 1618023 1632520 1647288 1662019 1676621 1691019 1705158 1719268 1733836 1749152
66917 1749152 1765017 1781050 1797140 1813465 1830226 1847478 1865097 1882714 1899837 1916257 1932373
66906 1932373 1948948 1966500 1984967 2003874 2022747 2041366 2059703 2077669 2095022 2111697 2128155
66895 2128155 2145171 2163123 2181643 2200049 2218001 2235624 2253118 2270476 2287485 2303947 2319893
66884 2319893 2335591 2351197 2366417 2380787 2394371 2407843 2421674 2435523 2448747 2461293 2473647
66873 2473647 2486011 2497899 2508613 2517841 2525818 2533198 2540713 2548600 2556237 2562622 2567310 2570615 2572841
66860 2572841 2573740 2573043 2571240 2569368 2567962 2566523 2564101 2560232 2555148 2549293 2542908 2536132 2529178 2522112
66846 2522112 2514452 2505311 2494134 2481233 2467442 2453330 2438911 2424021 2408703 2393072 2376992 2360125
66834 2360125 2342285 2323598 2304273 2284368 2263933 2243280 2222815 2202559 2182097 2161235 2140446
66823 2140446 2120292 2100470 2079939 2058069 2035323 2012595 1990222 1967894 1945271 1922344 1899332
66812 1899332 1876565 1854375 1832830 1811598 1790307 1768986 1747940 1727233 1706533 1685451 1663870
66801 1663870 1642001 1620253 1598973 1578072 1556988 1535240 1513028 1491090 1469982 1449693 1429918
66790 1429918 1410417 1391072 1371857 1352892 1334384 1316400 1298771 1281267 1263828 1246606 1229841
66779 1229841 1213679 1198035 1182722 1167709 1153089 1138728 1124165 1109106 1093826 1078800 1064121
66768 1064121 1049586 1035211 1021200 1007457 993651 979874 966754 954606 942894 930907 918707
66757 918707 906929 895776 884699 873144 861250 849580 838421 827620 816951 806308 795549
66746 795549 784544 773537 763201 753992 745603 737371 729114 721110 713311 705165 696484 687961 680364
66733 680364 673526 666625 659238 651606 643988 636387 628935 621994 615617 609316 602650 595788 589280 583446
66719 583446 578172 573064 567619 561432 554531 547515 541143 535679 530667 525368 519448 513284 507575 502727
66705 502727 498610 494860 491173 487303 483075 478598 474230 470147 466149 462051 457922 453647 448729 443061
66691 443061 437528 433109 429541 425665 421124 416842 413606 410993 408183 405146 402357 399805 397032 393929
66677 393929 390886 388131 385380 382172 378268 373746 368984 364527 360728 357557 354862 352630 350772 348865
66663 348865 346462 343579 340582 337696 334909 332266 329879 327645 325309 322815 320346 317936 315397 312761
66649 312761 310477 308938 307924 306795 305173 303237 301344 299523 297524 295284 293135 291430 290115 288892
66635 288892 287701 286774 286105 285240 283797 281982 280273 278684 276710 274058 271169 268816 267301 266187 264779
66620 264779 262742 260245 257632 255135 252882 250993 249444 247878 245809 243153 240411 238213 236724 235566
66606 235566 234264 232648 230891 229260 227863 226614 225409 224257 223195 222142 220985 219764 218593 217406
66592 217406 215995 214299 212456 210528 208425 206282 204619 203808 203476 202758 201242 199448 198221 197795 197626
66577 197626 197089 196075 194776 193166 191133 189107 187984 188015 188153 187055 184627 182043 180321 179505 179334 179959
66561 179959 181498 183324 184411 184256 183114 181491 179753 178147 176828 175819 175111 174724 174494 174014 173033 171778
66545 171778 170561 169268 167631 165885 164633 164020 163493 162546 161303 160085 158794 157130 155296 154027 153818
66530 153818 154374 154943 155037 154727 154384 154271 154324 154140 153256 151629 149879 148782 148416 148009 146802 144883 142974
66513 142974 141553 140569 139918 139761 140246 141170 142126 142846 143316 143644 143890 143953 143649 142993 142293 141796 141399 140926 140494
66494 140494 140234 139814 138786 137409 136564 136695 137314 137694 137550 136879 135725 134434 133632 133478 133344 132622 131448
66477 131448 130194 128744 126856 124834 123114 121496 119546 117659 116885 117608 119013 120071 120493 120557 120499 120361
66461 120361 120106 119634 118877 117928 116897 115667 114123 112586 111631 111390 111474 111661 112205 113247 114301 114675 114186
66444 114186 113245 112330 111582 110813 109810 108678 107810 107398 107058 106248 105009 103917 103356 103231 103415 103933 104516
66427 104516 104523 103709 102707 102297 102453 102553 102292 101906 101558 101095 100522 100274 100678 101354 101479 100614 99090 97529
66409 97529 96243 95190 94377 93957 93895 93822 93488 93171 93338 93970 94574 94863 95075 95502 96051 96494 96873 97361 97843
66390 97843 97955 97546 96887 96407 96377 96847 97636 98326 98475 98056 97621 97805 98617 99393 99498 98897 97957 96952 96096
66371 96096 95781 96218 96825 96555 95140 93458 92330 91436 90039 88410 87695 88398 89719 90591 90797 90809 91025
66354 91025 91466 91891 91918 91363 90601 90269 90388 90267 89554 88882 88925 89216 88642 86974 85149 83940 83084 82097 81356
66335 81356 81693 83097 84435 84642 83775 82646 81710 80785 79790 79224 79537 80337 80746 80512 80283 80637 81304 81741
66317 81741 82075 82898 84183 85029 84722 83641 82778 82586 82647 82360 81552 80427 79262 78305 77710 77408 77237 77328
66299 77328 78033 79288 80250 80028 78671 77086 76054 75691 75788 76137 76392 76149 75459 74891 74776 74782 74517 74123 73871
66280 73871 73560 72898 72223 72228 73026 74046 74802 75265 75481 75420 75257 75299 75460 75288 74701 74253 74465 75224 76036 76499
66260 76499 76366 75521 74201 72956 72181 71857 71890 72324 73061 73719 74053 74229 74429 74446 73947 72896 71508 70038
66242 70038 68856 68354 68470 68608 68421 68379 69129 70530 71837 72651 73098 73174 72555 71251 69882 68978 68432 67897
66224 67897 67465 67542 68218 69091 69689 69851 69679 69320 68876 68388 67828 67178 66554 66178 66149 66281 66219 65753 65014 64391
66204 64391 64259 64673 65197 65185 64470 63728 63815 64666 65187 64512 63049 61977 61969 62781 63864 64819 65343 65303 65009 64956
66184 64956 65172 65204 64830 64397 64319 64627 65150 65701 65925 65504 64776 64671 65611 66864 67411 67100 66491 65870 65043
66165 65043 63990 63143 62878 63082 63334 63370 63332 63633 64452 65310 65465 64870 64363 64636 65371 65781 65657 65370 65147
66146 65147 64931 64766 64714 64496 63846 63147 63021 63305 63190 62523 62194 62868 64010 64695 64808 64840 64921 64755 64324 63973
66126 63973 63740 63192 62079 60782 59933 59856 60529 61764 63242 64550 65440 65987 66403 66789 67178 67595 67886 67645
66108 67645 66680 65484 64837 64822 64637 63701 62616 62574 63895 65604 66487 66150 64986 63568 62342 61603 61408
66091 61408 61559 61838 62067 61969 61307 60381 60010 60674 61901 62894 63535 64352 65636 67034 67978 68123 67358 65815
66073 65815 63978 62431 61391 60688 60252 60306 60920 61677 61939 61387 60258 59147 58598 58699 59061 59296 59419 59583
66055 59583 59587 59049 58071 57279 57030 56994 56759 56474 56480 56533 55949 54646 53624 54077 56131 58680 60528 61467 62149
66036 62149 63104 64179 64934 65230 65229 65052 64706 64249 63789 63418 63319 63776 64803 65816 65966 64859 62858 60811
66018 60811 59650 59983 61597 63384 64188 63823 63022 62484 62374 62659 63359 64237 64783 64828 64822 65165 65567 65494 65062
65999 65062 65030 65903 67359 68579 68961 68490 67610 66804 66233 65728 65070 64173 63009 61580 60044 58696 57747
65982 57747 57234 57220 57842 59067 60544 61877 62854 63365 63364 63115 63173 63806 64599 64940 64806 64765 65233 66015 66584 66552
65962 66552 65870 64838 63991 63738 64007 64384 64683 65191 66228 67625 68838 69571 70141 71141 72763 74495 75550
65945 75550 75569 74886 74134 73723 73683 73818 73849 73549 72942 72378 72217 72417 72595 72542 72527 72961 73867 74839 75522 75994 76600
65924 76600 77458 78252 78532 78165 77432 76783 76564 76913 77732 78716 79542 80149 80762 81549 82311 82568 81968 80633 79132
65905 79132 78094 77727 77666 77355 76570 75489 74329 73172 72192 71682 71644 71634 71368 71275 71915 72905 73084 71990 70658
65886 70658 70380 71019 71200 70139 68596 67757 67751 67771 67396 67177 67856 69441 71226 72522 73146 73334 73352 73238 72896
65867 72896 72326 71641 70786 69510 67812 66213 65209 64611 63851 62928 62454 62653 62932 62830 62840 63720 65322 66811
65849 66811 67814 68648 69466 69952 70054 70311 71064 71898 72289 72381 72612 72896 72859 72669 72937 73653 73929 73166 72020
65830 72020 71703 72564 73858 74875 75659 76448 76971 76819 76259 76049 76466 76994 77092 76822 76485 76076 75429 74637 73923
65811 73923 73319 72853 72908 73917 75722 77586 78868 79407 79308 78742 77974 77248 76532 75634 74584 73620 72789 71913
65793 71913 70996 70334 70142 70341 70734 71034 70786 69761 68543 68144 68819 69768 70250 70406 70560 70375 69464 68399
65775 68399 68197 68864 69314 68899 68302 68511 69483 70305 70405 70095 69996 70312 70743 70885 70586 69953 69105 68048 66844
65756 66844 65796 65167 64747 63999 62833 61974 62236 63579 65227 66734 68462 70782 73166 74572 74543 73505
65740 73505 72022 70420 69251 69379 70963 72812 73504 72962 72221 71811 71309 70591 70435 71265 72168 72024 71141
65723 71141 70791 71386 72066 72173 72153 72660 73518 74096 74267 74391 74595 74574 74095 73358 72811 72760 73143 73556 73574 73146
65703 73146 72626 72318 72146 71881 71533 71341 71456 71801 72145 72141 71423 69941 68166 66707 65753 65135 64891 65337 66409
65684 66409 67338 67321 66353 65083 64042 63344 62974 62836 62476 61340 59561 58050 57456 57399 57168 56828 57005 57688
65666 57688 57974 57252 56048 55306 55201 55145 54730 54137 53590 52932 52027 51323 51579 52969 54630 55331 54541 52804
65648 52804 51080 49947 49556 50055 51559 53605 55072 55103 54054 53214 53471 54404 54820 54014 52362 50815 50088
65631 50088 50384 51566 53241 54726 55318 54812 53650 52490 51758 51654 52288 53521 54823 55575 55568 55115 54770
65614 54770 55011 55973 57239 58063 58066 57631 57355 57292 57070 56586 56101 55703 55178 54533 54241 54723 55890 57265 58311
65595 58311 58627 58259 57911 58368 59474 60043 59080 56798 54212 52090 50644 49898 49885 50530 51623 52861 53840
65578 53840 54214 54070 53942 54242 54907 55698 56481 57002 56855 56138 55740 56379 57530 57927 57100 55856 55170 55091 55003
65559 55003 54555 54015 53810 53994 54203 54096 53748 53481 53371 53136 52612 52055 51799 51898 52310 53091 54073 54595 54081
65540 54081 52740 51316 50270 49673 49712 50667 52303 53925 55221 56539 58041 59083 58960 57964 57150 57099 57391
65523 57391 57418 57267 57486 58217 58968 59284 59253 59165 59014 58693 58463 58700 59191 59205 58414 57263 56258 55379 54543 54118
65503 54118 54438 55137 55543 55537 55446 55242 54427 52797 50808 49086 47976 47582 47852 48506 49192 49812 50437 50914 50916
65484 50916 50401 49748 49340 49284 49453 49561 49261 48574 48123 48540 49632 50562 50879 50930 51206 51762 52403 52996 53473
65465 53473 53895 54619 55932 57388 58013 57433 56391 55877 56119 56710 57321 57951 58692 59550 60350 60705 60416 59972
65447 59972 60164 61022 61611 61203 60112 59040 58131 57205 56413 55998 55799 55702 56228 57864 60009 61542 62360 63404
65429 63404 64965 65999 65645 64545 63922 63901 63564 62387 60782 59247 57769 56270 55065 54515 54523 54706 54909
65412 54909 55280 55909 56590 56949 56771 56214 55728 55693 56176 57059 58293 59791 61163 61959 62259 62613 63221 63585
65394 63585 63372 63206 63983 65606 67028 67556 67466 67209 66697 65726 64546 63574 62932 62666 63005 63876 64440 63798
65376 63798 62096 60414 59549 59308 59079 58677 58484 58968 60140 61411 62019 61717 60896 59933 58759 57320 56044
65359 56044 55389 55193 55035 54986 55407 56144 56623 56740 56928 57280 57315 56819 56269 56108 56134 55998 55826 55972 56589 57703
65339 57703 59314 61026 61996 61795 61087 61022 62062 63705 65166 66033 66411 66741 67396 68197 68457 67757 66561
65322 66561 65863 66279 67624 69213 70488 71507 72934 75355 78512 81445 83497 84889 86180 87559 88954
65307 88954 90463 92286 94421 96805 99663 103368 107967 113063 118124 122786 127022 131144 135449 139650
65293 139650 142801 144000 143097 140692 137612 134458 131376 128074 124221 119901 115477 111032 106411 101886
65279 101886 98239 95884 94307 92753 91081 89553 88141 86509 84486 82217 80042 78448 77812 77796 77410
65264 77410 76145 74675 73942 73891 73747 73226 72721 72416 71979 71243 70470 69783 68872 67451 65599 63484 61216
65247 61216 59130 57735 57096 56619 55742 54649 54014 54182 54788 55169 55031 54709 54703 54952 54801 53859 52643 52032
65229 52032 52229 52655 52778 52641 52550 52606 52714 52854 53214 54120 55642 57189 57733 56796 55047 53610 52971 52875 52964
65210 52964 52940 52363 51026 49536 48844 49042 49259 48907 48406 48369 48720 48999 49110 49291 49668 50216 50916 51584 51787
65191 51787 51287 50482 50102 50537 51564 52576 52968 52542 51757 51366 51643 52144 52371 52368 52417 52473 52295 51964 51870 52159
65171 52159 52545 52752 52922 53428 54315 55099 55273 55038 55274 56552 58273 59154 58562 57006 55301 53714 52140
65154 52140 50691 49691 49267 49279 49528 49795 49804 49431 48866 48347 47836 47155 46330 45552 44932 44494 44330 44464 44637
65135 44637 44480 43944 43358 43075 43232 43779 44510 45091 45309 45344 45512 45701 45413 44530 43709 43628 44011 43910 43000 42110
65115 42110 42141 42854 43239 42892 42433 42489 42880 43143 43345 43884 44785 45755 46759 47974 49219 50043 50453 50981 51804
65096 51804 52325 51982 51083 50388 50169 50142 50162 50441 51038 51571 51654 51364 51058 50855 50545 50059 49815 50369 51660 52809
65076 52809 52839 51555 49645 48025 47251 47370 47955 48274 47853 47030 46709 47358 48493 49267 49346 49068 48995 49514 50655
65057 50655 52006 52944 53183 53045 53015 53210 53452 53705 54138 54857 55829 56992 58177 59015 59254 59157 59284 59848 60603
65038 60603 61397 62441 63865 65363 66578 67614 68750 69819 70244 69801 69051 68918 69984 72245 75274 78470
65022 78470 81396 84072 86856 89894 92854 95342 97399 99300 101072 102554 103807 105006 105954 106192 105750
65007 105750 105291 105223 105121 104341 102872 101173 99451 97619 95776 94166 92627 90596 87798 84593 81495
64992 81495 78606 75675 72573 69554 67134 65701 65186 65092 64935 64543 63865 62740 61110 59297 57789 56829
64976 56829 56431 56584 57097 57415 57020 55988 54816 53788 52902 52330 52412 53076 53635 53326 51886 49643 47336
64959 47336 45758 45189 45156 45098 45172 45968 47533 49153 50188 50595 50605 50399 50181 50093 49907 49311 48550 48259 48528
64940 48528 48720 48399 47830 47366 47034 46997 47698 49086 50396 51241 52269 54050 55862 56401 55460 54117 53433
64923 53433 53561 54003 54135 53534 52296 51036 50194 49521 48655 47927 48020 48946 49992 50663 51116 51588 51901 51741
64905 51741 51098 50286 49734 49758 50330 51068 51638 52021 52228 52021 51245 50200 49266 48302 46930 45292 44078 43779
64887 43779 44270 45136 46058 46925 47816 48812 49659 49837 49239 48455 47952 47373 46253 45076 44775 45362 45926 45996 46005
64868 46005 46233 46253 45784 45307 45273 45365 45167 45021 45486 46340 46849 46886 47063 47748 48589 49174 49614 50150 50577 50507 50088
64847 50088 49976 50446 50874 50490 49511 49126 50173 52183 53941 54695 54541 53865 52905 51866 51106 51065 52012 53694
64829 53694 55179 55444 54461 53365 53133 53430 53234 52246 51033 50027 49216 48705 48694 48803 48318 47283 46543 46454
64811 46454 46433 46192 46491 48009 50164 51801 52563 52884 53102 53306 53693 54256 54340 53286 51461 49967 49353 49206
64793 49206 49000 48690 48449 48398 48748 49744 51290 52962 54388 55298 55266 54015 52044 50396 49613 49343 49123 48997
64775 48997 49068 48987 48447 47887 48149 49414 50897 51676 51521 50883 50303 49986 49826 49631 49269 48718 48130 47849 48204
64756 48204 49128 50079 50586 50828 51443 52695 54042 54638 54142 52939 51729 51050 51086 51691 52596 53647 54851
64739 54851 56105 56948 56826 55684 54194 53204 52956 52933 52523 51719 51064 51007 51497 52190 52834 53280 53286 52613 51395
64720 51395 50263 49925 50585 51801 52949 53794 54567 55518 56526 57224 57394 57109 56569 55973 55504 55231 55000 54646
64702 54646 54370 54663 55767 57416 59138 60532 61188 60795 59657 58670 58355 58174 57308 55898 54885 54710 54868
64685 54868 54837 54729 54692 54351 53375 52163 51418 51328 51683 52539 54042 55695 56535 56207 55333 54621 54182 54008 54549
64666 54549 56230 58605 60592 61521 61560 61113 60238 58849 57140 55562 54488 54088 54379 55189 56119 56759 57049
64649 57049 57269 57592 57719 57187 56027 54908 54451 54567 54731 54761 54981 55605 56380 56991 57442 57803 57927 57760 57613
64630 57613 57721 57798 57541 57302 57615 58142 57911 56780 55892 56257 57498 58533 59000 59328 59720 59831 59459 58893
64612 58893 58468 58184 57962 57903 58155 58762 59709 60908 62047 62738 62905 62787 62479 61712 60273 58504 57163 56788
64594 56788 57239 57870 58173 58314 58943 60375 62082 63150 63215 62707 62246 62066 62027 61922 61605 61032 60321 59713 59401
64575 59401 59417 59673 60019 60298 60530 61038 62200 64004 65971 67519 68299 68175 67119 65340 63410 62089 61775
64558 61775 62085 62028 60837 58707 56628 55505 55625 56899 59070 61422 62809 62621 61557 60873 60945 61093 60755
64541 60755 60168 59757 59525 59413 59709 60644 61917 63113 64316 65835 67407 68237 67981 67338 67353 68221 69049 68900
64523 68900 67871 66886 66499 66318 65803 65111 64742 64651 64411 64130 64514 65864 67637 69159 70200 70646 70220 68967
64505 68967 67561 66655 66207 65792 65186 64336 63193 62051 61631 62264 63272 63800 63973 64533 65452 65760 64935 63727
64487 63727 63207 63448 63633 63258 62782 63012 64060 65075 65062 63918 62503 61677 61518 61596 61704 61999 62598 63424
64469 63424 64389 65394 66163 66401 66175 65904 65925 66243 66674 67008 67105 67055 67224 67876 68836 69697 70265 70521 70390 69957
64449 69957 69769 70328 71205 71251 69925 67982 66596 66218 66573 67328 68226 68859 68904 68591 68487 68709 68747 68213 67462
64430 67462 67158 67376 67469 66912 66024 65626 66020 66641 66815 66601 66563 66827 66820 66115 65179 64931 65645 66610 66962 66635
64410 66635 66309 66559 67240 67759 67802 67620 67616 67796 67740 67098 66081 65378 65515 66305 67088 67577 68226 69503 71003
64391 71003 71765 71479 70861 70634 70656 70429 69996 69793 69849 69852 69884 70396 71297 71714 70981 69463 68048 67153 66640 66416
64371 66416 66649 67365 68256 69023 69726 70673 72060 73763 75423 76649 77203 77119 76727 76501 76716 77166 77350 77047
64353 77047 76590 76451 76642 76776 76662 76623 77106 78146 79269 79906 79873 79522 79384 79630 80006 80342 80873 81814 82861
64334 82861 83517 83848 84474 85706 87037 87617 86978 85273 83121 81344 80482 80347 80236 79727 78995 78274 77462
64317 77462 76563 76124 76715 78070 79148 79081 77846 76090 74626 74042 74483 75632 77006 78325 79540 80624
64301 80624 81474 81999 82197 82231 82453 83170 84222 85009 85141 84914 84905 85270 85724 85988 85876 85140 83750 82308 81676
64282 81676 82092 83066 84218 85636 87214 88240 88157 87365 86704 86356 85763 84611 83392 82891 83438 84772 86400
64265 86400 87951 89314 90528 91531 92150 92487 93066 94297 95884 97107 97671 97908 98183 98572 99235 100610
64249 100610 102843 105350 107315 108542 109562 110973 112868 114826 116292 117016 117214 117191 116811 115650 113772
64234 113772 111951 110876 110445 110171 109905 109728 109455 108882 108374 108566 109454 110386 111030 111806 113228 115303 117713
64217 117713 120065 121790 122396 122130 121906 122247 122808 123292 124236 126224 128769 130729 131700 132285 133031 133773 134157
64200 134157 134241 134282 134318 134186 133731 132837 131457 129727 127945 126372 125222 124771 125190 126223 127288 128006 128408
64183 128408 128615 128607 128437 128408 128790 129465 130089 130579 131288 132638 134596 136583 137975 138699 139236 140010 140953 141816
64165 141816 142765 144403 147142 150643 153943 156173 157338 158416 160451 163389 166026 167267 167167 166515 165721
64150 165721 164616 163180 161948 161542 162138 163399 164686 165363 165246 164794 164586 164692 164893 165382 166724 169053
64134 169053 171808 174399 176713 178809 180632 182318 184307 186726 189024 190652 191875 193439 195525 197501
64120 197501 198692 199031 198841 198258 197046 194929 192043 189033 186629 185120 184323 183999 184028 184101 183621 182224 180300
64103 180300 178732 178180 178708 179926 181211 181948 181879 181353 181042 181367 182298 183651 185377 187499 189917 192427
64087 192427 194891 197395 200168 203355 206852 210441 214128 218227 223061 228637 234713 241117 247825 254751
64073 254751 261623 268237 274717 281315 287887 293844 298861 303402 308060 312416 315149 315569 314491 313070
64059 313070 311241 308032 303176 297530 291876 286230 280672 276014 272903 270726 268115 264434 260308 256794
64045 256794 254503 253445 253256 253427 253578 253661 253789 253938 254009 254111 254635 255982 258319 261509 265238 269256 273507
64028 273507 277938 282200 285871 289068 292547 296991 302427 308477 314874 321448 327869 333757 338902 343124
64014 343124 346176 348088 349383 350524 351310 351266 350483 349537 348547 346910 344184 340835 337769 335364 333291 331152
63998 331152 328965 326961 325198 323585 322248 321604 321884 322790 323891 325275 327404 330315 333462 336558 340043
63983 340043 344370 349283 354345 359816 366287 373582 380756 387298 393725 400822 408786 417356 426386 435932
63969 435932 445996 456401 466824 476879 486414 495716 505121 514359 522612 529376 534952 539992 544886
63956 544886 549760 554683 559647 564655 570099 576776 585170 594872 604986 614974 624902 635098 645896
63943 645896 657521 669854 682366 694573 706528 718602 730868 743024 754893 766684 778687
63932 778687 790992 803657 816943 831223 846671 863128 880256 897904 916390 936328 958057
63921 958057 981403 1006179 1032798 1062058 1094343 1129363 1166738 1206528 1249032 1294405 1342732
63910 1342732 1394340 1449781 1509518 1573716 1642228 1714647 1790592 1870213 1954440 2044554 2141543
63899 2141543 2245976 2358357 2479424 2610226 2752190 2907059 3076549 3262133 3465517
63890 3465517 3689284 3936669 4210613 4513430 4847508 5215630 5619897 6060359 6534992
63881 6534992 7040697 7573749 8129374 8701619 9283909 9869196 10449028 11012592 11546995
63872 11546995 12038616 12474452 12843192 13136228 13348293 13476981 13521135 13479444 13350569 13134766
63862 13134766 12835567 12460162 12018482 11522073 10983319 10414684 9827668 9232163 8636779
63853 8636779 8049485 7477541 6926970 6402630 5908750 5448734 5024119 4634221 4277271
63844 4277271 3951739 3656351 3389195 3147446 2928061 2728603 2547447 2383394 2234984
63835 2234984 2100063 1976141 1861382 1755062 1656938 1566415 1482608 1404903 1332939 1266129
63825 1266129 1203659 1144953 1089733 1037551 987678 939637 893560 849812 808490 769466 732647
63814 732647 697934 665051 633687 603851 575947 550408 527252 505997 486048 467240 449942
63803 449942 434519 420664 407438 394061 380655 368124 357284 348126 339908 331917 324052 316672
63791 316672 310090 304398 299631 295740 292378 289103 285918 283268 281310 279560 277624 275955 275361 275856 276530
63776 276530 276615 276227 275890 275676 275025 273276 270243 266424 262667 259462 256492 252944 248250 242400 235707 228666
63760 228666 222038 216579 212343 208477 203954 198551 193027 188457 185361 183289 181149 178138 174504 171263
63746 171263 169064 167525 165799 163625 161536 160077 159094 157873 155856 153118 150189 147570 145429 143625
63732 143625 141854 139850 137708 136051 135581 136240 137051 137095 136507 136161 136437 136779 136492 135600 134664 134038 133607 133101
63714 133101 132385 131460 130394 129326 128411 127694 127024 126171 125033 123721 122403 121116 119876 118962 118786 119335
63698 119335 119952 119943 119289 118554 118243 118534 119459 120893 122389 123450 124120 124951 126175 127238 127394 126631 125758 125597
63680 125597 126237 127039 127361 127278 127552 128812 130863 133013 134921 136826 138941 141019 142689 143984 145319 147131
63664 147131 149660 152946 156862 161239 165998 171168 176748 182605 188483 194086 199278 204312 209596 215015
63650 215015 219682 222704 223998 223994 222817 220356 217036 213755 210990 208569 206466 205063 204377 203742 202678
63635 202678 201435 200221 198523 195860 192673 189715 186906 183659 180078 177013 174902 173322 171793 170395
63621 170395 169419 168980 169127 169891 171006 172032 172925 174137 175981 178330 181093 184505 188623 192850 196409
63606 196409 199133 201575 204500 208534 213988 220577 227285 232897 236890 239649 241749 243116 243061 241121 237733
63591 237733 233903 230266 226718 222990 219270 215890 212640 208865 204331 199614 195545 192583 190863 190441
63577 190441 191115 192264 193276 194121 195250 196946 199011 201118 203261 205768 208989 212985 217479 222104 226797
63562 226797 231891 237729 244193 250753 257010 263124 269717 277470 286809 297812 310295 323927 338329
63549 338329 353177 368370 384160 400982 418997 437844 457017 476411 496281 516541 536219
63538 536219 553751 567800 577921 584662 589083 591993 593501 593363 591702 589134 586113 582544 578263 573522
63524 573522 568551 562882 555685 546752 536648 525854 514391 502401 490487 479052 467831 456555
63512 456555 445665 435794 426787 417924 409017 400695 393575 387719 383041 379700 377780 376955 376743 376868 377245
63497 377245 377907 379194 381771 386157 392280 399650 407854 416808 426708 437919 450800 465476 481764
63484 481764 499300 517652 536365 555163 574085 593177 611969 629504 644938 657811 667711 674230
63472 674230 677627 679226 680633 682543 684552 686014 686720 686753 686060 684298 680899 675101 666032 653069 636320
63457 636320 616780 595838 574423 552696 530663 508862 488008 468070 448263 428269 408994
63446 408994 391717 376751 363444 351304 340573 331564 323912 316772 309609 302604 296322 291095 286728
63433 286728 282705 278669 274713 271274 268776 267303 266536 266055 265811 266191 267429 269086 270495 271713 273574
63418 273574 276634 280524 284596 288855 293746 299306 305061 310655 316133 321521 326524 330697 333597 334732
63404 334732 333765 331009 327482 324153 321154 317880 313844 309298 305001 301514 298825 296663 294921 293593
63390 293593 292450 291212 290094 289766 290534 291893 293204 294538 296393 298809 301344 303895 306916 310583 314293
63375 314293 317460 320554 324789 330790 337942 345231 352426 360222 369343 379876 391540 404331 418619
63362 418619 434618 452062 470515 489876 510392 532208 555070 578561 602611 627658 654149
63351 654149 681871 709794 736593 761181 782759 800627 814326 823854 829497 831487 830073 825917
63339 825917 820097 813643 807192 801007 794925 788217 779840 769030 755617 739821 722045 702831 682704
63326 682704 662005 641162 620977 602179 584681 567836 551490 536250 522616 510598 500399
63315 500399 492638 487320 483314 479651 476834 476065 477475 480025 482995 486703 491648 497736 504698 512757
63301 512757 522510 534301 547819 562250 576903 591910 608184 626516 646865 668720 691735 715564
63289 715564 739368 762031 782728 800815 815468 826076 832897 836642 837459 835016 829684 822910 816150
63276 816150 809858 803687 797159 789845 781274 770996 758662 744065 727396 709343 690506 670758
63264 670758 649656 627530 605620 585054 566128 548658 532454 517303 503040 489870 478140
63253 478140 467614 457479 447303 437521 428745 421098 414479 408904 404166 399731 395476 392150 390509
63240 390509 390249 390289 389907 389061 387792 385936 383519 380986 378804 377023 375346 373542 371763 370437 369763 369335
63224 369335 368445 366780 364591 362164 359524 356809 354571 353325 352954 352845 352474 351714 350708 349705 348917 348382
63208 348382 347984 347643 347330 346947 346469 346303 347149 349296 352263 355318 358127 360754 363281 365672 367791 369461
63192 369461 370669 371841 373614 376166 379077 381973 384971 388292 391837 395499 399585 404483 410125 416188
63178 416188 422645 429704 437349 445291 453330 461465 469711 478184 487257 497258 507927 518544 528783
63165 528783 539277 551129 564834 579763 594783 609410 624172 639658 655380 670000 682794
63154 682794 694531 706713 720191 734637 749044 762493 774723 786198 797466 808307 817767 825130
63142 825130 830457 833956 835297 833999 830141 824153 816121 805796 793239 779003 763730 747900 731959
63129 731959 716376 701545 687817 675511 664679 655070 646623 639837 635310 633107 632945 634806 638885
63116 638885 644943 652164 659687 667015 674032 681103 689079 698630 709432 720444 731074 741605 752260
63103 752260 762404 771176 778630 785665 792834 799623 805073 808813 811214 812608 812641 810488 805512 797616
63089 797616 787125 774627 760841 746321 731195 715402 699181 683031 667244 651928 637623
63078 637623 625303 615362 606991 598996 591011 583513 576947 571271 566201 561415 556648 552041 548290 546017
63064 546017 545083 544896 545298 546584 548694 550951 552766 554142 555340 556440 557413 558332 559322 560464 561789 563128
63048 563128 564007 564022 563403 562898 563072 563961 565366 567073 568723 569899 570545 571104 572168 574192 577387 581429
63032 581429 585341 588268 590486 593058 596348 599522 601850 603813 606371 609724 613505 617729 622627 627666
63018 627666 631770 634757 637862 642439 648638 655698 663033 670496 677921 685090 692247 700114 709176 719213
63004 719213 729654 740156 750646 761067 771479 782393 794572 808262 822738 836915 850440
62993 850440 864059 878855 895220 912697 930783 949643 969888 991715 1014588 1037898 1061671
62982 1061671 1086408 1112378 1139421 1167362 1196174 1225653 1255346 1285011 1314821 1344786 1374308
62971 1374308 1402730 1430199 1457518 1485120 1512578 1539284 1565251 1590930 1616347 1640728 1663091
62960 1663091 1682966 1700277 1714491 1724249 1728101 1725504 1716831 1702580 1683038 1658709 1630536 1599444
62948 1599444 1566037 1530968 1495240 1459834 1425424 1392812 1363171 1337307 1314937 1295278 1278226
62937 1278226 1264349 1253832 1246176 1241057 1238807 1239706 1243292 1248803 1255957 1264879 1275465 1287249 1299793
62924 1299793 1312776 1325632 1337564 1348226 1358202 1368368 1378733 1388192 1395646 1401008 1404733 1406614
62912 1406614 1405559 1400533 1391205 1377647 1360035 1338836 1314590 1287276 1256497 1222683 1187347 1151582
62900 1151582 1115105 1077536 1039896 1003696 969126 935450 902957 872986 845901 820491 795857
62889 795857 772614 751538 732127 713501 695892 680206 666575 654258 642630 631496 620662
62878 620662 610023 599953 590914 582729 574782 566778 558837 551059 543616 537010 531486 526281 520269 513433
62864 513433 506941 501582 496893 492122 487272 482649 477990 472790 467231 462107 457830 454110 450649 447666
62850 447666 445519 444134 443078 441998 440795 439536 438402 437670 437547 438011 438884 440009 441210 442182 442645 442624
62834 442624 442383 442036 441454 440626 439835 439287 438781 438073 437418 437392 438151 439141 439685 439646 439381 439200 439027 438545 437593
62815 437593 436447 435687 435746 436535 437528 438194 438352 438224 438223 438592 439196 439691 439893 439751 438974 437070 434009 430575
62797 430575 427693 425578 423877 422421 421379 420759 420220 419404 418122 416264 413961 411779 410221 409057 407672
62782 407672 406133 405284 405573 406448 407248 408058 409161 410196 410605 410647 411198 412564 414140 415344 416328 417449 418513
62765 418513 418960 418648 418122 418056 418636 419522 420284 420856 421623 423071 425242 427484 428935 429434 429835 431104 433154
62748 433154 435020 436251 437580 439836 442693 445105 446704 448064 449720 451728 454248 457743 462207 466810
62734 466810 470808 474487 478783 484258 490790 498027 505791 514172 523489 534021 545628 557888 570725
62721 570725 584593 599800 616119 633385 652114 673040 696268 721342 747936 775989 805343
62710 805343 835839 867840 902139 939250 979190 1022010 1067916 1116499 1166247 1215378 1263103
62699 1263103 1309556 1354397 1395936 1431958 1461168 1483391 1498533 1505979 1505246 1496632 1480719 1457624
62687 1457624 1427399 1391044 1350372 1306736 1260492 1211932 1162151 1112564 1063963 1016502 970414
62676 970414 926298 884801 846264 810661 777694 747029 718526 692127 667504 644113 621725
62665 621725 600647 581302 563834 548202 534287 521711 509942 498880 489080 481099 474787 469482
62653 469482 464730 460609 457553 456008 456016 456957 457998 458926 460277 462508 465527 469316 474464 481549 490363
62638 490363 500296 511254 523682 537833 553561 570785 589660 610220 632240 655519 680115 706257
62626 706257 734166 763877 795094 827458 861038 896249 932965 969986 1005701 1038992 1069208
62615 1069208 1095583 1117216 1133468 1143960 1148331 1146390 1138374 1124678 1105485 1081037 1052138 1019954
62603 1019954 985471 949424 912593 875700 839233 803715 769858 737963 707463 677744 649283
62592 649283 623243 599974 578581 558064 538287 519666 502445 486501 471455 456857 442617
62581 442617 429279 417480 407153 397723 389060 381638 375627 370385 365116 359611 354165 349155 344904
62568 344904 341552 338813 336118 333209 330312 327658 325191 322867 320881 319422 318486 318077 318292 319056 320048
62553 320048 321021 321974 323012 324308 326150 328631 331274 333421 335075 336890 339288 342218 345951 351353 358841
62538 358841 367508 375882 383381 390609 398448 407352 417431 428718 441153 454461 468257 482363 497116
62525 497116 513229 531116 550437 570657 591973 615193 640525 667000 693333 718925 743642
62514 743642 767016 788134 806169 820643 831258 837789 840099 838070 831599 820877 806577 789590
62502 789590 770602 750008 728033 704855 680823 656743 633662 612047 591363 570819 550531
62491 550531 531636 515177 501077 488264 475698 463199 451367 440804 431513 423033 414989 407356
62479 407356 400301 393893 387940 381994 375659 369079 362961 357865 353656 349977 347030 345302 344586 343928 342743
62464 342743 341475 340914 341282 342308 343769 345633 347963 350951 354803 359352 364109 368947 374421 381092 388782
62449 388782 396910 405333 414525 425041 437104 450612 465241 480638 496743 513844 532170 551507
62437 551507 571384 591445 611436 630903 649085 665081 678164 688094 695173 699723 701476 699828
62425 699828 694757 687024 677298 665547 651611 635940 619364 602480 585698 569517 554245 539655
62413 539655 525410 511715 499116 487845 477788 468968 461515 455221 449600 444385 439566 434973 430276
62400 430276 425512 421225 418023 416260 416087 417356 419402 421381 423034 424872 427430 430546 433513 435696
62386 435696 436918 437472 437956 438980 440788 443186 445768 448265 450746 453593 457148 461157 464763 467273 468849
62371 468849 470109 471105 471057 469199 465514 460595 455095 449477 443976 438491 432702 426556 420587 415513 411511
62356 411511 408043 404478 400803 397634 395612 394844 394972 395664 396851 398537 400623 403057 405964 409460 413442
62341 413442 417762 422484 427796 433689 439894 446088 452028 457611 463028 468782 475218 481978 488112 492851
62327 492851 496161 498525 500338 501640 502324 502501 502529 502681 502831 502618 501937 501085 500450 500327 501161 503533 507593
62310 507593 512705 518122 523937 531010 539937 550466 561970 574221 587571 602669 620090 640031
62298 640031 662211 686209 711992 739980 770590 803881 839715 878017 918659 961139 1004537
62287 1004537 1047833 1090245 1131160 1169677 1204275 1233193 1255291 1270395 1278749 1280523 1276158 1266842
62275 1266842 1253962 1238000 1218418 1194758 1167405 1137132 1104395 1069536 1033466 997746 963925
62264 963925 932867 904517 878164 853089 829137 806653 785796 766176 747281 729049 711822
62253 711822 695959 681808 669801 660155 652436 645732 639368 633258 627610 622573 618286 614923 612426
62240 612426 610302 607927 605083 602039 599095 596131 592641 588173 582707 576692 570802 565644 561581 558634
62226 558634 556545 555042 554129 554034 554853 556413 558519 561092 563844 566140 567634 568994 571493 575733 581163
62211 581163 586997 593135 599874 607210 614988 623478 633172 644036 655585 667753 681112 696045 712219
62198 712219 729158 746956 766098 786940 809724 834826 862576 892967 925878 961436 999780
62187 999780 1040546 1082808 1125449 1167316 1207135 1243586 1275440 1301565 1321071 1333748 1340131 1340818
62175 1340818 1335928 1325556 1310423 1291485 1269059 1242958 1213496 1181775 1148914 1115611 1082600
62164 1082600 1050968 1021634 994804 970171 947383 926189 906499 888486 872447 858499 846677
62153 846677 837203 830129 824703 819726 814815 810764 808362 807304 806559 805335 803344 800678 797983 796369
62139 796369 796561 798243 800588 803227 806315 809978 814198 819055 824667 831007 838123 846291 855583 865584
62125 865584 876034 887509 900844 916049 932345 949276 967108 986063 1005732 1025487 1044992
62114 1044992 1063997 1081944 1098178 1112429 1124981 1136440 1147516 1158836 1170804 1183562 1197136
62103 1197136 1211663 1227538 1245322 1265427 1287912 1312668 1339678 1368837 1399543 1430812 1461824
62092 1461824 1491929 1520062 1544764 1565104 1581144 1593210 1601271 1605482 1606722 1605828 1602681 1596849 1588897
62079 1588897 1580169 1571339 1562031 1551956 1541593 1531539 1522001 1513324 1506337 1501623 1498916 1497721 1498220
62066 1498220 1500939 1505659 1511138 1516084 1520268 1524669 1530625 1538786 1548765 1559717 1571119 1582898 1595071
62053 1595071 1607651 1620890 1635294 1651251 1668765 1687511 1706934 1726469 1746049 1766357 1788159
62042 1788159 1811346 1835017 1858532 1882062 1905967 1930150 1954285 1978376 2002791 2027960 2054258
62031 2054258 2081909 2110798 2140572 2171204 2203252 2237312 2273239 2310024 2346290 2380847 2413140
62020 2413140 2443631 2473690 2504794 2537623 2571982 2607465 2643889 2681010 2718080 2754118 2788718
62009 2788718 2822366 2855733 2888835 2921194 2952731 2984048 3015727 3047794 3080113 3112865 3146192
61998 3146192 3179674 3212705 3245226 3277643 3309996 3341609 3371490 3398699 3422412 3442072 3457572
61987 3457572 3469002 3476268 3479245 3478143 3473294 3464701 3452281 3436481 3418053 3397228 3373752 3347908
61975 3347908 3320870 3293755 3266871 3240220 3214269 3189725 3166835 3145340 3124973 3105746 3087870
61964 3087870 3071634 3057220 3044471 3032966 3022418 3012791 3003938 2995372 2986586 2977408 2967950 2958416 2949117
61951 2949117 2940398 2932376 2924832 2917398 2909729 2901545 2892775 2883657 2874494 2865410 2856622 2848723 2842119 2836204
61937 2836204 2829743 2822254 2814458 2807161 2800273 2793192 2785536 2777023 2767130 2755453 2742132 2727427 2711084
61924 2711084 2692513 2671414 2647911 2622296 2595020 2566705 2537740 2508008 2477406 2446511 2416373
61913 2416373 2387677 2360443 2334479 2309788 2286455 2264377 2243222 2222638 2202523 2183117 2164720
61902 2164720 2147330 2130707 2114771 2099706 2085621 2072385 2059847 2047923 2036458 2025360 2014863
61891 2014863 2005232 1996217 1987433 1979405 1973422 1969861 1967393 1964560 1961699 1960570 1962320 1966597 1972535 1979850
61877 1979850 1988819 1999758 2012750 2027675 2044358 2062799 2083159 2105385 2129076 2154013 2180542
61866 2180542 2209047 2239211 2270273 2301953 2334779 2369591 2407034 2447410 2490583 2535978 2583085
61855 2583085 2632084 2683904 2739836 2801224 2869206 2944339 3026581 3116091 3214010 3322192 3442250
61844 3442250 3575177 3721703 3882690 4059285 4253002 4465442 4697650 4949947 5222721
61835 5222721 5516781 5831992 6165484 6511686 6863683 7213371 7549828 7858362 8121903
61826 8121903 8323723 8449851 8491154 8445135 8316478 8115652 7856498 7554068 7222788 6875005
61816 6875005 6520525 6167292 5821970 5489572 5173052 4873954 4593459 4332440 4090725
61807 4090725 3867020 3659917 3468782 3293543 3133821 2988499 2856069 2735224 2625078
61798 2625078 2524949 2434086 2351672 2276965 2209347 2148264 2093318 2044403 2001666 1965254 1935119
61787 1935119 1910919 1891974 1877394 1866473 1859043 1855243 1854864 1857001 1860361 1863866 1866998 1869741 1872239
61774 1872239 1874346 1875431 1874692 1871737 1866924 1861246 1855918 1851926 1849730 1849380 1851001 1855025 1861774 1870885
61760 1870885 1881422 1892572 1904068 1915873 1927691 1938948 1949204 1958464 1967049 1975196 1982780 1989515
61748 1989515 1995432 2001038 2007004 2013918 2022427 2033344 2047330 2064611 2085203 2109328 2137369 2169664
61736 2169664 2206603 2248761 2296517 2349600 2407446 2470067 2538270 2613002 2694733 2783505 2879199
61725 2879199 2981757 3091439 3208935 3334984 3470017 3614635 3770412 3939512 4123301
61716 4123301 4321967 4536016 4767656 5020167 5296255 5597671 5926199 6284228 6674259
61707 6674259 7098565 7559448 8059022 8597858 9173707 9781421 10413215 11057758 11698499
61698 11698499 12313026 12874328 13353096 13720513 13952023 14031861 13956205 13732992 13379143 12917480
61688 12917480 12374282 11776471 11148370 10509683 9875718 9258470 8666715 8105548 7577022
61679 7577022 7081947 6621010 6194325 5800574 5437314 5102146 4793377 4509582 4248882
61670 4248882 4008959 3787728 3583796 3396153 3223629 3064878 2918718 2784124 2659822
61661 2659822 2544362 2436857 2337339 2245980 2162113 2084382 2011701 1943599 1879598 1818779 1760331
61650 1760331 1704315 1651491 1602346 1556523 1513293 1472375 1434036 1398426 1365166 1333759 1304128
61639 1304128 1276421 1250511 1226160 1203555 1183040 1164277 1146294 1128655 1111934 1096661 1082325
61628 1082325 1068013 1053642 1039883 1027160 1015363 1004347 993973 983721 972952 961692 950590
61617 950590 939980 929534 918994 908726 899284 890767 882765 874646 865869 856455 847352 839848 834358
61604 834358 829994 825586 820838 816289 812454 809261 806222 802897 799218 795423 791678 787890 784077 780654
61590 780654 778046 776184 774840 774289 775029 776767 778416 779279 779733 780541 782097 784604 788237 792612 796642
61575 796642 799573 801796 804064 806279 807727 808263 808522 809001 809621 810245 810987 811814 812307 812085 811214 810093 809175
61558 809175 808804 808966 809113 808542 807030 804809 801892 797881 792636 786752 781087 776044 771565 767521 763801
61543 763801 760213 756725 753717 751567 749945 747819 744370 739775 735048 731228 728756 727409 726618 725892 725065
61528 725065 724267 723806 724161 725884 729169 733475 737921 742185 746783 752250 758409 764720 771117 778002 785580
61513 785580 793701 802409 812109 823046 835074 848202 862890 879419 897320 915872 934993 955171
61501 955171 976631 998987 1021749 1044774 1068138 1091841 1115639 1138996 1161180 1181696 1200666
61490 1200666 1218569 1235604 1251506 1265974 1278999 1290710 1301148 1310269 1317962 1323948 1327883 1329754
61478 1329754 1330093 1329693 1329099 1328377 1327268 1325532 1323214 1320578 1317755 1314624 1311233 1308313 1307111 1308536 1312513
61463 1312513 1318183 1324690 1331839 1340139 1350346 1363010 1378485 1397194 1419556 1445545 1474589 1506169
61451 1506169 1540400 1577939 1619503 1665665 1716822 1773025 1834049 1899989 1971706 2050352 2136620
61440 2136620 2230745 2332993 2443557 2561987 2687190 2818045 2953484 3091721 3229729 3363582
61430 3363582 3488978 3601394 3696356 3770179 3820554 3846482 3848080 3826790 3785472 3727792 3657279
61419 3657279 3576940 3489560 3397984 3304964 3212846 3123520 3038605 2959459 2886834 2820693 2760744
61408 2760744 2707243 2660985 2622379 2590879 2565604 2546214 2532853 2525543 2524061 2528183 2537592 2551621
61396 2551621 2569645 2591676 2618146 2649158 2684292 2722971 2764469 2807660 2851434 2895405 2939635
61385 2939635 2983611 3026179 3066655 3105346 3142651 3178236 3211437 3241911 3269415 3293383 3313304
61374 3313304 3329290 3341896 3351601 3358882 3364539 3369470 3374144 3378596 3382860 3387126 3391527 3396048 3400636
61361 3400636 3405237 3409711 3413794 3417059 3418900 3418724 3416327 3412005 3406269 3399477 3391651 3382482 3371628 3359316
61347 3359316 3346538 3334220 3322174 3309264 3294589 3278053 3259771 3239633 3217800 3195072 3172325
61336 3172325 3149964 3128378 3108563 3091741 3078492 3068737 3062524 3060488 3063618 3072861 3088994 3112640
61324 3112640 3144349 3184747 3234511 3294077 3363489 3442651 3531619 3630574 3739635 3858752 3987522
61313 3987522 4124864 4268903 4417174 4566749 4714059 4854729 4983701 5095753 5186413 5253025
61303 5253025 5295065 5313142 5307722 5279160 5228746 5159012 5072736 4972056 4858696 4734598 4602125
61292 4602125 4464008 4323253 4182562 4043572 3906996 3773665 3644956 3522021 3405211
61283 3405211 3294606 3190605 3093613 3003568 2920234 2843606 2773668 2710170 2653046 2602715 2559567
61272 2559567 2523444 2493963 2470971 2454271 2443351 2437859 2437948 2443667 2454313 2468908 2486986 2508418
61260 2508418 2532764 2559392 2587976 2618245 2649441 2680541 2710917 2740209 2767724 2792573 2814344
61249 2814344 2833117 2848800 2861047 2869833 2875620 2878806 2879306 2876749 2870779 2861207 2848189 2832313 2814234
61236 2814234 2794285 2772633 2749691 2726000 2701815 2677134 2652133 2627218 2602659 2578403 2554303
61225 2554303 2530424 2507189 2485251 2464930 2445664 2426438 2407039 2388539 2372155 2357959 2345060
61214 2345060 2332631 2320178 2307147 2293074 2278087 2262683 2246975 2230717 2214108 2198000 2183182
61203 2183182 2169908 2158377 2149313 2143683 2141898 2143407 2147160 2152481 2159455 2168336 2178826 2190487 2203929
61190 2203929 2220953 2243124 2270646 2302997 2340092 2382241 2429361 2480937 2536521 2595583 2656837
61179 2656837 2718066 2776365 2828223 2869849 2898174 2911468 2908738 2889080 2852387 2800286 2735506
61168 2735506 2660556 2577876 2490895 2403524 2318210 2235298 2154587 2076762 2003002 1933954 1869615
61157 1869615 1809800 1754421 1703609 1657700 1616688 1579716 1545700 1514527 1486969 1463245 1442350
61146 1442350 1423123 1405415 1389891 1377151 1367373 1360368 1355658 1352884 1352304 1354449 1359144 1365488 1373059
61133 1373059 1382448 1394032 1406686 1418364 1427692 1434530 1439275 1442315 1444084 1445021 1445165 1444030 1441032 1435959
61119 1435959 1428983 1420352 1410127 1398265 1384895 1370407 1355139 1339119 1322243 1304560 1286130 1266779
61107 1266779 1246396 1225416 1204558 1184045 1163421 1142243 1120555 1098561 1076241 1053578 1030925
61096 1030925 1008878 987943 968507 951008 935890 923336 913002 904022 895404 886624 877736 868784
61084 868784 859310 848722 836951 824408 811446 798287 785401 773404 762501 752437 743067 734589
61072 734589 727124 720505 714674 709961 706745 705057 704664 705340 706931 709302 712310 715727 719272 722941 727231
61057 727231 732743 739552 747213 755360 763996 773168 782697 792325 801938 811593 821419 831409 841136 849798
61043 849798 856765 862026 865971 868896 870867 871768 871221 868838 864935 860600 856561 852342 847127 841133 835412
61028 835412 830510 826134 822060 818466 815221 811707 807681 803675 800208 797066 793688 789863 785823 781995
61014 781995 778873 776791 775647 775066 774871 775118 775744 776623 777930 779905 782215 784055 785032 785571 786320 787597
60998 787597 789469 791946 794932 798360 802458 807517 813368 819442 825388 831263 837160 843097 849261 855902
60984 855902 862991 870439 878581 887982 898700 910218 922063 934031 945975 958042 971097 986195
60972 986195 1003390 1021587 1039682 1057399 1075041 1093039 1111877 1131939 1153253 1175781 1199927
60961 1199927 1226194 1254349 1283461 1312865 1342642 1373217 1405013 1438450 1473695 1510388 1548142
60950 1548142 1587182 1627925 1670152 1713410 1758286 1806542 1859757 1918240 1981226 2047726 2117414
60939 2117414 2191285 2271249 2358592 2453146 2554389 2662579 2778102 2900623 3030116 3168097
60929 3168097 3316606 3476758 3649752 3838364 4045432 4271296 4514717 4776034 5057550
60920 5057550 5361676 5691614 6053992 6458364 6914403 7432517 8026914 8714177 9508296
60911 9508296 10420670 11464599 12654599 14002616 15524517 17248397 19188001 21272747
60903 21272747 23299226 24986005 26119930 26674489 26798016 26701877 26566887 26527243 26675315
60894 26675315 27017188 27410673 27585579 27275647 26365114 24929763 23158425 21244658 19330395
60885 19330395 17504439 15816009 14284023 12908071 11681353 10595768 9639073 8794564
60877 8794564 8046249 7381878 6790840 6262722 5789152 5364469 4983491 4640476 4330650
60868 4330650 4050476 3795648 3560885 3342546 3139739 2952237 2778951 2619010 2472389
60859 2472389 2338338 2214426 2098005 1987621 1882645 1782862 1688997 1602299 1522836 1449169
60849 1449169 1380124 1315786 1256395 1201549 1151019 1105152 1063847 1026199 991683 960589 932750
60838 932750 906975 882423 859498 838744 819818 802206 786038 771555 758560 746982 737155 728948
60826 728948 721465 714220 707846 703035 699448 696242 693004 689679 686237 682918 680152 677765 674836 670738
60812 670738 665716 660147 654013 647483 641231 635620 630217 624548 618734 613010 607344 601913 597339 594005
60798 594005 591728 590351 589927 590077 589997 589564 589661 590989 593335 596386 600405 605536 611271 617222 623732 631179
60782 631179 639440 648599 659326 671720 684453 695880 705611 714326 722597 730578 738405 746014 752785
60769 752785 758000 761563 763952 765746 767538 769822 772458 774545 775259 774501 772440 768941 763905 757804 751369
60754 751369 745044 739062 733617 728534 723149 716973 710246 703555 697198 691170 685400 679731 673947 668088
60740 668088 662454 657217 652403 648244 645031 642536 640193 638014 636713 636779 638054 640263 643222 646406 649226
60725 649226 651996 655791 661039 667152 673811 681517 690290 698924 706419 713374 721137 730182 740025 750121
60711 750121 760020 769165 777299 784744 791764 798129 803746 809101 814496 819536 823938 828157 832511 836440
60697 836440 839399 841777 844025 845539 845506 844411 843539 843211 842560 840984 838858 836731 834578 832024 828922
60682 828922 825615 822792 820814 818960 815783 810619 804212 797528 790662 783503 776685 770971 766201 761740
60668 761740 757565 754029 750946 747862 744995 742978 741796 740785 739583 738372 737319 736466 736014 736086 736393
60653 736393 736719 737361 738413 739036 738380 736906 735776 735080 733746 731193 728066 725142 722528 720206 718524
60638 718524 717589 716708 714913 711819 707831 703713 700010 696648 693104 689047 684514 679250 672519 664125 655102
60623 655102 646641 638769 630964 623655 617872 613479 608999 603499 597568 592044 586738 581167 575741 571361
60609 571361 568121 565231 562249 559781 558711 558985 559553 559608 559598 560694 563337 566866 570613 574698 579404 584400
60593 584400 589243 594221 599952 606350 612637 618356 623861 629833 636664 644132 651391 657572 662720 667739
60579 667739 673078 678043 681949 685271 688899 692916 697036 701736 707745 714747 721764 728657 736037 743796
60565 743796 751082 757827 764985 772886 780589 787386 793769 800289 806446 811439 815209 817904 819062 818246
60551 818246 816054 813613 811200 808059 803499 797667 791255 784846 778600 772441 766620 762005 759446 758793
60537 758793 758965 759151 759465 760236 761212 761849 761905 761321 759869 757402 754249 750893 747460 743944 740773 738723
60521 738723 738188 738868 740145 741557 742906 744178 745545 747367 750027 753603 757614 761228 763943 766072 768407
60506 768407 771380 774708 777841 780576 783144 785842 788639 791145 792946 793983 794502 794661 794397 793724 792818
60491 792818 791634 789785 787071 783926 781048 778856 777537 777246 777856 778829 779832 781297 783928 787969 793472
60476 793472 800951 810977 823216 836707 851245 867845 887597 910615 936362 964444 994639 1026361
60464 1026361 1058403 1089168 1117096 1140949 1159718 1172300 1177706 1176030 1168984 1158936 1147485 1135376
60452 1135376 1123555 1113516 1106508 1102961 1102863 1106101 1112214 1120310 1129590 1139707 1150442 1161380 1172184
60439 1172184 1183011 1194443 1207116 1221488 1237806 1256242 1277094 1300815 1327796 1358375 1393214
60428 1393214 1433354 1479593 1532076 1590784 1656013 1727809 1805322 1887463 1974198 2066613 2165884
60417 2165884 2272936 2389176 2516804 2658060 2814498 2986918 3175090 3376710 3586135
60408 3586135 3793725 3986210 4148543 4266972 4331624 4337115 4282225 4170494 4011110 3817617
60398 3817617 3604248 3382713 3161473 2946481 2741743 2549597 2371232 2207152 2057220
60389 2057220 1920638 1796212 1682766 1579561 1486512 1403686 1330259 1264265 1203869 1148602
60379 1148602 1098854 1054565 1015137 980153 949117 920697 893415 867235 843413 822566 803892
60368 803892 786520 770530 756111 742683 729546 716710 704511 693027 682385 673021 665044 657897
60356 657897 651122 644933 639507 634395 629277 624783 621767 620061 618688 617133 615828 615427 616070 617288 618323
60341 618323 618653 618510 618723 619835 621583 623470 625528 628153 631442 635066 638744 642497 646452 650537 654434
60326 654434 657859 660987 664420 668426 672350 675209 676868 678178 679942 682200 684554 686688 688429 689704
60312 689704 690555 690895 690383 689051 687860 687920 689192 690644 691679 692535 693241 693261 692538 691944 692102 692543 692632 692697
60294 692697 693681 696139 700010 704823 709729 713938 717570 721469 725805 729577 732043 733918 736479 740055
60280 740055 744157 748529 753249 758135 762841 767432 772272 777500 783015 788696 794254 799209 803425 807297
60266 807297 811061 814419 817257 820185 823820 828060 832669 838049 844710 852381 860302 867965 874871 880023
60252 880023 882560 882657 881027 877730 872292 864902 856697 848812 841709 835365 829518 823714 817648 811502 805635
60237 805635 800161 795264 791568 789551 788770 788372 788241 788918 790456 792136 793470 794840 796834 799452 802230
60222 802230 804874 807483 810325 813513 816887 820276 823918 828382 833853 839722 845146 849876 854307 858972
60208 858972 864218 870125 876410 882657 888883 895580 902958 910576 918117 926080 935164 945295 955850 966619
60194 966619 977954 990137 1003181 1017197 1032524 1049478 1068267 1088979 1111365 1134939 1159696
60183 1159696 1186440 1215952 1248089 1282167 1317993 1355964 1396383 1439317 1485076 1534237 1587127
60172 1587127 1643651 1703636 1767007 1833682 1903526 1976321 2051557 2128433 2206188 2284082 2360893
60161 2360893 2434936 2504900 2570083 2629474 2681422 2724927 2760607 2789445 2811144 2824792 2830805
60150 2830805 2830997 2826774 2818350 2805933 2790744 2774529 2758874 2745266 2735120 2729288 2727951 2731195 2739386
60137 2739386 2752975 2772474 2798672 2832294 2873243 2920633 2973684 3032203 3096141 3165103 3238209
60126 3238209 3313839 3389413 3462053 3529814 3591984 3648097 3697078 3737483 3768086 3788023 3796725
60115 3796725 3794123 3780886 3758381 3728383 3692603 3652331 3608661 3563213 3518291 3476010 3437594
60104 3437594 3403917 3376333 3356373 3344847 3341787 3347041 3360264 3380575 3406977 3439112 3476898 3519447
60092 3519447 3564953 3611542 3657598 3701294 3740758 3774973 3803959 3827923 3846772 3860622 3870291
60081 3870291 3877145 3882884 3889361 3898009 3909471 3924426 3944715 3972813 4010113 4056658 4112770 4180013
60069 4180013 4260095 4353698 4461043 4582928 4720447 4874046 5043523 5228619 5428986 5643668
60059 5643668 5871165 6109957 6358507 6614607 6874895 7135045 7390389 7636559 7869683
60050 7869683 8085937 8280899 8449457 8586369 8686848 8746947 8764000 8737005 8666565 8554706
60040 8554706 8405210 8224067 8018972 7797970 7568420 7336796 7108637 6888393 6679705
60031 6679705 6485964 6310202 6154322 6018856 5903663 5808488 5732679 5674775 5632734 5604430
60021 5604430 5587830 5580906 5581329 5585933 5590535 5590848 5584017 5569124 5546358 5516080 5478761 5435175 5386204
60008 5386204 5332636 5275351 5215418 5153706 5090493 5025563 4958533 4889067 4817064 4742833 4666956
59997 4666956 4589919 4512038 4433665 4355151 4276689 4198619 4122049 4048934 3981348 3920724 3867639
59986 3867639 3822010 3783541 3752360 3729383 3715819 3712293 3718658 3734551 3759820 3794423 3838281 3891280
59974 3891280 3953040 4022559 4098168 4177779 4259017 4339274 4416006 4486972 4550055 4603171 4644705
59963 4644705 4673796 4689813 4691817 4679142 4652321 4612867 4562276 4501814 4433169 4358537 4279979
59952 4279979 4199237 4118314 4039657 3965559 3897687 3837195 3784902 3741344 3706978 3682219 3666986
59941 3666986 3660601 3662769 3674400 3696742 3729990 3773601 3827763 3893391 3970498 4057568 4152777 4254878
59929 4254878 4362436 4473042 4583818 4692109 4795239 4890136 4973745 5043578 5097905 5136037
59919 5136037 5158553 5166471 5159838 5137753 5100122 5048770 4986569 4916260 4840527 4762532 4685627 4612735
59907 4612735 4546210 4487738 4438135 4397822 4367802 4349484 4343253 4348011 4362691 4387523 4423251 4469803
59895 4469803 4526503 4592939 4668697 4752560 4842801 4938013 5036873 5137261 5236526 5332829 5425762
59884 5425762 5515574 5602232 5685426 5765162 5842167 5917734 5993245 6069975 6149583 6234572 6327767
59873 6327767 6431217 6546127 6673872 6816375 6975100 7150146 7340614 7545038 7760725
59864 7760725 7982887 8204882 8419019 8616774 8788849 8926171 9021410 9069718 9068592 9017763
59854 9017763 8919342 8777762 8599359 8391809 8163427 7922377 7676056 7430685 7190945 6960086
59844 6960086 6740935 6536805 6350927 6184977 6038903 5912387 5805799 5719507 5653199 5606469
59834 5606469 5579323 5571359 5580958 5606070 5645451 5698376 5763273 5837181 5916320 5996509 6073110 6141164
59822 6141164 6195787 6232241 6245931 6232966 6191035 6119816 6020806 5896982 5752321 5591180 5417858
59811 5417858 5236536 5051098 4864713 4679865 4498918 4324352 4158144 4001205 3853620
59802 3853620 3715244 3586034 3466249 3356576 3257705 3169522 3091055 3021400 2960350 2907930
59792 2907930 2863755 2827069 2797093 2773118 2754576 2741047 2731829 2725491 2720464 2716106 2712609 2709865
59780 2709865 2707198 2704297 2701365 2698067 2693273 2686331 2677648 2667416 2654709 2638519 2618904 2596381 2571031
59767 2571031 2543100 2513838 2484836 2457079 2431336 2408685 2389632 2373399 2359252 2348099 2341622
59756 2341622 2340223 2342908 2348817 2357574 2368280 2379539 2390811 2402858 2416734 2433217 2453206 2477622
59744 2477622 2506458 2538623 2572954 2608776 2645427 2682046 2718255 2754464 2791128 2827989 2864186
59733 2864186 2898690 2930600 2959432 2985426 3009308 3031710 3053015 3073660 3094276 3115628 3138741
59722 3138741 3164879 3195038 3229620 3268957 3313894 3365387 3423795 3489175 3562112 3643708 3734910
59711 3734910 3836499 3949653 4075895 4216365 4371588 4541857 4727363 4927868 5142433
59702 5142433 5369001 5603313 5837916 6062355 6264270 6430589 6549308 6612490 6618943 6574222
59692 6574222 6488167 6372378 6238708 6097957 5958605 5826551 5705883 5599419 5508723 5434419
59682 5434419 5376871 5336238 5312003 5303116 5308727 5328395 5361666 5408136 5468107 5542522 5631884 5735662
59670 5735662 5853055 5984094 6129739 6291088 6468668 6662479 6872788 7100937 7349160
59661 7349160 7619397 7912507 8228815 8568975 8933927 9324431 9741165 10184718 10654614
59652 10654614 11148408 11662379 12192814 12735687 13285203 13833845 14374464 14901995 15413297
59643 15413297 15906421 16380821 16837887 17280491 17711572 18132637 18542960 18939783 19319237
59634 19319237 19676776 20006471 20300417 20549834 20747270 20887948 20969864 20993860 20963964 20886886
59624 20886886 20770635 20623687 20455256 20275468 20094632 19922286 19766721 19634765 19531735
59615 19531735 19461915 19429394 19438359 19492684 19595544 19749375 19955751 20215106 20526614 20887978
59605 20887978 21294613 21738770 22209521 22693311 23173950 23632143 24045853 24391927 24648095
59596 24648095 24794744 24816744 24705216 24458604 24082812 23590710 23000869 22335199 21616207
59587 21616207 20865094 20100913 19340042 18595768 17878266 17194906 16550497 15947617 15387129
59578 15387129 14868312 14388176 13940720 13516961 13105502 12693469 12268628 11822727 11353976
59569 11353976 10866755 10369310 9871475 9382866 8911246 8461820 8038035 7642414 7276065
59560 7276065 6938162 6627050 6341681 6081163 5843493 5626111 5427656 5247937 5086028
59551 5086028 4939518 4806012 4684352 4573970 4473862 4382651 4298996 4221442 4148349 4078333
59541 4078333 4010448 3943812 3877512 3810974 3743997 3676478 3608617 3541315 3475733 3412437 3351541
59530 3351541 3293571 3239430 3189563 3143922 3102757 3066576 3035281 3008202 2985181 2966801 2953411
59519 2953411 2944784 2940885 2942007 2947798 2957104 2969305 2985067 3005293 3029891 3057994 3088832 3121965
59507 3121965 3157253 3194972 3235446 3278266 3322516 3368081 3416103 3467667 3522664 3580469 3641252
59496 3641252 3706075 3776002 3851594 3933100 4020783 4115191 4217158 4327293 4445474 4571277
59486 4571277 4704869 4846875 4997267 5154883 5318227 5486063 5656992 5829037 5999987
59477 5999987 6167744 6330067 6484497 6628930 6761999 6882695 6990041 7083421 7162961 7229306
59467 7229306 7282862 7322958 7347571 7354458 7343422 7317484 7281381 7239273 7194464 7150670 7112166
59456 7112166 7082601 7064750 7061449 7075515 7108434 7160071 7229883 7317310 7420470 7535322 7656320
59445 7656320 7776920 7889256 7984788 8056335 8098902 8108268 8080068 8011377 7902665 7757413 7580373
59434 7580373 7376888 7153235 6916483 6673745 6431483 6194938 5967777 5752565 5551710
59425 5551710 5367339 5200260 5049964 4916013 4798613 4697573 4611725 4540041 4482518 4439376
59415 4439376 4410221 4394668 4393000 4405415 4431184 4469311 4519531 4582085 4656985 4743997 4842667
59404 4842667 4951650 5068507 5190737 5316485 5443590 5568357 5685801 5790666 5877889 5942892
59394 5942892 5982338 5994431 5978184 5933012 5859569 5760385 5639091 5499396 5345102 5180228
59384 5180228 5008338 4832166 4654398 4478206 4306466 4141005 3983084 3833880 3693870
59375 3693870 3562491 3439173 3324194 3217902 3119814 3029217 2946083 2870645 2802604 2741444
59365 2741444 2686932 2638614 2595405 2556497 2522199 2493183 2469380 2450259 2435582 2425144 2418355
59354 2418355 2414831 2414855 2418563 2425344 2434804 2447549 2464099 2483710 2505362 2529407 2557178 2589363 2625531
59341 2625531 2664548 2704340 2741950 2775368 2805417 2834964 2866535 2901521 2941083 2986399 3038150
59330 3038150 3096705 3162510 3235042 3311665 3389128 3466601 3546389 3631614 3724208 3825106 3935131
59319 3935131 4055163 4186322 4330383 4489364 4664467 4855964 5064254 5290400 5535558
59310 5535558 5800509 6085869 6392107 6719069 7065713 7430056 7808686 8196328 8586489
59301 8586489 8972706 9349003 9709683 10049738 10365717 10655832 10919391 11156733 11369467
59292 11369467 11559803 11729195 11877737 12004546 12107926 12185116 12232381 12245570 12220506 12153303
59282 12153303 12041035 11882249 11676863 11426206 11133781 10805581 10448978 10071437 9680455
59273 9680455 9283734 8888221 8499171 8120774 7757144 7411643 7085661 6779218 6492660
59264 6492660 6226868 5982072 5757648 5553070 5368006 5201411 5051553 4917125 4797475
59255 4797475 4691683 4598369 4516673 4446561 4387817 4339365 4299894 4268546 4244809 4228200 4218190
59244 4218190 4214019 4214565 4218786 4226100 4235806 4246373 4255970 4263603 4269137 4272428 4273191 4271502 4267621 4261391
59230 4261391 4252634 4242061 4230949 4219958 4209158 4199265 4192009 4189121 4191676 4200434 4215965 4238267
59218 4238267 4267043 4302574 4345710 4396829 4455366 4520426 4591291 4667314 4747827 4832061 4918493
59207 4918493 5004386 5086676 5163299 5233038 5294321 5344945 5382799 5405924 5412121 5399856 5370042
59196 5370042 5326229 5272756 5213162 5150094 5085505 5020487 4955607 4891645 4829446 4769128 4710259
59185 4710259 4652829 4597143 4542733 4488481 4434091 4380485 4328394 4277478 4227256 4178104 4130930
59174 4130930 4086639 4046309 4011169 3981899 3958490 3941107 3930479 3927322 3932148 3945951 3970164 4005455
59162 4005455 4051346 4107633 4175648 4257586 4355061 4468815 4599253 4746608 4910774 5091370
59152 5091370 5287650 5497935 5719189 5947173 6176600 6400975 6612750 6804023 6967056
59143 6967056 7094435 7179697 7218497 7209206 7152392 7050131 6905870 6724532 6512489 6277449
59133 6277449 6027920 5771960 5516008 5264942 5022804 4792688 4576055 4372980 4183420
59124 4183420 4007812 3846424 3698791 3563937 3440706 3327856 3224425 3130197 3045387 2969811
59114 2969811 2902766 2843634 2792014 2747292 2708698 2675842 2648690 2627000 2610306 2598394 2591226
59103 2591226 2588366 2588995 2592493 2598623 2607331 2618840 2633655 2651928 2673115 2696924 2724069 2755192
59091 2755192 2789446 2825246 2862166 2900907 2941493 2982731 3023538 3063611 3102543 3139320 3173047
59080 3173047 3203310 3229598 3251268 3268268 3281093 3289878 3294333 3294602 3291328 3284886 3275600 3264724 3254115
59067 3254115 3244762 3236702 3230401 3227020 3227095 3230290 3236871 3248299 3265883 3289866 3320150 3356821 3399538
59054 3399538 3447513 3500638 3559633 3624698 3695078 3770385 3851185 3937776 4029510 4125923 4227343
59043 4227343 4333749 4444174 4558060 4676084 4798687 4924623 5051793 5178572 5303339
59034 5303339 5423315 5534714 5633470 5715125 5774792 5808228 5812805 5787243 5731303 5646424 5535919
59023 5535919 5403698 5253222 5088030 4912435 4730865 4547011 4364029 4184782 4011134
59014 4011134 3843679 3682814 3529506 3384514 3247609 3118266 2996478 2882255 2774961
59005 2774961 2673866 2578813 2489807 2406522 2328736 2256607 2189982 2128138 2070675 2017871 1969569
58994 1969569 1924553 1881840 1841903 1805883 1774107 1745978 1720638 1697080 1674245 1651734 1629975
58983 1629975 1609298 1589553 1571018 1554679 1540866 1528509 1516529 1505140 1495060 1486386 1479257 1474728
58971 1474728 1473705 1475464 1478261 1481045 1483637 1485758 1486958 1487346 1487575 1488209 1489675 1492399 1496300 1500454 1503933
58956 1503933 1506719 1509327 1512035 1514983 1518473 1522506 1526442 1529672 1532256 1534535 1536797 1539734 1544282 1550222
58942 1550222 1555737 1559334 1561584 1564071 1567160 1569730 1570788 1570405 1569239 1567791 1565975 1563100 1558681 1553587
58928 1553587 1549720 1548189 1548510 1549928 1552537 1556528 1561564 1567816 1576498 1588115 1600988 1612862 1623538
58915 1623538 1634750 1647873 1662831 1678909 1695526 1712381 1729729 1748299 1768313 1789058 1810167
58904 1810167 1832671 1857773 1885057 1912971 1940733 1968696 1997084 2025433 2053287 2080661 2107873
58893 2107873 2135501 2164292 2194502 2225563 2256928 2288966 2322589 2358435 2396878 2438306 2482695
58882 2482695 2529467 2578333 2629828 2684531 2742446 2803662 2868810 2938171 3011156 3087521 3168300
58871 3168300 3254666 3346608 3443673 3546300 3655352 3771008 3893182 4022592 4160330 4306742
58861 4306742 4461642 4625313 4798653 4982822 5179388 5390118 5615826 5856125 6110996
58852 6110996 6381833 6670172 6976409 7300696 7644023 8007116 8389121 8788397 9203529
58843 9203529 9631961 10068305 10505314 10935730 11351658 11742877 12097658 12405160 12655973
58834 12655973 12841253 12953471 12988424 12945660 12827535 12639198 12388966 12086892 11742582 11365019
58824 11365019 10963627 10547837 10125711 9704024 9289177 8886575 8499453 8129551 7778547
58815 7778547 7447578 7136012 6842377 6566255 6307862 6066229 5839473 5626591 5427429
58806 5427429 5241173 5066469 4902800 4750134 4607459 4473348 4347742 4231382 4123653
58797 4123653 4022938 3929051 3843254 3765484 3693554 3625783 3562768 3505825 3455041 3409652 3369289
58786 3369289 3334162 3304744 3281538 3264458 3252526 3245033 3242709 3246642 3256473 3271054 3290567 3316285
58774 3316285 3348396 3385831 3428392 3477292 3533243 3595620 3663912 3738485 3819535 3906773 4000595
58763 4000595 4102219 4212223 4330305 4456704 4592464 4737958 4892683 5056932 5232161
58754 5232161 5419213 5617792 5828334 6052915 6293495 6550566 6824380 7116191 7427336
58745 7427336 7758067 8108043 8476931 8863581 9265250 9678080 10097354 10516542 10926804
58736 10926804 11318029 11679768 12000986 12270225 12477088 12613516 12673853 12654968 12557248 12385038
58726 12385038 12145774 11848886 11505078 11125215 10719145 10295713 9863430 9430002 9001139
58717 9001139 8580872 8172959 7780940 7406877 7051334 6714715 6397382 6098498 5816257
58708 5816257 5549674 5298893 5063509 4842038 4633478 4438019 4255582 4084829 3924264
58699 3924264 3773291 3631647 3498765 3374165 3257657 3148799 3046993 2952265 2864946 2784519
58689 2784519 2709913 2641025 2578659 2522739 2471941 2425421 2383583 2346673 2313952 2284737 2259057
58678 2259057 2236716 2216817 2198666 2181996 2165835 2148311 2128159 2105440 2080560 2053837 2026345
58667 2026345 1999763 1974723 1950425 1926351 1903091 1880939 1859059 1836778 1814554 1792921 1771536
58656 1771536 1750031 1728787 1708040 1687078 1665066 1641983 1618240 1594138 1570156 1547013 1524963
58645 1524963 1503666 1482998 1463304 1444787 1427471 1411736 1397868 1385088 1372177 1359135 1347059
58634 1347059 1336346 1326267 1316311 1306585 1296794 1286304 1275449 1265332 1256113 1246907 1237569 1229069 1221861
58621 1221861 1215472 1210012 1206396 1204662 1203662 1202985 1203651 1206397 1210773 1216415 1223602 1232072 1240799 1249484
58607 1249484 1258771 1268510 1277423 1284930 1291727 1298143 1303617 1308213 1312743 1316801 1318604 1317509 1314872 1311744
58593 1311744 1307622 1302283 1296909 1292395 1288352 1284708 1282497 1282131 1282692 1283902 1286958 1292380 1298903 1305599
58579 1305599 1313319 1322920 1333895 1345884 1359735 1375850 1393159 1410921 1429817 1450231 1471370 1493207
58567 1493207 1517293 1544392 1573326 1603551 1636673 1673777 1713378 1753903 1796274 1842109 1891238
58556 1891238 1943139 1999165 2061067 2128593 2200711 2278019 2361987 2452880 2550356 2654999 2767287
58545 2767287 2885900 3008718 3134602 3262563 3390142 3514018 3631043 3737173 3826741 3894632
58535 3894632 3938392 3957009 3949292 3915379 3858610 3783910 3695153 3595573 3489340 3380576 3271497
58524 3271497 3163136 3057023 2954697 2856655 2763395 2676490 2597153 2524892 2459080 2400520 2349825
58513 2349825 2305580 2265895 2230562 2199964 2173237 2149394 2128957 2112543 2099128 2087687 2079173
58502 2079173 2074600 2072361 2069796 2066465 2063483 2060405 2055035 2045754 2031977 2012987 1988465 1959751 1928737
58489 1928737 1895991 1861581 1826884 1793682 1762164 1731703 1702923 1677133 1654388 1633819 1615286
58478 1615286 1599071 1584712 1571705 1560505 1551271 1542704 1533799 1525565 1519131 1513291 1506008 1497354 1488931
58465 1488931 1481339 1474188 1467641 1461860 1455873 1449000 1442448 1437448 1432858 1426824 1419813 1413689 1408709 1403788
58451 1403788 1398966 1395233 1392482 1389889 1387752 1386884 1386850 1386851 1387595 1390190 1393924 1397314 1400639 1405347 1411669 1418836
58435 1418836 1426829 1435883 1445168 1454019 1463551 1475004 1487587 1500133 1513515 1528923 1544952 1559187
58423 1559187 1571671 1584046 1596140 1606263 1614159 1620836 1626115 1629056 1630265 1631031 1630703 1627620 1622195
58410 1622195 1616461 1611092 1605373 1599515 1594373 1589426 1583641 1577687 1572733 1567822 1561265 1553886 1548061 1544090
58396 1544090 1540378 1536579 1533645 1531305 1528518 1525977 1525260 1525941 1526350 1526646 1528295 1531127 1533899 1537094 1542031
58381 1542031 1547816 1552405 1556205 1561407 1568264 1575253 1582393 1590920 1600115 1607942 1614626 1622171 1630654 1638421
58367 1638421 1645561 1653531 1661584 1667398 1671240 1675820 1681965 1688098 1694016 1701294 1709764 1717414 1724208 1732248
58353 1732248 1741745 1750533 1758034 1766065 1775231 1784176 1792915 1803159 1814708 1825218 1834206 1843712 1854336
58340 1854336 1864324 1873279 1883041 1893953 1903914 1912093 1920053 1928194 1934595 1938586 1942199 1946973 1952424 1958465
58326 1958465 1966166 1975162 1983495 1990920 1999382 2009509 2019672 2029071 2038607 2048226 2056688 2064474 2073696
58313 2073696 2084667 2095763 2106906 2119669 2133749 2146932 2158879 2171334 2184483 2196991 2209653
58302 2209653 2224753 2241597 2257012 2270665 2285430 2302109 2318449 2334038 2351341 2370985 2390692
58291 2390692 2409876 2430562 2452769 2473800 2493252 2513896 2536300 2557452 2576122 2594698 2614252
58280 2614252 2632670 2649270 2666392 2684751 2702046 2717821 2734869 2754094 2772946 2790654 2809952
58269 2809952 2831756 2853246 2873255 2894470 2918179 2941982 2964894 2989536 3016963 3044385 3070390
58258 3070390 3097337 3126276 3154800 3182388 3212531 3246844 3282227 3316580 3352047 3389846 3427264
58247 3427264 3462784 3498964 3537193 3574779 3610309 3646734 3686008 3725727 3764082 3803070 3843877
58236 3843877 3884334 3923935 3966037 4012031 4058748 4104570 4152505 4204191 4256732 4308739 4363557
58225 4363557 4423050 4484091 4544688 4607632 4674615 4742862 4811163 4882947 4959705 5037842 5115850
58214 5115850 5197979 5286775 5378788 5471958 5570335 5676722 5787262 5897972 6010127 6124651
58204 6124651 6238013 6348335 6458845 6570729 6679591 6783483 6887254 6994548 7103381
58195 7103381 7214082 7333137 7463909 7602007 7745130 7898767 8066698 8245193 8432601
58186 8432601 8635110 8856353 9090858 9334543 9591882 9865695 10150140 10441498 10745702
58177 10745702 11067485 11402788 11749883 12116555 12507259 12914537 13332545 13767672 14226584
58168 14226584 14706429 15207290 15741237 16317327 16930069 17574144 18257310 18986798 19757571
58159 19757571 20567927 21432903 22368208 23374923 24453579 25616990 26873606 28215024
58151 28215024 29637159 31157364 32794350 34550587 36432936 38469578 40686253 43089203
58143 43089203 45695201 48554313 51718060 55213424 59079380 63403310 68294876 73864009
58135 73864009 80264852 87717855 96432400 106540233 118153022 131438647 146597526
58128 146597526 163855257 183519720 205729430 229608131 252463833 270212627 279219177
58121 279219177 278163966 268390909 252710595 233941447 214190825 194812665 176557176
58114 176557176 159733974 144417271 130608253 118260886 107256605 97443297 88695574
58107 88695574 80911344 73982327 67809680 62332569 57510074 53286628 49595901 46381254
58099 46381254 43589240 41156824 39027580 37174028 35591142 34278272 33239191 32488430
58091 32488430 32043891 31917402 32116317 32644940 33497360 34641863 35981105 37291369 38218432
58082 38218432 38406096 37687185 36158996 34078035 31703652 29230827 26800226 24504386
58074 24504386 22382695 20442176 18688167 17124460 15737474 14503211 13405973 12435258
58066 12435258 11572264 10796849 10102698 9490558 8951282 8469146 8036257 7649729 7299205
58057 7299205 6970602 6658905 6365834 6089074 5824985 5577545 5353065 5149388 4960352
58048 4960352 4786772 4632716 4495030 4366943 4248344 4142324 4044959 3948628 3852666 3761425
58038 3761425 3674842 3590198 3510250 3440113 3378270 3319393 3263793 3215566 3173691 3133396 3094325
58027 3094325 3059150 3026027 2990467 2953129 2918114 2885117 2850571 2815015 2782163 2752122 2722364
58016 2722364 2693791 2669127 2646883 2623542 2600126 2580173 2562941 2545083 2527323 2512933 2501228
58005 2501228 2489072 2477285 2469045 2463352 2456593 2449313 2444901 2442663 2438671 2432694 2427996 2424931 2420875
57992 2420875 2415998 2413091 2411940 2409522 2405549 2402520 2400666 2398082 2395422 2395235 2397012 2397911 2397975 2399644 2402656
57977 2402656 2404460 2405335 2408155 2413294 2418462 2423194 2428872 2434760 2438734 2441613 2446139 2452027 2456547 2459577
57963 2459577 2463457 2468276 2471995 2475012 2479954 2486997 2493825 2500160 2507907 2516857 2524598 2530746 2537160 2543981
57949 2543981 2549558 2554240 2560084 2566875 2572497 2577201 2583419 2591365 2598851 2605468 2612904 2621111 2628210 2634306
57935 2634306 2641478 2649859 2657605 2664794 2673362 2682998 2691003 2696449 2700711 2703815 2704249 2702653 2701779 2702427 2703125
57920 2703125 2704001 2706966 2711691 2715491 2717851 2721249 2726757 2732604 2737889 2744068 2751760 2759526 2766777 2774755
57906 2774755 2783771 2792544 2800906 2810098 2819827 2828187 2835006 2842114 2849841 2856587 2862300 2868838 2876183 2881894
57892 2881894 2885335 2889023 2894593 2900647 2905810 2910816 2916256 2921171 2925270 2929925 2935754 2941664 2947312 2954011
57878 2954011 2962247 2970776 2979123 2988540 2999654 3011569 3024006 3037776 3052345 3065557 3076640 3087016
57866 3087016 3097310 3106210 3113140 3119459 3125970 3131618 3135653 3138764 3141261 3142541 3143188 3145141 3148917 3153058
57852 3153058 3157055 3162187 3168611 3174423 3178842 3183834 3191219 3200464 3210524 3221464 3232996 3243730 3253436
57839 3253436 3264049 3276960 3291092 3304842 3318138 3331422 3344434 3357187 3370493 3384468 3398053
57828 3398053 3410820 3423574 3436523 3448753 3460227 3472254 3485095 3497092 3507197 3516470 3526128 3535935
57816 3535935 3545467 3555091 3564706 3573227 3580342 3587191 3594586 3602172 3609907 3618507 3627862 3636957 3645986 3656485
57802 3656485 3668701 3681023 3692736 3705111 3718950 3733373 3748002 3763969 3781594 3799343 3816372
57791 3816372 3833840 3852299 3870059 3885736 3900364 3915287 3929841 3942900 3955051 3967459 3979920
57780 3979920 3991642 4002700 4013303 4022904 4031367 4039783 4048935 4058206 4067030 4076025 4085655 4095261 4104518
57767 4104518 4114265 4124787 4134919 4144091 4153679 4164956 4177225 4189342 4201553 4214323 4226762 4237857
57755 4237857 4248158 4258741 4269483 4279661 4289362 4299140 4309152 4319499 4330397 4341256 4350995 4360074
57743 4360074 4370669 4383728 4397425 4409784 4421302 4433657 4447258 4461587 4476684 4492696 4509000
57732 4509000 4525200 4542095 4560406 4579506 4598586 4618047 4638512 4659451 4679989 4700157 4720246
57721 4720246 4739862 4758697 4777309 4796221 4815164 4834050 4853542 4873805 4893916 4913358 4932746
57710 4932746 4952214 4970586 4987261 5003385 5019934 5036088 5050869 5064936 5079294 5093618 5107326
57699 5107326 5121045 5135426 5149727 5163222 5176895 5192151 5208804 5225946 5243790 5262974 5282873
57688 5282873 5302292 5321173 5340211 5359512 5379002 5399296 5420684 5442106 5462626 5483157 5505161
57677 5505161 5528311 5551068 5572999 5594988 5617507 5640147 5662579 5684772 5706593 5728192 5750426
57666 5750426 5773947 5798366 5823097 5848266 5873934 5899355 5924079 5948887 5974514 6000394 6025865
57655 6025865 6051689 6079056 6107904 6137526 6167999 6199669 6231958 6264180 6296810 6330634 6365277
57644 6365277 6399878 6434556 6469943 6505886 6541939 6578433 6615803 6653610 6691529 6730580 6771947
57633 6771947 6815308 6859794 6905877 6954742 7006345 7059693 7114598 7171624 7230690 7291269 7353713
57622 7353713 7419020 7487529 7559112 7634413 7714727 7800893 7893307 7992576 8099136 8212778 8333514
57611 8333514 8462140 8598820 8741916 8889458 9040726 9194760 9348151 9496059 9634986
57602 9634986 9763057 9878404 9978999 10063160 10127747 10166090 10170317 10136934 10069508 9976332 9866926
57591 9866926 9750160 9633087 9520136 9413911 9316657 9230073 9154175 9087824 9030372 8981751
57581 8981751 8941355 8908188 8881858 8862102 8847748 8837676 8832429 8833214 8839540 8849587 8862707 8879731
57569 8879731 8900803 8924787 8951190 8980953 9014910 9052912 9094763 9140579 9189931 9242092 9297492
57558 9297492 9357566 9422954 9493294 9568961 9651247 9740269 9834247 9931672 10032849 10138540 10248228
57547 10248228 10360283 10472616 10582271 10685408 10778463 10858689 10923224 10968889 10993817 10998656
57537 10998656 10985613 10957049 10915463 10863865 10805315 10742432 10677623 10613075 10550149 10489427 10431768
57526 10431768 10378638 10331040 10288813 10251327 10218271 10189494 10164760 10144068 10127618 10115171 10105956
57515 10105956 10099459 10095741 10094814 10096359 10100254 10106708 10115662 10126602 10139156 10153305 10168890 10185569 10203392
57502 10203392 10222790 10243863 10266266 10289875 10314842 10340935 10367572 10394727 10423076 10453062 10484432
57491 10484432 10516849 10550228 10584336 10618788 10653730 10689891 10727668 10766658 10806293 10846432 10887211
57480 10887211 10928800 10971420 11015154 11059780 11105225 11152059 11200887 11251402 11302764 11354832 11408315
57469 11408315 11463687 11520729 11579160 11639042 11700583 11764292 11831245 11902398 11977626 12056184 12138023
57458 12138023 12223690 12313016 12404958 12498930 12595118 12693138 12791284 12887484 12980088 13067173 13145908
57447 13145908 13213287 13267161 13306331 13330269 13339367 13335151 13319925 13296310 13266994 13234393 13200353
57436 13200353 13166416 13134190 13104964 13079152 13056649 13037628 13022359 13010569 13001812 12996403 12995155 12998236
57424 12998236 13005068 13015305 13029019 13045934 13065357 13086956 13110810 13136744 13164537 13194741 13228256
57413 13228256 13264901 13303451 13343279 13384922 13428702 13473856 13519586 13566197 13614686 13665851 13720189
57402 13720189 13778011 13839246 13903582 13971051 14041932 14116032 14192757 14272021 14354277 14439330 14525790
57391 14525790 14611806 14695622 14775177 14847973 14911681 14964338 15003892 15028473 15037502 15031998 15013691
57380 15013691 14984605 14947482 14905466 14860829 14814734 14768496 14724099 14682967 14645086 14609927 14577560
57369 14577560 14548309 14522049 14498536 14477970 14460662 14446473 14435009 14425975 14419021 14413652 14409646 14407153
57357 14407153 14406182 14406430 14407862 14410952 14416026 14422761 14430531 14438860 14447460 14456359 14466144 14477507 14490337 14503732
57343 14503732 14517064 14530543 14544600 14559265 14574372 14589940 14606180 14623458 14642179 14662267 14682888
57332 14682888 14703283 14723695 14744776 14766303 14787298 14807301 14826503 14844674 14861141 14876083 14890790
57321 14890790 14906199 14921979 14937442 14952573 14967772 14983266 14999142 15015353 15031480 15047068 15062330
57310 15062330 15077858 15093648 15109159 15124319 15139512 15154540 15168635 15181640 15194097 15205999 15216647
57299 15216647 15226047 15235258 15244856 15254121 15262251 15269347 15275733 15281382 15286582 15292088 15297923 15302987 15306594 15309496
57285 15309496 15312706 15316252 15319782 15323447 15327352 15330982 15334045 15337144 15340852 15344837 15348656 15352657 15357267 15362163
57271 15362163 15367019 15372421 15379081 15386720 15394502 15402017 15409009 15414862 15419332 15423223 15427322 15431072 15433296 15433836
57257 15433836 15433498 15432708 15431300 15429478 15427882 15426530 15424482 15420800 15415344 15408585 15401048 15393058 15384671 15375876
57243 15375876 15367014 15358826 15351917 15346414 15342281 15339517 15337869 15336922 15336783 15338145 15341276 15345448 15349860 15354575
57229 15354575 15360078 15366347 15372927 15379560 15386224 15392817 15399238 15405461 15411166 15415608 15418224 15419026 15418181 15415635
57215 15415635 15411433 15405896 15399099 15390628 15380135 15367619 15352865 15335270 15314702 15291913 15267694 15242179
57203 15242179 15215523 15188640 15162695 15138443 15116707 15098952 15086538 15079730 15078110 15081743 15091319 15107327
57191 15107327 15129660 15157941 15191731 15230398 15273071 15318622 15365633 15412595 15458262 15501523 15540964
57180 15540964 15575105 15603392 15626592 15646114 15663282 15679136 15694197 15708169 15720419 15730951 15740368
57169 15740368 15748905 15756277 15762607 15768600 15774542 15779956 15784508 15788331 15791076 15791569 15788994 15783734 15776610 15768096
57155 15768096 15758673 15749080 15739649 15730111 15720615 15712140 15705450 15700360 15696457 15693620 15691329 15688432 15684250 15679105
57141 15679105 15673164 15665801 15656885 15647647 15639232 15631152 15622203 15612232 15601853 15590839 15577828 15561361 15540361
57128 15540361 15513844 15480905 15440798 15392534 15334758 15266614 15188324 15100316 15002173 14892968 14772204
57117 14772204 14639749 14495194 14337915 14167699 13984891 13790092 13583955 13367152 13140595
57108 13140595 12906112 12666918 12426826 12189090 11956689 11733649 11524985 11334953 11165984
57099 11165984 11019141 10894322 10789573 10701029 10623711 10551346 10475396 10385829 10273812 10133205
57089 10133205 9959851 9751351 9508584 9236474 8942568 8635526 8324747 8019270 7725122
57080 7725122 7443625 7172052 6904839 6634168 6351292 6048695 5721006 5364651 4978755
57071 4978755 4566967 4136519 3693942 3241648 2777939 2298485 1797595 1270052 712777
57062 712777 123987 -499056 -1160054 -1861947 -2607520 -3401820 -4252054 -5165309 -6148630 -7211167
57052 -7211167 -8363620 -9615897 -10978424 -12465921 -14096693 -15888027 -17855603 -20017344
57044 -20017344 -22393779 -25004239 -27867146 -31005049 -34445460 -38216520 -42346832 -46870014
57036 -46870014 -51823654 -57242759 -63160199 -69614085 -76646452 -84292153 -92576698 -101525444
57028 -101525444 -111158225 -121455629 -132317747 -143536461 -154782163 -165620308 -175593931
57021 -175593931 -184356264 -191752464 -197770458 -202417461 -205654000 -207425608 -207709414 -206507038
57013 -206507038 -203816023 -199634158 -193982811 -186906920 -178460985 -168723089 -157838836 -146053952
57005 -146053952 -133708310 -121197896 -108919053 -97208048 -86298648 -76316923 -67304398
56998 -67304398 -59244336 -52081425 -45740930 -40145610 -35221356 -30894863 -27095477 -23761277
56990 -23761277 -20839360 -18280721 -16039715 -14078365 -12366077 -10874038 -9573249 -8437904
56982 -8437904 -7446648 -6580112 -5820751 -5155418 -4574598 -4068387 -3625873 -3238268 -2899474
56973 -2899474 -2603393 -2343680 -2116351 -1919625 -1750654 -1604837 -1478535 -1369919 -1276983 -1197263
56963 -1197263 -1129896 -1075632 -1034431 -1004895 -986067 -977620 -978136 -985195 -997291 -1013834 -1033337 -1053520
56951 -1053520 -1073139 -1092007 -1109362 -1123960 -1135521 -1144300 -1149464 -1149524 -1143933 -1132654 -1114774 -1089277
56939 -1089277 -1056470 -1016814 -969113 -911777 -844944 -769251 -683408 -585247 -474452 -352650 -223176
56928 -223176 -94537 17452 96389 136140 143324 129447 103510 71424 37431 3363 -31197 -66240
56916 -66240 -100210 -132125 -162564 -191682 -218281 -241709 -262711 -281532 -297056 -308626 -316879 -322000
56904 -322000 -323028 -319732 -313515 -305565 -295673 -283563 -269680 -253923 -235378 -214290 -192981 -174018
56892 -174018 -158777 -148157 -142865 -142052 -143136 -143951 -144043 -143391 -141353 -137588 -132597 -126546 -118787 -109139 -98411
56877 -98411 -87066 -74596 -60783 -46298 -31473 -15737 1225 18857 36548 53627 68114 77095
56865 77095 79151 75296 67167 55757 42388 29158 17408 6916 -2701 -11037 -17985 -24419 -30955
56852 -30955 -37152 -42589 -47582 -52191 -55711 -57782 -58872 -59129 -58035 -55742 -53360 -51229 -48236 -43602 -37997
56837 -37997 -32100 -25445 -17628 -9392 -1458 6558 15023 23187 30285 36837 43785 51136 58325 65151
56823 65151 71475 76714 80433 82814 83976 83629 81991 80083 78456 76466 73561 70469 68355 67574 67922
56808 67922 69371 71892 75172 79091 83943 89821 96415 103659 111755 120445 129156 137808 146272 153008
56794 153008 155905 154879 152041 148740 144149 137565 130337 124305 119737 116052 113348 111985 111728 112583 115498
56779 115498 121083 128540 136994 146912 159109 173323 188984 206354 225329 243725 258186 266569
56767 266569 268526 264463 255257 242638 228609 214436 200782 188275 177184 167083 157740 149895
56755 149895 144318 140691 138337 137594 139482 144257 151192 159665 169737 181676 195187 208885 220337
56742 220337 227173 228544 225169 218026 207794 195631 183300 171980 161780 152762 145399 139659 134814
56729 134814 130693 127979 126695 125706 124476 124083 125625 128877 133338 139304 146715 154071 159667 162979 163894
56714 163894 161800 156694 150065 143346 136381 128676 121101 114831 109502 103978 98317 93498 89763 86662
56700 86662 84249 82809 81732 80041 77819 76002 75006 74448 73845 72754 70805 68522 67377 68038 69304
56685 69304 69807 69940 70855 72421 73587 74122 74547 74888 74916 75174 76333 77890 78772 78831 78545 77820 76443 75255
56667 75255 75384 76638 77948 78984 80004 80499 79553 77347 74972 72991 71400 70638 71224 72671 74049 75315
56651 75315 76857 78234 78843 79370 80944 83197 84818 85745 87034 88799 90123 91008 92505 94725 96584
56636 96584 97811 99413 101643 103324 103834 104255 105657 107510 108625 108652 107925 106716 105282 103946 102705 101397
56620 101397 100431 100494 101407 102206 102494 102764 103238 103506 103606 104350 106132 108271 109968 111171 112151 112963 113634 114263
56602 114263 114768 115102 115698 116988 118567 119619 120083 120493 120811 120456 119474 118600 118051 117301 116176 115170 114449
56585 114449 113507 112082 110544 109143 107628 105833 103930 102059 100266 98750 97534 96177 94560 93541
56571 93541 93842 94639 94447 93102 91712 90912 90506 90632 91794 93679 95356 96722 98505 100770 102759 104260
56555 104260 105752 107159 107882 108182 108995 110254 110983 111285 112422 114500 115824 115353 114186 113715 113754 113503 113130
56538 113130 113235 113718 114179 114724 115503 116081 116013 115527 115158 115233 116003 117538 119238 120278 120774 121674 123250 124700
56520 124700 125483 126020 126742 127480 128146 129041 130125 130925 131516 132601 134352 136083 137333 138241 138766 138754 138972
56503 138972 140712 143952 147159 149312 150907 152646 154517 156565 159194 162129 164509 166467 169207 172886
56489 172886 175998 177629 178820 180735 182939 184589 186038 188053 190473 192782 195109 197634 199794 201019
56475 201019 201511 201586 201116 200320 200075 200660 201078 200422 199071 197917 197283 197138 197303 196949 195128 192419 190738
56458 190738 190824 191326 191114 190873 191385 191856 191343 190450 190119 189896 188946 187745 187260 187307 187176 187043 187358 187572 186926
56439 186926 185864 185324 185185 184686 183750 182675 181084 178555 175821 174131 173746 174026 174472 174728 174202 172826
56423 172826 171638 171640 172614 173910 175634 178000 180381 182169 183869 186113 188278 189412 189975 191303 193767
56408 193767 196642 199415 202085 204569 206895 209631 213118 216684 219525 221840 224210 226521 228497 230608
56394 230608 233367 236346 238993 241744 245149 248562 250973 252585 254316 256241 257704 258524 258875 258476 257081
56379 257081 255389 254334 253898 253628 253703 254384 255046 255057 255016 255797 256910 257190 256726 256687 257511 258522 259099 259074 258282
56360 258282 256860 255660 255307 255179 254352 253044 252095 251618 251286 251298 251752 251767 250645 249342 249324 250463 251528
56343 251528 252226 253135 254055 254178 253642 253300 253131 252497 251819 252237 253568 254284 253784 253148 253294 253742 253704 253316 253306
56324 253306 254254 256372 259296 262024 263710 264452 264845 265158 265636 266907 269138 271358 272669 273549 274894 276479
56308 276479 277630 278785 280874 283653 286117 288268 290971 294298 297422 300039 302614 305396 308268 311333
56294 311333 314612 317590 320066 322806 326240 329365 331251 332727 335033 337696 339556 341018 343300 346136
56280 346136 348338 350170 352992 356836 360498 363799 367604 371690 374789 376827 379039 381711 383891 385546
56266 385546 388027 392004 396708 401452 406254 410870 414960 419283 424887 431092 436207 440287 445113 451316
56252 451316 457643 463379 469288 475634 481422 486328 491504 497700 504288 510797 517751 525346 532861 539935
56238 539935 546966 553865 559938 565332 570948 576656 581318 584884 588594 592776 596385 599220 602615 607210
56224 607210 611968 616169 620619 626060 632030 638165 645133 653513 663034 673468 684908 696804 708276
56211 708276 719815 733064 748509 765003 781918 799991 819645 840318 862052 885917 912285
56200 912285 940357 969922 1001816 1036208 1072358 1110660 1152972 1200181 1251258 1305364 1363058
56189 1363058 1424821 1490245 1559438 1633344 1711952 1793901 1878410 1965653 2054649 2142900 2228810
56178 2228810 2312373 2392667 2466790 2532189 2588059 2633645 2667351 2688542 2698266 2697319 2685712 2664833
56166 2664833 2637806 2606506 2570404 2529456 2485812 2441343 2395708 2348321 2300149 2251982 2202911
56155 2202911 2152060 2100105 2047694 1994157 1939143 1883763 1828846 1773868 1718778 1664965 1613181
56144 1613181 1562519 1512679 1465190 1421026 1379130 1338738 1301043 1266974 1235416 1205332 1177601
56133 1177601 1153104 1130958 1110338 1092076 1076635 1062410 1047971 1034249 1022797 1013525 1005834 1000205
56121 1000205 996882 994680 992754 991896 992590 993597 994049 995005 997379 1000318 1003277 1007557 1013946 1020902 1027023
56106 1027023 1033334 1041289 1050498 1060349 1071744 1085203 1099272 1112902 1127360 1143764 1160848 1177407
56094 1177407 1194718 1214104 1234082 1252501 1269670 1286968 1304185 1320753 1337803 1356478 1375802
56083 1375802 1394643 1414062 1435396 1457796 1480201 1503939 1530797 1560185 1590837 1623716 1660761
56072 1660761 1702424 1748946 1802262 1863923 1932743 2007169 2088385 2178343 2276180 2379114 2485134
56061 2485134 2591947 2694996 2789730 2875140 2952843 3024222 3090660 3154571 3216960 3274907 3323710
56050 3323710 3360192 3382239 3387870 3377913 3357688 3332738 3304037 3269562 3228310 3179850 3122233 3054045
56038 3054045 2977298 2895552 2810906 2725532 2643903 2569996 2503785 2443485 2389512 2343338 2304507
56027 2304507 2271906 2245969 2226502 2210557 2195749 2183485 2175606 2170289 2164862 2160226 2158598 2159158 2159977
56014 2159977 2162060 2167333 2174693 2182098 2190502 2201621 2214030 2225738 2238437 2254822 2273854 2293085
56002 2293085 2313443 2337125 2362964 2388609 2415120 2444649 2475813 2506306 2537779 2572971 2610240
55991 2610240 2646296 2682145 2720848 2761569 2801555 2841954 2885752 2931879 2977311 3023245 3073100
55980 3073100 3126091 3178868 3231935 3288342 3347618 3407141 3467862 3532517 3599995 3667775 3737999
55969 3737999 3814431 3895378 3976458 4058431 4145110 4235516 4325665 4416490 4512322 4612956 4714799
55958 4714799 4818355 4926854 5039217 5152443 5269308 5395380 5529966 5668409 5811502
55949 5811502 5963848 6124861 6290863 6464439 6651879 6852723 7061766 7279973 7512999
55940 7512999 7760163 8015679 8279883 8558492 8851912 9156525 9475467 9816189 10178026
55931 10178026 10553964 10943895 11354028 11784537 12231100 12697823 13195025 13724821 14282563
55922 14282563 14871246 15499747 16168259 16871709 17616965 18420243 19288325 20219299 21219994
55913 21219994 22303342 23469757 24712086 26038917 27472090 29022557 30691964 32496547
55905 32496547 34463403 36604678 38925039 41455373 44248829 47344988 50774497 54601601
55897 54601601 58926750 63852390 69496422 76041632 83715265 92711405 103188634 115337394
55889 115337394 129364788 145413759 163597088 184025856 206386230 229092158 248945662
55882 248945662 262158846 266226623 261099409 248773832 231955781 213003985 193602812
55875 193602812 174823216 157240852 141093250 126464467 113375386 101766868 91503026
55868 91503026 82435456 74438254 67384443 61140796 55603875 50708538 46390682 42569920
55860 42569920 39173796 36148061 33434894 30968288 28700385 26610510 24682469 22894362
55852 22894362 21235325 19709313 18313990 17033247 15855107 14778334 13795827 12889144
55844 12889144 12045639 11265477 10546607 9877964 9252594 8672820 8137131 7635534 7162884
55835 7162884 6723856 6319731 5942456 5586395 5254216 4946699 4658057 4385756 4134083
55826 4134083 3903639 3687713 3483218 3295054 3125519 2969213 2822558 2688790 2569302
55817 2569302 2459160 2355410 2261111 2177122 2098407 2022425 1952966 1891727 1834141 1777490 1725324
55806 1725324 1679822 1637256 1595037 1556047 1521952 1489184 1455452 1423628 1395356 1367193 1336767
55795 1336767 1306601 1278481 1250278 1221662 1196585 1176540 1157495 1137071 1118546 1103968 1089288
55784 1089288 1070404 1048507 1025571 1000113 971584 943779 919544 896640 872796 850425 832342
55773 832342 817029 802014 788140 776859 766951 757323 749570 744622 740224 734547 728805 723697 716963
55760 716963 707199 696438 686299 675179 661776 647724 634183 619562 603216 587559 573882 559870
55748 559870 544058 528959 516825 505977 494432 483721 475887 469798 463544 457684 453229 449168 444658
55735 444658 441020 439077 437233 434501 432577 432600 432798 431635 430352 430051 429333 427177 425133 424154 422245 417799
55719 417799 412363 407678 402896 397202 392148 388792 385475 381026 377219 375387 373601 370009 365909 362431
55705 362431 357184 347722 335911 325339 316394 307141 297222 287716 278720 270027 262799 257983 254438 250782
55691 250782 247394 244603 240972 235666 230432 226866 223769 219620 215481 212870 210845 207939 205024 203449
55677 203449 202103 199141 195109 191708 188954 186085 183770 182831 182181 180466 178445 177395 176600 174701 172097
55662 172097 169740 167036 163230 159407 156769 154423 151119 147669 145282 143067 139693 136121 134139 133414
55648 133414 132448 131278 130774 130464 129527 128892 129955 132093 133627 134299 134716 134431 132799 130778 129816 129819 130031
55631 130031 130761 132377 133854 134324 134763 136237 137867 138628 139660 142474 146273 149436 152382 156494 161283
55616 161283 165116 167759 169873 171007 170505 169435 169226 169267 168183 166523 165812 165808 165114 163750 162763 162051 160917
55599 160917 160065 160648 161966 162395 161996 162017 162471 162504 162488 163486 165149 166344 167268 168764 170241 170584 170526 171689
55581 171689 173701 174617 173874 172650 171616 170551 169792 169829 169706 167958 164936 162153 159643 156071 151179 146013
55565 146013 140935 135421 129718 124707 120260 115588 111029 107610 105055 102009 98106 94153 90594 87393
55551 87393 85013 83805 82965 81720 80856 81305 82034 81366 79573 78037 76654 74435 71967 70753 70585 70127
55535 70127 69626 70401 71988 72589 72241 72739 74289 75048 74385 73910 74584 75297 75031 74256 73481 72443 71436 71467
55517 71467 72490 73223 73302 73856 75446 77161 78248 78967 79469 79489 79544 80792 83341 86235 89219 92868 96961
55500 96961 100677 104510 109895 116652 122906 127940 132903 138107 141842 142821 141851 140110 137581 134188 130780
55485 130780 127860 124669 120505 115726 110689 105039 98814 92992 88168 83816 79565 75964 73353 71134
55471 71134 68886 67146 66466 66635 67260 68149 68773 68482 67561 67035 67146 67186 66942 66985 67305 67067 66146 65524 65727
55452 65727 66137 66232 66246 66212 65653 64646 63913 63481 62517 60867 59456 58766 58204 57369 56651 56066 54792 52420
55434 52420 49575 46885 44388 42178 40453 38744 36380 33861 32421 32033 31348 29830 28371 27441 26298
55419 26298 24566 22983 22002 21140 20287 20151 20733 20866 20019 19097 18773 18446 17645 17060 17255 17597 17373 16847
55401 16847 16448 15933 15072 14164 13346 12442 11913 12663 14412 15576 15309 14361 13453 12313 10927 10161 10317 10496
55383 10496 10279 10633 12236 14217 15482 16004 15988 15141 13761 13154 13879 14790 14820 14469 14505 14490 13795 12886 12354
55364 12354 11815 11040 11067 12834 15534 17615 18639 18993 18667 17637 16765 16997 18116 19311 20445 21674
55348 21674 22505 22392 21839 21811 22345 22696 22616 22637 23244 24360 25491 26070 26019 26111 27112 28435 28589 27224 25691
55329 25691 25085 24870 24021 22450 20590 18623 16868 15920 15651 15077 13986 13635 14995 17278 19087 20008
55313 20008 20282 20002 19632 20234 22068 23808 24199 23587 22832 21771 19973 18113 17232 17270 17518 17883 18534 18897
55295 18897 18228 16730 15086 13377 11527 10250 10418 11765 13205 14116 14532 14457 13860 13044 12364 11922 11937
55278 11937 12752 13987 14553 14091 13496 13356 12935 11576 10050 9435 9616 9973 10612 11699 12413 11910 10705
55261 10705 9910 9743 9868 10507 11913 13409 14240 14845 16044 17498 18190 17935 17231 16156 14714 13755 14177
55244 14177 15444 16130 15680 14616 13371 12061 11049 10640 10486 10263 10451 11464 12620 13121 13427 14314 15168
55227 15168 14756 13314 12255 11973 11511 10437 9531 9381 9586 9693 9930 10694 12124 14206 16577 18299 18604
55210 18604 17766 16622 15530 14507 13861 13731 13494 12649 11808 11709 11869 11464 10963 11296 11896 11319 9698 8796
55192 8796 9474 10738 11591 12222 12849 12871 11914 10615 9722 9302 9265 9757 10569 11038 10961 10820 10820 10561 10004 9835
55172 9835 10388 10992 10890 10186 9458 8997 8845 9089 9724 10528 11271 11789 11886 11567 11261 11323 11435 11097 10572 10713
55152 10713 11888 13704 15639 17304 18249 18307 18072 18309 18912 19193 19084 19232 19883 20496 20591 20255 19723 19119
55134 19119 18674 18569 18559 18293 17949 17948 18205 18349 18497 19020 19679 19782 19205 18496 18028 17769 17736 17934 17966 17479 16864
55113 16864 16735 16935 16910 16831 17360 18421 19229 19463 19436 19189 18499 17798 17941 18904 19694 19714 19241 18516 17454 16444
55093 16444 16291 16953 17269 16406 14835 13592 13214 13546 13957 13711 12849 12608 14045 16392 17833 17853 17568 17708
55075 17708 17733 17265 16873 16802 16274 14865 13486 13051 13130 12898 12562 12834 13583 14075 14217 14642 15731 17225 18772
55056 18772 20246 21550 22540 23218 23900 25120 27294 30224 33096 35270 36853 38123 38749 38301 37239 36518
55040 36518 36296 35931 35217 34606 34160 33359 32235 31597 31755 31970 31760 31838 33092 35281 37339 38488 38615 38056
55022 38056 37440 37271 37342 37038 36361 36038 36409 36910 37022 36965 37079 37226 37311 37743 38844 40308 41666 42817 43699
55003 43699 43988 43630 43195 43287 43921 44818 45812 46661 46902 46361 45512 44988 44988 45316 45649 45621 45056 44273 43815 43839 44209
54982 44209 45079 46743 48853 50488 51148 51099 50687 50020 49314 48730 47822 46052 44047 43321 44345 45878 46663
54965 46663 46875 47302 47962 48319 48262 48124 48024 47758 47044 45626 43614 41948 41885 43602 45870 47471 48392 49327
54947 49327 50653 52304 54043 55390 55832 55465 54916 54330 53156 51309 49766 49421 49961 50468 50647 50851 51310
54930 51310 51919 52479 52723 52432 51798 51339 51266 51338 51472 51876 52395 52460 51956 51432 51191 50917 50520 50489 50925 51086
54910 51086 50440 49508 49077 49248 49811 50904 52654 54662 56391 57624 58287 58499 59022 60764 63359 65230
54894 65230 65642 65707 66630 68007 68859 69434 70767 73075 75791 78748 82156 85677 88656 91207 94133 97831
54878 97831 101985 106291 110730 115204 119594 124171 129346 135098 141088 147156 153116 158176 161137 161329 159087
54863 159087 155372 151055 146323 140648 133586 125698 118219 111781 106068 100831 96392 92787 89327 85585
54849 85585 82049 79211 76762 74345 72379 71373 71091 71157 71864 73494 75431 76886 78090 79903 82597
54834 82597 85790 89222 92842 96516 100438 105468 112222 120096 127858 134855 140946 145712 148569 149336 147949
54819 147949 143975 137316 129078 120878 113440 106528 99931 93734 87887 82296 77203 72835 68969 65436
54805 65436 62638 60884 59625 58159 56649 55661 55134 54706 54616 55232 56030 56104 55528 55183 55373 55594 55562 55488 55396
54786 55396 55087 54771 54880 55292 55531 55586 55713 55645 54873 53606 52502 51583 50349 48855 47643 46655 45324 43775
54768 43775 42865 42843 42973 42702 42262 41895 41438 40998 41203 42366 44035 45595 46731 47161 46673 45655 44951 44991
54750 44991 45589 46559 47841 48985 49377 49131 48994 49284 49691 50169 51151 52601 53821 54503 55210 56465 58130
54733 58130 60004 62231 64733 67035 69172 72006 76049 80560 84392 87342 90184 93749 98382 103957
54719 103957 110023 116298 123229 131641 141511 151476 159867 165882 169504 170867 170194 168005 164853 160920
54705 160920 156221 151050 145978 141491 137828 135060 133164 132045 131535 131315 131008 130594 130604 131593 133417 135348
54689 135348 136826 137856 138802 140183 142585 146381 151446 157368 163814 170487 177018 183245 189289 195025
54675 195025 199887 203756 207449 211552 215123 216596 215764 213799 211280 207361 201155 192924 183477 173301
54661 173301 162877 153094 144588 137054 129809 122814 116689 111856 108023 104462 100675 96845 93557 90909
54647 90909 88141 84535 80529 77364 75660 74896 74322 73815 73654 73938 74478 74976 75199 75150 75030 74865 74368 73481
54629 73481 72718 72532 72677 72710 72708 72837 72701 71953 71216 71406 72365 73153 73545 74098 74816 74985 74508 74241 74683 75436
54609 75436 76315 77886 80422 83284 85924 88634 91769 95101 98474 102251 106452 110169 112603 114051 115298
54594 115298 116629 118050 119849 122168 124507 126328 127828 129513 131345 132904 134131 135377 136978 139254
54580 139254 142708 147729 154143 161302 168526 175410 182039 188992 196748 204967 212747 219620 225733 230919
54566 230919 234250 234809 232486 227850 221715 214956 208144 201195 193848 186460 179581 172913 165697 158316
54552 158316 152229 147854 143752 138661 133253 128912 125730 122880 120285 118562 117617 116503 114730 112799
54538 112799 111303 110170 108940 107293 105184 102808 100430 98111 95720 93325 91255 89634 88230 86977
54524 86977 86147 85678 84843 83042 80543 78102 76161 74713 73495 72044 70042 67850 66231 65354 64750 64475
54508 64475 65347 67479 69531 70230 69980 70008 70529 70691 69928 68393 66327 63934 61817 60704 60705 61380 62402
54491 62402 63637 64744 65372 65672 66127 66988 68229 69798 71465 72731 73415 74025 75054 76244 77132 77989
54475 77989 79497 81743 84200 86541 88827 91084 93397 96232 99964 104090 107642 110429 113298 117023
54461 117023 121435 125790 129523 132435 134398 135109 134162 131491 127755 123957 120498 116918 112813 108570 104867
54446 104867 101851 99156 96393 93277 89697 86119 83500 82343 82130 82088 82088 82346 82716 82822 82523 81737 80230
54429 80230 78107 76095 74771 73970 73388 73228 73603 74000 74127 74671 76295 78369 79674 79953 79813 79563 79272
54412 79272 79543 80881 82461 82896 82265 82049 82900 83817 83944 83861 84454 85517 86292 86656 87035 87619 88335 89241
54394 89241 90416 91706 92923 94052 95067 95865 96545 97385 98344 98937 98804 98073 97067 96017 95164 94716 94541
54377 94541 94234 93632 92950 92328 91621 90693 89600 88424 87218 86131 85273 84492 83625 82892 82582 82488 82181 81755
54359 81755 81708 82081 82299 82002 81470 81140 81192 81694 82571 83295 83228 82540 82260 83091 84557 85653 86034 86282 87214
54340 87214 89077 91345 93217 94439 95486 96803 98175 99297 100563 102648 105466 108246 110578 112667
54326 112667 114508 115617 115796 115524 115320 115240 115174 115065 114609 113286 110972 108133 105287 102712 100668 99313
54310 99313 98287 96984 95451 94359 93912 93492 92651 91771 91291 90931 90208 89231 88481 88157 88156 88294 88201 87392 85859
54291 85859 84224 82938 81798 80615 79867 80124 81238 82658 84226 86041 87836 89176 90154 91271 92624
54276 92624 93829 94789 95964 97602 99140 99767 99431 98960 99135 99843 100278 99834 98591 96947 95100 93101
54260 93101 91115 89258 87359 85311 83522 82490 81918 80890 79077 77221 76139 75696 75129 73985 72329
54245 72329 70349 68228 66314 64980 64254 63762 63027 61751 59997 58238 57098 56821 57052 57202 56928 56199
54229 56199 55110 53801 52449 51242 50325 49761 49438 49055 48342 47293 46105 45006 44258 44042 44078 43652 42476
54212 42476 41297 41075 41638 41819 40986 39800 39277 39696 40745 42143 43676 44956 45679 45980 46244 46639 47049
54195 47049 47322 47440 47566 48009 48982 50376 51905 53457 55045 56459 57318 57488 57137 56400 55365 54363 53777
54178 53777 53511 53109 52520 52267 52673 53391 53919 54186 54418 54790 55398 56220 56919 57063 56710 56431 56582 56897 56990
54159 56990 56848 56686 56651 56822 57152 57338 57187 57128 57800 59045 59967 60135 60030 60029 59756 58859 57693 56627 55382
54140 55382 53709 52153 51377 51131 50691 50028 49809 50430 51694 53235 54623 55214 54609 53266 52098 51473 51088
54123 51088 50702 50385 50155 49947 49966 50446 51020 50870 49727 48242 47175 46592 46016 45052 43711 42445 41979 42790
54105 42790 44492 45981 46406 45907 45250 44935 44897 44926 45085 45579 46445 47549 48780 49971 50598 50048 48442 46905
54087 46905 46504 47080 47608 47593 47494 47731 48019 47987 47829 47873 47957 47740 47288 46867 46379 45478 44160 42856 42068 42098
54067 42098 42933 44141 45056 45324 45081 44498 43556 42448 41664 41277 40611 39192 37576 36656 36439 36255 35906 35895
54049 35895 36547 37609 38779 39983 41029 41579 41614 41486 41308 40764 39712 38595 37969 37917 38189 38699 39613 40993
54031 40993 42506 43525 43627 43091 42775 43292 44375 45313 45884 46532 47627 48920 49827 49998 49493 48642 47911
54014 47911 47779 48485 49800 51068 51681 51637 51531 51768 51929 51315 50120 49534 50432 52398 54354 55661 56252
53997 56252 56162 55606 55222 55565 56389 57001 57239 57524 58040 58509 58857 59535 60932 62942 65311 67961 70732 73158
53979 73158 74848 75897 76760 77850 79337 81082 82675 83788 84597 85664 87344 89540 92072 94912 97901
53964 97901 100653 103039 105474 108390 111594 114545 117185 120055 123575 127521 131408 135071 138559 141655
53950 141655 143942 145423 146703 148310 150101 151639 152902 154156 155258 155689 155384 154980 154949 154915 154222 152815
53934 152815 151145 149454 147619 145552 143322 140929 138313 135578 132879 130200 127577 125402 124093 123441
53920 123441 122685 121278 119248 116794 114005 111159 108866 107513 106731 105727 104152 102436 101265 100873 100932
53905 100932 101054 101227 101620 102127 102348 102121 101833 101943 102319 102294 101413 100030 99084 99313 100625 102173 103089 103144
53887 103144 102719 102333 102360 103031 104286 105580 106254 106247 106172 106586 107547 108974 110966 113505 116224 118802 121288
53870 121288 123768 126116 128408 131200 134926 139260 143496 147326 150811 153891 156448 158642 160673 162351
53856 162351 163363 163853 164269 164804 165476 166574 168395 170654 172765 174728 177097 180004 182862 185229 187449
53841 187449 190150 193565 197583 202067 206821 211477 215723 219521 223014 226305 229296 231566 232504 231923 230501
53826 230501 229266 228624 228191 227439 225988 223378 219284 214208 209365 205453 202002 198352 194742 191879 189659
53811 189659 187083 183447 179067 174622 170247 165655 160916 156565 152867 149356 145445 141262 137428 134080
53797 134080 130651 126835 123239 120606 118710 116589 113781 110797 108332 106530 105113 103833 102553 101209
53783 101209 99921 98970 98459 98130 97628 96822 95789 94639 93490 92520 91912 91746 91963 92451 93095 93695 93827
53766 93827 93033 91382 89745 89074 89368 89737 89554 89063 88636 88102 87329 86957 87809 89727 91650 92800 93316
53749 93316 93765 94536 95643 96734 97342 97528 98118 99754 101869 103272 103709 104168 105510 107491 109420 111153
53733 111153 113060 115365 117958 120681 123490 126419 129526 132805 136158 139588 143296 147350 151363 154807
53719 154807 157560 159869 161912 163799 165838 168311 171097 173888 176668 179401 181472 182161 181702 181162 181127
53704 181127 181170 180728 179743 178185 175763 172579 169464 167030 164841 162021 158421 154734 151683 149425 147618
53689 147618 145697 143291 140542 137896 135562 133489 131886 131128 130981 130506 129179 127615 126670 126224 125374 123624
53673 123624 121332 119114 117284 115888 114931 114483 114619 115199 115714 115689 115289 115179 115551 115792 115390 114820 115025 116270
53655 116270 117952 119404 120460 121362 122427 123788 125191 126152 126556 126933 127849 129193 130389 131169 131820 132690
53639 132690 133874 135366 137184 139194 141037 142436 143517 144789 146758 149489 152476 154965 156506 157264
53625 157264 157908 159240 161729 165131 168586 171294 173085 174221 174897 175304 175973 177420 179385 180966 181762
53610 181762 182407 183667 185471 187123 188174 188782 189452 190694 192631 194719 196121 196607 196749 197106 197644 198216
53594 198216 198998 199964 200437 199920 199036 198845 199340 199435 198549 197420 197013 197271 197506 197565 197908 198660 199215 199002 198237
53575 198237 197646 197657 198180 199019 200078 201170 201971 202388 202716 203241 203971 204907 206320 208423 210999 213662 216346
53558 216346 219142 221789 223755 224825 225300 225671 226356 227635 229530 231910 234860 238666 243037 246807 249098
53543 249098 250487 252277 254817 257432 259916 263022 267214 271900 276340 280582 284985 289417 293464 297069
53529 297069 300584 304425 308829 313498 317492 320101 321956 324535 328387 332632 336434 340021 343721 346930
53515 346930 348846 349611 350041 350772 352239 354821 358199 361138 362761 363643 364899 366549 367677 367896 367757 367827
53499 367827 368176 368744 369520 370290 370744 370860 370820 370661 370440 370573 371570 373457 375720 377697 378854 379063 378931 379449
53481 379449 380934 382723 384258 385929 388295 391054 393450 395286 396899 398520 400317 402635 405521 408416
53467 408416 411005 413928 417902 422609 427319 432144 437694 443817 449791 455648 462235 469986 478586 487792
53453 487792 497674 508063 518663 529715 541697 554399 567253 580518 595064 610903 627017 642868
53441 642868 659053 676182 694080 712449 731317 750425 769159 787671 807228 828815 852028
53430 852028 875944 900418 925840 952110 978544 1004619 1030339 1056009 1081836 1107559 1132444
53419 1132444 1156077 1179150 1202851 1227419 1251973 1275910 1299633 1323622 1347684 1371606 1395753
53408 1395753 1420382 1444933 1468651 1491410 1513308 1533898 1552519 1569124 1584240 1598265 1611255
53397 1611255 1623167 1633912 1643387 1651770 1659550 1666962 1673599 1678803 1682151 1683383 1682298 1679027 1674015
53384 1674015 1667451 1659100 1648952 1637525 1625203 1611801 1597135 1581455 1564857 1546882 1527307 1506829
53372 1506829 1486280 1465535 1443958 1421624 1399362 1377720 1356570 1335698 1315172 1295155 1275912
53361 1275912 1258005 1241939 1227568 1214230 1201487 1189430 1178319 1168283 1159346 1151431 1144442 1138648
53349 1138648 1134805 1133580 1134992 1138694 1144491 1152152 1161008 1170489 1181000 1193676 1209197 1227291 1247363
53336 1247363 1268999 1291764 1315115 1338919 1363732 1390277 1418810 1449114 1480900 1514092 1548871
53325 1548871 1585471 1623847 1663633 1704686 1747469 1792516 1839593 1887860 1936871 1986821 2037774
53314 2037774 2089281 2141120 2193841 2248006 2303205 2358384 2412966 2467095 2520794 2573407 2624019
53303 2624019 2672043 2717216 2759375 2798484 2834689 2868027 2898216 2924962 2948376 2968799 2986199
53292 2986199 3000077 3010050 3016259 3018981 3018024 3012761 3002726 2988005 2969137 2946762 2921280 2892563
53280 2892563 2859946 2822730 2780823 2734862 2685777 2634376 2581273 2526970 2471901 2416549 2361517
53269 2361517 2307308 2253924 2200882 2147760 2094644 2042011 1990326 1939866 1890843 1843549 1798328
53258 1798328 1755350 1714336 1674555 1635316 1596566 1559014 1523602 1490899 1460912 1433329 1407863
53247 1407863 1384435 1363027 1343404 1325134 1307897 1291647 1276404 1262250 1249647 1239397 1231807
53236 1231807 1226202 1221702 1218237 1216190 1215278 1214641 1214126 1214621 1216748 1219977 1223593 1227946 1234002 1241970 1251169
53221 1251169 1261176 1272422 1285539 1300636 1317467 1335925 1356051 1377717 1400587 1424318 1448598
53210 1448598 1472955 1496746 1519466 1541071 1561924 1582448 1602912 1623401 1643606 1662534 1678822
53199 1678822 1691836 1702301 1711461 1719688 1726313 1730772 1733388 1734945 1735872 1735974 1734568 1730761 1724078 1715017
53185 1715017 1704537 1692738 1678500 1660859 1640345 1618429 1595868 1572136 1546416 1518572 1489001
53174 1489001 1458030 1425802 1392638 1359228 1326360 1294513 1263778 1234144 1205690 1178396 1151889
53163 1151889 1125715 1099851 1074720 1050533 1026923 1003313 979401 955151 930608 906080 882313
53152 882313 860060 839407 819765 800627 782128 764695 748306 732429 716816 702070 688991
53141 688991 677417 666173 654329 642023 629737 617293 604183 590603 577414 565178 553912
53130 553912 543700 534696 526315 517294 506984 496032 485372 475175 465275 455972 447581 439483 430464
53117 430464 420078 409102 398569 388743 379191 369482 359628 350025 341140 333200 326152 319872 314265
53104 314265 309083 303861 298282 292529 287071 282074 277221 272166 267002 262095 257473 252701 247620 242991
53090 242991 239881 238299 236996 234901 232231 229737 227437 224808 221779 218663 215377 211736 208436 206614
53076 206614 206211 205782 204281 202132 200108 198118 195737 193140 190767 188637 186701 185348 184833 184579 183785
53061 183785 182479 181314 180536 179719 178419 176661 174944 174010 174310 175380 176138 176081 175723 175546 175231 174464 173775
53044 173775 173758 173988 173588 172481 171188 169750 167894 166116 165494 166190 166983 166626 165065 163112 161464 160274
53028 160274 159276 158095 156676 155464 154921 154967 155159 155309 155521 155783 155982 156268 157032 158528 160745 163449 166038
53011 166038 167656 167899 167265 166506 165836 165145 164498 163807 162420 159882 156856 154518 153103 151810 150024 147817
52995 147817 145322 142537 139821 137747 136247 134649 132779 131269 130480 129794 128380 126143 123588 121198 119255
52980 119255 117871 116871 115893 114797 113763 112927 112221 111573 110905 110040 109030 108443 108695 109181 108744 107105 105158
52963 105158 103750 102892 102353 102244 102566 102798 102375 101206 99417 97073 94481 92300 91000 90499 90533 90917 91211
52946 91211 90765 89527 88375 88180 88836 89608 90096 90465 90933 91506 92099 92607 92924 93018 92886 92404 91500 90531 90138
52927 90138 90569 91451 92354 93214 94058 94704 94982 94902 94436 93470 92191 91200 90989 91559 92649 93961 95031 95344
52909 95344 94878 94227 93982 94281 95053 96249 97576 98438 98532 98252 98263 98874 99909 100798 100734 99263 97001 95317
52891 95317 95061 95974 97466 99299 101249 102791 103724 104662 106319 108690 111345 114088 116754 118763 119602 119659
52875 119659 119969 121220 123370 126105 129213 132582 136188 139994 143623 146403 148070 149157 150267 151257 151587
52860 151587 151262 150894 150935 151274 151539 151453 150940 150178 149429 148612 147406 145940 144890 144384 143325 140614 136785
52843 136785 133627 132217 132058 132102 131842 131165 129924 128101 126027 124114 122607 121723 121688 122416 123410 124167 124492
52826 124492 124377 123928 123513 123716 124844 126600 128352 129651 130475 131115 131847 132588 132951 132760 132379 132272 132467
52809 132467 132746 133199 134032 134907 135074 134278 133104 132215 131732 131525 131516 131394 130584 129077 127926 128256 129925 131769
52791 131769 133078 134154 135334 136202 136242 135785 135661 136095 136487 136313 135750 135249 134905 134561 134273 134335 134937 136021
52773 136021 137398 138745 139593 139688 139385 139446 140257 141369 141914 141416 140232 139274 139240 139955 140506 140168 139180 138424
52755 138424 138461 139159 140137 141156 142004 142438 142487 142535 142961 143902 145499 147925 150823 153035 153455 152205 150676
52738 150676 150253 151044 151881 151434 149360 146428 143594 141074 138454 135535 132723 130538 129073 128052 127130
52723 127130 125940 124163 121829 119407 117333 115526 113542 111138 108574 106440 105216 104856 104750 104232 103160
52708 103160 101798 100241 98363 96365 94857 94103 93580 92624 91183 89639 88230 87036 86266 86040 85932 85183
52692 85183 83408 80943 78589 77123 76770 76877 76351 74799 73023 72029 71835 71729 71476 71574 72247 72880 72828 72337
52674 72337 72168 72436 72317 71023 68868 67087 66523 66703 66407 65082 63372 62205 61797 61768 61903 62277 62765
52657 62765 62893 62362 61503 61068 61544 62653 63465 63130 61608 59641 58032 57116 56960 57641 59071 60737 61950
52640 61950 62330 61926 61036 60038 59145 58135 56563 54507 52851 52437 53113 53954 54315 54309 54345 54571 54791 54705 54222
52621 54222 53727 53899 55022 56608 57974 58999 60040 61247 62427 63552 64973 66989 69484 72081 74468
52606 74468 76509 78206 79607 80645 81124 80993 80576 80373 80683 81514 82733 84109 85367 86357 87105 87573 87551
52589 87551 86967 86063 85061 83901 82572 81400 80613 79834 78538 76928 75884 75964 76791 77462 77240 75904 73816
52572 73816 71851 70909 71228 72163 72641 71898 70027 68061 67271 68056 69584 70762 71366 71903 72584 72962 72574
52555 72574 71438 69817 67939 66141 64885 64390 64370 64395 64392 64648 65364 66308 66960 67063 67024 67591 69076 71053
52537 71053 72857 74117 74690 74487 73697 72911 72611 72684 72780 72931 73403 74103 74602 74720 74702 74800 75027 75257 75289 74901
52517 74901 74127 73444 73411 74201 75655 77534 79458 80890 81662 82242 83058 83757 83751 83300 83388 84564 86438 88322
52499 88322 89770 90534 90607 90464 90747 91600 92702 93907 95268 96477 96969 96744 96506 96809 97628 98901 100830
52482 100830 103282 105458 106547 106467 105692 104747 104022 103665 103452 103077 102704 102785 103274 103620 103767 104479 106271 108548
52464 108548 110292 111215 111699 111938 111685 110728 109253 107805 107089 107505 108643 109483 109436 109005 109183 110396 112151
52447 112151 113474 113561 112406 111030 110734 111800 113229 113967 113937 113583 113003 112068 111015 110210 109560 108786 108100
52430 108100 107960 108204 108148 107620 107266 107608 108329 108849 109195 109883 111159 112738 114152 115067 115325 115074 114892 115410
52412 115410 116642 117947 118859 119646 120694 121657 121857 121497 121682 122955 124473 125171 125189 125428 126130 126767 127154
52395 127154 127725 128638 129427 129744 129747 129541 128964 128205 127901 128249 128622 128521 128257 128200 127964 127080 126008 125719 126499
52376 126499 127803 129150 130439 131449 131737 131231 130461 130060 130330 131341 132991 134792 135916 135825 134794 133647
52360 133647 132994 132768 132523 132093 131824 132172 133195 134594 136092 137515 138638 139245 139335 138996 138151 136828 135583
52343 135583 135178 135711 136519 137039 137304 137504 137565 137425 137235 137043 136688 136282 136291 136835 137336 137239 136690 136201 136090 136550
52323 136550 137748 139411 140804 141640 142519 143924 145264 145600 144952 144169 143817 144003 144952 146829 149045 150617
52307 150617 151374 152050 153103 154213 155164 156407 158332 160561 162496 164186 166128 168473 170797 172587 173687
52292 173687 174384 175265 176869 179233 181824 184032 185707 187197 188945 191080 193280 194970 195782 195876 195820 196151
52276 196151 197073 198490 200264 202436 205189 208479 211766 214448 216662 219300 222946 227019 230269 231964
52262 231964 232331 232063 231832 232172 233380 235337 237637 239935 242122 244290 246669 249505 252774 256192 259610
52247 259610 263226 267201 271377 275684 280438 285805 291257 296209 301040 306792 313802 321210 328041 334282
52233 334282 340644 347822 356213 365986 376891 388162 399013 409277 419400 429821 440511 451122
52221 451122 461497 471912 482753 494044 505475 516907 528579 540623 552672 564214 575113
52210 575113 585475 595217 604203 612661 620955 628922 635972 641921 647273 652417 657053 660754 663784 666856
52196 666856 670112 672774 673978 673776 673149 673059 673640 674302 674483 674129 673493 672804 672230 671925 671844 671669 671170 670608
52178 670608 670585 671525 673401 675885 678645 681637 685258 690039 695980 702344 708369 714050 719970 726539 733713
52163 733713 741339 749322 757370 764973 771814 777998 783761 789087 793744 797537 800413 802400 803596 804241
52149 804241 804694 805121 805174 804199 802028 799358 796945 794436 790567 784667 777513 770409 763901 757695 751372
52134 751372 744661 737399 729832 722782 716949 712099 707383 702394 697512 693289 689849 686873 683825 680347
52120 680347 676671 673438 670835 668223 665078 661885 659466 657741 655925 653788 651874 650421 648940 647070
52106 647070 645142 643592 642409 641416 640547 639570 638050 635905 633574 631359 629072 626630 624476 622971 621778
52091 621778 620303 618479 616669 614994 613209 611201 609244 607676 606478 605186 603197 600297 596919 593759
52077 593759 591151 588972 587057 585354 583659 581659 579370 577166 575215 573272 571216 569379 567968 566511
52063 566511 564308 561257 557848 554428 550966 547580 544866 543337 542644 541737 539941 537690 535973 535179 534890
52048 534890 534767 535129 536382 538357 540618 543060 545778 548708 551968 556258 562140 569074 575887 582236 588893
52033 588893 596517 604912 613697 622945 632857 643388 654535 666481 679137 692066 705153 718765
52021 718765 732936 746974 760341 773340 786470 799603 812368 824820 837057 848596 858900
52010 858900 868258 877360 886019 893069 897656 900139 901621 903024 904653 906186 906912 906302 904513 902137 899486
51995 899486 896364 892483 887754 882205 876053 869910 864505 859963 855627 850877 845910 841507 838161 835695
51981 835695 833626 831587 829379 826942 824513 822737 822321 823464 825671 828188 830533 832616 834532 836442
51967 836442 838541 840980 843755 846746 849742 852418 854401 855575 856219 856706 857164 857508 857594 857179 855923 853707
51951 853707 850737 847072 842311 836197 829288 822505 816024 809162 801343 792673 783440 773547 762605 750321
51937 750321 736698 722179 707542 693280 679123 664592 649945 635942 622636 609102 594627
51926 594627 579556 564659 550179 535904 521677 507466 493246 479182 465638 452705 439991
51915 439991 427120 414135 401227 388475 376026 364143 352795 341603 330451 319742 309825 300627
51903 300627 292102 284520 277919 271723 265360 258907 252766 247088 241897 237362 233510 230001 226574 223382
51889 223382 220602 218108 215862 214092 212641 210707 207769 204314 201086 198069 194892 191728 189047 186817
51875 186817 184716 182825 181362 179938 177888 175233 172588 170269 168144 166188 164442 162597 160409 158356
51861 158356 157029 155994 154269 151906 150090 149438 149274 148941 148804 149303 149879 149654 148701 147878 147611 147501 146944
51844 146944 145690 143829 141620 139388 137392 135829 134946 134862 135180 135156 134439 133394 132558 132054 131739 131555 131445
51827 131445 131199 130740 130388 130517 131091 131754 132284 132674 132864 132727 132358 132167 132524 133338 134049 134118 133527 132763 132305
51808 132305 132265 132617 133469 134819 136216 137079 137378 137653 138367 139574 141216 143227 145232 146623 147275 147783 148624
51791 148624 149387 149252 148064 146482 145159 144253 143742 143691 143995 144221 144073 143806 143870 144265 144589 144693 144900 145501
51773 145501 146360 147235 148186 149352 150581 151630 152574 153615 154595 155182 155513 156086 156942 157466 157249 156707 156493
51756 156493 156726 157166 157833 158980 160631 162500 164240 165528 166070 165826 165103 164223 163301 162517 162230 162525 162974
51739 162974 163243 163611 164480 165643 166562 167129 167672 168419 169467 171109 173527 176214 178257 179283 179725 180197
51723 180197 181028 182379 184230 186168 187593 188317 188696 189170 189974 191169 192571 193692 194191 194366 194813 195689
51707 195689 196712 197752 198916 200171 201526 203483 206626 210662 214533 217625 220305 223214 226700 231045
51693 231045 236376 241937 246160 248022 247909 246822 245319 243714 242605 242410 242638 242373 241377 240135 238955
51678 238955 237623 236026 234561 233672 233269 232801 231794 230269 228723 227675 227153 226646 225697 224483 223650 223602
51662 223602 224037 224224 223682 222586 221551 221085 221295 222002 222871 223381 223078 222179 221569 221795 222289 222107 221287 220801
51644 220801 221124 221535 221145 220062 219097 218618 218117 216839 214663 212427 211343 211827 212934 213283 212615 212018 212558
51627 212558 214179 216105 217784 219111 220154 221161 222559 224503 226586 228353 229981 232132 235215 239074
51613 239074 243253 247235 250483 252494 252901 251463 248096 243108 237300 231617 226618 222307 218350 214388
51599 214388 210264 206140 202395 199354 197017 195005 192725 189817 186627 184039 182607 181947 181279 180370 179538
51584 179538 178883 178113 177185 176536 176413 176370 175773 174523 173108 172141 171968 172471 173083 173259 173009 172774 172777 172836 172808 172821
51564 172821 172952 173109 173302 173637 173940 173793 173127 172356 171783 171309 170880 170703 170805 170877 170829 170988 171468 171845 171876 172060
51544 172060 173001 174600 176302 177872 179449 181079 182659 184189 185756 187356 188998 190768 192633 194423
51530 194423 196198 198258 200563 202593 204093 205540 207461 209601 211238 212002 212006 211480 210687 209946 209367 208726
51514 208726 207898 207132 206642 206328 206217 206752 208168 210036 211795 213358 214711 215520 215734 216108 217318 218854
51498 218854 219600 219316 218768 218577 218759 219312 220419 221926 223342 224519 225732 227008 227941 228330 228432 228412 228022
51481 228022 227102 226011 225368 225509 226244 226908 226828 226050 225448 225704 226372 226473 225812 225086 224785 224730 224709 224828 225056
51462 225056 225057 224752 224489 224384 224000 223036 221933 221497 222156 223700 225415 226374 226002 224626 223150 222129 221462
51445 221462 220970 220684 220433 219751 218585 217598 217341 217474 217268 216695 216508 217288 218673 219685 219743 219370 219807 221746
51427 221746 224527 226873 228343 229643 231559 234020 236388 238178 239294 239963 240735 242189 244342 246617 248616
51412 248616 250601 252944 255477 257774 259770 261672 263445 264893 266183 267820 269990 272250 273990 274993
51398 274993 275431 275554 275580 275782 276409 277420 278400 278914 278933 278733 278378 277550 276048 274238 272711 271658 270807 269829
51380 269829 268483 266457 263521 259913 256243 252899 249810 246855 244179 241952 240071 238313 236627 235133
51366 235133 233900 232795 231576 230189 228999 228522 228776 229161 229246 229347 229905 230573 230578 229924 229472 229684 229912 229267
51348 229267 227708 225917 224478 223445 222422 220797 218179 214858 211580 208711 205957 203051 200263 197907
51334 197907 195762 193402 190833 188397 186195 183975 181450 178522 175331 172311 169994 168458 167170 165573
51320 165573 163632 161637 159790 158297 157460 157189 156678 155089 152520 149832 147596 145638 143590 141434 139402
51305 139402 137716 136545 135943 135677 135407 135087 134938 134932 134600 133622 132371 131561 131367 131177 130333 128964 127812 127305
51287 127305 127136 126897 126839 127536 128906 130099 130531 130647 131355 132991 135122 137102 138564 139558 140527 141971 143814
51270 143814 145270 145751 145743 146363 148070 150254 152144 153643 154955 155816 155508 153652 150726 147730 145378 143631
51254 143631 141991 140191 138452 137021 135686 134033 132105 130453 129482 128933 128156 126697 124554 122045 119584
51239 119584 117444 115573 113710 111710 109735 108072 106915 106336 106261 106343 106071 105268 104393 104139 104706 105689 106583
51222 106583 107233 107754 108331 109178 110409 111782 112770 113119 113163 113316 113449 113117 112326 111617 111333 111207 110928 110716
51204 110716 111001 111682 112091 111678 110474 108852 107099 105289 103441 101652 100058 98681 97386 96068 94889
51189 94889 94172 94077 94529 95421 96624 97721 98134 97792 97349 97384 97669 97593 97066 96525 96182 95877 95629 95719 96088 96202
51169 96202 95826 95427 95495 95863 96149 96517 97371 98420 98653 97517 95774 94902 95696 97683 99789 101381 102597
51152 102597 103828 105078 105885 105780 104783 103467 102528 102323 102797 103852 105583 108012 110696 112979 114621 115962
51136 115962 117397 118988 120615 122131 123247 123696 123759 124226 125462 126838 127547 127636 127787 128335 129041 129643 130033
51119 130033 130050 129678 129418 129814 130589 130820 130062 128765 127501 126329 125104 123880 122748 121652 120554 119522
51103 119522 118543 117545 116618 115891 115251 114580 114153 114235 114383 113865 112787 112008 111823 111612 111060 110789 111292 112038 112355
51084 112355 112468 112903 113405 113341 112848 112701 113182 113776 113969 113716 113154 112358 111481 110699 110004 109272 108450 107504 106386
51065 106386 105317 104725 104563 104069 102727 101172 100502 100873 101412 101472 101316 101531 102297 103428 104653 105665 106209
51048 106209 106384 106672 107563 109168 111148 112942 114160 114891 115512 116129 116504 116579 116662 116882 116930 116694 116656 117173 117809
51029 117809 118023 118098 118661 119604 120331 120903 121961 123477 124562 124821 125078 126328 128530 130878 132772 134062
51013 134062 134779 135126 135557 136400 137499 138409 138907 139133 139429 140110 141240 142552 143744 144905 146344 147981
50997 147981 149246 149705 149562 149448 149932 151246 153110 154678 155066 154222 153075 152597 152876 153245 153098 152373 151434
50980 151434 150737 150499 150541 150494 150223 149915 149731 149603 149550 149952 151302 153624 156229 158078 158510 157832 157172 157530
50962 157530 158914 160564 161937 163118 164269 165140 165445 165435 165777 166885 168600 170439 172011 173233 174338
50947 174338 175703 177561 179867 182358 184708 186680 188324 190033 192217 194803 197245 199161 200843 202974
50933 202974 205906 209388 212993 216642 220587 224937 229436 233839 238338 243372 248972 254640 260035 265568
50919 265568 272051 279891 288828 298342 308042 317702 327238 336760 346549 356934 368207 380515 393744
50906 393744 407678 422436 438609 456775 477036 499187 523130 548856 576194 604919 634988
50895 634988 666401 699000 732716 767813 804509 842476 881134 920289 959914 999343 1037165
50884 1037165 1072088 1103536 1131413 1155781 1176818 1194564 1208480 1217810 1222727 1224728 1225434 1225118 1222772
50871 1222772 1217517 1209737 1200812 1192028 1183818 1175946 1168154 1160337 1152089 1142541 1131009 1117611 1102834
50858 1102834 1086717 1068868 1049132 1027625 1004146 978192 949792 919868 889552 859476 829819
50847 829819 800578 771611 742842 714726 688147 663669 641182 620433 601483 584391 568895
50836 568895 554837 542569 532546 524617 518014 511932 505956 500090 494661 490091 486653 484531 483994 485101
50822 485101 487134 488827 489524 489826 490810 492930 495942 499604 503921 508831 513998 519024 523765 528554 534140
50807 534140 541150 549407 558053 566495 574994 584130 594074 604771 616555 630074 645531 662346 679635
50794 679635 697018 715000 734608 756565 780819 807064 835560 867050 901877 939812 980937
50783 980937 1026071 1075882 1130034 1187730 1248803 1313778 1383114 1456834 1534644 1615901 1699586
50772 1699586 1784765 1870850 1957027 2041685 2122993 2199813 2271370 2336087 2391495 2435581 2467859
50761 2467859 2489091 2500480 2503286 2498636 2487374 2470404 2449443 2427008 2405277 2385037 2366000 2347997
50749 2347997 2331531 2317189 2304716 2292757 2279419 2262972 2242062 2215514 2182359 2142303 2095980
50738 2095980 2044423 1988294 1927843 1863598 1796800 1729081 1661852 1596021 1532164 1470880 1412998
50727 1412998 1359382 1310448 1265978 1225558 1189107 1156875 1129055 1105660 1086681 1072044 1061345
50716 1061345 1053901 1049216 1047223 1047978 1051177 1056163 1062231 1068753 1074966 1079977 1083262 1085187 1086652 1088036
50702 1088036 1088696 1087776 1085265 1081843 1077821 1072794 1066349 1058616 1049863 1039994 1028745 1016080 1002203 987478
50688 987478 972565 958258 944925 932400 920584 909821 900480 892643 886526 882713 881544 882689 885735
50675 885735 890812 898145 907490 918689 932392 949471 969927 993091 1018731 1047254 1078900 1113529
50663 1113529 1151180 1192077 1236091 1282860 1332440 1385006 1439744 1494882 1549047 1601853 1652838
50652 1652838 1700668 1743929 1782101 1815128 1842455 1863007 1875833 1880411 1876750 1865729 1849104 1828704
50640 1828704 1805641 1780508 1754117 1727732 1702835 1680828 1662631 1648185 1636516 1626560 1617762 1609751
50628 1609751 1601827 1593040 1582450 1569054 1551874 1530576 1505740 1478112 1447911 1415264 1381028 1346639
50616 1346639 1313271 1281628 1252366 1226132 1203160 1183320 1166614 1153337 1143753 1137948 1136003 1137946
50604 1137946 1143586 1152725 1165552 1182526 1203940 1229861 1260321 1295037 1332945 1372509 1412605 1452740
50592 1452740 1492383 1530622 1566652 1600113 1630742 1658109 1682059 1703043 1721649 1738037 1752133
50581 1752133 1764089 1774162 1782352 1788661 1793688 1798554 1804142 1810657 1817910 1825771 1834322 1843916 1855171
50568 1855171 1868661 1884433 1902051 1921217 1942030 1964366 1987257 2009332 2029850 2048834 2066109
50557 2066109 2080666 2091330 2097842 2100874 2101091 2098645 2093611 2086460 2077827 2068074 2057420 2046406 2036059
50544 2036059 2027639 2022266 2020456 2021729 2024858 2028839 2033501 2038875 2044143 2047803 2048866 2047297 2043005 2034917
50530 2034917 2021528 2002048 1976554 1945255 1908197 1865747 1818870 1768696 1716081 1661779 1606774
50519 1606774 1552174 1498826 1447186 1397600 1350627 1306967 1266971 1230219 1195835 1163467 1133850
50508 1133850 1108117 1086581 1068434 1052637 1038813 1027222 1018233 1012019 1008504 1007355 1008137 1010639 1014953
50495 1014953 1021186 1029308 1039352 1051454 1065535 1081287 1098774 1118765 1142037 1168528 1197575 1228803
50483 1228803 1262304 1298061 1335778 1375362 1417028 1460660 1505405 1550130 1594060 1636907 1678741
50472 1678741 1719893 1760614 1800556 1838958 1875695 1911923 1949399 1989259 2031601 2075920 2121610
50461 2121610 2168280 2216099 2265861 2318507 2374608 2434452 2498338 2566305 2637668 2711296 2786447
50450 2786447 2862933 2940376 3017654 3093291 3166024 3234612 3297270 3351752 3396143 3429383 3450937
50439 3450937 3460141 3456219 3438967 3409215 3368413 3317924 3258949 3193071 3122483 3049622 2976812 2906350
50427 2906350 2840530 2781196 2729386 2685695 2650771 2625179 2608892 2601264 2601328 2607666 2617918 2628908
50415 2628908 2637543 2641446 2638615 2626779 2603497 2567038 2517263 2455748 2385062 2307623 2225009 2138268
50403 2138268 2048826 1958925 1871023 1786772 1706624 1630396 1558109 1490245 1427272 1369176 1315672
50392 1315672 1266766 1222732 1183418 1147913 1115261 1085359 1058837 1036163 1017224 1001677 989214
50381 989214 979336 971355 964974 960651 959078 960350 963935 969322 976377 985013 994867 1005602 1017392 1030778
50367 1030778 1045926 1062269 1079067 1096244 1114440 1134209 1155414 1177495 1200121 1223339 1247102
50356 1247102 1270937 1294258 1317049 1340108 1364408 1390112 1416330 1441999 1466878 1491578 1516878
50345 1516878 1543387 1571698 1602203 1634618 1668273 1703136 1740060 1779585 1820939 1862693 1904015
50334 1904015 1944710 1984340 2022002 2056964 2088857 2117201 2141301 2160706 2175249 2184476 2187441 2183229
50322 2183229 2171331 2151400 2123134 2086696 2043049 1993694 1940241 1884243 1827035 1769647 1713097
50311 1713097 1658839 1608511 1563185 1523235 1489010 1461089 1439617 1423939 1413274 1407357 1405953 1408094
50299 1408094 1412251 1416955 1420698 1421524 1417507 1407839 1392908 1373212 1348674 1319288 1286032 1250581 1214147
50286 1214147 1176905 1138643 1099771 1061497 1025043 990856 958624 927920 898710 871280 845965
50275 845965 822985 802358 783790 766755 750870 736228 723299 712434 703451 695696 688618 682359
50263 682359 677682 675175 674633 675425 677290 680422 684817 690028 695693 701910 708805 716109 723553 731433 740296
50248 740296 750137 760325 770404 780617 791495 803231 815682 828719 842223 855706 868344 879627
50236 879627 889890 899915 909994 919643 928246 935638 941811 946395 948859 949126 947615 944712 940659 935916
50222 935916 931024 925872 919617 911753 902897 894029 885169 875340 863863 851174 838174 825210 811989
50209 811989 798321 784546 771148 758189 745319 732325 719455 707162 695630 684658 673898
50198 673898 663154 652556 642661 634189 627357 621540 615871 610177 605031 600885 597561 594751 592598 591479
50184 591479 591429 592082 593041 594028 594760 594983 594717 594315 594138 594078 593476 591722 589105 586869 586006 586032 585365 582940
50166 582940 579061 574642 570233 566114 562760 560514 558999 557392 555287 552867 550338 547601 544509 541077
50152 541077 537473 534136 531857 531271 532137 533543 534918 536434 538228 539763 540484 540772 541623 543327 545049
50137 545049 545903 546008 546099 546400 546406 545700 544499 543183 541694 539641 536807 533308 529415 525427 521575 517859
50121 517859 514160 510642 507715 505303 502522 498645 494216 490487 487815 485273 482009 478348 475233 473169
50107 473169 472076 471631 471206 469916 467425 464596 462808 462572 463227 463922 464460 465083 465868 466593 466987 466919 466380
50090 466380 465437 464184 462675 460923 458958 456936 455109 453598 452232 450813 449596 449261 450094 451490 452600
50075 452600 453266 453859 454416 454632 454741 455558 457332 459211 460347 461020 462119 463914 466026 468371 471486 475801
50059 475801 481007 486266 490872 494750 498471 502734 507699 512937 518061 523122 528234 533141 537437 540976
50045 540976 543838 546142 548160 550350 553098 556545 560703 565353 569777 573175 575696 578512 582488 587314
50031 587314 592348 597658 603561 609692 615419 620869 626758 633353 640408 647951 656390 665877 676306 687813
50017 687813 700513 713754 726504 738613 750947 764131 777925 792083 807026 823225 840499
50006 840499 858443 877124 896976 918294 941218 965951 992701 1021550 1052632 1086267 1122827
49995 1122827 1162528 1205330 1250861 1298590 1348460 1401260 1457864 1517982 1579938 1641578 1700959
49984 1700959 1756309 1806102 1849556 1886736 1918110 1944397 1966824 1986844 2005281 2022072 2036897
49973 2036897 2049469 2058967 2063712 2061740 2051399 2031325 2000577 1959232 1908542 1850227 1785999 1717893
49961 1717893 1648388 1579624 1512780 1448556 1387842 1331507 1279820 1232505 1189140 1149253 1112371
49950 1112371 1078353 1047424 1019623 994565 971983 952034 934635 918993 904358 890899 879242
49939 879242 869406 860804 853127 846498 840792 835441 829987 824343 818346 811603 804010 796125 788696 782014
49925 782014 775882 770058 764466 759047 753617 748025 742430 737327 733204 730247 728375 727468 727406 727991 729064
49910 729064 730651 732836 735606 739128 743962 750537 758435 766688 774806 783056 791723 800811 810658 822109
49896 822109 835570 850408 865752 881502 898171 916184 935850 957540 981299 1006571 1032902
49885 1032902 1060642 1090441 1122362 1156194 1192436 1232276 1276623 1325805 1380231 1440676 1507697
49874 1507697 1581182 1660580 1745148 1833696 1924320 2014509 2101608 2183493 2259291 2329452 2394913
49863 2394913 2456306 2514099 2568968 2621400 2671123 2717508 2760288 2799086 2832140 2856260 2868356
49852 2868356 2866614 2850250 2819013 2773462 2715251 2646599 2569591 2486102 2397925 2306544 2212988
49841 2212988 2118246 2023662 1930651 1840183 1752751 1668689 1588301 1511832 1439597 1372094 1309772
49830 1309772 1252620 1200036 1151075 1104940 1061410 1020867 983764 949981 918791 889443 861684
49819 861684 835718 811857 790184 770421 752075 734764 718321 702536 687050 671819 657405
49808 657405 644465 632970 622301 611978 601882 591921 582090 572900 565091 558744 553189 548029 543733
49795 543733 540884 539363 538617 538346 538470 538805 539204 539822 540858 542242 543939 546260 549461 553304 557478 562233
49779 562233 568004 574546 581014 586952 592695 598732 605181 612120 619950 629122 639652 651131 663124
49766 663124 675494 688522 702837 719052 737388 757715 779968 804419 831638 862391 897432
49755 897432 937038 980757 1027980 1078786 1133790 1193031 1255389 1319248 1383168 1445452 1503554
49744 1503554 1554817 1598080 1634272 1665374 1693073 1718356 1741804 1763802 1784514 1803792 1821071
49733 1821071 1835152 1844115 1845569 1837126 1816861 1783718 1737857 1680796 1615162 1544044 1470228 1395730
49721 1395730 1321855 1249706 1180528 1115535 1055464 1000416 950089 904081 862012 823556 788419
49710 788419 756279 726787 699739 675192 653232 633595 615685 599026 583562 569548 557236
49699 557236 546679 537652 529742 522623 516236 510516 505075 499496 493923 488941 484728 480726 476400 471930
49685 471930 467849 464319 461171 458385 456060 454057 452201 450755 450235 450626 451198 451219 450601 449804 449390 449737
49669 449737 450819 452090 452796 452617 451971 451685 452414 454282 456839 459408 461615 463567 465399 466870 467691 467991
49653 467991 468090 467951 467404 466829 467029 468297 470109 471889 473568 475163 476293 476524 475905 474889 473920 473288 473164
49636 473164 473583 474497 475907 477694 479414 480602 481325 481983 482565 482706 482541 482816 483889 485296 486663 488336
49620 488336 490528 492517 493464 493646 494058 495087 496299 497331 498230 498971 499396 499707 500374 501421 502304 502597 502405
49603 502405 502047 501794 501963 502733 503718 504143 503673 502820 502389 502746 503707 504802 505589 505917 506051 506381 507010 507771
49585 507771 508536 509239 509751 509991 510168 510587 511327 512329 513632 515114 516214 516480 516423 517261 519594 522678 525193
49568 525193 526410 526583 526580 527332 529263 531963 534507 536282 537422 538478 539836 541448 542968 544154 545294
49553 545294 547111 550052 553788 557639 561306 564878 568399 571952 575989 580989 586798 592869 599104 605816
49539 605816 612845 619458 625375 631230 637703 644728 651996 659659 668082 677271 687023 697316 708143 719262
49525 719262 730532 742251 754698 767591 780540 793872 808469 824660 841688 858448 874568
49514 874568 890670 907726 926223 945872 966003 986151 1006292 1026731 1047957 1070419 1094055
49503 1094055 1118156 1142097 1166183 1191277 1217509 1243973 1269937 1295770 1322239 1349351 1376480
49492 1376480 1403329 1430181 1457234 1484182 1510448 1535501 1559051 1581252 1602721 1623970 1644815
49481 1644815 1664520 1682450 1698307 1711879 1722998 1731815 1738806 1744307 1748232 1750381 1750949 1750625 1750170
49468 1750170 1749852 1749206 1747425 1744116 1739687 1735003 1730776 1727307 1724626 1722701 1721524 1721210 1722014 1724239 1728070
49453 1728070 1733480 1740190 1747769 1755881 1764460 1773618 1783480 1794153 1805582 1817155 1827774 1836832 1844965
49440 1844965 1853209 1861441 1868334 1873027 1875999 1877918 1878370 1876456 1872078 1865836 1857902 1847784 1835179 1820354
49426 1820354 1803623 1784922 1764044 1740923 1715710 1688920 1661462 1634064 1606652 1578578 1549505
49415 1549505 1519754 1489878 1460281 1431164 1402420 1373641 1344718 1316407 1289708 1264604 1240050
49404 1240050 1215420 1191343 1168755 1147696 1127599 1108347 1090357 1073693 1057770 1042063 1026724
49393 1026724 1012372 999544 988359 978425 968911 959002 948593 938524 929973 923563 919051 915686 912765
49380 912765 909881 906932 904055 901481 899308 897385 895511 893797 892711 892637 893417 894452 895291 896024 897035
49365 897035 898514 900356 902549 905431 909406 914538 920607 927539 935447 944210 953317 962368 971552 981408
49351 981408 992272 1004153 1016882 1029918 1042153 1052475 1060655 1067406 1073580 1079737 1086492 1094603 1104340
49338 1104340 1115180 1126576 1138687 1151974 1166371 1181346 1196542 1211796 1226634 1240475 1253498
49327 1253498 1266742 1280922 1295493 1309299 1322035 1334652 1348217 1362693 1377049 1390392 1402713
49316 1402713 1414495 1425923 1436756 1446855 1456588 1466637 1477505 1489203 1501261 1513074 1524416
49305 1524416 1535627 1547200 1559249 1571562 1584077 1597019 1610551 1624524 1638629 1652650 1666662
49294 1666662 1681208 1697111 1714683 1733192 1751558 1769584 1788087 1807877 1829148 1851889 1876124
49283 1876124 1901518 1927436 1953725 1980792 2008632 2036583 2064550 2093638 2124769 2157374 2190436
49272 2190436 2224262 2260018 2297741 2336052 2374008 2412141 2451363 2491747 2532792 2574200 2615861
49261 2615861 2657562 2699157 2740675 2781980 2822703 2862751 2902428 2941730 2979871 3015847 3049265
49250 3049265 3080318 3109167 3135625 3159368 3180245 3198453 3214425 3228416 3240218 3249427 3255905 3259674
49238 3259674 3260580 3258594 3254490 3249586 3244522 3238796 3231761 3223693 3215471 3207582 3199905 3192289 3184872 3177840
49224 3177840 3171222 3165034 3159411 3154541 3150557 3147591 3145934 3146109 3148611 3153427 3159906 3167244 3175008 3183035
49210 3183035 3191060 3198870 3206704 3214912 3223117 3230200 3235366 3238871 3241395 3242963 3242726 3239619 3233079 3223253
49196 3223253 3210688 3195680 3177957 3157160 3133556 3107901 3080626 3051588 3020717 2988364 2954835
49185 2954835 2920100 2884289 2848093 2812281 2777176 2742861 2709474 2676933 2644743 2612596 2580875
49174 2580875 2550119 2520258 2490885 2462081 2434389 2408135 2383189 2359297 2336141 2313170 2289985
49163 2289985 2266962 2245010 2224648 2205703 2187900 2171208 2155432 2140010 2124556 2109363 2095161
49152 2095161 2082630 2072219 2064033 2057566 2051863 2046316 2041206 2037206 2034486 2032559 2030913 2029575 2029063 2029937
49138 2029937 2032264 2035379 2038351 2040944 2043998 2048485 2054272 2060261 2065837 2071698 2078973 2087907 2097797 2107963
49124 2107963 2118278 2128862 2139840 2151473 2164032 2177350 2190885 2204424 2218310 2232733 2247260
49113 2247260 2261489 2275761 2290643 2305944 2320843 2334896 2348385 2361767 2375387 2389662 2404776
49102 2404776 2419995 2434042 2446501 2458344 2470755 2483945 2497402 2510668 2523341 2534959 2545620
49091 2545620 2556392 2568355 2581468 2594974 2608702 2623160 2638468 2654096 2669738 2685670 2702083
49080 2702083 2718831 2736121 2754635 2774448 2794477 2813624 2831970 2850171 2868076 2884784 2899927
49069 2899927 2914099 2927977 2941734 2955526 2969877 2985126 3000917 3016658 3032218 3047757 3063056
49058 3063056 3077421 3090236 3101363 3111064 3119750 3127794 3135359 3142441 3149180 3155951 3162859 3169270 3174290
49045 3174290 3177787 3180607 3183635 3186923 3189868 3191957 3193084 3193422 3193319 3193279 3193735 3194828 3196511 3198835 3201951
49030 3201951 3205857 3210281 3214840 3219247 3223419 3227443 3231382 3235123 3238574 3242055 3246208 3251325 3256914 3262091
49016 3262091 3266308 3269610 3272440 3275376 3278778 3282364 3285358 3287354 3288809 3290351 3291914 3293000 3293549 3293888
49002 3293888 3293937 3293211 3291671 3289917 3288289 3286397 3283790 3280491 3276503 3271363 3264724 3256996 3248870 3240444 3231333
48987 3231333 3221453 3211144 3200556 3189433 3177540 3164932 3151720 3137918 3123677 3109410 3095506
48976 3095506 3082055 3068950 3056158 3043765 3031828 3020260 3008947 2997942 2987527 2977917 2968947 2960252
48964 2960252 2951849 2944405 2938703 2934876 2932220 2929801 2927195 2924705 2922919 2922100 2922032 2922404 2923146 2924338 2926058
48949 2926058 2928536 2932120 2936740 2941557 2945723 2949438 2953743 2959235 2965498 2971848 2977970 2983612 2988306 2991908
48935 2991908 2994949 2998021 3001170 3004303 3007693 3011454 3014843 3016838 3017392 3017508 3018058 3018983 3019747 3020072 3020036 3019726
48919 3019726 3019047 3017853 3016235 3014594 3013180 3011457 3008339 3003356 2997216 2990799 2983939 2975836 2966457 2956757
48905 2956757 2947438 2938195 2928430 2918207 2908080 2898351 2888834 2879153 2868976 2858113 2846690 2835236
48893 2835236 2824453 2814848 2806605 2799691 2794016 2789474 2785868 2782955 2780725 2779600 2780077 2782104 2785153 2789062
48879 2789062 2794357 2801475 2810092 2819704 2830441 2842669 2856072 2869975 2884539 2900774 2919169 2939034
48867 2939034 2959491 2980487 3002523 3025968 3051088 3078169 3107016 3136743 3166679 3197305 3229673
48856 3229673 3263986 3299286 3334567 3369721 3405346 3442062 3480125 3519394 3559476 3600120 3641642
48845 3641642 3684741 3729780 3776393 3823933 3872154 3921251 3971360 4022281 4073722 4125681 4178519
48834 4178519 4232677 4288342 4345210 4402522 4459497 4515915 4572292 4629289 4686951 4744576 4801320
48823 4801320 4856698 4910544 4962708 5012915 5060728 5105611 5147279 5186100 5222836 5257771 5290267
48812 5290267 5319405 5344753 5366286 5383855 5397206 5406418 5411884 5413817 5412122 5406671 5397401 5384121
48800 5384121 5366580 5344778 5318966 5289389 5256360 5220514 5182567 5142739 5100735 5056386 5009965
48789 5009965 4961810 4912037 4860758 4808292 4755016 4701293 4647595 4594343 4541450 4488440 4435250
48778 4435250 4382670 4331790 4283247 4237146 4193303 4151205 4110077 4069523 4030121 3993085 3959260
48767 3959260 3928580 3900436 3874404 3850597 3829404 3810926 3794760 3780457 3768122 3758317 3751397 3747228
48755 3747228 3745569 3746423 3749899 3756095 3765206 3777388 3792288 3809026 3826916 3845895 3866135 3887589
48743 3887589 3910223 3934278 3959875 3986677 4014389 4043303 4073875 4105898 4138565 4171208 4203493
48732 4203493 4235153 4266209 4297437 4329896 4363741 4398025 4431893 4465522 4499556 4534118 4568848
48721 4568848 4603594 4638532 4673666 4708737 4743707 4778964 4814771 4850728 4886034 4920278 4953808
48710 4953808 4987219 5020653 5053703 5085854 5116754 5145998 5172997 5197255 5218592 5236862 5251647
48699 5251647 5262512 5269421 5272500 5271456 5265769 5255526 5241523 5224235 5203159 5177612 5147888 5115086
48687 5115086 5080006 5042823 5003796 4963575 4922456 4879832 4834764 4786845 4736220 4683178 4628257
48676 4628257 4572555 4517335 4463216 4410158 4358204 4307775 4259130 4212107 4166694 4123423 4082822
48665 4082822 4044809 4009011 3975355 3943994 3914929 3888250 3864482 3844058 3826519 3810919 3797028
48654 3797028 3785487 3776573 3769531 3763489 3758520 3755297 3754175 3755183 3758546 3764481 3772489 3781527 3791099 3801710
48640 3801710 3814018 3827925 3842792 3858229 3874263 3890897 3907934 3925389 3943745 3963611 3985192
48629 3985192 4008302 4032771 4058601 4085721 4113895 4143057 4173589 4206018 4240485 4276604 4313760
48618 4313760 4351461 4389636 4428810 4469786 4512749 4556701 4600155 4642398 4683752 4724652 4764902
48607 4764902 4803959 4841453 4877114 4910541 4941334 4969269 4994124 5015545 5033285 5047323 5057536
48596 5057536 5063499 5064877 5061747 5054312 5042513 5026260 5005762 4981300 4952932 4920814 4885542 4847647
$$ [...]
##END NTUPLES=NMR SPECTRUM
##END=
