##TITLE=coffee_type CCIN01-ROVE100_90-10%
COFFEE_meoh_noesyp64 COFFEE_meoh {C:\Bruker\TOPSPIN} Administrator 15
##JCAMPDX= 6.0         $$ Bruker NMR JCAMP-DX V2.0
##DATA TYPE= NMR SPECTRUM
##DATA CLASS= NTUPLES
##ORIGIN= Bruker BioSpin GmbH
##OWNER= Administrator
$$ 1.72 TOPSPIN		Version 2.1
$$ 2012-05-18 15:50:05.479 -0700  Administrator@X
$$ Compression mode = diff/dup
##.OBSERVE FREQUENCY= 400.13188235
##.OBSERVE NUCLEUS= ^1H
##.ACQUISITION MODE= SIMULTANEOUS (DQD)
##.ACQUISITION SCHEME= undefined
##.AVERAGES= 64
##.DIGITISER RES= 22
##SPECTROMETER/DATA SYSTEM= spect
##.PULSE SEQUENCE= noesygpps1d.comp
##.SOLVENT NAME= COFFEE_meoh
##.SHIFT REFERENCE= INTERNAL, COFFEE_meoh, 1, 14.98061
##AUDIT TRAIL= $$ (NUMBER, WHEN, WHO, WHERE, PROCESS, VERSION, WHAT)
$$ ##TITLE= Audit trail, TOPSPIN		Version 2.1
$$ ##JCAMPDX= 5.01
$$ ##ORIGIN= Bruker BioSpin GmbH
$$ ##OWNER= Administrator
$$ $$ C:\Bruker\TOPSPIN/data/Administrator/nmr/12-COFFEE-2502/92/pdata/1/auditp.txt
$$ ##AUDIT TRAIL=  $$ (NUMBER, WHEN, WHO, WHERE, PROCESS, VERSION, WHAT)
(   1,<2012-02-25 16:39:48.469 -0500>,<Administrator>,<TOPSPIN>,<go>,<TOPSPIN 2.1>,
      <created by zg
	started at 2012-02-25 16:28:18.172 -0500,
	POWCHK enabled, PULCHK disabled,
       configuration hash MD5:
       B0 76 FB 9C 50 81 44 7D 18 B3 26 32 4E 60 AD 96
       data hash MD5: 64K
       4C EF FC 48 84 49 0D BB 2C D9 75 C9 5D 66 9C A1>)
(   2,<2012-02-25 16:39:51.266 -0500>,<Administrator>,<TOPSPIN>,<proc1d>,<TOPSPIN 2.1>,
      <Start of raw data processing
       efp LB = 0.3 FT_mod = 6 PKNL = 1 PHC0 = 0 PHC1 = 0 SI = 128K 
       data hash MD5: 128K
       62 66 40 9A 1A 94 81 89 F5 0A 8A 30 73 17 86 5B>)
(   3,<2012-02-25 16:39:52.609 -0500>,<Administrator>,<TOPSPIN>,<proc1d>,<TOPSPIN 2.1>,
      <pk PHC0 = 24.5929 PHC1 = 0 
       data hash MD5: 128K
       D0 36 D2 72 B7 15 40 C8 DB 79 8E 8F 5E 5E 30 F1>)
(   4,<2012-02-25 16:39:52.859 -0500>,<Administrator>,<TOPSPIN>,<proc1d>,<TOPSPIN 2.1>,
      <abs ABSG = 1 
       data hash MD5: 128K
       DA 91 03 63 05 F7 8C 6B 0C 25 64 BE 2B 67 10 2F>)
(   5,<2012-02-25 16:39:52.937 -0500>,<Administrator>,<TOPSPIN>,<proc1d>,<TOPSPIN 2.1>,
      <abs ABSG = 2 
       data hash MD5: 128K
       48 A3 0F 4E 09 7F 89 F6 D2 C0 C6 73 AF 80 47 32>)
(   6,<2012-02-25 16:39:53.000 -0500>,<Administrator>,<TOPSPIN>,<proc1d>,<TOPSPIN 2.1>,
      <abs ABSG = 3 
       data hash MD5: 128K
       F0 72 AF E3 64 B5 0A 69 B7 9E 2C 83 C8 82 10 6E>)
(   7,<2012-02-25 16:39:53.250 -0500>,<Administrator>,<TOPSPIN>,<proc1d>,<TOPSPIN 2.1>,
      <abs ABSG = 4 
       data hash MD5: 128K
       75 AD F1 20 4B 2D 87 65 D2 9A 34 3B BE BD 67 D6>)
(   8,<2012-02-25 16:39:53.312 -0500>,<Administrator>,<TOPSPIN>,<proc1d>,<TOPSPIN 2.1>,
      <abs ABSG = 5 
       data hash MD5: 128K
       75 CF CB A5 A0 08 04 C9 F2 3A 2E 53 19 4D 51 19>)
(   9,<2012-02-25 16:39:53.437 -0500>,<Administrator>,<TOPSPIN>,<audit>,<TOPSPIN 2.1>,
      <user comment:
       ICON-NMR User ID: Administrator
$$ [...]
150 150 150 150 150 150 150 150
##$TP07= 0
##$TPNAME0= <>
##$TPNAME1= <>
##$TPNAME2= <>
##$TPNAME3= <>
##$TPNAME4= <>
##$TPNAME5= <>
##$TPNAME6= <>
##$TPNAME7= <>
##$TPOAL= (0..7)
0.5 0.5 0.5 0.5 0.5 0.5 0.5 0.5
##$TPOFFS= (0..7)
0 0 0 0 0 0 0 0
##$TUNHIN= 0
##$TUNHOUT= 0
##$TUNXOUT= 0
##$USERA1= <user>
##$USERA2= <user>
##$USERA3= <user>
##$USERA4= <user>
##$USERA5= <user>
##$V9= 5
##$VALIST= <valist>
##$VCLIST= <CCCCCCCCCCCCCCC>
##$VD= 0
##$VDLIST= <DDDDDDDDDDDDDDD>
##$VPLIST= <PPPPPPPPPPPPPPP>
##$VTLIST= <TTTTTTTTTTTTTTT>
##$WBST= 1024
##$WBSW= 4
##$XGAIN= (0..3)
0 0 0 0
##$XL= 0
##$YL= 0
##$YMAX_a= 13345884
##$YMIN_a= -6261303
##$ZGOPTNS= <>
##$ZL1= 120
##$ZL2= 120
##$ZL3= 120
##$ZL4= 120
##$ABSF1= 14.98061
##$ABSF2= -5.57192
##$ABSG= 5
##$ABSL= 3
##$ALPHA= 0
##$AQORDER= 0
##$ASSFAC= 0
##$ASSFACI= 0
##$ASSFACX= 0
##$ASSWID= 0
##$AUNMP= <proc_prof1d_extract>
##$AXLEFT= 0
##$AXNAME= <>
##$AXNUC= <1H>
##$AXRIGHT= 0
##$AXTYPE= 0
##$AXUNIT= <>
##$AZFE= 0.1
##$AZFW= 0.1
##$BCFW= 0
##$BC_mod= 0
##$BYTORDP= 0
##$COROFFS= 0
##$CY= 15
##$DATMOD= 1
##$DC= 0
##$DFILT= <>
##$DTYPP= 0
##$F1P= 0
##$F2P= 0
##$FCOR= 0.5
##$FTSIZE= 131072
##$FT_mod= 6
##$GAMMA= 0
##$GB= 0
##$INTBC= 1
##$INTSCL= 1
##$ISEN= 128
##$LB= 0.3
##$LEV0= 0
##$LPBIN= 0
##$MAXI= 10000
##$MC2= 0
##$MEAN= 0
##$ME_mod= 0
##$MI= 0
##$NCOEF= 0
##$NC_proc= -3
##$NLEV= 6
##$NOISF1= 0
##$NOISF2= 0
##$NSP= 0
##$NTH_PI= 0
##$NZP= 0
##$OFFSET= 14.98061
##$PC= 1
##$PHC0= 24.5929
##$PHC1= 0
##$PH_mod= 1
##$PKNL= yes
##$PPARMOD= 0
##$PPDIAG= 0
##$PPIPTYP= 0
##$PPMPNUM= 2147483647
##$PPRESOL= 1
##$PSCAL= 4
##$PSIGN= 0
##$PYNMP= <proc.py>
##$REVERSE= no
##$SF= 400.13
##$SI= 131072
##$SIGF1= 0
##$SIGF2= 0
##$SINO= 400
##$SIOLD= 131072
##$SPECTYP= <>
##$SREGLST= <1H.CDCl3>
##$SSB= 0
##$STSI= 131072
##$STSR= 0
##$SW_p= 8223.68421052632
##$SYMM= 0
##$S_DEV= 0
##$TDeff= 65536
##$TDoff= 0
##$TI= <>
##$TILT= no
##$TM1= 0
##$TM2= 0
##$TOPLEV= 0
##$USERP1= <user>
##$USERP2= <user>
##$USERP3= <user>
##$USERP4= <user>
##$USERP5= <user>
##$WDW= 1
##$XDIM= 131072
##$YMAX_p= 479926567
##$YMIN_p= -298731729
##$CURPLOT= <Network HP LaserJet P1505>
##$CURPRIN= <$Network HP LaserJet P1505>
##$DFORMAT= <normdp>
##$LAYOUT= <+/1D_H.xwp>
##$LFORMAT= <normlp>
##$PFORMAT= <normpl>
##$SURQMSG= 1
$$ End of Bruker specific parameters
$$ ---------------------------------
##NTUPLES= NMR SPECTRUM
##VAR_NAME=  FREQUENCY,     SPECTRUM/REAL,   SPECTRUM/IMAG
##SYMBOL=    X,             R,               I
##VAR_TYPE=  INDEPENDENT,   DEPENDENT,       DEPENDENT
##VAR_FORM=  AFFN,          ASDF,            ASDF
##VAR_DIM=   131072,        131072,          131072
##UNITS=     HZ,            ARBITRARY UNITS, ARBITRARY UNITS
##FACTOR=    0.0627417313425165, 1,          1
##FIRST=     8223.62146879498, 3032,         -89061
##LAST=      0,             5910,            -88887
##MIN=       0,             -298731729,      0
##MAX=       8223.62146879498, 479926567,    0
$$ Real data points
##PAGE= N=1
##DATA TABLE= (X++(R..R)), XYDATA
$$ [...]
60736A187977q502p384o963o655o151n417m087j801R03K851L667M290N792Q182
60722A166702J0556J2068J2577J2637J2963J3717J4403J4725J5025J5452J5266
60711A316091J4025J2963J3748J5817J6459J4154J0508Q156P861Q600R536J0520
60699A458438J1098J0401Q317N902M372L919L641K576Q62j39O61K533L517K718
60685A518816J256N45N47K53q73k696m918o947p835p314o426o255o546o526o556
60670A458525p632r365j0058r051p833q147r712j0619r657p651o453o724o983
60657A348640n240j689J000P14j444k531j389L12N20r73l019m618n330n100m379
60642A315474l990m297m810m855m293l413k686k692l714n059n521m824m076m385
$$ plain form
60736 1187977 1179475 1172091 1165128 1158473 1152322 1146905 1142818 1141017 1141920 1144771 1148438 1152728 1158520 1166702
60722 1166702 1177258 1189326 1201903 1214540 1227503 1241220 1255623 1270348 1285373 1300825 1316091
60711 1316091 1330116 1343079 1356827 1372644 1389103 1403257 1413765 1421921 1429782 1438382 1447918 1458438
60699 1458438 1469536 1479937 1488254 1494156 1498528 1502447 1506088 1508664 1509526 1509387 1510048 1512581 1516098 1518816
60685 1518816 1520072 1520617 1521164 1521417 1520544 1517848 1512930 1505983 1498148 1490834 1484408 1478153 1471607 1465081 1458525
60670 1458525 1450893 1441528 1431470 1422419 1414586 1406439 1396727 1386108 1376451 1368800 1362347 1355623 1348640
60657 1348640 1343400 1341711 1342711 1343425 1341981 1339450 1338061 1338373 1338893 1337920 1334901 1330283 1324953 1319853 1315474
60642 1315474 1311484 1307187 1302377 1297522 1293229 1289816 1287130 1284438 1280724 1275665 1270144 1265320 1261244 1256859
60628A256859n661p271r166j1564j3958j5321j5364j4912j4887j5320j5572j5236
60616A102627j4511j3794j3198j2677j2348j2242j1734r946p036m488l456l380
60604I83817k951j895p83M39K337M483N544N176M562M694N410O526Q392J0455
60590A036206J0845Q782O294O047Q088J0185J0836J0444R821R131Q460Q085P819
60577A151043P132O159N746O201O920P483Q307R805J1610J3057J3981J4666J5413
60564A277523J6411J7665J8864J9600J9779J9577J9077J8307J7509J6860J6055
60553A477227J4675J2822J0839Q607N913L322J704Q05p17l471o400q192q939r855
60539A498340j1839j4715j7556j9336j9631j8945j8138j7495j6741j5814j4865
$$ plain form
60628 1256859 1251198 1243927 1234761 1223197 1209239 1193918 1178554 1163642 1148755 1133435 1117863 1102627
60616 1102627 1088116 1074322 1061124 1048447 1036099 1023857 1012123 1002177 995141 990653 987197 983817
60604 983817 980866 978971 978188 978627 980964 985447 990991 996167 1000729 1005423 1010833 1017359 1025751 1036206
60590 1036206 1047051 1055833 1062127 1068174 1076262 1086447 1097283 1107727 1117548 1126679 1135139 1143224 1151043
60577 1151043 1158175 1164334 1170080 1176281 1183201 1190684 1198991 1208796 1220406 1233463 1247444 1262110 1277523
60564 1277523 1293934 1311599 1330463 1350063 1369842 1389419 1408496 1426803 1444312 1461172 1477227
60553 1477227 1491902 1504724 1515563 1524170 1530083 1533405 1535109 1535914 1535197 1531726 1525326 1517134 1508195 1498340
60539 1498340 1486501 1471786 1454230 1434894 1415263 1396318 1378180 1360685 1343944 1328130 1313265
60528A313265j3595j1517r091p547p018n946l037R53M249O137P077P318O488M525
60514A292261K222Q72J575M418P860R642R084P936Q104R195R337P913O126N147
60500A381692N174O203Q161R918R692P244M572L604M072M472M348M482N304O222
60486A465160O596O728P625J0097J4018J8409K2342K5919L0039L5065M0214M4475
60474A726687M7532M9408M9613M7336M2258L4759K5420J4719L199q268j8338k5343
60462A988982k8216k7483k4815k1276j6536j0193l081L443Q857J3102J5561J5813
60450A914158J5206J6121J9184K2549K4632K6384K9808L5187M1204M7357N4711
60439B246501O4010P4335Q4379R4248J05169J17901J32134J47144J62212J76570
$$ plain form
60528 1313265 1299670 1288153 1279062 1271515 1264497 1258551 1255514 1256467 1260716 1266853 1273930 1281248 1287736 1292261
60514 1292261 1294483 1295355 1296930 1301348 1309208 1318850 1327934 1335870 1343974 1353169 1362506 1370419 1376545 1381692
60500 1381692 1386866 1393069 1401230 1411148 1420840 1428084 1432656 1436260 1440332 1444804 1449152 1453634 1458938 1465160
60486 1465160 1471756 1478484 1486109 1496206 1510224 1528633 1550975 1576894 1606933 1641998 1682212 1726687
60474 1726687 1774219 1823627 1873240 1920576 1962834 1997593 2023013 2037732 2040931 2032663 2014325 1988982
60462 1988982 1960766 1933283 1908468 1887192 1870656 1860463 1857382 1860825 1869682 1882784 1898345 1914158
60450 1914158 1929364 1945485 1964669 1987218 2011850 2038234 2068042 2103229 2144433 2191790 2246501
60439 2246501 2310511 2384846 2469225 2563473 2668642 2786543 2918677 3065821 3228033 3404603
60429C404603J89862K02871K16973K32571K48824K65406K83601L04684L27509
60420E676904L48462L63165L67044L54613L20344K61672J80888Q3899k2027j28957
60410G806007k28307l12080l74679m13707m29941m27326m12002l89731l63735
60401D454499l35353l06014k77551k50875k25660k01674j79545j59954j42862
60392B375011j27807j14436j02482r1638q1672p2501o4281n7665n3354n0804m7986
60381A510385m3438l8097l3876l0945k7942k4699k2720k2498k2156j9848j6125
60370A208041j2872j1103j0820j1848j3421j3958j2788j1385j1425j2171j1471
60359A074779r074p036o670o796n798m020k916k642j832L11K743L823L286K406
$$ plain form
60429 3404603 3594465 3797336 4014309 4246880 4495704 4761110 5044711 5349395 5676904
60420 5676904 6025366 6388531 6755575 7110188 7430532 7692204 7873092 7956991 7934964 7806007
60410 7806007 7577700 7265620 6890941 6477234 6047293 5619967 5207965 4818234 4454499
60401 4454499 4119146 3813132 3535581 3284706 3059046 2857372 2677827 2517873 2375011
60392 2375011 2247204 2132768 2030286 1938648 1856976 1784475 1720194 1662529 1609175 1558371 1510385
60381 1510385 1466947 1428850 1394974 1364029 1336087 1311388 1288668 1266170 1244014 1224166 1208041
60370 1208041 1195169 1184066 1173246 1161398 1147977 1134019 1121231 1109846 1098421 1086250 1074779
60359 1074779 1065705 1058669 1051999 1045203 1039405 1035385 1032469 1029827 1027995 1028306 1031049 1034872 1038158 1040564
60345A040564K357L089M036N131O379O961O005M188L371M319N891O937P679Q634
60331A115541R448R754J0039J0529J0303Q792P136O463N851L829J250M44J738
60318A201117L020K928K379K406K425J571P8j563l453n283n810m447k386j045
60304A191937l36M83J173J025L84L14R70J562J870K729M700O983Q123P512O030
60289A235459N263O124Q201J0364J1797J2310J2036J1356J0775J0298R185P035
60277A350203M820L784L538K532M49j158j025L11J645K555L096L196L120L547
60263A380613M464M940M596M135L610J562k824p766j0677j1281j1426j2216j2761
60250A334969j1802r366o631m801m247m328m228m071m587n508n439l903k309j924
$$ plain form
60345 1040564 1042921 1046010 1050046 1055177 1061556 1068517 1074522 1078710 1082081 1086400 1092291 1099228 1106907 1115541
60331 1115541 1124989 1134743 1144782 1155311 1165614 1174406 1181542 1188005 1193856 1197685 1198935 1199379 1201117
60318 1201117 1204137 1207065 1209444 1211850 1214275 1215846 1215924 1214361 1210908 1205625 1199815 1195368 1192982 1191937
60304 1191937 1191601 1192084 1193257 1194282 1194666 1194980 1195950 1197512 1199382 1202111 1206811 1213794 1221917 1229429 1235459
60289 1235459 1240722 1246846 1255047 1265411 1277208 1289518 1301554 1312910 1323685 1333983 1343168 1350203
60277 1350203 1355023 1358807 1362345 1364877 1365326 1364168 1363143 1363454 1365099 1367654 1370750 1373946 1377066 1380613
60263 1380613 1385077 1390017 1394613 1398748 1402358 1403920 1401096 1393330 1382653 1371372 1359946 1347730 1334969
60250 1334969 1323167 1313801 1307170 1302369 1298122 1293794 1289566 1285495 1280908 1275400 1269961 1266058 1263749 1261825
60236A261825k096j696j042r76j084o68m71j471k699k503j464j626k918k924o21
60221A237566K103L415L826M476N191N576O403Q362J0609J2042J3132J5065J7700
60208A345466J9537J9478J7836J5978J5402J6703J8928K0565K1429K2592K4391
60197A558305K5804K6462K7703L0534L3882L6247L8045M0820M4861M9184N3375
60186A965222N7864O2737O7700P3028P9253Q6024R2605R9291J06917J15023J22118
60175B927782J27952J33969J40952J47642J52476J55368J56784J56136J52430
60166D251491J45885J37598J27846J15944J01846Q6822P2034N7228M1492K4969
60156E163155R201m281j5210k4212l1402l5823l6455l3521k8424k2351j5217o182
$$ plain form
60236 1261825 1259729 1258033 1256991 1256015 1254931 1254263 1253792 1252321 1249622 1247119 1245655 1244029 1241111 1238187 1237566
60221 1237566 1239669 1243084 1246910 1251386 1256577 1262153 1268556 1276918 1287527 1299569 1312701 1327766 1345466
60208 1345466 1365003 1384481 1402317 1418295 1433697 1450400 1469328 1489893 1511322 1533914 1558305
60197 1558305 1584109 1610571 1638274 1668808 1702690 1738937 1776982 1817802 1862663 1911847 1965222
60186 1965222 2023086 2085823 2153523 2226551 2305804 2391828 2484433 2583724 2690641 2805664 2927782
60175 2927782 3055734 3189703 3330655 3478297 3630773 3786141 3942925 4099061 4251491
60166 4251491 4397376 4534974 4662820 4778764 4880610 4967432 5039466 5096694 5138186 5163155
60156 5163155 5172356 5168075 5152865 5128653 5097251 5061428 5024973 4991452 4963028 4940677 4925460 4919278
60144D919278N089J8004L1720M5756N9749P3145Q5682R8004J11020J24364J36057
60133E707868J44166J48381J49614J48438J44621J37765J27565J13492R5302P4105
60123F991317N2048L0471R058j2773l4349n4228p1545q5994r6921j03402j05312
60112F518370j03511r8748r0923p9696o5498m9660l3626j8114k958J2247K7425
60101F015308M1993N5479O7822P8837Q7722R3304R4807R2341Q6762P9083O9665
60090F863123N8152M4705L1049J9480J0666L419k944o983o596j246Q114K0522
60078G041461L5319N1667O9212Q9012J12385J38671J65362J90820K15779K41909
60068H351597K69865K99108L28576L56831L82469M05200M25991M45451M62415
$$ plain form
60144 4919278 4924367 4942371 4974091 5019847 5079596 5152741 5238423 5336427 5447447 5571811 5707868
60133 5707868 5852034 6000415 6150029 6298467 6443088 6580853 6708418 6821910 6917212 6991317
60123 6991317 7043365 7073836 7082894 7070121 7035772 6981544 6909999 6824005 6727084 6623682 6518370
60112 6518370 6414859 6316111 6225188 6145492 6079994 6030334 5996708 5978594 5975636 5987883 6015308
60101 6015308 6057301 6112780 6180602 6259439 6347161 6440465 6535272 6627613 6714375 6793458 6863123
60090 6863123 6921275 6965980 6997029 7016509 7027175 7030594 7027650 7020667 7014071 7012825 7020939 7041461
60078 7041461 7076780 7128447 7197659 7286671 7399056 7537727 7703089 7893909 8109688 8351597
60068 8351597 8621462 8920570 9249146 9605977 9988446 10393646 10819637 11265088 11727503
60059A1727503M74645M80438M79042M70013M52874M27230L92779L49640K99072
60050A5553236K43299J83871J20640N3058j7839q9399j58827k23724k81727l31019
60040A5051569l71263m02712m24031m32400m26659m09437l85145l56517l23956
60031A1519449k87514k48120k07007j65363j24815q7218n3342k2602N407K9703
60021A0358578M8750O1900O9310P0993O6875N7625M4512K8277Q953j2910l5549
60010A0767314n7011p6580r4810j12389j29315j45120j59414j72107j83210j92491
60000I444867j99359k03231k03966k01801j96914j89378j79564j68102j55136
59991G747416j39897j21577j00455p7833n4922l2236r974J1542L2091N1852P1124
$$ plain form
60059 11727503 12202148 12682586 13161628 13631641 14084515 14511745 14904524 15254164 15553236
60050 15553236 15796535 15980406 16101046 16154104 16136265 16046866 15888039 15664315 15382588 15051569
60040 15051569 14680306 14277594 13853563 13421163 12994504 12585067 12199922 11843405 11519449
60031 11519449 11231935 10983815 10776808 10611445 10486630 10399412 10346070 10323468 10328875 10358578
60021 10358578 10407328 10469228 10538538 10609531 10676406 10734031 10778543 10806820 10815773 10802863 10767314
60010 10767314 10710303 10633723 10538913 10426524 10297209 10152089 9992675 9820568 9637358 9444867
60000 9444867 9245508 9042277 8838311 8636510 8439596 8250218 8070654 7902552 7747416
59991 7747416 7607519 7485942 7385487 7307654 7252732 7220496 7210522 7222064 7254155 7306007 7377131
59980G377131Q9779J07084J22051J33869J42126J46673J47242J43116J33455J18055
59970H660581R7740P3934M7967K0876o505l3659o0536q7182j12944j36220j55145
59959H308907j68508j76056j78220j75749j69433j59790j46936j30951j12341
59950F890923r2122p1452n1212l1615j1924R147L2144N5981P8815R9945J20238
59939G028868J40461J59928J77372J92482K05656K16374K22719K22680K15392
59930H781932K01040J80396J54725J25670R4572O2084K8544n560l9655p3104j04744
59919I405900j32665j54984j70813j80164j83150j79725j70306j56149j38708
59910G939236j18769r6385p1741m5817k0125M182K6908M8628O9904R0579J09738
$$ plain form
59980 7377131 7466910 7573994 7696045 7829914 7972040 8118713 8265955 8409071 8542526 8660581
59970 8660581 8758321 8832255 8880222 8901098 8894593 8860934 8800398 8713216 8600272 8464052 8308907
59959 8308907 8140399 7964343 7786123 7610374 7440941 7281151 7134215 7003264 6890923
59950 6890923 6798801 6727349 6676137 6644522 6632598 6641745 6673889 6729870 6808685 6908630 7028868
59939 7028868 7169329 7329257 7506629 7699111 7904767 8121141 8343860 8566540 8781932
59930 8781932 8982972 9163368 9318093 9443763 9538335 9600419 9628963 9623403 9583748 9510644 9405900
59919 9405900 9273235 9118251 8947438 8767274 8584124 8404399 8234093 8077944 7939236
59910 7939236 7820467 7724082 7652341 7606524 7586399 7590581 7617489 7666117 7736021 7826600 7936338
59899G936338J26433J40410J51851J60265J64360J63651J59832J55352J50586
59890I309078J43606J33259J21241J10185J00791R2275Q4836P9854P7855P8143
59880A0331123Q0897Q7972J00713J18266J39128J63499J92704K26720K63340K99868
59870A2004230L34872L68064L98974M26027M46838M59346M62304M54375M33114
59861A5788144L95820L41551K71837J89398R7196j055j00343j95201k80717l52818
59851A6153812m08723m47915m71984m82839m81549m69206m47755m19154l84628
59842A2140059l45672l04780k63786k22244j78982j34972r3116n5134k0127J3647
59832A0534893M6616P7892J06225J30436J49477J62472J68423J65978J54057J32631
$$ plain form
59899 7936338 8062771 8203181 8355032 8515297 8679657 8843308 9003140 9158492 9309078
59890 9309078 9452684 9585943 9707184 9817369 9918160 10010435 10095271 10175125 10252980 10331123
59880 10331123 10412020 10499992 10600705 10718971 10858099 11021598 11214302 11441022 11704362 12004230
59870 12004230 12339102 12707166 13106140 13532167 13979005 14438351 14900655 15355030 15788144
59861 15788144 16183964 16525515 16797352 16986750 17083946 17082891 16982548 16787347 16506630 16153812
59851 16153812 15745089 15297174 14825190 14342351 13860802 13391596 12943841 12524687 12140059
59842 12140059 11794387 11489607 11225821 11003577 10824595 10689623 10596507 10541373 10521246 10534893
59832 10534893 10581509 10659401 10765626 10896062 11045539 11208011 11376434 11542412 11696469 11829100
59822A1829100J02282O3413J6761l5456r0028j44443j97123k46014k88225l21533
59812A0688734l45437l60452l67418l67903l64126l57465l47452l32874l13581
59803G532026k90938k66999k43613k21717k01022j80652j60284j40296j20978
59794E705527j02372q5118p0434n8793m9381m1301l4591k9612k6283k4479k4238
59783E158925k4769k4291k1981j9404j8717j9847k0871k0960k1389k3433k6712
59772D916551l0260l4142l8904m4101m8352n0701n1172n0083m7636m4402m1576
59761D435222m0065l9379l7884l4316k8807k2301j5301p775k44N778R155J0752
59749D234835J3136J8297K5971L4382M2343N0031N7785O4872P0039P2918P4194
$$ plain form
59822 11829100 11931382 11994795 12011556 11976100 11886072 11741629 11544506 11298492 11010267 10688734
59812 10688734 10343297 9982845 9615427 9247524 8883398 8525933 8178481 7845607 7532026
59803 7532026 7241088 6974089 6730476 6508759 6307737 6127085 5966801 5826505 5705527
59794 5705527 5603155 5518037 5447603 5388810 5339429 5298128 5263537 5233925 5207642 5183163 5158925
59783 5158925 5134156 5109865 5087884 5068480 5049763 5029916 5009045 4988085 4966696 4943263 4916551
59772 4916551 4886291 4852149 4813245 4769144 4720792 4670091 4618919 4568836 4521200 4476798 4435222
59761 4435222 4395157 4355778 4317894 4283578 4254771 4232470 4217169 4209394 4209150 4214928 4224083 4234835
59749 4234835 4247971 4266268 4292239 4326621 4368964 4418995 4476780 4541652 4611691 4684609 4758803
59738D758803P4430P3404P0745O6504O0846N3983M6931M1475L8530L7093L5847
59727E358591L5426L8010M4716N4417O5218P6144Q7416J00141J15884J35412J57444
59716F268819J79672K01405K24099K48819K74522K99736L24844L51170L78440
59707H751526M04141M24783M36435M34308M13273L69536L01759K11715J05434
59698A1852910o244j10234j95988k58574k98049l17040l18896l06887k84077k53810
59688I503111k19878j85308j50953j16188q1209m7624j6469J3121M2432P1267
59678H812302R8663J24872J51293J78576K06032K33135K60493K88925L18366L48499
59668A1021156L80021M14371M52221M92609N33763N74645O15824O58915P04987
$$ plain form
59738 4758803 4833233 4906637 4977382 5043886 5104732 5158715 5205646 5247121 5285651 5322744 5358591
59727 5358591 5394017 5432027 5476743 5531160 5596378 5672522 5759938 5860079 5975963 6111375 6268819
59716 6268819 6448491 6649896 6873995 7122814 7397336 7697072 8021916 8373086 8751526
59707 8751526 9155667 9580450 10016885 10451193 10864466 11234002 11535761 11747476 11852910
59698 11852910 11846666 11736432 11540444 11281870 10983821 10666781 10347885 10040998 9756921 9503111
59688 9503111 9283233 9097925 8946972 8830784 8749575 8701951 8685482 8698603 8741035 8812302
59678 8812302 8910965 9035837 9187130 9365706 9571738 9804873 10065366 10354291 10672657 11021156
59668 11021156 11401177 11815548 12267769 12760378 13294141 13868786 14484610 15143525 15848512
59659A5848512P53335Q01918Q49071Q94320R37149R75321J005206J023872J030383
59650B4119087J025027J008067R80011R43013R01466Q60650Q24384P93787P68265
59641C2223757P47574P32183P21144P10306O93820O67321O28858N77150N10928
59632C8213041M30922L40943K45805J49174N4568l2874j07878j67823k12267k39821
59622C8673790k47712k34935k03988j58600j00993l2237M6088J31769K22782L17259
59612C8413223M13244N09149O03796O95146P79538Q52723R10959R50424R66021
59603D5094223R51673R01543Q11034O77861N03296K92219N1883k08266m75139
59594D8600327p32410r64587j161005j315769j425718j490524j513951j502665
$$ plain form
59659 15848512 16601847 17403765 18252836 19147156 20084305 21059626 22064832 23088704 24119087
59650 24119087 25144114 26152181 27132192 28075205 28976671 29837321 30661705 31455492 32223757
59641 32223757 32971331 33703514 34424658 35134964 35828784 36496105 37124963 37702113 38213041
59632 38213041 38643963 38984906 39230711 39379885 39434453 39401579 39293701 39125878 38913611 38673790
59622 38673790 38426078 38191143 37987155 37828555 37727562 37695325 37741413 37873182 38095964 38413223
59612 38413223 38826467 39335616 39939412 40634558 41414096 42266819 43177778 44128202 45094223
59603 45094223 46045896 46947439 47758473 48436334 48939630 49231849 49283732 49075466 48600327
59594 48600327 47867917 46903330 45742325 44426556 43000838 41510314 39996363 38493698
59586C8493698j463332j402020j325823j242845j160042j082579j015697r65652
59578B8835708r37915r34782r54301r89819j030438j064194j082690j082802j064534
59569A9694233j029128r79810r21955q60410p97301p33646o71922o15065n63421
59560A2521575n14690m67334m22756l83511l50181l20623k92081k63830k37708
59551I268861k15821j97831j81297j64988j50750j41050j35602j31940j28941
59542G820641j27913j29923j33696j37057j39293j41021j42418j42681j41018
59533F585621j37331j31968j25424j18214j10585j02331r3316q4059p5349o7244
59523E539800n8870m9353l8772k8064j8271r929k918L366R717J6787K4773L3162
$$ plain form
59586 38493698 37030366 35628346 34302523 33059678 31899636 30817057 29801360 28835708
59578 28835708 27897793 26963011 26008710 25018891 23988453 22924259 21841569 20758767 19694233
59569 19694233 18665105 17685295 16763340 15902930 15105629 14371983 13700061 13084996 12521575
59560 12521575 12006885 11539551 11116795 10733284 10383103 10062480 9770399 9506569 9268861
59551 9268861 9053040 8855209 8673912 8508924 8358174 8217124 8081522 7949582 7820641
59542 7820641 7692728 7562805 7429109 7292052 7152759 7011738 6869320 6726639 6585621
59533 6585621 6448290 6316322 6190898 6072684 5962099 5859768 5766452 5682393 5607044 5539800
59523 5539800 5480930 5431577 5392805 5364741 5346470 5336541 5333623 5336989 5346706 5363493 5388266 5421428
59511E421428M0800M6515M9959N1901N3687N6478O0848O6633P2910P8608Q3675
59500F083442Q9472R7490J07788J19217J31001J43354J56510J70152J84255J99562
59490G482243K16395K33609K49780K65104K81058K98142L14961L29785L42058
59481A0013135L51859L58674L61468L59517L52560L40526L23717L02940K78639
59472A3043035K50096K16333J78139J38517J00800O6637L6060Q995j3956l2075
59462A3992581m5318n4135n8721n8580n2755m0419k1353L834L3782O6834J01470
59451A3867220J36158J68799J96660K17083K28122K28158K15330J87960J45733
59442A5591223R0072K3397n1404j30750k10330k85949l54210m12318m57773m88861
$$ plain form
59511 5421428 5462228 5508743 5558702 5610603 5664290 5720768 5781616 5848249 5921159 5999767 6083442
59500 6083442 6172914 6270404 6378192 6497409 6628410 6771764 6928274 7098426 7282681 7482243
59490 7482243 7698638 7932247 8182027 8447131 8728189 9026331 9341292 9671077 10013135
59481 10013135 10364994 10723668 11085136 11444653 11797213 12137739 12461456 12764396 13043035
59472 13043035 13293131 13509464 13687603 13826120 13926920 13993557 14029617 14038612 14024656 13992581
59462 13992581 13947263 13893128 13834407 13775827 13723072 13682653 13661300 13665134 13698916 13765750 13867220
59451 13867220 14003378 14172177 14368837 14585920 14814042 15042200 15257530 15445490 15591223
59442 15591223 15681295 15704692 15653288 15522538 15312208 15026259 14672049 14259731 13801958 13313097
59432A3313097n05333n08241m99332m80797m55156m24659l90759l54502l17247
59423I377071k80494k45058k10937j77987j46251j15587q5584n6117k7578k19
59413H031259K6423N2911P8921J03423J25975J47320J68344J88731K07171K22677
59403I353155K35054K43871K47669K44864K34963K18181J94066J61517J20497
59394A1253837P2950K1545l2090q7295j42888j96257k44037k83573l13955l35929
59384I712308l50825l59397l61666l57780l48775l36424l22394l07397k91013
59375F676637k72620k52783k33324k15448j98402j80837j63158j47197j33621
59366D879247j21096j08373r5779q3996p2643o1095m9675l9053k9326k0594j3476
$$ plain form
59432 13313097 12807764 12299523 11800191 11319394 10864238 10439579 10048820 9694318 9377071
59423 9377071 9096577 8851519 8640582 8462595 8316344 8200757 8115173 8059056 8031478 8031259
59413 8031259 8057682 8110593 8189514 8292937 8418912 8566232 8734576 8923307 9130478 9353155
59403 9353155 9588209 9832080 10079749 10324613 10559576 10777757 10971823 11133340 11253837
59394 11253837 11326787 11348332 11316242 11228947 11086059 10889802 10645765 10362192 10048237 9712308
59384 9712308 9361483 9002086 8640420 8282640 7933865 7597441 7275047 6967650 6676637
59375 6676637 6404017 6151234 5917910 5702462 5504060 5323223 5160065 5012868 4879247
59366 4879247 4758151 4649778 4553999 4470003 4397360 4336265 4286590 4247537 4218211 4197617 4184141
59355D184141p869k213M805J2633K0236K7966L6122M2471M3701L9507L3136K7701
59343D462337K4011K2464K4550L0964L9976M9409N9117O9880Q0616Q8620R2592
59332E044536R4021R5460R8611J04333J13416J26312J42331J59793J77327J95022
59322F351162K14071K35313K58406K82711L08476L36487L66751L98381M30967
59313I182725M65281N02127N41084N80856O20460O59485O97196P31717P60085
59304A4741016P79148P86652P81692P64291P34793O94065O44082N87884N28959
59295B1042582M70615M15211L63222L13314K64012K14956J65785J14406N7761
59286B3421864n806p6054j52417k34398l20052m05724m87991n64613o33125o90155
$$ plain form
59355 4184141 4176272 4174059 4178864 4191497 4211733 4239699 4275821 4318292 4361993 4401500 4434636 4462337
59343 4462337 4486348 4508812 4533362 4564326 4604302 4653711 4712828 4782708 4863324 4951944 5044536
59332 5044536 5138557 5234017 5332628 5436961 5550377 5676689 5819020 5978813 6156140 6351162
59322 6351162 6565233 6800546 7058952 7341663 7650139 7986626 8353377 8751758 9182725
59313 9182725 9648006 10150133 10691217 11272073 11892533 12552018 13249214 13980931 14741016
59304 14741016 15520164 16306816 17088508 17852799 18587592 19281657 19925739 20513623 21042582
59295 21042582 21513197 21928408 22291630 22604944 22868956 23083912 23249697 23364103 23421864
59286 23421864 23416058 23340004 23187587 22953189 22633137 22227413 21739422 21174809 20541684 19851529
59276A9851529p33413p63115p80390p85410p78420p61374p36800p05729o68433
59267A3138445o26811n84200n42761n02444m62617m23310l84676l46750l10268
59258H954608k76533k45957k17619j90810j66054j43993j24117j05386q7525p0894
59248G325720n5460m0646k6125j2189N78J1678K0968K8930L6472M4034N0997N6355
59236G441312N9805O1685O2006O0254N6411N1598M7122M3148L8895L4061K9477
59225G985774K6184K4538K4623K6924L1877L8981M7183N6134O6357P8117R0878
59214H497570J04106J17532J29922J38417J40262J35144J25105J12304R7606Q1155
59204I679123O3121M3380K1459k426k6746m9704p0572q9275j05080j16687j23621
$$ plain form
59276 19851529 19118116 18355001 17574611 16789201 16010781 15249407 14512607 13806878 13138445
59267 13138445 12511634 11927434 11384673 10882229 10419612 9996302 9611626 9264876 8954608
59258 8954608 8678075 8432118 8214499 8023689 7857635 7713642 7589525 7484139 7396614 7325720
59248 7325720 7270260 7229614 7203489 7191300 7191878 7203556 7224524 7253454 7289926 7333960 7384957 7441312
59236 7441312 7501117 7562802 7624808 7685062 7741473 7793071 7840193 7883341 7922236 7956297 7985774
59225 7985774 8011958 8036496 8061119 8088043 8119920 8158901 8206084 8262218 8328575 8406692 8497570
59214 8497570 8601676 8719208 8849130 8987547 9127809 9262953 9388058 9500362 9597968 9679123
59204 9679123 9742244 9785624 9807083 9804657 9777911 9728207 9657635 9568360 9463280 9346593 9222972
59193I222972j26469j25677j21268j14216j06655r9554r1285q0186o7900n8111
59183H231651n2050m7481m2703l9106l8343l9012l8335l5935l3638l2234l0694
59172G802120k8248k4880j9715j1183O40J3900K7832M3799O2747Q3627J05619
59161H056258J30044J58389J89680K21616K53283K85012L16261L45599L72511
59152A0328653L97296M18834M33667M37742M28317M04170L65031L11398K44501
59143A3769609J66253P9271j3307j08409k03107k93644l74969m42189m92630n26223
59133A1560655n44244n48285n40188n22211m97031m67529m36096m03836l70963
59124G230272l38286l07607k80115k55228k31803k09904j90370j73213j57467
$$ plain form
59193 9222972 9096503 8970826 8849558 8735342 8628687 8529133 8437848 8357662 8289762 8231651
59183 8231651 8179601 8132120 8089417 8050311 8011968 7972956 7934621 7898686 7865048 7832814 7802120
59172 7802120 7773872 7748992 7729277 7718094 7718734 7732634 7760466 7804265 7867012 7950639 8056258
59161 8056258 8186302 8344691 8534371 8755987 9009270 9294282 9610543 9956142 10328653
59152 10328653 10725949 11144783 11578450 12016192 12444509 12848679 13213710 13525108 13769609
59143 13769609 13935862 14015133 14001826 13893417 13690310 13396666 13021697 12579508 12086878 11560655
59133 11560655 11016411 10468126 9927938 9405727 8908696 8441167 8005071 7601235 7230272
59124 7230272 6891986 6584379 6304264 6049036 5817233 5607329 5416959 5243746 5086279
59115E086279j42376j27756j13418r9307q6083p4632o4802n5467m5900l6521k8196
59104D211821k1318j5563j0146m380J726P726J3758K0589K8251L5486M1359M6561
59092D355870N1997N6998O0411O2977O6831P2636P8796Q3836Q7977R1822R4717
59081E164868R5423R3676R0369Q6506Q2430P7715P1665O4123N5750M7231L8502
59070E968258K9408K0696J3459P851L333L3j285o64Q83K965O559J2615K0787L0016
59056F114914L9690M9845O0654P2049Q3502R4233J04135J14240J25509J37391
59046F996162J48578J58998J69804J81237J91936K00838K08570K16187K23424
59037H695734K28987K31904K31977K29257K23453K13297J96393J70574J35731
$$ plain form
59115 5086279 4943903 4816147 4702729 4603422 4517339 4442707 4377905 4322438 4276538 4240017 4211821
59104 4211821 4190503 4174940 4164794 4160414 4162140 4169866 4183624 4204213 4232464 4267950 4309309 4355870
59092 4355870 4407867 4464865 4525276 4588253 4655084 4727720 4806516 4890352 4978329 5070151 5164868
59081 5164868 5260291 5353967 5444336 5530842 5613272 5690987 5762652 5826775 5882525 5929756 5968258
59070 5968258 5997666 6018362 6031821 6039672 6043005 6043038 6041753 6041089 6041972 6044937 6051496 6064111 6084898 6114914
59056 6114914 6154604 6204449 6265103 6337152 6420654 6514887 6619022 6733262 6858771 6996162
59046 6996162 7144740 7303738 7473542 7654779 7846715 8047553 8256123 8472310 8695734
59037 8695734 8924721 9156625 9388602 9617859 9841312 10054609 10251002 10421576 10557307
59028A0557307R3691M6203n867o0959j15634j65982k09675k46261k76084k99465
59018I317274l16375l26495l30143l29086l25436l19552l10321k97968k85041
59009F476857k73667k63082k51118k37123k22195k07508j93917j82393j73169
59000D472685j64590j54509j42836j31532j22079j14109j06666r9519r2840q6550
58990C257455q0583p5154p0389o6074o2051n8405n5134n1955m8561m4737m0351
58979B604061l5669l1576k8857k7202k5415k2696j9257j5636j2036q598n828m226
58967B367065l663l320k331m62J682L154L466K905K005R45k56j221j275j35J730
58952B370289L453M329M188L563L425M367N904O833O423N012L303J451q27l367
$$ plain form
59028 10557307 10650998 10697201 10691334 10630375 10514741 10348759 10139084 9892823 9616739 9317274
59018 9317274 9000899 8674404 8344261 8015175 7689739 7370187 7059866 6761898 6476857
59009 6476857 6203190 5940108 5688990 5451867 5229672 5022164 4828247 4645854 4472685
59000 4472685 4308095 4153586 4010750 3879218 3757139 3643030 3536364 3436845 3344005 3257455
58990 3257455 3176872 3101718 3031329 2965255 2903204 2844799 2789665 2737710 2689149 2644412 2604061
58979 2604061 2568392 2536816 2507959 2480757 2455342 2432646 2413389 2397753 2385717 2377119 2371291 2367065
58967 2367065 2363402 2360082 2357751 2357289 2358971 2362125 2365591 2368496 2370501 2371446 2371190 2369969 2368694 2368559 2370289
58952 2370289 2373742 2378071 2382259 2385822 2389247 2393614 2399518 2406351 2412774 2417786 2421089 2422540 2421713 2418346
58938B418346n430o752q261j0967j4231j5866j4572j1661r620r216q899p097m195
58925B291579j690j02J516M107P325R973J1464J2411J3795J5778J7698J9008J9809
58912B422671K0406K0986K1925K3694K6024K7843K8741K9798L2083L4906L6728
58901B725805L7462L8513M0570M2668M3723M3849M3740M3756M4064M5001M6880
58890C196031M9997N4767O1026O7385P2384P6403Q1056Q6619R1642R5515R9660
58879D032485J05266J11488J17114J22567J28893J36012J43556J52407J63607
58870E213395J76354J88807K00427K12019K23977K36256K49784K65940K84416
58861G251375L03376L22147L42199L64839L89435M14793M41096M69425N00094
$$ plain form
58938 2418346 2412916 2406164 2397903 2386936 2372705 2356839 2342267 2330606 2320986 2311770 2302871 2295774 2291579
58925 2291579 2289889 2289787 2291303 2295410 2302735 2312708 2324172 2336583 2350378 2366156 2383854 2402862 2422671
58912 2422671 2443077 2464063 2485988 2509682 2535706 2563549 2592290 2622088 2654171 2689077 2725805
58901 2725805 2763267 2801780 2842350 2885018 2928741 2972590 3016330 3060086 3104150 3149151 3196031
58890 3196031 3246028 3300795 3361821 3429206 3501590 3577993 3659049 3745668 3837310 3932825 4032485
58879 4032485 4137751 4249239 4366353 4488920 4617813 4753825 4897381 5049788 5213395
58870 5213395 5389749 5578556 5778983 5991002 6214979 6451235 6701019 6966959 7251375
58861 7251375 7554751 7876898 8219097 8583936 8973371 9388164 9829260 10298685 10798779
58852A0798779N32451N65896O00219O35152O70304P05385P39866P72375Q00769
58843A6821196Q22893Q37096Q42071Q36304Q17718P83723P31758O60040N68169
58834B3720968M57337L30094J89936M1172j10693k58896l96494n18126o20895
58825B2834403p03964p67650q12678q39565q48723q41809q22830p96701p66226
58816A5634257p31444o92313o50961o10460n72350n36421n02238m69728m38753
58807A0429589m09313l81993l57282l34620l12910k91818k71792k53078k35585
58798G581198k19435k04665j90564j76193j61652j47953j35656j24395j13609
58789F107076j02941r1941q0326o8658n7857m7778l7141k5316j3415k985O009
$$ plain form
58852 10798779 11331230 11897126 12497345 13132497 13802801 14508186 15248052 16020427 16821196
58843 16821196 17644089 18481185 19323256 20159560 20977278 21761001 22492759 23152799 23720968
58834 23720968 24178305 24508399 24698335 24739507 24628814 24369918 23973424 23455298 22834403
58825 22834403 22130439 21362789 20550111 19710546 18861823 18020014 17197184 16400483 15634257
58816 15634257 14902813 14210500 13559539 12949079 12376729 11840308 11338070 10868342 10429589
58807 10429589 10020276 9638283 9281001 8946381 8633471 8341653 8069861 7816783 7581198
58798 7581198 7361763 7157098 6966534 6790341 6628689 6480736 6345080 6220685 6107076
58789 6107076 6004135 5912194 5831868 5763210 5705353 5657575 5620434 5595118 5581703 5578718 5584727
58778E584727J5217K5968L7816M9280N9767P0107Q1031R1875J01697J11126J21827
58767F350438J34148J46865J59530J73410J89226K05666K21476K37582K55468
58758H073809K74671K93824L13385L35183L59757L86109M13882M43662M75211
58749A1369493N07457N40488N75444O11981O47846O81599P13816P44599P71562
58740A7164285P91477Q02451Q03277P91703P64730P19875O55395N70230M64977
58731B3528400L42415K06474O1326q8050k35547l75251n02476o13104p03369p71702
58721B0849116q19912q51074q66669q66947q53414q29495p98880p64438p28372
58712A3469915o91975o55086o17111n78872n42417n08749m76904m45806m15933
$$ plain form
58778 5584727 5599944 5625912 5663728 5713008 5772775 5842882 5923913 6015788 6117485 6228611 6350438
58767 6350438 6484586 6631451 6790981 6964391 7153617 7359283 7580759 7818341 8073809
58758 8073809 8348480 8642304 8955689 9290872 9650629 10036738 10450620 10894282 11369493
58749 11369493 11876950 12417438 12992882 13604863 14252709 14934308 15648124 16392723 17164285
58740 17164285 17955762 18758213 19561490 20353193 21117923 21837798 22493193 23063423 23528400
58731 23528400 23870815 24077289 24138615 24050565 23815018 23439767 22937291 22324187 21620818 20849116
58721 20849116 20029204 19178130 18311461 17444514 16591100 15761605 14962725 14198287 13469915
58712 13469915 12777940 12122854 11505743 10926871 10384454 9875705 9398801 8952995 8537062
58703H537062l88348l62926l38663l15416k94148k75252k57623k39945k22371
58694E842370k06275j92453j80253j68445j56368j44075j31973j20720j10991
58685D430817j02885r5805q9188q2939p6884p0572o4161n8806n5207n2437m9324
58674C632609m6510m5695m7030m8815m9920n0923n2317n3184n2603n1199n0150
58663C084263m9584m9076m9073n0392n2628n4358n5022n5523n6659n7730n7446
58652B496772n5777n4191n3872n4122n3099n0150m6650m4193m2537m0291l7114
58641A964776l4028l1561k8987k5996k3823k3733k5088k6009k5645k4833k4675
58630A670398k5237k5862k6067k5855k5314k4224k2296j9823j7855j7200j7243
$$ plain form
58703 8537062 8148714 7785788 7447125 7131709 6837561 6562309 6304686 6064741 5842370
58694 5842370 5636095 5443642 5263389 5094944 4938576 4794501 4662528 4541808 4430817
58685 4430817 4327932 4232127 4142939 4060000 3983116 3912544 3848383 3789577 3734370 3681933 3632609
58674 3632609 3586099 3540404 3493374 3444559 3394639 3343716 3291399 3238215 3185612 3134413 3084263
58663 3084263 3034679 2985603 2936530 2886138 2833510 2779152 2724130 2668607 2611948 2554218 2496772
58652 2496772 2440995 2386804 2332932 2278810 2225711 2175561 2128911 2084718 2042181 2001890 1964776
58641 1964776 1930748 1899187 1870200 1844204 1820381 1796648 1771560 1745551 1719906 1695073 1670398
58630 1670398 1645161 1619299 1593232 1567377 1542063 1517839 1495543 1475720 1457865 1440665 1423422
58619A423422j6262j3153q583m320j617l54O84K730N954R371J1966J3730J5240
58606A438808J6482J6725J5410J2647Q957N161K278O57p08l168o718j0018j2060
58593A484453j2841j2719j2086j1567j1216r585n293L05L893M342M278O489J0435
58580A438888J3710J5529J7084J9387K2502K6224K9965L2450L3133L3567L5832
58569A718271L9862M3843M6986N0227N4151N8076O1762O6365P2647P9381Q4786
58558B376357Q8907R3564J00189J08770J18676J29491J40690J51412J61405J71729
58548C641190J83504J95930K06700K14803K21810K29216K35476K37150K32551
58539E598330K22273K06113J81812J48019J06827O1913J5419l1777p7728j19309
$$ plain form
58619 1423422 1407160 1394007 1385424 1381104 1379487 1379133 1379817 1382547 1388501 1397872 1409838 1423568 1438808
58606 1438808 1455290 1472015 1487425 1500072 1509029 1514190 1516468 1517125 1516417 1513249 1506531 1496513 1484453
58593 1484453 1471612 1458893 1446807 1435240 1424024 1414439 1409146 1409451 1413344 1417686 1421964 1428453 1438888
58580 1438888 1452598 1468127 1485211 1504598 1527100 1553324 1583289 1615739 1648872 1682439 1718271
58569 1718271 1758133 1801976 1848962 1899189 1953340 2011416 2073178 2139543 2212190 2291571 2376357
58558 2376357 2465264 2558828 2659017 2767787 2886463 3015954 3156644 3308056 3469461 3641190
58548 3641190 3824694 4020624 4227324 4442127 4663937 4893153 5128629 5365779 5598330
58539 5598330 5820603 6026716 6208528 6356547 6463374 6525287 6540706 6508929 6431201 6311892
58529F311892j54284j82061k02522k15522k21751k22895k20445k14953k06531
58520D470928j95604j83124j70387j58354j46702j34075j19928j05639r3070q2522
58510C081523p3106o4540n7413n1895m7436m3728m0795l8057l4497k9953k5343
58499B574760k1438j8438j7003j8452k3200k9719l5791m0351m3712m6503m8908
58488B231245n0740n1778n2095n2126n2153n1701m9873m6457m2329l8632l5709
58477A707652l2926k9400k5009k0888j8618j8516j9031j8327j6257j4051j2447
58466A482182j1139j0065j0025j1388j3111j3761j3153j2352j2373j3428j5153
58455A346234j6947j8178j8509j8183j7656j6964j5715j3730j1448r570q411p624
$$ plain form
58529 6311892 6157608 5975547 5773025 5557503 5335752 5112857 4892412 4677459 4470928
58520 4470928 4275324 4092200 3921813 3763459 3616757 3482682 3362754 3257115 3164045 3081523
58510 3081523 3008417 2943877 2886464 2834569 2787133 2743405 2702610 2664553 2630056 2600103 2574760
58499 2574760 2553322 2534884 2517881 2499429 2476229 2446510 2410719 2370368 2326656 2280153 2231245
58488 2231245 2180505 2128727 2076632 2024506 1972353 1920652 1870779 1824322 1781993 1743361 1707652
58477 1707652 1674726 1645326 1620317 1599429 1580811 1562295 1543264 1524937 1508680 1494629 1482182
58466 1482182 1471043 1460978 1450953 1439565 1426454 1412693 1399540 1387188 1374815 1361387 1346234
58455 1346234 1329287 1311109 1292600 1274417 1256761 1239797 1224082 1210352 1198904 1189334 1180923 1173299
58443A173299o515m662k410o62J3J80J048K986M824N172M315M095N689Q257J0153
58428A205782J0884J1055J0949J0157Q637P135O306O036N792N128L720J495j106
58415A291970l495n656p986j0411j2260j3103j3107j2540j1654j1011j1025j1099
58403A168623j0048p737n441m389m734n967p385q023p349o334o527p743q113o980
58389A071853o047o654p553o896n099l941l757l361k217r38J79J432K627L198
58375A032826L431M187N244N300L934K429K063K541K716K121J211N00%n20j107
58360A066876j506j417p53M41K135M071N661O600P427Q697R861R993R584J0227
58346A137897J2240J4048J4530J4545J5165J5767J5159J3582J2210J1258R854
$$ plain form
58443 1173299 1166784 1162122 1159712 1159050 1159063 1159243 1160291 1163277 1168101 1173273 1177588 1181683 1187372 1195629 1205782
58428 1205782 1216666 1227721 1238670 1248827 1257464 1264599 1270905 1276941 1282733 1287861 1291581 1293076 1291970
58415 1291970 1288475 1282819 1274833 1264422 1252162 1239059 1225952 1213412 1201758 1190747 1179722 1168623
58403 1168623 1158575 1150838 1145397 1141008 1136274 1130307 1122922 1114899 1107550 1101216 1094689 1086946 1078833 1071853
58389 1071853 1065806 1059152 1051599 1044703 1039604 1035663 1031906 1028545 1026328 1025390 1025569 1027001 1029628 1032826
58375 1032826 1036257 1040444 1045688 1050988 1054922 1057351 1059414 1061955 1064671 1066792 1068003 1068503 1068503 1067983 1066876
58360 1066876 1065370 1063953 1063200 1063641 1065776 1069847 1075508 1082108 1089535 1098232 1108093 1118086 1127670 1137897
58346 1137897 1150137 1164185 1178715 1193260 1208425 1224192 1239351 1252933 1265143 1276401 1286255
58335A286255P335L785k49l774n809o585p599r678j1941j3483j4974j7508k0866
58322A184909k4092k6648k7771k5893k0508j3729q252m405p69L098O434R178J1970
58309A063522J4348J4907J3543J2069J2133J3555J4994J5480J5174J5015J5449
58298A220189J5471J3866J1664J1654J4570J7484J7517J5505J4139J4016J3843
58287A379918J3410J3751J4850J5441J4855J3219J0437O861M197L787M638N145
58275A500509N750P630R838J0561J0409J1442J3395J4077J3390J3699J5975J8598
58263A645273K0449K2208K3997K4693K4442K5079K7010K8334K8083K7836K8766
58252A926170K9490K8500K6871K6758K8412L0106L0253K8730K6751K5785K6023
$$ plain form
58335 1286255 1293590 1297375 1297126 1293352 1287543 1280958 1273359 1263681 1251740 1238257 1223283 1205775 1184909
58322 1184909 1160817 1134169 1106398 1080505 1059997 1046268 1038016 1033611 1032842 1035940 1042374 1051552 1063522
58309 1063522 1077870 1092777 1106320 1118389 1130522 1144077 1159071 1174551 1189725 1204740 1220189
58298 1220189 1235660 1249526 1261190 1272844 1287414 1304898 1322415 1337920 1352059 1366075 1379918
58287 1379918 1393328 1407079 1421929 1437370 1452225 1465444 1475881 1482742 1486939 1490726 1495364 1500509
58275 1500509 1506259 1513889 1523727 1534288 1544697 1556139 1569534 1583611 1597001 1610700 1626675 1645273
58263 1645273 1665722 1687930 1711927 1736620 1761062 1786141 1813151 1841485 1869568 1897404 1926170
58252 1926170 1955660 1984160 2011031 2037789 2066201 2096307 2126560 2155290 2182041 2207826 2233849
58241B233849K6171K5603K5716K7567K9403K8985K7652K8961L3349L7375L8785
58230B563416L9349M1684M5797M9900N2733N4024N4470N5755N9067O3417O7003
58219C146615O9893P3185P6280P7783P8818Q2079Q7430R1812R4106R6671J01130
58208D075802J05759J08463J09674J11022J13214J16079J18787J19785J18692
58199E097277J18116J21152J27440J34488J42106J51896J62964J72601J81434
58190F409474J93363K09715K27850K46352K67135K91182L16515L41949L68877
58181H872412L97927M27509M57042M88040N21250N56267N94413O37772O85090
58172A3637722P32970P81308Q32875Q87684R43158R99596J059334J120582J179093
$$ plain form
58241 2233849 2260020 2285623 2311339 2338906 2368309 2397294 2424946 2453907 2487256 2524631 2563416
58230 2563416 2602765 2644449 2690246 2740146 2792879 2846903 2901373 2957128 3016195 3079612 3146615
58219 3146615 3216508 3289693 3365973 3443756 3522574 3604653 3692083 3783895 3878001 3974672 4075802
58208 4075802 4181561 4290024 4399698 4510720 4623934 4740013 4858800 4978585 5097277
58199 5097277 5215393 5336545 5463985 5598473 5740579 5892475 6055439 6228040 6409474
58190 6409474 6602837 6812552 7040402 7286754 7553889 7845071 8161586 8503535 8872412
58181 8872412 9270339 9697848 10154890 10642930 11164180 11720447 12314860 12952632 13637722
58172 13637722 14370692 15152000 15984875 16872559 17815717 18815313 19874647 20995229 22174322
58163B2174322J236450J299493J370733J446713J526602J614427J712003J818540
58155C4199283J938501K080370K245593K428024K625780K843231L080192L332064
58147E4773038L604546L916439M285104M721759N243095N871306O617925P483565
58139I6516777Q477285R616088J0897244J2288286J3750136J5256138J6802988
58132A83604942J8452921K0375395K2784832K5775009K9185663L2543959L4968988
58125C67691709L5099627L1421749K3158237J1126957k341104j4549117k3713720
58118D27894338k9396919l2065290l2472361l1346301k9309069k6824745k4177910
58111B22301743k1532740j9001856j6653615j4502995j2538634j0750519r124219
$$ plain form
58163 22174322 23410772 24710265 26080998 27527711 29054313 30668740 32380743 34199283
58155 34199283 36137784 38218154 40463747 42891771 45517551 48360782 51440974 54773038
58147 54773038 58377584 62294023 66579127 71300886 76543981 82415287 89033212 96516777
58139 96516777 104994062 114610150 125507394 137795680 151545816 166801954 183604942
58132 183604942 202057863 222433258 245218090 270993099 300178762 332722721 367691709
58125 367691709 402791336 434213085 457371322 468498279 466157175 451608058 427894338
58118 427894338 398497419 366432129 333959768 302613467 273304398 246479653 222301743
58111 222301743 200769003 181767147 165113532 150610537 138071903 127321384 118197165
58104A18197165p639883o297996n121575m109826l203432k308899j348128l03211
58096H7864215P20136J439449J476332O07046j012412k889846m493230n528492
58088G8183198n985695o002831n729900n284385m759057m225805l729770l290204
58080C9175551k909688k583092k302674k060697j850818j668327j509569j371333
58072B2919353j250959j146712j057182r80268r13611q55817q05806p60990p17951
58063A4430057o75356o34478n96522n61214n28260m98015m70056m43093m16948
58054I606115l92938l72099l54892l42210l34045l27224l17710l05566k94498
58045F564933k85985k77338k66386k54407k42945k31112k17937k04430j91339
$$ plain form
58104 118197165 110557282 104259286 99137711 95027885 91824453 89515554 88167426 87864215
58096 87864215 88584351 90023800 91500132 92107178 91094766 88204920 83711690 78183198
58088 78183198 72197503 66194672 60464772 55180387 50421330 46195525 42465755 39175551
58080 39175551 36265863 33682771 31380097 29319400 27468582 25800255 24290686 22919353
58072 22919353 21668394 20521682 19464500 18484232 17570621 16714804 15908998 15148008 14430057
58063 14430057 13754701 13120223 12523701 11962487 11434227 10936212 10466156 10023063 9606115
58054 9606115 9213177 8841078 8486186 8143976 7809931 7482707 7164997 6859431 6564933
58045 6564933 6278948 6001610 5735224 5480817 5237872 5006760 4788823 4584393 4393054
58036D393054j77547j62671j48773j37580j28051j18433j08787r9986r2301q6269
58026C132656q2809q1260p9514p7254p6493p7638p7814p4871p0563o7706o6512
58015B300222o5478o3841o1341n7588n3399n0756m9840m8236m4601m0858l8995
58004A725289l8005l5889l2612k9106k5508k2202k0441k0090j8949j6290j4628
57993A451569j5728j7314j6439j3907j2451j2390j2108j1345j0930j0429q944
57982A309584p342p040p360o594m928l904l749l509l127l131l019k124j336j781
57968A250640k688k709k467l441n052n434m467l550k903j628o7N79Q12K309M705
57953A224639N572M070K136J377J149P05R63K679M392L943J339j148j486K99K608
$$ plain form
58036 4393054 4215507 4052836 3904063 3766483 3638432 3519999 3411212 3311226 3218925 3132656
58026 3132656 3049847 2968587 2889073 2811819 2735326 2657688 2579874 2505003 2434440 2366734 2300222
58015 2300222 2234744 2170903 2109562 2051974 1998575 1947819 1897979 1849743 1805142 1764284 1725289
58004 1725289 1687284 1651395 1618783 1589677 1564169 1541967 1521526 1501436 1482487 1466197 1451569
57993 1451569 1435841 1418527 1402088 1388181 1375730 1363340 1351232 1339887 1328957 1318528 1309584
57982 1309584 1302242 1295202 1287842 1281248 1276320 1272416 1268667 1265158 1262031 1258900 1255881 1253757 1252421 1250640
57968 1250640 1247952 1245243 1242776 1239335 1234283 1228849 1224382 1220832 1217929 1216301 1216234 1216813 1217625 1219934 1224639
57953 1224639 1230211 1234281 1236417 1237794 1238943 1239648 1240611 1243290 1247682 1251625 1252964 1251816 1250330 1250629 1253237
57938A253237M127M980O061P360P645O033L106j1k970n979r162j2903j7821k3449
57924A220254k7931l0067l0778l1319l1107k8743k4404j9545j4960j0754p604
57913I63042o140n415l739j059J094J864J789J378O85K85J067K602L163J907o4
57898I62459j247j412j350j691k398k982l084l007l351l974m082l876m817p212
57884I17976q733p041l184m50j38m24N79K513L846L744K313K53j252j439j110
57869I07453j864l937n873o714p355r133j1962j4500j5647j5319j4194j3086j2413
57856G75456j2049j1708j1172j0124q316o314n295n421n201l323m37J909L325
57843G01330M301M607L785K870L700O291Q456Q570P369O483O391O421N871M470
$$ plain form
57938 1253237 1257364 1262344 1268405 1275765 1283410 1289443 1292549 1292538 1289568 1283589 1274427 1261524 1243703 1220254
57924 1220254 1192323 1162256 1131478 1100159 1069052 1040309 1015905 996360 981400 970646 963042
57913 963042 956902 951487 947748 946689 947783 949647 951436 952814 953499 953784 954851 957453 960616 962523 962459
57898 962459 961212 959800 958450 956759 954361 951379 948295 945288 941937 937963 933881 930005 925188 917976
57884 917976 909243 902202 899018 898568 898430 898006 898585 901098 904944 908688 911001 911254 910002 908563 907453
57869 907453 905589 901652 895779 889065 881710 872577 860615 846115 830468 815149 800955 787869 775456
57856 775456 763407 751699 740527 730403 722087 715773 710478 705057 699856 696533 696096 698005 701330
57843 701330 705631 710238 714023 716893 720593 726884 735340 743910 751279 757762 764153 770574 776445 780915
57829G80915K386K43j347k439l514m668n647o481p328p862p733p469p857q529
57815G12670q387p416o721o535n553k901L63K489L017K869L122M270O185Q121
57801G05593R130Q900Q111P606P474P104N977M277K804K222K199J590k66k650
57787G70071m236m439l779l312l946n800p687p988o544n009m759n291n488n376
57773F96417n447n240m170k992k885l567l966m243n215o298o120n145n378p204
57759F28547q658q504p971q551r907j0944j1364j1069r585p187n253m355l370
57746E21829j591k92p83k139k490j562l47R39K792M904O468P751R539J1045J0264
57731E66327O883L304J873K170K109R52J20J176L975P041R131J0008R922Q922
$$ plain form
57829 780915 783301 783544 782197 779758 776244 771576 765929 759448 752120 744258 736525 729056 721199 712670
57815 712670 704283 696867 690146 683611 678058 675157 675520 678009 681026 683895 687017 691287 697472 705593
57801 705593 714723 723623 731734 739340 746814 753918 759895 764172 766976 769198 771397 772987 772721 770071
57787 770071 765835 761396 757617 754305 750359 744559 736872 728884 722340 717331 712572 707281 701793 696417
57773 696417 690970 685730 681560 678568 675683 672116 668150 663907 658692 652394 646274 641129 635751 628547
57759 628547 619889 611385 603414 594863 584956 574012 562648 551579 541994 534807 529554 525199 521829
57746 521829 520238 519946 519163 517024 514534 512972 512625 513564 516356 521260 527728 535479 545018 556063 566327
57731 566327 573210 576514 578387 580557 582666 583618 583738 584914 588889 595930 605061 615069 624991 633913
57717F33913O880L963P77k010m098n676p203q960j0708j1931j2397j2263j1579
57704E58708j0183q373p086o942p424p453o542m953l235k014j712j830j140P36
57690D90557K565L235L447M453N809O052N335N478P179Q921R268Q727Q465Q465
57676E77956P971O886N718M673L655K858K725L412M566N466N474M839M834O384
57662F47417Q705J0155J0343J0328J0792J1298J1591J2271J3659J5156J6276J7283
57650G95274J8299J8795J8637J8588J9206K0185K1355K3255K5996K8581L0250
57639A038421L1504L2983L4373L5361L6777L9509M2925M5559M6999M8225N0372
57628A483008N4018N9218O5444P1708P7452Q3134Q9640R7570J07376J19296J32595
$$ plain form
57717 633913 640793 644756 645533 643523 639425 633749 626546 617586 606878 594947 582550 570287 558708
57704 558708 548525 540152 533066 526124 518700 511247 504705 499752 496517 494503 492791 490961 489821 490557
57690 490557 493122 496357 499804 504257 510066 516118 521453 526931 534110 543031 552299 561026 569491 577956
57676 577956 585927 592813 598531 603204 606859 609717 612442 615854 620420 625886 631360 636199 641033 647417
57662 647417 656122 666277 676620 686948 697740 709038 720629 732900 746559 761715 777991 795274
57650 795274 813573 832368 851005 869593 888799 908984 930339 953594 979590 1008171 1038421
57639 1038421 1069925 1102908 1137281 1172642 1209419 1248928 1291853 1337412 1384411 1432636 1483008
57628 1483008 1537026 1596244 1661688 1733396 1810848 1893982 1983622 2081192 2188568 2307864 2440459
57617B440459J45793J58434J71772J86932K03244K19313K34732K49589K63140
57608D273408K74394K83235K89143K88589K75076K42401J88078J15019L1606n0552
57598F210397j21503j77072k18031k45789k60430k62921k56929k46826k34582
57589D186314k19915k02981j85517j69227j54164j39457j25078j12053j00838
57580B777084r0455p9783o9260o0306n3128m6058l7482k7691j8358j0717m765
57569B279081K27N141J0571J6380K1871K6850L2300L9392M7941N6414O3675P0414
57557B670257P8513Q8924J00304J10199J17717J24531J32602J41538J49090J53884
57547C867559J56203J55992J51503J40652J22869R9038P0429L8179L220l3630
$$ plain form
57617 2440459 2586252 2744686 2916458 3103390 3306634 3525947 3760679 4010268 4273408
57608 4273408 4547802 4831037 5120180 5408769 5683845 5926246 6114324 6229343 6260949 6210397
57598 6210397 6088894 5911822 5693791 5448002 5187572 4924651 4667722 4420896 4186314
57589 4186314 3966399 3763418 3577901 3408674 3254510 3115053 2989975 2877922 2777084
57580 2777084 2686629 2606846 2537586 2477280 2424152 2378094 2340612 2312921 2294563 2283846 2279081
57569 2279081 2279308 2284449 2295020 2311400 2333271 2360121 2392421 2431813 2479754 2536168 2599843 2670257
57557 2670257 2748770 2837694 2937998 3048197 3165914 3290445 3423047 3564585 3713675 3867559
57547 3867559 4023762 4179754 4331257 4471909 4594778 4693816 4764245 4802424 4805644 4772014
57537D772014p0705j04751j32425j53033j68434j79803j86076j86447j82695j77466
57527C230179j71437j63786j54611j45114j35830j26260j16246j06473r7611q9669
57517A923142q2182p4572o6883o0476n6919n5494n3121m7897m1415l6233l2410
57506A315540k8488k4690k2645k2327k1725j9686j7011j4529j2027r497p717o907
57494A108291o106m475k238j28J158J148M77J252M882R663J2385J2400J2072J3083
57480A163864J4649J6107J8628K2830K6803K8445K8428K8943L0688L3012L6175
57469A448572M1093M6991N1461N3451N4803N8131O4032P1029P7670Q3913R0444
57458B141590R7204J03126J07507J11112J15053J18621J19223J14884J06096R4521
$$ plain form
57537 4772014 4701309 4596558 4464133 4311100 4142666 3962863 3776787 3590340 3407645 3230179
57527 3230179 3058742 2894956 2740345 2595231 2459401 2333141 2216895 2110422 2012811 1923142
57517 1923142 1840960 1766388 1699505 1639029 1582110 1526616 1473495 1425598 1384183 1347950 1315540
57506 1315540 1287052 1262362 1239717 1217390 1195665 1175979 1158968 1144439 1132412 1122915 1115198 1108291
57494 1108291 1102185 1097710 1095472 1095344 1096502 1097650 1098127 1099379 1104261 1113924 1126309 1138709 1150781 1163864
57480 1163864 1178513 1194620 1213248 1236078 1262881 1291326 1319754 1348697 1379385 1412397 1448572
57469 1448572 1489665 1536656 1588117 1641568 1696371 1754502 1818534 1889563 1967233 2051146 2141590
57458 2141590 2238794 2341920 2449427 2560539 2675592 2794213 2913436 3028320 3134416 3228937
57448C228937Q0638O3474M2248J7419r680l7251o2944q4217r9532j09256j15113
57437B914723j18582j19796j18073j13320j06632r9340r1984q4632p7729p1863
57427A912772o6818o1605n5473m8420m0785l3153k6622k2228j9642j7136j3318
57416A507572q414l519R39N390J0144J4809J8793K2114K5463K9384L3620L7674
57404A693969M1935M7462N4327O1063O6529P1542P7645Q4778R1427R6614J00407
57393B487698J02693J02931J01166R7776R1982Q1977O6890M7399K4296j937k9704
57382C173167n6219p9747j00401j17880j30130j35727j36332j35022j32998j29401
57372B019310j23695j16573j08900j01246r4310q8388q2468p5250o7124o0039
$$ plain form
57448 3228937 3309575 3373049 3415297 3432716 3423036 3385785 3322841 3238624 3139092 3029836 2914723
57437 2914723 2796141 2676345 2558272 2444952 2338320 2238980 2146996 2062364 1984635 1912772
57427 1912772 1845954 1784349 1728876 1680456 1639671 1606518 1579896 1557668 1538026 1520890 1507572
57416 1507572 1499158 1495639 1496578 1501968 1512112 1526921 1545714 1567828 1593291 1622675 1656295 1693969
57404 1693969 1735904 1783366 1837693 1898756 1965285 2036827 2114472 2199250 2290677 2387291 2487698
57393 2487698 2590391 2693322 2794488 2892264 2984246 3066223 3133113 3180512 3204808 3202871 3173167
57382 3173167 3116948 3037201 2936800 2818920 2688790 2553063 2416731 2281709 2148711 2019310
57372 2019310 1895615 1779042 1670142 1568896 1474586 1386198 1303730 1228480 1161356 1101317
57362A101317n5145n1750m8744m5963m3614m1229l8060l4165l0460k7687k5652
57351F58848k3644k1543k0183k0272k1037k0692j8436j5312j2716j0938r713r346
57339D55016j0087j1066j1120j0524j0539j1236j1154r535p667p234q181r083
57327C37590r029q272p324o321n276m381l787l414l098k776k515k601l338m529
57313B70929n202m398k352n00l6p95j848k785l803m701m654l292j377j9L76o8
57297B35475j255k890m081m128l552l543m234m414l161j136K16J75q39j965k439
57282A98229j845m39Q20J036K99l62r9R07J891K685L921N820P317P127N547M194
57266B37048L830L471K283J167J431K657L305K970K660K925L140K867K611K776
$$ plain form
57362 1101317 1046172 994422 945678 899715 856101 814872 776812 742647 712187 684500 658848
57351 658848 635204 613661 593478 573206 552169 531477 513041 497729 485013 474075 464362 455016
57339 455016 444929 433863 422743 412219 401680 390444 379290 369755 362088 354854 346673 337590
57327 337590 328561 320289 312965 306644 301368 296987 293200 289786 286688 283912 281397 278796 275458 270929
57313 270929 265727 261329 258977 258477 258441 257646 255798 253013 249210 244509 239855 236563 235186 235167 235543 235475
57297 235475 234220 231330 227249 223121 219569 216026 211792 207378 204217 203081 203297 203472 202633 200668 198229
57282 198229 196384 195945 196765 197801 198100 197738 197639 198546 200437 203122 207043 212863 220180 227307 232854 237048
57266 237048 240878 244349 246632 247799 249230 251887 255192 258162 260822 263747 266887 269754 272365 275141
57252B75141K941K800K981M315O674R006J0241J0157R657J0074J1710J3367J4008
57239C83072J4282J5440J7226J8350J8813K0163K3293K7501L1847L5788L8258
57228F44033L8109L6086L4436L3769L2376K9825K8920L2144L7953M2915M6232
57217A036798M9597N3409N6021N6649N6471N6267N5089N2131M8198M4230L9711
57206A604571L3656K6345J9000J2187N563j037o932j1250j3872j5533j7000j8209
57194A617489j8345j6755j3587r654n946l228j459L58L062N935P371P162P044
57181A579447Q366J0335J1456J1753J2372J3775J5662J8189K1871K6439L0988
57170A760653L5136L8980M2075M3621M3686M3178M2427M0813L8070L4965L2405
$$ plain form
57252 275141 278082 280882 283863 288178 294852 303858 314099 324256 333913 343987 355697 369064 383072
57239 383072 397354 412794 430020 448370 467183 487346 510639 538140 569987 605775 644033
57228 644033 682142 718228 752664 786433 818809 848634 877554 909698 947651 990566 1036798
57217 1036798 1086395 1139804 1195825 1252474 1308945 1365212 1420301 1472432 1520630 1564860 1604571
57206 1604571 1638227 1664572 1683572 1695759 1701322 1700285 1693353 1682103 1668231 1652698 1635698 1617489
57194 1617489 1599144 1582389 1568802 1559148 1553202 1549974 1548515 1548873 1551935 1557870 1565241 1572403 1579447
57181 1579447 1587813 1598148 1609604 1621357 1633729 1647504 1663166 1681355 1703226 1729665 1760653
57170 1760653 1795789 1834769 1876844 1920465 1964151 2007329 2049756 2090569 2128639 2163604 2196009
57159B196009L0548K9184K8461K8824L0501L3276L6607M0092M3924M8532N3588
57148B599546N7860O0527O2001O2914O3064O2286O1588O2094O3272O3666O3282
57137C282100O3798O6174O9420P2295P5135P9150Q4490Q9754R3167R3891R2456
57126D161830R0131Q7755Q5314Q2757Q0708P9611P8574P6108P2093O7985O4892
57115E027758O2325N9368N6115N3301N1058M8843M6361M3833M1312L8328L4540
57104E563142L0372K6578K3240J9648J5351J0872O962L564J02l448o621r458j2442
57091E667862j5434j7745j9551k1962k5141k7590k8237k8138k8928l0487l1538
57080E393111l2149l4325m0163n0369o4317q0547r7246j13439j30240j50267j75422
$$ plain form
57159 2196009 2226557 2255741 2284202 2313026 2343527 2376803 2413410 2453502 2497426 2545958 2599546
57148 2599546 2657406 2717933 2779934 2842848 2905912 2968198 3029786 3091880 3155152 3218818 3282100
57137 3282100 3345898 3412072 3481492 3553787 3628922 3708072 3792562 3882316 3975483 4069374 4161830
57126 4161830 4251961 4339716 4425030 4507787 4588495 4668106 4746680 4822788 4894881 4962866 5027758
57115 5027758 5090083 5149451 5205566 5258867 5309925 5358768 5405129 5448962 5490274 5528602 5563142
57104 5563142 5593514 5620092 5643332 5662980 5678331 5689203 5696165 5699729 5699831 5696383 5689762 5680304 5667862
57091 5667862 5652428 5634683 5615132 5593170 5568029 5540439 5512202 5484064 5455136 5424649 5393111
57080 5393111 5360962 5326637 5286474 5236105 5171788 5091241 4993995 4880556 4750316 4600049 4424627
57069D424627k05331k38116k72493l09071l49596l95119m45485n00872n62968
57060A145576E12039b00388p98268q90652r90179j096692j209874j331922j467495
57051g985470j620277j791443j981969k194243k430438k691393k978248l293559
57043b6967040l640243m021789m444409m917036n448365o045707o715985p464442
57035f9665016q292197r196655j0168896j1182228j2188601j3143149j4032484
57028a47869226j4852968j5544824j5971990j6003757j5615863j4880976j3854909
57021b54594513j2506801j0783242q715706o430178m055252j646037Q05808L320592
57013b94605329N901620Q526757J1130494J3585403J5716928J7354402J8384109
$$ plain form
57069 4424627 4219296 3981180 3708687 3399616 3050020 2654901 2209416 1708544 1145576
57060 1145576 512039 -200388 -998656 -1889308 -2879487 -3976179 -5186053 -6517975 -7985470
57051 -7985470 -9605747 -11397190 -13379159 -15573402 -18003840 -20695233 -23673481 -26967040
57043 -26967040 -30607283 -34629072 -39073481 -43990517 -49438882 -55484589 -62200574 -69665016
57035 -69665016 -77957213 -87153868 -97322764 -108504992 -120693593 -133836742 -147869226
57028 -147869226 -162722194 -178267018 -194239008 -210242765 -225858628 -240739604 -254594513
57021 -254594513 -267101314 -277884556 -286600262 -293030440 -297085692 -298731729 -297925921 -294605329
57013 -294605329 -288703709 -280176952 -269046458 -255461055 -239744127 -222389725 -204005616
57006b04005616J8774255J8569629J7869380J6800395J5494466J4072413J2633615
56999h9791463J1248918R959002Q780576P717302O768680N932964N205670M578068
56991b9600283M038616L575954L179928K839912K544234K282814K049805J842615
56983g246405J659161J497154J354872J230629c82941F41695R37165Q57256P82528
56974C218644P11259O44038N82753N27901M77926M30890L85780L42644L02436
56965G624271K66277K33874K03370J73581J45345J19716R6258P4629N6170M1838
56955I035329K9810J7655N917l021q865j3468j7435j9771k0991k3573k8668l4718
56943H918201m0060m4867n0740o1561q5501j32121k03925k91247l77152m47112
$$ plain form
57006 -204005616 -185231361 -166661732 -148792352 -131991957 -116497491 -102425078 -89791463
56999 -89791463 -78542545 -68583543 -59802967 -52085665 -45316985 -39384021 -34178351 -29600283
56991 -29600283 -25561667 -21985713 -18805785 -15965873 -13421639 -11138825 -9089020 -7246405
56983 -7246405 -5587244 -4090090 -2735218 -1504589 -382941 641695 1578860 2436116 3218644
56974 3218644 3929903 4573941 5156694 5684595 6162521 6593411 6979191 7321835 7624271
56965 7624271 7890548 8124422 8327792 8501373 8646718 8766434 8862692 8937321 8993491 9035329
56955 9035329 9065139 9082794 9088711 9085690 9076825 9063357 9045922 9026151 9005160 8981587 8952919 8918201
56943 8918201 8878141 8833274 8782534 8720973 8635472 8503351 8299426 8008179 7631027 7183915
56933G183915m94185n17823n20915n08006m84213m54297m21919l89089l56305
56924C037163l23889k93020k64899k39512k16591j97202j82579j71499j61006
56915I86966j50082j40397j32718j24952j15071j04032r3926D1070c3752o4163
56905i7915n4426m6489l9108l0711k1331j2295m518K291Q764J4610J8619J9924
56893b42585J8638J4999Q811P18o791j1135j2226j1997j1649j0902r723q852q090
56880b90784o015k173J870M686O928J0087J4277J8313K1329K3434K5060K6150
56868a46838K5568K1483J3272L268m687q870j0829j2679j4580j5470j4853j2899
56856a78114r957o889m903m114l183j198J012K323L014L883M607M283L033J937
$$ plain form
56933 7183915 6689730 6171907 5650992 5142986 4658773 4204476 3782557 3393468 3037163
56924 3037163 2713274 2420254 2155355 1915843 1699252 1502050 1319471 1147972 986966
56915 986966 836884 696487 563769 438817 323746 219714 125788 41070 -33752 -97915
56905 -97915 -152341 -198830 -237938 -268649 -289980 -302275 -306793 -304502 -295738 -281128 -262509 -242585
56893 -242585 -223947 -208948 -200137 -199419 -206210 -217345 -229571 -241568 -253217 -264119 -273842 -282694 -290784
56880 -290784 -296799 -298972 -297102 -292416 -285488 -275401 -261124 -242811 -221482 -198048 -172988 -146838
56868 -146838 -121270 -99787 -86515 -83247 -87934 -96804 -107633 -120312 -134892 -150362 -165215 -178114
56856 -178114 -188071 -194960 -199863 -203977 -207160 -208358 -207346 -205023 -202009 -198126 -193519 -189236 -186203 -184266
56842a84266J656K014K566K767J983K37j379j748j011l43p13k088l320k717M19
56827a85943M526P082P503P505Q077P877N910M030M775P707J0098J0887J1746
56814h8220J4158J7402J9979a5277F656K1866K1970K3460K6568K9884L2088L3744
56802A96236L6413M0295M3765M5245M4529M1851L6446K7079J4080J62j1228j8264
56790D96609k1384k2101k1620k0270j7663j3314p362o94N814J1854J7332K2110
56778D29311K6576L1956L9034M6954N4149O0013O4307O5105N9088M4670K3965
56767I45128J230j9751l6436m7213n1711n1182m7726m3068l7992l2416k5803j8054
56755E35006j0111l110L050R448J6381K2960K8751L4580M0920M6278M7869M3575
$$ plain form
56842 -184266 -182610 -180596 -178030 -175263 -173280 -173043 -174422 -176170 -177181 -177524 -178237 -180325 -183645 -186362 -185943
56827 -185943 -181417 -174335 -166832 -159327 -151250 -143373 -137463 -133433 -128658 -120951 -110853 -99966 -88220
56814 -88220 -74062 -56660 -36681 -15277 6656 28522 50492 73952 100520 130404 162492 196236
56802 196236 232649 272944 316709 361954 406483 448334 484780 511859 525939 526101 514873 496609
56790 496609 475225 453124 431504 411234 393571 380257 372895 372201 378015 389869 407201 429311
56778 429311 455887 487843 526877 573831 627980 687993 752300 817405 876493 921163 945128
56767 945128 946358 926607 890171 842958 791247 740065 692339 649271 611279 578863 553060 535006
56755 535006 524895 521785 524835 534283 550664 573624 602375 636955 677875 724153 772022 815597
56743H15597L2919J7130j090j8450l2444m2023m7172m8622m7765m5716m2305l6883
56731E03176l0107k3639j8155j3099q471n002k113K089P909J3126J6194J8267
56719D60175K0371K0589J6405Q575J36p587j5441k3318k9180l1593l1338k9879
56707C57915k7740k4987k2067j9564j7697j6366j5123j3316j0886q792p819p281
56695A66277n928l908k758l369m794n276l902j351O65R94L47M36J473J666j7j951
56679A38604k020p06k04j143k089k044j617j564j773k009k334k512k200j835k212
56664A12342l093l490l283l350l865l947l396l338m530o079o509n345l162q29
56650E8126R36J958K786L833M279K956M08j223q76N6j93j343j746p74N87J217
$$ plain form
56743 815597 848516 865646 864556 846106 813662 771639 724467 675845 628080 582364 540059 503176
56731 503176 473069 449430 431275 418176 409705 404703 402590 404679 412588 425714 441908 460175
56719 460175 480546 501135 517540 526115 526251 518664 503223 479905 450725 419132 387794 357915
56707 357915 330175 305188 283121 263557 245860 229494 214371 201055 190169 181377 173558 166277
56695 166277 160349 156441 153683 150314 145520 140244 136342 134991 135656 136650 136997 137433 138906 140572 140555 138604
56679 138604 136584 135878 135674 134531 132442 130398 128781 127217 125444 123435 121101 118589 116389 114554 112342
56664 112342 109249 105759 102476 99126 95261 91314 87918 84580 80050 73971 67462 62117 58955 58126
56650 58126 59062 61020 63806 67639 71918 74874 75282 74059 73183 73239 73046 71703 69957 69183 69770 70987
56634G0987J052P61Q49J332K031K978M328N766O333N316L210J327M66M32P73J300
56618A09241J859K193K256K272K274K008J435R37Q51R98R25N57M89J406L060M100
56602A36861L544K131J287Q98l98k484l202j585P4q34l460m686l308q24J358L084
56586A28456L820K480l59k116j304N14R92m2j045j183j007j089j127n08P13J616
56570A28811J297K4q22m34M07O79P22J376K068J445l05j384q46M54J585K528L061
56553A40666K338M72r22o74N31J400J605J413Q87L49N15J442K224K355K303K192
56537A59096J315j28l85J425L517L603J951O10L95L62l3j51M07J049J257J369
56521A75659J860K511K711K211J508J531K684M043M160L003K246L072M582N298
$$ plain form
56634 70987 72039 72800 73649 74981 77012 79990 84318 90084 96417 101733 104943 106270 106736 107168 107941 109241
56618 109241 111100 113293 115549 117821 120095 122103 123538 124475 125326 126324 127249 127806 128295 129701 132761 136861
56602 136861 140405 142536 143823 144721 144323 141839 138637 137052 137126 136292 132832 128146 124838 124014 125372 128456
56586 128456 132276 134756 134397 132281 130977 131491 132483 132441 131396 130213 129206 128117 126990 126482 127195 128811
56570 128811 130108 130132 129310 128876 129283 129962 130684 132060 134128 135573 135268 133884 133038 133492 135077 137605 140666
56553 140666 143004 143476 142554 141880 142411 143811 145416 146829 147716 148065 148580 150022 152246 154601 156904 159096
56537 159096 160411 160283 159898 161323 164840 168443 170394 171004 171399 171761 171728 171577 171984 173033 174290 175659
56521 175659 177519 180030 182741 184952 186460 187991 190675 194718 198878 201881 204127 207199 211781 217079
56507B17079N316N679O336O316N702N795P158Q823R704R750R338Q683Q212Q465
56493C22356R127R142Q387Q204R379J0519R705P220N165M422L439P40k670m528
56479D00607m441m391n989q346r358q372o748o065o585p406p499o401m477k729
56465C11800j999k263k894l546m374n424o375o943o941n973l770j203r4j392l897
56450B54712n493n319m199l222k685k378k162j959j699j615k157l270m065l776
56436B10713k821k305k483k436j474k23K64r4n79p60o05K00J896L638L905K348
56420B09184M10k72N60J975K906K846K215K193L353M519M209L096L384N406O729
56405B52713N557L103J439R12J198K962O198Q408P246M257L369N807Q775R178
$$ plain form
56507 217079 222395 228074 234410 240726 246428 252223 259381 268204 277908 287658 296996 305679 313891 322356
56493 322356 331483 340625 349012 357216 366595 377114 386819 394039 399204 403626 407065 407805 405135 400607
56479 400607 396166 391775 385786 377440 368082 359710 352962 346897 340312 332906 325407 319006 314529 311800
56465 311800 309801 307538 304644 301098 296724 291300 284925 277982 271041 265068 261298 260095 260001 258609 254712
56450 254712 249219 243900 239701 236479 233794 231416 229254 227295 225596 223981 221824 218554 214489 210713
56436 210713 207892 205587 203104 200668 199194 198971 199235 199141 198562 197802 197197 197397 199293 202931 206836 209184
56420 209184 209594 209322 209882 211857 214763 217609 219824 222017 225370 229889 234098 237194 240578 245984 252713
56405 252713 258270 261373 262812 263724 264922 267884 274082 282490 289736 293993 297362 303169 311944 321122
56391C21122O720L232Q52Q32K552L714K908J550J651K551K115M47m83n77j813
56376C47373m320n443l821j680j590l250m824n501n334m391l460l863n358n757
56362B88781l960j652q06j036q57n7N55O07J55o85j271q40k6l08j356r36J586
56345B77894L890M044K929J814J3l012n391n144l141j506o59o2j93j236j422N71
56329B69389K822K707J058Q33K428L570L416L447M219M296L142K245K543K956
56315C09071K455J713J771K527L336L812L629K663J623J372J549J159L41R1L23
56300C37435o5r94r29Q49L201M842N604N615M768L521K897L065L163K932L185
56285C79089M051M255K984J312P30J049Q57m33j825j917l43J864L260L488L622
$$ plain form
56391 321122 327842 331074 331926 332758 335310 339024 341932 343482 345133 347684 349799 350246 349763 349186 347373
56376 347373 343053 337610 333789 332109 330519 327269 322445 316944 311610 307219 303759 299896 294538 288781
56362 288781 284821 283169 282363 281327 280470 280413 280968 281575 281730 281045 279774 278934 278908 278600 277244 276308 277894
56345 277894 281784 285828 288757 290571 290584 287572 282181 277037 273896 272390 271731 271669 271476 270240 268818 269389
56329 269389 272211 274918 275976 276809 279237 282807 286223 289670 293889 298185 301327 303572 306115 309071
56315 309071 311526 313239 315010 317537 320873 324685 328314 330977 332600 333972 335521 336680 337021 337112 337435
56300 337435 337370 336376 335447 336296 339497 344339 349943 355558 360326 363847 366744 369809 372972 375904 379089
56285 379089 383140 387395 390379 391691 392421 393470 394327 393894 392069 390152 389809 391673 394933 398421 402043
56270D02043M635N874N866M458L142L165M215N294O131P172Q595R769R800Q559
56256D88718P153O939Q088R590J0762J1933J3243J3805J2859J1104J0032J0372
56244F14598J1754J3257J3801J2829J1292J0976J2202J3263J2872J1807J1154
56233G49805J0531R421Q737R220R663Q788P772Q657J1182J3499J5234J7316J9368
56220H99193K0031J9746K0584K3124K5957K8487L1705L5747L9191M1535M4116
56209A229416M7825N1928N5953O0619O6030P1008P5351Q0804Q8436R6824J04413
56198B028607J12060J21516J32469J42933J51970J60351J68752J76640J83112
56189C378410J87868J91002J92195J90475J84903J75636J63874J50289J33785
$$ plain form
56270 402043 406678 412552 418418 422876 426018 429183 433398 438692 444823 451995 460590 470359 480159 488718
56256 488718 495871 502810 510898 520488 531250 543183 556426 570231 583090 594194 604226 614598
56244 614598 626352 639609 653410 666239 677531 688507 700709 713972 726844 738651 749805
56233 749805 760336 769757 778494 787714 797377 806165 813937 822594 833776 847275 862509 879825 899193
56220 899193 919224 938970 959554 982678 1008635 1037122 1068827 1104574 1143765 1185300 1229416
56209 1229416 1277241 1329169 1385122 1445741 1511771 1582779 1658130 1738934 1827370 1924194 2028607
56198 2028607 2140667 2262183 2394652 2537585 2689555 2849906 3018658 3195298 3378410
56189 3378410 3566278 3757280 3949475 4139950 4324853 4500489 4664363 4814652 4948437
56180D948437J12606Q6610N7910K9449L526j8827l8009n5259p1124q4749r5304
56169D875266j03308j09678j14285j16747j17867j18793j19476j19659j20517
56160C834936j23161j26087j26574j24580j22790j22522j22058j19832j16912
56151B730420j14977j13526j10515j04896r7568r0462q5173q1665p8131p2927
56141A780580o6558o0849n6486n2634m8610m4371l9718l4773l1018k9846l0092
56130A285625k8989k5565k1192j6961j2904r842r096r701q675n193j987j269j668
56117A132583p89J336L356N310Q054J1046J2763J2902J2697J3371J5226J7885
56105A245740K0542K2396K3397K4215K5350K6873K8879L1249L3017L3279L2729
$$ plain form
56180 4948437 5061043 5147653 5205563 5235012 5238538 5219711 5181702 5126443 5055319 4970570 4875266
56169 4875266 4771958 4662280 4547995 4431248 4313381 4194588 4075112 3955453 3834936
56160 3834936 3711775 3585688 3459114 3334534 3211744 3089222 2967164 2847332 2730420
56151 2730420 2615443 2501917 2391402 2286506 2188938 2098476 2013303 1931638 1853507 1780580
56141 1780580 1714022 1653173 1596687 1544053 1495443 1451072 1411354 1376581 1345563 1315717 1285625
56130 1285625 1256636 1231071 1209879 1192918 1180014 1170172 1161076 1151375 1142700 1137507 1135520 1134251 1132583
56117 1132583 1131794 1133130 1136486 1141796 1149850 1160896 1173659 1186561 1199258 1212629 1227855 1245740
56105 1245740 1266282 1288678 1312075 1336290 1361640 1388513 1417392 1448641 1481658 1514937 1547666
56094A547666L3021L4521L6106L7132L8005L8679L8386L7174L6184L6031L6453
56083A949358L7706M0640M5288N1238N9519P2106Q9062J08056J27125J46053J64673
56072B890824J81665J95417K04139K05136J96448J79883J60244J41013J22842
56063D477611J06329R3194Q3581P4728O3634M9108L0772Q766j4375l4126m8091
56052D891131n8226o8389q1578r9656j22671j47079j67415j81175j90007j95286
56042C579649j95452j88953j76863j60982j42165j22250j04792r1564q0556o9369
56032B246703n8324m8504l9210k9665k1106j5011j0924p785n597m287k896j448
56020B001946j422k917l791l103k730l767m187k286K80J380J886L558N730O830
$$ plain form
56094 1547666 1580687 1615208 1651314 1688446 1726451 1765130 1803516 1840690 1876874 1912905 1949358
56083 1949358 1987064 2027704 2072992 2124230 2183749 2255855 2344917 2452973 2580098 2726151 2890824
56072 2890824 3072489 3267906 3472045 3677181 3873629 4053512 4213756 4354769 4477611
56063 4477611 4583940 4677134 4760715 4835443 4899077 4948185 4978957 4987723 4973348 4939222 4891131
56052 4891131 4832905 4764516 4682938 4583282 4460611 4313532 4146117 3964942 3774935 3579649
56042 3579649 3384197 3195244 3018381 2857399 2715234 2592984 2488192 2396628 2316072 2246703
56032 2246703 2188379 2139875 2100665 2071000 2049894 2034883 2023959 2016174 2010577 2006290 2003394 2001946
56020 2001946 2000524 1997607 1993816 1990713 1987983 1984216 1980029 1977743 1978023 1979403 1981289 1984847 1990577 1997407
56006A997407P453R244J2099J4729J6688J8012J8388J8366J9667K2789K5974K7872
55994B208688K9276L1043L2606L3774L5591L8125M0000M1074M2785M5016M6103
55983B624081M6845N0329N6305O0278O0231N9665O1492O3733O4311O5376O9020
55972C281666P3032P5007P6836Q1062Q6282R0201R3899R9086J04460J08609J13203
55961D283343J19580J25685J30110J35534J44242J54013J62377J70976J81587
55952E607447J91991K00390K09761K23259K39236K55447K73846K96361L20317
55943G818055L43027L66547L92900M19462M44436M71827N05152N41256N76345
55934A1879007O12861O54138O97846P41518P88816Q43017Q99971R55150J011593
$$ plain form
56006 1997407 2004860 2014104 2026203 2040932 2057620 2075632 2094020 2112386 2132053 2154842 2180816 2208688
55994 2208688 2237964 2269007 2301613 2335387 2370978 2409103 2449103 2490177 2532962 2577978 2624081
55983 2624081 2670926 2721255 2777560 2837838 2898069 2957734 3019226 3082959 3147270 3212646 3281666
55972 3281666 3354698 3429705 3506541 3587603 3673885 3764086 3857985 3957071 4061531 4170140 4283343
55961 4283343 4402923 4528608 4658718 4794252 4938494 5092507 5254884 5425860 5607447
55952 5607447 5799438 5999828 6209589 6432848 6672084 6927531 7201377 7497738 7818055
55943 7818055 8161082 8527629 8920529 9339991 9784427 10256254 10761406 11302662 11879007
55934 11879007 12491868 13146006 13843852 14585370 15374186 16217203 17117174 18072324 19083917
55925A9083917J072880J134753J192832J252532J321515J398186J477456J561979
55917B9496050J657359J762655J876766K008061K165749K347179K544973K760157
55909D6618949K996747L251668L524355L829823M188909M614016N118244N727184
55901G9869895O463035P325816Q307224R410901J0639642J1977879J3411225J4948717
55893A62354334J6602286J8370040K0278812K2421952K4905533K7752998L0834954
55886C23520909L3721931L5411571L4293462K8826461J8699866N452367q186072
55879D71740495j9726341k7913504l2696491l4638774l4460579l2869536l0473970
55872B58961300k7704060k4820805k1994951j9347915j6942211j4791869j2897926
$$ plain form
55925 19083917 20156797 21291550 22484382 23736914 25058429 26456615 27934071 29496050
55917 29496050 31153409 32916064 34792830 36800891 38966640 41313819 43858792 46618949
55909 46618949 49615696 52867364 56391719 60221542 64410451 69024467 74142711 79869895
55901 79869895 86332930 93658746 101965970 111376871 122016513 133994392 147405617 162354334
55893 162354334 178956620 197326660 217605472 240027424 264932957 292685955 323520909
55886 323520909 357242840 392654411 426947873 455774334 474474200 479926567 471740495
55879 471740495 452014154 424100650 391404159 356765385 322304806 289435270 258961300
55872 258961300 231257240 206436435 184441484 165093569 148151358 133359489 120461563
55865A20461563j1256271r842459q620792p569444o677244n921142n268598m699745
55857F0605868m208789l786088l415920l089995k807667k563729k348791k159683
55849C6225206j997223j855596j724948j602278j489748j385246j284855j191635
55841B3693677j111514j042737r78715r18845q67054q22168p79217p38476p04103
55832A5730848o75040o45759o14962n85895n59227n32925n07776m85885m65032
55823A0658347m41399m16601l95454l78285l61877l46216l33449l21693l06710
55814G356663k88926k72510k58562k45138k32658k23040k14771k05112j95962
55805E219984j91207j89293j85115j78405j73375j70313j64462j53914j42252
$$ plain form
55865 120461563 109205292 99362833 90742041 83172597 76495353 70574211 65305613 60605868
55857 60605868 56397079 52610991 49195071 46105076 43297409 40733680 38384889 36225206
55849 36225206 34227983 32372387 30647439 29045161 27555413 26170167 24885312 23693677
55841 23693677 22582163 21539426 20560711 19641866 18774812 17952644 17173427 16434951 15730848
55832 15730848 15055808 14410049 13795087 13209192 12649965 12117040 11609264 11123379 10658347
55823 10658347 10216948 9800347 9404893 9026608 8664731 8318515 7985066 7663373 7356663
55814 7356663 7067737 6795227 6536665 6291527 6058869 5835829 5621058 5415946 5219984
55805 5219984 5028777 4839484 4654369 4475964 4302589 4132276 3967814 3813900 3671648
55796C671648j32447j24011j17235j14460j15388j16091j14156j10751j06541
55787B620568j00073r1491q3673p8073p2896o6636o0272n4873n0018m5563m2346
55776A874654m0418l8806l7246l5783l3100k7963k2000j8189j6867j6023j4907
55765A573352j4325j4033j3251j3196j5561j8910k0214j9760k0688k3784k6602
55754A373028k7956k9266l0899l1041k9112k6836k4969k2334j9009j7166j7396
55743A097044j7372j5385j2579j0335q178n633l654k794k011p34j00j008k645
55730A014616l877m394l829j672J034J833j91l188n169o255p393q322q028o274
55716I58891l761j620j052k720o134j0167j3989j6742j7140j4818j1605r760r285
$$ plain form
55796 3671648 3539201 3415190 3297955 3183495 3068107 2952016 2837860 2727109 2620568
55787 2620568 2520495 2429004 2345331 2267258 2194362 2127726 2067454 2012581 1962563 1917000 1874654
55776 1874654 1834236 1795430 1758184 1722401 1689301 1661338 1639338 1621149 1604282 1588259 1573352
55765 1573352 1559027 1544994 1531743 1518547 1502986 1484076 1463862 1444102 1423414 1399630 1373028
55754 1373028 1345072 1315806 1284907 1253866 1224754 1197918 1172949 1150615 1131606 1114440 1097044
55743 1097044 1079672 1064287 1051708 1041373 1033195 1027562 1023908 1021114 1019103 1018369 1018269 1017261 1014616
55730 1014616 1010739 1006345 1002516 1000844 1001878 1003711 1003520 1000332 995163 988908 981515 973193 965165 958891
55716 958891 955130 953510 952458 949738 943604 933437 919448 902706 885566 870748 859143 849383 840098
55703H40098q580p402p130q194r273r327q678p778o503n125m589n394p109r132
55689G35884j1189j3461j6872k2441k9164l3740l4013l1636k9620k8340k6223
55678D59185k3277k1068j9560j6908j2627q570o345n720n767n724m737k699j306
55665C24877k238m474n417m580l825m067m223l658l145k902j993l54P04O97O94
55650B86096J238J444Q46K98L55M73M02P50J520J641M82j381l250m721n039l728
55634B77426k058k084l907n479n294l692j441J085L085L685L389L548M205M286
55620B76754L979M745O805Q690R586R978R668P683M637K728K420J485j501m845
55606C42812o229n671m619l588k120o7K076L426L050J164p0J368M430O024N144
$$ plain form
55703 840098 831518 824116 816986 808792 799519 790192 781514 773736 767233 762108 757519 752125 745016 735884
55689 735884 724695 711234 694362 671921 642757 609017 575004 543368 513748 485408 459185
55678 459185 435908 414840 395280 378372 365745 357175 350830 345110 339343 333619 328882 326183 324877
55665 324877 322639 318165 312748 308168 304343 300276 296053 292395 289250 286348 284355 284001 284705 285402 286096
55650 286096 287334 288778 289624 289922 290277 290750 291152 291902 293422 295063 295545 294164 290914 286193 281154 277426
55634 277426 275368 273284 269377 263898 258604 254912 253471 254556 257641 261326 264715 268263 272468 276754
55620 276754 280733 285478 292283 300973 310559 320537 330205 337888 342525 345253 347673 349158 347657 342812
55606 342812 336583 330912 326293 322705 320585 320518 322594 326020 329070 330234 330164 331532 335962 341986 347130
55591C47130L872L918M506M418L860L269K354J336J337K389K892J977P33J93j16
55576C84068p69j472k369m346p085q741q644q288q587q285o552m972n261o658
55562C02039p360p063o503n858n192n287o587q304r592j0468j0742r597p223n233
55548A97030m406l768k808k665l686m036k455m80q7q27j198j247j753k283k019
55533A63312j321o98L56J752J616j095m160m623k638o34L33R40J272O76m08p21
55517A53959k02R8n6J29J023K171K931K520M02k182k425N97M045M781L426K761
55501A73978L344L410K212O31j117l511n552n391l519k763m518p096q366q122
55487A33620p176n971m782l905l081j952j243j997l512l707j860N52K076K739
$$ plain form
55591 347130 351002 354920 359426 363844 367704 370973 373327 374663 376000 378389 381281 383258 383991 384184 384068
55576 384068 383299 381827 379458 375112 368027 359286 350642 342354 333767 325482 318930 313958 308697 302039
55562 302039 294679 287616 281113 275255 270063 264776 258189 249885 240293 229825 219083 209486 202263 197030
55548 197030 192624 188856 186048 183383 179697 175661 173206 172726 172639 171812 170614 169367 167614 165331 163312
55533 163312 161991 161293 161649 163401 165017 163922 159762 155139 152501 151867 152200 153140 154412 155088 154680 153959
55517 153959 153757 153855 153799 153928 154951 157122 160053 162573 162975 160793 158368 158965 163010 167791 171217 173978
55501 173978 177322 180732 182944 183575 182458 178947 173395 168004 164485 161722 157204 150108 141742 133620
55487 133620 126444 120473 115691 111786 108705 106753 105510 103513 100001 96294 94434 94986 97062 99801
55473I9801K868K194R58M16J214K209J902L94p70l20J580L525M023K854J292P13
55457A24853J269K281L287M039M128L582L129K990K230L69j280j299l28N2k20
55442A49082j79p2q71k040k087j258j332k664l698l756m000n078o086o466o864
55427A02631p269o509m636l665m602n641m860l044k091k069j780j128j009j447
55413E2881j637j502j684k045j578K7J640J878N29j247j979j388q10j635l296
55398C8154l734k020M69J808J424k01k466m404m675k988p96L39M54M08L17j06
55382B1983l84J83J229J689J249M51l35j006j195o79p0j6P3J239K955L249J200
55365C1815j740l372k929j271K68P26j13j553k467k314j504n98K80J010J042N7
$$ plain form
55473 99801 102669 104863 105821 106237 107451 109660 111562 111956 111186 110866 112446 115971 119994 122848 124140 124853
55457 124853 126122 128403 131690 135729 139857 143439 146568 149558 151788 152157 150877 149578 149250 149302 149082
55442 149082 148903 148831 147960 145920 143833 142575 141243 138579 134881 131125 127125 122047 115961 109495 102631
55427 102631 95362 88853 84217 80552 75950 70309 65449 62405 60314 58245 56465 55337 54328 52881
55413 52881 51244 49742 48058 46013 44435 44462 46102 47980 48509 47262 45283 43895 43085 41450 38154
55398 38154 34420 32400 32869 34677 36101 35900 33434 29030 24355 21367 20571 20910 21364 21772 22089 21983
55382 21983 21599 21782 23011 24700 25949 26400 26065 25059 23864 23185 23115 23099 23172 24411 27366 30615 31815
55365 31815 30075 26703 23774 22503 22771 23497 23384 21831 19364 17050 15546 14948 15228 16238 17280 17337
55349A7337j276j684n37J618L559M259L519K138J331J618K312K433J871J257Q58
55334D0613K72o48j362j478j504k060k840l025k552k114j952j531n82L49Q44J365
55318B1795K379L285K966J248q68k301k708k323j568r03p10j047j582j821j318
55303A4524K3J620K362J489o74k878l855l136j318M22J286J426J276O30q81k481
55287I835k614j035N09M60o34j210r05m65j08O24J643K189J989J439P07l28j230
55270A0866j343r86j150j684j187O33J804M67k357A425d59G86L069K718J406M25
55254H404j19n26m49N02J605J672R11Q47J943K523J128j257k534k245j488o99
55238A0218O31K176K553J253o03j806k078j349M78K510L183K329J627K066K274
$$ plain form
55349 17337 16061 14377 13840 15458 19017 23276 26795 28933 30264 31882 34194 36627 38498 39755 40613
55334 40613 40885 40237 38875 37397 35893 33833 30993 27968 25416 23302 21350 19819 19237 19586 20430 21795
55318 21795 24174 27459 30425 31673 30805 28504 25796 23473 21905 21002 20292 19245 17663 15842 14524
55303 14524 14547 16167 18529 20018 19344 16466 12611 9475 8157 8579 9865 11291 12567 13197 12316 9835
55287 9835 7221 6186 6695 7155 6521 5311 4406 3941 3833 4457 6100 8289 10278 11717 12424 12096 10866
55270 10866 9523 8537 7387 5703 4516 5149 6953 7420 5063 1425 -459 786 3855 6573 7979 8404
55254 8404 8285 7759 7310 7812 9417 11089 12000 12847 14790 17313 18441 17184 14650 12405 10917 10218
55238 10218 10849 13025 15578 16831 16228 14422 12344 10995 11473 13983 17166 19495 21122 23188 25462
55223B5462N98k220l876l319j427N41J860J998Q13q03j529j075l16Pr4m98j274
55206A4848k043j931o41R99J941J943J353M14o72j314r49R9P40L06p41j488j586
55189A1278j240o28J90Q50Q61K93j90j54J74N40J078J789K124J653P27J0l20l67
55171A8668K6Q69J450J019n6o45l24K26L93L38M19N37L81j57r82j847k304k059
55153A5952j376p31j10Q21J876K382K138J818K172L224M258M302K716j39k832
55138C6471l953l289j687n1R85Q46n09j992k164q39P26J270O26n03j206j029m27
55121B3275l12o40k45J145J732R8k149k292o09n5j715l234k560o59P21J677K835
55104A7013L437K767J942K180K481J207r91k104j963k161l084l269j955k20Q39
$$ plain form
55223 25462 26060 23840 19964 16645 15218 15759 17619 19617 20430 19627 18098 17023 16707 16714 16620 16122 14848
55206 14848 12805 10874 10233 11232 13173 15116 16469 16883 16211 14897 13948 14047 14787 15093 14352 12864 11278
55189 11278 10038 9410 9600 10450 11311 11604 11414 11260 11434 11974 13052 14841 16965 18618 19345 19355 19035 18668
55171 18668 18694 19563 21013 22032 21976 21331 21007 21233 21626 21964 22383 22920 23301 23144 22162 20315 18011 15952
55153 15952 14576 13845 13735 14556 16432 18814 20952 22770 24942 28166 32424 36726 39442 39303 36471
55138 36471 32518 29229 27542 27491 28476 29322 28813 26821 24657 23818 24544 25814 26440 25937 24731 23702 23275
55121 23275 22963 22323 22078 23223 24955 25053 22904 20612 20003 19948 18233 14999 12439 11780 12501 14178 17013
55104 17013 20450 23217 25159 27339 29820 31027 30036 27932 25969 23808 20724 17455 15500 15280 16119
55089A6119J344J585J295N67K66P97J482J711J738J819J453J95j501k800l341
55074B2729l152k268q88M40J237J500J612K016K829L347K421R0j489j21L395N609
55058C9307M450J608J11P05J942K844L716M436L904J884O4J29J486K072J119p3
55042F9704k19K53J30p73j593j765j601j660k118k735k815j579Q00K673K499Q96
55026F0097P6R53K036J655J83q48r13o40m11n4L24L22J19L57J062J427R09k0m62
55007F6172mJ053K086K709L078L516L671K667N15j291j421n38m25j486k382k235
54991G5685j840k109k432j544M90K199K406J349J09n11m25m7J85J43m3k83n59
54974G2773o32j02R70J849J966J801K293L379L758K534O01l73l2K92n36j939k462
$$ plain form
55089 16119 17463 19048 20343 20910 21176 21973 23455 25166 26904 28723 30176 30371 28870 26070 22729
55074 22729 19577 17309 16421 16861 18098 19598 21210 23226 26055 29402 31823 31913 30424 30303 33698 39307
55058 39307 43757 45365 45476 46181 48123 50967 54683 59119 63023 64907 64971 65100 66586 68658 69777 69704
55042 69704 69485 69738 69868 69095 67502 65737 64136 62476 60358 57623 54808 53229 54029 56702 59201 60097
55026 60097 60173 61126 63162 64817 65000 64152 63239 62599 62188 62134 62458 62780 62899 63256 64318 65745 66654 66634 66172
55007 66172 66168 67221 69307 72016 75094 78610 82281 84948 85463 84172 82751 82213 81788 80302 77920 75685
54991 75685 73845 71736 69304 67760 68250 70449 72855 74204 74313 73802 73377 73330 73515 73658 73615 73332 72773
54974 72773 72141 72039 73009 74858 76824 78625 80918 84297 88055 90589 91190 90817 90785 91077 90541 88602 86140
54957H6140j574jJ331K017K023J552J116J057R29k7j607k478j647L39K002K440
54941I3612J955J411J297J281P09l98j154r81n87r93j797j568j18Q13k69k575
54925I0638m000l436j510N19J794K113J713Q58m36j908k471j113J431L004K603
54910H9799J501J159J183N68k70j36Q25J342J126J199K084K994L173K932K975
54895A12454L456M013M214L879L434L824N423P265Q107P998P961Q296Q433Q395
54881A97152R064J0585J1663J1185R789R096R835J1278J2188J1729R643O178J938
54868C21323k292n906q838j1507j4093j5895j6010j4749j3560j3043j2009r342
54856A84079o107m553n379p185q330q249o973m685k001K93K035L521M556M598
$$ plain form
54957 86140 84566 84565 85896 87913 89936 91488 92604 93661 94590 94563 92956 90478 88831 89170 91172 93612
54941 93612 95567 96978 98275 99556 100265 99867 98713 97732 97145 96152 94355 92787 92669 93482 93213 90638
54925 90638 86638 83202 81692 82211 84005 86118 87831 88689 88253 86345 83874 82761 84192 87196 89799
54910 89799 91300 92459 93642 94210 93940 93804 94629 95971 97097 98296 100380 103374 106547 109479 112454
54895 112454 115910 119923 124137 128016 131450 135274 140697 147962 156069 164067 172028 180324 188757 197152
54881 197152 206216 216801 228464 239649 249438 258534 268369 279647 291835 303564 313207 319385 321323
54868 321323 319031 313125 304287 292780 278687 262792 246782 232033 218473 205430 193421 184079
54856 184079 177972 173419 168040 160855 152525 144276 137303 132618 130617 130910 132945 136466 141022 145620
54842A45620L850L266L352L935N012O795Q786R949J0152J0410J1377J2568J3324
54829B48396J3499J2890J1070Q171M751O10m949j1207j5779j7222j6716j6171
54817B17343j5793j4626j2647j0865r889r495r292q897p883o439n544n611n437
54804I4925l744j324k83j298k796l029j880l24Q07J243J112R19J147J584J532
54789H8591Q43J68n7k69r42j747k159k462l285m274m131k440n61j13r56j556j072
54772F3578j09O01J129J532J249J28q77j021r95j663k284j521K02J058N52J24
54756F1683O75J268R00J01j56J62P24J577K420K342J403J268K923M878N038L564
54740I0770K301K146K601L371M589N667N727N125N013N391N317N094O248Q839
$$ plain form
54842 145620 149470 152736 156088 160023 165035 171830 180616 190565 200717 211127 222504 235072 248396
54829 248396 261895 274785 285855 294026 298777 299387 294438 283231 267452 250230 233514 217343
54817 217343 201550 186924 174277 163412 153523 144028 134736 125839 117956 111517 105973 100362 94925
54804 94925 91181 89857 89574 88276 85480 82451 80571 80247 81054 82297 83409 84328 85475 87059 88591
54789 88591 89434 89602 89545 89276 88334 86587 84428 81966 78681 74407 70276 67836 67275 67162 66206 64650 63578
54772 63578 63469 64070 65199 66731 67980 68108 67231 66210 65215 63552 61268 59747 59949 61007 61559 61683
54756 61683 62358 63626 64526 64627 64471 64633 65357 66934 69354 71696 73099 74367 77290 82168 87206 90770
54740 90770 93071 95217 97818 101189 105778 111445 117172 122297 127310 132701 138018 143112 149360 158199
54726A58199J0841J1077J0984J2113J3551J3700J3359J4705J7519J8745J6290
54715C11083J1472O806K939r98m996p877r194r896j0724j1151j0573r578r029
54702B48284q517o901m236j996j129q91o4J441K735L172K944K871L960O536R464
54687B57673J0957J0741J0647J2222J4518J5454J4853J4600J5687J6684J5723
54676D09759J2941J0009P894N961L089j021n741j0285j4350j8053k1225k3163
54664C55815k3337k2256k1004j9942j8450j6148j3708j2139j1587j1237j0152
54653A75855p954n084k695j920k664l441k979j759j423k649m343m976m055k060
54639A27853K88K112K414R79r03j542p04L07N72N93J071J525J077L3l39M72J620
$$ plain form
54726 158199 169040 180117 191101 203214 216765 230465 243824 258529 276048 294793 311083
54715 311083 322555 329361 332300 331302 326306 318429 309235 299339 288615 277464 266891 257313 248284
54702 248284 239767 232866 228630 226634 225505 224614 224550 225991 228726 231898 234842 237713 241673 248209 257673
54687 257673 268630 279371 290018 302240 316758 332212 347065 361665 377352 394036 409759
54676 409759 422700 432709 440603 446564 449653 448632 442891 432606 418256 400203 378978 355815
54664 355815 332478 310222 289218 269276 250826 234678 220970 208831 197244 186007 175855
54653 175855 167901 162817 160122 158202 155538 152097 149118 147359 145936 143287 138944 133968 129913 127853
54639 127853 128141 130253 132667 133646 132743 131201 130497 130804 131376 131969 133040 134565 135642 135675 135336 135808 137428
54622A37428K120J901J508J318J314J259R04L73K64R08J713J813J333J215J856
54607A57227K729L468M272M949M756L726L163L893M858M573L371K962M005N328
54593B13280N569M583L023J416J41k18Q05K941N139O378O620O830P736Q809R093
54578B82145Q969J0064J3006J6251J7872J7687J6804J5873J4934J4234J3765J2268
54566D53872Q299K431k966o496r157j2435j6084j8481j8572j6816j4658j3444
54554C35493j3474j3722j2867j0857q984q241q165p715o693n866n924o740p450
54541B18795p097n470l527k641l253m538n527o013o147n737m515k892j865k053
54527A57520l076m031m319l944l073j744k35N34k55k098l437l582l506m111m626
$$ plain form
54622 137428 139548 141449 142957 144275 145589 146848 147752 148125 148389 149297 151010 152823 154156 155371 157227
54607 157227 159956 163424 167696 172645 177401 181127 184290 188183 193041 197614 200985 203947 207952 213280
54593 213280 218849 223432 226455 227871 228012 227794 228599 231540 236679 243057 249677 256507 264243 273052 282145
54578 282145 291114 301178 314184 330435 348307 365994 382798 398671 413605 427839 441604 453872
54566 453872 462171 464602 461636 455140 445983 433548 417464 398983 380411 363595 348937 335493
54554 335493 322019 308297 295430 284573 275589 267348 259183 251468 244775 238909 232985 226245 218795
54541 218795 211698 206228 202701 200060 196807 192269 186742 180729 174582 168845 164330 161438 159573 157520
54527 157520 154444 150413 146094 142150 139077 137333 137098 137632 137377 135279 131842 128260 124754 120643 116017
54512A16017l772j932o27k34J85Q00N87n55j072o4J180J206O93J107K030J626
54496A17175l92k032j596K27J425R75l98j268q98J98R02P69N17J017K143L082
54480A21846L414L308K890K209J689J818K381K802L228M392O313Q013Q896R478
54466A82677J0239J0634R989Q694P643O865N676L991K567J880J501P24p70l007
54452B49303n713q042r040q749q319q503q588p453n361l958m479o403p973p703
54438A49019n516k831j424j761k538k286j241q73j638k206j316N33J924K380K417
54423A32643K152R93j027k560k163J26K796M331M309L258J924Q38L30M75Q79Q98
54407A50202M09K06J150K993M428M394K985J032o28j444j226l69L76O17N37L94
$$ plain form
54512 116017 112245 110313 109686 109452 109637 110437 111024 110469 109397 109333 110513 111719 112412 113519 115549 117175
54496 117175 116783 114751 113155 113382 114807 115782 115384 114116 113218 113416 114318 115087 115604 116621 118764 121846
54480 121846 125260 128568 131458 133667 135356 137174 139555 142357 145585 149977 156290 164303 173199 182677
54466 182677 192916 203550 213539 222233 229876 236741 242417 246408 248975 250855 252356 253080 252310 249303
54452 249303 243590 235548 226508 217759 209440 200937 192349 184896 179535 175577 171098 164695 156722 149019
54438 149019 143503 140672 139248 137487 134949 132663 131422 130549 128911 126705 125389 125922 127846 130226 132643
54423 132643 134795 135788 134761 132201 130038 130164 132960 137291 141600 144858 146782 147620 147950 148425 149304 150202
54407 150202 150611 150817 151967 154960 159388 163782 166767 167799 167171 165727 164501 164132 164508 165125 165662 166056
54391A66056K76L42O68O81m05k254l380k920j606m85K97P49K19j413k767k617
54375A51441j865k253l612m198l481k718k568k024l58J548K528K537J945O74j068
54360A36528k173j685R4K156L685M032K858R99K07J155K522K850K397K229K364
54345A60218K127J796K384L912M990M498K965K024K746M571N872N697M810M498
54331B13108M603L799J777k10j375k464l978m853m230l204l218l739l360k485
54317A90171k765m075m280k471n79q88l172n225n463m210k838k200j888r67N13
54302A49663J231L45j185j823j425r35n84J38R97J103N30L77R22J312J390K178
54286A54234L773M396K791L96k64J258K981L026J530J54L32J930L361L217J814
$$ plain form
54391 166056 166332 166674 167342 168023 167618 165364 161984 159064 157458 156973 157270 158019 158238 156825 154058 151441
54375 151441 149576 147323 143711 139513 136032 133314 130746 128722 128364 129912 132440 134977 136922 137596 136528
54360 136528 134355 132670 132764 134920 138605 142637 145495 146494 146701 147856 150378 153228 155625 157854 160218
54345 160218 162345 164141 166525 170437 175427 179925 182890 184914 187660 192231 198103 203800 208610 213108
54331 213108 217711 221510 223287 223077 221702 219238 215260 210407 206177 202973 199755 196016 192656 190171
54317 190171 187406 183331 179051 176580 176001 175113 171941 166716 161253 157043 154205 152005 150117 149150 149663
54302 149663 150894 151239 150054 148231 146806 145871 145287 145425 146422 147525 148055 148432 149354 150666 152056 154234
54286 154234 158007 162403 165194 165590 165326 166584 169565 172591 174121 174275 174607 176537 179898 183115 184929
54271A84929N31j73j029k120k354j514j316l112n627o611n992n498n563m650k083
54256A37818K75K48j880l933m506l997l414l170l303l841m395l969j999M71J495
54241A01900L88j443k295k087j777j582j020l53n34j566k223j923j509j592j439
54226H0945m07O86P53K9o49j252j885j599L69K779L521K470J425J273J005j20
54210H9343j149j049k56K85O25J323K173K366J561J41j224j924j686q37M9Q80
54194I0621J782K215J354m37j588j305m80j14P2N95R79O91M17J034J952J772L36
54177I9896j224k107k264j440O43K987L676K084k39j422j167l61L02O92Q15P14
54161A01585M87J80q8J30J138K287K481J684J147J675K509K496J569L94p26j704
$$ plain form
54271 184929 185460 185287 184258 182138 179784 178270 176954 173842 168215 161604 155612 150114 144551 139901 137818
54256 137818 138093 138341 136461 132528 128022 124025 120611 117441 114138 110297 105902 101933 99934 100405 101900
54241 101900 102288 100845 98550 96463 94686 93104 92084 91731 91197 89631 87408 85485 83976 82384 80945
54226 80945 80538 81224 81977 82006 81357 80105 78220 76621 76990 79769 83290 85760 87185 88458 89463 89343
54210 89343 88194 87145 86889 87174 87799 89122 91295 93661 95222 95363 94139 92215 90529 89692 89741 90621
54194 90621 92403 94618 95972 95535 93947 92642 92162 92048 92120 92715 93694 94385 94802 95836 97788 99560 99896
54177 99896 98672 96565 94301 92861 93504 96491 100167 102251 102012 100590 99423 99062 99364 100056 100871 101585
54161 101585 102072 102252 102164 102294 103432 105719 108200 109884 111031 112706 115215 117711 119280 119674 118948 117244
54145A17244k079j627j108j401k024j709m00M61j15j458k367k554k365j968j597
54130I4933j930l258m525m224k261l8J361K166K787K756J555j01r28p60n48o86
54114H6299m74M35J125Q37L39Q07J845J997R99J77L27N01l93j937l057l600m048
54097H2179m088k817k96K074K986K405J173M6p55j341j766j754r83N8J41j242
54081G6020k877l134j975p56j83L08R99J071n3j463j748n96J118K340K374J076
54065G2521p16j521p53M57P03M3n12p26j194j872j852q16K95N89L28L12O75Q92
54047F6853N21l65j232j396o54K49L72j36r2J062K345K493J523M45j00k01NM85
54029G2177R56J037Q07O35M83j9p77j144p93j60K16L52N38P76Q85Q29P73Q65J139
$$ plain form
54145 117244 115165 113538 112430 111029 109005 107296 106896 107357 107242 105784 103417 100863 98498 96530 94933
54130 94933 93003 89745 85220 80996 78735 78697 80058 82224 85011 87767 89322 89221 88293 87533 86985 86299
54114 86299 85825 86260 87385 88222 88561 89368 91213 93210 94209 94386 94713 95214 94821 92884 89827 86227 82179
54097 82179 78091 75274 74978 77052 80038 82443 83616 83662 82907 81566 79800 78046 77063 77121 77262 76020
54081 76020 73143 70009 68034 67278 67095 67403 68402 69473 69420 67957 66209 65613 66731 69071 71445 72521
54065 72521 71805 70284 69531 69988 70691 70734 70222 69496 68302 66430 64578 63762 64057 64646 64974 65286 65961 66853
54047 66853 67374 67009 65777 64381 63727 63976 64348 64212 64120 65182 67527 70020 71543 71988 71888 71687 71692 72177
54029 72177 73133 74170 74977 75612 76095 76076 75299 74155 73362 73202 73418 73770 74308 75084 75969 76798 77571 78436 79575
54010G9575J434J384Q31K74N33J731L045L674L621L256K622J687Q56N91O65N22
53994A06301K43M73J401K452L193L843M640N329N646N731N576M681K949J474J562
53979A55494L010M235M197L400K793K542K419K703L830N508O949P933Q747R121
53965B22881Q126N697L500L444N467P518P788O429M930M313M380M386L975L262
53951B96096K334J089l55j350j365q73j047k214l229l045k472l237n398o903o209
53936B61822m272l154l466m261m800n147n267m773l792l097l069l321l568m046
53922B05789m738m936m101k646j491j186j698k590l089k578j261N0R38J608K051
53907A80122J882J221P59N35l42k017l078k426j029n42r25p96J78Q34M48j89N8
$$ plain form
54010 79575 81009 82393 83224 83498 84031 85762 88807 92481 96102 99358 101980 103667 104523 105114 105779 106301
53994 106301 106544 107017 108418 110870 114063 117906 122546 127875 133521 139252 144828 149509 152458 153932 155494
53979 155494 158504 162739 166936 170336 173129 175671 178090 180793 184623 190131 197080 205013 213760 222881
53965 222881 231007 236704 240204 243648 249115 256633 264421 270850 275780 280093 284473 288859 292834 296096
53951 296096 298430 299519 299164 297814 296449 295576 294529 292315 289086 286041 283569 280332 274934 268031 261822
53936 261822 257550 254396 250930 246669 241869 236722 231455 226682 222890 219793 216724 213403 209835 205789
53922 205789 201051 196115 192014 189368 187877 186691 184993 182403 179314 176736 175475 175525 176463 178071 180122
53907 180122 182004 183225 183984 184519 184177 182160 179082 176656 175627 175085 174160 173364 173542 174376 174824 174635 174693
53890A74693J249K446K607J563O36J707M746O913N657K376J158L675P289Q836
53876B25551Q406Q123Q697Q862P597N386L408K525K927M005M685M370L432K399
53862C00373J247p6r29n35J024K897M302M965N199N795P239Q669Q585P094O379
53847C62228P964J0434J1170R672P688O464N555M323L137K547K319J787N89j189
53833D34688l003m040m047l851m249m705m250l450l998o226q464r368r468r659
53819C55910r630q843p926p749p842p148n856n174n464n941o100o206o257n677
53805B60097m546m028m810n889n818m728m199n100o332o164m420k785k904m550
53791A93824n984n894m545k986j854j297j427k056k307j481l48n65k360l800l095
$$ plain form
53890 174693 175942 178388 180995 182558 183194 184901 189647 196560 202217 204593 205751 209426 216715 225551
53876 225551 233957 242080 250777 259639 267236 272622 276030 278555 281482 285487 290172 294542 297974 300373
53862 300373 301620 301544 300615 300080 301104 304001 308303 313268 318467 324262 331501 340170 348755 355849 362228
53847 362228 370192 380626 391796 401468 409156 415620 421175 425498 428635 431182 433501 435288 435877 434688
53833 434688 431685 427645 423598 419747 415498 410793 406543 403093 399095 392869 384405 375037 365569 355910
53819 355910 346280 337437 329511 321762 313920 306772 300916 295742 290278 284337 278237 272031 265774 260097
53805 260097 255551 251523 246713 240824 235006 230278 226079 220979 214647 208483 204063 201278 198374 193824
53791 193824 187840 181946 177401 174415 172561 171264 169837 167781 165474 163993 163645 163080 160720 156920 153825
53776A53825q96P47J144J414K218K583J553j48j050q72m15o8M25Q19K61j277k435
53759A57828j974k53J359K047K000J703J550J911K866L845M106L740L648M267
53745A88643M848M466L428K951L424L720K778J377J506L888O956Q643Q442P268
53731B52338N990N088N248O962R356J0563R774Q116O984O231M785K555Q34P45
53717C35569J889K812K527J311K3j155k738m650n695n082l864l817n134o422o899
53702B98675p052p051o234m764m130m891n469m484k972k675l306l358k793k859
53688B36637l755m518m995n843o489n315k351J67P69N27Q96J361N64j331k872
53673B03452l308l168l110l134k822j797o5J714K613K375J668J306J557K279L039
$$ plain form
53776 153825 152929 153676 154820 156234 158452 161035 162588 162440 161390 160518 160103 160035 160460 161279 161540 160263 157828
53759 157828 155854 155601 156960 159007 161007 162710 164260 166171 169037 172882 176988 180728 184376 188643
53745 188643 193491 197957 201385 204336 207760 211480 214258 215635 217141 221029 227985 236628 245070 252338
53731 252338 258328 263416 268664 275626 284982 295545 305319 313435 320419 326650 331435 333990 334824 335569
53717 335569 337458 340270 342797 344108 344131 342976 340238 335588 329893 324811 320947 317130 311996 305574 298675
53702 298675 291623 284572 278338 273574 269444 264553 259084 254600 251628 248953 245647 242289 239496 236637
53688 236637 232882 228364 223369 217526 211037 205722 203371 203538 204307 204834 205730 207091 207655 206324 203452
53673 203452 200144 196976 193866 190732 187910 186113 186048 187762 190375 192750 194418 195724 197281 199560 202599
53658B02599L155K409J724K217L457L836K916K106K437L084K909K190J753J487
53644B38279J060J194K716M859O002N682M665L349J627J84K71J775K910K491J394
53629B78458J126J752K159J919J894K964M814O299O715O346N716M759L127J109
53615C29157l49o33K6J123K286L021K785J814J054Q50M24p13j656j400m44k6k44
53598C37075j87L70O34J08q94k052l332m322m355l421k121o39J096K325J798l42
53582C21741k196k241q75O47J681K034J441K75j30J011K641L138K346J418J143
53567C34074J602K922N034O785O764N266M168M464N155N119M820N206N880N621
53553D02880M335L267L337M271N399O356O846O661O321O833Q213Q961P773N379
$$ plain form
53658 202599 205754 208163 209887 212104 215561 219397 222313 224419 226856 229940 232849 235039 236792 238279
53644 238279 239339 240533 243249 248108 254110 259792 264457 267806 269433 269617 269888 271663 274573 277064 278458
53629 278458 279584 281336 283495 285414 287308 290272 295086 301385 308100 314446 320162 324921 328048 329157
53615 329157 328808 328175 328201 329324 331610 334631 337416 339230 340284 341134 341558 340845 339189 337789 337345 337319 337075
53598 337075 336888 337258 337892 338000 337106 335054 331722 327400 323045 319624 317503 316864 317960 320285 322083 321741
53582 321741 319545 317304 316429 317076 318757 320791 322232 322507 322377 323388 326029 329167 331513 332931 334074
53567 334074 335676 338598 343632 350417 357181 362447 366615 371079 376234 381353 386173 391379 397259 402880
53553 402880 407215 410482 413819 418090 423489 429845 436691 443352 449673 456506 464719 473680 481453 486832
53539D86832L914M632O925R321J0713J0672R498Q193P622P432O425M312K311J624
53525E80426K058K818L798N066N700M598K347Q97R96J245M32m81K4J326J298m67
53509F12081j709m82K186L641K850J151M2m95j191k056k433j958q11O83K100K736
53493F16335K103P27k1P38K501L957M284L672K752J993J713K301L908N867O913
53478F59743O439N318N012N838O770O958O780O899P123O985P100Q741J1972J5109
53464G66787J6479J6156J5530J5621J6405J7549J9091K1139K3266K4741K5384
53453I78148K5918K7087K8746L0245L1511L3017L4653L5679L6144L7247L9488
53442A337883M1518M2107M2271M3839M6371M7636M7146M7083M8931N1130N1410
$$ plain form
53539 486832 490746 495378 502303 511624 522337 533009 542507 550700 558322 565754 572179 576491 578802 580426
53525 580426 582484 585302 589100 594166 599866 604464 606811 607708 608704 609949 610381 609900 609924 611250 612548 612081
53509 612081 610372 609890 612076 615717 618567 619718 619760 619265 618074 616018 613585 611627 610816 611499 613599 616335
53493 616335 618438 619165 619144 619882 622383 626340 630624 634296 637048 639041 640754 643055 646963 652830 659743
53478 659743 666182 671500 676512 682350 689120 696078 702858 709757 716880 723865 730965 739706 751678 766787
53464 766787 783266 799422 814952 830573 846978 864527 883618 904757 928023 952764 978148
53453 978148 1004066 1031153 1059899 1090144 1121655 1154672 1189325 1225004 1261148 1298395 1337883
53442 1337883 1379401 1421508 1463779 1507618 1553989 1601625 1648771 1695854 1744785 1795915 1847325
53431A847325M9952M8657M8231M7712M6526M5401M5149M5716M6670M7753M8637
53420B367729M8881M8298M7099M5503M3729M2232M1502M1430M1214L9939L7247
53409B844803L3563K9872K7114K5526K4591K3653K2341K0423J7721J4388J0825
53398C094820P083K812j925o350r794j2442j4951j7759k1011k4605k7904l0074
53386B937900l1155l2269l4319l6979l9408m1226m2248m2081m0835l9559l9069
53375B518752l8841l8007l6872l6363l6327l5577l3567l0891k8203k5605k3206
53364B155293k1317j9779j7895j5272j2155q820n298j809J223L878O907J0833
53352B075789J5214J9000K1524K3038K4524K6773K9586L2068L3985L6387M0399
$$ plain form
53431 1847325 1897277 1945934 1994165 2041877 2088403 2133804 2178953 2224669 2271339 2319092 2367729
53420 2367729 2416610 2464908 2512007 2557510 2601239 2643471 2684973 2726403 2767617 2807556 2844803
53409 2844803 2878366 2908238 2935352 2960878 2985469 3009122 3031463 3051886 3069607 3083995 3094820
53398 3094820 3101903 3104715 3102790 3096440 3086646 3074204 3059253 3041494 3020483 2995878 2967974 2937900
53386 2937900 2906745 2874476 2840157 2803178 2763770 2722544 2680296 2638215 2597380 2557821 2518752
53375 2518752 2479911 2441904 2405032 2368669 2332342 2296765 2263198 2232307 2204104 2178499 2155293
53364 2155293 2133976 2114197 2096302 2081030 2068875 2060055 2054757 2052948 2054171 2058049 2064956 2075789
53352 2075789 2091003 2110003 2131527 2154565 2179089 2205862 2235448 2267516 2301501 2337888 2378287
53341B378287M5630N0448N3716N5746N7605O0049O3165O6685P0331P3834P6794
53330C052290P8896Q0644Q3383Q7673R2042R4604R5809R7915J01398J03912J03868
53319D072434J03036J03770J05233J04673J01559R7972R5274R2747Q9664Q6507
53309E052869Q3453P9405P3275O5221N6180M7238L9489L3297K7470K0421J2273
53298E590591M589k045q608j5675k2561k8994l6025m4349n2901o0245o6454p2753
53286E184570p9889q7457r4308r9149j01424j01941j02073j02178j01574j00106
53276D214471r8631r7667r6552r4504r1703q8930q6751q5342q4379q2922q0174
53265C226916p6486p2925o9797o6466o2520n8119n3319m8223m3700m0702l8838
$$ plain form
53341 2378287 2423917 2474365 2528081 2583827 2641432 2701481 2764646 2831331 2901662 2975496 3052290
53330 3052290 3131186 3211830 3295213 3382886 3474928 3569532 3665341 3763256 3864654 3968566 4072434
53319 4072434 4175470 4279240 4384473 4489146 4590705 4688677 4783951 4876698 4966362 5052869
53309 5052869 5136322 5215727 5289002 5354223 5410403 5457641 5497130 5530427 5557897 5578318 5590591
53298 5590591 5595180 5593135 5584527 5568852 5546291 5517297 5481272 5436923 5384022 5323777 5257323 5184570
53286 5184570 5104681 5017224 4922916 4823767 4722343 4620402 4518329 4416151 4314577 4214471
53276 4214471 4115840 4018173 3921621 3827117 3735414 3646484 3559733 3474391 3390012 3307090 3226916
53265 3226916 3150430 3077505 3007708 2941242 2878722 2820603 2767284 2719061 2675361 2634659 2595821
53254B595821l6904l4707l2988l1642k9705k7083k4533k1828j8011j3753j1152
53243B313515j0541r572o521k448Q95L304N104N977O245P527J0576J3985J6486
53230B354532J8777K1687K4370K6108K8080L1362L4794L7004L8975M2089M5045
53219B702823M5564M4215M3685M4513M4422M2058L8856L6591L5100L3206L0404
53208C141437K6960K3269J9581J5822J1754P811N061L617J940j212n038q154j0783
53195C232065j4013j7905k1968k6610l2095l6930l9423m0383m2166m5423m8849
53184B866300n1797n4804n7587n8855n8431n7609n7068n6224n4833n3438n2009
53173B253645m9893m7361m5472m4279m2919m1519m1155m1705m1757m0814l9713
$$ plain form
53254 2595821 2558917 2524210 2491222 2459580 2429875 2402792 2378259 2356431 2338420 2324667 2313515
53243 2313515 2302974 2293402 2286881 2284433 2285328 2288632 2293736 2299713 2305958 2313485 2324061 2338046 2354532
53230 2354532 2373309 2394996 2419366 2445474 2473554 2504916 2539710 2576714 2615689 2657778 2702823
53219 2702823 2748387 2792602 2836287 2880800 2925222 2967280 3006136 3042727 3077827 3111033 3141437
53208 3141437 3168397 3191666 3211247 3227069 3238823 3246634 3251695 3255312 3257252 3256040 3251002 3242848 3232065
53195 3232065 3218052 3200147 3178179 3151569 3119474 3082544 3043121 3002738 2960572 2915149 2866300
53184 2866300 2814503 2759699 2702112 2643257 2584826 2527217 2470149 2413925 2359092 2305654 2253645
53173 2253645 2203752 2156391 2110919 2066640 2023721 1982202 1941047 1899342 1857585 1816771 1777058
53162A777058l8647l6957l5158l4826l5711l5259l2017k7550k4062k2018k1051
53151A433802k1278k2439k3335k3404k3364k3500k2920k1421k0309k0269k0204
53140A191359j9415j8984j9683k0336j9895j9431k0169k1138k0792j9601j8932
53129I72983j8595j7720j7115j8251k0401k1180j9839j8037j7246j7285j7590
53118G69724j8137j8630j8275j6850j5118j3748j2798j2271j2324j2734j2936
53107F05903j2702j2161j1291j0117r242r268r825r943r299q324p301o241n509
53094D84680n583o165o428o274o406p108p649p262o081m858m179m143m426m554
53080D03564m358m080l880l479k716k110k304l098l664l600l277l141l220l317
$$ plain form
53162 1777058 1738411 1701454 1666296 1631470 1595759 1560500 1528483 1500933 1476871 1454853 1433802
53151 1433802 1412524 1390085 1366750 1343346 1319982 1296482 1273562 1252141 1231832 1211563 1191359
53140 1191359 1171944 1152960 1133277 1112941 1093046 1073615 1053446 1032308 1011516 991915 972983
53129 972983 954388 936668 919553 901302 880901 859721 839882 821845 804599 787314 769724
53118 769724 751587 732957 714682 697832 682714 668966 656168 643897 631573 618839 605903
53107 605903 593201 581040 569749 559632 550390 541122 531297 521354 512055 503731 496430 490189 484680
53094 484680 479097 472932 466504 460230 453824 446716 439067 431805 425724 420866 416687 412544 408118 403564
53080 403564 399206 395126 391246 387767 385051 382941 380637 377539 373875 370275 366998 363857 360637 357320
53066C57320l281l027k593k167j924j890k013k143j883r25K85P16q5j510k793
53051C32087l787m523m640l942l008k610k862l387l842l813k879j427p14j358
53037B89295k320k335j667j369j299m66Q10P67j124k770j889Q28K302P66k024
53022B77505k833o61K256L167J815L82Q45L113N500O367N273L172J670J502J748
53007C10821J023o56j982k145j542p75j62l05j786l846m872m671m811n968o599
52992B71724n424l651l103l495l392k864l153m270m986n005n160n498n036l719
52978B12968k829l017l398l204k938l090k895j419P01J632L92j969l319k527n44
52963A84544P11N35q5j83p7l26n21j53J14o23j836k233j780j678k397l078k950
$$ plain form
53066 357320 354039 351012 348419 346252 344328 342438 340425 338282 336399 335474 335759 336475 336390 334880 332087
53051 332087 328300 323777 319137 315195 312187 309577 306715 303328 299486 295673 292794 291367 290653 289295
53037 289295 286975 284640 282973 281604 280305 279839 280649 281416 280292 277522 275633 276461 278763 279529 277505
53022 277505 274672 274011 276267 279434 281249 281631 282476 285589 291089 297456 302729 305901 307571 309073 310821
53007 310821 311844 311188 309206 307061 305519 304744 304582 304277 302491 298645 293773 289102 284291 278323 271724
52992 271724 266300 262649 259546 256051 252659 249795 246642 242372 237386 232381 227221 221723 216687 212968
52978 212968 210139 207122 203724 200520 197582 194492 191597 190178 190879 192511 192903 190934 187615 185088 184544
52963 184544 185255 185790 185705 185522 185445 185119 184598 184445 184559 183936 182100 179867 178087 176409 174012 170934 167984
52946A67984k127r41M24J502J752J241L93p30j980k457j532j46L79L75J160K510
52930A67807K770J520K16j84k37k89L27J505J688J41j678k152j545r73o80m92
52914A67744p96j710k320j803m72J134K953M326L787J446nJ445L913L903J093
52899A84638j395j272N89K294L345M123M554M255L246J940Q93O42J123J344N34
52884B10853n51n81K03J97r09j310L92L097M731M857M639M807M970M692M127L597
52868B47811L389L925N317O709O938O023N084M634L926K542J407J235R57p84l078
52853B96035l569j856k21m06j448j811j913k848l836l156j069K93l5q26r83j041
52837B71310j752k621k671j654mJ439J457m58k711k932j181j44j237k427j464
$$ plain form
52946 167984 165857 164916 165340 166842 168594 169835 170228 169498 167518 165061 163529 163383 163762 164137 165297 167807
52930 167807 170577 172097 172313 172129 171892 171603 171930 173435 175123 175264 173586 171434 169889 168916 168236 167744
52914 167744 166948 165238 162918 161115 160643 161777 164730 169056 172843 174289 174284 175729 179642 183545 184638
52899 184638 183243 181971 182560 184854 188199 192322 196876 201131 204377 206317 207210 207852 208975 210319 210853
52884 210853 210302 209721 209924 210121 209212 207902 208294 211391 216122 220979 225618 230425 235395 240087 244214 247811
52868 247811 251200 255125 260442 267151 274089 280112 285196 289830 293756 296298 297705 298940 299897 299113 296035
52853 296035 292466 290610 290389 289983 288535 286724 284811 281963 278127 274971 273902 274195 274160 273334 272351 271310
52837 271310 269558 266937 264266 262612 262608 264047 265504 265046 262335 259403 258222 258078 256841 254414 252950
52822B52950M85N41j634l526l314j660M3J339K290K739K585J971J011k0n15l48
52806B54937l66j081j369J4K049K386P03q68j021r94j941k479o93K539M191K962
52790B58969P97K14J366K456K296J504J233J544J504O67k20j73Q23J909K276J642
52774B78807J93j367k094j787j373j526j446l0J912K181J67k130k710j979j578
52759B65240j899k028j522q54l96n6M0l88r30o49O65K189L159L565L477K603J095
52742B73311R1N89K053K862K084K33j688l225m364m988m922m324l661l276l201
52727B47574l331l607l993m375m530m278l714l189k930k713k262j899k192k902
52713B01659k984k132j620k660m405m725k964p51J56k59j079j931k866l569l759
$$ plain form
52822 252950 253435 253976 252342 248816 245502 243842 243885 245224 247514 250253 252838 254809 255820 255800 255285 254937
52806 254937 254571 253490 252121 252135 254184 256570 257273 256405 255384 254390 252449 249970 249277 251816 256007 258969
52790 258969 259766 259980 261346 263802 266098 267602 268835 270379 271883 272550 272330 272157 272980 274889 277165 278807
52774 278807 279000 277633 275539 273752 272379 270853 269407 269377 271289 273470 273637 271507 268797 266818 265240
52759 265240 263341 261313 259791 258937 258541 258485 258525 258137 257207 256558 257223 259412 262571 266136 269613 272216 273311
52742 273311 273402 273991 276044 278906 280990 281223 279535 276310 271946 266958 262036 257712 254051 250775 247574
52727 247574 244243 240636 236643 232268 227738 223460 219746 216557 213627 210914 208652 206753 204561 201659
52713 201659 198675 196543 194923 192263 187858 183133 180169 179418 179574 179315 178236 176305 173439 169870 166111
52698A66111l796m018l872k732j176l64k88J16J069J393K32j668k964l183k715
52683A42145k051j622j820k521l048l007k836k952k999k535j999k123k665k644
52669A07323j816j009p97p18j93N04P75P19R84J756K448K419J596M11n35p79l38
52652A12750L9n90k291l859l870k167j00Q14K61q73j630j782j464n55J021K539
52636I8243K738J358j50j33J259K308K042J337J339J664J076m83j513q04J028
52621A11309K068J069j254k774j975M04K159K093J217J064J636J855J408R72Q04
52606A22055M78K6J38R58J760K233K932M132N138N292M730L702K195P01J99P46
52590A57415J116O30J26J92j52j661l010k509q95m95j916l435l573k615j474o19
$$ plain form
52698 166111 162315 158297 154425 151693 150517 150153 149865 149981 151050 152443 152675 151007 148043 144860 142145
52683 142145 140094 138472 136652 134131 131083 128076 125240 122288 119289 116754 114755 112632 109967 107323
52669 107323 105507 104498 103701 102983 102790 103294 104069 104788 105772 107528 109976 112395 113991 114402 113867 113088 112750
52652 112750 112789 112199 109908 106049 102179 100012 99912 100726 100987 100114 98484 96702 95238 94683 95704 98243
52636 98243 100981 102339 102189 102056 103315 105623 107665 109002 110341 112005 113081 112598 111085 110281 111309
52621 111309 113377 114446 113192 110418 108443 108847 111006 113099 114316 115380 117016 118871 120279 121251 122055
52606 122055 122533 122559 122697 123655 125415 127648 130580 134712 139850 145142 149872 153574 155769 156470 156669 157415
52590 157415 158531 159161 159287 159479 159327 157666 154656 152147 151252 150757 148841 145406 141833 139218 137744 137125
52574A37125m04j052j900j856q69R2N39O99L24j131k842k969j304L3m48j463r92
52557A21582P63J959J800J110O45J94o11j607k382k586k067j116m05l16m87l76
52541A16100J74J097K182K660J574p22k288j643M21K048K648K954L151K363J98
52526A32917k268l539l073j434M49J910K758L077K852K040J102R30J819L022L734
52511A46296L999M066L579K333J277J583K934L781L285J986O41m37q49j62J159
52496A75471J897J659J393J872K597K768K523K471K546K185J253J81n42o60j77
52481A97437M38N23P1j76K07O80O89N65P76Q16p3j424j860r08L96R73Q54O68O44
52462B01296O30M85M0q82j927k138r65Q17J759J268J25n42l89Q1L38L80N66R93
$$ plain form
52574 137125 136721 135669 133769 131913 131044 131136 131675 132374 132698 131567 128725 125756 124452 124485 124037 122574 121582
52557 121582 122345 124304 126104 127214 127859 128053 127442 125835 123453 120867 118800 117684 117279 116963 116476 116100
52541 116100 116274 117371 119553 122213 123787 123065 120777 119134 119555 121603 124251 127205 130356 132719 132917
52526 132917 130649 127110 124037 122603 123052 124962 127720 130797 133649 135689 136791 137721 139540 142562 146296
52511 146296 150295 154361 157940 160273 161550 163133 166067 169848 173133 175119 175760 175323 174474 174312 175471
52496 175471 177368 179027 180420 182292 184889 187657 190180 192651 195197 197382 198635 198816 198274 197614 197437
52481 197437 197875 198398 198469 198293 198500 199180 199869 200434 201210 202026 201953 200529 198669 197761 198157 199130 199984 200652 201296
52462 201296 201926 202411 202451 201569 199642 197504 196539 197356 199115 200383 200508 199966 199577 199658 199996 200376 200942 201935
52444B01935J324J219Q11M35Q9l96o96k37P17Q95m30k214k749j670p4J079J692
52427B01730J685P03q85j761j143K37J236J682J878J694J138J116K235L310K598
52412B17453M04j123q37L15J305K317L177K509r3k445k250l44M53p38k112k297
52396B15694k108k538k858j880RJ338J458R82P23R92J656K247K248J767J529J766
52380B23025J727R94N59J426K502J453j984m954m632j582J072J325K2r33r00m88
52364B18632j86J49O93J295J714J820J484P07q9k46M98J789L059L852L788K779
52348B41738J390N76O95J170J346J208R41L54p09j746j979j170L25J846K403J089
52332B49477j565l256k171P22K882L344L180L036K212P52K39J320K159J057p94
$$ plain form
52444 201935 203259 204478 205289 205724 205813 205417 204721 204484 205201 206096 205666 203452 200703 199033 198959 200038 201730
52427 201730 203415 204118 203233 201472 200329 200566 201802 203484 205362 207056 208194 209310 211545 214855 217453
52412 217453 217857 216734 215897 216212 217517 219834 223011 225520 225427 222982 220732 220388 220841 220103 217991 215694
52396 215694 213586 211048 208190 206310 206319 207657 209115 210097 210820 211812 213468 215715 217963 219730 221259 223025
52380 223025 224752 225746 226305 227731 230233 231686 229702 224748 220116 218534 219606 220931 220953 220020 219120 218632
52364 218632 218446 218595 219288 220583 222297 224117 225601 226308 226219 225973 226471 228260 231319 235171 238959 241738
52348 241738 243128 243704 244399 245569 246915 248123 249064 249418 248709 246963 244984 243814 244139 245985 248388 249477
52332 249477 247912 244656 242485 243207 246089 249433 252613 255649 257861 258613 258852 260172 262331 263388 262594
52317B62594j034L33J327J235J228J830K124J899K383L950N027M424L246L092
52303B93658L690L851L732M324N340N432M401L486L359L311K762K205K100K085
52289C43736J933K213L154L770L225K412K945M793O163N774M201K623J385L95
52275C88722R9J024K620L647L742L727M174M519M167L685M100N322O225O137N484
52260D47394M993N012N645O765P754Q069Q383J0044J2938J4918J4338J2269J1067
52247E69589J1418J2136J2518J3345J5313J7819J9830K1033K1677K2005K2264
52236G58947K2611K2780K2445K2071K2545K3747K4441K3961K3137K3046K3717
52225A013448K4543K5057K4744K3172K1036J9957K0275K0131J8058J5442J4691
$$ plain form
52317 262594 261560 261893 263220 264455 265683 267513 269637 271536 273919 277869 282896 287320 290566 293658
52303 293658 297348 301199 304931 309255 314595 320027 324428 327914 331273 334584 337346 339551 341651 343736
52289 343736 345669 347882 351036 354806 358031 360443 363388 368181 374344 380118 384319 386942 388327 388722
52275 388722 388821 389845 392465 396112 399854 403581 407755 412274 416441 420126 424226 429548 435773 441910 447394
52260 447394 452387 457399 463044 469809 477563 485632 494015 504059 516997 531915 546253 558522 569589
52247 569589 581007 593143 605661 619006 634319 652138 671968 693001 714678 736683 758947
52236 758947 781558 804338 826783 848854 871399 895146 919587 943548 966685 989731 1013448
52225 1013448 1037991 1063048 1087792 1110964 1132000 1151957 1172232 1192363 1210421 1225863 1240554
52214A240554J5640J5678J3358R926P198N561M580M003L369J940j16j449j177
52201A319065j3Q68J232J375J200N93Q9K09N74M84J12L15J520L401N476P464R199
52184A353163J0647J1914J2928J3398J3356J3330J3608J3757J3291J2511J2196
52173A494099J2683J3603J4243J3979J2702J1066R900R167Q149O769N792N321
52161A617473M159J543j476l424m393n569p372r369j1530j4017j6007j6185j4626
52148A519207j2963j2497j3161j4279j5135j4812j2863j0435r306r499r236p744
52136A377277o513o866p840p717o512n436m828m218l899m672o077o359m553j619
52122A300168O84J242o7k470m482m914m131l650m239n121n281m796m412m407m478
$$ plain form
52214 1240554 1256194 1271872 1285230 1295156 1302354 1307915 1312495 1316498 1319867 1321807 1321691 1320242 1319065
52201 1319065 1319052 1319920 1321152 1322527 1323727 1324320 1324409 1324618 1325192 1325676 1325788 1326103 1327623 1331024 1336500 1343964 1353163
52184 1353163 1363810 1375724 1388652 1402050 1415406 1428736 1442344 1456101 1469392 1481903 1494099
52173 1494099 1506782 1520385 1534628 1548607 1561309 1572375 1582275 1591442 1599591 1606360 1612152 1617473
52161 1617473 1621632 1623175 1621699 1618275 1613882 1608313 1600941 1591572 1580042 1566025 1550018 1533833 1519207
52148 1519207 1506244 1493747 1480586 1466307 1451172 1436360 1423497 1413062 1403756 1394257 1385021 1377277
52136 1377277 1370764 1363898 1356058 1348341 1341829 1336393 1331565 1327347 1323448 1318776 1312699 1306340 1301787 1300168
52122 1300168 1300852 1302094 1302027 1299557 1295075 1290161 1286030 1282380 1278141 1273020 1267739 1262943 1258531 1254124 1249646
52107A249646m270l545k274j088j164k894n023n910n532n338o085o894o805o250
52093A186574o118o184n635m795m846n708n628l551q11M91j7j176k319l685n035
52078A131557n377m433l280k969l323l572l490l352l304l285l264l079k465j457
52064A084907m45L41Q86R06J11q22n82R20K023J460J52j23R03K272L716N754Q129
52047A110508R814J0817J2490J5487J8771K1177K2829K4112K4438K3252K1637
52036A315332K1541K3535K6316K8359K9170K8976K8253K7790K8351K9544K9745
52025A616912K7900K5035K3246K3122K2965K0869J7010J3413J1592J1012R962
52014A823038P571M604K306Q05r51l675o634q610r669j1088j3248j4617j3666
$$ plain form
52107 1249646 1245376 1241831 1239557 1238469 1237305 1234411 1229388 1223478 1217946 1212608 1206523 1199629 1192824 1186574
52093 1186574 1180456 1174272 1168637 1163842 1158996 1153288 1147660 1144109 1143298 1143789 1143772 1142596 1140277 1136592 1131557
52078 1131557 1126180 1121747 1118467 1115498 1112175 1108603 1105113 1101761 1098457 1095172 1091908 1088829 1086364 1084907
52064 1084907 1084462 1084803 1085689 1086595 1086706 1085884 1085302 1086222 1088245 1089705 1089857 1089734 1090637 1092909 1096625 1102379 1110508
52047 1110508 1120322 1131139 1143629 1159116 1177887 1199064 1221893 1246005 1270443 1293695 1315332
52036 1315332 1336873 1360408 1386724 1415083 1444253 1473229 1501482 1529272 1557623 1587167 1616912
52025 1616912 1644812 1669847 1693093 1716215 1739180 1760049 1777059 1790472 1802064 1813076 1823038
52014 1823038 1830609 1835213 1837519 1838324 1837373 1833698 1827064 1818454 1808785 1797697 1784449 1769832 1756166
52001A756166j1103r069q471q384p983p619p618p432o683n852n041l217K04L831
51987A671729N700N596M836M337M237M872O478Q138Q593Q135Q239R166R535Q592
51973A768183P204O049M480K148K43k35k96j558l796n332n536n460o153p571r287
51958A743083j1165j2995j4323j5144j6262j8557k1982k5392k7358k7306k6171
51947A526428k5639k6520k8005k8758k8487k8142k8843l0746l2786l3361l1846
51936A203295k9548k8550k9244k9803k8619k6402k5084k5415k6601k7747k8350
51925H97932k7826k5938k3666k2448k2302k1843k0336j8653j7866j7949j8311
51914F60794j8671j8784j8114j6527j4795j3736j3191j2318j0627q455o751o558
$$ plain form
52001 1756166 1745063 1735994 1727523 1719139 1711156 1703537 1695919 1688487 1681804 1675952 1670911 1667694 1667898 1671729
51987 1671729 1677429 1683025 1687861 1692198 1696435 1701307 1707785 1715923 1724516 1732651 1740890 1750056 1759591 1768183
51973 1768183 1775387 1781436 1785916 1788064 1788307 1788072 1787776 1786218 1782422 1777090 1771554 1766094 1759941 1752370 1743083
51958 1743083 1731918 1718923 1704600 1689456 1673194 1654637 1632655 1607263 1579905 1552599 1526428
51947 1526428 1500789 1474269 1446264 1417506 1389019 1360877 1332034 1301288 1268502 1235141 1203295
51936 1203295 1173747 1145197 1115953 1086150 1057531 1031129 1006045 980630 954029 926282 897932
51925 897932 870106 844168 820502 798054 775752 753909 733573 714920 697054 679105 660794
51914 660794 642123 623339 605225 588698 573903 560167 546976 534658 524031 515576 508825 502267
51902E02267q091j0069j0638r478q265q410r110q580o726n234n090n308m588l218
51888C99462k501k964l961m807n431n899o033n789n407m917m015k849k405l466
51874C39018n328o329n598l776k060j264j718l128m369m278l147k551l133l591
51860B88748k638j099q69k286l773l844k449n41P87Q59R0j96N27R05m27k459k927
51843B68408j563l69n29j012r14j098k351l583l428k436k101k555k654j858o01
51828B41356O88J761K055J176k33j048r20k33O33J161N47j206k565k133o36J06
51812B40509j34J11J448K614K477J541Q53N21J41j90j14K94O84R88J422K189L326
51795B58680M467M748L574J553po53j095j804k191j620m16O85J463J977J951J160
$$ plain form
51902 502267 494176 484107 473469 463991 455726 447316 438206 429626 422900 417666 412576 407268 402680 399462
51888 399462 396961 393997 390036 385229 379798 373899 367866 362077 356670 351753 347738 344889 342484 339018
51874 339018 333690 327361 321763 317987 315927 314663 312945 309817 305448 301170 298023 295472 292339 288748
51860 288748 286110 285011 284142 281856 278083 274239 271790 271249 272036 272895 272985 272789 273316 274221 273794 271335 268408
51843 268408 266845 266476 265947 264935 264021 262923 260572 256989 253561 251125 249024 246469 243815 241957 241356
51828 241356 242044 243805 245860 247036 246803 245755 244835 244602 245235 246396 246943 245737 243172 241039 240403 240509
51812 240509 240375 240486 241934 244548 247025 248566 249419 249940 250081 249891 249777 250071 250755 251743 253165 255354 258680
51795 258680 263147 267895 271469 273022 273015 272362 271267 269463 267272 265652 265236 265921 267384 269361 271312 272472
51779B72472J72j11L76P29K61n49n68N73J891K150J418R70J455J965J555Q94J278
51762B86931K404K573J213k84o27k68k08l09J80J212K021K168J610K65j517k481
51746B94883j492R37K970L251J858k32j790j655M57L121M146K853Q40Q5P71J522
51730C12525J317M67j62j00O47J907L254L996L686K589J297L6j117j466l0K948
51714C31794N572O086M748L214K497K395K649L430M426M653L808L103L947O181
51700C88503Q214Q786Q185P850Q879J0758J1520R672N918K451M44r09k672m464
51686D63135n176m621l624k844k333j968j679j399j368k087l407m074l058j052
51672D24445K31J35l68j73Q00J947K671K462J203l04q58l49o3q69j814j331M76
$$ plain form
51779 272472 272644 272533 272909 273638 273899 273350 272782 273355 275246 277396 278814 279784 281239 283204 284759 285653 286931
51762 286931 289335 291908 293121 292837 292210 291942 291734 291425 291605 292817 294838 297006 298616 298881 297364 294883
51746 294883 293391 294328 297298 300549 302407 302175 300385 298730 299187 302308 306454 309307 310147 310232 311003 312525
51730 312525 313842 314309 314147 314047 314694 316601 319855 323851 327537 330126 331423 331459 330342 328876 328846 331794
51714 331794 337366 343452 348200 351414 353911 356306 358955 362385 366811 371464 375272 378375 382322 388503
51700 388503 396717 405503 413688 421538 430417 441175 452695 462367 468285 470736 471180 470271 467599 463135
51686 463135 457959 453338 449714 446870 444537 442569 440890 439491 438123 436036 432629 428555 425497 424445
51672 424445 424676 424811 424443 424270 425070 427017 429688 432150 433353 433049 432191 431842 431779 430910 429096 427765 428241
51655D28241J727J091n81j432q91r0j12n39j83J107K040J403m40j980k268j755
51639D25338j404j292n86J110K840L160J846K35k39N94J966L234M181M674M765
51624D50422M827N080N217N081N232O036O609N728L566J282r15l797p101r257
51610D78010r677r716j0358j0550r105o978n939n997n801n166n240o361p382p383
51596C72357o690n893n017m049l335l093l110l143l039k414r91P24J745J741J216
51581C37009O11j78j348k769l993m306l127r88L71k08j697k053p78P27J208P37
51565C19218p9q67j251q63L1Q58J639K618L041J754p69k380j854k11J102J999
51549C23986K798K878J584l30j425j268k86J412L845O114O964O454N931O033N780
$$ plain form
51655 428241 429968 431059 430478 429046 428155 428065 427953 427414 427231 428338 430378 431781 431341 429361 427093 425338
51639 425338 423934 422642 422056 423166 426006 429166 431012 431247 431008 431602 433568 436802 440983 445657 450422
51624 450422 455249 460329 465546 470627 475859 481895 488504 494232 497798 499080 498165 494368 487267 478010
51610 478010 468333 458617 448259 437709 428604 421626 415687 409690 403889 398723 393483 387122 379740 372357
51596 372357 365667 359774 354757 350708 347373 344280 341170 338027 334988 332574 331583 332307 334052 335793 337009
51581 337009 337620 337442 336094 333325 329332 325026 321899 320911 321282 321074 319377 317324 316546 317273 318481 319218
51565 319218 319139 318272 317021 316158 316189 317047 318686 321304 324345 326099 325330 322950 321096 320885 321987 323986
51549 323986 326784 329662 331246 330916 329491 328223 327937 329349 333194 339308 346272 352726 358657 364690 370470
51534C70470M242K343J946L303M506L909K334J751K255J805n15k640k200J4J024
51519C94547l65k395l150k766k398k511k763k482q21K352N397O180M844L760M160
51504D01589M555L516K118K022K674K460J636J885L355M193L138R23j110k372
51490D30582k692j867j96J282J591O44p78j464n72J465L037K929J590L10k88l73
51474D35200j00L37K91o08j589j611r14o78j235j701j409p07k10r6k70n31n56
51457D23613k85k58r16j792k115j966j997k291k369k209k201k231j785r10j82
51442D00106K29O05Q87R03J030J632K128J864J545K229L090K253K8p76J336M368
51426D23457N650N176M680M782M838M694M829N041M610L752L608M611N808N955
$$ plain form
51534 370470 374712 377055 379001 382304 386810 390719 393053 394804 397059 398864 398349 395709 393509 393523 394547
51519 394547 394182 391787 388637 385871 383473 380962 378199 375717 374896 377248 382645 388825 393669 397429 401589
51504 401589 406144 409660 411778 413800 416474 418934 420570 422455 425810 430003 433141 434064 432954 430582
51490 430582 427890 426023 425827 427109 428700 429344 428566 427102 426530 427995 431032 433961 435551 435861 435573 435200
51474 435200 435100 435437 435728 435120 433531 431920 431006 430328 429093 427392 425983 425276 425066 424970 424700 424169 423613
51457 423613 423328 423070 422154 420362 418247 416281 414284 411993 409624 407415 405214 402983 401198 400288 400106
51442 400106 400335 400940 401827 402730 403760 405392 407520 409384 410929 413158 416248 418501 418529 417753 419089 423457
51426 423457 429107 434283 438963 443745 448583 453277 458106 463147 467757 471509 475117 479728 485536 491491
51412D91491M751K955J817K200L670M730M360L155K396K349K186J392N98Q67K498
51397E31415M477N076L387M62j584j814j181q33o90l99n97k008l874m622l876
51382E23339k671j898j635j912k925m336n444o196p119q117q413p860p202o712
51368D50899n684l804j894o87P3O40M38p00j489p34P97J422J093J245K313L031
51352D46959K543J574R44K69q26j589j392j253k582m977o685o964o595o228n743
51337D07455n455o311q202r394q561o376m286k752j804k204m527p537r137q845
51323C22064p998p465o595m836l050k384k700k855k157j008m35j191l020m678
51309B71692n176m928m965n090l981j394R71J530O95j74p03j277j666j342q25
$$ plain form
51412 491491 496242 499197 501014 503214 506884 511614 515974 519129 521525 523874 526060 527452 528050 528917 531415
51397 531415 535892 540968 544355 544817 543233 541419 540238 539405 538715 538316 537719 535711 531837 527215 523339
51382 523339 520668 518770 517135 515223 512298 507962 502518 496322 489203 481086 472673 464813 457611 450899
51368 450899 445215 441411 439517 438830 438903 439543 439981 439281 437792 437058 437855 439277 440370 441615 443928 446959
51352 446959 449502 451076 452020 452289 451463 449874 448482 447229 444647 439670 432985 426021 419426 413198 407455
51337 407455 402000 395689 387487 378093 369532 363156 358870 356118 354314 352110 347583 340046 330909 322064
51323 322064 314066 306601 300006 295170 292120 289736 287036 284181 282024 281016 280581 279390 276370 271692
51309 271692 266516 261588 256623 251533 247552 246158 247129 248659 249354 249180 248477 247200 245534 244192 243367
51294B43367j175k215k551j688p87q25j060j10K098M272N205M659L131J429K93
51279B54043n6m6ON46K199M503N915N470M037L453M423N799N964M562K566J023
51263C04407J28n69j560k953m235m526l520k211k042l128m049l831l378m075n633
51248B58825o426n813m803m275l790k799j973k278l384m035l748l134k698k317
51234B07352k004k096k349j762k0J556J405k85j744j617j30J602K692K808K153
51219B07561J378J003O96k94j884k849k161k12J697K613K406J449L70k90o13j157
51203B09713j871j799n25O70J67j880l768m480m415l956k776j013J75J21l21k18
51187A83824j51j093k347k077N4K247K858K223J621J349Q23P1o1P55J549J101
$$ plain form
51294 243367 242192 239977 237426 235738 234951 234126 233066 232956 235054 239326 244531 249190 252321 253750 254043
51279 254043 253987 253941 253947 254493 256692 261195 267110 272580 276617 280070 284493 290292 296256 300818 303384 304407
51263 304407 304535 303966 302406 299453 295218 290692 287172 284961 282919 279791 275742 271911 268533 264458 258825
51248 258825 252399 246586 241783 237508 233718 230919 228946 226668 223284 219249 215501 212367 209669 207352
51234 207352 205348 203252 200903 199141 199121 200677 202082 201797 200053 198436 198306 199908 202600 205408 207561
51219 207561 208939 209942 210638 210344 208460 205611 203450 203238 204935 207548 209954 211403 211773 211483 210870 209713
51203 209713 207842 206043 205518 206188 206355 204475 200707 196227 191812 187856 185080 184067 184242 184363 184042 183824
51187 183824 183673 182580 180233 178156 178210 180457 183315 185538 187159 188508 189331 189402 189341 190096 191645 192746
51171A92746o43k529l385k928j622j3J516K612K890K299J437J279K179L202K864
51156B01904Q44j340j921j004l77j160k420k520j163O12J947K764L132K935K390
51141B04623K110K387K809K812K354J857J774K180K556K168R18k63l84M86J488
51126B29875K063K114J444J0j334j489o57j36l08l6J178J798J95k789m606m160
51110B23162k880k594l379m039l873l233k619j991j239q28j334k311k312n09K024
51095A92045L358K776J176l69j469j834j082L81J181M73r59j703j339n83k69p01
51079A91082j516j820r08O92J528R89K2l94n59j084j517j071j98o9q28j503j633
51062A81213j762k197k354j694o13P1J5m91r26r67p42o55p56o29q0M92Q64J547
$$ plain form
51171 192746 192103 189574 186189 183261 181639 181626 183142 185754 188644 190943 192380 193659 195838 199040 201904
51156 201904 202748 201408 199487 198483 198106 196946 194526 192006 190843 191455 193402 196166 199298 202233 204623
51141 204623 206733 209120 211929 214741 217095 218952 220726 222906 225462 227630 228548 228285 227901 228387 229875
51126 229875 231938 234052 235496 235506 234172 232683 232026 231890 231582 231546 232724 234522 234717 231928 227322 223162
51110 223162 220282 217688 214309 210270 206397 203164 200545 198554 197315 196487 195153 192842 190530 190021 192045
51095 192045 195403 198179 199355 198986 197517 195683 194601 194982 196163 196636 195677 193974 192635 192052 191783 191082
51079 191082 189566 187746 186838 187530 189058 190047 190069 189675 189116 188032 186515 185444 185246 185177 184349 182846 181213
51062 181213 179451 177254 174900 173206 172593 172664 172679 172188 171262 170295 169553 168898 168142 167513 167433 167925 168789 170336
51044A70336K820L790L404K114J492K136K975K778J612N98O81J828K980K941J596
51029B04081O4p90j350k126k384j173Q45K021K084K401L673M834M634L147J215
51014B21176m84j255m97J355K869L227K993K843K529J726R29O59O07L68L42R91
50998B40378J853K109J695J081N13J96N45J361J436N7j565j578M0J491J534P25
50982B51871J33n5j41r2K45N21P8j277k849l426k306q5J733K204J802J518J593
50965B51467J734K066K849L472K928J508P55J255J610N14j030q77J258L289L362
50950B76160J898O18M75J146K008K887L989N610P712R488R769Q404O875O790P984
50935C51813Q896Q733Q299Q559R339R987J0394J0855J1579J2848J4979J7504J9041
$$ plain form
51044 170336 173156 176946 180350 182464 183956 186092 189067 191845 193457 194055 194736 196564 199544 202485 204081
51029 204081 204145 203355 202005 199879 197495 196322 197167 199188 201272 203673 207346 212180 216814 219961 221176
51014 221176 220692 219437 218940 220295 223164 226391 229384 232227 234756 236482 237411 238070 238677 239045 239387 240378
50998 240378 242231 244340 246035 247116 247629 247825 248370 249731 251167 251224 249659 248081 248121 249612 251146 251871
50982 251871 252004 251949 251808 251716 251961 252482 252560 251283 248434 245008 242702 242617 244350 246554 248356 249874 251467
50965 251467 253201 255267 258116 261588 264516 266024 266779 268034 269644 270158 269128 268251 269509 272798 276160
50950 276160 278058 278676 279151 280297 282305 285192 289181 294791 302503 311991 321760 330164 337039 343829 351813
50935 351813 360709 369442 377741 386300 395639 405626 416020 426875 438454 451302 466281 483785 502826
50922E02826J8787J7604J6908J7146J8126K0040K2944K5837K7714K9216L1774
50911G48922L5365L8718M1692M5538N0438N4654N7074N8942O1927O5727O8975
50900A327972P1464P3972P6648P9063Q1372Q3906Q5696Q4843Q0685P4654O8697
50889B188972O3402N7805N0511M0997L0360K0603J2819O290j91o565j1865j5759
50877B437379j8599k0155j9719j7833j6597j7530j9937k2183k3939k6144k9188
50866B205555l2307l4909l7505m0861m4889m8912n2633n6157n9286o1575o3099
50855A673422o4362o5207o4671o2462n9836n8062n6555n3550m8486m2612l7326
50844A060293l3025k9584k6862k4343k1298j7885j5219j4012j3780j3668j2998
$$ plain form
50922 502826 521613 539217 556125 573271 591397 611437 634381 660218 687932 717148 748922
50911 748922 784287 823005 864697 910235 960673 1015327 1072401 1131343 1193270 1258997 1327972
50900 1327972 1399436 1473408 1550056 1629119 1710491 1794397 1880093 1964936 2045621 2120275 2188972
50889 2188972 2252374 2310179 2360690 2401687 2432047 2452650 2465469 2471759 2471568 2465003 2453138 2437379
50877 2437379 2418780 2398625 2378906 2361073 2344476 2326946 2307009 2284826 2260887 2234743 2205555
50866 2205555 2173248 2138339 2100834 2059973 2015084 1966172 1913539 1857382 1798096 1736521 1673422
50855 1673422 1609060 1543853 1479182 1416720 1356884 1298822 1242267 1188717 1140231 1097619 1060293
50844 1060293 1027268 997684 970822 946479 925181 907296 892077 878065 864285 850617 837619
50833H37619j0811o386r36K636K990K196K950N000N985N147M061L889M001L782
50819H62123M131O048Q908J1091J1934J2310J3482J5794J8322J9778J9882J9769
50807A023572K0738K2982K5827K8764L1528L3756L5579L8133M2290M7112N0989
50796A401270N4271N9123O6421P4332Q0903Q6697R3684J02458J11836J20722J29171
50785B380888J37717J46594J55610J64136J71282J76571J80400J83291J84744
50776C881233J83316J77792J67926J54172J37319J18405R8478P8165N7698L7433
50766E091937J8060J69j6105l0699m2934n1600n5949n6528n4641n1136m6124m0022
50754D664428l4427l1512l2781l8473m7625n8275o8414p7600q7307r8830j11113
$$ plain form
50833 837619 826808 820422 819486 822122 825112 827308 830258 835258 841243 846390 850451 854340 858341 862123
50819 862123 866254 872302 881210 892301 904235 916545 930027 945821 964143 983921 1003803 1023572
50807 1023572 1044310 1067292 1093119 1121883 1153411 1187167 1222746 1260879 1303169 1350281 1401270
50796 1401270 1455541 1514664 1581085 1655417 1736320 1823017 1916701 2019159 2130995 2251717 2380888
50785 2380888 2518605 2665199 2820809 2984945 3156227 3332798 3513198 3696489 3881233
50776 3881233 4064549 4242341 4410267 4564439 4701758 4820163 4918641 4996806 5054504 5091937
50766 5091937 5109997 5110166 5094061 5063362 5020428 4968828 4912879 4856351 4801710 4750574 4704450 4664428
50754 4664428 4630001 4598489 4565708 4527235 4479610 4421335 4352921 4275321 4188014 4089184 3978071
50743C978071j21738j29890j36834j43259j47579j47805j43933j37535j29801
50734B739697j21149j12182j03537r4808q4836p3527o2517n3477m6288l9456l2019
50723A915901k4421j7519j1512o274k316n14o90j213o59N58R54Pj372k458l757
50708A844715o056r128j1912j3617j4276j4520j5108j6362j7875j8919j9233j8984
50696A668725j8182j6689j4855j3301j1887r733o604l381o35K327O223J0283J2980
50683A605271J3980J4608J6612K0905K7092L3573L8667M2339M6376N2203N9145
50672A970771O5696P1805P8551Q5943R2597R7697J01829J05479J07955J08476
50662B886799J07439J05715J03315R9459R3485Q5231P4744O2140M7599L1413J4333
$$ plain form
50743 3978071 3856333 3726443 3589609 3446350 3298771 3150966 3007033 2869498 2739697
50734 2739697 2618548 2506366 2402829 2308021 2223185 2149658 2087141 2033664 1987376 1947920 1915901
50723 1915901 1891480 1873961 1862449 1856175 1853859 1853345 1852655 1851442 1850783 1851341 1852295 1852302 1850930 1848472 1844715
50708 1844715 1838659 1829531 1817619 1804002 1789726 1775206 1760098 1743736 1725861 1706942 1687709 1668725
50696 1668725 1650543 1633854 1618999 1605698 1593811 1584078 1577474 1574093 1573458 1575785 1582008 1592291 1605271
50683 1605271 1619251 1633859 1650471 1671376 1698468 1732041 1770708 1813047 1859423 1911626 1970771
50672 1970771 2036467 2108272 2186823 2272766 2365363 2463060 2564889 2670368 2778323 2886799
50662 2886799 2994238 3099953 3203268 3302727 3396212 3481443 3556187 3618327 3665926 3697339 3711672
50651C711672k169j6683k9107m0401n0679n8275o1401o0292n6940n2955m8424
50640C234346m2945l7004l1835k8140k5448k3066k1554k2693k7551l4944m2555
50629B896611m9363n6092o3110o9097p2470p3379p3165p2226o9442o3814n6065
50618B178388m8259m2145l7754l3308k6693j7405p119K033R549J6539K3937L1412
50606B049175L8204M4301N0285N6275O1414O4584O5451O4666O2953O0296N6436
50595B674040N2026M8558M6771M5784M4346M2407M0714L9341L7641L5419L3182
50584C140229L1140K9026K7063K6217K7070K9214L2086L5492L8989M1717M3528
50573C501771M5403M7882M9800M9628M7577M5142M2791L9303L3540K5858J7438
$$ plain form
50651 3711672 3709503 3692820 3663713 3623312 3572633 3514358 3452957 3392665 3335725 3282770 3234346
50640 3234346 3191401 3154397 3122562 3094422 3068974 3045908 3024354 3001661 2974110 2939166 2896611
50629 2896611 2847248 2791156 2728046 2658949 2586479 2513100 2439935 2367709 2298267 2234453 2178388
50618 2178388 2130129 2087984 2050230 2016922 1990229 1972824 1965705 1967738 1977287 1993826 2017763 2049175
50606 2049175 2087379 2131680 2181965 2238240 2299654 2364238 2429689 2494355 2557308 2617604 2674040
50595 2674040 2726066 2774624 2821395 2867179 2911525 2953932 2994646 3033987 3071628 3107047 3140229
50584 3140229 3171369 3200395 3227458 3253675 3280745 3309959 3342045 3377537 3416526 3458243 3501771
50573 3501771 3547174 3595056 3644856 3694484 3742061 3787203 3829994 3869297 3902837 3928695 3946133
50562C946133R200J818l961p934j1025j4504j8457k1445k1875j9466j5191j0096
50550C813197m590R99N830R056J0707J1477J1677J0889Q532M149k731j2029k2322
50537C844841l1940m1204n2241o5731p9197q9754r7335j03509j08187j09808j08462
50526B957473j06480j05376j04153j01242r6496r0392q3028p5017o8024o3031
50516B064234n8869n3753m7514m1266l5517k9902k4247j8780j3479q190l263P97
50504A730251M259P963J2362J7188K1914K6022K9251L2023L5286L9388M3640M7508
50492B047055N1511N6184O0894O4751O8126P2048P6478Q0386Q3308Q5656Q7511
50481B833908Q8387Q8252Q7651Q6679Q4901Q2577Q0938Q0870Q2144Q4293Q7286
$$ plain form
50562 3946133 3955333 3957151 3953190 3945256 3934231 3919727 3901270 3879825 3857950 3838484 3823293 3813197
50550 3813197 3808607 3809606 3815436 3824492 3835199 3846676 3858353 3869242 3877774 3881923 3879192 3867163 3844841
50537 3844841 3812901 3771697 3719456 3653725 3574528 3484774 3387439 3283930 3175743 3065935 2957473
50526 2957473 2850993 2745617 2641464 2540222 2443726 2353334 2270306 2195289 2127265 2064234
50516 2064234 2005365 1951612 1904098 1862832 1827315 1797413 1773166 1754386 1740907 1732717 1729454 1730251
50504 1730251 1734510 1742473 1754835 1772023 1793937 1819959 1849210 1881233 1916519 1955907 1999547 2047055
50492 2047055 2098566 2154750 2215644 2280395 2348521 2420569 2497047 2577433 2660741 2746397 2833908
50481 2833908 2922295 3010547 3098198 3184877 3269778 3352355 3433293 3514163 3596307 3680600 3767886
50470C767886R0909R4467R7680J01305J06108J11869J17968J24546J32187J40546
50460D885471J47945J52647J54309J54017J52837J50500J45644J37322J25890
50451F206582J12228R6513P8228N7175L3981R699j4711l8549o1338q2512j01159
50440F296137j16363j28025j36584j41650j41644j35529j24362j10336r4835p8161
50430E088648o0631m2927k5761j0093K641J1460J6607J8423J5956P761o263k4962
50418D990859m7222p1729r6011j17508j35613j50994j63134j70533j73343j73641
50408C691131j72489j68744j61622j52529j43207j33731j23584j13269j03439
50399B418517r3578q3044p2582o3577n6400n0454m5051l9415l2792k5567j9316
$$ plain form
50470 3767886 3858795 3953262 4050942 4152247 4258355 4370224 4488192 4612738 4744925 4885471
50460 4885471 5033416 5186063 5340372 5494389 5647226 5797726 5943370 6080692 6206582
50451 6206582 6318810 6415323 6493551 6550726 6584707 6594406 6579695 6541146 6479808 6397296 6296137
50440 6296137 6179774 6051749 5915165 5773515 5631871 5496342 5371980 5261644 5166809 5088648
50430 5088648 5028017 4985090 4959329 4949236 4951877 4963337 4979944 4998367 5014323 5022084 5015821 4990859
50418 4990859 4943637 4871908 4775897 4658389 4522776 4371782 4208648 4038115 3864772 3691131
50408 3691131 3518642 3349898 3188276 3035747 2892540 2758809 2635225 2521956 2418517
50399 2418517 2324939 2241895 2169313 2105736 2049336 1998882 1953831 1914416 1881624 1856057 1836741
50388A836741j4777j0726n972j283K137N042R070J3849J7214J8470J9632K2756
50376A912153K7203L0464L1280L1153L2639L6430M0560M2874M3545M4183M5040
50365B317524M4773M3202M2237M3261M5175M6253M6488M6766M7045M6925M6974
50354B816623M7908M9324N0742N3036N7215O2468O7106P0698P3803P6309P7718
50343C502950P8445P8985P8417P5514P0776O5525N9634N2189M3716L5254K5706
50332D167111J2868k831j8378l2449m6760o2373p7413q9770r9686j07984j13800
50321C528535j15843j14367j10188j03253r3844q3856p4946o6299n6034m4001
50311B665904l1528j9276p362K798Q964J0652R559O991K315n407j5460k5985l5865
$$ plain form
50388 1836741 1821964 1811238 1805266 1803983 1806120 1811162 1820232 1834081 1851295 1869765 1889397 1912153
50376 1912153 1939356 1969820 2001100 2032253 2064892 2101322 2141882 2184756 2228301 2272484 2317524
50365 2317524 2362297 2405499 2447736 2490997 2536172 2582425 2628913 2675679 2722724 2769649 2816623
50354 2816623 2864531 2913855 2964597 3017633 3074848 3137316 3204422 3275120 3348923 3425232 3502950
50343 3502950 3581395 3660380 3738797 3814311 3885087 3950612 4010246 4062435 4106151 4141405 4167111
50332 4167111 4179979 4177148 4158770 4126321 4079561 4017188 3939775 3850005 3750319 3642335 3528535
50321 3528535 3412692 3298325 3188137 3084884 2991040 2907184 2832238 2765939 2709905 2665904
50311 2665904 2634376 2615100 2607738 2610536 2619500 2630152 2639711 2646702 2649017 2643610 2628150 2602165 2566300
50298B566300m5228n4233o2067o7453p0044p0929p1524p2030p1441o8998o5227
50287A847126o1369n8200n5638n2997m9485m4781l9413l4329l0027k6400k3315
50276A371172k0772j8548j6270j3959j1904r975p745n289l110j128J460N052R060
50263A278044J2678J5456J7102J7589J7716J8601K0200K1205K0911K0297K0695
50252A480494K2118K3539K4207K4155K3940K4291K5499K6743K6600K4531K1363
50241A747480J8166J5447J3587J2927J2931J2347J0671Q569O310L018j739o724
50229A852990j0342j2370j3595j4719j6412j9444k3446k6441k6964k6153k6435
50218A636669k8541l1031l2345l2077l0396k7636k4641k2521k1618k1328k0940
$$ plain form
50298 2566300 2521072 2466839 2404772 2337319 2267275 2196346 2124822 2052792 1981351 1912353 1847126
50287 1847126 1785757 1727557 1671919 1618922 1569437 1524656 1485243 1450914 1420887 1394487 1371172
50276 1371172 1350400 1331852 1315582 1301623 1289719 1279744 1271999 1266710 1263600 1262472 1263932 1268984 1278044
50263 1278044 1290722 1306178 1323280 1340869 1358585 1377186 1397386 1418591 1439502 1459799 1480494
50252 1480494 1502612 1526151 1550358 1574513 1598453 1622744 1648243 1674986 1701586 1726117 1747480
50241 1747480 1765646 1781093 1794680 1807607 1820538 1832885 1843556 1852125 1858435 1861453 1859714 1852990
50229 1852990 1842648 1830278 1816683 1801964 1785552 1766108 1742662 1716221 1689257 1663104 1636669
50218 1636669 1608128 1577097 1544752 1512675 1482279 1454643 1430002 1407481 1385863 1364535 1343595
50207A343595k0310j9684j9211j8585j6988j3893j0207p887p929r235r896r066
50195A180704p181n138l743l252k912j769l48k44j560k369j770j723m107p426
50181A137162q641p316n713n326n704o407p701r088r271q115o860o042n005l830
50167A042143l789n082n885m758k680j535j604j581m69J414K901K939J554O7j33
50152A023502Q52J716J609O85p16k257l208l129k872l496m342l899k512k289m054
50137I95590o404q188r658j0533r579p307o536q350r845q331n615n262p099p864
50123H85019o546n646o859q650q935p684n788l530j452r30k373m017l902k198
50109H16509n55Q0l2m33q60j030q71q33j309k075k719l305m104n070o061p083
$$ plain form
50207 1343595 1323285 1303601 1284390 1265805 1248817 1234924 1224717 1216830 1208901 1199666 1189770 1180704
50195 1180704 1173523 1168385 1164642 1161390 1158478 1156709 1156361 1156117 1154557 1152188 1150418 1148695 1144588 1137162
50181 1137162 1128521 1121205 1115492 1110166 1104462 1098055 1090354 1081266 1071995 1063880 1057020 1050978 1045973 1042143
50167 1042143 1038354 1033272 1027387 1022629 1019949 1018414 1016810 1015229 1014760 1016174 1019075 1022014 1023568 1023635 1023502
50152 1023502 1024354 1026070 1027679 1028364 1027648 1025391 1022183 1019054 1016182 1012686 1008344 1004445 1001933 999644 995590
50137 995590 989186 980998 971340 960807 951228 943921 937385 929035 919190 910859 905244 899982 892883 885019
50123 885019 878473 872827 865968 857318 848383 840699 834911 831381 829929 828999 826626 822609 818707 816509
50109 816509 815954 816034 816002 815569 814709 813679 812808 811975 810666 808591 805872 802567 798463 793393 787332 780249
50093G80249p876p714o337m598l486l005k731l020m351n693n061k257K25P2j856
50078G22561k629q90J884L727M387M714N064N257N415N725N791N259M842N589
50064G76696P176Q165Q162Q380R461J0064Q897P128P205R605J2229J3104J2336
50051H98608J1085J0000R329R444J0215J0534R538P847O712O241N569M665M664
50038A004451O054P624Q016P517P411P972Q176P428O558O772Q219J0104J1797
50025A108099J3367J5036J6630J7699J8019J7805J7410J6923J6347J6157J7215
50014A290707J9736K2743K5120K6928K8928L1081L2590L3482L4837L7000L8844
50003A621996L9725M0976M4110M8443N2036N4527N7292O0958O4611O7780P1416
$$ plain form
50093 780249 772373 764659 758322 753724 750238 747233 744502 741482 737131 731438 726377 724120 724345 724417 722561
50078 722561 719932 719042 720926 724653 729040 733754 738818 744075 749490 755215 761006 766265 771107 776696
50064 776696 783872 792037 800199 808579 818040 828104 837001 844129 851334 860939 873168 886272 898608
50051 898608 909693 919693 929022 938466 948681 959215 968753 976600 983312 989553 995122 999787 1004451
50038 1004451 1010505 1018129 1026145 1033662 1041073 1049045 1057221 1064649 1071207 1077979 1086198 1096302 1108099
50025 1108099 1121466 1136502 1153132 1170831 1188850 1206655 1224065 1240988 1257335 1273492 1290707
50014 1290707 1310443 1333186 1358306 1385234 1414162 1445243 1477833 1511315 1546152 1583152 1621996
50003 1621996 1661721 1702697 1746807 1795250 1847286 1901813 1959105 2020063 2084674 2152454 2223870
49992B223870P6094Q0718Q4071Q6548Q9076R1104R1032Q8288Q3646P7620O9644
49981C141711N9276M7449L6065K6603J9290J3516Q770N068K258o81n037j1040
49969C343248j8036k6287l7571n2864p0003q4963r5444j02167j06510j08215j06318
49958B534870j01426r5694r0433q4892p7906p0044o3044n7400n1793m5472l9937
49947A756829l7072l6220l4731l1491k8288k7028k7063k6459k4892k3682k3409
49936A436494k3054k1760k0140j9315j9466j9846j9743j8927j7584j6224j5403
49925A225032j5260j5359j5127j4182j2422j0162q231p299o849n363k148J425
49913A114055L133K399R50Q57K486M726O691Q422J0066J1324J2057J2791J4006
$$ plain form
49992 2223870 2299964 2380682 2464753 2551301 2640377 2731481 2822513 2910801 2994447 3072067 3141711
49981 3141711 3200987 3248436 3284501 3311104 3330394 3343910 3352680 3357748 3360006 3359325 3354288 3343248
49969 3343248 3325212 3298925 3261354 3208490 3138487 3053524 2958080 2855913 2749403 2641188 2534870
49958 2534870 2433444 2337750 2247317 2162425 2084519 2014475 1951431 1894031 1842238 1796766 1756829
49947 1756829 1719757 1683537 1648806 1617315 1589027 1561999 1534936 1508477 1483585 1459903 1436494
49936 1436494 1413440 1391680 1371540 1352225 1332759 1312913 1293170 1274243 1256659 1240435 1225032
49925 1225032 1209772 1194413 1179286 1165104 1152682 1142520 1134289 1126990 1120141 1114778 1112630 1114055
49913 1114055 1117188 1119587 1120537 1121394 1123880 1128606 1135297 1143719 1153785 1165109 1177166 1189957 1203963
49900A203963J5278J5848J5814J6068J7199J9004K1024K2896K4201K4805K5359
49889A421459K6801K9184L1892L5076L9681M5645N1266N5320N8779O3400O9465
49878A927968P6190Q3610R2512J02649J12611J21575J29827J37252J42538J44606
49868C071338J43684J40360J34443J25711J15206J04868R5985Q8569Q2083P6242
49858D178489P1057O6411O1620N5265M5637L1659J3453p905l0993n4433p7025
49847D353235r7726j15515j29360j38805j44586j48318j51209j53164j53173j50444
$$ plain form
49900 1203963 1219241 1235089 1250903 1266971 1284170 1303174 1324198 1347094 1371295 1396100 1421459
49889 1421459 1448260 1477444 1509336 1544412 1584093 1629738 1681004 1736324 1795103 1858503 1927968
49878 1927968 2004158 2087768 2180280 2282929 2395540 2517115 2646942 2784194 2926732 3071338
49868 3071338 3215022 3355382 3489825 3615536 3730742 3835610 3931595 4020164 4102247 4178489
49858 4178489 4249546 4315957 4377577 4432842 4478479 4510138 4523591 4515686 4484693 4430260 4353235
49847 4353235 4255509 4139994 4010634 3871829 3727243 3578925 3427716 3274552 3121379 2970935
$$ [...]
##END NTUPLES=NMR SPECTRUM
##END=
