##TITLE=coffee_type CCIN01-ROVE100_95-5%
COFFEE_meoh_noesyp64 COFFEE_meoh {C:\Bruker\TOPSPIN} Administrator 11
##JCAMPDX= 6.0         $$ Bruker NMR JCAMP-DX V2.0
##DATA TYPE= NMR SPECTRUM
##DATA CLASS= NTUPLES
##ORIGIN= Bruker BioSpin GmbH
##OWNER= Administrator
$$ 1.72 TOPSPIN		Version 2.1
$$ 2012-05-18 15:52:09.745 -0700  Administrator@X
$$ Compression mode = diff/dup
##.OBSERVE FREQUENCY= 400.13188235
##.OBSERVE NUCLEUS= ^1H
##.ACQUISITION MODE= SIMULTANEOUS (DQD)
##.ACQUISITION SCHEME= undefined
##.AVERAGES= 64
##.DIGITISER RES= 22
##SPECTROMETER/DATA SYSTEM= spect
##.PULSE SEQUENCE= noesygpps1d.comp
##.SOLVENT NAME= COFFEE_meoh
##.SHIFT REFERENCE= INTERNAL, COFFEE_meoh, 1, 14.98061
##AUDIT TRAIL= $$ (NUMBER, WHEN, WHO, WHERE, PROCESS, VERSION, WHAT)
$$ ##TITLE= Audit trail, TOPSPIN		Version 2.1
$$ ##JCAMPDX= 5.01
$$ ##ORIGIN= Bruker BioSpin GmbH
$$ ##OWNER= Administrator
$$ $$ C:\Bruker\TOPSPIN/data/Administrator/nmr/12-COFFEE-2502/212/pdata/1/auditp.txt
$$ ##AUDIT TRAIL=  $$ (NUMBER, WHEN, WHO, WHERE, PROCESS, VERSION, WHAT)
(   1,<2012-02-25 21:19:06.062 -0500>,<Administrator>,<TOPSPIN>,<go>,<TOPSPIN 2.1>,
      <created by zg
	started at 2012-02-25 21:07:35.797 -0500,
	POWCHK enabled, PULCHK disabled,
       configuration hash MD5:
       B0 76 FB 9C 50 81 44 7D 18 B3 26 32 4E 60 AD 96
       data hash MD5: 64K
       88 D5 33 7A 21 B4 27 C7 2F 9F A9 20 DA C5 82 8C>)
(   2,<2012-02-25 21:19:08.672 -0500>,<Administrator>,<TOPSPIN>,<proc1d>,<TOPSPIN 2.1>,
      <Start of raw data processing
       efp LB = 0.3 FT_mod = 6 PKNL = 1 PHC0 = 0 PHC1 = 0 SI = 128K 
       data hash MD5: 128K
       3D 71 88 F1 14 69 FF 19 FA A4 B8 B4 01 00 F3 DE>)
(   3,<2012-02-25 21:19:09.953 -0500>,<Administrator>,<TOPSPIN>,<proc1d>,<TOPSPIN 2.1>,
      <pk PHC0 = 25.54321 PHC1 = 0 
       data hash MD5: 128K
       C2 4D 2E 51 F6 80 5C 6A 08 DA 0E 2A 7E 3B CB E8>)
(   4,<2012-02-25 21:19:10.203 -0500>,<Administrator>,<TOPSPIN>,<proc1d>,<TOPSPIN 2.1>,
      <abs ABSG = 1 
       data hash MD5: 128K
       F1 83 73 0D F7 87 AF FD 10 67 AC F7 B6 36 A7 56>)
(   5,<2012-02-25 21:19:10.297 -0500>,<Administrator>,<TOPSPIN>,<proc1d>,<TOPSPIN 2.1>,
      <abs ABSG = 2 
       data hash MD5: 128K
       86 08 84 12 2A 71 0D D5 BF 5F 9C 62 FD A1 1B 07>)
(   6,<2012-02-25 21:19:10.344 -0500>,<Administrator>,<TOPSPIN>,<proc1d>,<TOPSPIN 2.1>,
      <abs ABSG = 3 
       data hash MD5: 128K
       EE 4D 96 E6 61 1F 24 33 AC D1 8E FD AF 59 5B 40>)
(   7,<2012-02-25 21:19:10.406 -0500>,<Administrator>,<TOPSPIN>,<proc1d>,<TOPSPIN 2.1>,
      <abs ABSG = 4 
       data hash MD5: 128K
       FA 35 DF 11 B0 D9 72 39 D9 30 3E E5 75 8C BE 64>)
(   8,<2012-02-25 21:19:10.469 -0500>,<Administrator>,<TOPSPIN>,<proc1d>,<TOPSPIN 2.1>,
      <abs ABSG = 5 
       data hash MD5: 128K
       57 39 D8 73 06 F1 D3 2A 33 60 1C 50 8F C7 1C 0F>)
(   9,<2012-02-25 21:19:10.750 -0500>,<Administrator>,<TOPSPIN>,<audit>,<TOPSPIN 2.1>,
      <user comment:
       ICON-NMR User ID: Administrator
$$ [...]
150 150 150 150 150 150 150 150
##$TP07= 0
##$TPNAME0= <>
##$TPNAME1= <>
##$TPNAME2= <>
##$TPNAME3= <>
##$TPNAME4= <>
##$TPNAME5= <>
##$TPNAME6= <>
##$TPNAME7= <>
##$TPOAL= (0..7)
0.5 0.5 0.5 0.5 0.5 0.5 0.5 0.5
##$TPOFFS= (0..7)
0 0 0 0 0 0 0 0
##$TUNHIN= 0
##$TUNHOUT= 0
##$TUNXOUT= 0
##$USERA1= <user>
##$USERA2= <user>
##$USERA3= <user>
##$USERA4= <user>
##$USERA5= <user>
##$V9= 5
##$VALIST= <valist>
##$VCLIST= <CCCCCCCCCCCCCCC>
##$VD= 0
##$VDLIST= <DDDDDDDDDDDDDDD>
##$VPLIST= <PPPPPPPPPPPPPPP>
##$VTLIST= <TTTTTTTTTTTTTTT>
##$WBST= 1024
##$WBSW= 4
##$XGAIN= (0..3)
0 0 0 0
##$XL= 0
##$YL= 0
##$YMAX_a= 13126451
##$YMIN_a= -6151792
##$ZGOPTNS= <>
##$ZL1= 120
##$ZL2= 120
##$ZL3= 120
##$ZL4= 120
##$ABSF1= 14.98061
##$ABSF2= -5.57192
##$ABSG= 5
##$ABSL= 3
##$ALPHA= 0
##$AQORDER= 0
##$ASSFAC= 0
##$ASSFACI= 0
##$ASSFACX= 0
##$ASSWID= 0
##$AUNMP= <proc_prof1d_extract>
##$AXLEFT= 0
##$AXNAME= <>
##$AXNUC= <1H>
##$AXRIGHT= 0
##$AXTYPE= 0
##$AXUNIT= <>
##$AZFE= 0.1
##$AZFW= 0.1
##$BCFW= 0
##$BC_mod= 0
##$BYTORDP= 0
##$COROFFS= 0
##$CY= 15
##$DATMOD= 1
##$DC= 0
##$DFILT= <>
##$DTYPP= 0
##$F1P= 0
##$F2P= 0
##$FCOR= 0.5
##$FTSIZE= 131072
##$FT_mod= 6
##$GAMMA= 0
##$GB= 0
##$INTBC= 1
##$INTSCL= 1
##$ISEN= 128
##$LB= 0.3
##$LEV0= 0
##$LPBIN= 0
##$MAXI= 10000
##$MC2= 0
##$MEAN= 0
##$ME_mod= 0
##$MI= 0
##$NCOEF= 0
##$NC_proc= -3
##$NLEV= 6
##$NOISF1= 0
##$NOISF2= 0
##$NSP= 0
##$NTH_PI= 0
##$NZP= 0
##$OFFSET= 14.98061
##$PC= 1
##$PHC0= 25.54321
##$PHC1= 0
##$PH_mod= 1
##$PKNL= yes
##$PPARMOD= 0
##$PPDIAG= 0
##$PPIPTYP= 0
##$PPMPNUM= 2147483647
##$PPRESOL= 1
##$PSCAL= 4
##$PSIGN= 0
##$PYNMP= <proc.py>
##$REVERSE= no
##$SF= 400.13
##$SI= 131072
##$SIGF1= 0
##$SIGF2= 0
##$SINO= 400
##$SIOLD= 131072
##$SPECTYP= <>
##$SREGLST= <1H.CDCl3>
##$SSB= 0
##$STSI= 131072
##$STSR= 0
##$SW_p= 8223.68421052632
##$SYMM= 0
##$S_DEV= 0
##$TDeff= 65536
##$TDoff= 0
##$TI= <>
##$TILT= no
##$TM1= 0
##$TM2= 0
##$TOPLEV= 0
##$USERP1= <user>
##$USERP2= <user>
##$USERP3= <user>
##$USERP4= <user>
##$USERP5= <user>
##$WDW= 1
##$XDIM= 131072
##$YMAX_p= 481544904
##$YMIN_p= -319665681
##$CURPLOT= <Network HP LaserJet P1505>
##$CURPRIN= <$Network HP LaserJet P1505>
##$DFORMAT= <normdp>
##$LAYOUT= <+/1D_H.xwp>
##$LFORMAT= <normlp>
##$PFORMAT= <normpl>
##$SURQMSG= 1
$$ End of Bruker specific parameters
$$ ---------------------------------
##NTUPLES= NMR SPECTRUM
##VAR_NAME=  FREQUENCY,     SPECTRUM/REAL,   SPECTRUM/IMAG
##SYMBOL=    X,             R,               I
##VAR_TYPE=  INDEPENDENT,   DEPENDENT,       DEPENDENT
##VAR_FORM=  AFFN,          ASDF,            ASDF
##VAR_DIM=   131072,        131072,          131072
##UNITS=     HZ,            ARBITRARY UNITS, ARBITRARY UNITS
##FACTOR=    0.0627417313425165, 1,          1
##FIRST=     8223.62146879498, 5301,         -93545
##LAST=      0,             9830,            -92738
##MIN=       0,             -319665681,      0
##MAX=       8223.62146879498, 481544904,    0
$$ Real data points
##PAGE= N=1
##DATA TABLE= (X++(R..R)), XYDATA
$$ [...]
64023 565141 572462 578722 583195 584699 583181 579486 574255 567946 561398 555392 549750 543579 536421 528731
64009 528731 521278 514469 508250 502377 496813 491963 488357 485954 484014 481913 479899 478752 478945 480439
63995 480439 483103 486830 491209 495634 500112 505742 513796 524160 535071 544867 553843 563864 576193
63982 576193 590360 605293 620726 636885 653416 669591 685374 701477 718383 735964 753944
63971 753944 771944 788982 803709 815445 824457 831159 835747 838881 842048 846722 853472 862153 872559
63958 872559 884652 898454 913998 931131 949323 968054 987529 1008628 1032057 1057774 1085017
63947 1085017 1112425 1138290 1161625 1183062 1204017 1224899 1244983 1264076 1283146 1302987 1323421
63936 1323421 1344436 1367108 1392617 1421290 1453384 1489802 1530960 1575797 1623182 1673749 1729043
63925 1729043 1789356 1853904 1923065 1998915 2083142 2175356 2273782 2376916 2484509 2597870 2719455
63914 2719455 2851401 2994157 3147041 3310016 3484238 3671064 3871690 4088030 4322872
63905 4322872 4578734 4857560 5162179 5497322 5868514 6280509 6737451 7244009 7805717
63896 7805717 8428378 9117604 9878217 10712933 11621161 12599147 13641041 14739376 15884787
63887 15884787 17065961 18270185 19483529 20689810 21868872 22995826 24042635 24981790
63879 24981790 25790046 26450197 26950757 27284739 27448181 27438518 27253722 26893445 26361654 25668573
63869 25668573 24830606 23868991 22808086 21673364 20489251 19277707 18057919 16846550
63861 16846550 15658182 14506070 13402580 12358325 11380649 10473297 9637577 8873197 8177961
63852 8177961 7547683 6977296 6461970 5997206 5578579 5201909 4863245 4558391 4282966
63843 4282966 4033273 3806543 3600054 3410812 3236539 3076026 2927800 2789364 2658763
63834 2658763 2536069 2421904 2314932 2212298 2112491 2016411 1925497 1840090 1759885 1684546
63824 1684546 1613070 1543620 1474997 1407895 1344041 1284444 1228999 1177271 1128956 1083745 1041265
63813 1041265 1001156 963031 926668 892470 861280 833306 807536 782645 758261 734862 712637
63802 712637 691091 669882 649630 631657 616931 605249 595321 585739 576027 566808 558990 552968 548536
63789 548536 545247 542680 540647 539344 539137 539982 541173 541777 541176 539180 535839 531204 525045 516870 506657
63774 506657 495484 484710 474349 463070 450334 437676 426969 418014 408938 398746 388295 378662
63762 378662 369776 361124 352804 345082 337434 328844 318936 308397 298440 290120 283838 279116 275090 271533
63748 271533 269065 268016 267506 266152 263375 259454 254703 249468 244780 241940 241061 240768 239735 237962 236084
63733 236084 234162 231897 229591 227967 227066 226154 224941 224239 225006 227072 229113 229737 228468 225947 223322
63718 223322 221276 219490 217287 214743 212719 211669 211031 210254 209888 210853 212769 213816 212506 209098 205113
63703 205113 201870 199752 198517 197920 198081 199341 201668 204324 206430 207836 208958 209742 209417 207562 204874
63688 204874 202445 200814 200148 200749 202581 204686 206004 206689 207827 209922 212494 215168 218134 221349 224375
63673 224375 227587 232566 240342 249886 259244 267781 276395 285880 296174 307093 318528 329625 338875
63660 338875 345723 351321 356886 361729 363801 362043 357542 352361 347904 344546 342152 340301 338196 335025
63646 335025 330755 326361 322927 320540 318311 315625 312999 311393 310877 310497 309489 308131 307069 306320 305398
63631 305398 304112 302546 300244 296331 291036 286546 285344 287489 290265 291104 290435 290998 294527 299950 305078
63616 305078 309297 313902 320194 327985 335974 343050 349156 355259 362498 371004 379519 386493 391435 394725
63602 394725 396233 394970 390420 383516 375814 368135 360510 353003 345928 339430 333415 327854 322750 317914
63588 317914 313184 308782 305082 302116 299651 297730 296759 297130 298984 302245 306607 311656 317219 323412 330106
63573 330106 336890 344047 352956 364549 377644 389857 400337 410745 423346 439028 457379 477722
63561 477722 499452 522110 545823 571345 599264 629586 662212 697005 732986 768474 802882
63550 802882 837588 873977 911057 946007 976638 1002260 1022575 1037200 1046500 1051658 1053530 1052301
63538 1052301 1048597 1043914 1039286 1034174 1027267 1017875 1006083 992128 976198 958473 938853 916961
63526 916961 892941 868020 843869 821620 801743 784385 769115 754670 739712 724077 708849
63515 708849 695199 683485 673591 665757 660785 659309 660821 663540 665662 666947 668717 672162 677196 683355
63501 683355 691167 701725 715223 730901 748537 769019 793015 819811 848089 877489 908883 943242
63489 943242 980521 1019354 1057380 1092040 1121624 1145948 1166067 1183310 1198377 1210986 1220294 1225944
63477 1225944 1228854 1230753 1232856 1235249 1237391 1238446 1236762 1229951 1216455 1196822 1172651 1144605 1112416
63464 1112416 1076683 1039300 1001612 963203 923322 882752 843323 806023 770631 737146 706465
63453 706465 679318 655193 632779 611124 590073 569891 550843 533114 516932 502730 491046
63442 491046 482008 474984 468968 463278 457649 451882 446044 441145 438949 440491 444906 449979 453832 456085
63428 456085 457777 460459 465107 471545 478885 486523 494535 503186 512546 522713 533711 544708 553885
63415 553885 559876 563173 565385 567203 567729 565805 561276 554627 546079 535697 524251 513364 504568 498272
63401 498272 493787 490380 488073 487250 487619 488127 488107 488042 488822 490598 492870 495392 498334 501678 505083 508521
63385 508521 512521 517634 523929 531076 538698 546722 555647 566325 579231 594268 611648 632359 656972
63372 656972 684471 713292 743315 775735 811102 848853 888814 931601 977021 1023608 1070617
63361 1070617 1119102 1169886 1221610 1272086 1320593 1367270 1410883 1448882 1479476 1502285 1517181
63350 1517181 1524090 1524041 1518993 1510300 1498435 1484324 1469511 1454476 1437974 1418647 1396181 1370246
63338 1370246 1339645 1303772 1264250 1223831 1183850 1143748 1102964 1062337 1023482 987568 955172
63327 955172 926795 902817 882818 865394 849205 834321 822113 813590 808317 805442 805227 808543 815023
63314 815023 822806 830557 838966 849945 865061 885055 909940 938700 969368 1000269 1031253 1063545
63302 1063545 1098626 1137377 1179593 1223804 1268004 1311004 1352585 1391878 1426385 1453500 1472631
63291 1472631 1484882 1490967 1490622 1484176 1473582 1461325 1448830 1436387 1424039 1411732 1398535 1382356
63279 1382356 1361078 1334193 1303130 1269759 1234801 1198044 1159835 1121462 1083866 1046820 1010022
63268 1010022 974355 941260 911102 882855 855334 828180 801856 777334 755739 737580 722076
63257 722076 707577 692852 677895 663684 651398 641642 634010 627542 621910 617817 615934 615811 616325
63244 616325 616759 616771 615756 613194 609580 606181 603737 601960 600204 597984 594936 591011 586657 582143 576863
63229 576863 570202 563061 557577 555124 555341 557024 558987 560044 559510 558138 557503 558011 558651 559101 560587 563782
63213 563782 567218 569212 570395 572739 576648 580589 583445 585745 588446 591720 595252 598743 601862 604597
63199 604597 607896 613084 620234 627831 634436 640121 646002 653072 661931 672988 686161 700533 714862
63186 714862 728470 741475 754414 767927 782653 799071 817363 837414 858825 880934 903186
63175 903186 925749 949574 975570 1003792 1033695 1065043 1098151 1132947 1168144 1201926 1233664
63164 1233664 1264510 1295817 1327287 1357369 1385467 1412896 1441258 1470639 1500020 1528795 1556907
63153 1556907 1583678 1607493 1626842 1641037 1649779 1652709 1649693 1640994 1626769 1606761 1580877 1549867
63141 1549867 1515178 1478327 1440649 1403450 1368023 1335377 1305977 1279637 1255751 1233942 1214714
63130 1214714 1199401 1189147 1183807 1181920 1182033 1184179 1189816 1199961 1213640 1228813 1244737 1262424
63118 1262424 1282427 1303297 1323256 1342646 1363338 1385950 1409043 1431131 1452020 1471686 1489253
63107 1489253 1504164 1517462 1530587 1543073 1552322 1555690 1552254 1542842 1529055 1512287 1492938 1470307
63095 1470307 1443549 1412878 1379638 1345337 1311028 1277537 1245648 1215700 1187317 1160028 1134126
63084 1134126 1110592 1090050 1072071 1055719 1040566 1026754 1014208 1002458 991469 981954 974329 967880
63072 967880 961688 956016 951930 949771 948903 948828 949451 950177 949912 948418 946722 945740 945467 945979 948122 952327
63056 952327 957617 962780 967908 973788 980331 986634 992276 997593 1002966 1008586 1014548 1020364 1024875 1027618
63042 1027618 1029880 1033304 1037850 1042322 1046618 1051974 1058892 1066207 1072657 1078373 1084477 1091919 1100813 1110061
63028 1110061 1117682 1122564 1125956 1130156 1135789 1141694 1147423 1154149 1162667 1172256 1182309 1193527 1206495
63015 1206495 1220539 1235080 1250784 1268125 1286216 1304520 1324445 1347397 1372286 1396941 1421363
63004 1421363 1447529 1476453 1507573 1540868 1577297 1616762 1657766 1699847 1744527 1792949 1844151
62993 1844151 1896802 1951271 2008639 2068633 2129987 2192385 2256800 2323937 2393084 2462509 2530540
62982 2530540 2596435 2660614 2723862 2786205 2846932 2905846 2963854 3022005 3080355 3138039 3193877
62971 3193877 3246673 3295494 3340014 3380028 3414352 3440761 3457225 3462517 3455566 3435396 3402366 3358531
62959 3358531 3306065 3246058 3179499 3108402 3034950 2960334 2885664 2813374 2746407 2686257 2632856
62948 2632856 2586049 2545971 2512217 2484027 2461469 2445436 2436296 2433456 2436303 2444624 2457950 2475394
62936 2475394 2496376 2520718 2547851 2576778 2607006 2638575 2670780 2701766 2730062 2755913 2780463
62925 2780463 2803758 2823960 2838498 2845944 2846846 2842441 2832395 2814420 2786770 2750421 2707614 2658764
62913 2658764 2602384 2538068 2467841 2394155 2318168 2240787 2163847 2088844 2015461 1942747 1871244
62902 1871244 1802824 1738804 1679174 1623383 1571011 1521907 1476453 1435367 1398538 1364448 1331536
62891 1331536 1299862 1270566 1244120 1220089 1198420 1179767 1164147 1150063 1135450 1119371 1102717
62880 1102717 1087357 1074339 1062714 1050653 1037983 1026849 1019073 1013533 1007200 998311 987451 975921
62868 975921 964443 953497 943414 933611 922806 910709 898830 889042 881823 876285 871327 866229 860507
62855 860507 853903 846715 840082 835694 834613 835897 836827 835234 831485 827647 825102 823782 823299 823569 824266
62840 824266 824835 825232 825600 825224 823185 820344 819187 820984 824379 827589 830578 833909 836686 837297 835641
62825 835641 833128 830766 828467 826065 823724 821302 818377 815009 811671 808442 805063 801651 798457 795079
62811 795079 790993 786957 784641 784374 784194 781773 776726 770568 764982 760609 757025 753214 748178 741584 733965
62796 733965 726392 720114 716190 714772 714549 713638 711389 708837 707061 705740 703991 702066 701246 701985 703017
62781 703017 702698 700894 699150 699190 701435 704840 707894 709799 710950 712395 714771 717648 719979 721241 722080
62766 722080 723705 726765 730913 735346 739416 742787 745499 748092 751260 755042 758648 761430 763755 766540
62752 766540 770185 774507 779435 785091 791124 796751 801828 807348 814409 822978 832189 841702 852340 865265
62738 865265 880794 898188 916514 935631 956319 979464 1005174 1032720 1061282 1090735 1121876
62727 1121876 1156121 1194891 1238942 1288024 1341274 1398125 1458851 1524160 1594279 1668676 1746894
62716 1746894 1829580 1918181 2013282 2113413 2215965 2319143 2422523 2525745 2627368 2725218
62706 2725218 2817068 2900453 2972450 3030478 3073073 3099330 3108078 3098636 3072201 3031389 2978091 2912539
62694 2912539 2834858 2746748 2651073 2550308 2445990 2339486 2232759 2128222 2027859 1932295
62684 1932295 1840791 1752522 1667977 1588646 1515305 1447201 1383279 1323608 1269083 1220180 1176668
62673 1176668 1138273 1104728 1075088 1047734 1021536 996716 974185 954180 935953 918851 903301
62662 903301 890294 880002 871462 863936 858134 855494 856400 859683 863874 868353 873301 879372 887804 900032
62648 900032 916452 935963 957349 980764 1007107 1036362 1067648 1101055 1138335 1181124 1229036
62637 1229036 1280251 1333778 1390483 1451800 1517942 1587721 1659810 1733638 1808818 1884044 1957092
62626 1957092 2026105 2090489 2150117 2203728 2248513 2281483 2301086 2307396 2301012 2282202 2251176 2208803
62614 2208803 2156644 2096259 2028889 1955962 1879578 1802011 1724743 1648322 1573195 1500239 1430360
62603 1430360 1363961 1301111 1241981 1186804 1135549 1087951 1043750 1002638 964127 927883 894210
62592 894210 863738 836358 810799 785703 761149 738769 720061 704694 690757 676655 662484
62581 662484 649412 638113 628167 618757 609405 599981 590483 581075 572119 564001 557003 551257 546497 542035
62567 542035 537537 533874 532441 533327 534865 535576 535851 536865 538380 538935 538211 537945 539921 544038 549209 555454
62551 555454 563896 574753 586502 597471 607541 617690 628489 639902 652423 667397 685903 707877
62539 707877 732676 759905 789257 820156 852470 887348 926397 969861 1016274 1064101 1113040
62528 1113040 1163480 1215510 1268945 1323699 1379254 1433932 1485205 1530744 1568978 1598975 1620243
62517 1620243 1632507 1635436 1628805 1613177 1590032 1560879 1526585 1487813 1445470 1400135 1351698 1300506
62505 1300506 1248469 1198089 1150548 1105644 1063394 1024483 989029 956159 925259 896650 870437
62494 870437 845647 821369 798175 777530 760016 744723 730150 715334 700491 687048 676552
62483 676552 668836 661606 652616 642055 632014 623774 616628 609549 602934 598008 595124 593540 592779 593385
62469 593385 596065 600482 605323 609492 612968 616557 621223 627842 637242 649915 665566 683359 702701
62456 702701 723581 746128 770361 796583 825433 857063 890646 925346 961537 1000273 1041522
62445 1041522 1083637 1124792 1164276 1201959 1237081 1268202 1294154 1314411 1328635 1336397 1337422 1331658
62433 1331658 1319024 1299664 1274766 1246689 1217655 1188346 1158171 1126746 1094540 1062073 1029413
62422 1029413 997102 966899 940463 917324 895258 873133 852449 835300 821476 808731 795727
62411 795727 783466 773521 765909 759453 753463 748096 743352 738767 734187 730152 727223 725460 724744 725128
62397 725128 726565 728735 731585 735770 742126 750707 760542 770257 778965 786869 795126 804652 814806 823811
62383 823811 830857 837161 844055 850632 854605 855496 855503 856523 857380 855031 847932 837206 824768 811399 796823
62368 796823 780887 764185 747801 732640 718889 706109 694077 683366 674744 668064 662142 655854
62356 655854 649115 642777 637887 635066 634361 635482 638174 642331 647761 654105 661109 668689 676537 684098
62342 684098 691386 699485 709598 721698 734608 747288 759589 771958 785052 799467 814965 829913
62330 829913 842447 852443 861572 871031 880003 886847 891043 893299 894419 894943 895627 897335 900391 904481
62316 904481 909192 914422 920583 928874 940941 957602 977948 1000298 1024052 1050179 1080061 1114421
62304 1114421 1153433 1197296 1246468 1301544 1362823 1429659 1500388 1573430 1648484 1726162 1806431
62293 1806431 1887814 1967978 2044325 2113943 2173917 2222492 2259635 2286015 2301748 2306547 2300724 2285249
62281 2285249 2260804 2227339 2184845 2134239 2077214 2015368 1949707 1881089 1811054 1742004 1676249
62270 1676249 1614693 1556626 1500955 1447475 1396776 1349153 1304146 1261235 1220449 1182000 1145700
62259 1145700 1111316 1079382 1051068 1026981 1006500 988524 972674 959405 949079 941234 934808 928961
62247 928961 923762 920122 918853 919581 920886 921791 922747 924638 927093 928628 928477 927549 927357 928577 930743 932554
62231 932554 932257 928880 923929 920999 922423 926696 930348 932256 934750 940288 948421 956870 964643 972909
62217 972909 983130 995454 1009139 1023698 1039101 1055358 1072670 1092043 1115010 1142183 1172324
62206 1172324 1203546 1235491 1269726 1307903 1350308 1396640 1447289 1502871 1562920 1626142 1691904
62195 1691904 1760494 1831936 1905437 1979969 2054102 2124873 2188052 2240411 2281111 2310278 2327231
62184 2327231 2331138 2322660 2303595 2275095 2237324 2190777 2136712 2076200 2009947 1939517 1867817 1797708
62172 1797708 1730700 1667379 1608360 1554043 1504003 1457559 1414855 1376642 1342980 1312849 1285224
62161 1285224 1260095 1238204 1220190 1206141 1195520 1187230 1180155 1174052 1169633 1167344 1166297 1165073 1163515
62148 1163515 1162979 1164577 1167832 1171549 1175516 1180509 1186822 1193628 1200074 1206462 1214007 1223693 1235607 1249197
62134 1249197 1263863 1279368 1295826 1313424 1332354 1353132 1376603 1403049 1431414 1460122 1488854
62123 1488854 1518788 1550620 1582895 1613016 1639810 1664549 1689452 1715534 1742042 1767766 1792712
62112 1792712 1818401 1846451 1877235 1910516 1947193 1989309 2037856 2091459 2148003 2206711 2267446
62101 2267446 2328458 2386313 2438144 2482795 2519567 2547232 2565071 2574002 2575835 2571874 2562722 2548701
62089 2548701 2529628 2504754 2473989 2439108 2402871 2366938 2331358 2296101 2262154 2230707 2202022
62078 2202022 2175926 2153121 2135036 2121981 2112030 2102432 2092093 2082103 2073796 2067154 2061642 2057835 2057016
62065 2057016 2059264 2063137 2067558 2073078 2080751 2090734 2102768 2117329 2135177 2156033 2178661 2202261
62053 2202261 2227060 2253524 2281718 2311595 2343298 2376971 2412625 2450186 2489331 2529417 2570225
62042 2570225 2612764 2658664 2708522 2761385 2816023 2872104 2929633 2987622 3043895 3096417 3144955
62031 3144955 3191723 3240287 3293269 3350642 3410081 3468692 3524278 3575773 3623750 3670713 3719835
62020 3719835 3772666 3828499 3886245 3946204 4009349 4075518 4143221 4211091 4278809 4346643 4414759
62009 4414759 4483259 4552592 4623680 4697458 4774034 4852196 4930072 5006444 5081128 5153940 5223764
61998 5223764 5288912 5348042 5400514 5446483 5487045 5523593 5556291 5583641 5604313 5618978 5629480
61987 5629480 5636589 5639676 5638396 5633498 5625865 5616104 5605611 5596774 5591031 5587293 5583376 5578798 5575269 5574364
61973 5574364 5575507 5576607 5576224 5574685 5573270 5572788 5573073 5573459 5573260 5571775 5568388 5563063 5556567 5549859 5543262
61958 5543262 5536368 5528572 5519620 5509957 5500766 5493337 5487996 5483890 5479974 5475776 5471136 5466185 5462280 5461878
61944 5461878 5466060 5472764 5479043 5484792 5492490 5503245 5515038 5525477 5534337 5542246 5548505 5551863 5552432
61931 5552432 5551151 5547879 5541378 5530788 5515911 5496623 5473398 5447993 5421991 5394751 5364382 5330932
61919 5330932 5297086 5265233 5235155 5205177 5174376 5142756 5110225 5076474 5041564 5005986 4970428
61908 4970428 4935783 4902768 4870961 4838797 4805181 4770725 4736784 4703699 4670785 4637831 4605724
61897 4605724 4575384 4546759 4519213 4492581 4467428 4444385 4423594 4404939 4388477 4374223 4361568
61886 4361568 4349710 4339156 4332199 4330994 4335306 4343000 4352648 4364531 4378922 4394795 4411202 4429013
61874 4429013 4450082 4475019 4502813 4532395 4563571 4596464 4631173 4668226 4708607 4752922 4801152
61863 4801152 4853441 4910427 4972384 5038836 5109802 5187094 5273595 5371347 5480989 5603042 5739064
61852 5739064 5891326 6061919 6252624 6465220 6701356 6962277 7249264 7564498 7911002
61843 7911002 8291476 8707431 9159693 9649361 10177612 10744371 11347288 11981861 12641843
61834 12641843 13318765 14000447 14669320 15301645 15868555 16339213 16685073 16883692 16921442
61825 16921442 16795607 16515582 16101417 15579021 14974519 14311484 13611610 12895642 12181917
61816 12181917 11483827 10809367 10163446 9550398 8974365 8438110 7942137 7484956 7064002
61807 7064002 6676742 6321603 5997970 5704928 5440055 5199858 4981386 4782927 4603122
61798 4603122 4440231 4292709 4159953 4041801 3937525 3845761 3765010 3693639 3629769 3572077
61788 3572077 3520634 3476202 3438564 3406252 3377947 3353157 3331109 3309818 3287131 3262401 3236655
61777 3236655 3211396 3187724 3166171 3146559 3128066 3110176 3093818 3081103 3073632 3071270 3072733 3076999
61765 3076999 3083778 3092785 3103034 3113138 3122111 3129619 3135517 3139513 3141486 3141892 3141681 3142011 3144192 3149531
61751 3149531 3158703 3171501 3187814 3208777 3236249 3271033 3312311 3359178 3412068 3472202 3540182
61740 3540182 3615778 3698800 3789522 3888389 3995920 4112949 4240487 4379277 4529726 4692250
61730 4692250 4867305 5055133 5255853 5470044 5699127 5945205 6210663 6497907 6809275
61721 6809275 7147150 7514224 7913641 8348963 8824175 9343689 9911959 10532931 11210134
61712 11210134 11947370 12748840 13618238 14557953 15569021 16650708 17798934 19004874 20254917
61703 20254917 21530592 22806663 24048713 25213169 26250274 27108088 27737208 28097627
61695 28097627 28166680 27943684 27448369 26715128 25786857 24709858 23529495 22287087 21018551
61686 21018551 19753805 18515802 17320265 16177603 15095766 14081053 13136498 12261016
61678 12261016 11451336 10704760 10019573 9393240 8821350 8298765 7821204 7385287 6987619
61669 6987619 6624589 6292922 5989679 5711693 5455752 5219674 5002580 4803559 4620379
61660 4620379 4450030 4290348 4140637 4000842 3870505 3748363 3632576 3521554 3415090
61651 3415090 3314562 3221431 3135544 3055360 2979701 2908475 2841559 2777861 2716123 2656210 2599021
61640 2599021 2545302 2494815 2446471 2399021 2351990 2306336 2263823 2225132 2188709 2152025 2114110
61629 2114110 2076399 2041004 2008623 1978453 1949721 1922594 1897452 1873799 1850465 1826745 1802820
61618 1802820 1779000 1755309 1732354 1711932 1695628 1682694 1670374 1656884 1643364 1632113 1623304
61607 1623304 1614463 1603314 1590264 1577536 1566345 1555709 1544055 1531261 1518667 1507484 1497944 1489886
61595 1489886 1483342 1478134 1473577 1469312 1466015 1464510 1464380 1464330 1463880 1463718 1464178 1464384 1463597 1462728 1463631 1467060
61579 1467060 1471844 1475985 1478164 1478415 1477849 1477804 1478942 1481006 1483319 1485358 1487022 1488853 1492008 1497374 1504487
61564 1504487 1511834 1518383 1524175 1529233 1532932 1534955 1535910 1536092 1534467 1529895 1522715 1513963 1503696 1491495
61550 1491495 1478136 1465086 1452399 1438848 1424435 1411055 1400036 1390549 1381307 1372435 1364415 1356290
61538 1356290 1346434 1334689 1322653 1312188 1304448 1299789 1297553 1296281 1295219 1295417 1298439 1304252 1311345
61525 1311345 1318637 1326170 1334146 1342631 1352412 1364835 1380222 1397275 1414581 1432054 1450583 1471005
61513 1471005 1493861 1519518 1548040 1579389 1613959 1652252 1693774 1737072 1781256 1826599 1872973
61502 1872973 1918633 1961566 2001487 2039489 2076184 2111323 2145034 2178131 2210984 2243057 2273898
61491 2273898 2303749 2332795 2360399 2385555 2407642 2426502 2442205 2454995 2465032 2471873 2474695 2473420
61479 2473420 2469257 2463746 2457434 2449786 2440221 2429053 2417674 2407892 2400674 2395320 2390318 2385377 2382206
61466 2382206 2382996 2388609 2398715 2413109 2432091 2455837 2484378 2518200 2558042 2604006 2655727 2713770
61454 2713770 2780061 2856387 2943027 3039456 3145895 3263388 3392632 3533672 3686985 3854114
61444 3854114 4036771 4235558 4449895 4678844 4921539 5176791 5442669 5716540 5995084
61435 5995084 6273668 6545486 6801516 7031785 7227184 7380637 7487409 7545295 7555106 7520727
61425 7520727 7447974 7342856 7210669 7056431 6885584 6703910 6516947 6329669 6146406 5970522
61415 5970522 5804121 5648455 5504736 5374284 5257899 5155673 5067716 4994585 4936585 4893064
61405 4893064 4863067 4846423 4843368 4853054 4873254 4901912 4938411 4983042 5035758 5095884 5162417 5233944
61393 5233944 5308619 5384953 5462518 5541294 5620521 5698891 5775846 5851964 5927860 6003212 6076958
61382 6076958 6147804 6214376 6275520 6330976 6381385 6427318 6468685 6505328 6537586 6565613 6588637
61371 6588637 6605819 6617866 6627001 6635000 6641697 6645678 6646001 6642807 6636389 6626315 6611842 6593161 6571802
61358 6571802 6549397 6526036 6500285 6471121 6439658 6408590 6380075 6354453 6330803 6308073 6285492
61347 6285492 6262464 6238677 6214245 6189317 6163449 6135578 6104777 6071115 6035912 6001338 5969695
61336 5969695 5942782 5921650 5906920 5899450 5900758 5912794 5937348 5975854 6029770 6100773 6190091 6297737
61324 6297737 6423013 6566162 6729144 6914230 7121841 7350081 7596252 7858316 8134776
61315 8134776 8423545 8721017 9021589 9317572 9599784 9858863 10086343 10274790 10417650
61306 10417650 10509993 10549888 10538949 10481341 10382011 10245467 10075550 9875835 9650004 9401903
61296 9401903 9135532 8855388 8566878 8275870 7987226 7703724 7426631 7157202 6897251
61287 6897251 6648470 6412029 6189300 5982461 5793670 5623561 5470811 5333210 5209044
61278 5209044 5097708 4999415 4914464 4842767 4784109 4738763 4707277 4689253 4682761 4685673 4697514
61267 4697514 4719216 4750853 4790327 4834794 4882875 4934897 4991213 5050903 5112038 5172613 5231085
61256 5231085 5286448 5338097 5385435 5427558 5463555 5493376 5518247 5539923 5559252 5575300 5585779
61245 5585779 5588498 5582673 5569059 5548892 5522827 5490869 5453027 5409704 5361618 5309775 5255582 5200509
61233 5200509 5145256 5089443 5032365 4973996 4915059 4856337 4798384 4742015 4688611 4639401 4594343
61222 4594343 4552025 4510993 4471225 4434137 4401100 4372109 4346034 4321942 4299683 4279029 4258678
61211 4258678 4236754 4212444 4186794 4161577 4137599 4114519 4092330 4072568 4057772 4049921 4049571 4056155
61199 4056155 4068587 4085635 4106416 4131136 4161429 4199686 4247815 4306364 4374589 4451408 4536476
61188 4536476 4630389 4733637 4845376 4963362 5084829 5206932 5326289 5438669 5539277 5622769
61178 5622769 5682876 5713140 5709280 5671012 5601254 5503940 5383121 5243374 5089603 4926056 4756279
61167 4756279 4584160 4414042 4249254 4091118 3939810 3795644 3659242 3531135 3411874
61158 3411874 3302079 3201805 3110156 3026045 2949017 2878974 2815664 2759087 2709895 2668395 2633313
61147 2633313 2602546 2575347 2552977 2536935 2527223 2522759 2522868 2527708 2537349 2551028 2567454 2585658
61135 2585658 2605210 2625375 2644134 2658675 2667407 2671294 2672615 2672479 2670177 2664788 2656474 2645900 2633180
61122 2633180 2618026 2600366 2580267 2557750 2533267 2507957 2482705 2457190 2430510 2402441 2373256
61111 2373256 2342594 2309635 2274560 2238804 2203316 2167353 2129586 2089764 2048625 2006739 1964424
61100 1964424 1922656 1883073 1846710 1813227 1781601 1751258 1722327 1695089 1669383 1644367 1618808
61089 1618808 1591813 1563430 1534286 1504604 1473881 1441783 1409112 1377428 1347671 1319456 1292060
61078 1292060 1265941 1242795 1223838 1208390 1194748 1182331 1172243 1165524 1161634 1159221 1157713 1157342
61066 1157342 1158070 1159699 1163011 1169593 1180004 1192831 1206023 1218640 1230919 1243322 1256049 1269079
61054 1269079 1282178 1295201 1308740 1324002 1341529 1360388 1379022 1396424 1411987 1424911 1434627
61043 1434627 1441535 1446450 1449463 1450029 1448010 1443813 1437630 1429460 1419952 1410386 1401558 1393282 1385173 1377241
61029 1377241 1369480 1361639 1353783 1346424 1339603 1332343 1323763 1314523 1306562 1301278 1298278 1296003 1293331 1290341
61015 1290341 1287624 1285261 1282876 1280507 1278653 1277221 1275187 1271960 1268519 1266346 1265696 1265882 1266903 1269399
61001 1269399 1272970 1276006 1277791 1279598 1282917 1287575 1292524 1297699 1303947 1311541 1319918 1328741 1338215 1348182
60987 1348182 1357840 1366826 1376013 1386829 1400058 1415609 1433236 1453034 1475240 1499862 1526607 1554998
60975 1554998 1584493 1614882 1646886 1682012 1721151 1763515 1807752 1854165 1904748 1960642 2020805
60964 2020805 2084041 2151240 2224261 2303496 2388096 2478053 2574217 2676538 2784276 2898189 3020576
60953 3020576 3152588 3293281 3442012 3600059 3768719 3947153 4133322 4326096 4525699
60944 4525699 4733430 4952250 5186853 5442073 5721787 6029663 6369527 6743929 7153720
60935 7153720 7600664 8090224 8631772 9237925 9924656 10710287 11612472 12646530 13826539
60926 13826539 15165955 16677637 18378233 20295231 22466158 24929329 27719936 30868464
60918 30868464 34366104 38082428 41703031 44792688 46992377 48209096 48640151 48629225
60910 48629225 48501444 48493720 48745587 49255517 49811605 50012918 49441468 47880699 45410022
60901 45410022 42318742 38939593 35533291 32263125 29215221 26421475 23880032 21577181
60893 21577181 19501534 17644027 15992792 14532921 13248683 12122634 11134375 10263217
60885 10263217 9491845 8806422 8194946 7647289 7155643 6713278 6313675 5951701 5623974
60876 5623974 5326790 5055336 4806207 4578627 4370980 4177709 3992122 3811334 3636309
60867 3636309 3468147 3307035 3154288 3012261 2881504 2760032 2646043 2539650 2441272 2349806
60857 2349806 2263232 2180109 2100049 2023569 1951752 1885229 1823231 1764352 1708202 1655334 1605655
60846 1605655 1558161 1512575 1470104 1431867 1397245 1364378 1331898 1299836 1269122 1240455 1213576
60835 1213576 1187673 1162566 1139155 1118479 1100896 1086491 1075455 1067371 1060895 1055148 1050741 1048340
60823 1048340 1047016 1045436 1044126 1044807 1047658 1050996 1053751 1056476 1059582 1062390 1064582 1066917 1069496 1070758
60809 1070758 1069403 1066261 1063061 1060206 1057016 1053467 1050247 1047380 1044083 1040112 1036252 1033212 1030763 1028301
60795 1028301 1025744 1023561 1022208 1021911 1023030 1026260 1032159 1040429 1050114 1060761 1072963 1087213 1102594
60782 1102594 1117402 1130949 1143894 1156755 1169149 1180876 1192760 1205628 1218939 1231118 1240996
60771 1240996 1248443 1253940 1258207 1262142 1266575 1271805 1277469 1282911 1287776 1292388 1297427 1302991 1308197 1312200
60757 1312200 1315425 1319108 1323609 1327991 1331474 1334427 1337401 1339851 1340540 1338868 1335196 1330082 1323672 1315775
60743 1315775 1306181 1295061 1283264 1271875 1261177 1250262 1238047 1224469 1210500 1197334 1185935
60732 1185935 1176946 1170391 1165459 1161054 1156624 1152319 1148608 1146150 1145854 1148349 1153185 1159012 1164945 1171525
60718 1171525 1179912 1190199 1201016 1211033 1220477 1230727 1242692 1256245 1271188 1287830 1306083 1324691
60706 1324691 1342110 1357891 1372601 1386833 1401034 1415842 1431514 1447062 1460941 1472710 1483131
60695 1483131 1492585 1500469 1506492 1511459 1516159 1520332 1523569 1526504 1530154 1534331 1537586 1538776 1538201 1537144
60681 1537144 1536545 1536087 1534433 1530533 1524706 1518266 1512178 1506548 1501282 1496425 1491602 1485905 1478824 1470746
60667 1470746 1462130 1452815 1442565 1431749 1420945 1410397 1400372 1391517 1384253 1378306 1373414 1369952 1368172
60654 1368172 1367255 1365960 1363994 1362088 1360987 1360896 1361536 1361970 1360724 1356968 1351459 1345578 1339654 1333112 1326033
60639 1326033 1319378 1313559 1307911 1302096 1297008 1293542 1291095 1288240 1284650 1281513 1279853 1279023 1277218 1273244
60625 1273244 1267429 1260826 1254025 1246945 1239246 1230299 1218975 1204447 1187482 1170074 1153276 1136174
60613 1136174 1117750 1099142 1082985 1070668 1061167 1052534 1043682 1034554 1025485 1017012 1009922 1004962 1002437
60600 1002437 1002048 1003057 1004744 1006988 1010219 1014570 1019325 1023681 1027855 1032969 1039906 1048745 1059125 1070521
60586 1070521 1082126 1092974 1102390 1110080 1115928 1120057 1122995 1125437 1127984 1131352 1136303 1142751 1149427
60573 1149427 1155277 1160918 1167797 1176165 1184999 1193776 1203063 1213325 1224567 1237488 1253562 1273174 1294826
60560 1294826 1316995 1339681 1363187 1386506 1408306 1428829 1449405 1470411 1491001 1510589 1529278
60549 1529278 1546843 1562614 1576558 1589201 1599989 1606840 1608042 1603823 1595418 1583229 1566768 1546033
60537 1546033 1522148 1496695 1470990 1445990 1422369 1400418 1380085 1361296 1344225 1329243 1316596
60526 1316596 1306174 1297761 1291571 1288152 1287239 1287029 1285531 1282917 1281693 1283848 1288446 1292768 1295484 1297741
60512 1297741 1301305 1306600 1312765 1318724 1323766 1327788 1331566 1336389 1342933 1350805 1359451 1368903 1379140 1389361
60498 1389361 1398807 1407946 1417925 1428945 1440114 1450866 1461555 1472464 1483314 1494151 1505809 1518896
60486 1518896 1533126 1548285 1565013 1583843 1604244 1625865 1650191 1679565 1714535 1753403 1794527
60475 1794527 1837697 1882587 1926832 1966520 1998019 2018731 2026970 2022598 2007986 1987366 1964493 1940861
60463 1940861 1916248 1890802 1866531 1846799 1834226 1828894 1828690 1831498 1837005 1846244 1859733 1876489
60451 1876489 1894834 1913801 1933623 1955209 1979451 2007009 2038575 2075164 2118089 2168638 2227775
60440 2227775 2296166 2374517 2463985 2566254 2683114 2815687 2964023 3127553 3306037 3500055
60430 3500055 3710674 3938778 4184753 4448760 4731288 5033459 5356425 5699798 6059815
60421 6059815 6428009 6790413 7127363 7415081 7629871 7753267 7774995 7692949 7512536 7246973
60411 7246973 6916570 6544751 6152567 5755827 5365956 4991602 4638597 4309416 4004171
60402 4004171 3722617 3464968 3231037 3019322 2827342 2652850 2494652 2352329 2225231
60393 2225231 2111764 2009707 1917227 1833381 1757661 1689387 1627780 1572272 1522323 1477100 1435774
60382 1435774 1397992 1363472 1331228 1299917 1269282 1240643 1215478 1193931 1175057 1157982 1142148
60371 1142148 1126905 1111924 1098041 1086718 1078231 1071080 1063495 1054905 1045469 1034982 1023241 1011177
60359 1011177 1000603 992667 987221 983771 982159 981917 981822 981123 980861 982886 987296 991827 994511 996353 1000339
60344 1000339 1007863 1017064 1025022 1030686 1035079 1039446 1044399 1050591 1058813 1068842 1079090 1088126 1096109
60331 1096109 1104129 1112484 1120300 1126722 1131834 1136361 1141000 1146206 1152130 1158425 1164246 1168811 1172034 1174555
60317 1174555 1177068 1179688 1182065 1184004 1185542 1186259 1185068 1181490 1177014 1174280 1174540 1176551 1178305 1179149 1179704
60302 1179704 1180434 1181343 1182775 1185424 1189336 1193577 1197096 1199603 1201671 1204479 1209376 1216981 1226487 1236356
60288 1236356 1245872 1255530 1265756 1275887 1284912 1292907 1301123 1310495 1320340 1328786 1334588 1338299 1341367
60275 1341367 1344168 1345602 1344860 1342857 1341259 1340660 1340561 1340754 1341715 1343776 1346916 1351282 1356748 1361817 1364211
60260 1364211 1363059 1359574 1355082 1349423 1341911 1332773 1322774 1312322 1302017 1293373 1287812 1285255 1284615 1285154
60246 1285154 1286323 1286862 1285538 1282704 1279783 1277238 1274395 1271481 1270207 1271541 1274047 1275432 1274969 1273543
60232 1273543 1271938 1270112 1267780 1264774 1260956 1256560 1252564 1250026 1249012 1248742 1248787 1249595 1251804 1255604 1260939
60217 1260939 1267897 1276565 1286663 1297561 1308767 1320550 1333970 1349775 1367034 1383496 1397998 1411978
60205 1411978 1427649 1445025 1462118 1478252 1495626 1516639 1540815 1565623 1589809 1614592 1641749
60194 1641749 1671829 1704510 1739687 1777691 1819040 1864367 1914201 1968595 2027387 2090823 2159405
60183 2159405 2233090 2311503 2395217 2485979 2585107 2692274 2806390 2927016 3054280 3188092
60173 3188092 3328401 3475730 3630186 3789910 3951447 4111766 4269041 4421283 4565302
60164 4565302 4697761 4816763 4921818 5012616 5088473 5148795 5193436 5222485 5236072 5234791 5220383
60153 5220383 5195849 5164728 5130114 5094359 5059633 5028503 5003728 4987551 4981277 4985420 5000328 5027070
60141 5027070 5067760 5124424 5197105 5283649 5381947 5491905 5614397 5748692 5891899 6040760
60131 6040760 6192701 6344833 6493145 6633507 6762758 6878176 6976549 7054694 7110751 7144430
60121 7144430 7156241 7147057 7118135 7070881 7006479 6926315 6833016 6730927 6625409 6521491 6422798
60110 6422798 6331385 6248622 6176313 6116910 6072704 6045128 6034850 6042031 6066179 6106020 6159841
60099 6159841 6225796 6301854 6385750 6475087 6566986 6657537 6742319 6818139 6884042 6940311 6986914
60088 6986914 7023312 7049280 7065277 7072461 7073158 7071039 7069842 7071827 7078345 7092206 7118652 7163395 7229973
60075 7229973 7319254 7430933 7564829 7721072 7900109 8103215 8332754 8591291 8880114 9198729
60065 9198729 9545775 9920096 10320690 10745973 11193535 11660221 12141490 12630454 13118386
60056 13118386 13596776 14058559 14496976 14903866 15269923 15586641 15847704 16048755 16186570
60047 16186570 16258562 16262744 16198064 16065046 15866316 15606819 15294094 14938478 14552220 14147316
60037 14147316 13733935 13320902 12916976 12530745 12169331 11837716 11539076 11275156 11046658
60028 11046658 10854358 10699918 10584706 10507531 10464328 10450365 10461967 10495695 10546796 10609382
60018 10609382 10677739 10746678 10810845 10864626 10903126 10923019 10922532 10901003 10858574 10795914 10713712
60007 10713712 10612150 10490894 10350015 10191300 10018439 9835281 9643762 9444119 9237285
59998 9237285 9026512 8816308 8610554 8412300 8224659 8050597 7891820 7749041 7623735
59989 7623735 7518645 7435851 7375099 7334990 7315449 7318000 7343650 7391538 7459806 7546706 7650241
59978 7650241 7767666 7896416 8035028 8181845 8332592 8480193 8617464 8739470 8843154
59969 8843154 8925521 8983012 9012387 9011769 8981074 8921856 8836682 8728280 8599218 8452295 8290886
59958 8290886 8118899 7940978 7762874 7590743 7429224 7280406 7145093 7024683 6921381
59949 6921381 6837297 6774236 6733924 6717325 6723787 6751934 6801626 6874292 6971203 7092090 7235426
59938 7235426 7399112 7580682 7777691 7988203 8209943 8438359 8666193 8885449 9089369
59929 9089369 9272515 9430316 9559476 9658004 9723875 9754325 9747681 9705468 9631437 9528633 9398756
59918 9398756 9244793 9073194 8892709 8711398 8534933 8366994 8210555 8068878 7945625
59909 7945625 7844067 7766245 7713039 7684802 7681416 7701849 7744440 7807971 7891860 7994953 8114639
59898 8114639 8247655 8391348 8543634 8702038 8863412 9024375 9181477 9331184 9470677
59889 9470677 9599020 9717002 9825512 9924488 10013793 10094610 10169496 10241427 10313469 10389354 10473592
59878 10473592 10570646 10684294 10818181 10976663 11164463 11385312 11641144 11932749 12260689
59869 12260689 12624866 13022996 13449863 13898446 14361491 14831388 15298272 15748461 16165011
59860 16165011 16530044 16827387 17044506 17173297 17209698 17152783 17004702 16771661 16464439 16097017
59850 16097017 15684325 15240879 14780438 14315366 13855707 13409391 12983599 12585355 12220464
59841 12220464 11892471 11603282 11354399 11146948 10980894 10855196 10769049 10722335 10714415 10742827
59831 10742827 10803749 10893707 11010109 11149424 11304941 11467093 11626426 11775739 11908788 12017623
59821 12017623 12092528 12124835 12108844 12041020 11919038 11743020 11517067 11248361 10944860 10614489
59811 10614489 10265636 9906570 9543772 9181641 8824037 8475305 8139603 7820098 7519200
59802 7519200 7238777 6979640 6741535 6524223 6328121 6153427 5999197 5863949 5746776
59793 5746776 5647141 5563788 5494511 5436971 5389175 5349091 5314336 5282610 5252332 5222847 5194182
59782 5194182 5166671 5140655 5116343 5093704 5072235 5050829 5028186 5003450 4976205 4945846 4911526
59771 4911526 4873067 4831504 4788176 4743424 4696655 4647493 4596345 4543980 4491267 4439602 4391075
59760 4391075 4347734 4310727 4280181 4255604 4236233 4221300 4210197 4202319 4196952 4194098 4195798 4205798
59748 4205798 4226826 4258308 4297701 4344008 4398809 4463383 4535881 4612364 4690024 4768324 4847321
59737 4847321 4925958 5002091 5073220 5137186 5193248 5242848 5288431 5331092 5370351 5406690 5443133
59726 5443133 5483238 5528495 5579170 5637282 5706982 5791672 5892138 6008173 6140980 6293096
59716 6293096 6466635 6662754 6882710 7128582 7402604 7706212 8039907 8403632 8796645
59707 8796645 9216591 9658328 10113030 10567355 11002625 11395026 11718318 11948983 12071641
59698 12071641 12082429 11989548 11811074 11570423 11290935 10992343 10690326 10397336 10122485 9871107
59688 9871107 9645844 9448779 9282338 9148422 9047504 8978725 8940477 8931011 8949257 8995294
59678 8995294 9069726 9172623 9303501 9462040 9648133 9861531 10102442 10372480 10673990 11008186
59668 11008186 11374953 11774781 12209961 12683426 13197460 13754240 14356670 15007535 15708134
59659 15708134 16458370 17257790 18105795 19001021 19940859 20920864 21933719 22968985 24014579
59650 24014579 25058594 26089777 27097538 28073063 29010949 29909616 30770738 31598978 32401502
59641 32401502 33185892 33957245 34716701 35461669 36186053 36880142 37531570 38127448 38655820
59632 38655820 39105745 39467554 39734447 39904250 39979925 39968870 39881969 39732753 39536877 39311983
59622 39311983 39077211 38851457 38651234 38490240 38380837 38335032 38363465 38474165 38673155 38965885
59612 38965885 39356921 39848091 40437765 41122116 41895938 42751023 43673526 44643059 45633675
59603 45633675 46614857 47551564 48404436 49131284 49689888 50041723 50156302 50014976 49612782
59594 49612782 48958331 48072925 46989068 45747051 44389838 42958823 41492188 40024155
59586 40024155 38583072 37189503 35856739 34593070 33402639 32283837 31227516 30217090
59578 30217090 29230501 28243703 27235590 26193059 25113668 24004940 22881666 21762537
59570 21762537 20666318 19608362 18599211 17645381 16750493 15915605 15139598 14420280 13755288
59561 13755288 13142249 12578905 12063322 11593307 11165424 10775345 10419443 10095351 9800870
59552 9800870 9533493 9291434 9073772 8878439 8700925 8536191 8381411 8235791 8098099
59543 8098099 7965464 7834385 7701971 7566406 7427271 7285582 7142786 6999622 6856401
59534 6856401 6714006 6573874 6437268 6305549 6181038 6066440 5962989 5869782 5785162 5708306
59524 5708306 5639511 5579685 5529766 5489981 5459369 5436486 5420824 5413214 5414728 5425535 5444719 5470723
59512 5470723 5501903 5537259 5576884 5621409 5670970 5725079 5783524 5846853 5915750 5990304 6070119
59501 6070119 6155024 6245603 6343198 6449420 6565594 6692816 6832432 6985855 7153548 7334831
59491 7334831 7529396 7738709 7965230 8210500 8474589 8756984 9057008 9373408 9704447
59482 9704447 10048476 10403560 10766360 11132131 11496021 11853773 12201194 12533654 12846214
59473 12846214 13133410 13389092 13607961 13788221 13932080 14042971 14122885 14172864 14195195 14193872
59463 14193872 14173041 14135967 14085840 14027139 13966035 13909715 13865317 13839129 13836304 13860974 13916481
59452 13916481 14005522 14129877 14289308 14480122 14695019 14924826 15160041 15390015 15601197
59443 15601197 15777787 15905073 15971914 15970325 15894259 15740165 15508612 15204793 14837685 14419045
59433 14419045 13962480 13481971 12990203 12497736 12013306 11544636 11098897 10682224 10298463
59424 10298463 9948602 9632032 9348557 9098822 8883112 8700811 8551369 8434770 8350414
59415 8350414 8296393 8270760 8273021 8303507 8361754 8446355 8556051 8689979 8847010 9025826 9225442
59404 9225442 9444448 9679358 9924591 10174282 10423076 10664673 10890814 11092866 11263782
59395 11263782 11397402 11486502 11523533 11504106 11428816 11301011 11123823 10900445 10636490 10340214
59385 10340214 10019912 9682099 9332575 8977996 8625195 8279271 7943175 7618865 7308020
59376 7308020 7011784 6730953 6466866 6221426 5995719 5788859 5598614 5423092 5261663
59367 5261663 5114580 4982160 4864329 4760557 4669836 4590721 4521835 4462743 4414189 4376892
59357 4376892 4350091 4331862 4321005 4317827 4322675 4334642 4352670 4377110 4408555 4444974 4481245 4512215
59345 4512215 4535840 4553504 4568487 4584755 4606284 4636214 4676198 4726571 4786850 4855821 4931235
59334 4931235 5009772 5087848 5163449 5238134 5317061 5406154 5508936 5626380 5759230 5909049
59324 5909049 6076755 6261642 6462972 6681921 6921162 7183167 7469877 7783648 8127345
59315 8127345 8503312 8913038 9358101 9840900 10364011 10928969 11535768 12183234 12869446
59306 12869446 13591519 14344842 15122496 15915314 16712284 17500954 18268207 19001920 19692822
59297 19692822 20335208 20926210 21464751 21950925 22385590 22769879 23104657 23389844 23623651
59288 23623651 23802426 23921526 23976135 23960870 23869021 23693342 23428166 23071027 22623150 22089803
59278 22089803 21480386 20807176 20083236 19321507 18535152 17737085 16938456 16148386 15375497
59269 15375497 14628500 13914257 13236090 12595128 11992953 11431956 10913327 10435868 9997220
59260 9997220 9595797 9231167 8902683 8608099 8343823 8106749 7895587 7710023 7548813
59251 7548813 7409332 7288888 7185754 7098868 7027365 6970648 6928283 6899600 6883959 6881441 6892361
59240 6892361 6915962 6950451 6994584 7048196 7110934 7181626 7259288 7343379 7432219 7522490 7611495
59229 7611495 7699091 7786365 7873301 7958883 8042538 8124011 8202521 8277739 8351501 8427070 8506595
59218 8506595 8590330 8678244 8771056 8869242 8971821 9076473 9180489 9281718 9379147 9472573
59208 9472573 9561404 9644048 9718669 9783596 9836147 9871828 9885931 9875780 9840815 9781504 9699673
59197 9699673 9599380 9485717 9362463 9231993 9097217 8962185 8830711 8705733 8590011
59188 8590011 8485907 8394100 8313914 8245409 8189813 8147413 8116341 8094218 8079942 8073020 8072142 8075376
59176 8075376 8081182 8088538 8096624 8105026 8113761 8122620 8131187 8140151 8152169 8170863 8199289 8239588 8293449
59163 8293449 8362579 8449419 8557787 8691984 8854668 9046300 9267161 9518986 9803798 10121877
59153 10121877 10471702 10850846 11255380 11678408 12110255 12539977 12955692 13343537 13687718
59144 13687718 13972517 14184421 14312931 14350850 14294815 14145540 13907267 13587129 13195052 12743757
59134 12743757 12248150 11724025 11186303 10647353 10116378 9600281 9104975 8635536 8195250
59125 8195250 7785069 7404322 7051839 6726436 6426869 6151910 5900510 5671656 5463960
59116 5463960 5275529 5104401 4949167 4809160 4684043 4573126 4475016 4387874 4310131 4241093
59106 4241093 4180864 4129563 4086587 4050802 4021458 3998644 3982779 3974006 3972355 3978113 3991426 4011484
59094 4011484 4036652 4065709 4098878 4137444 4182444 4233847 4291000 4353642 4422163 4496740 4576619
59083 4576619 4660818 4749347 4842907 4941191 5042315 5144430 5247054 5350063 5452163 5551594
59073 5551594 5647849 5741114 5829913 5910846 5981443 6042174 6094853 6140003 6177008 6206381 6230562
59062 6230562 6252207 6272512 6291565 6309856 6329027 6351396 6379112 6413677 6455873 6505877 6563530
59051 6563530 6628888 6702704 6786225 6880245 6984606 7098971 7223965 7361036 7511097 7673745
59041 7673745 7847968 8033181 8229227 8435765 8652094 8877181 9109004 9343638 9575608
59032 9575608 9799549 10010923 10204288 10371239 10501575 10587487 10626197 10618193 10564132 10465010
59022 10465010 10324608 10149494 9945779 9717341 9467904 9203106 8928915 8648952 8364900
59013 8364900 8078895 7793895 7512044 7234256 6961474 6694956 6435343 6182904 5938982
59004 5938982 5705800 5484318 5273432 5071856 4879808 4698265 4527530 4367236 4216913
58995 4216913 4075787 3942601 3816412 3697101 3584653 3478538 3378542 3285601 3200816 3123658
58985 3123658 3051937 2983722 2918818 2858084 2801611 2748166 2696703 2648028 2604050 2565181 2529514
58974 2529514 2495356 2463679 2436798 2415202 2397272 2381909 2369667 2360942 2354748 2349969 2346449 2344029
58962 2344029 2341900 2339944 2339503 2341528 2344745 2346869 2346970 2345649 2343640 2341528 2340279 2340763 2342910 2346407 2351769
58947 2351769 2359530 2368589 2376666 2382556 2386974 2391152 2395555 2399888 2403254 2404094 2401072 2394570 2386657 2379166
58933 2379166 2372311 2365322 2357735 2349696 2341708 2334649 2329701 2327687 2328448 2331082 2334756 2339292 2345227 2353393
58919 2353393 2364285 2377660 2392716 2408535 2424434 2440334 2457088 2476085 2498028 2522281 2547745
58908 2547745 2574160 2602051 2631705 2662852 2695294 2729210 2764683 2801365 2838635 2875799 2912284
58897 2912284 2948195 2984651 3023025 3063785 3106595 3151509 3199388 3250922 3305891 3363850 3425205
58886 3425205 3491242 3563246 3641674 3725842 3814252 3905652 4000128 4099016 4203705 4314933 4433229
58875 4433229 4559291 4693263 4834211 4981196 5134951 5297845 5472135 5658734 5857728
58866 5857728 6069365 6294135 6532434 6784868 7052811 7338269 7643192 7969280 8318195
58857 8318195 8691463 9090186 9515404 9968889 10453108 10970248 11521770 12108996 12733321
58848 12733321 13395241 14093747 14827390 15595451 16396864 17227705 18080258 18944600 19810343
58839 19810343 20666414 21499367 22292243 23025094 23676954 24228075 24661147 24961402 25117293
58830 25117293 25122757 24979248 24695128 24282965 23757572 23135748 22436057 21677626 20878912 20056959
58820 20056959 19226471 18399053 17583976 16789829 16024475 15293062 14597278 13937386 13314294
58811 13314294 12728896 12180314 11666042 11183531 10730745 10305635 9906243 9531401 9180367
58802 9180367 8851763 8543781 8255631 7987905 7740940 7513278 7302185 7105355 6921717
58793 6921717 6750953 6592895 6447607 6315602 6197431 6092888 6000862 5920203 5850557 5792109
58783 5792109 5744785 5708167 5682175 5667255 5663709 5671278 5689567 5718489 5757963 5807451 5866083 5933286
58771 5933286 6009389 6095825 6194486 6306468 6431524 6569133 6719815 6884688 7063994 7257090
58761 7257090 7464048 7686298 7925458 8182560 8458878 8756623 9078100 9424781 9797632
58752 9797632 10197713 10626057 11083893 11573607 12098587 12661335 13262313 13901185 14578087
58743 14578087 15292598 16042177 16822554 17628719 18453844 19287394 20115552 20923352 21695192
58734 21695192 22413347 23057452 23606335 24040540 24344223 24506763 24523710 24395998 24128285
58725 24128285 23728650 23209642 22588251 21883886 21116132 20303657 19463567 18610729 17757715
58716 17757715 16915433 16093170 15297706 14532876 13800436 13101319 12436140 11805166 11208415
58707 11208415 10645844 10117269 9622112 9159127 8726371 8321688 7943460 7590733 7262425
58698 7262425 6956662 6671161 6403982 6153700 5919242 5700018 5495853 5306245 5129876
58689 5129876 4965295 4811887 4669771 4538975 4419067 4309125 4207551 4112442 4022935 3939780
58679 3939780 3863698 3793435 3726502 3661770 3600231 3542925 3489155 3437155 3385642 3334090 3282212
58668 3282212 3230064 3178366 3127960 3078857 3030257 2981523 2932739 2884221 2835845 2787148 2737878
58657 2737878 2688125 2637971 2587374 2536384 2485010 2432756 2378974 2324201 2270522 2219805 2171983
58646 2171983 2125973 2081838 2040733 2002852 1966996 1932528 1900325 1871063 1843830 1817374 1791687
58635 1791687 1767396 1744452 1722409 1701170 1680413 1658950 1635723 1610948 1585387 1559264 1532948
58624 1532948 1507985 1486025 1467041 1449782 1433734 1419500 1407562 1397906 1390812 1386817 1385765 1386771
58612 1386771 1389214 1393108 1398601 1405818 1415042 1426441 1439732 1454513 1470382 1486180 1499916 1510263
58600 1510263 1517432 1521705 1522111 1517874 1510294 1501540 1492099 1481155 1469129 1457949 1448755 1441153 1434921
58587 1434921 1430799 1428999 1428451 1428311 1429295 1432957 1440412 1452015 1467468 1485936 1506683 1529521 1554054
58574 1554054 1578994 1603473 1628820 1657624 1691061 1728434 1769369 1814753 1865047 1919025 1974995
58563 1974995 2032548 2092824 2157865 2229761 2309372 2395703 2487422 2585036 2690635 2805638 2930073
58552 2930073 3064036 3208530 3364662 3533116 3714307 3907782 4111626 4324097 4545702
58543 4545702 4777730 5018374 5262104 5503088 5736995 5958571 6159632 6331046 6465587
58534 6465587 6558083 6604755 6604251 6558497 6471273 6346760 6190245 6008869 5810099 5599972 5383608
58523 5383608 5166283 4952599 4745263 4545810 4355942 4177325 4010935 3857632 3718512
58514 3718512 3593435 3479961 3375225 3278536 3190938 3112479 3041223 2974966 2912780 2854651 2800515
58503 2800515 2750124 2703360 2660202 2620347 2583051 2547440 2513047 2479779 2447173 2414054 2379336
58492 2379336 2342656 2303713 2261722 2216740 2170956 2127038 2085123 2042930 1999022 1954522 1911297
58481 1911297 1870015 1830608 1793235 1757959 1724501 1692972 1663898 1637065 1611477 1586903 1564294
58470 1564294 1544173 1525920 1509226 1494796 1482794 1471899 1460854 1449812 1439285 1429029 1418944
58459 1418944 1409905 1402450 1395448 1387107 1376685 1364549 1351452 1338474 1326629 1315731 1304528 1292573
58447 1292573 1280864 1270022 1259220 1247847 1236833 1227170 1218444 1210150 1203243 1198848 1196296 1194001 1191689
58434 1191689 1190421 1190853 1192648 1195206 1198056 1201005 1204661 1210147 1217450 1224848 1230771 1235421 1239683 1243395
58420 1243395 1245753 1246560 1245944 1243589 1239424 1234447 1229799 1225423 1220489 1214661 1208297 1201959 1196304 1191618
58406 1191618 1186909 1180308 1170954 1159746 1148089 1137176 1128666 1124095 1122755 1122011 1120794 1120976 1124106 1128736
58392 1128736 1132646 1135912 1139811 1144165 1147928 1151157 1154213 1155839 1154187 1149372 1143344 1137692 1132956 1129339
58378 1129339 1126630 1124145 1122122 1122327 1125827 1131084 1135691 1139092 1142259 1145781 1149828 1154780 1160090 1163632
58364 1163632 1164016 1162605 1161579 1161117 1160299 1159411 1159151 1158724 1157192 1155847 1156821 1160005 1163767 1168128 1174829 1184546
58348 1184546 1196338 1209440 1223461 1237213 1249685 1261937 1275950 1291921 1308704 1326238 1345053
58337 1345053 1363793 1379967 1393180 1405146 1416528 1426243 1434097 1441427 1448468 1453363 1454628 1452772 1448695
58324 1448695 1441999 1431577 1416756 1397724 1376072 1354995 1337656 1325254 1317509 1314288 1315365 1319384
58312 1319384 1324847 1331653 1340001 1348604 1355960 1362657 1370310 1378924 1387638 1397319 1409659 1423905 1437191
58299 1437191 1448269 1458628 1469961 1482738 1497114 1512821 1528214 1541799 1554696 1569288 1585679
58288 1585679 1602015 1618044 1635404 1654282 1672756 1689897 1706692 1723236 1737679 1748855 1757716
58277 1757716 1765486 1772625 1780097 1789308 1800159 1811274 1822662 1835853 1851031 1866425 1881220 1896818
58265 1896818 1914555 1934301 1955727 1978697 2001980 2024067 2045983 2070885 2100000 2131098 2161709
58254 2161709 2191742 2222222 2253601 2286203 2320439 2355834 2391510 2427953 2466413 2506264 2545092
58243 2545092 2581770 2617407 2652929 2687851 2721938 2756161 2791466 2828140 2866375 2905905 2945586
58232 2945586 2985294 3027574 3075188 3127752 3183137 3241032 3302106 3364756 3426420 3487707 3551775
58221 3551775 3620069 3692164 3769112 3852745 3941874 4033421 4127345 4226337 4330747 4438309 4548972
58210 4548972 4665204 4787021 4911597 5038688 5171705 5312164 5457426 5604910 5754132
58201 5754132 5903832 6052028 6200339 6353851 6515485 6684787 6862762 7052657 7254928
58192 7254928 7466972 7689335 7926804 8181767 8451988 8736758 9039618 9362931 9705319
58183 9705319 10066800 10451139 10861010 11296153 11758356 12252675 12781760 13344621 13942796
58174 13942796 14581459 15262611 15983977 16747028 17559293 18426354 19348505 20327380 21367963
58165 21367963 22471552 23635328 24862182 26162326 27541855 28999041 30535827 32163011
58157 32163011 33889452 35716869 37651361 39710214 41911652 44268891 46801497 49542676
58149 49542676 52529365 55796659 59388053 63357308 67752309 72613122 77999119 84007966
58141 84007966 90761612 98392162 107053559 116926292 128188487 140988315 155448998 171680324
58133 171680324 189783998 209894756 232250437 257192110 285054495 316026153 349953888
58126 349953888 385878772 421346533 452175099 473453113 481544904 475735500 458282035
58119 458282035 433009907 403677574 373091843 343004818 314336962 287451693 262437677
58112 262437677 239329987 218180606 199024232 181861559 166680213 153448421 142082392
58105 142082392 132453484 124435030 117919107 112795010 108956347 106332384 104828786 104139944
58097 104139944 103612996 102389322 99791331 95643933 90267783 84202533 77932923 71789265
58089 71789265 65971135 60579220 55633487 51110651 46988320 43254958 39891897 36868186
58081 36868186 34154068 31724676 29549812 27593901 25828869 24236448 22796186 21481915
58073 21481915 20272610 19157094 18125085 17162449 16258575 15410371 14615283 13867149 13162050
58064 13162050 12501459 11885746 11309873 10768345 10259323 9781368 9331188 8906882 8508224
58055 8508224 8131487 7769027 7416488 7075855 6749537 6436360 6135344 5848065 5574563
58046 5574563 5311706 5058456 4818387 4594281 4384405 4186700 4002415 3832755 3675813
58037 3675813 3529689 3395121 3272335 3158710 3052234 2954101 2865370 2784143 2708404 2638437
58027 2638437 2573924 2511682 2448903 2386121 2324719 2264086 2203320 2143179 2084308 2025960 1968200
58016 1968200 1912785 1860312 1809294 1759597 1713696 1672692 1634220 1596298 1560156 1527093 1495689
58005 1495689 1464601 1435328 1409604 1386547 1364756 1344764 1327092 1310287 1293248 1277177 1262926
57994 1262926 1248765 1233065 1216833 1201189 1184723 1166003 1146653 1129390 1114835 1102529 1093030
57983 1093030 1086500 1081114 1075327 1069911 1065532 1060460 1053396 1046574 1043047 1042377 1041816 1040408 1039046 1037661
57969 1037661 1035355 1032684 1031217 1031177 1031515 1031685 1031483 1029977 1026506 1022003 1017700 1013468 1009005 1005422 1003707
57954 1003707 1002733 1000672 997431 993908 989912 984776 979036 973629 968284 962426 956657 951685 946892 941692
57940 941692 937081 933999 931502 928660 926939 928277 931708 934399 935391 935860 936013 934068 928288 918233 904089
57925 904089 886485 866874 846796 827111 809045 794988 786510 782258 779560 777501 776798 777366 777929
57912 777929 777732 777024 776221 775960 777292 780222 782745 783001 781782 781313 782282 783799 785450 787374 788973 789598
57896 789598 790022 791152 791722 789468 784425 778905 774230 769529 763857 757613 751711 747103 745172 746710 750348
57881 750348 753766 756660 760702 766424 772032 775759 777641 778438 778436 777904 777131 775301 770722 763034 754032 745587
57865 745587 737788 729717 720928 711364 700694 688709 675887 662988 650454 638560 627717 618266
57853 618266 610342 604134 599900 597625 596991 597700 599496 601991 604785 607621 610251 612635 615610 620638 628210
57838 628210 637017 645374 652933 660314 667767 675069 682057 688263 692620 694572 694894 694408 692589 688675 683432
57823 683432 678324 673339 667164 659316 650628 641783 632821 624078 616276 609591 603795 599320 596934 596364
57809 596364 596411 596499 597060 598437 600568 603707 608227 613680 619245 625166 632539 641425 650168 656800 660346
57794 660346 660980 660033 659709 661468 664411 666235 665831 664011 661840 659527 656925 653826 649597 643743 637035
57779 637035 630941 625687 619987 613001 605568 599252 594922 592207 589489 584555 576428 566525 557026 548338
57765 548338 539398 530045 521313 513395 505220 496398 487863 479996 471823 462833 454054 446417 439404 432308
57751 432308 425640 420173 415519 410720 405568 400542 396040 392410 390144 389417 389985 392010 396347 403543 413022
57736 413022 423500 433519 441469 446065 447279 446202 443897 441204 439462 439938 442276 445043 448278 453936
57722 453936 463021 473859 484192 493463 501743 507877 510589 510582 509685 508230 504861 498815 490905 482123 472543
57707 472543 462029 451145 440825 431645 423614 416381 409512 402778 396255 390214 385058 381315 379226
57694 379226 378295 377853 378182 380421 385106 391457 398345 405173 411553 417092 422175 428077 435487 443504 450766
57679 450766 457020 462866 468636 474344 480160 486104 491691 496727 502044 508533 515799 522639 528638 534441
57665 534441 540597 547043 553668 560609 567956 575834 584818 595586 608028 621207 634424 647888 662192
57652 662192 677491 693357 709223 724829 740290 755919 772215 790124 810870 834899 861172
57641 861172 888314 916547 947500 981805 1017940 1054240 1091178 1130544 1172851 1216738 1260977
57630 1260977 1306209 1354448 1407388 1465479 1528437 1596543 1671261 1754253 1846019 1946292 2055817
57619 2055817 2176685 2310455 2457139 2616927 2791864 2984511 3195612 3424432 3670838
57610 3670838 3935365 4217339 4514414 4823651 5140458 5454664 5748355 5999171 6186860
57601 6186860 6298538 6330953 6290068 6188054 6038498 5852879 5640556 5410510 5171513 4930474
57591 4930474 4691627 4457763 4231758 4016575 3814262 3625509 3450264 3288631 3141254
57582 3141254 3008869 2891375 2787393 2695006 2613063 2541494 2480133 2427650 2382147 2342796 2310410
57571 2310410 2286248 2270570 2262401 2260230 2262817 2269845 2282284 2301822 2329498 2365040 2407738 2457562
57559 2457562 2515025 2580470 2654178 2736890 2829411 2931851 3044052 3166611 3300531 3445648
57549 3445648 3600246 3762331 3930223 4101201 4270244 4430709 4575890 4699609 4796115 4860437
57539 4860437 4889109 4880583 4835502 4756840 4649088 4516525 4362475 4190659 4006860 3818410
57529 3818410 3631636 3449730 3272849 3100310 2933026 2773933 2625745 2488491 2360025
57520 2360025 2238990 2126248 2022951 1928266 1839953 1756623 1678549 1606618 1541210 1481827 1427208
57509 1427208 1376148 1328677 1285963 1248455 1214764 1183216 1153853 1127889 1105602 1086002 1068375
57498 1068375 1052927 1039866 1028982 1020310 1014159 1010154 1007173 1004625 1003014 1002971 1004482 1007382 1011788 1017573
57484 1017573 1024176 1031521 1040532 1052141 1066213 1081947 1099059 1118042 1139592 1164101 1191425 1220823
57472 1220823 1251506 1283767 1319258 1359646 1405155 1454796 1507812 1564407 1625204 1690597 1760810
57461 1760810 1836285 1917810 2006288 2102334 2205914 2316334 2432517 2553246 2677144 2802711
57451 2802711 2928356 3051897 3169675 3276358 3366038 3433682 3475840 3490770 3478631 3441497
57441 3441497 3382638 3305481 3213155 3108536 2994168 2872365 2746004 2619207 2496402 2380310
57431 2380310 2271208 2168450 2072233 1983544 1902932 1830083 1764496 1705903 1653897 1607677 1566446
57420 1566446 1529911 1498304 1472104 1451653 1436787 1426823 1421213 1420096 1423788 1431895 1443691 1459628
57408 1459628 1481724 1511916 1550393 1595930 1647245 1703394 1763377 1826523 1893437 1965888 2045508
57397 2045508 2132962 2228224 2330834 2439439 2551610 2664636 2776467 2885753 2991004 3089681
57387 3089681 3177721 3249801 3300324 3324633 3319922 3285829 3224686 3140776 3038660 2922087 2794641
57376 2794641 2660697 2524748 2389753 2256918 2127107 2001708 1882139 1769403 1664319
57367 1664319 1567281 1477506 1393467 1314574 1241611 1175035 1113764 1056392 1002913 954287 910721
57356 910721 871182 834331 799293 765944 735202 708639 686840 668161 649856 630502 610799
57345 610799 592194 575440 560468 546883 534282 522483 511637 501975 493568 486527 481053 476790
57333 476790 472454 466889 460443 454719 451006 449448 449562 450768 452382 453905 455614 458317 462265 466795
57319 466795 471220 475546 480207 485691 492702 501982 513446 525838 537627 547878 556019 561480 564401
57306 564401 566318 569220 573783 579150 584505 590176 596868 604487 612306 619976 627793 636103 645054 654926
57292 654926 666057 678159 690230 701580 712679 724509 737373 750809 764432 778194 791843
57281 791843 804874 817239 829542 842255 855293 868718 883303 899780 917867 936669 955865
57270 955865 975895 996912 1018104 1038292 1056935 1074491 1092025 1110559 1130398 1150792 1170465
57259 1170465 1188852 1206917 1226421 1248132 1270969 1293286 1314852 1336975 1360650 1385453 1410695
57248 1410695 1436785 1464388 1492798 1520487 1547165 1573890 1600953 1627201 1652166 1677505 1705153
57237 1705153 1735068 1766122 1798481 1833397 1870789 1908720 1945834 1983280 2023634 2068625 2118323
57226 2118323 2171750 2227578 2284705 2342976 2403352 2466892 2533527 2602082 2671448 2741313 2811656
57215 2811656 2881878 2950793 3017373 3081271 3142650 3201841 3259121 3314184 3365477 3410596 3448090
57204 3448090 3478712 3504244 3525252 3540823 3550593 3556162 3560208 3564936 3571677 3581197 3593628 3608510
57192 3608510 3625375 3643992 3663738 3683323 3701645 3718592 3734632 3750176 3765906 3783290 3804000
57181 3804000 3828917 3858168 3891985 3931154 3976731 4029610 4090072 4157466 4230480 4307875 4388674
57170 4388674 4471697 4555517 4639037 4721391 4801034 4875689 4943577 5003938 5056079 5099025 5132923
57159 5132923 5159974 5183100 5204332 5225272 5248308 5276245 5311255 5355086 5409607 5475883 5552983
57148 5552983 5638889 5732444 5833446 5941081 6053419 6168564 6285538 6404081 6524209 6645731
57138 6645731 6767413 6886889 7002105 7112609 7218773 7320372 7416983 7509326 7598822 7685787
57128 7685787 7768998 7847020 7919010 7984389 8042805 8094622 8140623 8181243 8216896 8248899 8279099
57117 8279099 8308481 8336745 8363083 8386579 8406170 8421244 8432355 8440670 8446855 8451127 8453803 8454753
57105 8454753 8452702 8446224 8435193 8420217 8401112 8377300 8349237 8317849 8282630 8241950 8195385 8144144
57093 8144144 8088936 8029082 7964459 7896997 7829390 7763089 7698006 7633295 7567954 7501266 7432926
57082 7432926 7362149 7286713 7203849 7112333 7013157 6908286 6799274 6686355 6567440 6438176
57072 6438176 6294365 6134407 5958353 5764964 5551199 5314333 5052695 4763967 4444262
57063 4444262 4089321 3695265 3257800 2771855 2232317 1634112 971482 238255 -571307
57053 -1463348 -2446273 -3530998 -4729672 -6055645 -7524769 -9156229 -10973432 -13006319
57045 -13006319 -15293114 -17879220 -20815794 -24160812 -27979970 -32344644 -37330984 -43023879
57037 -43023879 -49520273 -56925422 -65345785 -74883667 -85628404 -97640649 -110941203 -125512489
57029 -125512489 -141296872 -158177599 -175964829 -194415929 -213263738 -232190960 -250751797
57022 -250751797 -268331008 -284211017 -297704728 -308259201 -315502899 -319277673 -319665681
57015 -319665681 -316961672 -311564727 -303843698 -294056039 -282348732 -268817468 -253588351
57008 -253588351 -236888513 -219073135 -200597197 -181955686 -163626369 -146027171 -129483574
57001 -129483574 -114209192 -100308656 -87799274 -76636937 -66738542 -58002175 -50322964
56994 -50322964 -43599169 -37730533 -32617370 -28163691 -24280457 -20887080 -17912994 -15299034
56986 -15299034 -12996099 -10962118 -9160861 -7562507 -6142859 -4881117 -3758906 -2760564
56978 -2760564 -1872257 -1080061 -369751 271297 852833 1382269 1865653 2307608 2710853
56969 2710853 3076460 3405116 3698547 3959619 4190812 4393138 4567435 4716424 4844231
56960 4844231 4953837 5046184 5121754 5181442 5225547 5253521 5265584 5263392 5248379 5220598 5179904
56949 5179904 5127135 5063616 4991103 4913336 4836074 4762871 4689439 4601660 4479320 4304152 4068684
56938 4068684 3780382 3457244 3118415 2778263 2446956 2132282 1838780 1567281 1317716
56929 1317716 1091518 889904 711292 552622 412607 291880 190295 105601 34461 -26544
56918 -80711 -130650 -177870 -223333 -267781 -310706 -349833 -382825 -409262 -430224 -446551 -458358 -465543
56906 -465543 -467804 -464631 -456101 -443064 -425885 -403928 -377079 -346783 -314385 -279396 -240797 -199524
56894 -199524 -158517 -120896 -89121 -65072 -49382 -40815 -37261 -36949 -38074 -38420 -36814 -34201 -31715
56881 -31715 -28246 -21360 -10259 3713 19181 35822 53634 72541 92815 114624 137111 158858
56869 158858 179010 196862 210686 218338 219089 213927 204332 191845 178437 165804 154141 142593
56857 142593 130759 118824 106636 94126 82502 73503 67250 62054 56581 51104 46505 43199 41288
56844 41288 40797 41429 42943 45808 50587 56657 62501 67409 72005 76982 82275 87596 93071 99242 107148
56829 107148 118197 132988 150383 168774 188160 209639 232755 254684 272799 287182 299937
56818 299937 312547 324523 334501 342353 349930 359339 370546 381578 391479 401959 415167 430940
56806 430940 447722 465481 485952 510230 537682 567206 598149 629875 661506 691938 718772
56795 718772 737674 744805 740423 728865 714680 699894 684847 669880 655489 642198 631065 623552
56783 623552 620649 622949 631451 647052 669205 696477 728535 766228 809725 858320 912116 971352
56771 971352 1032635 1087384 1125795 1142325 1137381 1115292 1081682 1041597 998548 954982 913258 875172
56759 875172 840782 809359 781885 761012 748060 741734 740588 744972 755564 771677 792576 819105
56747 819105 852223 890463 929779 964993 990567 1001541 995841 975561 944992 907931 867486 826945
56735 826945 788880 753802 721142 691241 665215 643445 625623 612007 603331 599588 600013 604129
56723 604129 611867 622879 636617 652650 669845 685455 696015 699098 693661 679569 658064 632141
56711 632141 604908 577479 549515 521527 495240 471729 450677 431760 415409 401632 389129
56700 389129 376428 363374 351020 340500 332260 325840 320079 314022 307928 302973 299740 297479 295105
56687 295105 292413 289849 287500 284955 282253 280442 280814 283537 287227 289933 290523 289235 287282 286039 286161
56672 286161 287005 287135 285850 283999 282896 282857 283432 284482 285958 286946 286284 284155 281751 279291 275850 271528
56656 271528 268146 266967 267042 266792 266075 265654 265680 265796 265954 266082 265733 264965 264707 265297 265567 264464 262645 261278
56638 261278 260236 258900 257842 258061 259124 259708 259674 260021 261088 262441 264366 267812 272644 277392 281029
56623 281029 283799 286014 287231 287033 285796 284342 283442 283663 285004 286798 288511 290303 292093 292852 292006
56608 292006 291020 292020 295082 298267 300153 300793 300365 298721 296521 295091 294637 294088 293170 292959 293715 293833
56592 293833 292056 289346 287313 285851 283763 280948 278467 276716 274872 272323 269651 267837 266988 266272 265030
56577 265030 263679 263244 263952 264745 264567 263574 262432 260867 258056 254281 250992 248967 247510 245835 244263
56562 244263 243493 243462 243547 243376 243034 242940 243753 245795 248315 250014 250551 250855 251716 252894 254002 255372 257373
56545 257373 259489 260789 260961 260491 260225 261017 263148 265614 266583 265209 262693 261137 261630 263710 266187 268107
56529 268107 269346 270701 273103 276439 279568 281749 283506 285604 287696 288598 287721 285773 284108 283602 283999
56514 283999 284220 283592 282847 283609 286703 291367 296183 300340 303768 306550 308749 310720 313320 317582 323901
56499 323901 331284 337769 342168 345255 348751 353359 358451 363355 367932 371852 374438 375664 376505 377769
56485 377769 379140 379797 379539 378940 378721 379203 380060 380576 380427 380062 379874 379373 377926 375981 374546 373601 372177
56468 372177 369974 367637 365337 362548 359607 357994 358177 358403 356637 352924 348958 346104 344625 344102 343604
56453 343604 341932 338592 334334 330291 327018 324697 323510 323192 322872 322080 321444 321857 323469 325883 328535
56438 328535 330364 330056 327537 324530 322754 322136 321666 321312 321963 323777 325684 326489 325838 324303 323144 323632
56422 323632 325805 328042 328546 327114 325028 323554 323162 323876 325569 328019 331257 335766 341828 348680 354723
56407 354723 358666 360459 361464 363720 368495 375240 382343 388879 394951 400496 405103 409375 414973 422325
56393 422325 429469 434389 437560 440778 444307 446830 447885 448578 449667 450367 449589 447372 444617 442108 440284
56378 440284 439430 439563 440218 440529 439602 437030 433246 429155 425209 421052 416142 410343 403807 396860 390282
56363 390282 385014 381164 377842 374324 370772 367485 364289 361288 359419 359489 361200 363731 366691 369924 373034
56348 373034 375602 377226 377053 374498 371054 369829 371971 374914 375722 375061 375854 378827 381659 382411 381684 381064
56332 381064 381201 381897 382746 383242 383383 384391 387610 392423 396566 398826 400140 401611 402747 402420 400471 397530
56316 397530 394081 390639 388215 387640 388591 389911 390775 391232 391807 393038 395307 398755 403150 407830 412011
56301 412011 415520 419237 424211 430152 435428 439028 441863 445408 449734 453848 457527 461666 466832 472509
56287 472509 477963 483020 487758 492023 495570 498400 500929 503864 507527 511088 513066 513094 512537 512756 513455
56272 513455 513706 513915 515580 519360 524490 529973 535258 539789 543021 545245 547803 552211 559152 568001 576968
56257 576968 584409 590600 597652 607066 618109 629328 640637 652693 665126 676931 688098 699416
56245 699416 711112 723125 736238 751264 767291 782389 795979 809033 822088 834798 847469
56234 847469 861240 876328 891533 905859 919227 931367 941493 949720 957632 966885 978073 991170
56222 991170 1006131 1022939 1041896 1063752 1088545 1114730 1140881 1167952 1198188 1231980 1267698
56211 1267698 1304793 1345040 1390276 1440729 1496154 1556866 1622865 1693610 1769510 1852302 1943201
56200 1943201 2042004 2148595 2263835 2388268 2521409 2663127 2814249 2974999 3144109 3320232
56190 3320232 3502613 3689518 3877596 4063956 4247401 4426258 4596201 4751578 4887966
56181 4887966 5002448 5092876 5158619 5201221 5222629 5223034 5201643 5159245 5099002 5025081 4941293
56170 4941293 4850516 4754342 4653337 4548072 4439564 4328459 4214563 4097659 3978053 3855999
56160 3855999 3731584 3605664 3479751 3354220 3227800 3099883 2972465 2848760 2730536
56151 2730536 2617664 2509479 2405504 2305375 2209092 2117163 2030049 1947887 1871139 1800683
56141 1800683 1736673 1678063 1623959 1574789 1531417 1493615 1459898 1428408 1397693 1367356 1338410
56130 1338410 1312329 1289504 1269315 1251649 1237165 1225854 1216709 1209243 1203987 1200929 1198950 1197543
56118 1197543 1197717 1200276 1204516 1209626 1216134 1224795 1235161 1246445 1258972 1273626 1290492 1309034 1329015
56105 1329015 1350492 1373481 1398130 1424447 1451496 1478010 1504219 1531858 1561716 1592616 1623522
56094 1623522 1655130 1688380 1722903 1758254 1795413 1835604 1878690 1924047 1972126 2023736 2078592
56083 2078592 2135986 2196469 2261858 2334118 2415242 2507776 2614604 2738288 2880510 3040942
56073 3040942 3216077 3399953 3586364 3769532 3943117 4101014 4240324 4362330 4470041
56064 4470041 4566125 4653197 4733099 4804098 4860550 4897104 4912392 4908209 4887295 4853202 4809827
56053 4809827 4758514 4696360 4618606 4521631 4403199 4262542 4102456 3929799 3752011 3574263
56043 3574263 3400973 3237578 3088345 2953854 2832630 2723995 2627653 2542355 2467226 2403064
56033 2403064 2350369 2307394 2272012 2243892 2222840 2206684 2193173 2182599 2176327 2173996 2174235 2176662
56021 2176662 2180937 2185187 2187610 2188358 2187970 2185699 2181612 2178430 2178669 2181572 2185430 2191140 2200610 2213305
56007 2213305 2227470 2243307 2261937 2282600 2304015 2327101 2353137 2380587 2407217 2434177 2464447
55996 2464447 2498159 2533015 2568507 2606017 2645320 2684679 2724206 2765752 2809738 2855313 2903294
55985 2903294 2955546 3011544 3068826 3126954 3188100 3253652 3322896 3394877 3469012 3544315 3620682
55974 3620682 3700466 3786183 3877313 3971793 4069539 4171735 4278148 4388480 4505035 4630233
55964 4630233 4762354 4897399 5034333 5174976 5319869 5468369 5622166 5784534 5956376
55955 5956376 6136650 6326114 6526899 6739122 6961847 7196744 7446791 7711933 7989933
55946 7989933 8280869 8586941 8908847 9246639 9603386 9983619 10388797 10818347 11274140
55937 11274140 11759668 12275926 12822543 13401772 14016986 14668953 15358337 16090023 16869888
55928 16869888 17699287 18578004 19510097 20500731 21549848 22655896 23823720 25061858 26374422
55919 26374422 27763107 29234671 30798271 32457831 34215985 36083930 38079147 40216429
55911 40216429 42511280 44990368 47689175 50642186 53885554 57465405 61431653 65828605
55903 65828605 70707757 76150105 82265666 89178224 97026779 105973439 116184527 127800662
55895 127800662 140939505 155721353 172276958 190753367 211354001 234366720 260107350
55888 260107350 288809200 320493360 354669433 389739843 422488029 448440544 463382335
55881 463382335 465159110 454444195 434019683 407348144 377481808 346665045 316356205
55874 316356205 287378318 260125988 234784031 211460431 190211758 171037989 153892421
55867 153892421 138683132 125262638 113442071 103030457 93856938 85765344 78612290
55860 78612290 72276976 66658997 61663781 57201661 53200318 49603686 46356614 43402584
55852 43402584 40697725 38214950 35931356 33820819 31859927 30031036 28317521 26704916
55844 26704916 25188752 23773124 22459167 21240918 20112125 19068897 18104201 17206932
55836 17206932 16368189 15582907 14844925 14146692 13484539 12858425 12265912 11701812 11163757
55827 11163757 10652441 10166359 9702117 9259926 8842809 8449941 8076457 7720282 7383534
55818 7383534 7066552 6766043 6479923 6208862 5952276 5707721 5474958 5255737 5048906
55809 5048906 4850442 4658970 4476411 4302443 4133233 3966950 3806351 3654860 3513967
55800 3513967 3384884 3268174 3160549 3056067 2951825 2849184 2749176 2650843 2554801 2464151
55790 2464151 2380502 2302518 2229214 2161171 2097846 2037396 1979959 1927477 1879571 1833406 1788464
55779 1788464 1747533 1711838 1678889 1646465 1615244 1586215 1558965 1533876 1512686 1495265 1478800
55768 1478800 1461608 1445024 1430392 1417073 1404599 1393833 1384615 1374844 1363127 1349872 1334971 1317194
55756 1317194 1296696 1275147 1252375 1225994 1195669 1164718 1136014 1109060 1082542 1056932 1032947
55745 1032947 1010110 988626 970273 955684 942956 930510 919188 910013 902138 894723 888678 884764
55733 884764 881740 878190 874586 872121 870934 870755 871787 873744 875398 875967 875537 873718 869911 865467 863112
55718 863112 863286 863367 861423 858044 853164 844109 829119 810611 792663 776934 762972 750679 740064
55705 740064 729863 718770 707312 696773 687113 677411 667438 657299 646507 634866 623329 612600
55693 612600 601760 589599 576322 562560 547475 529322 507415 482577 456275 430156 405689
55682 405689 383468 363572 346996 335333 328246 322703 315942 308130 301084 295574 291171 287675 285197
55669 285197 283315 281245 278468 274594 269425 263730 258988 255648 252619 249146 246006 244050 242736 241143
55655 241143 239320 237604 235617 233116 231021 230488 231551 233556 236315 240013 244472 249210 253767 257616
55641 257616 260327 261962 262502 261035 256787 251034 246397 243895 242289 240635 239471 238841 237386 234735 232932
55626 232932 233881 236862 240117 243543 248117 253761 259571 265486 272232 280024 288338 296369 302937 306929
55612 306929 308689 309988 311714 312842 312605 312198 312864 313639 312692 309983 307021 304832 303697 304029 305820 307786
55596 307786 308713 309277 311209 315007 319741 324560 329073 332707 335145 337250 340416 345065 350447 355458 358945
55581 358945 360050 359314 358738 359625 360897 360500 357752 353324 347871 341995 336684 332230 327261 320344 312064
55566 312064 304121 296824 288973 279861 269895 259491 248856 238652 229503 220917 212066 203489 196590
55553 196590 191479 186806 181879 177482 174199 171235 167575 163341 159307 155729 152333 149090 146390 144323
55539 144323 142067 138395 133222 128438 126418 127511 129772 131296 131740 131187 129079 125399 121692 119464 118291
55524 118291 116927 115589 115613 117195 118921 119393 118153 115369 111992 110011 110943 113845 116015 115929 114553 113677
55508 113677 114046 115380 117182 119090 121050 123422 126468 129669 132064 133145 132996 131855 130165 128670 127646
55493 127646 126230 123393 119378 115391 111988 108585 104426 99265 93297 87350 82921 80974 80578 79704 77562
55478 77562 75389 74821 76252 78944 81928 84411 85961 86803 87617 88787 89973 90674 91074 92196 95071 99572
55462 99572 104180 107271 108657 109466 110601 112020 113487 115062 116606 117808 119144 121771 125832 129760 131953
55447 131953 132291 131457 129856 128078 127187 127351 127085 125148 122415 120552 119545 117996 115289 111936 108100
55432 108100 103337 97840 92682 88611 85414 82380 78719 73864 68165 62894 58943 56073 54050 53370
55418 53370 53723 52939 49266 44043 40309 39131 38913 37933 35849 32991 30087 28662 29837 32393 33570
55403 33570 32102 29157 26366 24526 24322 26344 29670 31903 31472 29015 26083 23528 21522 20119 19255
55388 19255 18889 19302 20525 21722 22122 22308 23318 24770 25300 24730 24153 23915 23286 22221 21569 21162 19662
55371 19662 16969 14944 14913 16059 17107 18013 19005 19495 19082 18389 17925 17279 16350 15995 16447 16433 15085 13573
55353 13573 13580 15213 17581 20328 23222 25222 25471 24607 23817 23310 22906 23178 24500 25723 25465 24201 23384
55336 23384 22858 20983 17379 13775 11674 10631 9433 7841 6495 5921 6300 7620 9496 11199 12257
55321 12257 12791 13107 13352 13636 14010 14108 13274 11429 9568 8894 9403 9626 8060 4863 1830 459 358 10
55302 -1092 -1895 -1435 -236 395 -220 -1927 -4353 -6914 -8648 -8844 -7839 -6574 -5429 -3954 -1640 1565
55285 5472 9731 13598 16137 16942 16427 15365 14486 14559 16232 19246 22103 23143 22170 20653 20131 20691 21255
55268 21255 20997 20008 18710 17221 15422 13207 10506 7578 5394 5074 6552 8395 9445 10128 11451
55253 11451 13270 14417 14293 13407 12399 11441 10758 10986 12484 14608 16025 15804 14253 12689 12159 12487
55237 12487 12992 13926 16085 18808 19822 18009 15115 13434 12918 12152 11133 10901 10979 9696 7299 6325
55221 6325 8047 10567 11606 11509 12102 13828 15568 16543 16912 16882 16443 15956 16129 17258 18865 20088 20282
55204 20282 19488 18398 17680 17529 18186 20321 23876 26963 27317 24981 22249 20823 20412 20365 20880 21800 21870
55187 21870 20459 18819 18319 18420 17706 16148 14934 14536 14306 13810 13498 14042 15773 18617 22045 25276
55171 25276 27923 30044 31276 30699 28109 24582 21054 17205 12742 8937 7576 8753 10915 12810 14278
55156 14278 15277 15397 14656 13848 13799 14776 16776 19764 23367 26729 29014 30059 30552 31441 32912 34020 33745
55139 33745 32307 30723 29129 26691 23572 21760 22997 26708 30875 34178 36251 36624 34945 32160 30103
55124 30103 29633 29964 30027 29689 29397 29259 28906 27933 26164 23660 20770 18275 17337 18745 21808 24387 24889
55107 24889 24122 24238 25859 27372 27368 26488 26149 26582 27089 27371 27450 26908 25401 23616 22741 23080 23925 24553 24705
55088 24705 24256 23111 21432 19601 18093 17424 17718 18193 17838 16875 16691 17965 19866 21595 23535 25990
55072 25990 27964 28397 27842 27668 28234 28919 29326 29369 28745 27561 27013 28316 31304 35046 39254 43863 47893
55055 47893 50246 51499 53531 57248 61656 65104 66621 66288 65259 65224 67023 69978 73119 76362 79681
55040 79681 82152 83091 83259 83473 82845 80196 76486 73805 72361 70645 68432 67258 67549 67649 66495 65264
55024 65264 65337 66290 66988 67220 67152 66449 65160 64498 65570 68043 70907 73691 76009 76822 75423 72780 70864
55007 70864 70702 71738 72738 72780 71673 70053 68910 68581 68362 67399 65696 64031 63187 63477 64674 66157
54991 66157 67490 69005 71443 74867 78286 80501 81013 80152 78838 78215 78906 80411 81673 82269 82603 82978
54975 82978 83112 82617 81375 79388 76909 74765 73880 74351 75524 76910 78281 78956 78124 76225 75070 75955
54959 75955 78251 80338 81407 81783 81905 81803 81656 82319 84780 88933 93237 96156 97876 99865 102562 104550
54943 104550 104544 103134 101555 99782 97218 94521 93072 92850 92462 91256 89957 89172 88746 88716 89424 90349 90212
54926 90212 88639 86505 84375 81957 79463 78030 78107 78739 79162 79965 81864 84376 86575 88398 90419 92923
54910 92923 95720 98284 99865 100223 100444 102055 105047 107784 109194 109891 110761 111594 111708 110986 109877 109314
54894 109314 110811 115289 121436 126557 129512 131563 134155 137645 142664 150460 160686 170790 179144 187166
54880 187166 196792 207520 217818 228009 239530 252265 264798 276726 288594 299785 308302 312650
54868 312650 312640 308690 301686 293019 283298 271488 256835 241037 226752 214487 202930 191960 182920
54855 182920 175740 168259 159319 150590 144168 139787 135712 131314 127591 125690 125796 127156 128701 130120
54841 130120 132608 137934 146337 155916 164475 171494 178121 185920 195970 208456 222509 236715 250037
54828 250037 261988 271938 278847 281890 280853 275839 267279 256329 244437 232083 218644 203896 188972
54815 188972 175247 162967 151737 141847 134020 127929 122007 115240 108485 103486 100919 99945 99424 98855
54801 98855 98117 97070 95884 95211 95375 95700 95207 93752 91916 90086 88441 87540 87896 88897 89161 88232 87014
54784 87014 86283 85633 84186 81381 76877 70845 64817 60882 59283 58109 56274 55323 56829 59296 59692
54769 59692 57528 55294 54835 55132 54236 52003 50125 50252 52689 56490 60287 63091 64462 64241 62834 61795
54753 61795 63014 66568 70328 72582 74002 75898 77698 78044 77671 78955 82634 86966 90383 93046 95306
54738 95306 96614 97086 98616 103126 110507 119209 127975 136101 142882 148068 152545 157626 163784 170720 178510
54723 178510 188027 200149 214802 230823 246765 262000 276884 291421 304071 312694 316709 317491
54711 317491 316411 313330 307444 298902 288993 279072 269752 260926 252399 244627 238696 235165 233108 230977
54697 230977 228327 225996 224698 224322 224633 225637 227113 228804 231358 236039 243111 251537 260758 271630
54683 271630 284886 299708 314799 330098 346377 363731 381484 399176 416545 432648 445742
54672 445742 454034 456086 451049 439379 423203 405128 386615 367829 348753 329734 311179 293439
54660 293439 276884 261434 246242 230646 215401 202070 191103 181446 172288 164202 157946 153002
54648 153002 148223 143517 139822 137563 136057 134587 133166 131879 130414 128854 128229 129320 131383 132994
54634 132994 133774 134107 133513 131005 127439 125700 127416 130729 132578 132194 130978 129972 129315 129599 131609 134608
54618 134608 136836 138155 140427 144633 149197 152068 153069 153153 152640 151547 150813 151810 154912 159385 164247
54603 164247 168560 171651 174040 177439 182599 187685 190158 190040 189911 191627 194391 196446 197418 198347 200267
54588 200267 203574 208200 213623 218976 223798 228557 233928 239711 245029 249714 255000 262548 273032 286001
54574 286001 300899 317778 336894 357880 379475 399957 417868 432704 445033 455470 463293 466503
54562 466503 463720 455604 443928 429696 412997 394388 375333 357047 339784 323553 308827 296151
54550 296151 285518 276519 268721 261728 255254 249206 243277 236646 228890 221228 215792 213160 211498 208632
54536 208632 204212 199252 194384 189362 183767 177378 170280 163262 157634 153921 151146 148127 144973 142421
54522 142421 140235 137447 134050 131127 129057 126729 123164 119138 116311 115007 113588 110249 105078 100108
54508 100108 97405 97414 99264 102225 106244 111078 115651 118664 119574 118719 116883 114969 113633 112840 112069 111099
54492 111099 110174 109258 107905 106290 105590 106606 108509 109774 109986 109980 110494 111496 112666 113868 115192 117078
54476 117078 120130 124389 129141 133938 139199 145076 150565 154935 159427 165878 173883 181080 186479 191796
54462 191796 198873 207356 215800 223591 230435 235174 236839 236350 235521 234510 231685 226227 219426 212877 206479
54447 206479 199114 190682 182537 176018 171271 167569 164249 161029 157721 154127 150337 146837 144020 141672
54433 141672 139230 136589 134347 133095 132771 132908 133227 133669 134109 134422 134678 134835 134415 133052 131425 130982 132416
54416 132416 134787 136541 137152 137415 138396 140472 143243 145911 147816 148965 150007 151362 152521 152669 151980
54401 151980 151764 153157 156041 159304 161650 162027 160050 156578 153536 152488 153372 154882 155884 156238 156495
54386 156495 157179 158225 158887 158439 157167 156183 155910 155280 153064 149634 146628 145024 144227 142986 140651 137544
54370 137544 134626 132762 131917 131260 130447 130258 131314 132800 133484 133596 134425 136202 137804 138713 139834 141880
54354 141880 144196 145905 147200 148739 150542 152213 153671 155098 156618 158336 160100 161095 160679 159867 160827
54339 160827 164358 168975 173153 177248 182292 188056 193472 198101 201975 204751 206147 206612 206517 205467 203497
54324 203497 202028 202226 203123 202826 200952 198325 194976 190411 185487 181826 179228 175668 170360 165000 161366
54309 161366 159217 157382 155518 153868 152458 151422 151217 151751 152084 151518 150129 147807 144037 139403 136091
54294 136091 135783 137801 140311 142575 144996 147615 149829 151388 152748 154583 157390 161063 164310 165388
54280 165388 164394 164038 166820 171977 176594 179247 180766 181462 179783 174679 167750 161687 157476 154365 151841
54265 151841 150192 149308 148376 147033 145693 144365 142152 138594 134671 131594 129196 126540 123818 122397 122809
54250 122809 123712 123405 121592 119065 116314 113203 109658 105914 102165 98549 95399 93071 91564 90652 90178
54235 90178 89843 89010 87298 85292 84121 84340 85553 86946 87882 88217 88466 89351 90780 91721 91657 91535 92379
54218 92379 93586 93824 93237 93178 93714 93139 90574 87594 86328 87080 88820 91117 94344 98382 102248 104954
54202 104954 106151 106085 105393 104671 103949 103071 102811 104645 108640 112399 113232 110981 107668 104847 102576 100818
54186 100818 100262 101218 102783 103801 103961 103349 101642 98659 95321 93146 92622 92679 92064 90830 90159 91022 93386
54169 93386 96602 99950 102721 104315 104789 105015 105781 106965 108059 109155 110666 112179 112623 111838 111072 111487
54153 111487 112924 114640 116384 117919 118206 116317 112978 110175 109058 108976 108759 108254 108185 108963 110116 110803
54137 110803 110521 109161 106566 102563 97772 93919 92448 92823 93144 92673 92608 93745 94774 94187 92937 93367
54121 93367 95772 97894 98081 97266 97175 98096 99406 101040 103162 105122 106068 106187 106204 105838 103955 100319 96202
54104 96202 93011 91051 89900 89290 89217 89640 90406 91148 91165 89900 87814 86194 85697 85558 84767 83545 82929
54087 82929 83130 83235 82682 82167 82627 83863 84696 84195 82248 79183 75487 71946 69526 68772 69438 70831 72330
54070 72330 73505 73897 72981 70587 67435 65015 64473 65406 66149 65625 64569 64525 65929 67889 69573 70921
54054 70921 71847 71772 70543 69106 68517 68767 69281 70217 72305 75474 78525 80352 80790 80087 78394 76283 75095
54037 75095 75947 78530 81484 83805 85334 86073 85846 84952 84408 84987 86296 87320 87636 87594 87446 86991 86208
54020 86208 85668 85969 87089 88606 90302 92214 94259 96191 97828 99074 99815 100025 99906 99675 99289 98644
54004 98644 97977 97710 97908 98138 97976 97586 97827 99828 104093 109621 114130 115794 115022 114173 115319 118453 121974
53987 121974 124622 126622 129016 132240 135630 138373 140713 143886 148806 155075 161379 166650 170804 174742
53973 174742 179686 186098 193001 198891 203622 208751 215566 223426 230769 237120 243160 249306 255398 261588
53959 261588 268304 275248 281497 286757 291512 295786 298886 300591 301504 301883 301267 299733 298290 297256 295363
53944 295363 291379 285722 279498 272776 264980 256400 248170 241128 235633 232087 230514 229923 229155 228147 227380
53929 227380 226384 224008 220186 216208 212997 210221 207483 205355 204461 204304 203862 203046 202761 203403 203818 202214
53913 202214 198043 192723 188247 185292 183122 181127 179635 178958 178544 177776 177004 176947 177468 177767 177500 176819 175554
53896 175554 173378 170804 169097 168939 169900 171404 173487 176353 179751 183114 185968 188146 190063 192835 197512
53881 197512 203930 210714 216599 221469 226135 231558 238230 245825 253332 259946 265801 271418 276534 280141
53867 280141 281773 282168 282597 284032 286916 291086 295760 300175 304370 308892 313823 318764 323683 328955 334525
53852 334525 339915 345181 350887 356990 362861 368786 376158 385468 395175 403501 410355 416447 421422 424358
53838 424358 425647 426877 428782 430517 431074 430266 428058 424064 418372 412170 406776 402265 397478 391241 383279
53823 383279 374144 364576 354996 345503 336219 327457 319355 311555 303466 294895 286238 278198 271389 266033
53809 266033 261784 258016 254459 251242 248118 244174 238901 233122 228007 223300 217517 210060 202265 195975
53795 195975 191737 188881 186695 184871 183284 182006 181331 181141 180466 178266 174486 169835 164830 159801 155634
53780 155634 153411 153106 153474 153601 153697 153958 153674 152315 150702 149980 149926 149432 148393 147752 147655 146990 145198 143305
53762 143305 142507 142788 143710 145511 148286 150808 151570 150797 150307 151413 153950 157322 161407 166116 170933 175416
53746 175416 179716 184311 189520 195331 201312 206700 211016 214595 218122 221881 226044 231266 237978 245143
53732 245143 250983 255314 260083 266983 275334 282866 287939 290527 291827 293588 297092 301960 306431 309401
53718 309401 311617 314281 317245 319505 320741 321201 320620 318627 316041 314401 314036 313758 312600 310724 308334
53703 308334 304900 299977 293862 286914 279095 270791 263199 257162 252307 247941 243999 240249 235510 229026
53689 229026 222164 217303 214988 213418 210893 207547 204337 201573 199184 197442 196526 195975 195447 195418 196191 196713
53673 196713 195562 193057 191197 191169 191878 191514 189896 188625 189276 192013 195857 199750 203216 206136 208116
53658 208116 208443 206995 204938 203955 204847 207495 211996 218681 226621 233382 237373 239738 242748 246693 249619
53643 249619 250039 248617 246974 246150 246763 249487 254195 259204 262524 263908 265024 267533 271555 276053 280150
53628 280150 283663 286634 288873 290246 291251 292908 295830 299583 303280 306683 310353 314715 319401 323655
53614 323655 327021 329437 330956 331678 331842 331752 331656 331701 331908 332136 332193 331939 331216 329828 327851 325810 324172 322807
53596 322807 321394 320174 319686 319816 319863 319694 320039 321291 322779 323732 324247 324677 324688 323846 322778 322729 323965 325399
53578 325399 325911 325384 324358 323326 322658 322583 322912 323240 323801 325702 329774 335309 340491 344145 346850 350148
53562 350148 354788 359881 363772 365758 366889 369048 373231 378871 384735 390159 395127 399483 402796 405374
53548 405374 408936 415433 425013 435539 444466 450994 456303 462106 469336 477936 487295 496711 505740 514250
53534 514250 522184 529542 536767 544656 553326 561507 567622 571558 574736 578283 581826 584337 585579 586340
53520 586340 587663 590225 594017 598131 601151 602252 601968 601633 602099 603024 603237 601852 599354 597561 598009 600184
53504 600184 601885 601547 599683 597929 597417 598560 601502 605756 609759 611854 611892 611263 611327 612352 613871 615379
53488 615379 616483 617008 617361 618485 621102 625021 629285 632922 635654 638123 641435 646284 652437 659128 665818
53473 665818 672417 678914 685169 691210 697639 705550 715865 728538 742532 756955 772148 789167 808173
53460 808173 828021 847801 868083 889961 913405 937395 961482 986275 1012393 1039760 1068267
53449 1068267 1098521 1131385 1166975 1204377 1242309 1280007 1317647 1355995 1395740 1437194 1480479
53438 1480479 1525490 1571436 1617035 1661764 1706631 1753078 1801278 1850079 1898343 1945531 1991055
53427 1991055 2034233 2075437 2116569 2159562 2204579 2250146 2294834 2338331 2380968 2422783 2463450
53416 2463450 2502988 2542133 2581606 2620935 2658354 2692286 2722884 2751881 2780892 2810089 2838284
53405 2838284 2863802 2885241 2901952 2914216 2922866 2928602 2931712 2932284 2930217 2924947 2915743 2902675 2886946
53392 2886946 2869762 2851078 2830010 2806336 2780850 2754052 2725232 2693567 2659701 2625309 2591046
53381 2591046 2555821 2518436 2479197 2439303 2399428 2359935 2321971 2286855 2254154 2221687 2188278
53370 2188278 2155632 2126557 2101776 2079438 2057592 2036353 2017534 2002767 1992152 1984414 1978063 1972511
53358 1972511 1968216 1966070 1966967 1971744 1980773 1993344 2008030 2024128 2042349 2063785 2088718 2116879
53346 2116879 2148212 2182721 2220030 2259908 2302905 2349653 2399539 2450814 2502162 2553952 2608105
53335 2608105 2666917 2731512 2800818 2872431 2945044 3019729 3098288 3180852 3265946 3352493 3440709
53324 3440709 3531066 3623299 3716596 3810108 3903301 3996376 4090213 4185197 4280181 4373210 4463060
53313 4463060 4549430 4632037 4710541 4785080 4855622 4920794 4978513 5027979 5070046 5105567 5134606
53302 5134606 5157468 5175137 5187935 5194690 5193862 5184794 5167448 5141801 5108108 5067100 5019420 4965534
53290 4965534 4906360 4842963 4775082 4700978 4619715 4532933 4443599 4353461 4262460 4170229 4077491
53279 4077491 3986067 3897678 3812428 3728512 3644151 3559805 3477425 3397462 3318124 3238274 3159515
53268 3159515 3084216 3012692 2943771 2877315 2814572 2756420 2702632 2652655 2605936 2561718 2519684
53257 2519684 2480630 2445391 2413264 2382616 2352844 2324593 2298168 2273166 2249846 2229529 2213118
53246 2213118 2200178 2189806 2181531 2174980 2169673 2165727 2163986 2164938 2168031 2172542 2178456 2186045 2195262 2206204
53232 2206204 2219632 2236318 2256125 2278329 2302513 2328640 2356575 2386339 2418701 2454683 2494234
53221 2494234 2535961 2578397 2620970 2663346 2704470 2743219 2779912 2816177 2852880 2888836 2922123
53210 2922123 2951992 2978646 3001687 3020104 3033845 3044038 3051209 3054432 3053065 3048377 3042411 3035812
53198 3035812 3027679 3017060 3003469 2986300 2964945 2939505 2910403 2877279 2839379 2797162 2752492
53187 2752492 2706816 2660016 2611453 2561227 2509842 2457504 2404671 2352745 2303114 2255575 2208583
53176 2208583 2161248 2114347 2069070 2025463 1982774 1940942 1900854 1862979 1826552 1790651 1755560
53165 1755560 1722327 1691140 1660952 1630730 1600404 1570465 1541423 1513889 1488450 1464921 1442301
53154 1442301 1419868 1397808 1376433 1355572 1335301 1316435 1299403 1283249 1266595 1249047 1230718
53143 1230718 1211095 1189707 1167634 1146904 1128333 1110987 1093790 1076437 1058767 1040559 1022290
53132 1022290 1004804 987782 969706 949971 929881 910786 892230 872947 852975 833713 816210
53121 816210 800215 784722 768725 751686 733965 716720 700965 686672 673053 659557 646427
53110 646427 634521 624593 616272 607736 597200 585034 573639 564672 557176 549071 539637 529585 519401
53097 519401 508953 498564 489155 481112 473965 467403 461677 456716 451748 446349 441164 436873 432990 428402
53083 428402 422871 417206 412000 406941 401564 396029 390728 385629 380666 376526 374222 373675 373337 371626 368282
53068 368282 364034 359562 355413 352413 351124 350953 350647 349703 348582 347566 346366 344966 343760 342405 339659
53053 339659 335034 329708 324972 320615 315851 311009 307000 303632 300016 296554 294986 295991 297963 298754
53039 298754 297705 295359 292148 288263 284323 281164 278963 277123 275026 272537 269932 267661 266097 265298
53025 265298 265039 265175 265628 265891 265081 262999 260856 260302 261782 264374 267173 270227 273897 277901 281519 284466
53009 284466 287079 289664 292035 293839 295105 296250 297560 298833 299526 299174 297582 294678 290393 284860 278749
52994 278749 273300 269762 268444 268181 266976 263628 258849 254415 251052 247648 242957 237640 233743 232188
52980 232188 231638 230177 227352 223999 220725 217503 214381 211583 208771 205128 200524 196020 192900 191618
52966 191618 191842 192872 193732 193497 192050 190147 188330 186275 183638 180910 178711 176756 174439 172200 171234
52951 171234 171775 172492 171956 170124 168143 167117 167223 167650 167371 166371 165982 167345 169706 171146 171167 171429 173365
52934 173365 176092 177615 177341 176255 175035 173382 171397 170370 171432 174090 176847 178919 180633 182316
52920 182316 183661 184432 185013 185632 185524 183764 180876 178616 177869 177659 176898 176267 177340 180262 183483 185648
52904 185648 186714 187220 187732 189287 192978 198193 202221 202680 199970 196587 194509 194020 194607 195873 197493
52889 197493 199113 200631 202257 204258 206784 209654 212102 213213 213177 213632 216101 220401 225211 229739 233959
52874 233959 237577 240084 241868 244053 246818 248906 249437 249442 250900 254664 259836 264779 268312 270447 272486
52859 272486 276024 281235 286475 290125 292448 294895 297863 300139 300664 299921 299129 298760 298462 297920 296986 295165
52843 295165 291923 287694 283898 281472 279926 278355 276903 276323 276278 275186 272215 268616 266361 265936 266204
52828 266204 266047 265228 263725 261394 258746 257155 257351 258006 256762 252982 248962 247907 250768 255301 258303
52813 258303 258520 257235 256338 256327 256303 255431 253931 252837 253173 255262 258321 260650 260677 258242 254837 252422 251900
52796 251900 252609 253136 252586 251261 250260 250482 252044 254476 257116 259226 260242 260251 260080 260511 261648 263362
52780 263362 265956 269630 273392 275376 274659 272312 270379 270160 271542 273428 274474 273974 272551 271712 272295
52765 272295 273569 274130 273383 271749 269774 267709 265834 264605 264290 264753 265660 266618 267168 267007 266299 265425 264445
52748 264445 263173 261834 261215 261905 263612 265472 266828 267518 267588 267110 266364 265975 266542 267904 268815 267790 264627
52731 264627 260915 258518 257571 256494 254069 250821 248027 246018 244151 241996 239618 236782 232957 228419
52717 228419 224538 222294 220957 218821 214994 209983 204865 200500 197292 194930 192305 188461 183842 180029
52703 180029 177890 176443 173922 169653 164513 159845 156255 153300 150152 146730 144191 143776 144997 145693 144460
52688 144460 142320 141032 140312 138107 133660 128891 126038 125009 124015 122122 120065 118809 118393 118318 118273 118127
52672 118127 117699 116835 115391 113109 109962 106746 104748 104512 105294 106061 106573 107046 107220 106546 105271 104553 105171
52655 105171 106573 107530 107535 107250 107622 108717 109459 108614 106134 103313 101305 99767 97606 94915 93220 93418
52639 93418 94406 94552 93962 94313 96655 100215 103278 104485 103416 100884 98796 98825 100823 103123 104538 105301
52623 105301 105914 106086 105381 104106 102900 102022 101562 101686 102180 102456 102667 103967 106814 109893 111802 113079
52607 113079 115174 117964 119881 120335 120378 120843 121416 121892 122833 124342 125598 126430 128128 131677 136166 139978
52591 139978 142672 144617 145661 145565 145237 146106 148313 150601 151976 152503 152632 152796 153622 155418 157212 157280 154999
52574 154999 151406 147771 144456 141460 139098 137588 136736 136579 137591 139599 141175 141021 139451 137599 135517
52559 135517 132177 127417 122797 120080 119453 119696 119613 118869 117807 117020 117055 118089 119714 121226 122184 122637 122873
52542 122873 123053 123112 122941 122657 122738 123756 125856 128558 131081 132793 133338 132636 131043 129410 128581 128811 129871
52525 129871 131665 134351 137759 141117 143626 145128 145996 146567 147024 147618 148665 150320 152497 154849 156785
52510 156785 157897 158676 160340 163343 166384 167644 166831 165213 163802 162601 161760 162155 163989 165778 165855 164404
52494 164404 163052 162828 163588 165224 168200 172586 177578 182415 187044 191409 194809 196725 197766 198974 200268
52479 200268 200360 198463 195589 193714 193851 195299 196788 197942 199321 201271 203381 205126 206502 207649 208334
52464 208334 208422 208474 209175 210295 210999 211244 211978 213693 215526 216273 215727 214575 213492 212833 212701 212651 211767 209698
52446 209698 207326 205718 204766 203649 202239 200921 199210 196009 191740 188887 189338 191977 193962 193880 192577
52431 192577 191200 189894 188717 188524 190058 192732 195111 196353 196684 196765 197270 198923 202167 206553 210854
52416 210854 213979 215564 215752 214975 214103 214089 214916 215276 213977 211558 209846 209947 211276 212670 213701 214497
52400 214497 214991 215127 215447 216547 217896 218121 216854 215599 216150 218549 221370 223758 226254 229374 232329
52385 232329 233903 234037 233661 233162 232071 230437 229453 229912 230762 230154 227652 224515 221908 219907 218446 218087
52369 218087 219148 220827 222025 222573 222934 223136 222907 222560 222684 222994 222561 221495 221340 223139 225749 226853
52353 226853 225418 222581 220293 219619 220350 221823 223778 226338 229194 231285 231836 231596 232319 234825 238252
52338 238252 241474 244362 247109 249201 250038 250112 250494 251406 252312 253333 255443 258973 262857 265721 266996 266715
52322 266715 265040 262588 260546 259695 259681 259779 260015 260971 262788 265040 267417 269799 271709 272472 272268 272477 274435
52305 274435 278061 282085 285494 288250 290699 292992 295478 298978 303856 309062 313128 316247 320335 326530
52291 326530 333597 339568 344083 347967 351256 353212 354073 355271 357612 360646 364123 368677 374365 379801
52277 379801 383646 386052 387907 389689 391961 395865 401785 408138 412837 415653 418100 421423 425788 430990
52263 430990 436678 442086 446814 451824 458451 466549 474863 483227 492934 504643 517266 529501 541365
52250 541365 553633 566840 581527 598405 617382 637137 656506 675726 695559 715787 735563
52239 735563 754970 775217 797168 820256 843146 865262 887555 911696 938294 965975 992613
52228 992613 1017411 1041234 1064994 1088519 1111219 1132888 1153421 1172610 1190900 1209404 1228356
52217 1228356 1246276 1261714 1275119 1287735 1299061 1307082 1311229 1313659 1316878 1321085 1324723 1326937 1328306
52204 1328306 1329314 1329319 1327555 1324577 1321903 1320331 1319238 1317805 1316361 1316039 1317417 1320130 1323591 1327415 1331231
52189 1331231 1335115 1340453 1349386 1362678 1378640 1394759 1409872 1424251 1438325 1452329 1466852 1482618
52177 1482618 1499615 1517152 1534729 1552071 1568344 1582388 1594194 1605384 1617437 1629621 1639304
52166 1639304 1644374 1645158 1643883 1642499 1641163 1638705 1634131 1627347 1618658 1608178 1595855 1581744 1566116
52153 1566116 1549690 1533695 1519002 1505068 1490551 1475234 1460410 1446844 1433477 1419177 1404909
52142 1404909 1392702 1382892 1373855 1364396 1354942 1346160 1337715 1329109 1320791 1313788 1308684 1305242 1302423 1298686
52128 1298686 1293143 1286749 1281591 1278593 1276648 1274365 1271746 1269598 1268102 1266826 1265521 1264083 1262108 1259272
52114 1259272 1255868 1252286 1248259 1243296 1237620 1232013 1226912 1222360 1218649 1216184 1214599 1212704 1209611 1205552
52100 1205552 1201397 1197574 1193627 1188658 1182297 1175340 1169174 1164289 1159627 1153919 1147469 1141984 1138590 1136656
52086 1136656 1134803 1132520 1130237 1128121 1125424 1121289 1115905 1110485 1106057 1102587 1099583 1097228 1096234 1096446
52072 1096446 1096420 1095004 1092883 1091723 1091919 1092038 1090732 1088422 1086619 1086117 1086510 1087192 1088072 1089267 1090899 1093550
52056 1093550 1098283 1105453 1113692 1120926 1126568 1132023 1138690 1146286 1153968 1162526 1174210 1190262 1209558
52043 1209558 1230099 1251036 1272863 1296399 1322198 1350292 1379775 1409092 1437514 1465967 1495676
52032 1495676 1526260 1556029 1583902 1610149 1635347 1659642 1683132 1705969 1727716 1747369 1764369
52021 1764369 1778894 1790999 1800343 1807090 1812070 1815388 1815864 1812787 1807433 1801763 1796176 1789818 1782681 1775886
52007 1775886 1769710 1762791 1753827 1743137 1731993 1721227 1711017 1701231 1691323 1680562 1669210 1659039
51995 1659039 1651939 1648288 1647285 1648433 1651850 1657286 1663781 1670390 1676683 1682578 1688425 1695257 1704088 1714651
51981 1714651 1725384 1734971 1743366 1751040 1757906 1763577 1768251 1772675 1777228 1781453 1784504 1785851 1785569 1784137
51967 1784137 1781917 1778699 1773713 1766143 1755692 1742854 1728724 1714182 1698921 1681603 1661487 1639684
51955 1639684 1618137 1597499 1576843 1555330 1533045 1509984 1485471 1459326 1432556 1405948 1378723
51944 1378723 1349674 1319118 1288573 1258808 1229349 1199743 1170159 1140607 1110721 1080738 1051823
51933 1051823 1024851 999302 973807 947617 921290 895986 872095 848597 824123 798765 774134
51922 774134 751254 729325 707406 686374 667772 651255 634870 617718 600553 583694 566444
51911 566444 549339 535021 525310 518560 511256 501515 490018 478471 468423 460771 454852 448480 440276
51898 440276 431738 425590 422287 419537 415347 410099 405307 401660 398910 396613 394148 390663 385806 380257
51884 380257 375051 370630 366787 363192 359564 355630 351260 346605 341959 337523 333300 328971 324077 318695
51870 318695 313877 310870 309739 309224 308073 306110 303815 301334 298332 294554 290213 285930 282457 280327
51856 280327 279576 279867 280804 281977 282727 282336 280689 278530 276784 275597 274086 271105 266377 261052 257043
51841 257043 255462 255679 256034 255467 254182 252853 251648 250217 248351 246254 244151 241839 238940 235711 233353
51826 233353 232964 234130 235173 235189 235254 236989 240281 243244 244235 243157 240891 238372 236379 235349 234997 234774
51810 234774 234957 236579 239886 243597 246259 247820 249320 251625 255178 260361 267020 273722 278509 280691
51796 280691 281329 281770 282311 282545 282355 281906 280976 279004 276005 272938 270817 269669 268778 267932 267836 269011 270770
51779 270770 271856 271961 271948 272584 273721 274940 276280 277934 279758 281623 283898 286939 290352 293278 295301
51764 295301 296567 297215 297318 297278 297638 298290 298377 297172 294772 291954 289796 289471 291670 295757 299833 302140
51748 302140 302418 301733 301223 301207 301328 301111 300353 299156 297789 296616 296157 296792 298079 298670 297617 295892 295790
51731 295790 298454 302518 305623 306649 305966 304322 302626 302348 304660 308922 313129 316228 319042 322509 326147
51716 326147 328975 331008 332862 334645 336383 338899 342954 347681 351226 352987 354113 355751 358108 361489
51702 361489 366770 373915 381163 386756 390884 395051 400105 405817 411886 418338 425189 432570 440891 449882
51688 449882 457719 462227 463095 461976 460273 457875 454427 450820 448553 447997 448005 447113 444750 441409 438043 435410
51672 435410 433840 433418 434139 435730 437576 439148 440370 441391 442277 443226 444584 446037 446286 444377 441095
51657 441095 438014 435367 432123 428281 425635 425571 427243 428791 429437 429444 428835 427385 425542 424221 423799 424126
51641 424126 425290 427458 430023 431810 432213 431493 430015 428034 426378 426427 428908 433108 437723 442172 446789
51626 446789 451969 457523 462901 467928 473159 479329 486398 493330 498909 502454 503744 502874 500587 498147
51612 498147 496220 494236 491391 487749 483558 478091 470438 461277 452548 445196 438420 431391 424409 417819
51598 417819 411074 403822 396955 391504 387201 383213 379761 377793 377268 376894 375572 373200 370099 366637 363530
51583 363530 361505 360280 358656 356093 353504 351946 351010 349133 345316 340091 334893 330810 327934 325716
51569 325716 323898 322955 323357 324631 325666 326001 326132 326378 326220 325281 324297 324287 325109 325636 325199 324081 322790
51552 322790 321797 322094 324894 330170 336088 340513 342725 343309 342981 342199 341535 341623 342783 345144 348870 353677
51536 353677 358465 362325 365866 370663 377161 383940 389352 393132 396015 398522 400728 402639 404066 404458
51522 404458 403395 401037 397716 393646 389563 386961 386655 387437 387218 385445 383396 382219 381842 381871 382240 382520
51506 382520 381922 380927 381821 386393 393665 400969 406814 411559 415730 419088 421577 423917 426681 429522 431700
51491 431700 432791 432525 430708 427850 425302 424070 423711 422891 420909 418344 416424 416129 417734 420804 424552
51476 424552 428370 431928 434900 437033 438656 440615 443294 446135 448565 450924 453707 456191 456764 454813
51462 454813 451472 448184 445207 442075 438905 436315 434122 431035 426274 421142 418325 419230 422207 423728
51448 423728 421424 415905 409750 405203 403019 402923 404385 406783 409349 411428 412790 413650 414375 415112 415636 415674
51432 415674 415431 415481 415948 416309 416536 417935 421904 427948 433970 438793 443364 448937 455033 460084 463514 466216
51416 466216 469339 473564 479356 486847 495273 503324 510348 516667 522660 528168 533026 537450 541523 544783
51402 544783 546764 547591 547692 547250 546320 545194 544273 543667 543137 542388 541360 540449 540391 541519 543036 543519 542276
51385 542276 539754 536498 532436 527672 523201 519959 517538 514688 510902 506637 502100 496806 490509 483769
51371 483769 477284 471350 466227 462273 459207 455909 451615 446877 442731 439391 436603 434928 435579 438688
51357 438688 442515 444847 444837 443283 441594 440917 441828 444223 447388 450486 453115 455343 457345 459118 460466
51342 460466 461091 460677 458967 455771 451074 445343 439558 434384 429168 422323 413144 402778 392856 383607
51328 383607 374195 364667 356404 350259 345216 339617 333111 326692 321197 316657 312911 309936 307322 304185
51314 304185 300064 295536 291461 287809 283677 278464 272729 267718 264254 262261 261187 260449 259354 257152
51300 257152 253818 250627 249148 249466 250065 249811 249346 249880 251237 252084 251780 250965 250267 249470 248287 247174 246836
51283 246836 247509 249065 251308 253671 255225 255590 255543 256076 257103 257767 257949 258821 261589 266019 270361 272755
51267 272755 272891 272484 273977 278370 284343 289650 293239 295716 297921 299677 300062 298458 295123 291056 287566
51252 287566 285592 284855 283727 280494 275037 268927 263555 258552 252636 245836 239825 235755 232703 229185
51238 229185 225519 223304 222680 221536 218065 212991 208439 205441 203614 202621 202650 203534 204618 205716 207256
51223 207256 209180 210608 211115 211570 212936 214681 215207 213731 211061 208518 206742 205761 205564 206018 206526 206490
51207 206490 206276 207123 209608 212471 213561 212029 209131 206707 205323 204249 202826 201225 199938 199067 198355
51192 198355 197555 196583 195459 194189 192671 190762 188643 187019 186620 187403 188577 189525 190352 191306 192000 191794
51176 191794 190775 189800 189366 188985 188075 187095 187137 188491 190307 191866 193560 196095 199207 201772 203022 203054
51160 203054 202240 200828 199169 197720 196549 195330 194046 193236 193338 194247 195758 197850 200214 202060 202909
51145 202909 203158 203379 203541 203452 203532 204415 206091 208164 210682 213839 216992 219014 219766 220343 221473 222466 222179
51128 222179 220511 218440 217049 216946 218197 220268 222237 223495 224102 224209 223551 221979 220146 218943 218348
51113 218348 217458 215739 213601 211501 209168 206135 202594 199088 195771 192643 190232 189043 188334 186684 184298
51098 184298 183613 186474 191385 194922 195542 194657 194048 193941 194059 194847 196357 197077 195389 191849 188861 188214
51082 188214 189803 192480 195227 197546 199441 201036 201867 201092 199032 197672 198441 200095 200189 198360 196487
51067 196487 195636 194753 192891 190942 190095 189896 189159 187917 187183 187297 187604 187473 186767 185496 183746 181804 179814
51050 179814 177653 175623 174824 176075 178770 181472 183391 184622 185214 184933 184019 183485 184325 186630 189513 191809
51034 191809 193092 194182 196332 199648 202796 204597 205290 205729 206061 206083 206366 207839 210347 212652 213946 214484
51018 214484 214652 214430 214146 214822 217047 219959 221996 222584 222772 224211 227530 231556 234216 234590 233983 234620
51002 234620 237303 240821 243473 244463 243878 242320 240968 241173 243155 245490 246479 245843 244641 243891 243846 244275
50986 244275 244725 244531 243255 241290 239515 238261 237057 235627 234559 234592 235534 236413 236709 237022 238367 241004
50970 241004 244165 246894 248925 250579 251929 252429 251622 250034 248938 249173 250594 252797 255893 260048 264642
50955 264642 268641 271790 274788 278049 280967 282758 283475 283685 283654 283531 284081 286425 291018 297475 305271 313911
50939 313911 322434 329694 335563 341150 347394 354116 361103 369484 380940 395486 410920 424928 437361
50926 437361 450071 464805 481672 499533 517268 534332 550594 566496 583499 603552 627605
50915 627605 654970 684643 716698 751794 789863 830356 873555 920459 971358 1025675 1083395
50904 1083395 1145298 1211308 1279899 1350092 1422984 1500207 1581519 1664915 1748545 1831417 1912769
50893 1912769 1991899 2068338 2140961 2207147 2264123 2311331 2350525 2383395 2410099 2430184 2443739
50882 2443739 2451046 2451969 2446454 2435227 2419561 2400709 2379867 2358319 2337161 2317046 2298117 2279838
50870 2279838 2260824 2239482 2215082 2187828 2157672 2123509 2083957 2038643 1988462 1934675 1878023
50859 1878023 1818623 1756589 1692598 1627630 1562235 1496751 1432594 1372484 1318250 1268700 1220843
50848 1220843 1173299 1127465 1085210 1046743 1011395 979314 951224 926989 905524 886001 868518
50837 868518 853531 841242 831554 824280 819284 816436 815285 814840 814134 813191 812995 814292 816962 820783 826034
50822 826034 832717 839872 846590 853388 861625 871610 882279 892913 904262 917385 932050 947115 962343
50809 962343 979052 998687 1021287 1045872 1072161 1101192 1134012 1170303 1208936 1249673 1293642
50798 1293642 1342170 1395884 1455117 1520443 1592161 1669811 1752959 1842424 1940145 2047697 2165252
50787 2165252 2292017 2427394 2571542 2724940 2887436 3057759 3233991 3414425 3597687
50778 3597687 3782015 3964898 4143609 4315623 4477929 4626323 4756242 4864687 4951070 5016189
50768 5016189 5060844 5085658 5091802 5081340 5056836 5021051 4977113 4928651 4879159 4831008 4785065
50757 4785065 4741317 4699706 4660278 4622659 4585481 4546307 4502064 4449820 4387424 4313532 4227245
50746 4227245 4128184 4017114 3895928 3766482 3629666 3486186 3338087 3188868 3041972 2899590
50736 2899590 2762953 2633241 2511957 2400639 2300246 2210518 2130054 2057576 1993174 1937877
50726 1937877 1891917 1853929 1821948 1794683 1771726 1753154 1739163 1729547 1723186 1718455 1714275 1710350
50714 1710350 1706248 1700960 1693690 1684604 1674459 1663936 1653453 1643006 1631856 1619014 1604435 1589186
50702 1589186 1574159 1559291 1544330 1529484 1514794 1499894 1485199 1472416 1462879 1456119 1451262 1449065
50690 1449065 1451178 1457823 1467754 1480410 1496472 1516045 1537864 1560996 1586166 1614625 1646624 1681777
50678 1681777 1720138 1761987 1807103 1855233 1907251 1965163 2030897 2105318 2188122 2278257 2374519
50667 2374519 2476086 2582424 2692535 2804528 2916137 3025439 3130874 3230917 3324174 3409575
50657 3409575 3485935 3551339 3603463 3640656 3662421 3668780 3659677 3635528 3598270 3551377 3498633 3443069
50645 3443069 3387065 3332806 3281938 3234902 3191302 3151190 3115460 3084697 3058086 3033788 3009983
50634 3009983 2984996 2956721 2922706 2881042 2830969 2772668 2706867 2634775 2558101 2478984 2399756
50623 2399756 2322476 2248402 2178062 2112066 2051682 1998396 1953041 1915583 1885558 1862524 1846373
50612 1846373 1837493 1836388 1842844 1855835 1874648 1899723 1931804 1970482 2014091 2060833 2109385 2158653
50600 2158653 2207727 2256156 2303703 2349806 2393869 2436098 2477398 2518289 2558427 2597266 2634658
50589 2634658 2670687 2705528 2739704 2774220 2810307 2849239 2892085 2938957 2988564 3039259 3090665
50578 3090665 3143584 3198307 3254034 3310266 3367660 3426641 3485842 3542934 3596668 3647146 3694138
50567 3694138 3736022 3770820 3797839 3817836 3831688 3839261 3839810 3833378 3821475 3806144 3788604 3769139
50555 3769139 3748265 3727691 3710138 3698444 3694506 3698346 3707966 3720472 3733602 3746136 3757352 3766727
50543 3766727 3773919 3778062 3776888 3767474 3748226 3719292 3680637 3630701 3567933 3493046 3408635 3316689
50531 3316689 3217625 3112027 3002437 2892585 2785030 2680116 2577399 2477651 2382965 2294972
50521 2294972 2213590 2137887 2067669 2003628 1946256 1895393 1850743 1811984 1778261 1748402 1721987
50510 1721987 1699629 1681991 1669175 1661202 1658194 1659600 1664190 1671579 1683101 1700302 1722955 1749351
50498 1749351 1778209 1809543 1843931 1881773 1923197 1967978 2015504 2065396 2118184 2174908 2236067
50487 2236067 2301522 2371272 2445522 2523589 2603311 2682146 2758953 2834552 2910578 2987904 3066205
50476 3066205 3145062 3225197 3308271 3395467 3486647 3581116 3678901 3780990 3888482 4001786 4120658
50465 4120658 4244984 4375409 4512899 4657310 4806707 4958618 5111638 5264999 5416874
50456 5416874 5564435 5705786 5840360 5966567 6080241 6176571 6252945 6308908 6344127 6357726
50446 6357726 6349307 6319261 6267915 6195406 6102887 5993514 5872160 5744187 5613973 5484124
50436 5484124 5356664 5235417 5126263 5034003 4959590 4901526 4859248 4833626 4824395 4828816 4843089
50425 4843089 4863513 4885641 4903599 4911274 4903815 4877688 4830055 4758856 4663569 4545940 4410165
50414 4410165 4261714 4105046 3942581 3776349 3609801 3446583 3288049 3133849 2984932
50405 2984932 2844036 2712841 2590656 2476860 2372831 2280116 2198015 2124352 2057590 1996939
50395 1996939 1941538 1891324 1848214 1814668 1790995 1775031 1764226 1757044 1752700 1750875 1751976 1756848
50383 1756848 1766020 1779448 1796625 1816405 1837320 1858982 1882769 1910231 1941160 1974136 2008521
50372 2008521 2044761 2082922 2122154 2161619 2201062 2240519 2280408 2321668 2364610 2407670 2448580
50361 2448580 2487006 2524953 2564387 2605569 2647966 2691519 2736455 2783010 2831914 2884156 2939681
50350 2939681 2997394 3057179 3120800 3189844 3263623 3340037 3417587 3495385 3572031 3646048 3717080
50339 3717080 3785161 3848795 3905097 3951943 3988768 4014969 4028827 4028651 4014021 3985185 3941989 3884267
50327 3884267 3812912 3729840 3637099 3536614 3430608 3321733 3212787 3106627 3006151 2913814
50317 2913814 2831026 2758260 2695765 2643996 2603464 2574375 2556264 2547602 2545875 2548390 2553092 2558303
50305 2558303 2561808 2560703 2552369 2535308 2508966 2473253 2428711 2376808 2319472 2258113 2193327 2125634
50293 2125634 2056340 1987501 1920971 1857465 1796618 1738078 1682385 1630528 1582803 1538653 1497794
50282 1497794 1460831 1428246 1399288 1372510 1347143 1323296 1301123 1280719 1262851 1248830 1239335
50271 1239335 1234021 1232392 1234158 1238425 1243531 1248514 1254121 1261705 1271783 1284308 1299526 1317314 1336254
50258 1336254 1354771 1373112 1392879 1414524 1436627 1458097 1479760 1503015 1527844 1553012 1577481
50247 1577481 1600735 1622378 1642470 1661934 1681531 1700418 1716770 1730103 1742253 1755531 1770191
50236 1770191 1784183 1795241 1802921 1808458 1812790 1815083 1813482 1807159 1797114 1784816 1770642 1753979
50224 1753979 1734361 1711878 1686780 1659428 1630665 1601739 1573585 1546363 1519609 1492693 1465367
50213 1465367 1438201 1412252 1388016 1364994 1342767 1322031 1303804 1287881 1272973 1258333 1244288
50202 1244288 1231241 1219190 1208393 1199277 1191192 1182481 1172675 1163628 1157325 1153278 1149285 1144245 1138849
50189 1138849 1133794 1128827 1123777 1119165 1115304 1111747 1108035 1103986 1098884 1091549 1081995 1072008 1063041 1054388
50175 1054388 1044663 1034434 1025788 1019429 1013777 1007362 1000708 995086 990595 986603 983348 981764 981871 982580
50161 982580 983314 984654 986873 988778 989027 988170 988284 990504 993837 996742 999044 1001480 1003828 1004587 1002733
50146 1002733 999064 995327 992329 989362 985246 979513 972481 964548 955710 945783 935004 924230 914423
50133 914423 905907 898193 890461 882074 872731 862527 852096 842504 834732 829199 825639 823244 820923 817762
50119 817762 813479 808472 803451 799176 796271 794753 793720 792148 790188 789012 789056 789056 787402 783821 779138
50104 779138 774053 769109 765302 763329 762181 759657 754683 748243 741761 735420 728481 720386 711069 700971
50090 700971 691337 683826 679089 676165 673798 671754 670278 668999 667392 665871 665265 665362 665063 664106 663690 664967
50074 664967 667640 670470 672700 674609 677000 680539 685439 691423 697991 704780 711782 719355 728038 737988
50060 737988 748327 757567 765322 773387 784316 798738 814627 829419 842415 854832 867795 880666
50048 880666 891452 899067 905117 912900 924102 936898 948019 956291 963122 969860 976278 982120 988492
50035 988492 996461 1005114 1012451 1017921 1022848 1028354 1034056 1039211 1044225 1050224 1057534 1065290 1072661 1080084
50021 1080084 1088970 1100156 1112819 1125176 1136220 1146619 1157904 1171212 1186870 1204675 1224078
50010 1224078 1244308 1264821 1285703 1307481 1330728 1355956 1383521 1413184 1443934 1474669 1505006
49999 1505006 1535236 1565705 1596637 1628304 1660743 1693242 1724635 1754320 1782808 1811219 1840425
49988 1840425 1870645 1901594 1933006 1965209 1999150 2035658 2074782 2116100 2159442 2205043 2253171
49977 2253171 2303904 2356852 2410388 2461347 2506389 2544040 2574993 2600400 2620541 2635437 2646045
49966 2646045 2654211 2661661 2669412 2677814 2686532 2694279 2698812 2697393 2687548 2667754 2637636 2597529 2547949
49953 2547949 2489624 2423807 2352239 2276882 2199969 2123917 2050508 1980177 1912664 1848263 1787730
49942 1787730 1731103 1677531 1626396 1577662 1530931 1485349 1440984 1399232 1361138 1326340 1294443
49931 1294443 1266183 1241867 1219551 1196475 1172011 1147859 1125721 1106196 1089512 1075403 1062126
49920 1062126 1047619 1032237 1018663 1008316 999518 990266 981182 974172 969402 965438 961699 958951 957596
49907 957596 957078 956993 957331 957512 956669 955202 954675 955603 956575 956352 955832 956974 960479 965476 970999 976715 982378
49890 982378 987647 992720 998534 1005954 1015029 1025217 1036143 1048090 1061867 1078299 1097787 1120330
49878 1120330 1145747 1173630 1203250 1234095 1266773 1302937 1343855 1389326 1438385 1490871 1547882
49867 1547882 1611000 1681489 1759982 1846215 1939062 2037386 2140735 2248553 2358769 2468127
49857 2468127 2574205 2676183 2773139 2862755 2942950 3014376 3080091 3142812 3203438 3262021 3318487
49846 3318487 3371584 3418203 3454903 3479768 3492021 3490438 3473312 3439895 3390848 3327186 3249925
49835 3249925 3161151 3064382 2962874 2857885 2749352 2638090 2526544 2417249 2311034 2207038
49825 2207038 2104420 2004080 1908786 1821444 1742966 1671783 1605473 1542647 1483242 1427556 1375657
49814 1375657 1327577 1283435 1243203 1206667 1173613 1143674 1116069 1089957 1065131 1041872 1020078
49803 1020078 999107 978706 959446 941858 925596 909984 894953 880942 868170 856638 846534
49792 846534 837986 830505 823413 816824 811536 807844 805082 802520 800057 797660 794803 791045 786868 783362
49778 783362 781227 780416 780517 781004 781260 780872 779991 779073 778352 777892 778116 779825 783587 789323 796481 804310 812090
49761 812090 819577 827335 836216 846453 857696 870037 884411 901595 921317 942908 966553 993366
49749 993366 1024354 1059712 1098925 1141093 1185409 1231942 1282066 1337601 1399408 1467089 1539780
49738 1539780 1616366 1694738 1771739 1844537 1911759 1972935 2027422 2074477 2114035 2146726 2173304
49727 2173304 2194807 2213154 2230674 2248498 2265673 2279943 2288891 2290233 2281740 2261516 2228243 2180991
49715 2180991 2119449 2045131 1962107 1875599 1789380 1704846 1622420 1542957 1467339 1395642 1327833
49704 1327833 1265056 1209079 1160202 1116601 1076228 1038722 1004869 974874 948042 923781 901978
49693 901978 882495 865240 850733 839572 831070 823391 815531 808304 802810 798787 795138 791210 786646
49680 786646 780848 774026 768305 766176 767679 770371 772182 773020 773369 772980 771821 771032 771644 773031 773729 773361
49664 773361 772813 772870 773654 775120 777212 779611 782002 784301 785948 785527 782331 778044 775521 775662 776698 776875
49648 776875 776521 776831 777820 778599 778928 779195 779218 778324 776803 776243 777915 781253 784366 785824 785757 785364 785648 786627
49630 786627 787676 788418 789102 790231 792200 795344 799866 805361 810743 815022 818065 820373 822382 824301 826275
49615 826275 828225 829750 830651 831371 832319 833068 833076 833173 835247 839953 845430 848937 849356 847654 845431 843802 843375
49598 843375 844283 845905 847065 846879 845339 843147 841270 840611 841588 843764 845959 846985 846401 844798 843421
49583 843421 843150 843533 843190 841619 840279 841117 844133 847239 848572 848119 846848 845326 843815 842859 842769 843012
49567 843012 842965 842923 843441 844085 843916 843165 843297 845249 848576 852545 857062 862151 867620 873787 881508 890592
49551 890592 899140 905626 911035 917608 925803 933947 941023 948341 957815 969706 982942 996831 1011363
49538 1011363 1026321 1041276 1056502 1072853 1090404 1108098 1125227 1142613 1161514 1181886 1202739
49527 1202739 1224157 1247783 1274739 1303965 1333492 1362805 1392841 1423809 1454355 1483427 1512164
49516 1512164 1543169 1578237 1617296 1659128 1702487 1746687 1791806 1838507 1887358 1938211 1990366
49505 1990366 2043158 2096160 2149024 2201563 2254072 2307427 2362777 2420937 2481692 2543610 2604981
49494 2604981 2665159 2724549 2783162 2839964 2894194 2946469 2997640 3047014 3092786 3133974 3170817
49483 3170817 3203311 3230586 3252062 3268305 3280328 3288752 3293932 3296082 3294966 3290265 3282664 3273700 3263964
49470 3263964 3252356 3237932 3221907 3206892 3194573 3185069 3178231 3174499 3174241 3177046 3182050 3188632 3196606
49457 3196606 3206105 3217543 3231643 3249284 3270979 3296219 3323411 3350975 3378614 3407073 3436528
49446 3436528 3465854 3493682 3519423 3542695 3562589 3578441 3590920 3601286 3609492 3613798 3612335 3604494
49434 3604494 3590769 3571880 3548209 3519657 3485803 3446400 3401659 3351978 3297703 3239480 3178400
49423 3178400 3115222 3049762 2981767 2912165 2842690 2774316 2706746 2639426 2572394 2506155 2441389
49412 2441389 2378807 2318635 2260338 2203571 2149255 2098645 2051262 2004917 1958317 1912650 1869952
49401 1869952 1830829 1794562 1760671 1729241 1700015 1672094 1644619 1617327 1590591 1565347 1542689
49390 1542689 1523014 1505693 1489932 1475612 1462910 1451518 1440916 1431141 1422528 1414795 1407102 1399194
49378 1399194 1391931 1386493 1383314 1381818 1380831 1379272 1376903 1374581 1373523 1374240 1376323 1379213 1382819 1387347
49364 1387347 1392906 1399456 1407008 1415701 1425835 1437917 1452562 1470095 1490054 1511036 1531250 1549500
49352 1549500 1565643 1580051 1592927 1604555 1615859 1627836 1640353 1652396 1663920 1676535 1691643
49341 1691643 1708699 1726317 1744608 1765246 1789238 1815599 1842385 1868246 1892843 1916467 1939668
49330 1939668 1962798 1985769 2008411 2030836 2052898 2073724 2092699 2110755 2129508 2149049 2167787
49319 2167787 2184841 2201212 2218008 2234910 2251583 2269471 2290461 2314209 2338327 2361244 2383529
49308 2383529 2406320 2429835 2454013 2479484 2506966 2536328 2566990 2598902 2632531 2668038 2704945
49297 2704945 2742534 2780290 2818152 2856581 2896189 2937128 2979113 3022234 3067309 3115012 3164975
49286 3164975 3216277 3268697 3323001 3380001 3439759 3501701 3565109 3629476 3694834 3761972 3832094
49275 3832094 3906029 3983783 4064759 4148183 4233393 4320183 4408981 4500343 4594051 4688944 4783841
49264 4783841 4878437 4973087 5067828 5161793 5253501 5341751 5426476 5508772 5589711 5668961 5744792
49253 5744792 5815522 5880514 5939667 5992619 6038994 6078904 6112390 6138743 6157267 6168583 6174236
49242 6174236 6174946 6170209 6159912 6145401 6128328 6109217 6087959 6065220 6042466 6020730 6000112 5980468
49230 5980468 5962094 5945656 5931911 5921505 5914719 5911396 5911450 5915275 5923249 5935004 5949737 5967253 5988102
49217 5988102 6012520 6039752 6068654 6098404 6128272 6157149 6183933 6208286 6230470 6250363 6267069
49206 6267069 6279613 6287581 6290678 6287926 6277861 6259675 6233686 6200504 6160146 6112486 6058207 5998631
49194 5998631 5934646 5866578 5795180 5721819 5647169 5570520 5491170 5410039 5329062 5249344 5170875
49183 5170875 5093919 5019599 4948731 4880835 4814797 4750035 4686703 4625220 4565988 4509264 4454950
49172 4454950 4402723 4352623 4305163 4260540 4218001 4176428 4135496 4095940 4058591 4023517 3990214
49161 3990214 3958437 3928403 3900107 3872898 3846277 3820851 3797713 3776770 3756629 3736646 3718153
49150 3718153 3702642 3689449 3676532 3663244 3650923 3640612 3631575 3622541 3613258 3604224 3595819 3588448
49138 3588448 3582726 3578715 3575531 3572480 3570187 3569998 3572658 3578014 3585578 3594908 3605881 3618997 3634813
49125 3634813 3652772 3671404 3690179 3710163 3731960 3754067 3774563 3793818 3814080 3836756 3861400
49114 3861400 3887216 3914169 3942476 3972194 4003553 4036724 4071155 4106127 4142037 4180047 4220283
49103 4220283 4261443 4302379 4342895 4382682 4420864 4457507 4494533 4534070 4576312 4619756 4663029
49092 4663029 4705832 4748468 4791214 4834047 4876644 4918818 4961047 5003969 5047092 5088648 5127180
49081 5127180 5162687 5195921 5227386 5257656 5287854 5318810 5350131 5380919 5410974 5440405 5468545
49070 5468545 5494450 5518524 5542504 5567551 5593158 5618330 5643064 5668122 5693802 5719673 5745406
49059 5745406 5771291 5797588 5823609 5847966 5870030 5890918 5912503 5935359 5958164 5979313 5998524
49048 5998524 6016509 6033710 6050037 6065512 6080295 6094073 6106106 6116091 6124620 6132654 6140840 6149324
49036 6149324 6157889 6166278 6174612 6183430 6192918 6202132 6209511 6214424 6217948 6221871 6227012 6232707 6237930 6242683
49022 6242683 6248101 6255228 6264102 6274249 6285532 6297837 6310301 6321940 6333178 6345598 6359631 6373561
49010 6373561 6385628 6396209 6406775 6417348 6426296 6432329 6435476 6436162 6434643 6431517 6427538 6422371 6414391
48997 6414391 6402348 6386787 6369531 6352136 6334955 6317184 6297735 6276469 6254400 6232163 6208760
48986 6208760 6183004 6155976 6130458 6107612 6085734 6062915 6039489 6016810 5995038 5973626 5953091
48975 5953091 5934573 5918015 5902307 5887165 5873538 5862153 5852906 5845834 5841395 5839330 5838381 5837754 5838084
48962 5838084 5840262 5844019 5848425 5853199 5858663 5864663 5870565 5876479 5883657 5893006 5903518 5912998 5920503 5927502
48948 5927502 5936082 5946344 5956322 5964411 5970965 5977219 5983512 5989259 5993961 5997257 5998345 5996472 5991986 5986014
48934 5986014 5978975 5970187 5959082 5945970 5931357 5915297 5897750 5878816 5858171 5835035 5809289 5781947
48922 5781947 5753795 5724102 5691579 5656272 5619652 5582833 5545582 5507205 5467713 5427845 5388429
48911 5388429 5349966 5312402 5275002 5236762 5197240 5156947 5116879 5077984 5041160 5007365 4977201
48900 4977201 4950424 4926206 4904111 4884675 4868761 4856364 4846324 4837591 4830619 4826997 4827653 4831987
48888 4831987 4839026 4848767 4861755 4877832 4896276 4916992 4940525 4966738 4994457 5022847 5052397 5084054
48876 5084054 5118089 5154387 5193132 5234357 5277323 5321241 5366382 5413700 5463653 5516244 5571842
48865 5571842 5630759 5691935 5753377 5814421 5876602 5941732 6009930 6080250 6152373 6226703 6303295
48854 6303295 6381817 6462449 6545876 6632232 6720757 6810732 6902366 6996520 7093788 7193803 7295242
48843 7295242 7396644 7497556 7598787 7701266 7804839 7908465 8011122 8111978 8210067 8304814
48833 8304814 8396841 8487318 8576212 8661935 8743074 8819714 8892457 8960735 9022916 9077973 9126406
48822 9126406 9169386 9207347 9239662 9265527 9284874 9298151 9305203 9304877 9296149 9279482 9256493 9228352
48810 9228352 9194974 9155816 9110802 9060242 9004358 8943208 8876834 8805387 8729391 8649854 8567668
48799 8567668 8482949 8395533 8305986 8215270 8123425 8029674 7934148 7838245 7742768 7647067 7551154
48788 7551154 7457442 7368745 7285129 7204434 7125633 7050006 6978842 6911666 6847382 6785965 6728293
48777 6728293 6675188 6627287 6585049 6548160 6515499 6486309 6460859 6439540 6422041 6408171 6398764
48766 6398764 6394728 6395436 6399122 6405040 6414454 6429096 6449012 6472196 6496217 6520187 6545263 6573343
48754 6573343 6605258 6640329 6677607 6717052 6759222 6804187 6851365 6900311 6951098 7003661 7057152
48743 7057152 7110283 7162375 7213875 7265755 7318468 7371675 7425097 7479352 7535442 7593378 7651729
48732 7651729 7708824 7764078 7818022 7871409 7924737 7978280 8031944 8085029 8136668 8186722 8235988
48721 8235988 8285309 8334721 8383668 8431822 8479255 8525727 8570238 8611680 8649865 8685424 8718519
48710 8718519 8748043 8772408 8790749 8802880 8808321 8806181 8796121 8778852 8755378 8726128 8690995 8649759
48698 8649759 8602099 8547662 8486496 8419186 8346322 8268205 8185327 8098653 8008975 7916440 7821233
48687 7821233 7724289 7626551 7527804 7427272 7325504 7224874 7127875 7035440 6947217 6862920 6782990
48676 6782990 6708290 6639689 6577799 6522627 6473392 6428927 6388577 6352861 6323223 6300792 6285124
48665 6285124 6274285 6266442 6261201 6259204 6260773 6265501 6272968 6283031 6295366 6309518 6325564 6343939
48653 6343939 6364156 6384636 6404645 6425726 6450076 6477666 6505982 6532654 6557297 6580558 6602543
48642 6602543 6623070 6642709 6662378 6682024 6700793 6718760 6737723 6759783 6785655 6814832 6846868
48631 6846868 6881633 6918453 6955983 6993552 7032270 7074377 7121522 7173785 7230080 7289244 7351014
48620 7351014 7416366 7486793 7562959 7644069 7728709 7816003 7905758 7997909 8092397 8189154 8287348
48609 8287348 8384807 8479240 8570182 8658698 8744739 8825860 8899281 8964271 9021401 9070220 9109157
48598 9109157 9137491 9155827 9164262 9161378 9145800 9117895 9079128 9030346 8971463 8902410 8823682 8736157
48586 8736157 8641029 8539835 8434005 8324350 8211194 8094822 7975624 7854176 7731588 7609363
48576 7609363 7488272 7367697 7246745 7125840 7006533 6889911 6775960 6664394 6555146
48567 6555146 6447860 6341885 6237284 6135165 6036518 5941362 5849487 5761284 5677092 5596227
48557 5596227 5517569 5440898 5366966 5296565 5230303 5168963 5112918 5060946 5010614 4960399 4910955
48546 4910955 4863895 4819795 4777798 4736816 4696610 4657767 4620850 4585518 4550494 4514653 4478252
48535 4478252 4442809 4409725 4379360 4351266 4324618 4298266 4271262 4243971 4218103 4194972 4174160
48524 4174160 4154532 4136098 4119902 4106341 4094704 4084508 4076200 4070079 4065336 4060861 4056553 4053268
48512 4053268 4051736 4051946 4053314 4055058 4056717 4058777 4062646 4069609 4079843 4092601 4106919 4121698 4135651
48499 4135651 4148081 4159727 4172098 4185754 4199731 4212737 4224382 4235159 4245878 4257327 4269805
48488 4269805 4282574 4294442 4305280 4316332 4328402 4340446 4350913 4360035 4369567 4380390 4391586 4402232
48476 4402232 4412880 4424569 4437208 4449872 4462316 4475240 4489127 4503557 4517746 4531231 4543814
48465 4543814 4555290 4565590 4575186 4585097 4596293 4608899 4622118 4635171 4648115 4661319 4674336 4686342
48453 4686342 4697943 4711433 4728301 4747187 4765449 4782366 4799569 4818570 4839351 4861684 4886361
48442 4886361 4914275 4945228 4978566 5014350 5053031 5094495 5138277 5184358 5232947 5283861 5336855
48431 5336855 5392280 5450450 5510553 5571245 5632323 5694673 5758326 5821736 5883537 5944032 6003961
48420 6003961 6062489 6117557 6167934 6213833 6255440 6291990 6322712 6347860 6368115 6383479 6393479
48409 6393479 6398183 6398227 6393885 6384801 6370806 6352422 6330318 6304776 6276018 6244442 6210093 6172398
48397 6172398 6131210 6087765 6043714 5999196 5952760 5903317 5851200 5796855 5739534 5678322 5613923
48386 5613923 5548185 5481895 5414139 5344214 5273327 5203720 5136571 5071380 5007130 4943388 4880354
48375 4880354 4818534 4758675 4701578 4647529 4596086 4546776 4499908 4456306 4416263 4379265 4344985
48364 4344985 4314058 4287350 4264601 4244382 4225497 4208058 4193054 4181217 4172477 4166149 4161386 4157713
48352 4157713 4155427 4155334 4157829 4162402 4168205 4174939 4182835 4191953 4201959 4212624 4224171 4236888 4250728
48339 4250728 4265582 4281780 4299787 4319145 4338185 4355465 4371512 4388330 4406805 4425328 4441861
48328 4441861 4456836 4472721 4490780 4509654 4527600 4544653 4561470 4577149 4589874 4599469 4607811 4616463
48316 4616463 4625024 4632134 4637102 4639966 4640839 4640022 4638408 4637047 4636366 4636226 4636559 4637505 4638952 4640431 4641704
48301 4641704 4643201 4645563 4648773 4652167 4655554 4659955 4666592 4675139 4683798 4691482 4699328 4709462 4722760
48288 4722760 4738414 4755237 4772554 4790154 4808328 4827944 4849536 4872228 4894232 4914463 4932991
48277 4932991 4950160 4966311 4982416 4999682 5018040 5036019 5052595 5068173 5083263 5097358 5109954
48266 5109954 5121715 5133585 5145437 5156577 5166887 5176436 5184637 5190999 5196166 5200867 5204295 5204971 5203012
48253 5203012 5199887 5195845 5189368 5179791 5168957 5159314 5151360 5144001 5136571 5129352 5122515 5115656 5108343 5100624
48239 5100624 5093071 5086675 5082325 5079932 5078426 5077061 5076373 5077458 5080878 5086824 5095627 5107076 5119752 5132281
48225 5132281 5145295 5160983 5180403 5202189 5224334 5246255 5268296 5289831 5308857 5323565 5333794
48214 5333794 5340826 5345963 5349299 5349686 5345859 5337503 5325068 5308665 5287659 5261370 5229663 5192629 5150320
48201 5150320 5103262 5052708 4999704 4944271 4886188 4826289 4766042 4705815 4644500 4581324 4517353
48190 4517353 4454623 4394034 4334614 4274614 4212958 4149856 4086550 4024620 3965137 3908127 3852829
48179 3852829 3798624 3745828 3695603 3648911 3605373 3563289 3521041 3478544 3437235 3398642 3362983
48168 3362983 3328895 3294313 3257890 3220039 3182447 3146250 3110968 3075712 3040879 3007595 2975661
48157 2975661 2943427 2910052 2876581 2844133 2812336 2780586 2749732 2720904 2693272 2664605 2634095
48146 2634095 2603240 2573746 2545678 2517929 2489521 2460118 2430127 2400594 2372317 2344932 2317634
48135 2317634 2290794 2265725 2242719 2220530 2198267 2176615 2156438 2137212 2117843 2098280 2079424
48124 2079424 2062052 2046649 2033708 2023313 2014841 2007840 2002637 1999240 1996322 1992477 1988102 1984901 1983726
48111 1983726 1984083 1985564 1988425 1992553 1997093 2001583 2006558 2012622 2019610 2027014 2034453 2041503 2047901 2054435
48097 2054435 2062782 2073730 2086057 2097884 2108793 2120015 2132724 2146746 2160883 2174059 2186146
48086 2186146 2197875 2209922 2222070 2233563 2244367 2255494 2267746 2280544 2292534 2303090 2312739
48075 2312739 2322295 2332164 2342490 2353426 2364967 2376716 2387986 2398252 2407637 2417082 2427791 2440140
48063 2440140 2453189 2465591 2477003 2488393 2500954 2515002 2529972 2545208 2560510 2576024 2591929
48052 2591929 2608373 2625650 2644134 2663712 2683311 2701429 2717447 2732303 2747514 2763632 2780083
48041 2780083 2796482 2813525 2832229 2852722 2874361 2896944 2921234 2948140 2977839 3010018 3044610
48030 3044610 3081924 3122188 3165368 3211411 3260462 3312888 3369373 3430842 3497880 3570338 3647968
48019 3647968 3731351 3821075 3914867 4005254 4080815 4130979 4151181 4144734 4120153 4086202 4048544
48008 4048544 4010006 3972584 3938130 3907365 3879560 3853831 3830190 3809056 3790504 3774546 3761475
47997 3761475 3751240 3742923 3735491 3728625 3722182 3715474 3707962 3700168 3692828 3685413 3676579 3665941 3654238
47984 3654238 3641767 3627938 3612582 3596435 3579871 3562324 3543475 3523873 3503632 3481559 3456618
47973 3456618 3429360 3400848 3370821 3338235 3303217 3267177 3231036 3194505 3157277 3119837 3082664
47962 3082664 3045389 3007180 2967468 2926067 2883048 2838887 2794284 2749583 2704726 2659956 2616069
47951 2616069 2573656 2532507 2492074 2452133 2412522 2372672 2332148 2291601 2252549 2216037 2181949
47940 2181949 2149744 2119256 2090303 2062038 2033598 2005461 1979413 1956694 1936574 1917321 1898293
47929 1898293 1880455 1864792 1850885 1837358 1823353 1809128 1795390 1782540 1770644 1759890 1750745
47918 1750745 1743480 1737484 1731314 1723828 1715410 1707710 1701967 1697657 1693024 1686796 1679255 1671754 1665476 1660605
47904 1660605 1656431 1652045 1646880 1640673 1633197 1624346 1614517 1604575 1595186 1586340 1577714 1569368 1561839 1555500
47890 1555500 1550072 1544890 1539488 1533705 1527201 1519324 1509904 1500008 1491208 1483779 1476236 1467248 1457511 1448954
47876 1448954 1442343 1436677 1430985 1425573 1421101 1417512 1414722 1413564 1414840 1417761 1420522 1422576 1425388 1430461
47862 1430461 1437319 1444051 1449552 1454607 1460819 1468923 1478229 1487311 1494962 1500765 1505299 1509853 1515478 1521984
47848 1521984 1528088 1532653 1535334 1535781 1532991 1526503 1517866 1509731 1503281 1497512 1491213 1484393 1477176 1468587
47834 1468587 1457748 1445613 1434247 1424618 1416140 1408153 1400639 1393432 1385854 1377655 1369532 1362403 1356706
47821 1356706 1352765 1351165 1352288 1355740 1360564 1365714 1370214 1373352 1375127 1376247 1377476 1379158 1381496 1384882
47807 1384882 1389605 1395440 1401773 1408034 1413953 1419625 1425507 1431971 1438623 1444302 1448158 1450613 1452862 1455399
47793 1455399 1457324 1457245 1454616 1449927 1443711 1435858 1426210 1415424 1404605 1393997 1382691 1369985 1356513
47780 1356513 1343495 1331201 1318697 1305069 1290398 1275679 1262174 1250743 1241328 1233158 1225779 1219594
47768 1219594 1214947 1211122 1207122 1203268 1200926 1200516 1200841 1200834 1200909 1201841 1203089 1203375 1202718 1202817 1205191 1209554 1214303
47751 1214303 1218272 1221593 1224964 1228438 1231288 1233014 1233968 1234572 1234351 1232538 1229638 1227508 1227451 1228855 1230028
47736 1230028 1229846 1228112 1224987 1220954 1217058 1214377 1213125 1212748 1212866 1213712 1215654 1218803 1223166 1228811 1235726
47721 1235726 1243716 1252519 1261951 1272031 1283145 1296045 1311456 1329544 1349687 1370659 1391286 1411447
47709 1411447 1432393 1455433 1480064 1504138 1526314 1547598 1569651 1592302 1613915 1633931 1653622
47698 1653622 1673993 1693975 1711337 1724740 1734426 1741408 1746558 1750110 1751684 1750988 1748599 1745596 1742255
47685 1742255 1737714 1731264 1723330 1714696 1705510 1695715 1685909 1676725 1667646 1657531 1646400 1635821 1627398
47672 1627398 1621597 1618110 1616343 1615145 1613074 1609790 1606691 1605394 1605987 1607466 1609529 1612987 1618504 1625795
47658 1625795 1634302 1643992 1655284 1668631 1684233 1701546 1718980 1734794 1748710 1762090 1776159 1790571
47646 1790571 1804167 1816412 1827333 1836531 1843304 1847825 1851325 1854827 1858087 1859895 1858963 1854491 1846398
47633 1846398 1835288 1821940 1806741 1789814 1771553 1752506 1732793 1712311 1691613 1671869 1653745
47622 1653745 1636999 1621565 1608248 1597620 1588803 1580284 1571764 1564479 1559730 1557872 1558743 1562217 1567924
47609 1567924 1575025 1582906 1591990 1603435 1617854 1634506 1651870 1669046 1686412 1704644 1723224 1740462
47597 1740462 1755238 1768236 1780920 1793614 1805213 1814473 1820793 1823814 1823326 1819955 1815177 1810039 1804310
47584 1804310 1797376 1789439 1781155 1772391 1762065 1749155 1733405 1715289 1696030 1677605 1661832 1649031
47572 1649031 1638011 1627668 1618246 1610810 1605915 1603131 1601547 1600345 1599173 1598401 1598852 1600892 1603842 1606599
47558 1606599 1608721 1610525 1612199 1613275 1612991 1610814 1606566 1600350 1592472 1583160 1572239 1559343 1544487
47545 1544487 1528220 1511200 1493943 1476914 1460384 1443984 1426854 1408566 1389698 1371311 1354058
47534 1354058 1337798 1321658 1304426 1285584 1266320 1248804 1233741 1219240 1202949 1185006 1167748
47523 1167748 1152525 1137959 1121878 1104012 1086023 1069339 1053896 1038924 1024172 1009946 996291
47512 996291 982675 968660 954643 941580 930009 919744 910655 903274 898155 894966 892772 890963 889309
47499 889309 887323 884504 881382 879529 880099 882867 886986 892080 898175 905106 912586 920529 928735 936485
47485 936485 942930 947858 951849 955872 960912 967402 974414 979764 981677 980375 977573 974531 971179 967066
47471 967066 962319 957303 951921 945709 938456 930338 921605 912463 903150 893725 883724 872417 859753
47458 859753 846921 835553 826356 818762 811946 805579 799325 792243 783616 774192 765696 758898 752855 746370
47444 746370 739479 733016 727349 722311 718072 715334 714590 715549 717318 718952 719982 720648 721589 723268 725886
47429 725886 729692 734751 740333 745250 749148 752820 756826 760625 763634 766249 768849 770595 770489 769109
47415 769109 767876 766742 764205 759805 755138 751750 749252 746324 742661 738972 735705 732739 730038 727819
47401 727819 726221 725316 725275 726102 727422 728980 730967 733442 735804 737485 738944 741283 744828 748624 751449
47386 751449 752995 754128 756318 760585 766391 771581 774164 774477 774981 777539 781507 785152 788396 793003 799974
47371 799974 807930 814750 820036 825078 830827 837081 843654 851243 860718 872305 885899 901412 918237
47358 918237 935042 950943 966546 983141 1001226 1020452 1040658 1062037 1084330 1106630 1128068
47347 1128068 1148269 1167249 1185356 1203100 1220489 1236859 1251902 1266267 1280151 1291768 1298618
47336 1298618 1300268 1298564 1295027 1289493 1281657 1272408 1262743 1252540 1241256 1228881 1215485 1200945 1186087
47323 1186087 1172939 1162494 1153008 1142090 1130013 1119478 1112170 1106961 1101708 1095714 1090004 1085996 1084228
47310 1084228 1083919 1083632 1082765 1082270 1083357 1085827 1088458 1090857 1093954 1098500 1103966 1109141 1113145 1115644 1116762
47295 1116762 1117104 1117267 1117033 1115501 1112297 1108155 1104049 1100063 1095350 1088884 1080195 1069683 1058255 1046319
47281 1046319 1033273 1018417 1002224 986139 971261 957850 945874 934973 923916 911316 897340
47270 897340 883721 871602 860383 849284 838790 829452 820267 809854 798803 789275 782183 776248
47258 776248 770268 764993 761808 760391 758735 755388 750929 747210 745615 746131 747699 749257 750533 751966
47244 751966 753973 756431 758945 761389 763931 766546 768729 769803 769475 768058 766161 764212 762281 760333
47230 760333 758526 757114 756041 754887 753438 752272 752491 754701 758409 762522 766333 769829 773219 776542
47216 776542 779820 783241 787011 791225 796123 802274 810126 819363 828948 837952 846241 854293 862517 871003
47202 871003 879979 890179 902249 915642 928619 939882 949963 960382 971557 982267 991262 998566
47190 998566 1004911 1010731 1016344 1022248 1028343 1033323 1035836 1035977 1034808 1032733 1029425 1025146 1020801 1016509
47176 1016509 1011412 1005321 999445 994735 990425 985157 978890 972782 967544 962851 958310 954158 950834 948316
47162 948316 946180 944222 942949 943277 945455 948458 950997 953195 956560 962086 969212 976951 985064 993475
47148 993475 1001605 1009479 1018768 1031158 1045854 1060038 1071896 1082024 1091682 1100982 1109334 1116583 1122869
47135 1122869 1128063 1132196 1135966 1140055 1144092 1146818 1147198 1145098 1141126 1136178 1130896 1125217 1118635 1111063
47121 1111063 1103171 1095714 1089043 1083590 1080215 1079395 1080414 1082159 1084569 1088601 1094765 1102479 1111014 1120325
47107 1120325 1130516 1141207 1152219 1164662 1180467 1200511 1223622 1247711 1271545 1295071 1318341
47096 1318341 1340883 1362333 1383088 1403748 1424195 1443768 1462244 1479958 1496804 1511840 1524251
47085 1524251 1534286 1542642 1549275 1553500 1555196 1555232 1554446 1552685 1549186 1543659 1536640 1528959 1521188 1513599
47071 1513599 1506357 1499574 1493367 1487944 1483496 1479773 1475908 1471043 1465331 1460066 1456488 1454569 1453297 1452026
47057 1452026 1451071 1450888 1451298 1452000 1453408 1456288 1460596 1465332 1469728 1474051 1478815 1483667 1487692 1490681 1493254
47042 1493254 1495277 1494797 1489485 1479258 1466792 1455039 1444748 1434805 1424312 1413264 1401343 1387379
47030 1387379 1370685 1352239 1333803 1316256 1299423 1283140 1267708 1253375 1240005 1227275 1214794
47019 1214794 1202259 1190026 1179278 1170786 1163583 1155747 1146598 1137332 1129319 1122834 1117851 1115006 1114846
47006 1114846 1116833 1119947 1123829 1128417 1132942 1136463 1139299 1142926 1148268 1154951 1162372 1170558 1179545 1188711
46992 1188711 1197293 1205056 1211900 1217274 1220781 1223298 1226719 1232228 1238939 1244612 1247888 1249731 1252442 1257234
46978 1257234 1263232 1269095 1274967 1281962 1290206 1298605 1306721 1315594 1326065 1337262 1347654 1356889 1365718
46965 1365718 1374681 1383934 1393925 1405086 1416963 1428748 1440608 1453285 1466257 1477687 1486865 1495685
46953 1495685 1506806 1521000 1537090 1553745 1570303 1586233 1601036 1614818 1628153 1641188 1653549
46942 1653549 1665124 1676192 1686556 1695336 1702086 1707534 1712670 1717428 1720807 1722096 1721472 1719492 1716545
46929 1716545 1712935 1709119 1705634 1702879 1701103 1700440 1700837 1701993 1703508 1705147 1706982 1709186 1711623 1713743
46915 1713743 1715105 1716086 1717835 1721410 1727104 1734688 1743837 1753971 1764079 1773461 1782765 1793654 1807128
46902 1807128 1822523 1838328 1853578 1868252 1882800 1897810 1913676 1929940 1945221 1958489 1970369
46891 1970369 1982425 1995070 2007017 2017097 2025798 2034325 2042733 2049891 2055167 2059196 2062781 2065746 2067321
46878 2067321 2067245 2065998 2064106 2061714 2058850 2055778 2052934 2050691 2049298 2048937 2049696 2051537 2054351 2057943 2061828
46863 2061828 2065266 2067947 2070779 2075477 2082907 2092065 2101216 2109954 2119511 2130900 2143438 2155532 2166437
46850 2166437 2176685 2187084 2198007 2209504 2221414 2233114 2243688 2252603 2259966 2266026 2270774 2274173
46838 2274173 2276225 2276377 2273181 2265270 2252872 2238042 2223172 2209396 2196629 2184856 2174837 2167223
46826 2167223 2161403 2155906 2150103 2145043 2142373 2142940 2146834 2154129 2164623 2177148 2190336 2204399 2221077
46813 2221077 2241213 2263282 2285288 2307328 2330933 2356012 2379957 2400350 2417441 2433162 2448521
46802 2448521 2463069 2476557 2489809 2503589 2517471 2530340 2541503 2550921 2558939 2566426 2574740 2584699
46790 2584699 2595582 2605983 2615796 2626665 2640154 2656106 2673313 2691081 2709372 2727741 2745103
46779 2745103 2760676 2774522 2787088 2798819 2810281 2821822 2832744 2841448 2846914 2849592 2850421 2849527 2846531
46766 2846531 2841771 2836341 2830994 2825735 2820582 2815992 2812232 2808870 2805294 2801491 2798017 2795517 2794597 2795932
46752 2795932 2800104 2807261 2817134 2829299 2843299 2858637 2874934 2892131 2910366 2929680 2949931 2970959
46740 2970959 2992654 3014861 3037272 3059375 3080401 3099520 3116305 3130932 3143597 3153809 3160619
46729 3160619 3163666 3163503 3160713 3155084 3146138 3134188 3120355 3105635 3090460 3075104 3059889 3044808
46717 3044808 3029399 3013290 2996584 2979561 2962557 2946359 2932154 2920464 2910293 2899849 2888041
46706 2888041 2875137 2862295 2850838 2841558 2834109 2827246 2820250 2813862 2809188 2805970 2802786 2798849 2794684
46693 2794684 2791035 2788199 2786775 2787832 2791620 2796869 2802207 2807724 2814418 2822722 2832536 2844256 2858647
46680 2858647 2875612 2893834 2911762 2928456 2943664 2957814 2971936 2986914 3002646 3018329 3033424
46669 3033424 3047705 3060623 3071631 3081307 3091065 3101228 3110220 3116461 3120520 3124521 3129683 3135308 3140219
46656 3140219 3144454 3149218 3155549 3163402 3171899 3180164 3187881 3195211 3202426 3209696 3217090 3224491 3231583 3238166
46642 3238166 3244556 3251264 3258078 3263733 3266747 3266452 3262948 3256274 3246106 3232308 3215305 3195627 3173371
46629 3173371 3148550 3121850 3094402 3066468 3036801 3004020 2968587 2932651 2897663 2862800 2826379
46618 2826379 2788385 2750752 2715233 2681862 2649727 2618501 2588602 2560184 2532606 2504962 2476965
46607 2476965 2449303 2423205 2399501 2378010 2357971 2339037 2321575 2306009 2292340 2280438 2270262
46596 2270262 2261497 2253493 2246248 2241050 2239449 2241644 2246622 2253865 2263985 2277264 2292429 2307756 2322966
46583 2322966 2339178 2357070 2375953 2394750 2412946 2430153 2445672 2459272 2471825 2484109 2495265
46572 2495265 2503490 2508214 2510549 2511461 2510852 2508969 2507487 2508128 2510972 2515209 2520856 2528517 2537907 2548075
46558 2548075 2559075 2572061 2587605 2605151 2624469 2646348 2671273 2698411 2726485 2754642 2781879
46547 2781879 2806715 2828396 2847553 2864604 2878226 2886543 2889253 2887345 2881194 2870341 2855072 2836788
46535 2836788 2816427 2793582 2767558 2738482 2707034 2673919 2640001 2606293 2573361 2541352 2510880
46524 2510880 2483140 2458651 2436465 2415122 2393806 2372142 2349736 2326936 2305504 2287188 2271494
46513 2271494 2255921 2238757 2220683 2203033 2185324 2165717 2143822 2121836 2102450 2086388 2072713
46502 2072713 2060865 2051110 2042972 2034646 2024843 2014523 2005853 1999834 1995836 1993071 1991238 1989779 1987889
46489 1987889 1985822 1985039 1986264 1988390 1990260 1992620 1996941 2002850 2008475 2013338 2019192 2027314 2036522 2044988
46475 2044988 2052973 2062308 2073822 2086869 2101243 2117757 2136366 2155128 2172156 2187717 2203288 2219092
46463 2219092 2234024 2248030 2263213 2281896 2304391 2329452 2356373 2385615 2417294 2449875 2481108
46452 2481108 2510211 2538723 2568927 2601588 2635558 2669461 2703127 2736974 2770630 2803039 2833703
46441 2833703 2862811 2889896 2913422 2932433 2947979 2962082 2975585 2987764 2997793 3005714 3011910 3016373
46429 3016373 3018781 3018801 3016211 3011214 3004799 2998282 2992110 2985433 2977132 2966958 2955433 2943036 2929986
46416 2929986 2916592 2903121 2889087 2873038 2853504 2830216 2804281 2777113 2749271 2720324 2689596
46405 2689596 2656832 2622322 2586789 2551143 2515800 2480082 2442813 2403895 2364808 2326933 2289890
$$ [...]
##END NTUPLES=NMR SPECTRUM
##END=
