##TITLE=coffee_type CCIN01
COFFEE_meoh_noesyp64 COFFEE_meoh {C:\Bruker\TOPSPIN} Administrator 3
##JCAMPDX= 6.0         $$ Bruker NMR JCAMP-DX V2.0
##DATA TYPE= NMR SPECTRUM
##DATA CLASS= NTUPLES
##ORIGIN= Bruker BioSpin GmbH
##OWNER= Administrator
$$ 1.72 TOPSPIN		Version 2.1
$$ 2012-05-18 15:50:50.776 -0700  Administrator@X
$$ Compression mode = diff/dup
##.OBSERVE FREQUENCY= 400.13188235
##.OBSERVE NUCLEUS= ^1H
##.ACQUISITION MODE= SIMULTANEOUS (DQD)
##.ACQUISITION SCHEME= undefined
##.AVERAGES= 64
##.DIGITISER RES= 22
##SPECTROMETER/DATA SYSTEM= spect
##.PULSE SEQUENCE= noesygpps1d.comp
##.SOLVENT NAME= COFFEE_meoh
##.SHIFT REFERENCE= INTERNAL, COFFEE_meoh, 1, 14.98061
##AUDIT TRAIL= $$ (NUMBER, WHEN, WHO, WHERE, PROCESS, VERSION, WHAT)
$$ ##TITLE= Audit trail, TOPSPIN		Version 2.1
$$ ##JCAMPDX= 5.01
$$ ##ORIGIN= Bruker BioSpin GmbH
$$ ##OWNER= Administrator
$$ $$ C:\Bruker\TOPSPIN/data/Administrator/nmr/12-COFFEE-2502/132/pdata/1/auditp.txt
$$ ##AUDIT TRAIL=  $$ (NUMBER, WHEN, WHO, WHERE, PROCESS, VERSION, WHAT)
(   1,<2012-02-25 18:12:57.781 -0500>,<Administrator>,<TOPSPIN>,<go>,<TOPSPIN 2.1>,
      <created by zg
	started at 2012-02-25 18:01:27.422 -0500,
	POWCHK enabled, PULCHK disabled,
       configuration hash MD5:
       B0 76 FB 9C 50 81 44 7D 18 B3 26 32 4E 60 AD 96
       data hash MD5: 64K
       7E 63 AE E8 32 C7 51 B3 3D 75 40 12 A5 FD C0 FB>)
(   2,<2012-02-25 18:13:00.719 -0500>,<Administrator>,<TOPSPIN>,<proc1d>,<TOPSPIN 2.1>,
      <Start of raw data processing
       efp LB = 0.3 FT_mod = 6 PKNL = 1 PHC0 = 0 PHC1 = 0 SI = 128K 
       data hash MD5: 128K
       BC B4 47 C0 93 26 21 5D 07 51 49 88 34 0A CB 22>)
(   3,<2012-02-25 18:13:02.078 -0500>,<Administrator>,<TOPSPIN>,<proc1d>,<TOPSPIN 2.1>,
      <pk PHC0 = 22.28577 PHC1 = 0 
       data hash MD5: 128K
       0E 76 07 AE E8 4F F5 28 EE C1 DA 03 71 B4 26 6B>)
(   4,<2012-02-25 18:13:02.422 -0500>,<Administrator>,<TOPSPIN>,<proc1d>,<TOPSPIN 2.1>,
      <abs ABSG = 1 
       data hash MD5: 128K
       49 BA B9 95 9A 8C 97 D6 AD C7 4A 20 61 94 61 87>)
(   5,<2012-02-25 18:13:02.500 -0500>,<Administrator>,<TOPSPIN>,<proc1d>,<TOPSPIN 2.1>,
      <abs ABSG = 2 
       data hash MD5: 128K
       70 D9 12 00 4A 4B 6E A7 C0 51 C0 31 C5 95 4D 82>)
(   6,<2012-02-25 18:13:02.578 -0500>,<Administrator>,<TOPSPIN>,<proc1d>,<TOPSPIN 2.1>,
      <abs ABSG = 3 
       data hash MD5: 128K
       04 6B 1E 38 E7 19 C3 31 2C A9 2B 6A C8 AD EF AE>)
(   7,<2012-02-25 18:13:02.641 -0500>,<Administrator>,<TOPSPIN>,<proc1d>,<TOPSPIN 2.1>,
      <abs ABSG = 4 
       data hash MD5: 128K
       84 38 3F 7A 4F CF BD 27 C7 59 50 38 FE ED 12 EA>)
(   8,<2012-02-25 18:13:02.703 -0500>,<Administrator>,<TOPSPIN>,<proc1d>,<TOPSPIN 2.1>,
      <abs ABSG = 5 
       data hash MD5: 128K
       96 89 79 4A 67 BC 13 3F B5 5E E3 42 44 17 BA B6>)
(   9,<2012-02-25 18:13:02.844 -0500>,<Administrator>,<TOPSPIN>,<audit>,<TOPSPIN 2.1>,
      <user comment:
       ICON-NMR User ID: Administrator
$$ [...]
150 150 150 150 150 150 150 150
##$TP07= 0
##$TPNAME0= <>
##$TPNAME1= <>
##$TPNAME2= <>
##$TPNAME3= <>
##$TPNAME4= <>
##$TPNAME5= <>
##$TPNAME6= <>
##$TPNAME7= <>
##$TPOAL= (0..7)
0.5 0.5 0.5 0.5 0.5 0.5 0.5 0.5
##$TPOFFS= (0..7)
0 0 0 0 0 0 0 0
##$TUNHIN= 0
##$TUNHOUT= 0
##$TUNXOUT= 0
##$USERA1= <user>
##$USERA2= <user>
##$USERA3= <user>
##$USERA4= <user>
##$USERA5= <user>
##$V9= 5
##$VALIST= <valist>
##$VCLIST= <CCCCCCCCCCCCCCC>
##$VD= 0
##$VDLIST= <DDDDDDDDDDDDDDD>
##$VPLIST= <PPPPPPPPPPPPPPP>
##$VTLIST= <TTTTTTTTTTTTTTT>
##$WBST= 1024
##$WBSW= 4
##$XGAIN= (0..3)
0 0 0 0
##$XL= 0
##$YL= 0
##$YMAX_a= 13640934
##$YMIN_a= -6352395
##$ZGOPTNS= <>
##$ZL1= 120
##$ZL2= 120
##$ZL3= 120
##$ZL4= 120
##$ABSF1= 14.98061
##$ABSF2= -5.57192
##$ABSG= 5
##$ABSL= 3
##$ALPHA= 0
##$AQORDER= 0
##$ASSFAC= 0
##$ASSFACI= 0
##$ASSFACX= 0
##$ASSWID= 0
##$AUNMP= <proc_prof1d_extract>
##$AXLEFT= 0
##$AXNAME= <>
##$AXNUC= <1H>
##$AXRIGHT= 0
##$AXTYPE= 0
##$AXUNIT= <>
##$AZFE= 0.1
##$AZFW= 0.1
##$BCFW= 0
##$BC_mod= 0
##$BYTORDP= 0
##$COROFFS= 0
##$CY= 15
##$DATMOD= 1
##$DC= 0
##$DFILT= <>
##$DTYPP= 0
##$F1P= 0
##$F2P= 0
##$FCOR= 0.5
##$FTSIZE= 131072
##$FT_mod= 6
##$GAMMA= 0
##$GB= 0
##$INTBC= 1
##$INTSCL= 1
##$ISEN= 128
##$LB= 0.3
##$LEV0= 0
##$LPBIN= 0
##$MAXI= 10000
##$MC2= 0
##$MEAN= 0
##$ME_mod= 0
##$MI= 0
##$NCOEF= 0
##$NC_proc= -3
##$NLEV= 6
##$NOISF1= 0
##$NOISF2= 0
##$NSP= 0
##$NTH_PI= 0
##$NZP= 0
##$OFFSET= 14.98061
##$PC= 1
##$PHC0= 22.28577
##$PHC1= 0
##$PH_mod= 1
##$PKNL= yes
##$PPARMOD= 0
##$PPDIAG= 0
##$PPIPTYP= 0
##$PPMPNUM= 2147483647
##$PPRESOL= 1
##$PSCAL= 4
##$PSIGN= 0
##$PYNMP= <proc.py>
##$REVERSE= no
##$SF= 400.13
##$SI= 131072
##$SIGF1= 0
##$SIGF2= 0
##$SINO= 400
##$SIOLD= 131072
##$SPECTYP= <>
##$SREGLST= <1H.CDCl3>
##$SSB= 0
##$STSI= 131072
##$STSR= 0
##$SW_p= 8223.68421052632
##$SYMM= 0
##$S_DEV= 0
##$TDeff= 65536
##$TDoff= 0
##$TI= <>
##$TILT= no
##$TM1= 0
##$TM2= 0
##$TOPLEV= 0
##$USERP1= <user>
##$USERP2= <user>
##$USERP3= <user>
##$USERP4= <user>
##$USERP5= <user>
##$WDW= 1
##$XDIM= 131072
##$YMAX_p= 493720931
##$YMIN_p= -199413337
##$CURPLOT= <Network HP LaserJet P1505>
##$CURPRIN= <$Network HP LaserJet P1505>
##$DFORMAT= <normdp>
##$LAYOUT= <+/1D_H.xwp>
##$LFORMAT= <normlp>
##$PFORMAT= <normpl>
##$SURQMSG= 1
$$ End of Bruker specific parameters
$$ ---------------------------------
##NTUPLES= NMR SPECTRUM
##VAR_NAME=  FREQUENCY,     SPECTRUM/REAL,   SPECTRUM/IMAG
##SYMBOL=    X,             R,               I
##VAR_TYPE=  INDEPENDENT,   DEPENDENT,       DEPENDENT
##VAR_FORM=  AFFN,          ASDF,            ASDF
##VAR_DIM=   131072,        131072,          131072
##UNITS=     HZ,            ARBITRARY UNITS, ARBITRARY UNITS
##FACTOR=    0.0627417313425165, 1,          1
##FIRST=     8223.62146879498, -786,         -91686
##LAST=      0,             3680,            -92025
##MIN=       0,             -199413337,      0
##MAX=       8223.62146879498, 493720931,    0
$$ Real data points
##PAGE= N=1
##DATA TABLE= (X++(R..R)), XYDATA
$$ [...]
62976C041599O5217O0898N7863N6595N5763N4494N3253N1947M8946M2991L4793
62965C624359K5740J6070N233o908k0139l4120m7729n9196o7807p4503p9989q3328
62953C197683q3503q1248p7992p3851o8021o0536n2319m3882l5246k6824j9277
62942B574984j2728o852j456L745R317J5352K1028K5608K9120L1418L1746L0271
62930B751553K8910K9181L0073K9478K7031K4034K1303J8703J6231J3717R797
62919C000011K942o374j6036k4884l3509m2534n1504n9706o6851p2778p7390q0889
62907B470498q3211q3614q1793p8887p6104p3012o8667o3780n9880n6734n2793
62896A692023m8034m4213m2001m0020l7244l4230l1357k7856k3641k0226j8641
$$ y = [3041599, 3106816, 3167714, 3225577, 3282172, 3337935, 3392429, 3445682, 3497629, 3546575, 3589566, 3624359, 3650099, 3666169, 3671402, 3664494, 3644355, 3610235, 3562506, 3503310, 3435503, 3361000, 3281011, 3197683, 3114180, 3032932, 2954940, 2881089, 2813068, 2752532, 2700213, 2656331, 2621085, 2594261, 2574984, 2562256, 2555404, 2553948, 2557693, 2567010, 2582362, 2603390, 2628998, 2658118, 2689536, 2721282, 2751553, 2780463, 2809644, 2839717, 2869195, 2896226, 2920260, 2941563, 2960266, 2976497, 2990214, 3000011, 3002953, 2996579, 2980543, 2955659, 2922150, 2879616, 2828112, 2768406, 2701555, 2628777, 2551387, 2470498, 2387287, 2303673, 2221880, 2142993, 2066889, 1993877, 1925210, 1861430, 1801550, 1744816, 1692023, 1643989, 1599776, 1557775, 1517755, 1480511, 1446281, 1414924, 1387068, 1363427, 1343201, 1324560]
62885A324560j7950j6953j5922j5432j4812j3178j1076r770r575r919j0376j0678
62873A168919j0384r527q976r397j0350j1120j1719j2420j2965j3029j2808j2415
62861A033809j1420r665p936p046o848o789o815p013p019o502n734m988m064l006
62847I38964k566l116l852l904l574l592l772l450k727k182j814j237o55n63p23
62832I01237m38K26M54n7p72j241j515j578j222p61j041k243l237k732r57K98
62816H84421m70k715m208l296o09J754K543K355K410K984L253K222l59l600n887
62801H80798o275n547n185n241m302j871L73N66r64k416k958l288l961m403l832
62786H31494k409j144r08j721k780l217k917k399j962j467j075j409k521l365
$$ y = [1324560, 1306610, 1289657, 1273735, 1258303, 1243491, 1230313, 1219237, 1209467, 1199892, 1189973, 1179597, 1168919, 1158535, 1149008, 1140032, 1130635, 1120285, 1109165, 1097446, 1085026, 1072061, 1059032, 1046224, 1033809, 1022389, 1012724, 1004788, 997742, 990894, 984105, 977290, 970277, 963258, 956756, 951022, 946034, 941970, 938964, 936398, 933282, 929430, 925526, 921952, 918360, 914588, 911138, 908411, 906229, 904415, 903178, 902523, 901960, 901237, 900799, 901025, 901479, 901422, 900650, 899409, 897894, 896316, 895094, 894333, 893292, 891049, 887812, 885080, 884123, 884421, 883951, 881236, 877028, 873732, 873123, 874877, 877420, 879775, 882185, 885169, 888422, 890644, 890285, 886685, 880798, 874523, 868976, 863791, 858550, 854248, 852377, 852750, 853316, 852352, 849936, 846978, 843690, 839729, 835326, 831494, 829085, 827941, 827033, 825312, 822532, 819315, 816398, 813999, 812037, 810570, 809495, 808086, 805565, 802200]
62772H02200k978j729o55p9M35J065J523J661J632J483J237J172J416J501R59
62757H10843K36K79J191K031J994J296P95J195K581M258N191N152N266O656Q666
62742H57630R530R031R325J2270J6716J9707K0076J9631K0619K3150K5813K7888
62730A071386K9871L2195L4657L7178M0109M3462M6802N0273N4725O0199O5319
62719A566176O9139P2624P7122Q2154Q6393R0136R4959J00887J05920J08670J09602
62708B563782J09121J06397J01124R4558Q7370P7827O3920M6267K7347Q615r949
62697C276379k8174m5415o1581p6637q9241r7714j02574j06294j10100j12589
62687B446060j12187j09430j05903j02118r7632r2383q6728q0764p4735o9553
$$ y = [802200, 799222, 797493, 796838, 796759, 797194, 798259, 799782, 801443, 803075, 804558, 805795, 806967, 808383, 809884, 810843, 811079, 811358, 812549, 814580, 816574, 817870, 818665, 819860, 822441, 826699, 831890, 837042, 842308, 848964, 857630, 867160, 876191, 885516, 897786, 914502, 934209, 954285, 973916, 994535, 1017685, 1043498, 1071386, 1101257, 1133452, 1168109, 1205287, 1245396, 1288858, 1335660, 1385933, 1440658, 1500857, 1566176, 1635315, 1707939, 1785061, 1867215, 1953608, 2043744, 2138703, 2239590, 2345510, 2454180, 2563782, 2672903, 2779300, 2880424, 2974982, 3062352, 3140179, 3204099, 3250366, 3277713, 3286328, 3276379, 3248205, 3202790, 3141209, 3064572, 2975331, 2877617, 2775043, 2668749, 2558649, 2446060, 2333873, 2224443, 2118540, 2016422, 1918790, 1826407, 1739679, 1658915, 1584180, 1514627]
62677A514627o5677o1864n6343m9341m3108l9093l6362l3401l0370k8411k7507
62666A043150k6392k4330k1699j8806j5480j2099r627q024n978l102j007q21q51
62653H94934J412N684R379J1340J2865J4881J6519J7380J9002K2558K6743K9644
62641A082341L1542L4135L7796M1393M4478M7931N2339N7189O1942O6785P1835
62630A629706P6367P9298Q0082P8788P5733P1265O5778N9576N2555M3979L3034
62619B346161J9883N927p537k0502l3341m5320n5263o3424p0970p7472q0875q0669
62607A836598p9121p8196p7062p4225p0494o7713o5733o2879n8841n4821n1034
62596A096479m6268m0297l4811l1427l0048k9503k8679k6736k3560k0272j8289
$$ y = [1514627, 1448950, 1387086, 1330743, 1281402, 1238294, 1199201, 1162839, 1129438, 1099068, 1070657, 1043150, 1016758, 992428, 970729, 951923, 936443, 924344, 914717, 906693, 900715, 897613, 896606, 895785, 894934, 896346, 902030, 911409, 922749, 935614, 950495, 967014, 984394, 1003396, 1025954, 1052697, 1082341, 1113883, 1148018, 1185814, 1227207, 1271685, 1319616, 1371955, 1429144, 1491086, 1557871, 1629706, 1706073, 1785371, 1865453, 1944241, 2019974, 2091239, 2157017, 2216593, 2269148, 2313127, 2346161, 2366044, 2371971, 2364434, 2343932, 2310591, 2265271, 2210008, 2146584, 2075614, 1998142, 1917267, 1836598, 1757477, 1679281, 1602219, 1527994, 1457500, 1389787, 1324054, 1261175, 1202334, 1147513, 1096479, 1050211, 1009914, 975103, 943676, 913628, 884125, 855446, 828710, 805150, 784878, 766589]
62585G66589j7667j7303j6621j5799j4483j2024r283q423j0022j1888j1714r775
62573F11587p936p114o947p115p424o961m714j236J372J680M96k51L21J470K160
62558E69388K286K429K912L605M418N380O285O856P369Q467J0095J1349J1769
62545F52608J2113J3306J5245J7235J9018K0693K2146K3373K4889K7116K9710
62534H77452L2186L4783L8037M1919M6075N0238N3714N5303N4828N4097N4976
62523A393608N6846N7131N3993M7513L8770K9117J9963J1868L952m705j3574k1759
62511A672723k9758l8328m6208n1183n3265n4569n5897n5783n3459n0354m7714
62500A136205m4838m0925l6864l3774l1268k8574k6085k4361k2764k0461j7897
$$ y = [766589, 748922, 731619, 714998, 699199, 684716, 672692, 663409, 654986, 644964, 633076, 621362, 611587, 603651, 596537, 589590, 582475, 575051, 568090, 563376, 562140, 563512, 565192, 565688, 565437, 565758, 567228, 569388, 571674, 574103, 577015, 580620, 585038, 590418, 596703, 603559, 610928, 619395, 629490, 640839, 652608, 664721, 678027, 693272, 710507, 729525, 750218, 772364, 795737, 820626, 847742, 877452, 909638, 944421, 982458, 1024377, 1070452, 1120690, 1174404, 1229707, 1284535, 1338632, 1393608, 1450454, 1507585, 1561578, 1609091, 1647861, 1676978, 1696941, 1708809, 1712761, 1708056, 1694482, 1672723, 1642965, 1604637, 1558429, 1507246, 1453981, 1399412, 1343515, 1287732, 1234273, 1183919, 1136205, 1091367, 1050442, 1013578, 979804, 948536, 919962, 893877, 869516, 846752, 826291, 808394]
62489H08394j5976j4574j3114j1878j1486j1756j2160j2792j3759j4245j3378
62478F63276j1519r564p498m870k246p99n05nJ587L609M815M738M043L952N307
62463F54321P735R914J1019J1677J3039J5284J7546J8983J9460J9359J9361K0300
62451H37998K2685K6369L0693L4847L8010L9706M0301M0726M1403M1786M1076
62440A235600L8891L5145K9910K3722J7327J0866L889l617j0915j7467k3355k8524
62428A311472l2497l5205l7153l8281l7729l5321l2338l0044k8368k6690k4965
62417I52881k3237k1080j8442j6184j4814j3568j1732r966r148q852q203p443
62405G90212p177o751n035k499q71p54r63l86P02J399J381J155J701L718O647
$$ y = [808394, 792418, 777844, 764730, 752852, 741366, 729610, 717450, 704658, 690899, 676654, 663276, 651757, 642193, 634695, 629825, 627579, 626780, 626275, 626270, 627857, 631466, 636281, 641019, 645062, 649014, 654321, 662056, 671970, 682989, 694666, 707705, 722989, 740535, 759518, 778978, 798337, 817698, 837998, 860683, 887052, 917745, 952592, 990602, 1030308, 1070609, 1111335, 1152738, 1194524, 1235600, 1274491, 1309636, 1339546, 1363268, 1380595, 1391461, 1395350, 1391733, 1380818, 1363351, 1339996, 1311472, 1278975, 1243770, 1206617, 1168336, 1130607, 1095286, 1062948, 1032904, 1004536, 977846, 952881, 929644, 908564, 890122, 873938, 859124, 845556, 833824, 823858, 814710, 805858, 797655, 790212, 783035, 776284, 771249, 768750, 767879, 767125, 766162, 765776, 766478, 767877, 769258, 770413, 772114, 775832, 782479]
62390G82479Q893R660J0015J1160J2453J2355J0854R439Q931Q732Q209P423O336
62377I06939M546K040o72l306n866q211j0424j3226j6694j9039j8350j5519j3666
62364G88552j4334j5889j6140j4838j2909j0809q765p388o768n893m064k121j149
62351F67485n66J232M424P153P597O067M647M903O348P386P617Q402J0739J3465
62337G56899J4690J4452J4478J5400J5801J4449J2053J0105R101Q556P932O872
62325I00788N344M021L672L793L001J261M27J642L588M582N138O879R745J2180
62311I66061J3739J5683J8918K2799K6386K9649L2924L6240L9766M4249N0265
62300A296679N7305O3926O8898P2194P5030P8501Q2000Q3456Q1673P7715P3084
$$ y = [782479, 791372, 801032, 811047, 822207, 834660, 847015, 857869, 867308, 876239, 884971, 893180, 900603, 906939, 911485, 913525, 912853, 909547, 903681, 895470, 885046, 871820, 855126, 836087, 817737, 802218, 788552, 774218, 758329, 742189, 727351, 714442, 703633, 694868, 687480, 680712, 674819, 670755, 668634, 667485, 666919, 668151, 672575, 679728, 687325, 693392, 698039, 702942, 709290, 716676, 724293, 732695, 743434, 756899, 771589, 786041, 800519, 815919, 831720, 846169, 858222, 868327, 877428, 885984, 893916, 900788, 906132, 910153, 913825, 917618, 920619, 921880, 922307, 923949, 927537, 932119, 937257, 944136, 953881, 966061, 979800, 995483, 1014401, 1037200, 1063586, 1093235, 1126159, 1162399, 1202165, 1246414, 1296679, 1353984, 1417910, 1486808, 1559002, 1634032, 1712533, 1794533, 1877989, 1959662, 2037377, 2110461]
62289B110461O7252N8387M6363L3514K1986J1685J393r250j9682k9509l8705m7251
62277B206644n5251o2827o9315p3159p3468p1249o8241o5020o1184n6981n3373
62266A496576n0511m7483m4036m1263l9844l8595l5853l1787k8147k5999k4729
62255A088329k3384k1865k0370j8462j5559j1956q654o214m267k283l51R53J254
62242I57171P12m8k34N84J837K120O38j525k285j070L00r3j652k025k90J957K960
62225I59057K990L340M261N056N656O732Q369R814J0663J1411J2654J4396J6248
62212A070647J7707J8308J8246J8780K1025K4420K7356K9358L1465L4373L7538
62201A349223M0708M4771N0258N6116O1138O5617P0345P4728P7174P7028P4948
$$ y = [2110461, 2177713, 2236100, 2282463, 2315977, 2337963, 2349648, 2351041, 2341791, 2322109, 2292600, 2253895, 2206644, 2151393, 2088566, 2019251, 1946092, 1872624, 1801375, 1733134, 1668114, 1606930, 1549949, 1496576, 1446065, 1398582, 1354546, 1313283, 1273439, 1234844, 1198991, 1167204, 1139057, 1113058, 1088329, 1064945, 1043080, 1022710, 1004248, 988689, 976733, 968079, 961865, 957598, 955315, 954964, 955917, 957171, 957883, 957835, 957601, 958185, 960022, 962142, 962780, 961255, 958970, 957900, 958200, 958107, 956455, 954430, 954140, 956097, 959057, 962047, 965387, 969648, 974704, 980360, 987092, 995461, 1005275, 1015938, 1027349, 1040003, 1054399, 1070647, 1088354, 1106662, 1124908, 1143688, 1164713, 1189133, 1216489, 1245847, 1277312, 1311685, 1349223, 1389931, 1434702, 1484960, 1541076, 1602214, 1667831, 1738176, 1812904, 1890078, 1967106, 2042054]
62190B042054P1527O6511N9270M9462L7440K4546J2432J491r406k0910l1890m1130
62178B261397m9309n7734o5742p1149p3074p2603p0758o7587o3548n9987n7461
62167A552445n4882n1043m6012m0543l5170l0371k6580k3373j9706j5498j2048
62156A197219j0216r184p715n690l671j887m76J79L45J289L675O204P004N863
62142A182939M141K975K686L515N518P820R187R584J0198J1822J4162J6800J9805
62129A301152K2939K5331K6612K7690K9527L1611L2537L1890L0752L0115K9594
62118A619750K8172K5819K3716K2906K3331K4324K5503K6948K8874L1619L5622
62107A916584M0777M5938M9621N1389N2220N3421N5277N6572N5167M9538M0327
$$ y = [2042054, 2113581, 2180092, 2239362, 2288824, 2326264, 2350810, 2363242, 2364733, 2355327, 2334417, 2302527, 2261397, 2212088, 2154354, 2088612, 2017463, 1944389, 1871786, 1801028, 1733441, 1669893, 1609906, 1552445, 1497563, 1446520, 1400508, 1359965, 1324795, 1294424, 1267844, 1244471, 1224765, 1209267, 1197219, 1187003, 1177819, 1170104, 1164414, 1160743, 1158856, 1158380, 1158559, 1158904, 1160193, 1163868, 1170072, 1177076, 1182939, 1187080, 1190055, 1192741, 1196256, 1201774, 1209594, 1218781, 1228365, 1238563, 1250385, 1264547, 1281347, 1301152, 1324091, 1349422, 1376034, 1403724, 1433251, 1464862, 1497399, 1529289, 1560041, 1590156, 1619750, 1647922, 1673741, 1697457, 1720363, 1743694, 1768018, 1793521, 1820469, 1849343, 1880962, 1916584, 1957361, 2003299, 2052920, 2104309, 2156529, 2209950, 2265227, 2321799, 2376966, 2426504, 2466831]
62096B466831L0154K1350J4113P387R53m523r177j4209k0241k6614l2516l7547
62084B395961m0883m1401l9422l6949l5216l3264k9983k6214k3350k0999j7889
62073B050391j4375j2079j1334j0801r778r019q907q446o736m164j486J194L801
62060A958261N810P224R163J2422J6004J8128J8475J8588K0121K3315K7099L0175
62048B164785L1927L2676L3317L4670L7093M0435M4049M7032M9049N0924N3727
62037B619684N7022N8804N7663N4559N1813N0754N0935N1420N2076N3434N5746
62026C213910N8356N9868N9080N6106N2590N0512N0638N2311N4607N7294O0526
62015C825798O3940O6558O7700O7657O7289O7103O7103O7441O8540P0341P2007
$$ y = [2466831, 2496985, 2518335, 2532448, 2539835, 2540788, 2536265, 2527088, 2512879, 2492638, 2466024, 2433508, 2395961, 2355078, 2313677, 2274255, 2237306, 2202090, 2168826, 2138843, 2112629, 2089279, 2068280, 2050391, 2036016, 2023937, 2012603, 2001802, 1992024, 1983005, 1974098, 1965652, 1958916, 1954752, 1953266, 1954460, 1958261, 1964071, 1971295, 1980458, 1992880, 2008884, 2027012, 2045487, 2064075, 2084196, 2107511, 2134610, 2164785, 2196712, 2229388, 2262705, 2297375, 2334468, 2374903, 2418952, 2465984, 2515033, 2565957, 2619684, 2676706, 2735510, 2793173, 2847732, 2899545, 2950299, 3001234, 3052654, 3104730, 3158164, 3213910, 3272266, 3332134, 3391214, 3447320, 3499910, 3550422, 3601060, 3653371, 3707978, 3765272, 3825798, 3889738, 3956296, 4023996, 4091653, 4158942, 4226045, 4293148, 4360589, 4429129, 4499470, 4571477]
62004D571477P2955P3681P4782P5559P4626P1805O8235O4404N9386N2702M5728
61993E305340M0128L5750L1280K6385K1803J7702J3396Q876N122K478N9k617m449
61980E501253m241k504p94L22J643L834O437Q457R390R495R319R066Q408P247
61966E567332O431O902P938P382M390Q88q21j007j537k712l180k859l526n743
61952E579878p350o393l891k116j458q10J1L77Q41K664N354O876O805P212R532
61937E597532J2417J3924J4255J4715J5110J4133J1730R119O504K680k556p273
61925E702290r731j0789j2821j6620k0452k2179k1567k0287k0115k1404k3095
61914E503230k3968k3815k3424k3522k4046k4548k5000k5848k7372k9349l1394
$$ y = [4571477, 4644432, 4718113, 4792895, 4868454, 4943080, 5014885, 5083120, 5147524, 5206910, 5259612, 5305340, 5345468, 5381218, 5412498, 5438883, 5460686, 5478388, 5491784, 5500660, 5505782, 5508260, 5508319, 5505702, 5501253, 5497012, 5494508, 5493714, 5494036, 5495679, 5499513, 5505950, 5514407, 5523797, 5533292, 5542611, 5551677, 5560085, 5567332, 5573763, 5580665, 5588603, 5595985, 5600375, 5601263, 5600442, 5599435, 5597898, 5595186, 5592006, 5589147, 5585621, 5579878, 5572528, 5566135, 5562244, 5560128, 5558670, 5557860, 5557871, 5558248, 5559089, 5561753, 5567107, 5573983, 5580788, 5588000, 5597532, 5609949, 5623873, 5638128, 5652843, 5667953, 5682086, 5693816, 5702935, 5709439, 5712119, 5709563, 5702290, 5692559, 5681770, 5668949, 5652329, 5631877, 5609698, 5588131, 5567844, 5547729, 5526325, 5503230, 5479262, 5455447, 5432023, 5408501, 5384455, 5359907, 5334907, 5309059, 5281687, 5252338, 5220944]
61903E220944l3205l4362l4347l3143l1610l0833l1067l1657l1946l1958l1982
61892D864834l1780l0551k7737k3820k0207j8107j7329j6328j3764r853n846k368
61880D647144J055M872Q742J2290J5868J9825K3613K6375K8253L0279L3095L6447
61868D887858L9909M3436M7072N0728N4377N8025O1565O5109O9464P5593Q3471
61857E536607R2218J01526J12262J25322J40474J56800J73814J91730K11044K32255
61847G074052K55663K81075L08075L36903L68592M03752M41589M80599N19949
61838A0470249N59654N99644O38833O74589P02546P17348P14141O88921O37051
61829A6402976N52905M33220K81527J08449p2498k48759m09343n44897o49684
$$ y = [5220944, 5187739, 5153377, 5119030, 5085887, 5054277, 5023444, 4992377, 4960720, 4928774, 4896816, 4864834, 4833054, 4802503, 4774766, 4750946, 4730739, 4712632, 4695303, 4678975, 4665211, 4655358, 4649512, 4647144, 4648199, 4653071, 4661813, 4674103, 4689971, 4709796, 4733409, 4759784, 4788037, 4818316, 4851411, 4887858, 4927767, 4971203, 5018275, 5069003, 5123380, 5181405, 5242970, 5308079, 5377543, 5453136, 5536607, 5628825, 5730351, 5842613, 5967935, 6108409, 6265209, 6439023, 6630753, 6841797, 7074052, 7329715, 7610790, 7918865, 8255768, 8624360, 9028112, 9469701, 9950300, 10470249, 11029903, 11629547, 12268380, 12942969, 13645515, 14362863, 15077004, 15765925, 16402976, 16955881, 17389101, 17670628, 17779077, 17706579, 17457820, 17048477, 16503580, 15853896]
61820A5853896p23165p68322p88630p87519p69663p40527p03958o61544o14899
61811I295669n67230n21758m79467m39548m01411l65375l31867l01184k73789
61802E614040k49744k27944k07025j87097j69477j54643j41536j29141j17413
61793D030020j06196r4597q2509p1569o3301n7101n1360m5868m1505l8019l3998
61782C343997k9234k5436k3908k3808k3568k2944k2683k2871k2647k1271j8702
61771C086925j5295j1464p647m089o68K872O564J0158J3139J4767J4489J2643
61759C122394J0542R560J0261J2246J4531J6098J6659J7091J8649K1597K5143
61748C294771K8841L3337L9241M5967N2440N8665O5767P4510Q4301R3880J02641
$$ y = [15853896, 15130731, 14362409, 13573779, 12786260, 12016597, 11276070, 10572112, 9910568, 9295669, 8728439, 8206681, 7727214, 7287666, 6886255, 6520880, 6189013, 5887829, 5614040, 5364296, 5136352, 4929327, 4742230, 4572753, 4418110, 4276574, 4147433, 4030020, 3923824, 3829227, 3746718, 3675149, 3611848, 3554747, 3503387, 3457519, 3416014, 3377995, 3343997, 3314763, 3289327, 3265419, 3241611, 3218043, 3195099, 3172416, 3149545, 3126898, 3105627, 3086925, 3071630, 3060166, 3052519, 3048430, 3047762, 3050634, 3057198, 3067356, 3080495, 3095262, 3109751, 3122394, 3132936, 3142496, 3152757, 3165003, 3179534, 3195632, 3212291, 3229382, 3248031, 3269628, 3294771, 3323612, 3356949, 3396190, 3442157, 3494597, 3553262, 3619029, 3693539, 3777840, 3871720, 3974361]
61737C974361J11012J19702J28808J37997J47418J57870J69641J81845J93691
61728E322345K06050K20631K37700K55967K74943K95967L20209L46999L75399
61719G856210M06293M41414M80819N23042N67675O16274O70337P29554P92650
61710A3084268Q58943R28259R99949J072645J144501J212757J272897J318521
61702B1892740J341755J333405J283078J180555J018743P96793N21855K09030
61694B9577954j20326m41962p33370r77994j166935j298215j375367j406138j400219
61685B0657428j366239j310623j239431j159958j078808r98863r19883q42343
61677A1741280p68952p02016o41180n85035n33600m87697m46794m09144l73901
$$ y = [3974361, 4085373, 4205075, 4333883, 4471880, 4619298, 4777168, 4946809, 5128654, 5322345, 5528395, 5749026, 5986726, 6242693, 6517636, 6813603, 7133812, 7480811, 7856210, 8262503, 8703917, 9184736, 9707778, 10275453, 10891727, 11562064, 12291618, 13084268, 13943211, 14871470, 15871419, 16944064, 18088565, 19301322, 20574219, 21892740, 23234495, 24567900, 25850978, 27031533, 28050276, 28847069, 29368924, 29577954, 29457628, 29015666, 28282296, 27304302, 26137367, 24839152, 23463785, 22057647, 20657428, 19291189, 17980566, 16741135, 15581177, 14502369, 13503506, 12583623, 11741280, 10972328, 10270312, 9629132, 9044097, 8510497, 8022800, 7576006, 7166862, 6792961]
61668F792961l41673l13021k87468k64191k42774k23078k05014j88707j74281
61659D552754j61458j49703j38871j29219j20744j12906j05207r7859r1706q7442
61649C357639q4722q2049p7903p2117o5935o0777n7282n5308n4136n2655n0299
61638B644456m7929m6786m6362m4642m1039l7673l6654l7307l7434l6287l4758
61627B197585l3343l1761l0290k9705k9762k9205k7566k5752k4608k3996k3540
61616A888057k3217k2865k2006k0480j8613j6514j3957j1064q543p093p071q467
61604A708167j0540j1892j1804j1211j1364j1969j1820j0960j0531j0663j0164
61593A585249q647p252o663n903l917j248O68R88k27k134l184k320m87K23n19
$$ y = [6792961, 6451288, 6138267, 5850799, 5586608, 5343834, 5120756, 4915742, 4727035, 4552754, 4391296, 4241593, 4102722, 3973503, 3852759, 3739853, 3634646, 3536787, 3445081, 3357639, 3272917, 3190868, 3112965, 3040848, 2974913, 2914136, 2856854, 2801546, 2747410, 2694755, 2644456, 2596527, 2549741, 2503379, 2458737, 2417698, 2380025, 2343371, 2306064, 2268630, 2232343, 2197585, 2164242, 2132481, 2102191, 2072486, 2042724, 2013519, 1985953, 1960201, 1935593, 1911597, 1888057, 1864840, 1841975, 1819969, 1799489, 1780876, 1764362, 1750405, 1739341, 1730798, 1723705, 1716634, 1708167, 1697627, 1685735, 1673931, 1662720, 1651356, 1639387, 1627567, 1616607, 1606076, 1595413, 1585249, 1576602, 1569350, 1562687, 1556784, 1552867, 1551619, 1552287, 1553275, 1553048, 1550914, 1547730, 1545410, 1544923, 1545146, 1544627]
61578A544627q31K92J263N51o14j2K227M047M546M647N008N207N148N519O392
61563A588017O717N943N066N373O743P767P097M432O43k643m138m035l922n204
61549A617856p693r921j0748j0364r821r786j0084j0357j0640j1001j0990j0092
61537A496359q580p266o383n379l864k171q38r5L9j08L93K348N177P385Q506R626
61521A495149J1542J3597J5033J6306J8118K0199K2191K4763K8328L1527L2720
61510A729473L2718L4235L8469M3781M8069N0977N3085N4205N3686N1786M9656
61499B240140M7824M5492M1720L7168L3965L3289L3516L1746K7398K2991K0791
61488B616040J9997J8441J5883J3821J2681J1261Q753N540J805k698p108r604
$$ y = [1544627, 1543796, 1544088, 1545351, 1545902, 1545288, 1545276, 1547503, 1551550, 1556096, 1560743, 1565751, 1570958, 1576106, 1581625, 1588017, 1594734, 1600677, 1605743, 1611116, 1617859, 1625626, 1632723, 1637155, 1637798, 1635155, 1631017, 1626982, 1623060, 1617856, 1610163, 1600242, 1589494, 1579130, 1569309, 1559523, 1549439, 1539082, 1528442, 1517441, 1506451, 1496359, 1487779, 1480513, 1474130, 1468751, 1464887, 1462716, 1461878, 1461783, 1461822, 1461714, 1462107, 1464455, 1469632, 1477017, 1485523, 1495149, 1506691, 1520288, 1535321, 1551627, 1569745, 1589944, 1612135, 1636898, 1665226, 1696753, 1729473, 1762191, 1796426, 1834895, 1878676, 1926745, 1977722, 2030807, 2085012, 2138698, 2190484, 2240140, 2287964, 2333456, 2375176, 2412344, 2446309, 2479598, 2513114, 2544860, 2572258, 2595249, 2616040, 2636037, 2654478, 2670361, 2684182, 2696863, 2708124, 2716877, 2722417, 2724222, 2721524, 2714416, 2704812]
61476B704812r863r796j0867j2226j2493j1841j0950r237n893j733J732M559Q013
61463B624217J2330J6454J9993K3927K9297L6338M4852N4065O2236O8110P3176
61452C064995Q0859R2693J06587J19596J31060J42063J53246J64832J77854J93369
61442D427154K10481K26850K41496K55771K70811K85101K95412K99536K97226
61433F809838K88653K72782K47680K12295J67789J17213O4092J1496l7796q1146
61423H072896j16870j45056j66915j83190j93644j97940j96371j89559j78130
61414F505221j63125j46290j29493j13865r9584q6157p2855n9292m5809l3075
61404E555676k1376j0749j698N177J0555J6452K4183L2923M1026M8071N4663O0802
$$ y = [2704812, 2694949, 2685153, 2674286, 2662060, 2649567, 2637726, 2626776, 2617539, 2611646, 2609913, 2611645, 2616204, 2624217, 2636547, 2653001, 2672994, 2696921, 2726218, 2762556, 2807408, 2861473, 2923709, 2991819, 3064995, 3145854, 3238547, 3345134, 3464730, 3595790, 3737853, 3891099, 4055931, 4233785, 4427154, 4637635, 4864485, 5105981, 5361752, 5632563, 5917664, 6213076, 6512612, 6809838, 7098491, 7371273, 7618953, 7831248, 7999037, 8116250, 8180342, 8191838, 8154042, 8072896, 7956026, 7810970, 7644055, 7460865, 7267221, 7069281, 6872910, 6683351, 6505221, 6342096, 6195806, 6066313, 5952448, 5852864, 5766707, 5693852, 5634560, 5588751, 5555676, 5534300, 5523551, 5521853, 5527030, 5537585, 5554037, 5578220, 5611143, 5652169, 5700240, 5754903, 5815705]
61392E815705O5750O9426P2765P6363P9620Q1540Q1719Q0321P7721P4479P1114
61381F646523O7565O3300N8075N2173M5834L9183L2861K7906K4492K1413J7394
61370G096719J2496P758L965J330j61r07j919l938o453q468j0360j3842j9621
61357G056599k5987l0679l3612l6488l9830m1826m0803l7698l4845l3006l1088
61346F670737k8691k7259k8008l0008l1343l1481l1392l1792l2279l1931k9916
61335F336637k5784j9910j3431o847J044J1923K5897M1609N8173P5773R4379J13201
61323F692664J31881J51161J71821J93676K15857K37265K56580K72835K86393
61314H610133K98164L07267L10446L04572K88808K63745K29649J86889J37353
$$ y = [5815705, 5881455, 5950881, 6023646, 6100009, 6179629, 6261169, 6342888, 6423209, 6500930, 6575409, 6646523, 6714088, 6777388, 6835463, 6887636, 6933470, 6972653, 7005514, 7033420, 7057912, 7079325, 7096719, 7109215, 7116973, 7120938, 7122268, 7122107, 7121200, 7119281, 7115343, 7108890, 7100422, 7090062, 7076220, 7056599, 7030612, 6999933, 6966321, 6929833, 6890003, 6848177, 6807374, 6769676, 6734831, 6701825, 6670737, 6642046, 6614787, 6586779, 6556771, 6525428, 6493947, 6462555, 6430763, 6398484, 6366553, 6336637, 6310853, 6290943, 6277512, 6270665, 6271709, 6283632, 6309529, 6351138, 6409311, 6485084, 6579463, 6692664, 6824545, 6975706, 7147527, 7341203, 7557060, 7794325, 8050905, 8323740, 8610133, 8908297, 9215564, 9526010, 9830582, 10119390, 10383135, 10612784, 10799673, 10937026]
61305A0937026Q4036K9463k4454p5363j20784j59896j94122k25289k53502k77004
61295I720111k93807l03388l06990l06522l03227k97417k89210k78992k67131
61286G073427k53725k38945k23201k06778j89742j72308j54943j37960j21556
61277E374269j06215r2408p9670o6748n2914l8556k4439j1244J93R527J8056K7698
61265D957549L8114M6445N0980N3549N6831O0588O2594O2258O1048N9643N6998
61254E566597N2578M7599M3293L9262L4396K8434K2111J6323J1506P158J935n119
61242E866073j3416k1609k9257l6666m3328m8003n0659n2913n5912n8913o0646
61231E394751o1164o1495o2107o2450o1724n9559n6235n2525m9028m5545m1512
$$ y = [10937026, 11021062, 11050525, 11026071, 10950708, 10829924, 10670028, 10475906, 10250617, 9997115, 9720111, 9426304, 9122916, 8815926, 8509404, 8206177, 7908760, 7619550, 7340558, 7073427, 6819702, 6580757, 6357556, 6150778, 5961036, 5788728, 5633785, 5495825, 5374269, 5268054, 5175646, 5095976, 5029228, 4976314, 4937758, 4913319, 4902075, 4902268, 4911795, 4929851, 4957549, 4995663, 5042108, 5093088, 5146637, 5203468, 5264056, 5326650, 5388908, 5449956, 5509599, 5566597, 5619175, 5666774, 5710067, 5749329, 5783725, 5812159, 5834270, 5850593, 5862099, 5869257, 5871192, 5866073, 5852657, 5831048, 5801791, 5765125, 5721797, 5673794, 5623135, 5570222, 5514310, 5455397, 5394751, 5333587, 5272092, 5209985, 5147535, 5085811, 5026252, 4970017, 4917492, 4868464, 4822919, 4781407]
61220D781407l7028l2828k9232k5869k2642k0161j8981j9076k0292k2579k5455
61209D507264k8003k9601l0091k9051k5855k0807j5312j0359n561j29N825J1572
61197D329892J6798K1949K8010L6101M6608N8457O9927Q0431R0743J01383J11915
61186D992214J21908J31199J38591J41791J39579J32790J22066J06049Q3165N4184
61176F163536K1445j3377m8991q2740j11536j34484j52914j67510j77073j80428
61166E115928j78169j72134j64234j56052j48345j40650j32360j24219j17524
61157C782241j11868j05319r7321q9620q3496p7704p0458o2253n5095m9688m4790
61146B934629l9155l2799k6401k0453j5012r682l884K371Q249J3026J6755J9457
$$ y = [4781407, 4744379, 4711551, 4682319, 4656450, 4633808, 4613647, 4594666, 4575590, 4555298, 4532719, 4507264, 4479261, 4449660, 4419569, 4390518, 4364663, 4343856, 4328544, 4318185, 4312624, 4312495, 4318320, 4329892, 4346690, 4368639, 4396649, 4432750, 4479358, 4537815, 4607742, 4688173, 4778916, 4880299, 4992214, 5114122, 5245321, 5383912, 5525703, 5665282, 5798072, 5920138, 6026187, 6109352, 6163536, 6184981, 6171604, 6122613, 6039873, 5928337, 5793853, 5640939, 5473429, 5296356, 5115928, 4937759, 4765625, 4601391, 4445339, 4296994, 4156344, 4023984, 3899765, 3782241, 3670373, 3565054, 3467733, 3378113, 3294617, 3216913, 3146455, 3084202, 3029107, 2979419, 2934629, 2895474, 2862675, 2836274, 2815821, 2800809, 2791127, 2787243, 2789614, 2797863, 2810889, 2827644, 2847101]
61134B847101K0272J8385J4459J0235O761L799P08k810o749j0795j4356j7270
61122B869740k0245k3895k7662l0558l2675l4908l7321l9001l9581l9772m0142
61111B503980m0540m1007m2003m3247m3628m2965m2673m3736m5041m4970m3688
61100B030482m2494m1430l9305l5992l3156l2023l1585k9752k5840k1276j8205
61089A679424j7769j9671k2883k6479k9738l1805l1923l0278k8141k6626k5564
61078A388547k4011k1568j8698j5965j3545j1436r549p558n149k528l01J249K557
61065A262045M369P085J0345J3146J4619J4910J4990J5425J5810J5740J5733J6375
61053A420592J7111J6831J5593J4744J5178J6222J6529J5511J3524J1101Q366
$$ y = [2847101, 2867373, 2885758, 2900217, 2910452, 2917213, 2921012, 2921720, 2918910, 2912161, 2901366, 2887010, 2869740, 2849495, 2825600, 2797938, 2767380, 2734705, 2699797, 2662476, 2623475, 2583894, 2544122, 2503980, 2463440, 2422433, 2380430, 2337183, 2293555, 2250590, 2207917, 2164181, 2119140, 2074170, 2030482, 1987988, 1946558, 1907253, 1871261, 1838105, 1806082, 1774497, 1744745, 1718905, 1697629, 1679424, 1661655, 1641984, 1619101, 1592622, 1562884, 1531079, 1499156, 1468878, 1440737, 1414111, 1388547, 1364536, 1342968, 1324270, 1308305, 1294760, 1283324, 1273775, 1266217, 1261068, 1258540, 1258239, 1259488, 1262045, 1266414, 1273499, 1283844, 1296990, 1311609, 1326519, 1341509, 1356934, 1372744, 1388484, 1404217, 1420592, 1437703, 1454534, 1470127, 1484871, 1500049, 1516271, 1532800, 1548311, 1561835, 1572936, 1581302]
61042A581302N134J300k931p192j1175j4454j6318j6410j5521j4888j4602j3620
61030A460625j1765j0425j0485j0809j0009q626q018p974p239n941n547o412p201
61017A350174o988o251n552m792m139m178m555l947k023j36N30L72L19O01J223
61002A310658K604M882P336R078R585Q484N978L753L927O445Q794R180Q679R390
60988A408773J1620J4081J5858J7065J8119J9340K0904K2531K3790K5074K7465
60977A624620L1139L4773L7139L8495L9877M1799M4082M6308M8163N0095N3574
60966B090064N9544O6605P2111P5275P7814Q1540Q6878R3718J01648J09218J15081
60955C029496J20213J26751J34463J41094J46570J53657J63495J73868J83288
$$ y = [1581302, 1586436, 1587736, 1584805, 1577613, 1566438, 1551984, 1535666, 1519256, 1503735, 1488847, 1474245, 1460625, 1448860, 1438435, 1427950, 1417141, 1407132, 1398506, 1390488, 1382514, 1375275, 1369334, 1363787, 1357375, 1350174, 1343186, 1336935, 1331383, 1326591, 1322452, 1318274, 1313719, 1309772, 1307749, 1307613, 1308143, 1308515, 1308834, 1309435, 1310658, 1313262, 1318144, 1325480, 1334558, 1344143, 1352627, 1358605, 1362358, 1366285, 1372730, 1381524, 1390704, 1399383, 1408773, 1420393, 1434474, 1450332, 1467397, 1485516, 1504856, 1525760, 1548291, 1572081, 1597155, 1624620, 1655759, 1690532, 1727671, 1766166, 1806043, 1847842, 1891924, 1938232, 1986395, 2036490, 2090064, 2149608, 2216213, 2288324, 2363599, 2441413, 2522953, 2609831, 2703549, 2805197, 2914415, 3029496, 3149709, 3276460, 3410923, 3552017, 3698587, 3852244, 4015739, 4189607, 4372895]
60946D372895J93186K04363K14985K24736K37294K55643K78088L02243L29709
60937F613142L62894M00031M37681M76255N19419N70381O32336P09518Q03304
60928A1524961R09991J026687J155962J300614J460150J639907J856349K121665
60920B2996286K429522K770132L144777L523053L770923L669368L074175K080933
60912D7459169J004297J67823k86818l98296k57441N2354L90020N14521J97948
60903D8843577n88031j618142k564159l202735l495677l520794l372279l121447
60895B7360313k822576k515842k222488j950223j704283j488389j299879j132798
60887A2223835r85232q58576p51810o61849n87677n28747m80597m37305l97537
$$ y = [4372895, 4566081, 4770444, 4985429, 5210165, 5447459, 5703102, 5981190, 6283433, 6613142, 6976036, 7376067, 7813748, 8290003, 8809422, 9379803, 10012139, 10721657, 11524961, 12434952, 13461639, 14617601, 15918215, 17378365, 19018272, 20874621, 22996286, 25425808, 28195940, 31340717, 34863770, 38634693, 42304061, 45378236, 47459169, 48463466, 48631289, 48344471, 47946175, 47688734, 47741088, 48131108, 48645629, 48843577, 48255546, 46637404, 44073245, 40870510, 37374833, 33854039, 30481760, 27360313, 24537737, 22021895, 19799407, 17849184, 16144901, 14656512, 13356633, 12223835, 11238603, 10380027, 9628217, 8966368, 8378691, 7849944, 7369347, 6932042, 6534505]
60878F534505l63540l34919l08229k82249k58799k38210k18568k00074j85798
60869D144119j76901j70608j64092j57145j49962j41477j31530j22011j14313
60860B816080j07603j00843r4566q9444q4813p9830p4632o9529o4457n9901n6895
60849A933567n5243n3210m9772m6008m3363m1752m0063l7654l4678l1794k9993
60838A470037k9759l0059k9027k6109k2664k0151j8521j6834j4656j2455j1027
60827A238775j0612j0313q707n629k815j894k233j885j98J784L205M178M718M240
60813A212614K493k4k641m708n495m995m628n870q169r440q681o990n959o260
60799A141247p725r540j0203q591n460k886j867j385j32J895L900N627P604J0337
$$ y = [6534505, 6170965, 5836046, 5527817, 5245568, 4986769, 4748559, 4529991, 4329917, 4144119, 3967218, 3796610, 3632518, 3475373, 3325411, 3183934, 3052404, 2930393, 2816080, 2708477, 2607634, 2513068, 2423624, 2338811, 2258981, 2184349, 2114820, 2050363, 1990462, 1933567, 1878324, 1825114, 1775342, 1729334, 1685971, 1644219, 1604156, 1566502, 1531824, 1500030, 1470037, 1440278, 1410219, 1381192, 1355083, 1332419, 1312268, 1293747, 1276913, 1262257, 1249802, 1238775, 1228163, 1217850, 1209143, 1203514, 1200699, 1198805, 1196572, 1194687, 1194489, 1196273, 1199478, 1203656, 1208374, 1212614, 1215107, 1215083, 1212442, 1207734, 1202239, 1197244, 1192616, 1186746, 1178577, 1169137, 1160456, 1153466, 1147507, 1141247, 1133522, 1123982, 1113779, 1105188, 1099728, 1096842, 1094975, 1093590, 1093458, 1095353, 1099253, 1104880, 1112484, 1122821]
60785A122821J3518J6021J6904J6502J5978J5652J4780J3345J2714J3591J4754
60774A286580J5108J5484J6609J6691J3485Q004L670K079J998K324L320M689N019
60761A395060L945K895K846L147L179L338L640L175J855J016J325J576N39j421
60747A426115l421n395p414q954r846j0940j2863j5063j6694j7436j6968j5005
60735A286116j2492j1289j1698j1676r609o535m337k994j253Q14J858J634J809
60722A220348M009P925J1631J3400J3252J2865J3814J5822J7127J6571J4701J2786
60710A374251J1626J1468J2155J2940J3013J2420J1773J0950R316P441P134Q908
60698A503395J0772J0598Q679O845N861N177M658N062O621Q246Q573P350N486
$$ y = [1122821, 1136339, 1152360, 1169264, 1185766, 1201744, 1217396, 1232176, 1245521, 1258235, 1271826, 1286580, 1301688, 1317172, 1333781, 1350472, 1363957, 1371961, 1375631, 1377710, 1379708, 1382032, 1385352, 1390041, 1395060, 1399005, 1401900, 1404746, 1407893, 1411072, 1414410, 1418050, 1421225, 1423080, 1424096, 1425421, 1426997, 1427536, 1426115, 1422694, 1417299, 1409885, 1400931, 1391085, 1380145, 1367282, 1352219, 1335525, 1318089, 1301121, 1286116, 1273624, 1262335, 1250637, 1238961, 1229352, 1222817, 1218480, 1215486, 1214233, 1215047, 1216905, 1218539, 1220348, 1224357, 1232282, 1243913, 1257313, 1270565, 1283430, 1297244, 1313066, 1330193, 1346764, 1361465, 1374251, 1385877, 1397345, 1409500, 1422440, 1435453, 1447873, 1459646, 1470596, 1479912, 1487353, 1494487, 1503395, 1514167, 1524765, 1533444, 1540289, 1546150, 1551327, 1555985, 1561047, 1567668, 1575914, 1584487, 1591837, 1597323]
60685A597323M001L092K266J318Q23J303K171K133N97j818m074n468n735n178
60671A592754m706n150o524q391j0455j2122j2134r962p200o182p262q862r960
60658A483844j0892j1574j0966q909o952o389o743o902o581n944n063m481n181
60645A387267p122q793r036q334p666p118o442n906n610m796k878m92J225J846
60631A316145J612Q60Q3k54m34j419l554o084q224r798j0600j0306r563r983j2321
60616A236160j5550j8156j9528j9655j8665j7110j5592j3748j0854p704o178o450
60604A066970o441m880l015k186j590K7K085L264L604L930M216M137M223M961
60590A079305N761O220P288R660J1986J2414J1165R943R499R248Q687P773O571
$$ y = [1597323, 1601324, 1604416, 1606682, 1608000, 1608823, 1610126, 1612297, 1614430, 1615027, 1613209, 1609135, 1603667, 1597932, 1592754, 1588048, 1582898, 1576374, 1567983, 1557528, 1545406, 1533272, 1523310, 1516110, 1509928, 1502666, 1493804, 1483844, 1472952, 1461378, 1450412, 1441503, 1434551, 1428162, 1421419, 1414517, 1407936, 1401992, 1396929, 1392448, 1387267, 1380145, 1371352, 1362316, 1353982, 1346316, 1339198, 1332756, 1326850, 1321240, 1316444, 1313566, 1313074, 1314299, 1316145, 1317757, 1318617, 1318700, 1318446, 1318012, 1316593, 1313039, 1306955, 1298731, 1288933, 1278333, 1268027, 1258464, 1248481, 1236160, 1220610, 1202454, 1182926, 1163271, 1144606, 1127496, 1111904, 1098156, 1087302, 1079598, 1073420, 1066970, 1060529, 1055649, 1052634, 1050448, 1048858, 1048885, 1050970, 1054234, 1057838, 1061768, 1065984, 1070121, 1074344, 1079305, 1085066, 1091286, 1098574, 1108234, 1120220, 1132634, 1143799, 1153742, 1163241, 1172489, 1181176, 1188949, 1195520]
60577A195520N710O341Q333R680R124Q146Q713J0340J1429J2251J4058J6243J7066
60564A332954J6750J7137J8470J9191J8935J9044J9794J9797J8711J7958J7849
60553A536590J6579J3393J0447R718R858Q066M017L4k009k392k550l791o861j1489
60539A579610j6135j9025j9796j9744k0294k1481k2143k1407j9611j7560j5333
60528A367081j2549r659p872p265o089k893J426M682N868N567M621L715L766N268
60514A355667P240Q088P513O669O520P122Q102Q751P952N541L516M191O957Q546
60500A452375P038M112K578K872L113J874j10r13L69K484L254K255J667L753P969
60485A494690J1701J3615J4897J7207K0729K4675K8558L2371L6249M0324M4293
$$ y = [1195520, 1201230, 1207571, 1215904, 1225584, 1234708, 1242854, 1251567, 1261907, 1273336, 1285587, 1299645, 1315888, 1332954, 1349704, 1366841, 1385311, 1404502, 1423437, 1442481, 1462275, 1482072, 1500783, 1518741, 1536590, 1553169, 1566562, 1577009, 1586727, 1596585, 1604651, 1608668, 1608702, 1606693, 1604301, 1601751, 1597960, 1591099, 1579610, 1563475, 1544450, 1524654, 1504910, 1484616, 1463135, 1440992, 1419585, 1399974, 1382414, 1367081, 1354532, 1344873, 1337001, 1329736, 1323647, 1320754, 1322180, 1326862, 1332730, 1338297, 1342918, 1346633, 1350399, 1355667, 1362907, 1370995, 1378508, 1385177, 1391697, 1398819, 1406921, 1415672, 1423624, 1429165, 1432681, 1436872, 1443829, 1452375, 1459413, 1463525, 1466103, 1468975, 1472088, 1473962, 1473852, 1472939, 1473308, 1475792, 1479046, 1481301, 1482968, 1486721, 1494690, 1506391, 1520006, 1534903, 1552110, 1572839, 1597514, 1626072, 1658443, 1694692, 1735016, 1779309]
60474A779309M6899M6525M2538L5566K6584J6421O011l678j2044j8546k2383k3306
60462A919896k2336k0625j7988j3788q721m154K2N074J0905J5751J8718K0921
60450A903675K3557K6539K9528L2791L6360L9859M3786M9388N6677O4354P2398
60439B378912Q2684R5892J09868J22763J35932J51582J69052J85861K01588K18117
60429C852251K36437K55532K74633K94417L15347L36085L53574L63014L57574
60420F638864L30352K78228K03575J12037R879r5960j96880k83606l48848l89351
60410F258290m06424m05062l91615l70929l45341l16304k86212k57848k32533
60401C246022k09775j88804j69728j53125j39073j26868j15400j03780r2049q1317
$$ y = [1779309, 1826208, 1872733, 1915271, 1950837, 1977421, 1993842, 1999853, 1996175, 1984131, 1965585, 1943202, 1919896, 1897560, 1876935, 1858947, 1845159, 1836438, 1832284, 1832306, 1837380, 1848285, 1864036, 1882754, 1903675, 1927232, 1953771, 1983299, 2016090, 2052450, 2092309, 2136095, 2185483, 2242160, 2306514, 2378912, 2461596, 2557488, 2667356, 2790119, 2926051, 3077633, 3246685, 3432546, 3634134, 3852251, 4088688, 4344220, 4618853, 4913270, 5228617, 5564702, 5918276, 6281290, 6638864, 6969216, 7247444, 7451019, 7563056, 7572935, 7476975, 7280095, 6996489, 6647641, 6258290, 5851866, 5446804, 5055189, 4684260, 4338919, 4022615, 3736403, 3478555, 3246022, 3036247, 2847443, 2677715, 2524590, 2385517, 2258649, 2143249, 2039469, 1947420, 1866103]
60391A866103p2780o6337o0690n4891m9251m4456m0547l7277l4784l2990l0918
60380A341182k7703k4041k1469k0194j8904j6795j4550j2840j1243r365p950p814
60368A148314q461q783q440p758o830n733m978m840m744m298m163m802m974l087
60354A066423L67L222M382M664M847M546L608L207M581P361R934J1084J0797R882
60340A148905R204R267J0193J1962J4263J6244J7059J6954J6948J7043J5892J3117
60328A317051J0597J0018J0259R163P098O454P764Q777P745N523L658K337J153
60315A407597M02M60R97J521J704Q02j870n319p230o679n096l830k352J1K230
60300A383348K997K716K569K534J990J467K057L468M265L984L675M294N630O878
$$ y = [1866103, 1793323, 1726986, 1666296, 1611405, 1562154, 1517698, 1477151, 1439874, 1405090, 1372100, 1341182, 1313479, 1289438, 1267969, 1247775, 1228871, 1212076, 1197526, 1184686, 1173443, 1164078, 1156128, 1148314, 1139853, 1131070, 1122630, 1114872, 1108042, 1102309, 1097331, 1092491, 1087747, 1083449, 1079286, 1074484, 1069510, 1066423, 1066790, 1070012, 1074394, 1079058, 1083905, 1088451, 1092059, 1095266, 1099847, 1107208, 1117142, 1128226, 1139023, 1148905, 1158109, 1167376, 1177569, 1189531, 1203794, 1220038, 1237097, 1254051, 1270999, 1288042, 1303934, 1317051, 1327648, 1337666, 1347925, 1357088, 1364186, 1370640, 1378404, 1387181, 1394926, 1400449, 1404107, 1406444, 1407597, 1407999, 1408459, 1409456, 1410977, 1412681, 1413483, 1411613, 1406294, 1399064, 1392385, 1387289, 1383459, 1381107, 1381118, 1383348, 1386345, 1389061, 1391630, 1394164, 1396154, 1397621, 1399678, 1403146, 1407411, 1411395, 1415070, 1419364, 1424994, 1431872]
60286A431872P571P884Q520R947J1353J1006Q426N403L858L409K258J4j890k391
60272A507240j928j127J76K133M140N601O705P782Q451Q052O587M639K568K24
60258A561243k561n615q599j1232j3198j4102j3870j3069j2450j2047j1234r847
60246A433419q723q638r142r213q740q474q571q166o612m335k128k64J362K725
60232A354500L669L972L373J964N73M0J20j82j116j938k138j865r32J381M940
60217A366361Q294J0327J1516J2881J4558J6208J7894J9683K0975K1228K0853
60206A540778K0548K0257J9636J9013J9044J9741K0731K2125K4328K7286L0564
60195A784051L3834L6669L8439L9365M1038M4815M9921N4347N7524O0958O6066
$$ y = [1431872, 1439443, 1447327, 1455847, 1465794, 1477147, 1488153, 1496579, 1501982, 1505840, 1509249, 1511507, 1511521, 1509631, 1507240, 1505312, 1504185, 1504361, 1506494, 1510634, 1516235, 1522940, 1530722, 1539173, 1547225, 1553812, 1558451, 1561019, 1561243, 1558682, 1553067, 1544468, 1533236, 1520038, 1505936, 1492066, 1478997, 1466547, 1454500, 1443266, 1433419, 1424696, 1416058, 1406916, 1397703, 1388963, 1380489, 1371918, 1363752, 1357140, 1352805, 1350677, 1350413, 1351775, 1354500, 1358169, 1362141, 1365514, 1367478, 1368051, 1368091, 1368211, 1368029, 1366913, 1364975, 1362837, 1360972, 1360040, 1361421, 1366361, 1374655, 1384982, 1396498, 1409379, 1423937, 1440145, 1458039, 1477722, 1498697, 1519925, 1540778, 1561326, 1581583, 1601219, 1620232, 1639276, 1659017, 1679748, 1701873, 1726201, 1753487, 1784051, 1817885, 1854554, 1892993, 1932358, 1973396, 2018211, 2068132, 2122479, 2180003, 2240961, 2307027]
60184B307027P2582P9437Q6176R2800R9049J04684J10299J17071J25597J35241
60174C329963J44661J52744J59046J63644J66786J68645J69093J67583J63394
60165D785559J56254J46649J35273J22321J07548R0940P3121N5163L8146K2592
60155E733566Q166n544j7540k5433k7905k6628k4483k2084j7473r285J260J2114
60143E578731K2776L4088M6629O0278P4658Q9115J02701J14894J26122J36989
60133F386981J47250J55745J60943J61370J56358J46802J34559J20547J04062
60124G674617Q4321O1963L8487J4912q318l0737n1906p1635q9321j03373j11979
60113G407031j14562j12223j06831r9789r1285q0592o7200n1592l4661j6945R43
$$ y = [2307027, 2379609, 2459046, 2545222, 2638022, 2737071, 2841755, 2952054, 3069125, 3194722, 3329963, 3474624, 3627368, 3786414, 3950058, 4116844, 4285489, 4454582, 4622165, 4785559, 4941813, 5088462, 5223735, 5346056, 5453604, 5544544, 5617665, 5672828, 5710974, 5733566, 5741732, 5736188, 5718648, 5693215, 5665310, 5638682, 5614199, 5592115, 5574642, 5565357, 5566617, 5578731, 5601507, 5635595, 5682224, 5742502, 5817160, 5906275, 6008976, 6123870, 6249992, 6386981, 6534231, 6689976, 6850919, 7012289, 7168647, 7315449, 7450008, 7570555, 7674617, 7758938, 7820901, 7859388, 7874300, 7865982, 7835245, 7783339, 7711704, 7622383, 7519010, 7407031, 7292469, 7180246, 7073415, 6973626, 6882341, 6801749, 6734549, 6682957, 6648296, 6631351, 6632294]
60102F632294J7808L2983M7476O2408P6419Q6464R1372R2755R1941Q8090Q0343
60091G400353O9899N8430M6050L2479J8954P276k117r502j4140j4776j1322m422
60079G577162O093K0842L9205N9469Q0530J02415J25335J49243J74150J99941
60069H534385K26170K52836K80825L10616L41013L70134L97230M22624M46313
60060A1582146M67500M84931M96851N01228M96991M84376M63379M32870L92479
60051A5802751L44174K90470K31891J67791R8947K7554m4777j17101j87459k52936
60041A6361305l11273l60893l99662m25594m38955m41912m35880m20714l96771
60032A2729651l66036l30728k92167k51530k10436j70088j30801r2788n6722k3303
$$ y = [6632294, 6650102, 6683085, 6730561, 6792969, 6869388, 6955852, 7047224, 7139979, 7231920, 7320010, 7400353, 7470252, 7528682, 7574732, 7607211, 7626165, 7633441, 7631324, 7621822, 7607682, 7592906, 7581584, 7577162, 7583255, 7604097, 7643302, 7702771, 7783301, 7885716, 8011051, 8160294, 8334444, 8534385, 8760555, 9013391, 9294216, 9604832, 9945845, 10315979, 10713209, 11135833, 11582146, 12049646, 12534577, 13031428, 13532656, 14029647, 14514023, 14977402, 15410272, 15802751, 16146925, 16437395, 16669286, 16837077, 16936024, 16963578, 16918801, 16801700, 16614241, 16361305, 16050032, 15689139, 15289477, 14863883, 14424928, 13983016, 13547136, 13126422, 12729651, 12363615, 12032887, 11740720, 11489190, 11278754, 11108666, 10977865, 10885077, 10828355, 10805052]
60022A0805052O864L2864N3799O9574Q0346Q5311Q3037P3186N6988L6261J2980
60011A1396262j0601l3095n5332p9031j03769j26699j45668j61169j74677j86494
60001A0319727j96145k03727k09716k13889k15242k12707k05770j94896j81463
59992H486172j66635j50184j31147j09699q7397o5455m3783k2096q42J9708M0446
59981G769088O2493Q5412J06912J24469J37191J46089J52312J55195J52628J43558
59971I035347J29251J11462R0400O5585L7739Q449k1447n1499q0202j05699j27875
59960I091511j47942j65832j79583j87448j89096j84701j74631j60454j44393
59951G557431j27093j07434q5227o2367m0435j8641M562K8958N2958P5661R7355
$$ y = [10805052, 10811916, 10844780, 10898579, 10968153, 11048499, 11133810, 11216847, 11290033, 11347021, 11383282, 11396262, 11385661, 11352566, 11297234, 11218203, 11114434, 10987735, 10842067, 10680898, 10506221, 10319727, 10123582, 9919855, 9710139, 9496250, 9281008, 9068301, 8862531, 8667635, 8486172, 8319537, 8169353, 8038206, 7928507, 7841110, 7775655, 7731872, 7709776, 7708934, 7728642, 7769088, 7831581, 7916993, 8023905, 8148374, 8285565, 8431654, 8583966, 8739161, 8891789, 9035347, 9164598, 9276060, 9366460, 9432045, 9469784, 9478233, 9456786, 9405287, 9325085, 9219386, 9091511, 8943569, 8777737, 8598154, 8410706, 8221610, 8036909, 7862278, 7701824, 7557431, 7430338, 7322904, 7237677, 7175310, 7134875, 7116234, 7120796, 7149754, 7202712, 7278373, 7375728]
59940G375728J18447J38933J58755J77954J96452K13637K27794K36154K36593
59931I080447K29430K16648J99134J75813J45927J10983P3844L6606q0l6238p1546
59920A0160968j04592j33208j56143j74045j87637j95349j94391j84246j67505
59911H663852j47110j24586j01197p8342n5751l1359m474K2481M6764O8297Q8394
59900H346969J07111J23759J38687J52293J63032J68745J69702J68251J65390
59891I703939J59674J50029J37968J26202J16095J07167R8420Q9554Q1383P5515
59881A0845946P3423P5605Q1858R2253J07353J27495J52190J80503K11718K45616
59871A2193960K82085L20484L59307L96621M30667M59868M82413M96279M99614
$$ y = [7375728, 7494175, 7633108, 7791863, 7969817, 8166269, 8379906, 8607700, 8843854, 9080447, 9309877, 9526525, 9725659, 9901472, 10047399, 10158382, 10232226, 10268832, 10268752, 10232514, 10160968, 10056376, 9923168, 9767025, 9592980, 9405343, 9209994, 9015603, 8831357, 8663852, 8516742, 8392156, 8290959, 8212617, 8156866, 8125507, 8121033, 8143514, 8190278, 8258575, 8346969, 8454080, 8577839, 8716526, 8868819, 9031851, 9200596, 9370298, 9538549, 9703939, 9863613, 10013642, 10151610, 10277812, 10393907, 10501074, 10599494, 10689048, 10770431, 10845946, 10919369, 10994974, 11076832, 11169085, 11276438, 11403933, 11556123, 11736626, 11948344, 12193960, 12476045, 12796529, 13155836, 13552457, 13983124, 14442992, 14925405, 15421684, 15921298]
59862A5921298M90547M66654M25418L65705K88710J97573R6656q830j13259k11246
59852A7919226k98141l70518m26916m67868m94332n06292n03749m88690m64674
59843A3898046m34392l98896l59240l17298k74331k30314j85484j41342r9198
59834A1457551n8752j9135J9357N5504Q8421J17645J42458J61923J75235J81480
59824A2321687J79447J68122J46973J15565P3851K3321l2767r0889j48410k03069
59814A2553831k52336k93998l26823l50451l65349l73130l75725l73743l66669
59805I475607l55012l40815l25392l08005k87845k65950k43831k21430j98019
59796F929308j74206j51351j29514j07825q6789o8670n5123m5405l7379k9714
$$ y = [15921298, 16411845, 16878499, 17303917, 17669622, 17958332, 18155905, 18252561, 18243731, 18130472, 17919226, 17621085, 17250567, 16823651, 16355783, 15861451, 15355159, 14851410, 14362720, 13898046, 13463654, 13064758, 12705518, 12388220, 12113889, 11883575, 11698091, 11556749, 11457551, 11398799, 11379664, 11399021, 11454525, 11542946, 11660591, 11803049, 11964972, 12140207, 12321687, 12501134, 12669256, 12816229, 12931794, 13005645, 13028966, 12996199, 12905310, 12756900, 12553831, 12301495, 12007497, 11680674, 11330223, 10964874, 10591744, 10216019, 9842276, 9475607, 9120595, 8779780, 8454388, 8146383, 7858538, 7592588, 7348757, 7127327, 6929308, 6755102, 6603751, 6474237, 6366412, 6279623, 6210953, 6155830, 6110425, 6073046, 6043332]
59786F043332k2881j8202j6019j4936j3191j0532p863n143j009N022J1210J5244
59774E965032J6154J3845Q059r52j1533k1757l1046l9875m8506n6836o4657p1084
59762E656844p4606p4664p2488o9422o5269n9461n2927m7411m3433m0188l6872
59751E020103l2871k7151j8841q239L700J6352K9088M0755N0691N9501O7580P3776
59739E274444P6987P8155P8803P8272P4518O7419N9319N2211M6327M1565L8311
59728E966331L6451L5506L6341M0981M9900O1122P2990Q6324J02660J21528J41017
59717F751151J60380J80702K03189K27889K54127K81377L09459L38380L68211
59708I074865L98805M29141M56629M76971M84726M74110M39497L76527K84685
$$ y = [6043332, 6020451, 6002249, 5986230, 5971294, 5958103, 5947571, 5939708, 5934565, 5933556, 5938578, 5949788, 5965032, 5981186, 5995031, 6003090, 6002138, 5990605, 5968848, 5937802, 5897927, 5849421, 5792585, 5727928, 5656844, 5582238, 5507574, 5435086, 5365664, 5300395, 5240934, 5188007, 5140596, 5097163, 5056975, 5020103, 4987232, 4960081, 4941240, 4933001, 4936701, 4953053, 4982141, 5022896, 5073587, 5133088, 5200668, 5274444, 5351431, 5429586, 5508389, 5586661, 5661179, 5728598, 5787917, 5840128, 5886455, 5928020, 5966331, 6002782, 6038288, 6074629, 6115610, 6165510, 6226632, 6299622, 6385946, 6488606, 6610134, 6751151, 6911531, 7092233, 7295422, 7523311, 7777438, 8058815, 8368274, 8706654, 9074865, 9473670, 9902811, 10359440, 10836411, 11321137, 11795247, 12234744, 12611271, 12895956]
59699A2895956J70126M5321p5123j79074k58698l10504l35706l39764l29373l08897
59689A0974264k80082k44689k06016j67581j31297r7262o4693l2801j294K9633
59679I778182N9786Q9156J17457J44197J69796J95914K23793K52858K81971L11462
59669A1624572L42787L76486M11919M48762M87465N28192N70734O15499O63300
59660A6069716P13829P65556Q17367Q69049R19715R67049J008772J043714J070608
59651B4245375J086849J089629J077961J053007J017168R73940R28211Q85303
59643C2357443Q49035Q20848Q00576P87289P78986P71932P61031P41277P09083
59634C9377500O62549O00973N24540M34477L33445K25898J18000J6404p3808j49851
$$ y = [12895956, 13066082, 13111403, 13036280, 12857206, 12598508, 12288004, 11952298, 11612534, 11283161, 10974264, 10694182, 10449493, 10243477, 10075896, 9944599, 9847337, 9782644, 9749843, 9748549, 9778182, 9837968, 9927124, 10044581, 10188778, 10358574, 10554488, 10778281, 11031139, 11313110, 11624572, 11967359, 12343845, 12755764, 13204526, 13691991, 14220183, 14790917, 15406416, 16069716, 16783545, 17549101, 18366468, 19235517, 20155232, 21122281, 22131053, 23174767, 24245375, 25332224, 26421853, 27499814, 28552821, 29569989, 30543929, 31472140, 32357443, 33206478, 34027326, 34827902, 35615191, 36394177, 37166109, 37927140, 38668417, 39377500, 40040049, 40641022, 41165562, 41600039, 41933484, 42159382, 42277382, 42293786, 42219978, 42070127]
59624D2070127k09571k49683k67131k62230k38960k01568j51775q9691j5954O7936
59614D0451500J60234K58618L60060M62095N63616O63521P59354Q48054R26652
59605D5453704R90494J031689J041426J013763R45701Q34218O75860M70498K24502
59596E2681855n0070l38282o24125q91628j126555j318279j460863j553317j599038
59587D3719698j604225j576027j521577j447924j362010j270708j181170j100901
59579C2655156j037238r96877r85158j003452j045462j097084j142268j170183
59571B4177434j177238j164078j132676j086014j028170r63419q95423q27205
59563A5903211p61061o98305o39423n84335n32379m82943m36836l96007l60983
$$ y = [42070127, 41860556, 41610873, 41343742, 41081512, 40842552, 40640984, 40489209, 40399518, 40383564, 40451500, 40611734, 40870352, 41230412, 41692507, 42256123, 42919644, 43678998, 44527052, 45453704, 46444198, 47475887, 48517313, 49531076, 50476777, 51310995, 51986855, 52457353, 52681855, 52631785, 52293503, 51669378, 50777750, 49651195, 48332916, 46872053, 45318736, 43719698, 42115473, 40539446, 39017869, 37569945, 36207935, 34937227, 33756057, 32655156, 31617918, 30621041, 29635883, 28632431, 27586969, 26489885, 25347617, 24177434, 23000196, 21836118, 20703442, 19617428, 18589258, 17625839, 16730416, 15903211, 15142150, 14443845, 13804422, 13220087, 12687708, 12204765, 11767929, 11371922, 11010939]
59554A1010939l29573k99320k70279k43982k20746j99965j82212j68697j58809
59545H937356j50425j42911j37761j35940j36403j37851j40196j43398j46331
59536G666140j47743j47518j46177j43800j39905j34007j26185j17419j08973
59527F454413j00866r1648q0561o9092n9066n0186m1154l2251k4666j7867j0154
59516E876902j611O070J2727K0030K8256L5525M1092M6702N3552O0329O5767P0768
59504F316109P6334Q1497Q5423Q9812R7038J07027J17965J29065J40514J51649
59494G392433J61645J71919J85539K03561K23416K41665K57507K72888K89845
59485I400418L08537L27678L46002L62507L75671L83785L86686L85929L82281
$$ y = [11010939, 10681366, 10382046, 10111767, 9867785, 9647039, 9447074, 9264862, 9096165, 8937356, 8786931, 8644020, 8506259, 8370319, 8233916, 8096065, 7955869, 7812471, 7666140, 7518397, 7370879, 7224702, 7080902, 6940997, 6806990, 6680805, 6563386, 6454413, 6353547, 6261899, 6181338, 6112246, 6053180, 6002994, 5961840, 5929589, 5904923, 5887056, 5876902, 5875291, 5881361, 5894088, 5914118, 5942374, 5977899, 6018991, 6065693, 6119245, 6179574, 6245341, 6316109, 6392443, 6473940, 6559363, 6649175, 6746213, 6853240, 6971205, 7100270, 7240784, 7392433, 7554078, 7725997, 7911536, 8115097, 8338513, 8580178, 8837685, 9110573, 9400418, 9708955, 10036633, 10382635, 10745142, 11120813, 11504598, 11891284, 12277213, 12659494]
59476A2659494L74149L59857L40203L16600K87742K51232K08526J65170J25219
59467A5088192Q8286N3189K1503m679k6061m4451n9120o7302o7568o0665m7631
59456A4873693k9018n632K1735N3022Q8096J25334J61966J95152K21625K37090
59446A5943063K37745K22392J91987J47570Q9804K0280n7951j41099k24959l04964
59436A6123868l76950m38036m86251n19883n38153n42207n34378n16644m90427
59427A1680939m57569m20586l81875l43135l05279k68438k32393j97389j64071
59418H910204j32450j01681p1431m2575j5766R903L5955O2822Q9873J16439J42042
59407I003335J66154J88542K09393K28429K44459K56397K63949K66486K62166
$$ y = [12659494, 13033643, 13393500, 13733703, 14050303, 14338045, 14589277, 14797803, 14962973, 15088192, 15176478, 15229667, 15251170, 15246491, 15220430, 15175979, 15116859, 15049557, 14981989, 14921324, 14873693, 14844675, 14839043, 14860778, 14913800, 15001896, 15127230, 15289196, 15484348, 15705973, 15943063, 16180808, 16403200, 16595187, 16742757, 16832561, 16852841, 16794890, 16653791, 16428832, 16123868, 15746918, 15308882, 14822631, 14302748, 13764595, 13222388, 12688010, 12171366, 11680939, 11223370, 10802784, 10420909, 10077774, 9772495, 9504057, 9271664, 9074275, 8910204, 8777754, 8676073, 8604642, 8562067, 8546301, 8556204, 8592159, 8654981, 8744854, 8861293, 9003335, 9169489, 9358031, 9567424, 9795853, 10040312, 10296709, 10560658, 10827144, 11089310]
59398A1089310K49131K26997J96318J57298J10135N6115k541o3464j23973j80938
59388A1714388k32003k76507l14283l44162l64783l76413l80671l78874l71708
59379H674984l60238l45897l29464l11035k91099k70864k51434k33221k15952
59370F065780j98786j80906j62634j45553j30822j17882j05510r3432q1878p0269
59360D778108n7761m4957l3688k4831j7323r520q87P871J5821K2912L0265L8895
59348D704905M7626N2789N1109M3045L2947K5967K4909K9309L6672M4893N4076
59337E148247O5714P9752R3213J02543J06839J07965J08276J09508J13549J22490
59327F158096J37019J55355J74453J92395K09682K28438K50285K74877L00650
$$ y = [11089310, 11338441, 11565438, 11761756, 11919054, 12029189, 12085304, 12082763, 12019299, 11895326, 11714388, 11482385, 11205878, 10891595, 10547433, 10182650, 9806237, 9425566, 9046692, 8674984, 8314746, 7968849, 7639385, 7328350, 7037251, 6766387, 6514953, 6281732, 6065780, 5866994, 5686088, 5523454, 5377901, 5247079, 5129197, 5023687, 4930255, 4848377, 4778108, 4720347, 4675390, 4641702, 4616871, 4599548, 4590028, 4589141, 4597012, 4612833, 4635745, 4666010, 4704905, 4752531, 4805320, 4856429, 4899474, 4932421, 4958388, 4983297, 5012606, 5049278, 5094171, 5148247, 5213961, 5293713, 5386926, 5489469, 5596308, 5704273, 5812549, 5922057, 6035606, 6158096, 6295115, 6450470, 6624923, 6817318, 7027000, 7255438, 7505723, 7780600, 8081250]
59318H081250L26815L54093L83451M15005M48478M83965N21555N60795O01033
59309A2176440O41928O83044P23312P60888P92902Q15255Q23809Q16626P94649
59300A9028853P60169P15495O63198O06247N47084M87417M29212L74404L22992
59291B3935071K72770K21843J70046J16975O0233k926p3471j51233k35994l26055
59281B3987259m16890n03322n82404o52696p11922p57689p89933q10364q19588
59272A7942451q16843q02596p79523p50438p16703o78877o37788n94751n51627
59263A1613305n10347m71374m33235l94961l58383l26118k97734k69927k40667
59254H310559k11245j84045j60150j39531j21651j04984q7566o9128n1581l6532
$$ y = [8081250, 8408065, 8762158, 9145609, 9560614, 10009092, 10493057, 11014612, 11575407, 12176440, 12818368, 13501412, 14224724, 14985612, 15778514, 16593769, 17417578, 18234204, 19028853, 19789022, 20504517, 21167715, 21773962, 22321046, 22808463, 23237675, 23612079, 23935071, 24207841, 24429684, 24599730, 24716705, 24776938, 24774012, 24700541, 24549308, 24313314, 23987259, 23570369, 23067047, 22484643, 21831947, 21120025, 20362336, 19572403, 18762039, 17942451, 17125608, 16323012, 15543489, 14793051, 14076348, 13397471, 12759683, 12164932, 11613305, 11102958, 10631584, 10198349, 9803388, 9445005, 9118887, 8821153, 8551226, 8310559, 8099314, 7915269, 7755119, 7615588, 7493937, 7388953, 7301387, 7232259, 7180678, 7144146]
59244G144146k3299j0131L577J7150K9900M1653N2523O2879P3157Q3118R1660
59233G566333R7871J02083J05419J08451J10554J10598J08116J03890R9346R5472
59223H608133R2488R0431Q9450Q9385Q9730R0491R2535R6578J02189J07980J12264
59212I661654J13325J10124J03429R5523Q8088Q0652P1538N9522M4314K6289O283
59201A0460741j5167l8576o4234r0020j12316j29649j43418j54053j59055j56638
59191I397615j49062j39875j29598j16746j01610q6005p0326n3912l7712k3638
59181H489131j1592l6J0725J8774K4034K8409L2259L3756L2441L0618L0311L1316
59169H750146L3184L6673M2098M8586N6276O7209Q2707J01677J22795J46656J74370
$$ y = [7144146, 7120847, 7110716, 7114293, 7131443, 7161343, 7202996, 7255519, 7318398, 7391555, 7474673, 7566333, 7664204, 7766287, 7871706, 7980157, 8090711, 8201309, 8309425, 8413315, 8512661, 8608133, 8700621, 8791052, 8880502, 8969887, 9059617, 9150108, 9242643, 9339221, 9441410, 9549390, 9661654, 9774979, 9885103, 9988532, 10084055, 10172143, 10252795, 10324333, 10383855, 10428169, 10454458, 10460741, 10445574, 10406998, 10342764, 10252744, 10140428, 10010779, 9867361, 9713308, 9554253, 9397615, 9248553, 9108678, 8979080, 8862334, 8760724, 8674719, 8604393, 8550481, 8512769, 8489131, 8477539, 8477503, 8488228, 8507002, 8531036, 8559445, 8591704, 8625460, 8657901, 8688519, 8718830, 8750146, 8783330, 8820003, 8862101, 8910687, 8966963, 9034172, 9116879, 9218556, 9341351, 9488007, 9662377]
59158I662377K05487K38618K72921L07834L42339L75246M05053M28974M43602
59149A2682451M47046M38914M17628L79885L23968K52068J68141P5247k3879j25290
59139A5036179k24619l18166m02007m71482n23351n57561n75733n79087n69266
59130A0814907n49717n24180m94339m60668m24994l90330l58400l28831l00930
59121F982518k75131k52505k33664k18088k04038j89550j74236j59609j46983
59112E128714j35693j24196j12277j01031r0920q1035p0385n9144m8422l9179
59102D266432l1442k4402j7279j0083l104L990J1812J9989K7299L3313L8936M4918
59090D360379N0924N6513O2083O8122P4399Q0553Q6647R2583R7943J02984J08682
$$ y = [9662377, 9867864, 10106482, 10379403, 10687237, 11029576, 11404822, 11809875, 12238849, 12682451, 13129497, 13568411, 13986039, 14365924, 14689892, 14941960, 15110101, 15185348, 15161469, 15036179, 14811560, 14493394, 14091387, 13619905, 13096554, 12538993, 11963260, 11384173, 10814907, 10265190, 9741010, 9246671, 8786003, 8361009, 7970679, 7612279, 7283448, 6982518, 6707387, 6454882, 6221218, 6003130, 5799092, 5609542, 5435306, 5275697, 5128714, 4993021, 4868825, 4756548, 4655517, 4564597, 4483562, 4413177, 4354033, 4305611, 4266432, 4234990, 4210588, 4193309, 4183226, 4180122, 4184112, 4195924, 4215913, 4243212, 4276525, 4315461, 4360379, 4411303, 4467816, 4529899, 4598021, 4672420, 4752973, 4839620, 4932203, 5030146, 5133130, 5241812]
59079E241812J14978J20084J22641J23517J24326J24970J23912J20288J14437
59070F330965J06816R7752Q7965P8192O8327N7891M7098L6524K6265J6617R344
59059F963756O613Q412J2203J5630J8712K2996K9618L8705M9827O2073P4231Q5734
59047G388510R7317J09987J23561J36814J49111J61017J73121J85002J95941K06086
59037H926467K16040K25457K32757K36251K34887K27968K14823J94927J67740
59028A0877317J32637Q9959M2206o945n5115j01619j45170j82913k12801k35602
59018A0201954k53301k66618k75550k81154k84911k86912k86405k83810k80408
59009G702885k76271k70297k62414k54155k46692k39536k31503k22015k11312
$$ y = [5241812, 5356790, 5476874, 5599515, 5723032, 5847358, 5972328, 6096240, 6216528, 6330965, 6437781, 6535533, 6623498, 6701690, 6770017, 6827908, 6875006, 6911530, 6937795, 6954412, 6963756, 6970369, 6978781, 6990984, 7006614, 7025326, 7048322, 7077940, 7116645, 7166472, 7228545, 7302776, 7388510, 7485827, 7595814, 7719375, 7856189, 8005300, 8166317, 8339438, 8524440, 8720381, 8926467, 9142507, 9367964, 9600721, 9836972, 10071859, 10299827, 10514650, 10709577, 10877317, 11009954, 11099913, 11142119, 11135174, 11080059, 10978440, 10833270, 10650357, 10437556, 10201954, 9948653, 9682035, 9406485, 9125331, 8840420, 8553508, 8267103, 7983293, 7702885, 7426614, 7156317, 6893903, 6639748, 6393056, 6153520, 5922017, 5700002, 5488690]
59000E488690k00354j90411j81865j73592j64367j54553j45403j37327j29944
58991D010874j23103j16473j08848r9607r0309q3078p7873p3082o8213o3914n9878
58980C046496n5243n0762m8078m6801m4843m1740l8873l6200l1722k5053j8664
58969B608517j4393j1246p846m531j719J335M572O372O538P646J1384J5572J7213
58956B639414J6674J6505J7420J8200J8527J9318K0532K0952K0221J9243J8356
58945B845362J6602J3174Q659M425J240j406m736r149j3443j6127j7242j7848
58933B809511j8013j6945j5067j3959j3731j2360q542l450J195N104Q451J0712
58921B732906J1780J2788J4583J6578J8086J9317K0178J9741J8011J6612J6501
$$ y = [5488690, 5288336, 5097925, 4916060, 4742468, 4578101, 4423548, 4278145, 4140818, 4010874, 3887771, 3771298, 3662450, 3562843, 3472534, 3389456, 3311583, 3238501, 3170288, 3106374, 3046496, 2991253, 2940491, 2892413, 2845612, 2800769, 2759029, 2720156, 2683956, 2652234, 2627181, 2608517, 2594124, 2582878, 2575032, 2570501, 2568782, 2570117, 2574689, 2581061, 2587599, 2595245, 2606629, 2622201, 2639414, 2656088, 2672593, 2690013, 2708213, 2726740, 2746058, 2766590, 2787542, 2807763, 2827006, 2845362, 2861964, 2875138, 2883797, 2888222, 2889462, 2888056, 2883320, 2874171, 2860728, 2844601, 2827359, 2809511, 2791498, 2774553, 2759486, 2745527, 2731796, 2719436, 2710894, 2707444, 2708639, 2713743, 2722194, 2732906, 2744686, 2757474, 2772057, 2788635, 2806721, 2826038, 2846216, 2865957, 2883968, 2900580, 2917081]
58910B917081J6733J6735J7853K1029K4720K7011K8382L0491L3451L6136L8088
58899C207710L9498M0353M1181M3344M6944M9735N0028M9471N1035N5196O0037
58888C734532O4283O8404P3349P9806Q7910R6242J02219J05122J07756J13326
58878D632949J21652J30180J37610J44661J52135J60341J69796J80659J91934
58869F021917K02800K13972K26372K39535K53021K68131K86093L05545L24083
58860H341469L41544L59540L78588L98242M19645M45190M75394N08184N41568
58851A2209364N75348O10146O46305O83756P21670P58378P92859Q25601Q56427
58842A8679854Q82062Q97661R00369Q89566Q64012Q20648P56293O69172N59250
$$ y = [2917081, 2933814, 2950549, 2968402, 2989431, 3014151, 3041162, 3069544, 3100035, 3133486, 3169622, 3207710, 3247208, 3287561, 3328742, 3372086, 3419030, 3468765, 3518793, 3568264, 3619299, 3674495, 3734532, 3798815, 3867219, 3940568, 4020374, 4108284, 4204526, 4306745, 4411867, 4519623, 4632949, 4754601, 4884781, 5022391, 5167052, 5319187, 5479528, 5649324, 5829983, 6021917, 6224717, 6438689, 6665061, 6904596, 7157617, 7425748, 7711841, 8017386, 8341469, 8683013, 9042553, 9421141, 9819383, 10239028, 10684218, 11159612, 11667796, 12209364, 12784712, 13394858, 14041163, 14724919, 15446589, 16204967, 16997826, 17823427, 18679854, 19561916, 20459577, 21359946, 22249512, 23113524, 23934172, 24690465, 25359637, 25918887]
58833B5918887M28816K82682J26433l5195j97123l52274m93195o15154p16182
58824B4347695p95029q51212q86630r04731r07826q96822q73445q41033q03046
58815A6587921p62203p20637o79352o37903n96229n56308n20417m88256m57765
58806A1168851m28364m01300l77045l54350l32043l10065k88642k67909k48296
58797H160837k29998k12351j94949j78715j64449j51055j36975j22669j09822
58788F659854r8727q8257p7781o7203n5945m3829l2165k1817j1157J639J5318
58777F179930K7250L7637M8903O1338P2641Q1896R0907J01217J12595J24871J38540
58766G077725J53068J67054J80485J94552K09190K23442K38237K55792K75925
$$ y = [25918887, 26347703, 26630385, 26756818, 26721623, 26524500, 26172226, 25679031, 25063877, 24347695, 23552666, 22701454, 21814824, 20910093, 20002267, 19105445, 18232000, 17390967, 16587921, 15825718, 15105081, 14425729, 13787826, 13191597, 12635289, 12114872, 11626616, 11168851, 10740487, 10339187, 9962142, 9607792, 9275749, 8965684, 8677042, 8409133, 8160837, 7930839, 7718488, 7523539, 7344824, 7180375, 7029320, 6892345, 6769676, 6659854, 6561127, 6472870, 6395089, 6327886, 6271941, 6228112, 6195947, 6174130, 6162973, 6164612, 6179930, 6207180, 6244817, 6293720, 6355058, 6427699, 6509595, 6600502, 6701719, 6814314, 6939185, 7077725, 7230793, 7397847, 7578332, 7772884, 7982074, 8205516, 8443753, 8699545, 8975470]
58757H975470K96123L15760L36976L60677L85150M09896M37240M68401N01153
58748A2486846N33659N67805O06078O47293O88024P26538P62650P95050Q21401
58739A8635344Q40453Q51649Q52755Q39565Q08009P55525O80777N83388M64343
58730B5311808L26435J74477J4953j45371l00743m46007n75642o84904p72048
58721B2902958q38029q84004r10596r19558r14155q97327q71043q37851q01217
58712A5029178p63550p25306o86513o47713o09143n70775n33676m99561m68417
58703I524524m38416m08812l80990l55913l32649l10531k90689k73871k58450
58694F474203k42378k25927k10775j97254j84159j70742j57583j45561j34937
$$ y = [8975470, 9271593, 9587353, 9924329, 10285006, 10670156, 11080052, 11517292, 11985693, 12486846, 13020505, 13588310, 14194388, 14841681, 15529705, 16256243, 17018893, 17813943, 18635344, 19475797, 20327446, 21180201, 22019766, 22827775, 23583300, 24264077, 24847465, 25311808, 25638243, 25812720, 25827673, 25682302, 25381559, 24935552, 24359910, 23675006, 22902958, 22064929, 21180925, 20270329, 19350771, 18436616, 17539289, 16668246, 15830395, 15029178, 14265628, 13540322, 12853809, 12206096, 11596953, 11026178, 10492502, 9992941, 9524524, 9086108, 8677296, 8296306, 7940393, 7607744, 7297213, 7006524, 6732653, 6474203, 6231825, 6005898, 5795123, 5597869, 5413710, 5242968, 5085385, 4939824, 4804887]
58685D804887j25404j16551j08241j00675r3854q7291q0785p4925p0073o5388
58675C881700o0038n4802n1101m8851m6806m4518m2365m0171l7710l6097l6538
58664C382703l8091l8923l9479m1817m5902m9447n1569n3715n6392n8074n8269
58653B851025n8702o0002n9994n7088n3089n0732n0135m9363m7063m3045l7657
58642B284155l2017k7755k5381k3836k2209k0604j9107j7656j7382j9973k4972
58631B033263k9675l2501l4444l6431l7614l7293l6323l5209l2994k9362k5750
58620A665667k2944j9655j5082j0936r023q453p123m516j444J722M836P161Q236
58607A588446Q667Q971Q624P197N130K740j31k845m114m271n417q263j0845j1473
$$ y = [4804887, 4679483, 4562932, 4454691, 4354016, 4260162, 4172871, 4092086, 4017161, 3947088, 3881700, 3821662, 3766860, 3715759, 3666908, 3620102, 3575584, 3533219, 3493048, 3455338, 3419241, 3382703, 3344612, 3305689, 3266210, 3224393, 3178491, 3129044, 3077475, 3023760, 2967368, 2909294, 2851025, 2792323, 2732321, 2672327, 2615239, 2562150, 2511418, 2461283, 2411920, 2364857, 2321812, 2284155, 2252138, 2224383, 2199002, 2175166, 2152957, 2132353, 2113246, 2095590, 2078208, 2058235, 2033263, 2003588, 1971087, 1936643, 1900212, 1862598, 1825305, 1788982, 1753773, 1720779, 1691417, 1665667, 1642723, 1623068, 1607986, 1597050, 1588027, 1579574, 1572451, 1567935, 1566491, 1568213, 1573049, 1580210, 1588446, 1597113, 1606084, 1614708, 1621905, 1627035, 1629775, 1629644, 1626799, 1622685, 1618414, 1612997, 1604734, 1593889, 1582416]
58593A582416j0950j0467r460p215m789l437k590j106Q77K853N340Q847J2664
58580A562983J6020J9206K2439K5078K6996K9197L1968L4126L5298L6929L9881
58569A880121M2916M5042M7307N0697N4293N7348O1194O7024P3531P8897Q3605
58558B541975Q9137R5298J01141J07330J15414J25498J36512J48013J60160J72652
58548C793130J85152J97962K10983K23040K33300K42284K50255K55748K56630
58539E848484K51366K38444K16333J85181J47010J03272N4150J296n1041r9085
58529F895410j41719j78328k06960k26644k39181k46441k47864k42851k33604
58520D931818k23072k11678j98450j83957j69722j55992j42276j28964j16529
$$ y = [1582416, 1571466, 1560999, 1551539, 1544324, 1539535, 1536098, 1533508, 1532402, 1533279, 1536132, 1541472, 1550319, 1562983, 1579003, 1598209, 1620648, 1645726, 1672722, 1701919, 1733887, 1768013, 1803311, 1840240, 1880121, 1923037, 1968079, 2015386, 2066083, 2120376, 2177724, 2238918, 2305942, 2379473, 2458370, 2541975, 2631112, 2726410, 2827551, 2934881, 3050295, 3175793, 3312305, 3460318, 3620478, 3793130, 3978282, 4176244, 4387227, 4610267, 4843567, 5085851, 5336106, 5591854, 5848484, 6099850, 6338294, 6554627, 6739808, 6886818, 6990090, 7044240, 7045536, 6994495, 6895410, 6753691, 6575363, 6368403, 6141759, 5902578, 5656137, 5408273, 5165422, 4931818, 4708746, 4497068, 4298618, 4114661, 3944939, 3788947, 3646671, 3517707, 3401178]
58511C401178j04484r2961q3690p7470p2346o6411o0777n7398n5578n3083m9483
58500B627497m5976m2968m0071l7538l5623l3636l1355l0169l0991l2532l3559
58489B233079l5063l8102m1153m2130m1505m0904l9934l7118l2981k9616k7815
58478A826758k6657k5222k2949j9353j5112j2290j1814j2086j1629j1341j2410
58467A645895j3932j4609j4914j5505j5543j4820j5412j8515k1763k2384k1107
58456A457391k0110j9083j6567j3446j1732j1171j0217r128r047r198q080o326
58444A313286n513n234m213l163l557m721m951m509m708n192m828m095l914l510
58430A251178k003o69p72r82K07J389Q31J01J449L457L334J983K475M636N535
$$ y = [3401178, 3296694, 3203733, 3120043, 3042573, 2970227, 2903816, 2843039, 2785641, 2730063, 2676980, 2627497, 2581521, 2538553, 2498482, 2460944, 2425321, 2391685, 2360330, 2330161, 2299170, 2266638, 2233079, 2198016, 2159914, 2118761, 2076631, 2035126, 1994222, 1954288, 1917170, 1884189, 1854573, 1826758, 1800101, 1774879, 1751930, 1732577, 1717465, 1705175, 1693361, 1681275, 1669646, 1658305, 1645895, 1631963, 1617354, 1602440, 1586935, 1571392, 1556572, 1541160, 1522645, 1500882, 1478498, 1457391, 1437281, 1418198, 1401631, 1388185, 1376453, 1365282, 1355065, 1345937, 1336890, 1327692, 1319612, 1313286, 1307773, 1302539, 1298326, 1295163, 1291606, 1286885, 1281934, 1277425, 1272717, 1267525, 1262697, 1258602, 1254688, 1251178, 1249175, 1248506, 1247734, 1246752, 1246959, 1248348, 1249179, 1249280, 1250729, 1254186, 1257520, 1259503, 1261978, 1266614, 1272149]
58415A272149M665M305N074N127L793K415J530M32n27l15K96o35l320o484r699
58400A278806j2971j5084j5067j4122j3501j2192r499p744q901j0665r794p319
58388A141947o257o159m716k928l378m623k791J861N281O071O405O760N203K281
58374A144957J382L413N618O451P220Q330Q175O578N373M914L725J986J499J969
58360A211590J191o74r96Q97K918M048N233O426O549O396P708R515R351P813P673
58345A285638Q767Q285O146N338O651P568O815N686M550K347j57q75k73o70j893
58330A343923k021j881l827o415n768k272l31j071j030J222L001L249M652Q310
58316A339741J1409J2047J1862J2318J2649J2575J2853J2422R487O030O337J0322
$$ y = [1272149, 1276814, 1281119, 1286193, 1291320, 1295113, 1297528, 1299058, 1299490, 1298963, 1298648, 1298944, 1298309, 1294989, 1288505, 1278806, 1265835, 1250751, 1235684, 1221562, 1208061, 1195869, 1186370, 1178626, 1169725, 1159060, 1149266, 1141947, 1135690, 1129531, 1124815, 1121887, 1118509, 1113886, 1111095, 1112956, 1118237, 1124308, 1130713, 1137473, 1142676, 1144957, 1146339, 1149752, 1155370, 1161821, 1169041, 1177371, 1185546, 1192124, 1197497, 1202411, 1206136, 1208122, 1209621, 1211590, 1212781, 1212107, 1211111, 1212008, 1214926, 1218974, 1224207, 1230633, 1237182, 1243578, 1251286, 1260801, 1270152, 1277965, 1285638, 1294405, 1302690, 1308836, 1314174, 1320825, 1328393, 1335208, 1340894, 1345444, 1347791, 1347634, 1346759, 1346486, 1345816, 1343923, 1341902, 1340021, 1336194, 1329779, 1324011, 1321739, 1321408, 1320337, 1319307, 1320529, 1323530, 1326779, 1331431, 1339741, 1351150, 1363197, 1375059, 1387377, 1400026, 1412601, 1425454, 1437876, 1447363, 1453393, 1459730, 1470052]
58304A470052J3316J3175J2494J2918J2703J1118J0144J0365J0001R048R692J1778
58292A606804J2826J2984J4709J7133J6521J3102J1420J2910J4134J3382J2878
58281A758803J3231J1950R037P892R032Q985O919O204P876Q925Q675J0312J4230
58268A882071J6449J5726J5854J8737K1510K2524K3931K6334K7193K6413K7099
58257B123841K9252K9369K7566K7831K9991K9373K5987K5525K9106L0963K8921
58246B437725K8111L1002L2911L1229L0163L2082L2959L0861L0318L3500L5624
58235B786485L3987L3112L6062L9098L9923M2475M8195N1524M9897M9532N5035
58224C265325O1674O4364O5883O9697P2907P3146P4516P9789Q4399Q4774Q4947
$$ y = [1470052, 1483368, 1496543, 1509037, 1521955, 1534658, 1545776, 1555920, 1566285, 1576286, 1585334, 1595026, 1606804, 1619630, 1632614, 1647323, 1664456, 1680977, 1694079, 1705499, 1718409, 1732543, 1745925, 1758803, 1772034, 1783984, 1793021, 1800913, 1809945, 1818930, 1825849, 1832053, 1839929, 1848854, 1857529, 1867841, 1882071, 1898520, 1914246, 1930100, 1948837, 1970347, 1992871, 2016802, 2043136, 2070329, 2096742, 2123841, 2153093, 2182462, 2210028, 2237859, 2267850, 2297223, 2323210, 2348735, 2377841, 2408804, 2437725, 2465836, 2496838, 2529749, 2560978, 2591141, 2623223, 2656182, 2687043, 2717361, 2750861, 2786485, 2820472, 2853584, 2889646, 2928744, 2968667, 3011142, 3059337, 3110861, 3160758, 3210290, 3265325, 3326999, 3391363, 3457246, 3526943, 3599850, 3672996, 3747512, 3827301, 3911700, 3996474, 4081421]
58213D081421Q8486R1924R2726R5494J03414J11762J16717J22215J31107J38302
58203E173568J39983J41041J45920J50892J52858J56844J66941J78832J89059
58194F595938K02413K22065K41991K57488K73408K93847L13937L30553L50162
58185I081802L76640M02315M20994M38816M62074M85876N05577N27704N58207
58176A3260005N91678O23699O61469P10072P60990Q06983Q55211R12362R70652
58167B0153121J022748J076464J139571J204596J264399J327492J401114J475018
58159C0064523J540254J607963J691000J784284J883266K002850K155265K328118
58151D5057523K508702K710342K948843L214372L495853L810927M179341M589662
$$ y = [4081421, 4169907, 4261831, 4354557, 4450051, 4553465, 4665227, 4781944, 4904159, 5035266, 5173568, 5313551, 5454592, 5600512, 5751404, 5904262, 6061106, 6228047, 6406879, 6595938, 6798351, 7020416, 7262407, 7519895, 7793303, 8087150, 8401087, 8731640, 9081802, 9458442, 9860757, 10281751, 10720567, 11182641, 11668517, 12174094, 12701798, 13260005, 13851683, 14475382, 15136851, 15846923, 16607913, 17414896, 18270107, 19182469, 20153121, 21175869, 22252333, 23391904, 24596500, 25860899, 27188391, 28589505, 30064523, 31604777, 33212740, 34903740, 36688024, 38571290, 40574140, 42729405, 45057523, 47566225, 50276567, 53225410, 56439782, 59935635, 63746562, 67925903, 72515565]
58143G2515565N029000N523897O114109O810176P617439Q571843R700301J0971874
58135A32854204J2341708J3814136J5410357J7130011J9036522K1332358K4224311
58128B56143607K7719871L1615897L5503971L8433632L8574989L3803214K3283597
58121D85078778Q642153o678423j9432018k8100995l2854243l4581926l4185938
58114C37887388l2430694k9940888k7133517k4232193k1389603j8734773j6311334
58107A67714386j4075619j1997048j0101355q397596o841238n413772m164880
58100A06722878l099719k085492j008573n8580K64582m40925k048917l936621
58092I4308633n449204o302130o575994o461923o101224n598329n049300m512085
$$ y = [72515565, 77544565, 83068462, 89182571, 95992747, 103610186, 112182029, 121882330, 132854204, 145195912, 159010048, 174420405, 191550416, 210586938, 231919296, 256143607, 283863478, 315479375, 350983346, 389416978, 427991967, 461795181, 485078778, 493720931, 487042508, 467610490, 439509495, 406655252, 372073326, 337887388, 305456694, 275515806, 248382289, 224150096, 202760493, 184025720, 167714386, 153638767, 141641719, 131540364, 123142768, 116301530, 110887758, 106722878, 103623159, 101537667, 100529094, 100470514, 100735096, 100294171, 98245254, 94308633, 88859429, 82557299, 75981305, 69519382, 63418158, 57819829, 52770529, 48258444]
58084D8258444l997993l515810l092005k737753k432979k159542j922146j724208
58076B6676008j551722j396223j268789j175416j100153j027744r63091r13485
58068A7279385q70236q23359p77792p39680p01355o54703o06247n64863n26711
58059A1014439m85512m46100m14849l87576l59519l36938l26298l21415l13233
58050G622999l03472k97302k91411k80791k69288k62269k56361k46700k36754
58041E178651k30759k24038k11101j96061j84881j74375j59252j43347j33366
58032C521471j27358j19423j10350j03975r8288q9779q1592p8280p7163p3540
58022B561723o9438o8625o8104o3524n8181n7594n9455n7963n4034n2345n2000
$$ y = [48258444, 44260451, 40744641, 37652636, 34914883, 32481904, 30322362, 28400216, 26676008, 25124286, 23728063, 22459274, 21283858, 20183705, 19155961, 18192870, 17279385, 16409149, 15585790, 14807998, 14068318, 13366963, 12712260, 12106013, 11541150, 11014439, 10528927, 10082827, 9667978, 9280402, 8920883, 8583945, 8257647, 7936232, 7622999, 7319527, 7022225, 6730814, 6450023, 6180735, 5918466, 5662105, 5415405, 5178651, 4947892, 4723854, 4512753, 4316692, 4131811, 3957436, 3798184, 3654837, 3521471, 3394113, 3274690, 3164340, 3060365, 2962077, 2872298, 2790706, 2712426, 2635263, 2561723, 2492285, 2423660, 2355556, 2292032, 2233851, 2176257, 2116802, 2058839, 2004805, 1952460, 1900460]
58011A900460m9024m4857m3774m4519m2666l8721l6336l5003l1866k8194k7034
58000A478466k6920k4646k1604k0799k0532j7671j4334j4473j6636j6718j5312
57989A268821j5652j6835j5707j3196j2449j2836j1824j0484j1233j2581j1814
57978A124210j0337j0574j0440o926k333q45j650j494j237l485o417o447m635
57965A057390m231m364k544p57k276m716l333O45J962N7r23M38J835K679M227
57950A046089N332M016K148K756M201K949L53L59K031J197j608j858R96L086L330
57935A075377M437O787P857Q030J0728J6062J9983K0458J9202J7107J3149Q053
57923A227230L941K91m845r923j1669j1166j2493j5432j5673j2501j0020r854
$$ y = [1900460, 1851436, 1806579, 1762805, 1718286, 1675620, 1636899, 1600563, 1565560, 1533694, 1505500, 1478466, 1451546, 1426900, 1405296, 1384497, 1363965, 1346294, 1331960, 1317487, 1300851, 1284133, 1268821, 1253169, 1236334, 1220627, 1207431, 1194982, 1182146, 1170322, 1159838, 1148605, 1136024, 1124210, 1113873, 1103299, 1092859, 1085933, 1083600, 1082755, 1081105, 1079611, 1078374, 1074889, 1068472, 1062025, 1057390, 1053159, 1048795, 1046251, 1045494, 1043218, 1038502, 1035169, 1035814, 1037776, 1037833, 1036910, 1037348, 1039183, 1041862, 1046089, 1051421, 1055437, 1057585, 1060341, 1064542, 1067491, 1067844, 1068203, 1070234, 1071431, 1069823, 1067965, 1068961, 1072047, 1075377, 1079814, 1086601, 1094458, 1102488, 1113216, 1129278, 1149261, 1169719, 1188921, 1206028, 1219177, 1227230, 1231171, 1231462, 1226617, 1216694, 1205025, 1193859, 1181366, 1165934, 1150261, 1137760, 1127740, 1117886]
57911A117886q761m939j012R57K369M231N181N105O364R728J2902J4402J5207
57898A179620J5713J4920J3380J2932J2754R813M012j284m653q222j2957j6631
57886A219397j7853j8076j8177j6849j3866j1370j0467r618p584n027k446M20
57874A088484K520K132R7q19j44J38l25J20J056l30m633r194j2497j5789j9497
57859A031319k1971k2870k3957k5460k5324k3210k1503k1087j9944j7157j4584
57848G94252j3110j1009p692n346n023m520k087Q02K301K974L918M802N343O255
57834G71860P348P170N662M556M322L593K290K052K619J376k245n455o702p905
57820G90541j0240j1447r758p295o902q111q796q514p837o421m062k001j244j115
$$ y = [1117886, 1109125, 1104186, 1103174, 1104131, 1106500, 1110731, 1115912, 1121017, 1127381, 1137109, 1150011, 1164413, 1179620, 1195333, 1210253, 1223633, 1236565, 1249319, 1259132, 1263144, 1261860, 1257207, 1248985, 1236028, 1219397, 1201544, 1183468, 1165291, 1148442, 1134576, 1123206, 1112739, 1103121, 1095537, 1090510, 1088064, 1088484, 1091004, 1093136, 1093233, 1092414, 1092270, 1092408, 1092083, 1092203, 1093259, 1092929, 1088296, 1079102, 1066605, 1050816, 1031319, 1009348, 986478, 962521, 937061, 911737, 888527, 867024, 845937, 825993, 808836, 794252, 781142, 770133, 762441, 757095, 752072, 747552, 745465, 746267, 748568, 751542, 755460, 760262, 765605, 771860, 779208, 786378, 792040, 796596, 800918, 804511, 806801, 808853, 811472, 812848, 810603, 805148, 798446, 790541, 780301, 768854, 759096, 751801, 744899, 736788, 727992, 719478, 711641, 705220, 701158, 699157, 697913, 696798]
57806F96798p58k66O99L213O647Q409P481N877N219M483K815J769K581L535K562
57791G51064N44l00R3n9j610l730n072m622k554r00j832m602o029m734k785k225
57775G10647k331j648n79l54j140k488m128n382n383m734n097o657p996q818j0220
57760F43692j1811j1626r861r424j1389j3033j2128j0082q835p651n410l327k694
57747E26421k272n84J272J677J449K199L502M261N324P981J1201J2825J2463J1150
57733E98869R200O627M600M289N206O346P927J0245J2168J2716J2946J4278J6155
57720G21572J7242J7658J7892J6740J2762O978J793k334o956j2608j7733k0730
57708G52276k1595k1308k0710k0026j8873j6875j4537j2837j1807j0542q881p677
$$ y = [696798, 696040, 695774, 696473, 699686, 706333, 714742, 722223, 728100, 733319, 737802, 740617, 742386, 744967, 748502, 751064, 751608, 751308, 751401, 751342, 749732, 746002, 740930, 736308, 733754, 732854, 731022, 726420, 720391, 715657, 712872, 710647, 708316, 706668, 706089, 705735, 704595, 702107, 697979, 692597, 687214, 682480, 677383, 670726, 662730, 653912, 643692, 631881, 620255, 610394, 600970, 589581, 576548, 564420, 554338, 545503, 537852, 532442, 529115, 526421, 524149, 523565, 524837, 526514, 527963, 530162, 533664, 537925, 543249, 551230, 562431, 575256, 587719, 598869, 608069, 614696, 619296, 623585, 628791, 635137, 643064, 653309, 665477, 678193, 691139, 705417, 721572, 738814, 756472, 774364, 791104, 803866, 810844, 812637, 810303, 803347, 790739, 773006, 752276, 730681, 709373, 688663, 668637, 649764, 632889, 618352, 605515, 593708, 583166, 574285, 566608]
57696E66608o985n649l307j081M65K246M534N873N338M149L820M301N084O303
57682E91699P673Q190Q058Q761J0037R340O007L262L708N249M360J518J94J662
57668F69718L905N014N093M956N249O526Q568J0001R970R464R735J0553J1418
57655G70170J3050J5850J8234J8540J7574J7270J7843J8196J8271J9004K0703
57644I64705K3062K5949K8729L0024K9735K9920L2039L4808L6644L8385M1357
57633A315357M4522M6345M8017N1734N6863O0936O3822O7819P3941Q1043Q8451
57622A998850R6730J05792J14821J24260J35530J48770J62902J77793J94125K11277
57612C470850K27710K43431K59741K76396K91291L03035L11166L12907L01817
$$ y = [566608, 559623, 553974, 550667, 549586, 550051, 552297, 556831, 562704, 568042, 572191, 576011, 580312, 585396, 591699, 599372, 607562, 615620, 624381, 634418, 643758, 649765, 653027, 656735, 661984, 666344, 667862, 668056, 669718, 673623, 678637, 683730, 688686, 693935, 700461, 709029, 719030, 729000, 738464, 748199, 758752, 770170, 783220, 799070, 817304, 835844, 853418, 870688, 888531, 906727, 924998, 944002, 964705, 987767, 1013716, 1042445, 1072469, 1102204, 1132124, 1164163, 1198971, 1235615, 1274000, 1315357, 1359879, 1406224, 1454241, 1505975, 1562838, 1623774, 1687596, 1755415, 1829356, 1910399, 1998850, 2095580, 2201372, 2316193, 2440453, 2575983, 2724753, 2887655, 3065448, 3259573, 3470850, 3698560, 3941991, 4201732, 4478128, 4769419, 5072454, 5383620, 5696527, 5998344]
57603E998344K70891K16752J41715N4031l4087j11409j72460k17287k47516k64498
57593E634476k70486k68821k61965k50921k36775k21093k04549j87031j69399
57584C563436j53394j39450j26231j12801r9705q7591p6298o5776n6473m8331
57574B597386m0650l3164k6078j9002j1227l178L913J0003J6374K3466L0117L5519
57562B583479M0641M7018N5053O4053P3255Q2412R1787J01634J11556J20883J29963
57551C501734J40009J50913J60414J66630J69978J70989J67729J57576J40517
57542D926489J18153R0365N5936J6199k4898o4563j02186j36276j63396j81544
57532D534279j92277j98198k00099j97843j92349j85229j77297j68514j58677
$$ y = [5998344, 6269235, 6485987, 6627702, 6681733, 6647646, 6536237, 6363777, 6146490, 5898974, 5634476, 5363990, 5095169, 4833204, 4582283, 4345508, 4124415, 3919866, 3732835, 3563436, 3410042, 3270592, 3144361, 3031560, 2931855, 2844264, 2767966, 2702190, 2645717, 2597386, 2556736, 2523572, 2497494, 2478492, 2467265, 2464087, 2468000, 2478003, 2494377, 2517843, 2547960, 2583479, 2624120, 2671138, 2726191, 2790244, 2863499, 2945911, 3037698, 3139332, 3250888, 3371771, 3501734, 3641743, 3792656, 3953070, 4119700, 4289678, 4460667, 4628396, 4785972, 4926489, 5044642, 5135007, 5190943, 5207142, 5182244, 5117681, 5015495, 4879219, 4715823, 4534279, 4342002, 4143804, 3943705, 3745862, 3553513, 3368284, 3190987, 3022473, 2863796]
57523B863796j47724j36134j25195j15922j07726r9316r0781q3339p7160p1168
57513A809331o5072n9796n5530n1154m6107m1228l7209l3694l0469k8000k6257
57502A334815k4349k1913j9625j7978j6649j5251j3489j0707o872l841l611n104
57490A175426m887j517K908O094Q086R656J0536J0781J1931J5030J8799K1326
57478A284169K2507K3529K5003K6898K9445L2806L6415L9666M2772M6317N0527
57467A660054N5347O0392O4751O7864P0865P5703Q2610Q9904R6626J03587J11193
57456B538896J18064J23079J27017J30788J33258J32236J26673J16658J02136
57447C648805Q2926N9398L2250K380k8348n7151q2025j02570j18624j29294j34369
$$ y = [2863796, 2716072, 2579938, 2454743, 2338821, 2231095, 2131779, 2040998, 1957659, 1880499, 1809331, 1744259, 1684463, 1628933, 1577779, 1531672, 1490444, 1453235, 1419541, 1389072, 1361072, 1334815, 1310466, 1288553, 1268928, 1250950, 1234301, 1219050, 1205561, 1194854, 1187982, 1184141, 1180530, 1175426, 1170539, 1169022, 1171930, 1178024, 1186110, 1195766, 1206302, 1217083, 1229014, 1244044, 1262843, 1284169, 1306676, 1330205, 1355208, 1382106, 1411551, 1444357, 1480772, 1520438, 1563210, 1609527, 1660054, 1715401, 1775793, 1840544, 1908408, 1979273, 2054976, 2137586, 2227490, 2324116, 2427703, 2538896, 2656960, 2780039, 2907056, 3037844, 3171102, 3303338, 3430011, 3546669, 3648805, 3731731, 3791129, 3823379, 3825759, 3797411, 3740260, 3658235, 3555665, 3437041, 3307747, 3173378]
57436C173378j35485j34679j32467j28174j21409j12426j01992r1562q2658p5311
57426B057215o8093o0312n2875m6334l9733l2600k6437k2539j9549j5138r259
57415A664346l871R4L636P689J1947J5864J9515K3180K7035L1545L7306M4210
57403A882496N1287N7632O3315O9279P6312Q4021R1076R6847J02351J08574J14181
57392B797371J16377J14190J09261J02898R3945Q0352O1531L8051J0557j9531
57382C505002m9322p6068r9096j18947j35141j45951j50224j48708j43836j38494
57372B299215j34231j30147j24304j16544j08691j01620r3926q4648p5660o9427
57362A260017o5593o1655n6377n0701m5701m1533l8305l6321l5120l3617l1453
$$ y = [3173378, 3037893, 2903214, 2770747, 2642573, 2521164, 2408738, 2306746, 2215184, 2132526, 2057215, 1989122, 1928810, 1875935, 1829601, 1789868, 1757268, 1730831, 1708292, 1688743, 1673605, 1664346, 1660475, 1660569, 1664205, 1671894, 1683841, 1699705, 1719220, 1742400, 1769435, 1800980, 1838286, 1882496, 1933783, 1991415, 2054730, 2124009, 2200321, 2284342, 2375418, 2472265, 2574616, 2683190, 2797371, 2913748, 3027938, 3137199, 3240097, 3334042, 3414394, 3475925, 3513976, 3524533, 3505002, 3455680, 3379612, 3280516, 3161569, 3026428, 2880477, 2730253, 2581545, 2437709, 2299215, 2164984, 2034837, 1910533, 1793989, 1685298, 1583678, 1489752, 1405104, 1329444, 1260017, 1194424, 1132769, 1076392, 1025691, 979990, 938457, 900152, 863831, 828711, 795094, 763641]
57351G63641k9295k7614k6104k4465k2972k1902k0899j9204j6517j3731j2486
57340E28452j3345j4621j4170j2344j1670j3005j3904j2004q455o273o374p206
57328C95081p526p473p152o187n004m921o314p776p737o237m674m209m655m852
57314C10364m106l213l545n059o070n405l833k759k462k392k339k357k157j591
57300B63076j096r26n42M39J428J688J274M73p34j940k182j430r93j370j187M49
57284B56427K050J902P62M14P07L45l22K08J800K775K662K573K872K736K147K144
57268B82202K803K965K317J874K067K300K796M724P822R788R077O685M471L158
57254C45049K838L747N512O871P103O713O103M903L387K947M101N372N438N138
$$ y = [763641, 734346, 706732, 680628, 656163, 633191, 611289, 590390, 571186, 554669, 540938, 528452, 515107, 500486, 486316, 473972, 462302, 449297, 435393, 423389, 414934, 408661, 402287, 395081, 387555, 380082, 372930, 366743, 361739, 356818, 350504, 342728, 334991, 328754, 324080, 319871, 315216, 310364, 306258, 303045, 299500, 294441, 288371, 282966, 279133, 276374, 273912, 271520, 269181, 266824, 264667, 263076, 261980, 261054, 260512, 260951, 262379, 264067, 265341, 265814, 265080, 263140, 260958, 259528, 258535, 257165, 255978, 256427, 258477, 260379, 261141, 261555, 262262, 262607, 262285, 262493, 264293, 267068, 269730, 272303, 275175, 277911, 280058, 282202, 285005, 287970, 290287, 292161, 294228, 296528, 299324, 304048, 311870, 321658, 330735, 337420, 341891, 345049, 347887, 351634, 357146, 364017, 371120, 377833, 383936, 388839, 392226, 395173, 399274, 404646, 410084, 415222]
57240D15222N982P657Q674Q825R464J1482J4337J7057J9196K0734K1925K3315
57228E83870K5277K7560K9741L1987L4663L7397L9315M0409M1830M4342M7022
57217I83413M8256M7867M7336M7570M7283M4559L9520L4157K9561K4699J8593
57206A412814J2139O645J756l664r347j3940j7171j9976k2566k3987k3900k3202
57194A275601k2464k1119j8872j6718j5642j5144j3905j1467q545n991m060k517
57182A119157r90P56K834N433Q856J3063J7364K0883K3227K4531K5238K5998K7221
57169A313571K8308K8032K6362K5033K5450K6827K7593K7898K9117L1288L2785
57158A622264L2807L2714L4484L8671M4118M8853N1316N1609N1445N2117N2892
$$ y = [415222, 421204, 428861, 437535, 446360, 455824, 467306, 481643, 498700, 517896, 538630, 560555, 583870, 609147, 636707, 666448, 698435, 733098, 770495, 809810, 850219, 892049, 936391, 983413, 1031669, 1079536, 1126872, 1174442, 1221725, 1266284, 1305804, 1339961, 1369522, 1394221, 1412814, 1424953, 1431598, 1433354, 1429690, 1420343, 1406403, 1389232, 1369256, 1346690, 1322703, 1298803, 1275601, 1253137, 1232018, 1213146, 1196428, 1180786, 1165642, 1151737, 1140270, 1131725, 1125734, 1121674, 1119157, 1118167, 1118923, 1121757, 1127190, 1136046, 1149109, 1166473, 1187356, 1210583, 1235114, 1260352, 1286350, 1313571, 1341879, 1369911, 1396273, 1421306, 1446756, 1473583, 1501176, 1529074, 1558191, 1589479, 1622264, 1655071, 1687785, 1722269, 1760940, 1805058, 1853911, 1905227, 1956836, 2008281, 2060398, 2113290]
57147B113290N2389N1035N0595N1566N2625N2809N2726N3415N5286N8426O2503
57136B706665O6175O7962O8163O8663P0589P3345P6259P9555Q3218Q6200Q7579
57125C534373Q7583Q6780Q5236Q2983Q0623P8963P8571P9627Q1410Q2160Q0545
57114D438854P7215P3761P0444O6319O1395N6956N3731N1492N0563N1670N3958
57103E106358N5253N5082N5417N7495N9711N9987N8610N7290N6511N5217N2415
57092E729346M8034M2880L8470L6295L6703L9064M3199M9652N8460O8761P9580
57081F270444Q9689R6658R7804R2661Q3171P1279N7763M3523K9961J7529N525
57070F956007o405j8278l1456m8273o9628r5011j24992j61158k03261k49263k98893
$$ y = [2113290, 2165679, 2216714, 2267309, 2318875, 2371500, 2424309, 2477035, 2530450, 2585736, 2644162, 2706665, 2772840, 2840802, 2908965, 2977628, 3048217, 3121562, 3197821, 3277376, 3360594, 3446794, 3534373, 3621956, 3708736, 3793972, 3876955, 3957578, 4036541, 4115112, 4194739, 4276149, 4358309, 4438854, 4516069, 4589830, 4660274, 4726593, 4787988, 4844944, 4898675, 4950167, 5000730, 5052400, 5106358, 5161611, 5216693, 5272110, 5329605, 5389316, 5449303, 5507913, 5565203, 5621714, 5676931, 5729346, 5777380, 5820260, 5858730, 5895025, 5931728, 5970792, 6013991, 6063643, 6122103, 6190864, 6270444, 6360133, 6456791, 6554595, 6647256, 6730427, 6801706, 6859469, 6902992, 6932953, 6950482, 6956007, 6949602, 6931324, 6899868, 6851595, 6781967, 6686956, 6561964, 6400806, 6197545, 5948282, 5649389]
57059E649389l54288m16212m82583n51924o25264p03476p85946H56174a13618
57049a191464j198754j335015j491940j673882j882533k120856k394666k707731
57041a5996841l059077l447544l874615m340107m841161n380586n971453o627781
57033e3539165p353912q144740q984419r832548j0621019j1287206j1814764j2217943
57025a33795716j2459038j2379772j1740803j0370639q314833n855603l369198
57018a98285602j127735P94585K451269L890660N105704O090984O902745P637018
57010a66540372Q358763R064631R701047J0198685J0496561J0560927J0398292
57003i7761466J0048244R559531Q973190Q322739P637703O941180O249274N576829
$$ y = [5649389, 5295101, 4878889, 4396306, 3844382, 3219118, 2515642, 1729696, 856174, -113618, -1191464, -2390218, -3725233, -5217173, -6891055, -8773588, -10894444, -13289110, -15996841, -19055918, -22503462, -26378077, -30718184, -35559345, -40939931, -46911384, -53539165, -60893077, -69037817, -78022236, -87854784, -98475803, -109763009, -121577773, -133795716, -146254754, -158634526, -170375329, -180745968, -189060801, -194916404, -198285602, -199413337, -198618752, -196167483, -192276823, -187171119, -181080135, -174177390, -166540372, -158181609, -149116978, -139415931, -129217246, -118720685, -108159758, -97761466, -87713222, -78153691, -69180501, -60857762, -53220059, -46278879, -40029605, -34452776]
56995c4452776M940225M352554L819836L344161K926895K566410K256051J987390
56987h259254J754177J551930J376187J223130J090427b87247E91120P96335P30008
56978B117463O77101O32452N91492N52796N16417M81599M47318M13355L79374
56969F809367L44173L07095K69300K32772J98913J68430J41248J15902R0427O4747
56959H742374M1150K2045Q544J359P89M728Q760R899Q921P675N822K084k901p393
56945H853856j1398j6111k1206k6128l5197n8550j04997j73633k53152l28996
56935G824488l90655m33575m57007m62047m51367m29053l99463l66077l31531
56926D103713k98222k68144k42241k20514k02769j88732j77659j68650j61553
$$ y = [-34452776, -29512551, -25159997, -21340161, -17996000, -15069105, -12502695, -10246644, -8259254, -6505077, -4953147, -3576960, -2353830, -1263403, -287247, 591120, 1387455, 2117463, 2794564, 3427016, 4018508, 4571304, 5087721, 5569320, 6016638, 6429993, 6809367, 7153540, 7460635, 7729935, 7962707, 8161620, 8330050, 8471298, 8587200, 8677627, 8742374, 8783524, 8805569, 8814113, 8815472, 8816261, 8820989, 8829749, 8839648, 8848569, 8856244, 8862066, 8864150, 8861249, 8853856, 8842458, 8826347, 8805141, 8779013, 8743816, 8685266, 8580269, 8406636, 8153484, 7824488, 7433833, 7000258, 6543251, 6081204, 5629837, 5200784, 4801321, 4435244, 4103713, 3805491, 3537347, 3295106, 3074592, 2871823, 2683091, 2505432, 2336782, 2175229]
56917B175229j56645j53128j48903j42608j35189j28517j22932j17146j10267
56908I59894j02711r4950q6531p6999o6921n7201m7848l8390k9259k1714j6209
56897C21161j1722p170k856J12J126O6l333q847j4665j8375j9460j9657k0270
56884A96110k0351j8499j5344j2831j1486r968p284m059j190J482M551P998J1613
56871A20742J5688K0320K4222K5165K1823J4872O258k140r055j3720j5873j6013
56859A92289j5267j4583j3970j2663j0170p025m467l494m219n791o770n998l635
56846H4237j162J27N09J252K745L959L999L498L886N624P783R256R865J0221J0958
56831A56757J2302J3992J5340J5587J4541J2918J1802J1710J2169J2007J0013
$$ y = [2175229, 2018584, 1865456, 1716553, 1573945, 1438756, 1310239, 1187307, 1070161, 959894, 857183, 762233, 675702, 598703, 531782, 474581, 426733, 388343, 359084, 337370, 321161, 309439, 302269, 299413, 299525, 300651, 300717, 297384, 288537, 273872, 255497, 236037, 216380, 196110, 175759, 157260, 141916, 129085, 117599, 107631, 100347, 96288, 95098, 96580, 101131, 109129, 120742, 136430, 156750, 180972, 206137, 227960, 242832, 249090, 246950, 237895, 224175, 208302, 192289, 177022, 162439, 148469, 135806, 125636, 118611, 114144, 110650, 106431, 100640, 93870, 87872, 84237, 83075, 83202, 83711, 84963, 87708, 91667, 95666, 99164, 103050, 108674, 116457, 125713, 135578, 145799, 156757, 169059, 183051, 198391, 213978, 228519, 241437, 253239, 264949, 277118, 289125, 299138]
56820B99138N556q39p405j2076j3869j3368j1802r874p622m981k097Q57L764O541
56806B31923R257J2249J5811J9795K3750K7364L0545L3146L4966L5816L5184L1902
56794E41708K4839J4386L035o013j1056j2816j3143j2948j1559q255l839K1K974
56781E07334O338J0932J5683J9376K2919K8392L6138M4304N1252N6865O0779O0591
56769I20903N3049L7076J5315p056k5186l7124m4107m8072m9135m6153l9541l2090
56757F97879k6361k2191j7499j0879k722N588J2778J8291K2504K6358L0551L5061
56745G69358L9222M1460L9049K9495J3136o133k3412l5762m2653m4689m3049l9634
56733F96388l6315l3604l0526k6012k0230j4577j0400p549m412K40N565R685J2227
$$ y = [299138, 304694, 303855, 296450, 284374, 270505, 257137, 245335, 235461, 227839, 222858, 220761, 221618, 225382, 231923, 241180, 253429, 269240, 289035, 312785, 340149, 370694, 403840, 438806, 474622, 509806, 541708, 566547, 580933, 583968, 577955, 566899, 554083, 540940, 527992, 516433, 508178, 504339, 504360, 507334, 513672, 524604, 540287, 559663, 582582, 610974, 647112, 691416, 742668, 799533, 860312, 920903, 973952, 1011028, 1026343, 1019287, 994101, 956977, 912870, 864798, 815663, 769510, 729969, 697879, 671518, 649327, 631828, 620949, 618227, 623815, 636593, 654884, 677388, 703746, 734297, 769358, 808580, 850040, 889089, 918584, 931720, 925587, 902175, 866413, 823760, 779071, 736022, 696388, 660073, 626469, 595943, 569931, 549701, 535124, 524724, 517175, 512763, 513003, 518568, 528253, 540480]
56720E40480J4614J7448J8927J6783J0830K654o366j5377k3012k7585k8789k8246
56708D92361k7964k8390k8183k5811k1512j7495j5750j5792j5411j3612j1594
56697B70847j0560j0006r098q227p875p070m671j625j74r66k402k844k182j062
56683B02085P5P54L71j023k426k810k069r52l85q53j910k404j588j8J051R54O
56666A88858j120j855j849j240p14p70j101j091o91m09o14j207j774j800j098
56651A71525k57j35o25o92M5O29K19o65j136j212j149l77J562L609M144L173K384
56634A81042K955M267M923M296L016K265K642L518L891L797M077M650M378L066
56620B32783K132K339K379R76r65j780j396o30N74K351L414K549R27P22J937K735
$$ y = [540480, 555094, 572542, 591469, 608252, 619082, 621736, 615370, 599993, 576981, 549396, 520607, 492361, 464397, 436007, 407824, 382013, 360501, 343006, 327256, 311464, 296053, 282441, 270847, 260287, 250281, 241183, 232956, 225081, 218011, 213340, 211715, 211541, 210575, 208173, 205329, 203147, 202085, 202160, 202914, 203285, 202262, 199836, 197026, 194957, 194005, 193620, 192767, 190857, 188453, 186865, 186847, 187898, 188852, 188858, 187738, 185883, 184034, 182794, 182080, 181310, 180209, 179118, 178427, 178018, 177404, 176197, 174423, 172623, 171525, 171268, 171133, 170508, 169816, 169861, 170490, 170709, 170044, 168908, 167696, 166547, 166170, 167732, 171341, 175485, 178658, 181042, 183997, 188264, 193187, 197483, 200499, 202764, 205406, 208924, 212815, 216612, 220689, 225339, 229717, 232783, 234915, 237254, 239633, 240609, 239644, 237864, 236468, 235838, 236412, 238763, 242177, 244726, 245653, 246375, 248312, 251047]
56604B51047K500K359K848L265L372L620L633K554R57K91K91q62l407n260m950
56589B62258l286j538j6Q12n1k353m173m352l800l564l223k202j099n78k81P9
56573B32633j48j266k301k391k025j951j873j263m80j46j96l45o68j053r88m27
56557B15112n8j59j48K88O81Q15J066J363J050K64Q6P62J180P16J76J80R6n65
56539B22905j114q95k11O86K144L749M078K807J597J746K465K533K162J874J165
56524B47691j68p78L63J891J703j41j736j919j058R2R46J035O56J035K725M505
56508B56842M905M055L072K413K034K252L190M019L978L528L573M302N578P383
56494C11124Q903Q525O004L429K619K829K496J776J526J098m38j882j221J031
$$ y = [251047, 253547, 255906, 258754, 262019, 265391, 269011, 272644, 275198, 276155, 276446, 276737, 275875, 272468, 267208, 262258, 258972, 257434, 257418, 258230, 258179, 255826, 251653, 247301, 243501, 239937, 236714, 234512, 233413, 232835, 232554, 232633, 232485, 231219, 228918, 226527, 224502, 222551, 220678, 219415, 218935, 218789, 218593, 218248, 217580, 216527, 215539, 215112, 215054, 214895, 214747, 215035, 215716, 216531, 217597, 218960, 220010, 220274, 220360, 221122, 222302, 223018, 223194, 223374, 223470, 222905, 221791, 220896, 220685, 221371, 223515, 227264, 231342, 234149, 235746, 237492, 239957, 242490, 244652, 246526, 247691, 247523, 246745, 247108, 248999, 250702, 250561, 248825, 246906, 245848, 245940, 246886, 247921, 248577, 249612, 252337, 256842, 261747, 265802, 268874, 271287, 273321, 275573, 278763, 282782, 286760, 290288, 293861, 298163, 303741, 311124, 320027, 328552, 334556, 337985, 340604, 343433, 345929, 347705, 349231, 350329, 349891, 348009, 346788, 347819]
56480C47819K200J022j270l345n093o383o520n552m525l964l403k658k215k130
56466C03983j803j162q65j081j215j051j126j655k104k130k050k147k234k216
56452B81144k395l071m165n199n388m242k480j648k136k444j349M5j52j665k285
56437B42570q96J183K049J227l19j297j047q0N02M59P31J725K225J221j35P9J725
56420B51922K864K547J639J043P85J021K236L917M484L290J587R59J612K766L968
56405B86640N277O655P692P902P144N883M934M748N036N245N056M384L405K737
56391C62738K837L042K227O82P4Q97J393P0k008k760j918p99j75J38K32P6O0K84
56373C67090p9j462k771l003l088m470o564p530p060o468o206n352l693k413k208
$$ y = [347819, 350019, 351041, 349771, 346426, 341333, 334950, 328430, 322878, 318353, 314389, 310986, 308328, 306113, 303983, 302180, 301018, 300153, 299072, 297857, 296806, 295680, 294025, 291921, 289791, 287741, 285594, 283360, 281144, 278749, 275678, 271513, 266314, 260926, 256684, 254204, 252556, 250420, 247976, 246627, 246672, 246520, 244855, 242570, 241674, 242857, 244906, 246133, 245814, 244517, 243470, 243390, 243892, 244351, 245082, 246807, 249032, 250253, 250118, 250197, 251922, 254786, 257333, 258972, 260015, 260800, 261821, 264057, 267974, 272458, 275748, 277335, 278294, 279906, 282672, 286640, 291917, 298572, 306264, 314166, 321310, 327193, 332127, 336875, 341911, 347156, 352212, 356596, 360001, 362738, 365575, 368617, 370844, 371526, 371600, 372497, 373890, 373960, 371952, 369192, 367274, 366475, 366300, 366438, 366670, 366746, 366806, 367090, 367011, 365549, 362778, 359775, 356687, 352217, 345653, 338123, 331063, 324595, 318389, 313037, 309344, 306931, 304723]
56358C04723k186j196O65K310K702J623n4j009r42q23j257j487q49o9L5l0L81
56341C02537N37l94j591j864j741k336l046k458q79J77N58J276K186K069R33J56
56325B96120L65J070K189L908N212M593K407O04J20K51M32O94O06k23o99N56K685
56308C20890L487K805K648L809M782M480L669L088K337J375J232K316L683M606
56294C65207N301N688N112L818L068L355L982M601N487O092N212L072J490J509
56280D22994K459L492M331M308K759P83O07K592M699N434N482N808O129O105O356
56265D84338P158P565O743N214M208M498O129Q403J0106J0666J0754J0880J0284
56252E86946Q583P404Q363J0440J1559J1936J3254J5202J5751J4546J3252J2702
$$ y = [304723, 302537, 301341, 302006, 304316, 307018, 308641, 308587, 307578, 306636, 305813, 304556, 303069, 302220, 302151, 302186, 302156, 302537, 303074, 302680, 301089, 299225, 297484, 295148, 292102, 289644, 288765, 288942, 289500, 290776, 292962, 295031, 295964, 296120, 296485, 297555, 299744, 303652, 308864, 313457, 315864, 316468, 316588, 316839, 317271, 317965, 318571, 318348, 317649, 318205, 320890, 324377, 327182, 329830, 333639, 338421, 342901, 346570, 349658, 351995, 353370, 354602, 356918, 360601, 365207, 370508, 376196, 381308, 385126, 388194, 391549, 395531, 400132, 405619, 411711, 416923, 419995, 421485, 422994, 425453, 428945, 433276, 437584, 440343, 441126, 441733, 444325, 449024, 454458, 459940, 465748, 471877, 477982, 484338, 491496, 499061, 505804, 511018, 515226, 519724, 525853, 534256, 544362, 555028, 565782, 576662, 586946, 595529, 602933, 611296, 621736, 633295, 645231, 658485, 673687, 689438, 703984, 717236, 729938]
56240G29938J2456J2863J4547J6080J5367J3281J2603J3424J3141J1222J0112
56229H75034J0763J1200J0560J0736J2640J4470J5217J6504J9242K1747K3001
56218A041114K4583K7356K9396K9395K9433L2029L6684M1362M5373M9054N2630
56207A438409N6787O2320O8185P2281P5034P9396Q6447R4156J01645J10895J22614
56196B368169J34161J43718J52934J63161J72667J80166J87476J95584K01442
56187C899478K02191J99529J96262J91113J80824J65189J46163J23785R6990O7332
56177E468856L8309J1561j3393l6473n6771p4172q8882j00215j07873j13327j17967
56166D809653j21208j22391j23001j24858j27475j29337j30433j31611j32842
$$ y = [729938, 742394, 755257, 769804, 785884, 801251, 814532, 827135, 840559, 853700, 864922, 875034, 885797, 896997, 907557, 918293, 930933, 945403, 960620, 977124, 996366, 1018113, 1041114, 1065697, 1093053, 1122449, 1151844, 1181277, 1213306, 1249990, 1291352, 1336725, 1385779, 1438409, 1495196, 1557516, 1625701, 1697982, 1773016, 1852412, 1938859, 2033015, 2134660, 2245555, 2368169, 2502330, 2646048, 2798982, 2962143, 3134810, 3314976, 3502452, 3698036, 3899478, 4101669, 4301198, 4497460, 4688573, 4869397, 5034586, 5180749, 5304534, 5401524, 5468856, 5507165, 5518726, 5505333, 5468860, 5412089, 5337917, 5249035, 5148820, 5040947, 4927620, 4809653, 4688445, 4566054, 4443053, 4318195, 4190720, 4061383, 3930950, 3799339, 3666497]
56157C666497j33881j35080j35864j34402j30557j27034j25487j23706j18990
56148B501496j12157j05729j00157r4429q8579q2992p6854o9729o3086n8109n3750
56137A595925m8921m4516m1171l7418l2387k7881k5281k3013j9817j7689j8316
56126A259515j9203j7030j2709r449p779o182m873m981n360l946j245Q51K487
56113A170096M881P264Q240Q977J1603J5432J7927J8632J9105J9883K0482K1435
56101A343957K3492K5673K6720K7376K8855L0419L0898L1026L1886L2766L3044
56090A666112L4029L6338L7756L6768L5765L7543M1092M4417M8962N7139O7703
56079B143624P7937Q8766J03328J21736J41110J59422J75467J86573J90381J87675
$$ y = [3666497, 3532616, 3397536, 3261672, 3127270, 2996713, 2869679, 2744192, 2620486, 2501496, 2389339, 2283610, 2183453, 2089024, 2000445, 1917453, 1840599, 1770870, 1707784, 1649675, 1595925, 1547004, 1502488, 1461317, 1423899, 1391512, 1363631, 1338350, 1315337, 1295520, 1277831, 1259515, 1240312, 1223282, 1210573, 1201124, 1193345, 1187163, 1182290, 1177309, 1171949, 1168003, 1166758, 1167609, 1170096, 1174977, 1182241, 1190481, 1199458, 1211061, 1226493, 1244420, 1263052, 1282157, 1302040, 1322522, 1343957, 1367449, 1393122, 1419842, 1447218, 1476073, 1506492, 1537390, 1568416, 1600302, 1633068, 1666112, 1700141, 1736479, 1774235, 1811003, 1846768, 1884311, 1925403, 1969820, 2018782, 2075921, 2143624, 2221561, 2310327, 2413655, 2535391, 2676501, 2835923, 3011390, 3197963, 3388344, 3576019]
56069C576019J79964J66126J45466J22296J03018Q9579P9586P1243O3902N5145
56059D652344M1943K4455N412j3155k9553m1084m7216n2594o3064p9942j01101
56048D296445j24928j49090j68255j78128j79997j77135j69327j55638j39640
56039B854307j25988j13911r9915q4982p3143o4430n5423m5638l7510l1031k4126
56028B098210j7546j3729j1619q071l535j008l92Q52K530K597J849K346K707N68
56014B055759j909r05K330L694L519N278Q595J0234J0627J2862J6400J8410J9853
56001B164747K3382K6873K6304K3682K4407K8025K9448K8479K9850L4264L7433
55990B476894L8026L8957M0906M1962M3398M8247N4595N7733N8279O0673O4699
$$ y = [3576019, 3755983, 3922109, 4067575, 4189871, 4292889, 4382468, 4462054, 4533297, 4597199, 4652344, 4694287, 4718742, 4724154, 4710999, 4681446, 4640362, 4593146, 4540552, 4477488, 4397546, 4296445, 4171517, 4022427, 3854172, 3676044, 3496047, 3318912, 3149585, 2993947, 2854307, 2728319, 2614408, 2514493, 2429511, 2356368, 2291938, 2236515, 2190877, 2153367, 2122336, 2098210, 2080664, 2066935, 2055316, 2047245, 2043710, 2042702, 2042310, 2043162, 2045692, 2048289, 2050138, 2052484, 2055191, 2055759, 2053850, 2052945, 2055275, 2058969, 2062488, 2067766, 2076361, 2086595, 2097222, 2110084, 2126484, 2144894, 2164747, 2188129, 2215002, 2241306, 2264988, 2289395, 2317420, 2346868, 2375347, 2405197, 2439461, 2476894, 2514920, 2553877, 2594783, 2636745, 2680143, 2728390, 2782985, 2840718, 2898997, 2959670, 3024369]
55979C024369O6513O6739O9147P2516P2704P1533P4364Q0043Q2962Q3908Q8710
55968C853508R6950J02629J05479J10666J17734J21204J22248J27980J38607J46921
55958E043926J51510J58704J70303J81146J90165K02241K17713K31629K44496
55949F791833K61994K83181L01326L16974L37216L61260L80519L94000M09687
55940I837990M29440M47235M63680M87006N17898N48721N79517O18562O65291
55931A4595340P09603P50216P96230Q48412Q97388R42856R95107J054689J110765
55922B2700606J162878J222994J292266J358157J418927J488093J570492J658434
55914C3872847J755862J879670K031548K196197K373090K580264K820784L078388
$$ y = [3024369, 3090882, 3157621, 3226768, 3299284, 3371988, 3443521, 3517885, 3597928, 3680890, 3764798, 3853508, 3950458, 4053087, 4158566, 4269232, 4386966, 4508170, 4630418, 4758398, 4897005, 5043926, 5195436, 5354140, 5524443, 5705589, 5895754, 6097995, 6315708, 6547337, 6791833, 7053827, 7337008, 7638334, 7955308, 8292524, 8653784, 9034303, 9428303, 9837990, 10267430, 10714665, 11178345, 11665351, 12183249, 12731970, 13311487, 13930049, 14595340, 15304943, 16055159, 16851389, 17699801, 18597189, 19540045, 20535152, 21589841, 22700606, 23863484, 25086478, 26378744, 27736901, 29155828, 30643921, 32214413, 33872847, 35628709, 37508379, 39539927, 41736124, 44109214, 46689478, 49510262, 52588650]
55906E2588650L353918L671105M037852M440405M887020N417057O055042O798201
55898I1249250P659027Q668536R823966J1091799J2480889J4050861J5836277
55891A70860605J7845518K0150847K2862775K5963780K9272704L2560520L5385591
55884C54902340L6570705L4153169K6529947J4035741p37997j4412136k4691090
55877D26350679l1023073l3977799l4421996l3170279l0921753k8189313k5278320
55870B09368146k2383316j9661366j7201637j5008919j3067396j1382125r943651
55863A00719736q708257p641330o740165n994887n366344m821324m354157l957156
55855E3136116l603796l278110k990053k745610k529054k328440k151322k000602
$$ y = [52588650, 55942568, 59613673, 63651525, 68091930, 72978950, 78396007, 84451049, 91249250, 98908277, 107576813, 117400779, 128492578, 140973467, 155024328, 170860605, 188706123, 208856970, 231719745, 257683525, 286956229, 319516749, 354902340, 391473045, 425626214, 452156161, 466191902, 465453905, 451041769, 426350679, 395327606, 361349807, 326927811, 293757532, 262835779, 234646466, 209368146, 186984830, 167323464, 150121827, 135112908, 122045512, 110663387, 100719736, 92011479, 84370149, 77629984, 71635097, 66268753, 61447429, 57093272, 53136116, 49532320, 46254210, 43264157, 40518547, 37989493, 35661053, 33509731, 31509129]
55847C1509129j859784j716831j580406j459219j346216j235711j136214j053612
55839B0121136r79388r06941q42906p92086p47281p03524o66659o38937o11489
55830A3231925n79844n51780n31481n10725m84075m58198m37755m16288l89764
55821H872015l65414l48156l31230l09213k88158k73999k62312k48133k35053
55812F210347k26436k17941k06679j97786j94429j91011j83465j76591j74152
55803D441857j71274j63738j55369j49248j41161j29079j19886j18896j21056
55794C172150j19980j17510j16880j14585j07033r8268r3252q9669q3422p6241
55784B155310p1150o6226n9230n2918m9834m7207m2430l8142l6663l5142l1260
$$ y = [31509129, 29649345, 27932514, 26352108, 24892889, 23546673, 22310962, 21174748, 20121136, 19141748, 18234807, 17391901, 16599815, 15852534, 15149010, 14482351, 13843414, 13231925, 12652081, 12100301, 11568820, 11058095, 10574020, 10115822, 9678067, 9261779, 8872015, 8506601, 8158445, 7827215, 7518002, 7229844, 6955845, 6693533, 6445400, 6210347, 5983911, 5765970, 5559291, 5361505, 5167076, 4976065, 4792600, 4616009, 4441857, 4270583, 4106845, 3951476, 3802228, 3661067, 3531988, 3412102, 3293206, 3172150, 3052170, 2934660, 2817780, 2703195, 2596162, 2497894, 2404642, 2314973, 2231551, 2155310, 2084160, 2017934, 1958704, 1905786, 1855952, 1808745, 1766315, 1728173, 1691510, 1656368, 1625108]
55773A625108k7989k7640k7024k3570k0471k0598k0954j8296j4799j3341j2535
55762A397891j1151j1869j5911j9440j9902k0336k3090k5198k4668k5047k8579
55751A172700l1059k8984k5915k5942k6498k3720j9705j8252j8058j6120j3546
55740I24901j2401j0984p713n336n928o164l017L22j48k246j940n27j342l054
55726H64423k477q24j074k008p48J373J156o16j005l46o98j213j68N68j851n965
55710H48527q009p568o918o604n863n623p070q782q853q133q260q790r261j1289
55696G37504j5306j8215j7761j6299j6568j6967j4947j1936j0671j0541r807r659
55684E68827j1726j4158j4499j3961j4815j6041j5654j4717j4892j4667j2168
$$ y = [1625108, 1597119, 1569479, 1542455, 1518885, 1498414, 1477816, 1456862, 1438566, 1423767, 1410426, 1397891, 1386740, 1374871, 1358960, 1339520, 1319618, 1299282, 1276192, 1250994, 1226326, 1201279, 1172700, 1141641, 1112657, 1086742, 1060800, 1034302, 1010582, 990877, 972625, 954567, 938447, 924901, 912500, 901516, 893803, 888467, 882539, 876375, 873358, 873680, 873532, 871286, 869346, 868819, 867477, 864423, 861946, 861122, 860048, 858040, 857292, 858665, 859821, 859205, 858200, 857854, 857156, 855943, 855775, 856343, 854492, 848527, 840518, 832950, 826032, 819428, 813565, 807942, 800872, 792090, 783237, 775104, 766844, 758054, 748793, 737504, 722198, 703983, 686222, 669923, 653355, 636388, 621441, 609505, 598834, 588293, 578486, 568827, 557101, 542943, 528444, 514483, 499668, 483627, 467973, 453256, 438364, 423697, 411529]
55673D11529r164q061p584n649l785m226n379m831m158n898q316q244o779p034
55659C22421q367q074o847p246q430p781o189o346p130n205j262P43O5k62J047
55644B51137K294K780L422L658K157K50L65J436K91k786m349l405k309k033r62
55629B51946J244K771L067L481M186L986L363M171O177P328P467Q215R168Q012
55615C24582M832K594K645K981J858R7j052j781k569l218l563l538k620p73P26
55600C21201J130J788L877N928O147N728O833Q728R188Q717R686J2020J3266J2647
55586D26884J1685J1100J0222R256R133R310Q501P063N926M077J59m297o617p175
55572D95227q473j0708j1856j1515j1067j0404q248n426m152m304m053l871n946
$$ y = [411529, 402365, 394304, 386720, 381071, 377286, 373060, 367681, 362850, 358692, 352794, 344478, 336234, 329455, 322421, 314054, 305980, 299133, 291887, 283457, 275676, 269487, 263141, 256011, 250806, 249544, 250287, 250352, 250090, 251137, 253431, 256211, 259633, 263291, 265448, 265698, 266063, 267499, 267790, 265004, 260655, 257250, 254941, 252908, 251946, 253190, 255961, 259028, 262509, 266695, 270681, 274044, 278215, 284392, 291720, 299187, 307402, 316570, 324582, 329414, 332008, 334653, 337634, 339492, 339589, 338537, 336756, 334187, 330969, 327406, 323868, 321248, 320475, 321201, 322331, 324119, 327996, 333924, 340071, 345799, 352632, 361360, 370548, 379265, 388951, 400971, 414237, 426884, 438569, 449669, 459891, 469147, 478280, 487590, 496091, 503154, 509080, 513157, 513316, 509019, 502402, 495227, 486754, 476046, 464190, 452675, 441608, 431204, 422956, 417530, 413378, 409074, 405021, 401150, 395204]
55559C95204r664j1833j1748j1975j3507j4229j3078j1985j2299j2714j2059j1164
55547B48949j0740j0070q876p967p269n729l779l247m241m740l862k954k897l012
55533A69566l098l785m363l080l90Q73o74l390n470o722o940n358k694j214j722
55518A21539k657k765k513k332j827j229j322j504l04J793K614J773J246J951
55504A14463K452J857J382K104L378M266M545L809J642r70k537l337m511n344
55490A23199m305k499k632m441m787k821j316j830k365j304j30m04j111r50n37
55475I1767n31J7J533K570K231J768K233K810K930L676N399O222M853K889K507
55460A32874L604M796N537N855N517M830M722N051M567L308K937L816M128L085
$$ y = [395204, 385540, 373707, 361959, 349984, 336477, 322248, 309170, 297185, 284886, 272172, 260113, 248949, 238209, 228139, 219263, 211296, 204027, 198298, 194519, 191272, 187031, 182291, 178429, 175475, 172578, 169566, 166468, 162683, 158320, 155240, 154850, 155723, 155049, 151659, 146189, 139467, 132527, 127169, 124475, 123261, 121539, 118882, 116117, 113604, 111272, 109445, 108216, 106894, 105390, 105086, 106879, 109493, 111266, 112512, 114463, 116915, 118772, 120154, 122258, 125636, 129902, 134447, 138256, 139898, 138928, 136391, 133054, 128543, 123199, 118894, 116395, 113763, 109322, 104535, 101714, 100398, 98568, 96203, 94899, 94769, 94365, 93254, 92304, 91767, 91236, 91253, 92786, 95356, 97587, 99355, 101588, 104398, 107328, 111004, 116403, 122625, 127478, 130367, 132874, 136478, 141274, 146811, 152666, 158183, 163013, 167735, 172786, 177353, 180661, 183598, 187414, 191542, 194627]
55446A94627K445L413M464M063L294L760M734M472K857R02r81k656l562l845m890
55431B13097p381j0079j1703j2515j2971j2408j0364p795n789m389l577l833m818
55418A05475n239m906n138o258o804o165n735o210o115m604l380m008n284n183
55404C0446l768k308j152j56K29q0k45j94j093k878l368j526M76L63r87j500j129
55387A1130r22n76O39J853J826J134R50Q94J32n79j73M99r5j525k207j990j933
55370I057k203k108j664j317p71L11J223J400J709K922L856K998R87m20r81j593
55354A3406k089j593m81J28L79J186K143J998J065J084K535L822L438J544p64
55339B7801k539l238k862j979r89K70J513J535k27k356k946j878n05K57L49j96
$$ y = [194627, 197072, 200485, 204949, 209012, 212306, 216066, 220800, 225272, 228129, 229031, 228050, 225394, 221832, 217987, 213097, 205716, 195637, 183934, 171419, 158448, 146040, 135676, 127881, 122092, 117703, 114126, 110293, 105475, 100236, 95330, 90192, 83934, 77130, 70965, 65230, 59020, 52905, 48301, 44921, 40913, 35629, 30446, 26678, 24370, 23218, 23062, 23291, 23211, 22966, 22772, 21679, 18801, 15433, 13907, 14383, 14746, 13759, 12259, 11130, 10208, 9632, 10271, 12124, 13950, 15084, 16034, 16928, 17060, 16481, 16308, 16807, 16712, 15187, 12980, 10990, 9057, 6854, 4746, 3082, 1765, 994, 1305, 2528, 3928, 5637, 8559, 12415, 15413, 16400, 15980, 14999, 13406, 11317, 9724, 9243, 9371, 9750, 10936, 13079, 15077, 16142, 17226, 19761, 23583, 27021, 28565, 27801, 25262, 22024, 19162, 17183, 16194, 16464, 17977, 19512, 19285, 16929, 13983, 12105, 11600, 11857, 12206, 12010]
55323A2010j158j669j067K17J367K143K347J371n62j811j285r9J38l17j69N81
55307A2037Q55L88l13j317k910m300A81b783j720j139q59p10q60j001n59M79J740
55290g412K928a117I52C88a813j302N46O97q58j760p87R02J941a97A963J758J238
55273D959J113J432J650J297K41j359k739k773j353J03L12m36A060a645m421n070
55257a1136l228R0K334K435J430M52k99o68k62P10J465J653J570J385R85L37n78
55240a325j828k902k863j721p68o14r9J642L349L367a692Q43k12j602k465j563
55224f691L66J358J026O18N69K11l97m23l5k00o96m27L41K63m93j94J469f61A727
55204C466J579Q73j047B424A137J664L486K497j79k184k191p00P79J215P43j9
$$ y = [12010, 10852, 9183, 8116, 8333, 9700, 11843, 14190, 15561, 14999, 13188, 11903, 11804, 11942, 11625, 11456, 12037, 12892, 13280, 12967, 11650, 8740, 4440, 181, -2783, -4503, -5642, -6501, -7211, -8071, -9072, -9631, -9152, -7412, -4484, -1117, 952, 388, -1813, -3115, -2569, -1872, -2730, -4490, -5277, -4375, -2434, -197, 1963, 3721, 4959, 6072, 7504, 9154, 10451, 10692, 9333, 6594, 3821, 2468, 2571, 2883, 2447, 1060, -1645, -6066, -11136, -14364, -14274, -11940, -9505, -8075, -7623, -7922, -8590, -8852, -8142, -6677, -5024, -3454, -2069, -1084, -747, -1325, -3153, -6055, -8918, -10639, -11407, -12021, -12120, -10478, -7129, -3762, -1692, -849, -1061, -2663, -5128, -6691, -6325, -4967, -3941, -3323, -2754, -2543, -2940, -3363, -3398, -3598, -4294, -4721, -4380, -4117, -4610, -4804, -3335, -661, 1727, 3466, 5045, 5918, 4871, 2424, 1137, 2801, 6287, 8784, 8605, 6421, 4230, 3530, 4309, 5524, 6267, 6248]
55188F248p93j398j331n12J06k70r16D95K77N85K20K59Q29P91k07j040r86E28
55169a33j69I31K448K175Q10p6K92J140J231K19j005j164m6J127J169M10N1L61
55151A0073N50L26L70J076J907K354K681L177L396K649Q87j123k322k077q03K53
55135B3374K95j95l30m8J53K73N95P14j12j627k531k002o39K51j35j445k389j852
55117A2350j73J139J223O62O5q39j945j974m25R62M25j145j668j189j391k310
55101C767A632l56J364J955K275K941L019J941Q20O46O22k58j309j220j64N01
55085A4409K06k33J63J405K508K306O59j087j440o24l03j320k610k757j683k79
55069I320Q95J835K481K516J795P73L66J129K479L220L181L516M804N801N107
$$ y = [6248, 5455, 4057, 2726, 2214, 2320, 2050, 1134, 495, 772, 1357, 1577, 1836, 2665, 3456, 3249, 2209, 1223, 528, -133, -302, 931, 3379, 5554, 6364, 6288, 6580, 7720, 8951, 9170, 8165, 7001, 6955, 8082, 9251, 9661, 9712, 10073, 10623, 10949, 11319, 12395, 14302, 16656, 19337, 22514, 25910, 28559, 29446, 28323, 26001, 23924, 23121, 23374, 23669, 23474, 23144, 23096, 23249, 23522, 24117, 24831, 24719, 23092, 20561, 18559, 17920, 18171, 18036, 16591, 14202, 12350, 12177, 13316, 14539, 15201, 15266, 14427, 12482, 10508, 10083, 11045, 11470, 10325, 8657, 7468, 6077, 3767, 1632, 1276, 2640, 4595, 6870, 9811, 12830, 14771, 15591, 16237, 16859, 16601, 15292, 14072, 13908, 14409, 14615, 14382, 14545, 15950, 18458, 20764, 21423, 20336, 18896, 18272, 17969, 16649, 14039, 11282, 9599, 9320, 10215, 12050, 14531, 17047, 18842, 19615, 19981, 21110, 23589, 26809, 29990, 33506, 38310, 44111, 49218]
55054D9218L299K001J549J163Q93J402K020J082j372l090k553q89j56q90k053
55039E1624k469j616P5J333J180J77k91J46P40J161J712J989J048p92j875j456
55023E2686n09J41Q91J858K042R89j79m09j51j07J33J001J728J569J247J739K383
55006F7052J729j13j420j094J43R20P03j3l84k1O47P44p9j228j733j102L21J476
54988F6548J275k45j653j642o31K3N5L30R84J114O01O80J910K980K561J292P98
54971G6980J475K384K790K687K079Q07p52j646j391p07q00j881k758k273r01k35
54955G5858q10j452j179n43k67J66J232J844Q85n72o15N85J242J006J112J633
54939H0125J137n31j584j148m38l57j30O36P76k36r38k21P65N20n47j271j606
$$ y = [49218, 52517, 54518, 56067, 57230, 58123, 59525, 61545, 62627, 61255, 58165, 55612, 54723, 54567, 53677, 51624, 49155, 47539, 47614, 48947, 50127, 50304, 50013, 50159, 50899, 52060, 53772, 55761, 56809, 56017, 54142, 52686, 52177, 52318, 53209, 55067, 57109, 58098, 57919, 57510, 57359, 57252, 57385, 58386, 60114, 61683, 62930, 64669, 67052, 68781, 68668, 67248, 66154, 66297, 67217, 67920, 67907, 67523, 67502, 68149, 68893, 68814, 67586, 65853, 64751, 65072, 66548, 67823, 67578, 65925, 64283, 63652, 63675, 63730, 64060, 65044, 66158, 66759, 67439, 69349, 72329, 74890, 76182, 76980, 78455, 80839, 83629, 86316, 88395, 89202, 88450, 86804, 85413, 84706, 83906, 82025, 79267, 76994, 76093, 75858, 75048, 73596, 72417, 71874, 71607, 71773, 73005, 74849, 75734, 75162, 74547, 75132, 76374, 77380, 78492, 80125, 81262, 80731, 79147, 77999, 77561, 77204, 77074, 77710, 78486, 78250, 77312, 77091, 77856, 78376, 77829, 76558, 74952]
54922G4952j869j482j21J124J250R02J090J519J561J589J819J308k46j010N91
54907H2977L098L721K107L72N2R83K606M311M866L597J917J776K773K794J451
54892A19401O51J507K856L533M148N587P230P854P328O439N798N695O360P567
54878A91954Q576Q959R203R993J1311J2575J3167J2478J0014O029J722j850m907
54865B89224q387j2284j5177j5802j4674j3585j3494j3707j3169j1855j0305q527
54853A38258o320m198k952k409j701p07k25o07j225j318n26J370M035O082O438
54838A33995O245P693J0652J2472J1800J0629J1238J2939J3460J2210J0337Q465
54826B62135O131K989r13n574j0462j4034j5149j4588j4002j3821j3328j2298
$$ y = [74952, 73083, 71601, 71480, 72604, 73854, 74756, 75846, 77365, 78926, 80515, 82334, 83642, 83396, 82386, 82977, 86075, 89796, 91903, 92275, 92327, 93310, 95916, 100227, 105093, 108690, 110607, 112383, 115156, 117950, 119401, 120052, 121559, 124415, 127948, 132096, 137683, 144913, 152767, 160095, 166534, 172332, 178027, 184387, 191954, 200530, 209489, 218692, 228685, 239996, 252571, 265738, 278216, 288230, 294259, 295981, 294131, 289224, 280837, 268553, 253376, 237574, 222900, 209315, 195821, 182114, 168945, 157090, 146785, 138258, 131938, 127740, 124788, 122379, 120678, 119971, 119746, 119139, 117914, 116596, 116070, 117440, 121475, 127557, 133995, 140240, 147933, 158585, 171057, 182857, 193486, 204724, 217663, 231123, 243333, 253670, 262135, 268266, 271255, 270342, 264768, 254306, 240272, 225123, 210535, 196533, 182712, 169384, 157086]
54814A57086j1233j0337r425q589p901o824m963l091k307k508k694k556k568k832
54800G9258k838k247j128L15J528J626N18o19r12j087k026k832j961J47J323N32
54784F9597r69j574j068k70p4j026k842m182l827k194p33J01J200K985M380M071
54768F3575K036n35k419l049k644j759o78O43J868K155J286L60N27J486K051J828
54752F6731J404J146Q14L05NL39J413K948M118M030K798J604J194J128J099J804
54736I2880L450M632M190L267L787N499O483O151N854O556P866R516J1895J4690
54722A86716J6557J6861J6423J6038J5443J4198J2489J0499P969M813J302k459
54710C16849o226q818r012p551o765p601q479p880o652o454o988o337l671l00
$$ y = [157086, 145853, 135516, 126091, 117502, 109601, 102777, 97814, 94723, 92416, 89908, 87214, 84658, 82090, 79258, 76420, 74173, 73045, 73360, 74888, 76514, 77032, 76413, 75501, 74414, 72388, 69556, 67595, 67742, 69065, 69597, 68628, 67054, 65986, 65716, 65642, 64616, 61774, 57592, 53765, 51571, 50838, 50939, 52139, 55124, 59504, 63575, 65611, 65076, 62657, 59608, 56964, 55205, 54527, 55170, 57038, 59193, 60479, 60839, 61366, 62852, 64903, 66731, 68135, 69281, 70095, 70400, 70405, 70744, 72157, 75105, 79223, 83253, 86051, 87655, 88849, 89977, 91076, 92880, 96330, 100962, 105152, 108419, 112206, 117705, 124188, 130339, 136193, 142749, 150615, 160131, 172026, 186716, 203273, 220134, 236557, 252595, 268038, 282236, 294725, 305224, 313193, 318006, 319308, 316849, 310623, 301805, 292793, 285242, 278477, 270876, 262397, 254517, 247865, 241411, 234423, 228086, 224415, 224115]
54696B24115K040K854K730K319K035K303L475N446P680R836J1975J3883J4693
54683C05384J3975J2861J2887J3700J3411J1535R914R771R561P231L263l97l380
54670D19716o777j0664j4021j6762j9674k2218k2650k0685j8149j6484j5322j3988
54658B22322j2655j1369r619p674o797p318p799o994n342l758k298r66n51j447
54644A37735k734l352l300k774j328Q89K268J623J87J03J392J995P56j221k401
54629A29838k626k446j764j50J912L008K244K59j412j797j127j69O01J188J800
54614A29359K644L734M718N177N122M861M320L272K312K598M053M960M160K758
54600A84048K401K864K752J927J534J993K592L116M223N939P171P140O156M871
$$ y = [224115, 226155, 229009, 231739, 234058, 236093, 238396, 241871, 247317, 254997, 264833, 276808, 290691, 305384, 319359, 332220, 345107, 358807, 372218, 383753, 393667, 403438, 412999, 420230, 423493, 423096, 419716, 412939, 402275, 388254, 371492, 351818, 329600, 306950, 286265, 268116, 251632, 236310, 222322, 209667, 198298, 188679, 181005, 174208, 166890, 159091, 152097, 146755, 142997, 140699, 139733, 139182, 137735, 135001, 131649, 128349, 125575, 124247, 125136, 127404, 129027, 129214, 129317, 130709, 132704, 133460, 132239, 129838, 127212, 124766, 123002, 122852, 124764, 127772, 130016, 130275, 128863, 127066, 125939, 125770, 126371, 127559, 129359, 132003, 135737, 140455, 145632, 150754, 155615, 159935, 163207, 165519, 168117, 172170, 177130, 181290, 184048, 186449, 189313, 192065, 193992, 195526, 197519, 200111, 203227, 207450, 213389, 220560, 227700, 233856, 238727]
54586B38727L763L461M421O125P714R350J1734J4308J5494J4972J4212J4373J5080
54573C73734J5730J6477J7115J6267J2665O607m20o873j1703j4727j6760j8635
54561C89477k0019k0032j8866j7499j6013j3770j1220r737r454r044p910o698
54549B29215n339k929l06j48l136o212o438m701l704m041m402m387m643m934m284
54534A69611k719j222k17L92J69j318l285m484m844n124n358n039m391m038l723
54519A24410k800j781j900l153m142l910k837j653o96j35J6J37M62M31m92j683
54503A00274k018j451q62n60r7N12O58K90L0L0j76m97m2J507L204L957L682K976
54485A11417K324J966K018K283K321J921J282P67P43J475K724L736M150M708O251
$$ y = [238727, 242490, 245951, 250372, 256497, 264211, 273561, 285295, 299603, 315097, 330069, 344281, 358654, 373734, 389464, 405941, 423056, 439323, 451988, 458595, 458175, 451302, 439599, 424872, 408112, 389477, 369458, 349426, 330560, 313061, 297048, 283278, 272058, 262321, 252867, 243823, 235913, 229215, 223876, 220947, 220641, 220493, 217357, 211145, 204707, 200006, 196302, 192261, 187859, 183472, 178829, 173895, 169611, 166892, 165670, 165453, 165845, 166014, 164696, 161411, 156927, 152083, 146959, 141601, 136562, 132171, 128133, 124410, 121610, 119829, 117929, 114776, 110634, 106724, 103887, 102234, 101538, 101403, 101419, 101556, 102018, 102449, 101957, 100274, 98256, 96805, 95943, 95383, 95286, 95798, 96456, 96746, 96776, 96806, 96630, 96133, 96091, 97598, 100802, 104759, 108441, 111417, 113741, 115707, 117725, 120008, 122329, 124250, 125532, 126299, 127042, 128517, 131241, 134977, 139127, 143835, 150086]
54470A50086Q155Q782P693O508P040R041J0443R652P222N121M486M389K980k74
54456B41324m080o963q685r625r670q648p349p034p893q855r009q515p912p191
54442A29895n940m161k530j789j914k016j340l48k26j272k367k440j739j043l35
54427A00435P98J902J930Q41j71k54R5J3l23m4R80J589O55j347k425j087J909
54410A05496M198M203K504Q01J24L51R31J426J474Q10l79j299r43R93L510N000
54394A29200M809L769K835J761p5k168l328l423l264k926j753k11l7j788l692
54379A19709l884k586j120J1R24J278P96J30K0J62o2m50n65q35j835l030l337
54362A05326k524j061Q60K997M351M037K594J326P17M22L15M13L52Q8O22K603
$$ y = [150086, 158241, 167023, 174716, 181224, 188264, 197305, 207748, 217400, 224622, 229743, 234229, 238618, 241598, 241324, 237244, 230281, 221596, 211971, 202301, 193653, 186304, 179270, 171377, 162522, 153513, 144998, 137086, 129895, 123955, 119794, 117264, 115475, 113561, 111545, 110205, 109857, 109631, 108359, 105992, 103552, 101813, 100770, 100435, 101233, 103135, 105065, 105906, 105735, 105481, 105576, 105589, 105266, 105222, 106202, 107791, 108446, 107099, 104674, 103587, 105496, 109694, 113897, 116401, 117202, 117326, 117677, 118608, 120034, 121508, 122318, 121939, 120640, 119697, 120690, 124200, 129200, 134009, 137778, 140613, 142374, 142299, 140131, 136803, 133380, 130116, 127190, 125437, 125226, 125189, 123401, 119709, 115825, 113239, 112119, 112130, 113054, 114332, 115128, 115258, 115278, 115440, 115378, 114928, 114363, 113528, 111693, 108663, 105326, 102802, 101741, 102601, 105598, 109949, 113986, 116580, 117906, 118623, 119045, 119360, 119773, 120125, 120213, 120835, 123438]
54346A23438M757N168L898K768K815L508M336N451O449O253M734L226K838L319
54332A82958L884M135L813K749J409N95L52L8m90q83j407k688m190m591m006m114
54316A77564n409o068m739k810k356l069l095k134j673k348k962k452j284l32
54302A36833L80J143J691J691J404J065J73j636l364l443j754J08R10J108J595
54287A37904K161K141J853K087K525K164J178R41J898K889L051K891K759J778
54273A68220m49k367k344j140q48j885k762k623k345k853l796m457m858n381n962
54258A24150o068n193l311j212o3j37m46k05r8j082k570l154k770k586k853k536
54242H9866j325m03n89j071p85M9N56N14K13k69q26r11j65Q17J027J89r47j312
$$ y = [123438, 128195, 133363, 137261, 140029, 142844, 146352, 150688, 156139, 162588, 168841, 173575, 176801, 179639, 182958, 186842, 190977, 194790, 197539, 198948, 199543, 199895, 199933, 199443, 198560, 197153, 194465, 190275, 185684, 181678, 177564, 172155, 166087, 161348, 158538, 156182, 153113, 150018, 147884, 146211, 143863, 140901, 138449, 137165, 136833, 137213, 138356, 140047, 141738, 143142, 144207, 144380, 142744, 139380, 135937, 134183, 134291, 135201, 136309, 137904, 140065, 142206, 144059, 146146, 148671, 150835, 152013, 152954, 154852, 157741, 160792, 163683, 166442, 168220, 167771, 165404, 163060, 161920, 161072, 159187, 156425, 153802, 151457, 148604, 144808, 140351, 135493, 130112, 124150, 118082, 112889, 109578, 108366, 108303, 108166, 107720, 107515, 107417, 106335, 103765, 100611, 97841, 95255, 92402, 89866, 88541, 88138, 87549, 86478, 85693, 85742, 86298, 86812, 87025, 86756, 85930, 85019, 84854, 85671, 86698, 86887, 85940, 84628]
54224H4628m38J077J923J321j05j093j246j163j296j388j119m62N98J876K440
54209H5553J349q23k153j565J2J124J523J758J841J362N00O5N19J433J956J596
54193I6050O35r4K8P23J135P84r6r92j476j268m96J40N2m12l98K72Q79P78l6j194
54173I5014k064j791j96J485J843J275J531L048M167L626K421K120K453J915J79
54158A17026j454j942j646j488j718j918j754j399j199j150q58j37O01R52J214
54143A03130J785K060R19j452l211k919j237k0k31j403k524k777j785L6J434J284
54127I3089k78j986k701k285j479j203j825k733k731j200J084K475J879l81k935
54112G6790m432m325k879p48J325K616K667J709O02J05K83P05R64Q61L91k46q08
$$ y = [84628, 84190, 85267, 87190, 88511, 88406, 87313, 86067, 84904, 83608, 82220, 81101, 80639, 81237, 83113, 85553, 86902, 86079, 83926, 82361, 82373, 83497, 85020, 86778, 88619, 89981, 90481, 90546, 91065, 92498, 94454, 96050, 96685, 96591, 96619, 97342, 98477, 99261, 99165, 98173, 96697, 95429, 94933, 95073, 95125, 94713, 94315, 94587, 95466, 96244, 96208, 95014, 92950, 91159, 90963, 92448, 94291, 95566, 97097, 100145, 104312, 107938, 110359, 112479, 114932, 116847, 117026, 115572, 113630, 111984, 110496, 108778, 106860, 105106, 103707, 102508, 101358, 100500, 100363, 100964, 101916, 103130, 104915, 106975, 107894, 106442, 103231, 100312, 99075, 99055, 98824, 97421, 94897, 92120, 90335, 90371, 91805, 93089, 92811, 90825, 88124, 85839, 84360, 83157, 81332, 78599, 75868, 74668, 75752, 78227, 80106, 79725, 76790, 72358, 68033, 65154, 64406, 65731, 68347, 71014, 72723, 73325, 73430, 73713, 74418, 75382, 76243, 76634, 76388, 75580]
54095G5580j226j328n79J075K178R11k188m114l054q73n23k036k955k083p00r4
54079E7991O0L64M92Op29j058o37O11K222K956K026N25J60O85L00j181j724l61
54061F2708J062O81n51n39P15J419Q00j44n14o60j286k288k798k016p6J854K655
54044F1022K476K235K008J033n33j315p51n6k10l05P98K266K263O06j005j238
54028F9294m54K21K16j08Q9J169K363K554J892J693K294K356J128J38J071K953
54012H8869L225J261q80j222Q3J689K642K627J751P49P50K230M353N570M821K389
53996A20907k49j591j521j172j189q79L51J550J440N10O16K378M259M594L556
53981A33560K626K805L854M950N476N345M870M420M195M280M652N053N070M680
$$ y = [75580, 74354, 73026, 72447, 73522, 75700, 76611, 74423, 70309, 67255, 66382, 65859, 63823, 60868, 58785, 58085, 57991, 58051, 58415, 58907, 58913, 58184, 57126, 56489, 57100, 59322, 62278, 64304, 64829, 64989, 65674, 65974, 64793, 63069, 62708, 63770, 64451, 63900, 63361, 64076, 65495, 66295, 66151, 65637, 64977, 63691, 61403, 58605, 56589, 56513, 58367, 61022, 63498, 65733, 67741, 68774, 68241, 66926, 66175, 66119, 65909, 65604, 66402, 68668, 70931, 71537, 70532, 69294, 68840, 69061, 69277, 69169, 69258, 70427, 72790, 75344, 77236, 78929, 81223, 83579, 84707, 84845, 85916, 88869, 92094, 93355, 92475, 91253, 91336, 93025, 95667, 98294, 100045, 100794, 101544, 103774, 108127, 113697, 118518, 120907, 120658, 119067, 117546, 116374, 115185, 114306, 114657, 116207, 117647, 118157, 118773, 121151, 125410, 130004, 133560, 136186, 138991, 142845, 147795, 153271, 158616, 163486, 167906, 172101, 176381, 181033, 186086, 191156, 195836]
53967A95836M574N497P316R023R756R528Q880P955O318L979K199K490M547O129
53953B84027N675M237L754M067L319J034j000j335p53q37j958l544n188o553p049
53938B77896o533n682m999m243l425l354m359n298m858l252j821j500k371l984
53924B22217n427n788n199m730m733m297k871j268l47L4j00j398l371l700j186
53909A77836J926K622J183K54O65P29m19j405j098l38k81o16n07q9o5n02p36j29
53891A79030J399L155L971L286J946J294J623K117K146J886J837K453M062O348
53877B16553Q154Q660Q457Q618R046Q776P586O132M642K718N31r74j309r99p15
53862B85876n66l37K86J684L758N546O098N681N319N418N657O011O831P965Q698
$$ y = [195836, 200410, 205907, 213223, 222246, 232002, 241530, 250410, 258365, 264683, 268662, 270861, 273351, 277898, 284027, 289702, 293939, 297693, 301760, 305079, 306113, 305113, 303778, 303025, 302188, 300230, 296686, 291498, 284945, 277896, 271363, 265681, 260682, 256439, 253014, 249660, 245301, 240003, 235145, 231893, 230072, 228572, 226201, 222217, 216790, 211002, 205803, 201073, 196340, 192043, 189172, 187904, 187557, 187591, 187491, 186093, 182722, 179022, 177836, 179762, 182384, 183567, 183821, 184486, 185215, 184796, 183391, 182293, 181955, 181674, 181058, 180551, 180462, 180397, 179895, 179159, 179030, 180429, 183584, 187555, 190841, 192787, 194081, 195704, 197821, 199967, 201853, 203690, 206143, 210205, 216553, 224707, 233367, 241824, 250442, 259488, 268264, 275850, 281982, 286624, 289342, 289873, 288899, 287590, 286591, 285876, 285310, 284973, 285259, 286943, 290701, 296247, 302345, 308026, 313345, 318763, 324420, 330431, 337262, 345227, 353925]
53847C53925Q604P916P220P258Q451R928R819P473M597K992K069J77k351l505
53833D24573k687j499j308j796k266k700l164l524m141n512p091p761p713q356
53819C65055j0082j1533j1493j0255q785p763p642q300q493p169n386n236o623
53806B56295p054n276l147k896m319n822o705p064o777n931n378n540n508m325
53792A80553k457j054n10p02j788l740n590o140n140l284j508o13p96j128m20
53777A45683J084J832J187L34M25J005J086O60K21j14k51K46J194J499O08o13
53761A56086j223j391j503j263o96o72j342j204P91L348M434L982L443L503L807
53746A70100M268M951N140M246L286L804N484O511O254O018O845Q109Q734Q572
$$ y = [353925, 362529, 370445, 377665, 384923, 393374, 403302, 413121, 420594, 425191, 428183, 430252, 430429, 428078, 424573, 421886, 420387, 419079, 417283, 415017, 412317, 409153, 405629, 401488, 395976, 388885, 381124, 373411, 365055, 354973, 343440, 331947, 321692, 312907, 305144, 297502, 289202, 280709, 273540, 268154, 262918, 256295, 249241, 243965, 240818, 237922, 233603, 227781, 221076, 214012, 207235, 201304, 195926, 190386, 184878, 180553, 178096, 177042, 176532, 175830, 174042, 170302, 164712, 158572, 153432, 150148, 148640, 148027, 147231, 146103, 145683, 146767, 148599, 149786, 150120, 150545, 151550, 152636, 153296, 153517, 153403, 153152, 153398, 154592, 156091, 156699, 156086, 154863, 153472, 151969, 150706, 150010, 149338, 147996, 146792, 147583, 150931, 155365, 159347, 162790, 166293, 170100, 174368, 179319, 184459, 188705, 191991, 195795, 201279, 207790, 214044, 220062, 226907, 235016, 243750, 252322]
53732B52322Q129P860Q159R130J0082R986Q728P263O272N390L978K052J94r86
53718C38559j119l55M68L14j107l079m547n002m842m948n716o386n959m823m565
53703B86893n747o879o481n190m645n031n246n003n026n167m159j806J05r8j967
53688B24553l821m803n052m641l555k440k305l178l823l077j095J011K271K350
53674A92395J373q3r99o38N27J142O18k3N77K376L988M168K750N34j052o36J778
53657B08795M377N307M658L780L098K038Q73O40J027L33j766l318k999k017j641
53642B23185p23K113N289N894L906K182K303K807K166J211J467K703L645M047
53628B62195M675N629N986N300M430M424N035N012L847K469J800J296lj379r54
$$ y = [252322, 260451, 268311, 276470, 285600, 295682, 305668, 314396, 321659, 327931, 333321, 337299, 339351, 339545, 338559, 337440, 337085, 337553, 337867, 336760, 333681, 329134, 324132, 319290, 314342, 308626, 302240, 296281, 291458, 286893, 281146, 274267, 267786, 262596, 257951, 252920, 247674, 242671, 237645, 232478, 228319, 226513, 226618, 226520, 224553, 220732, 215929, 210877, 206236, 202681, 200241, 197936, 194758, 190935, 187858, 186763, 187774, 190045, 192395, 193768, 193685, 192686, 192048, 192575, 193717, 194335, 194312, 194889, 197265, 201253, 205421, 208171, 208705, 207653, 207017, 208795, 213172, 218479, 223137, 226917, 230015, 232053, 232926, 233566, 234593, 234926, 233160, 229842, 226843, 224826, 223185, 222462, 224575, 229864, 235758, 239664, 241846, 244149, 246956, 249122, 250333, 251800, 254503, 258148, 262195, 266870, 272499, 278485, 283785, 288215, 292639, 297674, 302686, 306533, 309002, 310802, 312098, 312095, 310716, 309762]
53613C09762J407L247K529K83j053r27q46j808l099l508k547n81J339J921R87
53598C07106M2M23J324R69n30j174M3J809K508K129J597J389J499J791J756P65
53582C23446p73j357j47J846K986K856K233J806J621J479J256R68Q80J353K260
53567C42713K814K376J264M81Q50K462M684O471O939O101N030M952N974O791N935
53552D05837L592J923K986O295R134R491P966O443N892O266P507R284J0265R282
53538E02163P186O211P290R109J0099J0067R510Q590P551P117P533P767O623M313
53524F11129K344J970L141M733N423M673L228K394K653L213L132K489K107K474
53510F55103L117L034J623m96j764j250J87Q47K84l87l38j38n18j015p56O1N04
$$ y = [309762, 311169, 314416, 316945, 317228, 316175, 315248, 314402, 312594, 309495, 305987, 303440, 302859, 304198, 306119, 307106, 307148, 307571, 308895, 309864, 309334, 308160, 308203, 310012, 312520, 314649, 316246, 317635, 319134, 320925, 322681, 323446, 322673, 321316, 321169, 323015, 326001, 328857, 331090, 332896, 334517, 335996, 337252, 338220, 339100, 340453, 342713, 345527, 347903, 349167, 349648, 350498, 352960, 357644, 364115, 371054, 377155, 382185, 387137, 393111, 399902, 405837, 409429, 411352, 414338, 420633, 429767, 439258, 447224, 453667, 459559, 465825, 473332, 482616, 492881, 502163, 509349, 515560, 522850, 531959, 542058, 552125, 561635, 570225, 577776, 584893, 592426, 600193, 606816, 611129, 613473, 615443, 618584, 623317, 628740, 633413, 636641, 639035, 641688, 644901, 648033, 650522, 652629, 655103, 658220, 661254, 662877, 662381, 660617, 659367, 659554, 660401, 660685, 660298, 659960, 659822, 659304, 658289, 657533, 657594, 658098]
53493F58098M38O96J582K197J623K29p30m88P21K321L858M755M303K646J351K173
53477F85773M994P793Q956Q938R156J0032J0985J1751J2650J3636J4185J4156
53465H13005J3959J3792J3613J3909J5511J8250K0787K2272K3411K5183K7119
53454A020811K7715K6422K4552K4126K6003K9124L1577L2611L3412L5446L8234
53443A350033L9762L9246L8450L9469M2088M4351M5243M5546M6060M6245M5252
53432A821745M3462M2213M2212M2846M3072M2618M2054M1965M2195M1989M0835
53421B287206L9138L7908L7649L7590L6400L3688L0491K8020K6404K5087K4129
53410B643710K4198K5232K5968K5185K2851J9626J5906J1961Q594O723O261N870
$$ y = [658098, 658536, 659232, 660814, 663011, 664634, 664863, 664133, 663645, 664366, 666687, 670545, 675300, 679603, 682249, 683600, 685773, 690767, 698560, 707516, 716454, 725610, 735642, 746627, 758378, 771028, 784664, 798849, 813005, 826964, 840756, 854369, 868278, 883789, 902039, 922826, 945098, 968509, 993692, 1020811, 1048526, 1074948, 1099500, 1123626, 1149629, 1178753, 1210330, 1242941, 1276353, 1311799, 1350033, 1389795, 1429041, 1467491, 1506960, 1549048, 1593399, 1638642, 1684188, 1730248, 1776493, 1821745, 1865207, 1907420, 1949632, 1992478, 2035550, 2078168, 2120222, 2162187, 2204382, 2246371, 2287206, 2326344, 2364252, 2401901, 2439491, 2475891, 2509579, 2540070, 2568090, 2594494, 2619581, 2643710, 2667908, 2693140, 2719108, 2744293, 2767144, 2786770, 2802676, 2814637, 2823231, 2829954, 2836215, 2842085]
53398B842085L922m00o591j3052j8079k1098k2819k4045k4785k4940k5228k6596
53386B638374k8949l1283l2994l4353l5604l6305l5896l4692l4006l5047l7403
53375B261842l8891l7639l4410l1949l1587l1676l0036k6722k3150j9621j5560
53364A940601j1549r066q080o850m500k083n18R92L496O507Q838J0479J2547J5761
53350A956575J9732K3513K6308K7954K9139L0903L3671L6911L9872M2331M4542
53339B311451M6969N0055N3758N7352O0173O2370O4412O6235O7738O9658P2727
53328B982898P6137P8405P9727Q1817Q5123Q7946Q9037Q9322R0031R0698R0371
53317C921512Q9417Q8596Q7442Q5204Q2524Q0400P8006P3464O6659N9663N4111
$$ y = [2842085, 2846007, 2845607, 2839016, 2825964, 2807885, 2786787, 2763968, 2739923, 2715138, 2690198, 2664970, 2638374, 2609425, 2578142, 2545148, 2510795, 2475191, 2438886, 2402990, 2368298, 2334292, 2299245, 2261842, 2222951, 2185312, 2150902, 2118953, 2087366, 2055690, 2025654, 1998932, 1975782, 1956161, 1940601, 1929052, 1919986, 1911906, 1905056, 1900556, 1898473, 1897955, 1898947, 1902443, 1908950, 1917788, 1928267, 1940814, 1956575, 1976307, 1999820, 2026128, 2054082, 2083221, 2114124, 2147795, 2184706, 2224578, 2266909, 2311451, 2358420, 2408475, 2462233, 2519585, 2579758, 2642128, 2706540, 2772775, 2840513, 2910171, 2982898, 3059035, 3137440, 3217167, 3298984, 3384107, 3472053, 3561090, 3650412, 3740443, 3831141, 3921512, 4010929, 4099525, 4186967, 4272171, 4354695, 4435095, 4513101, 4586565, 4653224, 4712887, 4766998]
53306D766998M9573M4713L8836L1976K4629J7769J2130P051Q29p328j6447k5113
53294D945616l2855l9810m5959n1379n6644o2201o7749p2712p6941q0417q2743
53283D276206q3804q4508q5808q6995q6117q2597p8501p6366p6344p6391p4912
53272C383863p2265o9784o8320o7899o7732o6298o2415n6819n1799m8713m6701
53261B705118m4344m1622l9284l7337l5311l3224l1032k7973k3857k0233j8584
53250B352317j8037j6789j5224j5149j6105j5255j1576p488n246m085k398n19
53238B224446O83K026M560P209Q230Q224R433J2482J5908J8715K1352K4178K6723
53225B384169K8737L0537L2093L3096L4003L5643L7576L8252L7147L5520L4607
$$ y = [4766998, 4816571, 4861284, 4900120, 4932096, 4956725, 4974494, 4986624, 4993675, 4994504, 4987176, 4970729, 4945616, 4912761, 4872951, 4826992, 4775613, 4718969, 4656768, 4589019, 4516307, 4439366, 4358949, 4276206, 4192402, 4107894, 4022086, 3935091, 3848974, 3766377, 3687876, 3611510, 3535166, 3458775, 3383863, 3311598, 3241814, 3173494, 3105595, 3037863, 2971565, 2909150, 2852331, 2800532, 2751819, 2705118, 2660774, 2619152, 2579868, 2542531, 2507220, 2473996, 2442964, 2414991, 2391134, 2370901, 2352317, 2334280, 2317491, 2302267, 2287118, 2271013, 2255758, 2244182, 2236694, 2231448, 2227363, 2224965, 2224446, 2225129, 2227155, 2231715, 2238924, 2247154, 2255378, 2264811, 2277293, 2293201, 2311916, 2333268, 2357446, 2384169, 2412906, 2443443, 2475536, 2508632, 2542635, 2578278, 2615854, 2654106, 2691253, 2726773, 2761380]
53214B761380L4179L3419L2223L0953K9601K7848K5519K2621J9173J5204J0700
53203C042820N743J015k268l757m973p917j2722j7536k0797k2718k4515k7032
53191B905343l0359l3856l6430l7568l8204l9765m2284m4439m5492m6005m6376
53180B464565m6028m4605m2960m2069m1824m1533m0931l9921l8219l6051l4484
53169B015940l4120l4119l3452l2491l2239l2482l2085l0861k9795k9259k8340
53158A666697k6339k3851k1741k0067j8791j8725k0599k3464k5124k4417k2443
53147A421136k1315k2131k4395k6926k8909l0086l0315k9309k7058k4415k2752
53136A133525k2745k3690k4411k4667k5079k5846k6274k5723k4360k2688k1031
$$ y = [2761380, 2795559, 2828978, 2861201, 2892154, 2921755, 2949603, 2975122, 2997743, 3016916, 3032120, 3042820, 3048563, 3049578, 3047310, 3043553, 3038580, 3030663, 3017941, 3000405, 2979608, 2956890, 2932375, 2905343, 2874984, 2841128, 2804698, 2767130, 2728926, 2689161, 2646877, 2602438, 2556946, 2510941, 2464565, 2418537, 2373932, 2330972, 2288903, 2247079, 2205546, 2164615, 2124694, 2086475, 2050424, 2015940, 1981820, 1947701, 1914249, 1881758, 1849519, 1817037, 1784952, 1754091, 1724296, 1695037, 1666697, 1640358, 1616507, 1594766, 1574699, 1555908, 1537183, 1516584, 1493120, 1467996, 1443579, 1421136, 1399821, 1377690, 1353295, 1326369, 1297460, 1267374, 1237059, 1207750, 1180692, 1156277, 1133525, 1110780, 1087090, 1062679, 1038012, 1012933, 987087, 960813, 935090, 910730, 888042, 867011]
53125H67011j9839j9736k0578k1066k0190j8725j8285j9004j9237j7785j5504
53114F57062j4238j4660j5661j5565j3726j1161r635r898j0817j0652r045p281
53102E14723o679p397q753r920j0196r349p956o925o543o533o865p627q128p399
53088D04453n834n113n962p022o752n414m330l980l874l648l296k700j908j519
53074C43101k019k992l662l812l636l141k416j969j985j708m41J161J713P48r36
53059C18006k361l067k992k437k029k139k453k464k058j334m49Po41j929k429
53044B89231j847j750l133m534m146k721k468l700m675m395l564k732j566k40
53030B47760L22N9jM42N71K75P01K280L866M565M883N236M948L825L201M027N152
$$ y = [867011, 847172, 827436, 806858, 785792, 765602, 746877, 728592, 709588, 690351, 672566, 657062, 642824, 628164, 612503, 596938, 583212, 572051, 562416, 552518, 541701, 531049, 522004, 514723, 508044, 500647, 491894, 481974, 471778, 462429, 454473, 447548, 441005, 434472, 427607, 419980, 411852, 404453, 398619, 393506, 387544, 380522, 373770, 368356, 364026, 360046, 356172, 352524, 349228, 346528, 344620, 343101, 341082, 338090, 334428, 330616, 326980, 323839, 321423, 319454, 317469, 315761, 315320, 316481, 318194, 318942, 318006, 315645, 312578, 309586, 307149, 305120, 302981, 300528, 298064, 296006, 294672, 294223, 294230, 293589, 291660, 289231, 287384, 285634, 282501, 277967, 273821, 271100, 268632, 264932, 260257, 255862, 252298, 249566, 248000, 247760, 248082, 248141, 248140, 248582, 249153, 249428, 250129, 252409, 256275, 260840, 265723, 270959, 275907, 279732, 282933, 286960, 292112]
53013B92112M951L717K887K746K374J426M37l41j185k091k822l616m900o373p225
52998B82097p131o280m831l134k107k249k643k123j385k338n175p432o830m031
52984B24408j664j175j638j393m7J279J213m56k530l528l108k270k025k367k680
52969B02019k718k680k572k214j805j849k300k511k228k077k553l039k577j287
52955A69609k04J59K89O27Q76O25l0p92j469j709j145j44L62K63O27K014L300
52938A73258L114J728M71j66o06q57m52K22K5j228k195j700j60J106J418J138
52922A75116J018J455K156K411J966J485J656K117J854O16p85j454j081K05J822
52907A90557K740K357J418J163J701K110J995J823J721J234N81P39J826K510J821
$$ y = [292112, 297063, 300780, 303667, 306413, 308787, 310213, 310650, 310309, 309124, 307033, 304211, 300595, 295695, 289322, 282097, 274966, 268686, 263855, 260721, 258614, 256365, 253722, 251599, 250214, 247876, 242701, 235269, 228439, 224408, 222744, 221569, 219931, 218538, 218491, 219770, 220983, 220527, 217997, 214469, 211361, 209091, 207066, 204699, 202019, 199301, 196621, 194049, 191835, 190030, 188181, 185881, 183370, 181142, 179065, 176512, 173473, 170896, 169609, 169405, 169564, 169853, 170480, 171356, 171981, 171951, 171159, 169690, 167981, 166836, 166692, 167054, 167317, 167944, 169958, 173258, 176372, 178100, 178571, 178405, 177799, 176942, 176490, 176712, 176737, 175509, 173314, 171614, 171454, 172560, 173978, 175116, 176134, 177589, 179745, 182156, 184122, 185607, 187263, 189380, 191234, 191850, 191065, 189611, 188530, 188735, 190557, 193297, 195654, 197072, 198235, 199936, 202046, 204041, 205864, 207585, 208819, 209400, 210139, 211965, 214475, 216296]
52892B16296N63K12J069K167K498J846R78J138K645M045L679K171J873L448M799
52877B49427M146K489J686J672J317Q40J379K751L648L808M162M859M934M194
52863B91312L767M219M527L637J931L86p52j624j919j405p65r19j586j517l99
52848B98893K92j046l935n991n441k981p37J41J04j82p38j396j103R26L682M941
52832B85429L435J41k652l316k114q33j003k308l020k236j043r84j841j889k89
52817B65477J703K195P96j147k115j869j282j042q36%J187J429l1k167k892j192
52801B58214J729L511K934J023j23L16J118O98q91k171k100q85P86K418L477L457
52785B73511K576J695J313J237J414K138L111L312K316Q73l25j469k562k636j172
$$ y = [216296, 216859, 217071, 218140, 220307, 222805, 224651, 225629, 226767, 229412, 233457, 237136, 239307, 241180, 244628, 249427, 253573, 256062, 257748, 259420, 260737, 261577, 262956, 265707, 269355, 273163, 277325, 282184, 287118, 291312, 295079, 299298, 303825, 307462, 309393, 309779, 309027, 307403, 305484, 304079, 303314, 302395, 300809, 299292, 298893, 299185, 298139, 294204, 288213, 282772, 279791, 279054, 279195, 279299, 279117, 278379, 276983, 275880, 276806, 280488, 285429, 288864, 289005, 286353, 283037, 280923, 280090, 279087, 276779, 273759, 271523, 270480, 269496, 267655, 265766, 265477, 267180, 269375, 270171, 269024, 266909, 265040, 263758, 262716, 261880, 261880, 263067, 264496, 264465, 262298, 259406, 258214, 259943, 263454, 266388, 267411, 267288, 267604, 268722, 269420, 268529, 266358, 264258, 263373, 264159, 266577, 270054, 273511, 276087, 277782, 279095, 280332, 281746, 283884, 286995, 290307, 292623, 293496, 293171, 291702, 289140, 286504, 285332]
52770B85332N51Q19l27j437j802j914k017j626p00j41o73j926k987l202k315m60
52754B65175J567K576K009N63m40k84O22J339J467J524K084K728K455J141j26
52739B84400n35o63j538l131m381m403l220j672r40j648l058l807l753m112n312
52724B42227n936m815l006k338k886l464l911m992o456p091o739o358n936m230
52710A74069j192J129J071o27k187k979l267k875j464L24J176M78j203k766l326
52695A56361k781j991k039k855l179k275r97o00j143j770k032k141k242k283k409
52680A25624k810l243l243k740j954q36P04K088K219O35j878m007m894m325k475
52665I8865Q3K312L251K822J800Q27k23j597k739k743j649n54j83p7L76R10J062
$$ y = [285332, 285883, 286702, 286375, 284938, 283136, 281222, 279205, 277579, 276879, 276738, 276065, 274139, 271152, 267950, 265635, 265175, 266742, 269318, 271327, 271890, 271450, 271166, 271788, 273127, 274594, 276118, 278202, 280930, 283385, 284526, 284400, 283865, 283202, 281664, 278533, 274152, 269749, 266529, 264857, 263917, 262269, 259211, 255404, 251651, 247539, 242227, 236291, 231476, 228470, 226132, 223246, 219782, 215871, 210879, 204423, 197332, 190593, 184235, 178299, 174069, 172877, 174006, 175077, 174450, 172263, 169284, 166017, 163142, 161678, 162002, 163178, 163656, 162453, 159687, 156361, 153580, 151589, 149550, 146695, 143516, 141241, 140244, 139644, 138501, 136731, 134699, 132558, 130316, 128033, 125624, 122814, 119571, 116328, 113588, 111634, 110798, 111502, 113590, 115809, 116444, 114566, 110559, 105665, 101340, 98865, 98948, 101260, 104511, 107333, 109133, 109960, 109737, 108140, 105401, 102658, 101009, 100455, 100272, 100195, 100571, 101481, 102543]
52648A02543J156J666K029J252m08j520j429j074j596k887l887l630j843Q13K817
52633I4002K947J734J013J675K647K559J574Q23P09O65K61k69m96k78J23J18o55
52616A09152j538j260L85J853J704O25N40J937L282L233K306J737J679J455J105
52601A28195J561L116M538M293K415N78L14J525K863L308K988K565K275J691L71
52586A62596j393k574k389j379j148k489m102l952j817K64M17j020k348k741k731
52571A33194k856k809k104q17O51K009K922K913J898N97j54m79j221k539l297
52556A27908k421n17N93N3j013j058j34L16n28j856k441k100j482p98M26K273
52540A17221L780L880K832K017K203K584J962M50p36r15n63k97j27l3l51r25p00
$$ y = [102543, 103699, 105365, 107394, 108646, 108238, 106718, 105289, 104215, 102619, 99732, 95845, 92215, 90372, 91185, 94002, 96949, 98683, 99696, 101371, 104018, 106577, 108151, 108974, 109683, 110348, 110609, 110340, 109844, 109566, 109689, 109807, 109152, 107614, 106354, 106739, 108592, 110296, 110921, 111461, 113398, 116680, 119913, 122219, 123956, 125635, 127090, 128195, 129756, 132872, 137410, 141703, 144118, 144696, 145010, 146535, 149398, 152706, 155694, 158259, 160534, 162225, 162596, 161203, 158629, 156240, 154861, 153713, 151224, 147122, 143170, 141353, 141617, 142034, 141014, 138666, 135925, 133194, 130338, 127529, 125425, 124608, 125259, 127268, 130190, 133103, 135001, 135598, 135444, 134965, 133744, 131205, 127908, 125487, 124970, 125563, 125616, 124603, 123545, 123411, 123727, 123199, 121343, 118902, 116802, 115320, 114522, 114948, 117221, 121001, 124881, 127713, 129730, 131933, 134517, 136479, 136929, 136193, 135278, 134715, 134418, 134291, 134258, 133907, 132982, 132282]
52523A32282R67L095M068L617K915K838L003K670J754Q07M95J236K813M263M620
52508A71443L827K474R18o92j658j147M34J366N82r20j124Q15L809N842N589L404
52492A94962J057J96Q54J798K156K085J862J319N07mp3m34j449k212j681k13R39
52475B01669J228J014N43k66j144j608j820k311k766k084j34J536J490K76k70
52460A95353O58K022K370J419%j048j499j474j022k18N24O16Qn16j73O90R52L28
52442A98990JR16J999J244j336l112j923J046K626J491o80j887k230k919l835
52427A90391l373o64K996N289N069L130J102j7k92k58l45p01j102r00L43J941
52411B02609K434J315k11q76r63j261j338m26N50p6j702j819J02J459M30j258
$$ y = [132282, 133249, 136344, 140412, 144029, 146944, 149782, 152785, 155455, 157209, 158016, 158511, 159747, 162560, 166823, 171443, 175270, 177744, 178662, 177970, 176312, 175165, 175599, 176965, 177547, 176627, 175503, 176318, 180127, 185969, 191558, 194962, 196019, 196215, 197069, 198867, 201023, 203108, 204970, 206289, 206796, 206792, 206719, 206285, 204836, 202624, 200943, 200730, 201669, 202897, 203911, 204454, 204188, 203044, 201436, 199616, 197305, 194539, 192455, 192321, 193857, 195347, 195623, 195353, 196011, 198033, 200403, 201822, 201822, 200774, 199275, 197801, 196779, 196561, 197085, 197701, 197709, 197193, 197020, 197710, 198662, 198990, 198991, 199907, 201906, 203150, 201814, 198702, 196779, 197825, 200451, 201942, 201262, 199375, 197145, 194226, 190391, 187018, 186354, 189350, 194639, 199708, 202838, 203940, 203923, 203631, 203373, 203028, 202327, 201225, 200325, 200668, 202609, 205043, 206358, 206147, 205271, 204308, 203047, 201709, 201283, 201833, 201757, 200055, 198236, 198338, 199797, 200227, 198969]
52395A98969j257k19j27o74q4J313J328m39j870j578n01J92O11Q71L91o38q89
52378A95399j2M74n18j872j972q84K39R94J651K043J692P68R3M10J874L814M827
52361B09020L970K022O61K51k68j257j675j013k17J23P05J669J606q7j576j190
52345B12744j55n53j677j045J480L240K648J084L14J79j82n14j88L92M96M65J179
52328B19907K449L015K252J174J369L250N508O248M671J789m28o42Q74K616L272
52313B57324K864K442K634L063L451M452O374P716O586L572J515J923L160L050
52299C10126J780J037J550K756M033M819M261K262M30O21K755N096O326O258N089
$$ y = [198969, 197712, 197493, 197366, 196692, 196608, 197921, 199249, 198810, 196940, 195362, 194861, 195053, 195664, 196535, 196926, 196288, 195399, 195387, 195861, 195343, 193471, 191499, 190615, 190854, 191848, 193499, 195542, 197234, 198002, 198095, 198505, 200379, 204193, 209020, 212990, 215012, 215673, 215924, 215656, 214399, 212724, 211711, 211494, 211617, 212322, 213991, 215597, 215510, 213934, 212744, 212589, 212036, 210359, 209314, 210794, 214034, 216682, 217766, 218080, 218259, 218077, 217563, 217375, 217767, 218263, 218728, 219907, 222356, 225371, 227623, 228797, 230166, 233416, 238924, 245172, 249843, 251632, 251204, 250562, 251436, 254052, 257324, 260188, 262630, 265264, 268327, 271778, 276230, 282604, 290320, 296906, 300478, 301993, 303916, 307076, 310126, 311906, 312943, 314493, 317249, 321282, 326101, 330362, 332624, 333054, 333675, 336430, 341526, 347852, 354110, 359199]
$$ [...]
##END NTUPLES=NMR SPECTRUM
##END=
