##TITLE=coffee_type CCPA01-ROVE100E_50-50%
COFFEE_meoh_noesyp64 COFFEE_meoh {C:\Bruker\TOPSPIN} Administrator 16
##JCAMPDX= 6.0         $$ Bruker NMR JCAMP-DX V2.0
##DATA TYPE= NMR SPECTRUM
##DATA CLASS= NTUPLES
##ORIGIN= Bruker BioSpin GmbH
##OWNER= Administrator
$$ 1.72 TOPSPIN		Version 2.1
$$ 2012-05-18 15:50:15.323 -0700  Administrator@X
$$ Compression mode = diff/dup
##.OBSERVE FREQUENCY= 400.13188235
##.OBSERVE NUCLEUS= ^1H
##.ACQUISITION MODE= SIMULTANEOUS (DQD)
##.ACQUISITION SCHEME= undefined
##.AVERAGES= 64
##.DIGITISER RES= 22
##SPECTROMETER/DATA SYSTEM= spect
##.PULSE SEQUENCE= noesygpps1d.comp
##.SOLVENT NAME= COFFEE_meoh
##.SHIFT REFERENCE= INTERNAL, COFFEE_meoh, 1, 14.98061
##AUDIT TRAIL= $$ (NUMBER, WHEN, WHO, WHERE, PROCESS, VERSION, WHAT)
$$ ##TITLE= Audit trail, TOPSPIN		Version 2.1
$$ ##JCAMPDX= 5.01
$$ ##ORIGIN= Bruker BioSpin GmbH
$$ ##OWNER= Administrator
$$ $$ C:\Bruker\TOPSPIN/data/Administrator/nmr/12-COFFEE-2502/102/pdata/1/auditp.txt
$$ ##AUDIT TRAIL=  $$ (NUMBER, WHEN, WHO, WHERE, PROCESS, VERSION, WHAT)
(   1,<2012-02-25 17:03:19.437 -0500>,<Administrator>,<TOPSPIN>,<go>,<TOPSPIN 2.1>,
      <created by zg
	started at 2012-02-25 16:51:48.797 -0500,
	POWCHK enabled, PULCHK disabled,
       configuration hash MD5:
       B0 76 FB 9C 50 81 44 7D 18 B3 26 32 4E 60 AD 96
       data hash MD5: 64K
       AF F9 F4 74 1E CC 62 79 77 9A 36 BE 76 90 56 A0>)
(   2,<2012-02-25 17:03:22.891 -0500>,<Administrator>,<TOPSPIN>,<proc1d>,<TOPSPIN 2.1>,
      <Start of raw data processing
       efp LB = 0.3 FT_mod = 6 PKNL = 1 PHC0 = 0 PHC1 = 0 SI = 128K 
       data hash MD5: 128K
       0C E5 87 B5 CD F8 9C 0A DE BF 12 36 73 F8 51 5E>)
(   3,<2012-02-25 17:03:24.187 -0500>,<Administrator>,<TOPSPIN>,<proc1d>,<TOPSPIN 2.1>,
      <pk PHC0 = 23.81836 PHC1 = 0 
       data hash MD5: 128K
       82 5A 9D D2 D4 38 35 F5 DC DC 29 66 5F BA 5C CC>)
(   4,<2012-02-25 17:03:24.875 -0500>,<Administrator>,<TOPSPIN>,<proc1d>,<TOPSPIN 2.1>,
      <abs ABSG = 1 
       data hash MD5: 128K
       53 F1 11 5D 99 A0 5C B6 4D F1 63 0C 6D 0C 5F C4>)
(   5,<2012-02-25 17:03:24.969 -0500>,<Administrator>,<TOPSPIN>,<proc1d>,<TOPSPIN 2.1>,
      <abs ABSG = 2 
       data hash MD5: 128K
       84 B3 FD 34 FC B2 77 19 FD A4 60 7C D5 C4 51 F5>)
(   6,<2012-02-25 17:03:25.359 -0500>,<Administrator>,<TOPSPIN>,<proc1d>,<TOPSPIN 2.1>,
      <abs ABSG = 3 
       data hash MD5: 128K
       00 C2 38 5B 7C 75 59 E2 BD 45 85 0B 6B B8 D6 B9>)
(   7,<2012-02-25 17:03:25.437 -0500>,<Administrator>,<TOPSPIN>,<proc1d>,<TOPSPIN 2.1>,
      <abs ABSG = 4 
       data hash MD5: 128K
       A5 0D 2F 8E A5 3D 30 67 21 A0 9B 97 57 FE 99 97>)
(   8,<2012-02-25 17:03:25.516 -0500>,<Administrator>,<TOPSPIN>,<proc1d>,<TOPSPIN 2.1>,
      <abs ABSG = 5 
       data hash MD5: 128K
       6E 3A 36 AB 63 19 04 66 13 2D 45 F2 DD 8F 09 C1>)
(   9,<2012-02-25 17:03:25.672 -0500>,<Administrator>,<TOPSPIN>,<audit>,<TOPSPIN 2.1>,
      <user comment:
       ICON-NMR User ID: Administrator
$$ [...]
150 150 150 150 150 150 150 150
##$TP07= 0
##$TPNAME0= <>
##$TPNAME1= <>
##$TPNAME2= <>
##$TPNAME3= <>
##$TPNAME4= <>
##$TPNAME5= <>
##$TPNAME6= <>
##$TPNAME7= <>
##$TPOAL= (0..7)
0.5 0.5 0.5 0.5 0.5 0.5 0.5 0.5
##$TPOFFS= (0..7)
0 0 0 0 0 0 0 0
##$TUNHIN= 0
##$TUNHOUT= 0
##$TUNXOUT= 0
##$USERA1= <user>
##$USERA2= <user>
##$USERA3= <user>
##$USERA4= <user>
##$USERA5= <user>
##$V9= 5
##$VALIST= <valist>
##$VCLIST= <CCCCCCCCCCCCCCC>
##$VD= 0
##$VDLIST= <DDDDDDDDDDDDDDD>
##$VPLIST= <PPPPPPPPPPPPPPP>
##$VTLIST= <TTTTTTTTTTTTTTT>
##$WBST= 1024
##$WBSW= 4
##$XGAIN= (0..3)
0 0 0 0
##$XL= 0
##$YL= 0
##$YMAX_a= 12879001
##$YMIN_a= -6041429
##$ZGOPTNS= <>
##$ZL1= 120
##$ZL2= 120
##$ZL3= 120
##$ZL4= 120
##$ABSF1= 14.98061
##$ABSF2= -5.57192
##$ABSG= 5
##$ABSL= 3
##$ALPHA= 0
##$AQORDER= 0
##$ASSFAC= 0
##$ASSFACI= 0
##$ASSFACX= 0
##$ASSWID= 0
##$AUNMP= <proc_prof1d_extract>
##$AXLEFT= 0
##$AXNAME= <>
##$AXNUC= <1H>
##$AXRIGHT= 0
##$AXTYPE= 0
##$AXUNIT= <>
##$AZFE= 0.1
##$AZFW= 0.1
##$BCFW= 0
##$BC_mod= 0
##$BYTORDP= 0
##$COROFFS= 0
##$CY= 15
##$DATMOD= 1
##$DC= 0
##$DFILT= <>
##$DTYPP= 0
##$F1P= 0
##$F2P= 0
##$FCOR= 0.5
##$FTSIZE= 131072
##$FT_mod= 6
##$GAMMA= 0
##$GB= 0
##$INTBC= 1
##$INTSCL= 1
##$ISEN= 128
##$LB= 0.3
##$LEV0= 0
##$LPBIN= 0
##$MAXI= 10000
##$MC2= 0
##$MEAN= 0
##$ME_mod= 0
##$MI= 0
##$NCOEF= 0
##$NC_proc= -3
##$NLEV= 6
##$NOISF1= 0
##$NOISF2= 0
##$NSP= 0
##$NTH_PI= 0
##$NZP= 0
##$OFFSET= 14.98061
##$PC= 1
##$PHC0= 23.81836
##$PHC1= 0
##$PH_mod= 1
##$PKNL= yes
##$PPARMOD= 0
##$PPDIAG= 0
##$PPIPTYP= 0
##$PPMPNUM= 2147483647
##$PPRESOL= 1
##$PSCAL= 4
##$PSIGN= 0
##$PYNMP= <proc.py>
##$REVERSE= no
##$SF= 400.13
##$SI= 131072
##$SIGF1= 0
##$SIGF2= 0
##$SINO= 400
##$SIOLD= 131072
##$SPECTYP= <>
##$SREGLST= <1H.CDCl3>
##$SSB= 0
##$STSI= 131072
##$STSR= 0
##$SW_p= 8223.68421052632
##$SYMM= 0
##$S_DEV= 0
##$TDeff= 65536
##$TDoff= 0
##$TI= <>
##$TILT= no
##$TM1= 0
##$TM2= 0
##$TOPLEV= 0
##$USERP1= <user>
##$USERP2= <user>
##$USERP3= <user>
##$USERP4= <user>
##$USERP5= <user>
##$WDW= 1
##$XDIM= 131072
##$YMAX_p= 494438386
##$YMIN_p= -318011479
##$CURPLOT= <Network HP LaserJet P1505>
##$CURPRIN= <$Network HP LaserJet P1505>
##$DFORMAT= <normdp>
##$LAYOUT= <+/1D_H.xwp>
##$LFORMAT= <normlp>
##$PFORMAT= <normpl>
##$SURQMSG= 1
$$ End of Bruker specific parameters
$$ ---------------------------------
##NTUPLES= NMR SPECTRUM
##VAR_NAME=  FREQUENCY,     SPECTRUM/REAL,   SPECTRUM/IMAG
##SYMBOL=    X,             R,               I
##VAR_TYPE=  INDEPENDENT,   DEPENDENT,       DEPENDENT
##VAR_FORM=  AFFN,          ASDF,            ASDF
##VAR_DIM=   131072,        131072,          131072
##UNITS=     HZ,            ARBITRARY UNITS, ARBITRARY UNITS
##FACTOR=    0.0627417313425165, 1,          1
##FIRST=     8223.62146879498, -9819,        -82073
##LAST=      0,             -7207,           -84824
##MIN=       0,             -318011479,      0
##MAX=       8223.62146879498, 494438386,    0
$$ Real data points
##PAGE= N=1
##DATA TABLE= (X++(R..R)), XYDATA
$$ [...]
60765A116982p069q194q625q247p637p050o306n385m469l605k897k701l172l991
60751A037634m963o302p853q584p552m963j852Q79K776L770M281M883N524N658
60737A023336N418N759P053Q526R621J0859J2588J4003J4446J4576J5072J5146
60725A156403J3876J2227J1908J2505J1641Q212L946J249O95J095J096K03j095
60712A233961j785j412q16j234k675l952m246l857l336k899k823l419m277m499
60698A192731m072l982m522m585l412k054k018l108l809l327k149q09O53J937
60684A157474K381J953J415J068K12j619l506m023k903j207o2K31k5m14o52p73
60668A149550j080j721k468l213m284n720o670o318n270n031n961o875p020p252
$$ y = [1116982, 1109913, 1101719, 1093094, 1084847, 1077210, 1070160, 1063854, 1058469, 1054000, 1050395, 1047498, 1044797, 1041625, 1037634, 1032671, 1026369, 1018516, 1009932, 1002380, 997417, 995565, 996444, 999220, 1002990, 1007271, 1012154, 1017678, 1023336, 1028754, 1034513, 1041566, 1050092, 1059713, 1070572, 1083160, 1097163, 1111609, 1126185, 1141257, 1156403, 1170279, 1182506, 1194414, 1206919, 1218560, 1226772, 1230718, 1231967, 1232662, 1233757, 1234853, 1235056, 1233961, 1232176, 1230764, 1229948, 1228714, 1226039, 1222087, 1217841, 1213984, 1210648, 1207749, 1204926, 1201507, 1197230, 1192731, 1188659, 1184677, 1180155, 1175570, 1172158, 1170104, 1168086, 1164978, 1161169, 1157842, 1155693, 1154884, 1155537, 1157474, 1159855, 1161808, 1163223, 1164291, 1164503, 1162884, 1159378, 1155355, 1152452, 1151245, 1151183, 1151414, 1151389, 1150975, 1150323, 1149550, 1148470, 1146749, 1144281, 1141068, 1136784, 1131064, 1124394, 1118076, 1112806, 1107775, 1101814, 1094939, 1087919, 1080667]
60654A080667q483r880r845q251o557n880o035o420o754o849o689p022q830j1758
60640I71414j3947j4071j2894j2072j2052j1995j1420j0870j0883j1121j0925
60629H39164j0201r376q736q130p260n992m465l098k374k401k693k630k152j723
60615G67933j486r05M94K293L653M376M958N714O450P012P493P786P611P174P186
60600H37742P951R095J0381J1929J3388J3942J3647J3725J4719J5453J4962J4365
60588I91299J5337J7397J8474J7840J6855J6663J6856J6684J6157J5472J4497
60577A173531J3343J2465J1769J0583Q960P911P745P181M882J296j799l224l464
60564A251179m104o409r989j2905j3584j2593j1730j1619j1372j0584j0158j0542
$$ y = [1080667, 1072184, 1062304, 1052459, 1044208, 1037651, 1031771, 1025736, 1019316, 1012562, 1005713, 999024, 992002, 983172, 971414, 957467, 943396, 930502, 918430, 906378, 894383, 882963, 872093, 861210, 850089, 839164, 828963, 819587, 810851, 802721, 795461, 789469, 785004, 781906, 779532, 777131, 774438, 771808, 769656, 767933, 766447, 765542, 766036, 768329, 771982, 776358, 781316, 787030, 793480, 800492, 807985, 815771, 823382, 830556, 837742, 845693, 854788, 865169, 877098, 890486, 904428, 918075, 931800, 946519, 961972, 976934, 991299, 1006636, 1024033, 1042507, 1060347, 1077202, 1093865, 1110721, 1127405, 1143562, 1159034, 1173531, 1186874, 1199339, 1211108, 1221691, 1230651, 1238562, 1246307, 1253488, 1258370, 1259666, 1257867, 1254643, 1251179, 1247075, 1240666, 1230677, 1217772, 1204188, 1191595, 1179865, 1168246, 1156874, 1146290, 1136132, 1125590]
60552A125590j0620r290p167n593m754l773k151q4K269M920P575R741J1288J2479
60538A130430J3572J4630J5490J5756J5153J3936J2546J0870Q503N739L512K238
60526A262375J580J380J781K300K084J449J815L482M816M509L368K768K468J304
60512A297479q00k832m165m991n732o816q429r778r595q185p742r352j0996j0186
60498A197880p536n681n416n205m270l705m165m550l768k134k82J842M151N824
60484A162985O549P258Q875J1135J3348J5477J7677J9697K1551K4079K7931L2547
60472A369109L7084M1844M7764N4725O1430O7114P2483P8534Q4924Q9977R2006
60461B096994R0346Q5267P7295O6757N3830L8962K3409R392o72n616o199m178
$$ y = [1125590, 1114970, 1105680, 1098513, 1092920, 1088166, 1084393, 1082242, 1082158, 1084427, 1089347, 1096922, 1106663, 1117951, 1130430, 1144002, 1158632, 1174122, 1189878, 1205031, 1218967, 1231513, 1242383, 1250886, 1256625, 1260137, 1262375, 1263955, 1265335, 1267116, 1269416, 1271500, 1272949, 1274764, 1278246, 1283062, 1287571, 1290939, 1293707, 1296175, 1297479, 1296679, 1293847, 1289682, 1284691, 1278959, 1272143, 1263714, 1253936, 1244341, 1236156, 1228414, 1219062, 1208066, 1197880, 1190344, 1184663, 1179247, 1174042, 1169772, 1166067, 1161902, 1157352, 1153584, 1151450, 1151168, 1153010, 1157161, 1162985, 1169534, 1176792, 1185667, 1196802, 1210150, 1225627, 1243304, 1263001, 1284552, 1308631, 1336562, 1369109, 1406193, 1448037, 1495801, 1550526, 1611956, 1679070, 1751553, 1830087, 1915011, 2004988, 2096994, 2187340, 2272607, 2349902, 2416659, 2470489, 2509451, 2532860, 2542252, 2541580, 2535964, 2529765, 2525587]
60449B525587q64L104O855R077Q972O940L983Q54k090m577o238o445m465k89M868
60434B545272R872J5483K3638L4602M6171N6447O6128P6909Q8762J00176J10273
60423C173733J19137J26439J31420J34239J36151J38236J41153J46175J55303
60414D401986J70007J90517K16575K48022K84516L25475L70565M19394M70280
60405G097337N19771N63564N97107O14647O08241N69252M92544L80099K40474
60396A1683036Q4537p7751k36244l78558m92538n71968o18530o37634o34218o13143
60386G506989n80774n43091n02953m61085m18899l78466l40564l04993k72391
60377C703773k43695k18263j94634j72927j54321j38427j23597j09867r9165r1985
$$ y = [2525587, 2524723, 2527827, 2534682, 2543759, 2552731, 2559671, 2563654, 2564508, 2562418, 2557841, 2551603, 2545158, 2540693, 2540404, 2545272, 2555144, 2570627, 2594265, 2628867, 2675038, 2731485, 2797613, 2874522, 2963284, 3063460, 3173733, 3292870, 3419309, 3550729, 3684968, 3821119, 3959355, 4100508, 4246683, 4401986, 4571993, 4762510, 4979085, 5227107, 5511623, 5837098, 6207663, 6627057, 7097337, 7617108, 8180672, 8777779, 9392426, 10000667, 10569919, 11062463, 11442562, 11683036, 11767573, 11689822, 11453578, 11075020, 10582482, 10010514, 9391984, 8754350, 8120132, 7506989, 6926215, 6383124, 5880171, 5419086, 5000187, 4621721, 4281157, 3976164, 3703773, 3460078, 3241815, 3047181, 2874254, 2719933, 2581506, 2457909, 2348042, 2248877, 2156892]
60367B156892q6206p9968p3626o7956o2486n6842n2018m8903m6738m4221m1138
60356A496790l8061l5352l3216l1673k9931k6997k3448k1139k0527j9873j7892
60345A198681j5543j4111j3250j2334j2054j2905j3408j1885r162p493p275o887
60333A062374n427l811k975k615k163j687j397j141p73l41K21R20J296Q36j49
60318A043168q00r48j283k160k985l178l136l684m826n719n906n978o538o963
60304I89064o026l786j888j505j862j576n88K93R82J802K121J071n12o22J161
60289I78129L113L821L580L020K100J141J117K027K560K190J982K460K438J320
60275A010998P45K216M579N720N668O028P194Q155Q554R139J0247J1356J1992
$$ y = [2156892, 2070686, 1990718, 1917092, 1849136, 1786650, 1729808, 1677790, 1628887, 1582149, 1537928, 1496790, 1458729, 1423377, 1390161, 1358488, 1328557, 1301560, 1278112, 1256973, 1236446, 1216573, 1198681, 1183138, 1169027, 1155777, 1143443, 1131389, 1118484, 1105076, 1093191, 1084029, 1076536, 1069261, 1062374, 1056947, 1053136, 1050161, 1047546, 1045383, 1043696, 1042299, 1041158, 1040385, 1040044, 1040265, 1041185, 1042481, 1043317, 1043168, 1042368, 1041420, 1040137, 1037977, 1034992, 1031814, 1028678, 1024994, 1020168, 1014449, 1008543, 1002565, 996027, 989064, 983038, 979252, 977364, 975859, 973997, 972421, 971833, 972126, 973108, 974910, 977031, 978102, 977590, 976968, 978129, 981242, 985063, 988643, 991663, 993763, 994904, 996021, 998048, 1000608, 1002798, 1004780, 1007240, 1009678, 1010998, 1011743, 1013959, 1018538, 1024258, 1029926, 1035954, 1043148, 1051303, 1059857, 1068996, 1079243, 1090599, 1102591]
60262A102591J1992J1214J0015R470J0008J0486R768Q329P013N153J671k691o076
60249A188943p914q852q913p716o156n766o402o561n939n602n538m362j986m03
60235A106833q95k174k333j150L75J466J658P72l51k95R92J772Q98n53r18j32
60219A105965P08J086J333J893L168N421Q045R675R832R679J0334J1235J1244
60206A189618J0646J0658J1410J1793J1419J1446J3006J5693J8149J9686K0791
60195A344315K2171K3844K5378K6764K8580L1217L4415L7860M1853M6764N2148
60184A715309N7077O1286O5302O9584P4242P9471Q5361R1215R6045R9935J03957
60173B598784J08457J12340J14569J15393J15447J14369J11115J05216R7091Q7414
$$ y = [1102591, 1114583, 1125797, 1135812, 1145282, 1155290, 1165776, 1175544, 1183873, 1190886, 1196039, 1197710, 1195019, 1188943, 1181029, 1172177, 1163264, 1155548, 1149392, 1143626, 1137224, 1130663, 1124724, 1119122, 1113584, 1109222, 1107236, 1106833, 1105938, 1103764, 1101431, 1100281, 1100656, 1102122, 1103780, 1104552, 1104201, 1103906, 1104898, 1106670, 1107568, 1107015, 1106097, 1105965, 1106673, 1107759, 1109092, 1110985, 1114153, 1119574, 1127619, 1137294, 1147126, 1156805, 1167139, 1178374, 1189618, 1200264, 1210922, 1222332, 1234125, 1245544, 1256990, 1269996, 1285689, 1303838, 1323524, 1344315, 1366486, 1390330, 1415708, 1442472, 1471052, 1502269, 1536684, 1574544, 1616397, 1663161, 1715309, 1772386, 1833672, 1898974, 1968558, 2042800, 2122271, 2207632, 2298847, 2394892, 2494827, 2598784, 2707241, 2819581, 2934150, 3049543, 3164990, 3279359, 3390474, 3495690, 3592781, 3680195]
60163C680195P6697O5274N3416M1634L0834K1558J3015L827n924j4253j9436k1838
60151C924999k2918k3209k2139j9177j4145o805K734J3267K3062L1415L9186M7755
60139C974025N7857O9235Q0836R1359J00091J07201J12909J16550J16985J13866
60129D940914J07921R9991R0148P7907O3048M6240K9068J3212q65j4222k7971
60118E425391m1520n2888o0775o5627o8275o8274o4408n6628m6537l5613k3717
60107D841129r921N656K1720L7333N2571O7368Q0652R1202R8611J02612J02201
60096E491134R6646Q7061P5675O3427M9444L3382J7100L156p737j6848k5244l2192
60084E835004l5778l4797k9943k3213j5854o977N444K2009M0826N9361P6926R4954
$$ y = [3680195, 3756892, 3822166, 3875582, 3917216, 3948050, 3969608, 3982623, 3986450, 3980526, 3966273, 3946837, 3924999, 3902081, 3878872, 3856733, 3837556, 3823411, 3816606, 3819340, 3832607, 3855669, 3887084, 3926270, 3974025, 4031882, 4101117, 4181953, 4273312, 4373403, 4480604, 4593513, 4710063, 4827048, 4940914, 5048835, 5148826, 5238974, 5316881, 5379929, 5426169, 5455237, 5468449, 5467584, 5453362, 5425391, 5383871, 5330983, 5270208, 5204581, 5136306, 5068032, 5003624, 4946996, 4900459, 4864846, 4841129, 4831208, 4836864, 4858584, 4895917, 4948488, 5015856, 5096508, 5187710, 5286321, 5388933, 5491134, 5587780, 5674841, 5750516, 5813943, 5863387, 5896769, 5913869, 5917025, 5909288, 5892440, 5867196, 5835004, 5799226, 5764429, 5734486, 5711273, 5695419, 5688442, 5693886, 5715895, 5756721, 5816082, 5893008, 5987962]
60072E987962J15030J37167J59917J81935K03350K25715K50456K77073L02925
60063G841530L25017L42184L55457L66192L73956L76519L72072L60835L43826
60054A1057588L20573K89440K50450K06221J59218J09469N6455K021n0690j00693
60044A2300052j49306j96566k39411k74066k98727l13531l19473l18128l10952
60035I879892k98050k78767k54096k26941j99222j70380j39742j08631p8702m9792
60025H075569k1287N608K9025M8863O5932P9358Q7104Q8864Q6341Q0628P1386
60014H697391N8848M4642K9975J4595j944j9469l8182n8746q0583j01406j19361
60003H425760j34445j47061j56429j61665j63435j63260j61744j58485j53278
$$ y = [5987962, 6102992, 6240159, 6400076, 6582011, 6785361, 7011076, 7261532, 7538605, 7841530, 8166547, 8508731, 8864188, 9230380, 9604336, 9980855, 10352927, 10713762, 11057588, 11378161, 11667601, 11918051, 12124272, 12283490, 12392959, 12449414, 12451435, 12400745, 12300052, 12150746, 11954180, 11714769, 11440703, 11141976, 10828445, 10508972, 10190844, 9879892, 9581842, 9303075, 9048979, 8822038, 8622816, 8452436, 8312694, 8204063, 8125361, 8075569, 8054282, 8059890, 8088915, 8137778, 8203710, 8283068, 8370172, 8459036, 8545377, 8626005, 8697391, 8756239, 8800881, 8830856, 8845451, 8843507, 8824038, 8785856, 8727110, 8646527, 8545121, 8425760, 8291315, 8144254, 7987825, 7826160, 7662725, 7499465, 7337721, 7179236, 7025958]
59994G025958j46453j38355j29212j19124j07528r3311p6398n8661m2176k6772
59984F087968j0396Q113K7491M5456O0707P3323Q3829R2373R8462J01113R9401
59973F767840R3018Q2245O7584M9732K9815R194j1189l1065n0406o8940q6168
59962F851660j01586j14711j25037j32116j35686j35677j32138j25224j15354
59953E734131j03323r0078p6214o1655m6146k9966j3938J431J6444L1691M7314
59942E409691O3070P8814R4536J09951J24442J37367J48099J55809J59609J59106
59932F640494J54480J45920J33238J16452R6443P4614N1750K7689K341k3195m7041
59921G373185o7984q6127j01858j14515j22534j24986j22623j17136j09525r9472
$$ y = [7025958, 6879505, 6741150, 6611938, 6492814, 6385286, 6291975, 6215577, 6156916, 6114740, 6087968, 6077572, 6085685, 6113176, 6158632, 6219339, 6292662, 6376491, 6468864, 6567326, 6668439, 6767840, 6860858, 6943103, 7010687, 7060419, 7090234, 7099428, 7088239, 7057174, 7006768, 6937828, 6851660, 6750074, 6635363, 6510326, 6378210, 6242524, 6106847, 5974709, 5849485, 5734131, 5630808, 5540730, 5464516, 5402861, 5356715, 5326749, 5312811, 5314242, 5330686, 5362377, 5409691, 5472761, 5551575, 5646111, 5756062, 5880504, 6017871, 6165970, 6321779, 6481388, 6640494, 6794974, 6940894, 7074132, 7190584, 7287027, 7361641, 7413391, 7441080, 7443421, 7420226, 7373185, 7305201, 7219074, 7117216, 7002701, 6880167, 6755181, 6632558, 6515422, 6405897, 6306425]
59911F306425q6450p1085n4976l9102k2931n664J2011K8144M1718N3886O6543
59900F228519Q0108R3240J04375J12812J18451J21277J21365J18937J14223J07502
59890G320809R9413R0744Q1907P2863O3836N5734M9763M6830M7296N0917N7030
59879H037142O5254P6063R0240J07741J27807J50385J76456K06225K37532K67012
59869I541857K92758L15139L34968L51344L61342L61420L49096L23747K85990
59860A2517661K36523J75997J06345L1617m3238j14322j79033k35071k80403l14432
59850A1901644l38000l51772l55468l49365l35739l17798k97340k74164k47583
59841I034415k17831j86022j53553j21737r1481o2882l5270p955J9050M4930O8484
$$ y = [6306425, 6219975, 6148890, 6093914, 6054812, 6031881, 6026217, 6038228, 6066372, 6108090, 6161976, 6228519, 6308627, 6401867, 6506242, 6619054, 6737505, 6858782, 6980147, 7099084, 7213307, 7320809, 7420222, 7510966, 7592873, 7665736, 7729572, 7785306, 7835069, 7881899, 7929195, 7980112, 8037142, 8102396, 8178459, 8268699, 8376440, 8504247, 8654632, 8831088, 9037313, 9274845, 9541857, 9834615, 10149754, 10484722, 10836066, 11197408, 11558828, 11907924, 12231671, 12517661, 12754184, 12930181, 13036526, 13068143, 13024905, 12910583, 12731550, 12496479, 12216076, 11901644, 11563644, 11211872, 10856404, 10507039, 10171300, 9853502, 9556162, 9281998, 9034415, 8816584, 8630562, 8477009, 8355272, 8263791, 8200909, 8165639, 8157684, 8176734, 8221664, 8290148]
59830H290148Q8678J04916J16794J23607J24303J18091J04924Q5162N9057K6921
59820I242601j0357n1219r3614j34892j72085k03353k29073k50618k67773k78435
59810G551182k81392k78364k72361k64719k54858k42477k28414k13319j97013
59801E318265j79762j62865j47044j31335j14818r8733q5302p4655o4597n3762
59791D205392m3574l6303l2237k9797k7662k5693k4122k2874k1697k0188j7869
59780C903376j4876j2404j1666j2590j4248j6392j9496k3410k7174l0517l4302
59769C686301l8967m3367m5971m6520m5853m4701m3187m0985l7542l2693k7428
59758C239087k3047j9228j4067o811Q18P217J3483K1671L1460M0650M8426N5875
$$ y = [8290148, 8378826, 8483742, 8600536, 8724143, 8848446, 8966537, 9071461, 9156623, 9215680, 9242601, 9232244, 9181025, 9087411, 8952519, 8780434, 8577081, 8348008, 8097390, 7829617, 7551182, 7269790, 6991426, 6719065, 6454346, 6199488, 5957011, 5728597, 5515278, 5318265, 5138503, 4975638, 4828594, 4697259, 4582441, 4483708, 4398406, 4323751, 4259154, 4205392, 4161818, 4125515, 4093278, 4063481, 4035819, 4010126, 3986004, 3963130, 3941433, 3921245, 3903376, 3888500, 3876096, 3864430, 3851840, 3837592, 3821200, 3801704, 3778294, 3751120, 3720603, 3686301, 3647334, 3603967, 3557996, 3511476, 3465623, 3420922, 3377735, 3336750, 3299208, 3266515, 3239087, 3216040, 3196812, 3182745, 3175934, 3176752, 3183969, 3197452, 3219123, 3250583, 3291233, 3339659, 3395534]
59746C395534O3183O8653P1146P1616P1344P0217O7755O4584O1802N9657N7533
59735D123024N4314M8417L8742K6601J5676Q966O412O103O864Q923J3052K0090
59723D377184L0497M3437N6963P0023Q3448R8314J14465J31613J50585J71882
59713E328411J93993K14971K35200K56794K80332L03611L23314L36210L38625
59704G811461L26376K96218K47186J81109J02992K0678n7287j24222j76027k10649
59694H417835k28364k32024k25402k11241j91655j69478j47149j24695j00749
59685F787078p5620n1380k8888p014J4704L4996N3433P1984R2491J14168J35034
59674G140986J54542J73403J92095K11268K32580K57272K84208L10975L36984
$$ y = [3395534, 3458717, 3527370, 3598516, 3670132, 3741476, 3811693, 3879448, 3944032, 4005834, 4065491, 4123024, 4177338, 4225755, 4264497, 4291098, 4306774, 4315740, 4322152, 4328255, 4335119, 4344042, 4357094, 4377184, 4407681, 4451118, 4508081, 4578104, 4661552, 4759866, 4874331, 5005944, 5156529, 5328411, 5522404, 5737375, 5972575, 6229369, 6509701, 6813312, 7136626, 7472836, 7811461, 8137837, 8434055, 8681241, 8862350, 8965342, 8986020, 8928733, 8804511, 8628484, 8417835, 8189471, 7957447, 7732045, 7520804, 7329149, 7159671, 7012522, 6887827, 6787078, 6711458, 6660078, 6631190, 6624176, 6638880, 6673876, 6727309, 6799293, 6891784, 7005952, 7140986, 7295528, 7468931, 7661026, 7872294, 8104874, 8362146, 8646354, 8957329, 9294313]
59665I294313L64253L94952M28988M64232M98657N32210N66628O03097O40049
59656A3787379O73944P02294P24883P41635P50731P49975P39215P20341O95670
59647B0286067O67568O39149O13762N93412N78386N68275N62546N60044N58587
59638B5627796N55149N46192N28191M98622M56734M03412L40570K70722J96625
59629B9424013J20960M6837k1548p9693j24840j56589j75158j80075j71145j49589
59619B8533173j17107p4633k3005L5927J00163J69029K42447L18980L95726M70260
59609C0050960N41502O08465O68607P17460P49410P59103P42701O97710O21649
59600C6157567N12061L68945J96796L850j99811m02666n92143p57332q92005r94204
$$ y = [9294313, 9658566, 10053518, 10482506, 10946738, 11445395, 11977605, 12544233, 13147330, 13787379, 14461323, 15163617, 15888500, 16630135, 17380866, 18130841, 18870056, 19590397, 20286067, 20953635, 21592784, 22206546, 22799958, 23378344, 23946619, 24509165, 25069209, 25627796, 26182945, 26729137, 27257328, 27755950, 28212684, 28616096, 28956666, 29227388, 29424013, 29544973, 29591810, 29570262, 29490569, 29365729, 29209140, 29033982, 28853907, 28682762, 28533173, 28416066, 28341433, 28318428, 28354355, 28454518, 28623547, 28865994, 29184974, 29580700, 30050960, 30592462, 31200927, 31869534, 32586994, 33336404, 34095507, 34838208, 35535918, 36157567, 36669628, 37038573, 37235369, 37239219, 37039408, 36636742, 36044599, 35287267, 34395262, 33401058]
59590C3401058j063514j100427j108042j092129j058616j011968r56269q96559
59582B5113534q38459p87565p49534p29257p28503p44479p71016q00766q26501
59573A8137454q42030q43552q30461q04673p69281p27608o82493o35795n88787
59564A1412774n42995m99960m59994m21984l84989l49490l16735k87366k61226
59555G888035k37882k16798j97274j78864j61770j46566j33599j22831j14098
59546F378353j07294j02510r9973r9635j00765j02327j03834j05495j07456j09234
59536E339830j10082j09585j07749j04684j00422r5064q9119q3470p8515p3285
59526D387855o6227n7378m8984m2953l8263l2060k3222j3499n163J212O301J0648
$$ y = [33401058, 32337544, 31237117, 30129075, 29036946, 27978330, 26966362, 26010093, 25113534, 24275075, 23487510, 22737976, 22008719, 21280216, 20535737, 19764721, 18963955, 18137454, 17295424, 16451872, 15621411, 14816738, 14047457, 13319849, 12637356, 12001561, 11412774, 10869779, 10369819, 9909825, 9487841, 9102852, 8753362, 8436627, 8149261, 7888035, 7650153, 7433355, 7236081, 7057217, 6895447, 6748881, 6615282, 6492451, 6378353, 6271059, 6168549, 6068576, 5968941, 5868176, 5765849, 5662015, 5556520, 5449064, 5339830, 5229748, 5120163, 5012414, 4907730, 4807308, 4712244, 4623125, 4539655, 4461140, 4387855, 4321628, 4264250, 4215266, 4172313, 4134050, 4101990, 4078768, 4065269, 4060106, 4061318, 4067619, 4078267]
59514D078267J4526J8245K1888K5276K8695L2950L8128M2956M6081M7579M8622
59503D443213N0198N2817N6918O2569O9018P5470Q2316R0709J00824J11339J21037
59492E316428J30287J40353J51740J64003J77036J91483K07361K23036K36475
59483F938202K47351K56855K65385K71456K73408K71329K66385K58960K48482
59474I297813K34992K19702K03769J86963J67705J44214J16122Q5498N6048L0477
59464A0743303Q860r851k5289l5787m0680m0969l7396k9150j5183M178K7532N3480
59452A0603048Q0604J07011J30780J50571J65265J73186J72136J60162J36205
59443A1878968J00607N5421L779n1589j09170j67780k25108k77454l20836l52477
$$ y = [4078267, 4092793, 4111038, 4132926, 4158202, 4186897, 4219847, 4257975, 4300931, 4347012, 4394591, 4443213, 4493411, 4546228, 4603146, 4665715, 4734733, 4810203, 4892519, 4983228, 5084052, 5195391, 5316428, 5446715, 5587068, 5738808, 5902811, 6079847, 6271330, 6478691, 6701727, 6938202, 7185553, 7442408, 7707793, 7979249, 8252657, 8523986, 8790371, 9049331, 9297813, 9532805, 9752507, 9956276, 10143239, 10310944, 10455158, 10571280, 10656778, 10712826, 10743303, 10752163, 10742312, 10717023, 10681236, 10640556, 10599587, 10562191, 10533041, 10517858, 10522036, 10549568, 10603048, 10683652, 10790663, 10921443, 11072014, 11237279, 11410465, 11582601, 11742763, 11878968, 11979575, 12034996, 12038775, 11987186, 11878016, 11710236, 11485128, 11207674, 10886838, 10534361]
59433A0534361l71766l80161l79951l72837l59695l41470l19658k95732k70531
59424G442560k44472k18109j92245j67633j44551j22486j00419p7875n5581l4618
59414F084571j4997M322K4057M3923O3333Q2076J00199J17740J34708J50786J65125
59403F955843J77045J86716J94168J97753J94847J84397J67612J45653J17931
59394H521965Q3682M4196K307l9892q1635j22108j59513j91801k17821k37556
59384G601824k51574k60307k63871k62658k57867k50951k42527k32397k20664
59375E359008k08043j94872j80737j65642j50848j37790j26553j15962j04951
59366C973610r3479q2353p2517o4199n6564m8628m0521l3292k7283k1497j4893
$$ y = [10534361, 10162595, 9782434, 9402483, 9029646, 8669951, 8328481, 8008823, 7713091, 7442560, 7198088, 6979979, 6787734, 6620101, 6475550, 6353064, 6252645, 6174770, 6119189, 6084571, 6069574, 6073896, 6097953, 6141876, 6205209, 6287285, 6387484, 6505224, 6639932, 6790718, 6955843, 7132888, 7319604, 7513772, 7711525, 7906372, 8090769, 8258381, 8404034, 8521965, 8605647, 8649843, 8652150, 8612258, 8530623, 8408515, 8249002, 8057201, 7839380, 7601824, 7350250, 7089943, 6826072, 6563414, 6305547, 6054596, 5812069, 5579672, 5359008, 5150965, 4956093, 4775356, 4609714, 4458866, 4321076, 4194523, 4078561, 3973610, 3880131, 3797778, 3725261, 3661062, 3604498, 3555870, 3515349, 3482057, 3454774, 3433277, 3418384]
59355C418384p616m37O202J2130J7162K1600K6471L2369L8320M2307M2776L9536
59343C689204L3901K8381K5473K6050K9282L4387M1606N1052O1587P1683Q0435
59332D173041Q6820Q9211Q7328Q4284Q4831R1263J02042J14510J27652J41886
59322E182868J57446J73984J91274K09508K28946K49741K72146K96649L23566
59313G286128L52496L82451M12959M44635M77915N11293N41869N67877N89315
59304A1566938O05363O12589O07545N90687N66166N37568N05275M68444M28360
59295A6488935L88581L51917L18077K84689K50298K15587J81296J45760J05694
59286A8730834N9373P729m7785j06807j68560k30261k88538l41695l89255m29928
$$ y = [3418384, 3410768, 3410331, 3416533, 3428663, 3445825, 3467425, 3493896, 3526265, 3564585, 3606892, 3649668, 3689204, 3723105, 3751486, 3776959, 3803009, 3832291, 3866678, 3908284, 3959336, 4020923, 4092606, 4173041, 4259861, 4349072, 4436400, 4520684, 4605515, 4696778, 4798820, 4913330, 5040982, 5182868, 5340314, 5514298, 5705572, 5915080, 6144026, 6393767, 6665913, 6962562, 7286128, 7638624, 8021075, 8434034, 8878669, 9356584, 9867877, 10409746, 10977623, 11566938, 12172301, 12784890, 13392435, 13983122, 14549288, 15086856, 15592131, 16060575, 16488935, 16877516, 17229433, 17547510, 17832199, 18082497, 18298084, 18479380, 18625140, 18730834, 18790207, 18797936, 18750151, 18643344, 18474784, 18244523, 17955985, 17614290, 17225035, 16795107]
59276A6795107m61804m84267m98223n04294n02126m91774m74702m52969m28174
59267A2496774m01372l73306l44462l15490k87600k62049k39335k19344k01970
59258I851846j86925j73504j61562j52283j46754j43983j41721j39243j37833
59249H468038j38223j39002j38296j35873j32733j29404j25450j20243j13628
59240G295186j06092r8475r1145q3380p4180o3681n3094m3152l3546k4073j5246
59229F609122p308N91R513J9628L0432M1457N2357O2973P3757Q5550R8471J11526
59217G188069J23700J34715J44561J53059J60369J66842J71666J72706J68661
59208H584348J60513J49636J35356J16023R1922O5094L6314M498l0068o3974r3815
$$ y = [16795107, 16333303, 15849036, 15350813, 14846519, 14344393, 13852619, 13377917, 12924948, 12496774, 12095402, 11722096, 11377634, 11062144, 10774544, 10512495, 10273160, 10053816, 9851846, 9664921, 9491417, 9329855, 9177572, 9030818, 8886835, 8745114, 8605871, 8468038, 8329815, 8190813, 8052517, 7916644, 7783911, 7654507, 7529057, 7408814, 7295186, 7189094, 7090619, 6999474, 6916094, 6841914, 6778233, 6725139, 6681987, 6648441, 6624368, 6609122, 6601814, 6602405, 6611918, 6631546, 6661978, 6703435, 6755792, 6818765, 6892522, 6978072, 7076543, 7188069, 7311769, 7446484, 7591045, 7744104, 7904473, 8071315, 8242981, 8415687, 8584348, 8744861, 8894497, 9029853, 9145876, 9237798, 9302892, 9339206, 9343704, 9313636, 9249662, 9155847]
59197I155847j19686j43465j64367j78930j85961j89208j93669k00616k07878
59188G572067k13702k17897k19462k15800k05508j90418j73739j57284j41473
59179E836784j26651j12862r9196q4961p0984n8286m5917l1933j6296j036J2657
59168E201319K5785L9685N4493P0142Q7255J06065J25620J45183J65397J87186
59158F208130K10467K34869K60653K87579L13675L36582L55497L70386L79703
59149H957541L80545L71074L51268L21089K79556K26406J63732R5127K3844m7539
59139A1122643j16351j79706k35061k80506l14681l37032l48143l49514l42858
59130H618791l29682l11330k89209k64941k40307k16737j94678j73577j52819
$$ y = [9155847, 9036161, 8892696, 8728329, 8549399, 8363438, 8174230, 7980561, 7779945, 7572067, 7358365, 7140468, 6921006, 6705206, 6499698, 6309280, 6135541, 5978257, 5836784, 5710133, 5597271, 5498075, 5413114, 5342130, 5283844, 5237927, 5205994, 5189698, 5188662, 5201319, 5227104, 5266789, 5321282, 5391424, 5478679, 5584744, 5710364, 5855547, 6020944, 6208130, 6418597, 6653466, 6914119, 7201698, 7515373, 7851955, 8207452, 8577838, 8957541, 9338086, 9709160, 10060428, 10381517, 10661073, 10887479, 11051211, 11146338, 11170182, 11122643, 11006292, 10826586, 10591525, 10311019, 9996338, 9659306, 9311163, 8961649, 8618791, 8289109, 7977779, 7688570, 7423629, 7183322, 6966585, 6771907, 6598330, 6445511]
59121F445511j32751j14553r9029q5700p3166o0296m7041l4133k2295j1805k646
59110E762096N317J2429J9185K5741L1455L5257L6443L4962L1033K5036J7842
59099F036796J0660L874l635j3181k4253l4470m1928m7004n1434n6150o0732o4552
59087E653991o7392o8753o7514o3017n6229m9276m3677l9196l4436k8472k1700
59076E114329j5013q466j367O213J3024J8366K3512L0226L8227M5573N1492N7368
59064E373484O4488P2347P9968Q7666R6191J05000J12676J18551J22797J25362
59054F358530J26084J25640J25025J24009J21235J16062J09352J02168R4646Q6648
59044G489399P8632P1126O3857N6219M8546M2294L8656L7257L6490L4927L1926
$$ y = [6445511, 6312760, 6198207, 6099178, 6013478, 5940312, 5880016, 5832975, 5798842, 5776547, 5764742, 5762096, 5767413, 5779842, 5799027, 5824768, 5856223, 5891480, 5927923, 5962885, 5993918, 6018954, 6036796, 6047456, 6051330, 6047695, 6034514, 6010261, 5975791, 5933863, 5886859, 5835425, 5779275, 5718543, 5653991, 5586599, 5517846, 5450332, 5387315, 5331086, 5281810, 5238133, 5198937, 5164501, 5136029, 5114329, 5099316, 5090850, 5089483, 5095696, 5108720, 5127086, 5150598, 5180824, 5219051, 5264624, 5316116, 5373484, 5437972, 5510319, 5590287, 5677953, 5774144, 5879144, 5991820, 6110371, 6233168, 6358530, 6484614, 6610254, 6735279, 6859288, 6980523, 7096585, 7205937, 7308105, 7402751, 7489399, 7568031, 7639157, 7703014, 7759233, 7807779, 7850073, 7888729, 7925986, 7962476, 7997403, 8029329]
59033H029329K6660J7372K478j7826m2036o9298r9592j31740j62803j90447k14677
59022G147420k35983k52981k63515k67407k66451k61964k54079k43366k31336
59013D870338k18966k06093j92648j79271j66420j54055j42635j33023j24891
59004C352336j16553j07216r8275r1396q6160q0797p4646o8668o3677n9162n4205
58993B451581m8981m4857m2849m2208m0894l7815l3994l1022k8893k6461k3688
58982B049919k1882k1363k0479j7750j3909j0676q403o075l212m34J789L883O352
58969A937760Q789J0235J0271R529R112R472J0032R940R080P951O794N408L826
58956B048199K598K119K282K956M229N847O915O699N518M493M514N572O886P551
$$ y = [8029329, 8055989, 8073361, 8075839, 8058013, 8015977, 7946679, 7847087, 7715347, 7552544, 7362097, 7147420, 6911437, 6658456, 6394941, 6127534, 5861083, 5599119, 5345040, 5101674, 4870338, 4651372, 4445279, 4252631, 4073360, 3906940, 3752885, 3610250, 3477227, 3352336, 3235783, 3128567, 3030292, 2938896, 2852736, 2771939, 2697293, 2628625, 2564948, 2505786, 2451581, 2402600, 2357743, 2314894, 2272686, 2231792, 2193977, 2159983, 2128961, 2100068, 2073607, 2049919, 2028037, 2006674, 1986195, 1968445, 1954536, 1943860, 1935457, 1929382, 1926170, 1925736, 1927525, 1931408, 1937760, 1946549, 1956784, 1967055, 1976584, 1985696, 1995168, 2005200, 2015140, 2024220, 2032171, 2038965, 2044373, 2048199, 2050797, 2052916, 2055198, 2058154, 2062383, 2068230, 2075145, 2081844, 2087362, 2091855, 2096369, 2101941, 2108827, 2116378]
58942B116378P210O121M569K417n38m116q036j2181j6057j8566j9283j9438k0460
58929B018020k1736k1201j8220j4443j1421q781n622k374j83Q93J958L796O039
58916A926725P713Q353Q727J0344J3712J7349J9515K0724K3133K7206L0756L2057
58904B146314L2217L3166L4715L5236L4441L3631L3584L3768L3570L3118L2741
58893B516501L2695L3339L4845L6789L8848M1533M5324M9477N2877N5822N9545
58882B997595O4040O7881P0581P3677P8646Q4828R0484R5187J00110J06187J12955
58871C942171J19290J24727J29939J36325J45134J56540J69371J82020J93845
58862E299362K05556K18193K31989K46545K61789K78274K96512L16574L38551
$$ y = [2116378, 2123588, 2129709, 2134278, 2136695, 2136157, 2132041, 2124005, 2111824, 2095767, 2077201, 2057918, 2038480, 2018020, 1996284, 1975083, 1956863, 1942420, 1930999, 1922218, 1916596, 1914222, 1914039, 1914932, 1916890, 1920686, 1926725, 1934438, 1942791, 1951518, 1961862, 1975574, 1992923, 2012438, 2033162, 2056295, 2083501, 2114257, 2146314, 2178531, 2211697, 2246412, 2281648, 2316089, 2349720, 2383304, 2417072, 2450642, 2483760, 2516501, 2549196, 2582535, 2617380, 2654169, 2693017, 2734550, 2779874, 2829351, 2882228, 2938050, 2997595, 3061635, 3129516, 3200097, 3273774, 3352420, 3437248, 3527732, 3622919, 3723029, 3829216, 3942171, 4061461, 4186188, 4316127, 4452452, 4597586, 4754126, 4923497, 5105517, 5299362, 5504918, 5723111, 5955100, 6201645, 6463434, 6741708, 7038220, 7354794, 7693345]
58853G693345L62748L88901M15755M42256M68841M96523N24897N52173N77347
58844A1922786O00940O22782O40058O48718O46402O32814O07475N68364N13303
58835A7403642M42125L57015K61099J57161M7709o4062j73776k76512l68093m45935
58825A7340373n08934n56930n90338o10124o17787o15286o04718n87979n66664
58816A2081613n42298n16295m89681m63160m37535m13516l90828l68180l44894
58807H115226l22071l01345k82751k64757k46402k28449k12198j97815j84213
58798E875225j70448j57033j45703j37359j30345j21761j10917j00202r1594q3665
58788D626198p3756o2096n1528m3567l6933l0023k2675j4932o180L609J3219K1671
$$ y = [7693345, 8056093, 8444994, 8860749, 9303005, 9771846, 10268369, 10793266, 11345439, 11922786, 12523726, 13146508, 13786566, 14435284, 15081686, 15714500, 16321975, 16890339, 17403642, 17845767, 18202782, 18463881, 18621042, 18668751, 18604689, 18430913, 18154401, 17786308, 17340373, 16831439, 16274509, 15684171, 15074047, 14456260, 13840974, 13236256, 12648277, 12081613, 11539315, 11023020, 10533339, 10070179, 9632644, 9219128, 8828300, 8460120, 8115226, 7793155, 7491810, 7209059, 6944302, 6697900, 6469451, 6257253, 6059438, 5875225, 5704777, 5547744, 5402041, 5264682, 5134337, 5012576, 4901659, 4801457, 4709863, 4626198, 4552442, 4490346, 4438818, 4395251, 4358318, 4328295, 4305620, 4290688, 4284508, 4288117, 4301336, 4323007]
58776D323007K9132L5988M2438M9357N7909O7653P6774Q4887R3858J04839J16347
58765E082189J26606J36168J46709J58520J70817J83468J96799K10530K24426
58756F636232K39378K56491K75558K95533L15960L37102L59376L83512M10320
58747I509462M39397M68883M97409N25152N52017N76173N95594O09706O17854
58738A4391647O17330O04727N78445N38171M82737M10686L22804K22569J14315
58729A8283431K303j08930k15062l12973m00394m75115n35685n82200o15089o33945
58719A4406341o39129o33755o22054o06010n85198n59694n31317n02192m73747
58710I253245m47063m22502l98955l75094l51535l30160l11237k92814k73435
$$ y = [4323007, 4352139, 4388127, 4430565, 4479922, 4537831, 4605484, 4682258, 4767145, 4861003, 4965842, 5082189, 5208795, 5344963, 5491672, 5650192, 5821009, 6004477, 6201276, 6411806, 6636232, 6875610, 7132101, 7407659, 7703192, 8019152, 8356254, 8715630, 9099142, 9509462, 9948859, 10417742, 10915151, 11440303, 11992320, 12568493, 13164087, 13773793, 14391647, 15008977, 15613704, 16192149, 16730320, 17213057, 17623743, 17946547, 18169116, 18283431, 18285734, 18176804, 17961742, 17648769, 17248375, 16773260, 16237575, 15655375, 15040286, 14406341, 13767212, 13133457, 12511403, 11905393, 11320195, 10760501, 10229184, 9726992, 9253245, 8806182, 8383680, 7984725, 7609631, 7258096, 6927936, 6616699, 6323885, 6050450]
58701F050450k53971k36278k21121k07833j95083j81764j67918j54825j43390
58692D288267j32821j21962j11413j02760r5879q8800q0512p2310o5678o0291
58682C355841n4805m8701m2602l7420l3698l1436l0175k9458k9212k9434k9949
58671B958951l0789l2273l4229l5875l7068l8634m0658m1658m0855m0017m1337
58660B545558m4353m6908m8419n0043n2057n3449n4120n5147n6553n6791n5007
58649A972711n2146m9315m6593m3941m1737l9922l7883l5517l3194l0642k7277
58638A534544k3790k1757k1431k1415k0756j9838j8965j7763j6407j5837j6207
58627A320378j6528j6170j5378j4007j1493q414o346n622m812l109j400k63J420
$$ y = [6050450, 5796479, 5560201, 5339080, 5131247, 4936164, 4754400, 4586482, 4431657, 4288267, 4155446, 4033484, 3922071, 3819311, 3723432, 3634632, 3554120, 3481810, 3416132, 3355841, 3301036, 3252335, 3209733, 3172313, 3138615, 3107179, 3077004, 3047546, 3018334, 2988900, 2958951, 2928162, 2895889, 2861660, 2825785, 2788717, 2750083, 2709425, 2667767, 2626912, 2586895, 2545558, 2501205, 2454297, 2405878, 2355835, 2303778, 2250329, 2196209, 2141062, 2084509, 2027718, 1972711, 1920565, 1871250, 1824657, 1780716, 1738979, 1699057, 1661174, 1625657, 1592463, 1561821, 1534544, 1510754, 1488997, 1467566, 1446151, 1425395, 1405557, 1386592, 1368829, 1352422, 1336585, 1320378, 1303850, 1287680, 1272302, 1258295, 1246802, 1238388, 1232042, 1226420, 1221608, 1218499, 1217099, 1216836, 1218256]
58614A218256M681Q596J1372J2326J2100J1758J2133J3027J2736R686M900J332
58602A332903L63M48k96j912l750n934q512j0581j1500j1838j2128j1833j0518
58589A244912q850p476o017m147k461j291L03L196O789R967J2564J4928J6931
58576A279348J8413J9917K1927K4015K5523K6598K7891K9773L2289L5249L8028
58565A578971M0168M2424M6162N1375N6420O0306O3958O8647P4421Q0708Q7359
58554B250919R4210J00706J06824J13550J21796J31542J42226J52923J62045J68390
58544C545131J72808J77108J80792J80663J74421J62700J46543J24987R6961O3971
58534E026085K9120n550l9174p0635r8683j22697j41933j54927j61101j62166
$$ y = [1218256, 1222937, 1231533, 1242905, 1255231, 1267331, 1279089, 1291222, 1304249, 1316985, 1326671, 1331571, 1332903, 1333266, 1333714, 1333418, 1331506, 1327756, 1321822, 1313310, 1302729, 1291229, 1279391, 1267263, 1255430, 1244912, 1236062, 1228586, 1222569, 1218422, 1215961, 1214670, 1214973, 1218169, 1224958, 1234925, 1247489, 1262417, 1279348, 1297761, 1317678, 1339605, 1363620, 1389143, 1415741, 1443632, 1473405, 1505694, 1540943, 1578971, 1619139, 1661563, 1707725, 1759100, 1815520, 1875826, 1939784, 2008431, 2082852, 2163560, 2250919, 2345129, 2445835, 2552659, 2666209, 2788005, 2919547, 3061773, 3214696, 3376741, 3545131, 3717939, 3895047, 4075839, 4256502, 4430923, 4593623, 4740166, 4865153, 4962114, 5026085, 5055205, 5049655, 5010481, 4939846, 4841163, 4718466, 4576533, 4421606, 4260505, 4098339]
58524D098339j60476j56663j50279j41977j33320j24788j15517j05013r3966q3399
58514B832941p3928o5767n8651n1912m5198l8987l3902k9896k6469k3269k0143
58503B364819j7146j4706j3169j2104j0904j0177j1448j5239k0614k6728l3538
58492B179046m0586m6541n0574n2942n3881n3278n1883n1057n0804m9674m7242
58481A630584m4862m3186m0934l7209l3083k9635k6361k2914k0605k0425k1167
58470A290203k1167k0443j9552j7878j4910j1817r894q668p363o919q475j0816
58458A132301j1501r973p765o145n196m768m792m883m687m262l521k207q89n68
58444A061144n93J098M516O573N223K663K309M251O074O736P166P997R174J1001
$$ y = [4098339, 3937863, 3781200, 3630921, 3488944, 3355624, 3230836, 3115319, 3010306, 2916340, 2832941, 2759013, 2693246, 2634595, 2582683, 2537485, 2498498, 2464596, 2434700, 2408231, 2384962, 2364819, 2347673, 2332967, 2319798, 2307694, 2296790, 2286613, 2275165, 2259926, 2239312, 2212584, 2179046, 2138460, 2091919, 2041345, 1988403, 1934522, 1881244, 1829361, 1778304, 1727500, 1677826, 1630584, 1585722, 1542536, 1501602, 1464393, 1431310, 1401675, 1375314, 1352400, 1331795, 1311370, 1290203, 1269036, 1248593, 1229041, 1211163, 1196253, 1184436, 1174542, 1165874, 1158511, 1151592, 1143117, 1132301, 1120800, 1110827, 1103062, 1096917, 1091721, 1086953, 1082161, 1077278, 1072591, 1068329, 1064808, 1062601, 1061712, 1061144, 1060551, 1061649, 1066165, 1072738, 1077961, 1080624, 1082933, 1087184, 1093258, 1099994, 1107160, 1115157, 1124331, 1135332]
58430A135332J3462J5193J5148J4390J4372J4405J2884J0047P313M774J580j996
58418A256904n032p740j0636j2891j3670j4202j6165j8894k0525k0959k1089k0152
58406A074949j6882j2668j0327r981r256p556o851p846q452p056m706k975j858
58393I68535q13l4L59R33K028L419N100P156Q812R072Q398Q254R094J0238J1462
58378A052013J3043J4385J4548J3997J4093J4897J5357J5354J5611J5691J4236
58367A213225J1249Q114N242J807k074n071o879q602j0479j1256j0434r209q486
58354A167147p673o126m255k542p03J505L813O033Q181R947J1139J2346J3985
58341A212797J5095J4627J3388J2845J2417J0135N997K400Q32J46j234l069m012
$$ y = [1135332, 1148794, 1163987, 1179135, 1193525, 1207897, 1222302, 1235186, 1245233, 1252546, 1257320, 1258900, 1256904, 1251872, 1244132, 1233496, 1220605, 1206935, 1192733, 1176568, 1157674, 1137149, 1116190, 1095101, 1074949, 1058067, 1045399, 1035072, 1025091, 1015835, 1008279, 1001428, 993582, 985130, 978074, 973368, 970393, 968535, 967722, 967688, 968047, 968980, 971008, 974427, 979527, 986683, 995495, 1004567, 1012965, 1021219, 1030313, 1040551, 1052013, 1065056, 1079441, 1093989, 1107986, 1122079, 1136976, 1152333, 1167687, 1183298, 1198989, 1213225, 1224474, 1232588, 1237830, 1239637, 1237563, 1232492, 1225613, 1217011, 1206532, 1195276, 1184842, 1175633, 1167147, 1159474, 1153348, 1149093, 1146551, 1145848, 1147353, 1151166, 1157199, 1165380, 1175327, 1186466, 1198812, 1212797, 1227892, 1242519, 1255907, 1268752, 1281169, 1291304, 1297301, 1299701, 1300533, 1300679, 1299445, 1296376, 1292364]
58328A292364l288j158J333L019L779M747O431P344N885K807J59j445k670l406
58314A315901l021k142j950k085j310J57J231K321M690P756R615J0136J1045J2831
58300A365175J4094J4180J4064J4320J4418J4357J4945J6208J7440J8775K0770
58289A538746K2595K2757K1414J9939J8540J6567J4561J3399J1953Q563M502K788
58277A716324L679M506M098M042N175O287P010Q702J1383J2846J2113J1181J2079
58264A819425J4442J6980J9156K0561K0776K0637K1774K4299K6749K8474L0092
58253B063365L1715L2880L4104L6182L8166L8497L7561L6474L4217K9424K4250
58242B436835K2456K3785K4423K3229K3076K5440K8033K9102L0004L2062L4469
$$ y = [1292364, 1289076, 1287918, 1289251, 1292270, 1296049, 1300796, 1307227, 1314571, 1320456, 1323263, 1323422, 1321977, 1319307, 1315901, 1312880, 1310738, 1308788, 1306703, 1305393, 1305550, 1306781, 1309102, 1313792, 1321548, 1331163, 1341299, 1352344, 1365175, 1379269, 1393449, 1407513, 1421833, 1436251, 1450608, 1465553, 1481761, 1499201, 1517976, 1538746, 1561341, 1584098, 1605512, 1625451, 1643991, 1660558, 1675119, 1688518, 1700471, 1709034, 1713536, 1716324, 1720003, 1724509, 1728607, 1732649, 1737824, 1744111, 1751121, 1759823, 1771206, 1784052, 1796165, 1807346, 1819425, 1833867, 1850847, 1870003, 1890564, 1911340, 1931977, 1953751, 1978050, 2004799, 2033273, 2063365, 2095080, 2127960, 2162064, 2198246, 2236412, 2274909, 2312470, 2348944, 2383161, 2412585, 2436835, 2459291, 2483076, 2507499, 2530728, 2553804, 2579244, 2607277, 2636379, 2666383, 2698445, 2732914]
58231B732914L6748L9864M3632M6402M8365N1739N6639O0442O2428O5323P0641
58220C315137P6134P9487Q1346Q3181Q5340Q8407R3282R8794J02614J05444J10613
58209D319779J18403J24718J26837J26690J26869J27165J26843J26817J27784
58200E451905J29278J31987J37832J46685J56354J66620J79654J95533K11235
58191F907083K24990K37938K50902K63580K77336K94349L13529L31808L49700
58182I451215L70623L94509M17584M38710M60231M82479N04013N27731N59562
58173A3606657N99785O42544O84914P29340P76281Q22880Q70681R25977R89830
58164B0648889J055720J119553J183742J249407J313948J379442J453949J540950
$$ y = [2732914, 2769662, 2809526, 2853158, 2899560, 2947925, 2999664, 3056303, 3116745, 3179173, 3244496, 3315137, 3391271, 3470758, 3552104, 3635285, 3720625, 3809032, 3902314, 4001108, 4103722, 4209166, 4319779, 4438182, 4562900, 4689737, 4816427, 4943296, 5070461, 5197304, 5324121, 5451905, 5581183, 5713170, 5851002, 5997687, 6154041, 6320661, 6500315, 6695848, 6907083, 7132073, 7370011, 7620913, 7884493, 8161829, 8456178, 8769707, 9101515, 9451215, 9821838, 10216347, 10633931, 11072641, 11532872, 12015351, 12519364, 13047095, 13606657, 14206442, 14848986, 15533900, 16263240, 17039521, 17862401, 18733082, 19659059, 20648889, 21704609, 22824162, 24007904, 25257311, 26571259, 27950701, 29404650, 30945600]
58156C0945600J636536J740273J859121J997018K150657K319093K507120K715841
58148D7871259K941550L187812L466748L785053M142426M547796N022609N584552
58140H0549805O244672P024502P956249R059638J0337309J1794761J3437694J5247730
58132A61652360J7203377J9347589K1803423K4698088K8068705L1751203L5144320
58125C39669065L6954679L5386705K9060051J8128774M583610q676075j9285093
58118D35821716k6270130k9913942l1080914l0638773k9225580k7259699k5023588
58111B36409090k2723608k0501012j8423938j6501197j4716746j3054329j1505246
58104A18983014j0074513q782946p652225o685509n866965n174982m587575m080409
$$ y = [30945600, 32582136, 34322409, 36181530, 38178548, 40329205, 42648298, 45155418, 47871259, 50812809, 54000621, 57467369, 61252422, 65394848, 69942644, 74965253, 80549805, 86794477, 93818979, 101775228, 110834866, 121172175, 132966936, 146404630, 161652360, 178855737, 198203326, 220006749, 244704837, 272773542, 304524745, 339669065, 376623744, 412010449, 441070500, 459199274, 463782884, 455106809, 435821716, 409551586, 379637644, 348556730, 317917957, 288692377, 261432678, 236409090, 213685482, 193184470, 174760532, 158259335, 143542589, 130488260, 118983014, 108908501, 100125555, 92473330, 85787821, 79920856, 74745874, 70158299, 66077890]
58096F6077890l630848l223715k848228k493626k152566j822796j500360j177247
58088D7228504q48362n11288j56646K28618O44250J075762J512427J953696K410591
58079E3537552K937192L643281M573518N492791N845518N072789L066646L19266
58071H4488553k385408m434272n617209o051208n982683n639722n173147m662054
58063D4542850m150633l675272l260236k905924k598291k326398k083229j858862
58055B1684005j646409j450899j282080j141563j024615r29266q54317p92458
58047A2562398p34818o80345o33199n93157n55488n17969m81547m45819m09694
58038G510362l74819l43523l15252k89116k67358k51905k40355k29438k19607
$$ y = [66077890, 62447042, 59223327, 56375099, 53881473, 51728907, 49906111, 48405751, 47228504, 46380142, 45868854, 45712208, 45940826, 46585076, 47660838, 49173265, 51126961, 53537552, 56474744, 60118025, 64691543, 70184334, 76029852, 81102641, 84169287, 84488553, 82103145, 77668873, 72051664, 66000456, 60017773, 54378051, 49204904, 44542850, 40392217, 36716945, 33456709, 30550785, 27952494, 25626096, 23542867, 21684005, 20037596, 18586697, 17304617, 16163054, 15138439, 14209173, 13354856, 12562398, 11827580, 11147235, 10514036, 9920879, 9365391, 8847422, 8365875, 7920056, 7510362, 7135543, 6792020, 6476768, 6187652, 5920294, 5668389, 5428034, 5198596, 4978989]
58029D978989k11958k03899j92621j80015j69520j60587j50860j41352j34714
58020C433463j30200j24806j17927j11093j04617r8004r2125q7813q3877p9391
58010B403610p5844p4273p2605o8825o4429o1644n9634n6684n3657n1865m9891
57999A714259m6161m2441m1089m0741l8637l5488l4218l5032l5493l4485l2835
57988A297639l0828k8182k5770k4582k3818k2278k0531j9447j8102j5616j3409
57977A055076j2902j2617j0468p532o418p105p550p485q440j0517j2047j2185
57965I39810j1462j0135q176o420n773n801n843o509q311r959r943q633o980m531
57951H31334r74J865K115Q69O69J936L176L685L687K827J056n7O55J590N50j718
$$ y = [4978989, 4767031, 4563132, 4370511, 4190496, 4020976, 3860389, 3709529, 3568177, 3433463, 3303263, 3178457, 3060530, 2949437, 2844820, 2746816, 2654691, 2566878, 2483001, 2403610, 2327766, 2253493, 2180888, 2112063, 2047634, 1985990, 1926356, 1869672, 1816015, 1764150, 1714259, 1668098, 1625657, 1584568, 1543827, 1505190, 1469702, 1435484, 1400452, 1364959, 1330474, 1297639, 1266811, 1238629, 1212859, 1188277, 1164459, 1142181, 1121650, 1102203, 1084101, 1068485, 1055076, 1042174, 1029557, 1019089, 1011557, 1005139, 998034, 990484, 982999, 974559, 964042, 951995, 939810, 928348, 918213, 910037, 903617, 897844, 892043, 886200, 879691, 871380, 861421, 851478, 842845, 835865, 831334, 830360, 832225, 834340, 835209, 835878, 837814, 840990, 844675, 848362, 851189, 852245, 852188, 852843, 854433, 854983, 853265]
57935H53265k882k999m181o998j0031j2665j5376j7399j6981j4185j1149r171
57923G29248p604n666l415j047R70J328n68k905l319k030j085j087j030p23o80
57908G00387LK614N772O498M715L545M484N375M339K797K750L605L756L436L703
57893G57779L810J783k719p753j1109j2020j1208j0042r422r001p828n892m266
57880F72112l516k927j756k98J010K655N306Q550J1189J2524J2787J2520J2017
57867G42173J1209R704P121L659K20k358m105n822q180j1032j3550j5046j5577
57854F98416j5676j5577j5128j4325j3469j2554j1143r124p139n834n141m632
57842E68674m172l808l420k817k019j197o41o34q89l32J578L511L583K153J759
$$ y = [853265, 850383, 847384, 843203, 836205, 826174, 813509, 798133, 780734, 763753, 749568, 738419, 729248, 721644, 715978, 712563, 711516, 712486, 713814, 713246, 710341, 707022, 704992, 703907, 702820, 701790, 701067, 700387, 700390, 703004, 708776, 715274, 719989, 723534, 728018, 733393, 737732, 740529, 743279, 746884, 750640, 754076, 757779, 761589, 763372, 760653, 752900, 741791, 729771, 718563, 708521, 699099, 690098, 682270, 676378, 672112, 668596, 665669, 663913, 663615, 664625, 667280, 672586, 681136, 692325, 704849, 717636, 730156, 742173, 753382, 763086, 770207, 773866, 774086, 771728, 767623, 761801, 753621, 742589, 729039, 713993, 698416, 682740, 667163, 652035, 637710, 624241, 611687, 600544, 591420, 584281, 578447, 573306, 568674, 564502, 560694, 557274, 554457, 552438, 551241, 550600, 549966, 549077, 548745, 550323, 553834, 557417, 559570, 561329]
57827E61329L659O089O874O255N764N607M929L802L130L024K721J932R48l33k326
57812F13404m760o778p793p607o234m466l863m949o119n652m142l364l322k375
57798E41980r4K059L202M272O055P652P964P610Q055R469J0513J0157Q842P765
57784F35501P429P188O088L886J109j623l784m647l738j932j185k456m594n978
57770F31264o578p495q978r967r464p614n513m428m838n832n885m624l256k838
57756E43954l123l657m792o480p294o182m480m517o659r183j0665j0902r977q128
57742D47915o453n994o047m974k756j051n29nJ256K252K171K039L153N076O428
57727D42481O883P151P583P992Q494R418J0519J1153J1260J1336J1324J0305P768
$$ y = [561329, 564988, 571077, 577951, 584206, 589970, 595577, 600506, 604308, 607438, 610462, 613183, 615115, 616063, 615730, 613404, 608644, 601866, 594073, 586466, 580232, 575766, 571903, 566954, 560835, 555183, 551041, 547677, 544355, 541980, 541886, 543945, 547147, 551419, 557474, 565126, 573090, 580700, 588755, 598224, 608737, 618894, 627736, 635501, 642930, 650118, 656206, 660092, 661201, 659578, 655794, 651147, 647409, 645477, 644292, 641836, 637242, 631264, 624686, 617191, 608213, 598246, 588782, 581168, 575655, 571227, 566389, 560557, 554672, 550048, 546792, 543954, 540831, 537174, 532382, 525902, 518608, 512426, 507946, 503429, 496770, 487587, 476922, 466020, 456043, 447915, 441462, 435468, 429421, 424447, 421691, 420640, 420111, 420106, 421362, 423614, 425785, 427824, 430977, 436053, 442481, 449364, 456515, 464098, 472090, 480584, 490002, 500521, 511674, 522934, 534270, 545594, 555899, 563667]
57714E63667M693K762K585L198L376K935K307J401l49k829n035o267o805p175
57700E58464p489p836q519r364r528q594p239o229n468m668m147m020l487j882
57686D69994J35J516K278K911L074K268J330J636K974L776L416K887L027L529
57672E04751M025M853O111O986O708N512M276L719M211N621P216Q180Q439Q439
57658E89047Q417Q553R520J1683J3862J4254J2902J2042J3373J5951J7486J7050
57646G44140J5867J5797J7559K0099K1553K1173K0420K1646K5537L0342L3785
57635I87918L5256L5942L7272L9464M1379M1788M0894M0261M1020M2804M4928
57624A428926M7861N2422N8139O3786O9324P6004Q4489R4163J04365J15040J26038
$$ y = [563667, 568360, 571122, 573707, 576905, 580281, 583216, 585523, 586924, 586575, 583746, 578711, 572444, 565639, 558464, 550975, 543139, 534620, 525256, 515728, 507134, 499895, 493666, 488198, 483530, 479383, 475363, 471876, 469994, 470129, 471645, 473923, 476834, 479908, 482176, 483506, 485142, 488116, 491892, 495308, 498195, 501222, 504751, 508776, 513629, 519740, 526726, 533434, 538946, 543222, 546941, 551152, 556773, 563989, 572169, 580608, 589047, 597464, 606017, 615537, 627220, 641082, 655336, 668238, 680280, 693653, 709604, 727090, 744140, 760007, 775804, 793363, 813462, 835015, 856188, 876608, 898254, 923791, 954133, 987918, 1023174, 1059116, 1096388, 1135852, 1177231, 1219019, 1259913, 1300174, 1341194, 1383998, 1428926, 1476787, 1529209, 1587348, 1651134, 1720458, 1796462, 1880951, 1975114, 2079479, 2194519, 2320557]
57613B320557J37018J48396J61039J74651J87597J98708K07926K14668K16999
57604C967559K13426K04081J88703J64227J26181P2992Q618n8594j19241j66259
57594D601693j96989k12989k17836k14863k06477j94601j80961j67026j53853
57585B856098j41737j29923j17285j03718r0552p9308p0381o3054n6236m9003
57575A954901m1125l3488k7438k3117j8955j3287o192P45O191J0131J3527J7430
57563A839323K2294K7738L3031L7963M3044M8790N5154O1952O9434P7954Q7196
57552B403873R6106J03602J09236J13233J15915J17124J16141J12181J04625R2724
57542C484760P5622N3337K7472K88k6713n2727p6505r6436j11906j23651j32365
$$ y = [2320557, 2457575, 2605971, 2767010, 2941661, 3129258, 3327966, 3535892, 3750560, 3967559, 4180985, 4385066, 4573769, 4737996, 4864177, 4937169, 4945787, 4887193, 4767952, 4601693, 4404704, 4191715, 3973879, 3759016, 3552539, 3357938, 3176977, 3009951, 2856098, 2714361, 2584438, 2467153, 2363435, 2272883, 2193575, 2123194, 2060140, 2003904, 1954901, 1913776, 1880288, 1852850, 1829733, 1810778, 1797491, 1791299, 1792044, 1798235, 1808366, 1821893, 1839323, 1861617, 1889355, 1922386, 1960349, 2003393, 2052183, 2107337, 2169289, 2238723, 2316677, 2403873, 2499979, 2603581, 2712817, 2826050, 2941965, 3059089, 3175230, 3287411, 3392036, 3484760, 3560382, 3613719, 3641191, 3641479, 3614766, 3562039, 3485534, 3389098, 3277192, 3153541, 3021176]
57531C021176j37768j39356j37389j32679j26084j18633j11503j05213r9207r2700
57521A820644q5595p8328p1445o5724o1995o0036n8038n4072m8088m1900l7263
57510A158160l4424l2464l0452k8022k5224k2210j9128j6278j4171j3182j3015
57499I09590j2743j1615r729p825o474n590m721l573k160m31J900M698O884P273
57485H65484O280N961P779J0846J3146J3973J4204J4522J4758J5150J6929K0780
57473A019812K5420K8675K9804L0155L1443L3869L6259L7952M0000M3965M9725
57462A407079N5424N9882O3998O9050P4617P9376Q3228Q7022R0516R2285R1819
57451B254296Q9940Q6627Q0082O8820N3466L5515J5607n740k6600m4541n8818
$$ y = [3021176, 2883408, 2744052, 2606663, 2473984, 2347900, 2229267, 2117764, 2012551, 1913344, 1820644, 1735049, 1656721, 1585276, 1519552, 1457557, 1397521, 1339483, 1285411, 1237323, 1195423, 1158160, 1123736, 1091272, 1060820, 1032798, 1007574, 985364, 966236, 949958, 935787, 922605, 909590, 896847, 885232, 875503, 867678, 861204, 855614, 850893, 847320, 845160, 844729, 846629, 851327, 858211, 865484, 871764, 877725, 885504, 896350, 909496, 923469, 937673, 952195, 966953, 982103, 999032, 1019812, 1045232, 1073907, 1103711, 1133866, 1165309, 1199178, 1235437, 1273389, 1313389, 1357354, 1407079, 1462503, 1522385, 1586383, 1655433, 1730050, 1809426, 1892654, 1979676, 2070192, 2162477, 2254296, 2344236, 2430863, 2510945, 2579765, 2633231, 2668746, 2684353, 2678613, 2652013, 2607472, 2548654]
57440B548654p0400p9907q6696r0218r1246r1107r0264q8134q4132p8411p1692
57429A626447o4746n8158n2293m7113m2115l6860l1652k7240k3707k0244j6461
57418A205858j3175j1209r889p706m252n29K428M360N390O014P508J1082J6426
57405A212306K1968K6841L1489L6275M0735M4766M9244N4718O0541O6077P1604
57394A716564P7049Q0893Q1645P9786P6827P2731O5575N3858L8140K0172J261
57383B364501j8068l7257n5020o9735q0666q8589r4648r8626r9275r6576r2539
57372A533502q8919q5163p9871p3525o8203o4667o1368n6728n1156m6142m2370
57361H15390l9497l7101l4885l2294k9034k5812k3709k2616k1182j8758j6569
$$ y = [2548654, 2478254, 2398347, 2311651, 2221433, 2130187, 2039080, 1948816, 1860682, 1776550, 1698139, 1626447, 1561701, 1503543, 1451250, 1404137, 1362022, 1325162, 1293510, 1266270, 1242563, 1222319, 1205858, 1192683, 1181474, 1171585, 1163879, 1159627, 1159098, 1161526, 1165886, 1171276, 1177290, 1184798, 1195880, 1212306, 1234274, 1261115, 1292604, 1328879, 1369614, 1414380, 1463624, 1518342, 1578883, 1644960, 1716564, 1793613, 1874506, 1956151, 2035937, 2112764, 2185495, 2251070, 2304928, 2343068, 2363240, 2364501, 2346433, 2309176, 2254156, 2184421, 2103755, 2015166, 1920518, 1821892, 1722617, 1626041, 1533502, 1444583, 1359420, 1279549, 1206024, 1137821, 1073154, 1011786, 955058, 903902, 857760, 815390, 775893, 738792, 703907, 671613, 642579, 616767, 593058, 570442, 549260, 530502, 513933]
57350E13933j6043j6580j6101j3748j0807q606o882m978l521l625n057o500p320
57337C94165p747p619o409m587l473l420l404k841k468k868l372l196k584j938
57323C38239r30N29J357N06j532l471m832n732n769m512k791k101k639l109k589
57308C00624j644j336j991l196m309m738m338l727l725m310m627m142l224k503
57294B52814k174k121k148j919j121j6O22L87l05r02j392j860j826o74J279K744
57278B41388K773J823J287K108L990N732O143M896K918J928L101N922Q664J0100
57264C02773J0521J0925J1796J3005J4376J5724J6608J6871J7216J8469K0300
57253D68584K1455K1354K0656J9997J9065J7395J5381J3834J3095J3187J4242
$$ y = [513933, 497890, 481310, 465209, 451461, 440654, 432048, 425166, 420188, 416667, 413042, 407985, 401485, 394165, 386418, 378799, 372390, 367803, 364330, 360910, 357506, 354665, 352197, 349329, 345957, 342761, 340177, 338239, 337309, 337838, 339195, 339701, 338169, 334698, 329866, 324134, 318365, 313853, 311062, 308961, 306322, 303213, 300624, 298980, 297644, 295653, 292457, 288148, 283410, 279072, 275345, 271620, 267310, 262683, 258541, 255317, 252814, 250640, 248519, 246371, 244452, 243331, 243315, 243937, 244324, 244019, 243117, 241725, 239865, 238039, 237365, 238644, 241388, 244161, 245984, 247271, 249379, 253369, 259101, 265244, 270140, 273058, 274986, 278087, 284009, 292673, 302773, 313294, 324219, 336015, 349020, 363396, 379120, 395728, 412599, 429815, 448284, 468584, 490039, 511393, 532049, 552046, 571111, 588506, 603887, 617721, 630816, 644003, 658245]
57242F58245J6021J7360J7164J6043J5988J8030K0796K1964K0697J8138J5841
57231H56287J4594J4713J6512J9712K3041K5303K6713K8386L0731L3292L6152
57220A125436M0081M4780M8331M9369M8966M9025M9620M9272M7440M4985M2197
57209A639502L7990L1705K4380J7617J1958P113K965m68l424o045p980q967r524
57196A736822j0321j0946r994o596j579L261O873R732J2792J6043J8513J9631
57184A784231J9916K0164K0561K0957K1375K1682K1413K0654K0663K2794K6946
57173B021356L1723L5955L9438M2562M5865M9754N4025N7775O0285O1551O1634
57162B561923O0232N7754N5819N5510N5682N4316N1206M7991M5879M4814M4712
$$ y = [658245, 674266, 691626, 708790, 724833, 740821, 758851, 779647, 801611, 822308, 840446, 856287, 870881, 885594, 902106, 921818, 944859, 970162, 996875, 1025261, 1055992, 1089284, 1125436, 1165517, 1210297, 1258628, 1307997, 1356963, 1405988, 1455608, 1504880, 1552320, 1597305, 1639502, 1677492, 1709197, 1733577, 1751194, 1763152, 1770265, 1773230, 1772762, 1769338, 1763293, 1755313, 1746346, 1736822, 1726501, 1715555, 1705561, 1698965, 1697386, 1700647, 1707520, 1717252, 1730044, 1746087, 1764600, 1784231, 1804147, 1824311, 1844872, 1865829, 1887204, 1908886, 1930299, 1950953, 1971616, 1994410, 2021356, 2053079, 2089034, 2128472, 2171034, 2216899, 2266653, 2320678, 2378453, 2438738, 2500289, 2561923, 2622155, 2679909, 2735728, 2791238, 2846920, 2901236, 2952442, 3000433, 3046312, 3091126, 3135838]
57151C135838M5952M8524N2038N6756O3300P0985P7728Q2109Q4652Q6649Q8588
57140C893119R0049R0482Q9754Q8371Q7176Q6367Q5153Q3068Q1137Q0725Q1626
57129D837027Q2324Q1896Q0621P9082P7735P6977P6456P4757P1045O6673O3806
57118E668399O2811O2440O2136O2537O3815O5123O5794O5804O5100O3711O2303
57107F369973O1601O1586O2210O3933O6270O6922O4165N9096N3710M8055M1463
57096G018984L5296L1587K9837K8084K6446K6549K7898K7887K5194K0140J2024
57085G309926n55j6721l3698n0167o6390q1506r4235j06135j20530j38143j57293
57074F444553j78131k02492k29476k55402k78744l01151l23284l43926l63947
$$ y = [3135838, 3181790, 3230314, 3282352, 3339108, 3402408, 3473393, 3551121, 3633230, 3717882, 3804531, 3893119, 3983168, 4073650, 4163404, 4251775, 4338951, 4425318, 4510471, 4593539, 4674676, 4755401, 4837027, 4919351, 5001247, 5081868, 5160950, 5238685, 5315662, 5392118, 5466875, 5537920, 5604593, 5668399, 5731210, 5793650, 5855786, 5918323, 5982138, 6047261, 6113055, 6178859, 6243959, 6307670, 6369973, 6431574, 6493160, 6555370, 6619303, 6685573, 6752495, 6816660, 6875756, 6929466, 6977521, 7018984, 7054280, 7085867, 7115704, 7143788, 7170234, 7196783, 7224681, 7252568, 7277762, 7297902, 7309926, 7309371, 7292650, 7258952, 7208785, 7142395, 7060889, 6966654, 6860519, 6739989, 6601846, 6444553, 6266422, 6063930, 5834454, 5579052, 5300308, 4999157, 4675873, 4331947, 3968000]
57065C968000l86950m15081m47905m85765n30240n81338D82070b22958p84085
57056a007043q74105r70073j071478j182419j304440j436377j581549j747465
57048a1174949j937564k150890k390725k665192k978208l328950l721862m167723
57040c4516063m673059n238468n869058o575370p362371q229687r183093j0229597
57032i1876766j1357584j2536418j3733916j4911800j6008140j6962460j7759814
57025a95146898j8384001j8684804j8357907j7161425j5163627j2702639j0070843
57018c05672144p288989m217415q32931K657781N948311Q821515J1228937J3251214
57010b76103721J5003699J6542704J7823399J8737277J9189916J9148484J8641037
$$ y = [3968000, 3581050, 3165969, 2718064, 2232299, 1702059, 1120721, 482070, -222958, -1007043, -1881148, -2851221, -3922699, -5105118, -6409558, -7845935, -9427484, -11174949, -13112513, -15263403, -17654128, -20319320, -23297528, -26626478, -30348340, -34516063, -39189122, -44427590, -50296648, -56872018, -64234389, -72464076, -81647169, -91876766, -103234350, -115770768, -129504684, -144416484, -160424624, -177387084, -195146898, -213530899, -232215703, -250573610, -267735035, -282898662, -295601301, -305672144, -312961133, -317178548, -318011479, -315353698, -309405387, -300583872, -289354935, -276103721, -261100022, -244557318, -226733919, -207996642, -188806726, -169658242, -151017205]
57003a51017205J7741665J6557420J5203379J3772644J2329463J0924317R600447
56996e4887870Q384814P286501O308337N451489M708431M063578L505123L028665
56988a2150932K627797K290167K005141J766850J567269d99331G40770J103145
56980A843915R81529Q69639P64926O70496N87798N12834M42540L79040L24507
56971G377224K77185K35453K00911J74411J53389J35764J22207J12222J02213
56962H890979R0098P8061O8481O0518N2683M5118L7278K6658J1756o760k9075
56951I325795n6764q8665j19868j46811j70280j91709k09823k23002k32257k39979
56941G646637k48156k58972k74335k93226l11736l26623l36339l38334l28941
$$ y = [-151017205, -133275540, -116718120, -101514741, -87742097, -75412634, -64488317, -54887870, -46503056, -39216555, -32908218, -27456729, -22748298, -18684720, -15179597, -12150932, -9523135, -7232968, -5227827, -3460977, -1893708, -499331, 740770, 1843915, 2825444, 3695083, 4460009, 5130505, 5718303, 6231137, 6673677, 7052717, 7377224, 7654409, 7889862, 8090773, 8265184, 8418573, 8554337, 8676544, 8788766, 8890979, 8981077, 9059138, 9127619, 9188137, 9240820, 9285938, 9323216, 9349874, 9361630, 9354870, 9325795, 9269031, 9180366, 9060498, 8913687, 8743407, 8551698, 8341875, 8118873, 7886616, 7646637, 7398481, 7139509, 6865174, 6571948, 6260212, 5933589, 5597250, 5258916, 4929975]
56932D929975l07328k76621k40113j99244j55930j13050p1015k6686K2657P5930
56922C638575J27608J66093J73440J34424N0742n6494j61060k46201l05640l37720
56912C183767l44442l32831l11312k84825k55810k27639k03235j81666j59731
56903H82276j36632j14592r5420p8884o3913m9649l5715k3033j3759r287r112
56892B52280j2200j7910k4572k9174l0072k8622k6794k4698k1643j7847E172c056
56879d958a300E815R195J1049J2688J4313J7252K1849K6081K8036K8184K7482
56867B01944K4874J8753R661l01r679j7581k2738k4510k3949k2403k0070j7222
56855I6779j5327j5253j5582j4570j2640j1162B312e506n064k960j797q25K38
$$ y = [4929975, 4622647, 4346026, 4105913, 3906669, 3750739, 3637689, 3566674, 3539988, 3562645, 3638575, 3766183, 3932276, 4105716, 4240140, 4290882, 4234388, 4073328, 3827127, 3521487, 3183767, 2839325, 2506494, 2195182, 1910357, 1654547, 1426908, 1223673, 1042007, 882276, 745644, 631052, 535632, 456748, 392835, 343186, 307471, 284438, 270679, 261392, 252280, 240080, 222170, 197598, 168424, 138352, 109730, 82936, 58238, 36595, 18748, 5172, -3056, -4958, -1300, 5815, 15010, 26059, 38747, 53060, 70312, 92161, 118242, 146278, 174462, 201944, 226818, 245571, 255232, 254931, 245252, 227671, 204933, 180423, 156474, 134071, 114001, 96779, 81452, 66199, 50617, 36047, 23407, 12245, 2312, -5506, -10570, -13530, -15327, -16152, -15914]
56842a5914J010J402J586J589J768K892g88E782P646R395J2524J5714J7740J9499
56828H8300K2179K4894K6035K5804K5322K4178K1050J6157J1087O427J370m377
56816B88426r740j3350j4439j3121j0676q894q142o707l109J821O292J0026J4049
56803B32436J8823K3915K8900L3418L6929L9231M0283L8727L2213K0678P854k289
56791E51118r400j5200j9534k0513j7906j3712r335m470R52N886R809J3703J8709
56778D90107K4860L1567L8417M5222N1978N8759O4842O7873O4797N4020L6485
56767A028927J5057o754k5963m0825n0688n5311n4945n0891m4906l7893l0152
56756F45656k2848j7372j3064p593l21O869J2945J9545K7854L5991M1485M4086
$$ y = [-15914, -14904, -13502, -11916, -10327, -8559, -5667, -788, 5782, 13428, 22823, 35347, 51061, 68801, 88300, 110479, 135373, 161408, 187212, 212534, 236712, 257762, 273919, 285006, 291433, 292803, 288426, 278686, 265336, 250897, 237776, 227100, 218206, 210064, 203357, 200248, 202069, 208361, 218387, 232436, 251259, 275174, 304074, 337492, 374421, 413652, 453935, 492662, 524875, 545553, 553407, 551118, 541718, 526518, 506984, 486471, 468565, 454853, 445518, 441048, 442000, 447886, 457695, 471398, 490107, 514967, 546534, 584951, 630173, 682151, 740910, 805752, 873625, 938422, 992442, 1028927, 1043984, 1037230, 1011267, 970442, 919754, 864443, 809498, 758607, 713701, 675808, 645656, 622808, 605436, 592372, 584779, 584458, 591327, 604272, 623817, 651671, 687662, 729147, 773233]
56744G73233M3808L8285K5285O853j1888k7318l8488m5030m7091m6685m5958m4134
56732E80872l8920l0856k3443j8679j5240j1540p868m589o79M645J0478J5507
56720D59688J9288K1513K1297J7974J1683K902p438j7288k4422k8511l0983l2640
56708D13063l2764l0817k7553k3947k0309j6921j4331j2542j1007r662q951q564
56696A95695p454n492l979l979n012n773n418l958k158j146j504k673l726m288
56682A39135m206l236j973k018l695m645k680P55K223R95m31l74J63Q0j7L29Q6
56665A20491j353k641k207l67J401K201J887O14q98j552j101m12j20J1J28k18
56649A15864j116k019k704l366l556k417l99P33P2j575l331n124o425o016l991
$$ y = [773233, 817041, 855326, 880611, 887464, 875576, 848258, 809770, 764740, 717649, 670964, 625006, 580872, 541952, 511096, 487653, 468974, 453734, 442194, 434326, 429737, 429058, 433703, 444181, 459688, 478976, 500489, 521786, 539760, 551443, 554345, 546907, 529619, 505197, 476686, 445703, 413063, 380299, 349482, 321929, 297982, 277673, 260752, 246421, 233879, 222872, 213210, 204259, 195695, 188241, 182749, 178770, 174791, 169779, 164006, 158588, 154630, 152472, 151326, 149822, 147149, 143423, 139135, 134929, 131693, 129720, 127702, 124007, 119362, 116682, 117437, 119660, 120655, 120224, 119850, 120013, 120093, 120076, 120405, 120491, 119138, 116497, 114290, 113923, 115324, 117525, 119412, 120026, 119128, 117576, 116475, 116063, 115943, 115954, 116082, 115864, 114748, 112729, 110025, 106659, 103103, 100686, 100287, 101020, 101092, 99517, 96186, 91062, 84637, 78621, 74630]
56634G4630k359k449l156k902j939j360j067k41J014J959K589L437M443M968M630
56619H2197L502K054J298K184M133N205M407K901K160K129K106K263K874L146
56605A22559K290J154J204K367L261L361L455M112M975N609N853N300L646J789
56591A70935J368K723M151L888K155N72M6M9j98o67r27j008j271j634j624j160
56575A77398o27p2R01K111K524J625L16m01q83j929l127l336k594k137k582l203
56559A63984l039j813J04J706J641k67k179k141n83N12N30N49J004J131Q31R98
56543A62968J556J366O31J137L157M327L049R43L41J018J332J146J556K557L032
56528A90116K649K189K200K557L105L658L684K808J329k71j692k181p05K382M932
$$ y = [74630, 72271, 69822, 66666, 63764, 61825, 60465, 59398, 59157, 60171, 62130, 64719, 68156, 72599, 77567, 82197, 85699, 87753, 89051, 91235, 95368, 100573, 104980, 107881, 110041, 112170, 114276, 116539, 119413, 122559, 124849, 126003, 127207, 129574, 132835, 136196, 139651, 143763, 148738, 154347, 160200, 165500, 169146, 170935, 172303, 175026, 179177, 183065, 185220, 185792, 185838, 185887, 185689, 185022, 184095, 183087, 181816, 180182, 178558, 177398, 176771, 176699, 177600, 179711, 182235, 183860, 184176, 183775, 182892, 180963, 177836, 174500, 171906, 169769, 167187, 163984, 160945, 159132, 159236, 160942, 162583, 162316, 160137, 157996, 157413, 157925, 158455, 159004, 160008, 161139, 161970, 162968, 164524, 165890, 166521, 167658, 170815, 175142, 178191, 179134, 179475, 180493, 181825, 182971, 184527, 187084, 190116, 192765, 194954, 197154, 199711, 202816, 206474, 210158, 212966, 214295, 214024, 212332, 210151, 209446, 211828, 216760]
56513B16760N303M181L092K325J536J232K010L141L533L517M108N066N389N301
56499B66494O026P652Q872R071R147R877J0666J0515R463Q493Q377Q897R119Q435
56485C91104P296O550O160N366M146L370L149K367N18j329k319l104m199m443
56471D14632k900j127j650m673q025r813r615p697m977l383m255o351p230o494
56457C36442n982o690p416o931n716m780m131l226k092j265j255k309m028n134
56443B75487m481k562j174j383k474l115k830k143j742j606q54J130L207L159
56429B58619O07j856j789j26L83q77k099k197j838j298K35K515L557K268R6j038
56413B55162r55m27M17J575K266K014J868L163N496P150P267O632O383O867P676
$$ y = [216760, 222063, 226244, 229336, 231661, 233197, 234429, 236439, 239580, 243113, 246630, 250738, 255804, 261193, 266494, 272520, 280172, 289044, 298115, 307262, 317139, 327805, 338320, 347783, 356276, 364653, 373550, 382669, 391104, 398400, 404950, 411110, 416476, 420622, 423992, 427141, 429508, 430026, 428697, 426378, 423274, 419075, 414632, 411732, 410605, 408955, 404282, 396257, 386444, 376829, 369132, 364155, 360772, 356517, 350166, 342936, 336442, 330460, 323770, 316354, 309423, 303707, 298927, 294796, 291570, 289478, 288213, 286958, 284649, 280621, 275487, 271006, 268444, 267270, 265887, 263413, 260298, 257468, 255325, 253583, 251977, 251123, 252253, 255460, 258619, 259226, 257370, 255581, 255455, 255838, 254961, 252862, 250665, 248827, 247529, 247764, 250279, 253836, 256104, 256200, 255162, 254207, 253780, 254197, 255772, 258038, 260052, 261920, 265083, 270579, 277729, 284996, 291628, 298011, 304878, 312554]
56398C12554Q208Q063P323O432N726N183M704M347M236M455N033N723O023N808
56384C93818N693O070O209N191L549K799L224L372K036k82k339l498l647k784
56370D19411j470q88j569k566k621j821j408k155l451m032l393k462k720m540
56356C84315o605p457p137o582n895m390k217o09k81p31j357k035k333j608m91
56341C34587p79k877m695m385k948k587l324l234j701m03o04j238p27N38R13J93
56325C06729Q5J717L750L863J670q39j660p27Q05K141L006L049K246J604K207
56310C29646L590M058K902J346R46J812K873L244K815J952J092M86J59J48O72
56295C57741J675K417K227J461J024J006O61k70j048r16J67J825L419L926K777
$$ y = [312554, 320762, 328825, 336148, 342580, 348306, 353489, 358193, 362540, 366776, 371231, 376264, 381987, 388010, 393818, 399511, 405581, 411790, 416981, 420530, 423329, 426553, 429925, 431961, 431679, 429340, 425842, 422195, 419411, 417941, 417053, 415484, 412918, 410297, 408476, 407068, 404913, 401462, 397430, 394037, 391575, 388855, 384315, 377710, 370253, 363116, 356534, 350639, 346249, 344032, 343423, 343142, 342411, 341054, 339019, 336686, 335078, 334587, 333808, 330931, 326236, 321851, 318903, 316316, 312992, 309758, 308057, 307654, 307050, 305812, 305085, 305623, 306536, 306729, 306814, 308531, 312281, 316144, 317814, 316975, 315315, 314588, 315393, 317534, 320540, 323589, 325835, 327439, 329646, 333236, 337294, 340196, 341542, 342488, 344300, 347173, 350417, 353232, 355184, 356276, 356762, 356921, 357069, 357741, 359416, 361833, 364060, 365521, 366545, 367551, 368212, 367942, 366894, 365978, 366145, 367970, 371389, 375315, 378092]
56280C78092J092R38K910N332O333N849N046M731M985N556N910N555M890N040
56266D42259O274P340P089O090N851P000Q902J0484J0820R483P300O252P624J0359
56252E53127J2028J1405R446P836P175O813O077N328N606P165Q760Q997Q144P628
56238F65535P791P303N229K508O34j68n04l66O91K344L569L856L606L415L648
56223G09091M491N738O696O918O901P434Q440R167R419R822J0823J2153J3544
56210H20637J5292J7685K0253K2168K3300K4485K6584K9554L2624L5178L7159
56199A104919L8822M0566M3134M7185N2377N7437O1685O5913P1069P6697Q1509
56188A741313Q5101Q8050R0556R2098R2310R1169Q8429Q3864P8006P1519O3881
$$ y = [378092, 379184, 380122, 383032, 388364, 394697, 400546, 405592, 410323, 415308, 420864, 426774, 432329, 437219, 442259, 448533, 455873, 462962, 469052, 474903, 481903, 490805, 501289, 512109, 521592, 528892, 535144, 542768, 553127, 565155, 576560, 586006, 593842, 601017, 607830, 613907, 619235, 624841, 632006, 640766, 649763, 657907, 665535, 673326, 680629, 685858, 688366, 689000, 688832, 688328, 687962, 688653, 690997, 694566, 698422, 702028, 705443, 709091, 713582, 719320, 726016, 732934, 739835, 747269, 755709, 764876, 774295, 784117, 794940, 807093, 820637, 835929, 853614, 873867, 896035, 919335, 943820, 970404, 999958, 1032582, 1067760, 1104919, 1143741, 1184307, 1227441, 1274626, 1327003, 1384440, 1446125, 1512038, 1583107, 1659804, 1741313, 1826414, 1914464, 2005020, 2097118, 2189428, 2280597, 2369026, 2452890, 2530896, 2602415, 2666296]
56177B666296N3860M1444K8114J5207L285o805j3965j8652k3139k8907l4609l7585
56165B644544l6853l4080l2068l2651l5476l8662m0903m2635m4478m5606m5255
56154B215877m5100m7679n2348n5411n4957n3118n2455n2597n2028n0966n0366
56143A648852m9687m7732m4741m1766l8962l6124l3877l2618l1209k8514k5351
56132A238271k3179k1606j9080j5513j2494j1170j1390j2480j3416j2784j0089
56121A075070o826m868m234l659k758k134j869j363l24J354M125P827J0804J1608
56107A082753J1087J1308J2796J4367J5228J5695J6117J6653J7833J9931K2056
56096A255824K3232K3871K4854K5861K6263K6956K9306L2562L4514L4706L5013
$$ y = [2666296, 2720156, 2761600, 2789714, 2804921, 2808206, 2801401, 2787436, 2768784, 2745645, 2716738, 2682129, 2644544, 2607691, 2573611, 2541543, 2508892, 2473416, 2434754, 2393851, 2351216, 2306738, 2261132, 2215877, 2170777, 2123098, 2070750, 2015339, 1960382, 1907264, 1854809, 1802212, 1750184, 1699218, 1648852, 1599165, 1551433, 1506692, 1464926, 1425964, 1389840, 1355963, 1323345, 1292136, 1263622, 1238271, 1215092, 1193486, 1174406, 1158893, 1146399, 1135229, 1123839, 1111359, 1097943, 1085159, 1075070, 1068244, 1063376, 1059142, 1055483, 1052725, 1050591, 1048722, 1047359, 1047035, 1048389, 1052514, 1060341, 1071145, 1082753, 1093840, 1105148, 1117944, 1132311, 1147539, 1163234, 1179351, 1196004, 1213837, 1233768, 1255824, 1279056, 1302927, 1327781, 1353642, 1379905, 1406861, 1436167, 1468729, 1503243, 1537949, 1572962]
56085A572962L6777L9247M1271M2894M4644M6485M7955M8658M8603M8806N1179
56074B069481N6778O4691P3668Q4125R7154J12373J28557J45798J65052J85850
56064C183527K06351K25356K42255K55039K60565K57218K45843K28073K05529
56055E309756J80774J57080J36403J18334J00893Q1387N7402K9011p9k5226m4745
56044F100990n9957p2453q3526r5695j12005j33225j57406j81993k04482k21442
56034D778806k29633k28686k21007k08964j93892j77310j60627j43531j25080
56025C090076j06577r1000p9432p0283o2190n5342m9721m4475l9508l5616l2820
56014B423112l0402k8298k6341k2783j6355r256m920l178r41K618N446P072R406
$$ y = [1572962, 1609739, 1648986, 1690257, 1733151, 1777795, 1824280, 1872235, 1920893, 1969496, 2018302, 2069481, 2126259, 2190950, 2264618, 2348743, 2445897, 2558270, 2686827, 2832625, 2997677, 3183527, 3389878, 3615234, 3857489, 4112528, 4373093, 4630311, 4876154, 5104227, 5309756, 5490530, 5647610, 5784013, 5902347, 6003240, 6084627, 6142029, 6171040, 6170961, 6145735, 6100990, 6041033, 5968580, 5885054, 5789359, 5677354, 5544129, 5386723, 5204730, 5000248, 4778806, 4549173, 4320487, 4099480, 3890516, 3696624, 3519314, 3358687, 3215156, 3090076, 2983499, 2892499, 2813067, 2742784, 2680594, 2625252, 2575531, 2531056, 2491548, 2455932, 2423112, 2392710, 2364412, 2338071, 2315288, 2298933, 2289677, 2284757, 2281579, 2280638, 2283256, 2288702, 2295774, 2305180]
56001B305180J2536J4099J3995J5339J9303K3130K5040K6943L0180L2687L3047
55990B551479L3586L6500M0198M2449M4205M7218N0547N2550N4127N6996O0774
55979C070629O4359O8111P2202P4879P5100P5055P7455Q1829Q5739Q8204Q9980
55968C923542R2043R5430J00911J07445J12846J17092J22613J30382J38719J47035
55958E088058J57141J69281J80680J90238K00924K14888K29813K42845K54694
55949F928562K66927K78704K89330L00946L15550L32192L49774L69405L91283
55940I822673M12833M32716M53106M75471M98207N21451N49549N85109O24946
55931A4376061O65527P07908P53677Q00948Q48733R00421R58476J020329J083583
$$ y = [2305180, 2317716, 2331815, 2345810, 2361149, 2380452, 2403582, 2428622, 2455565, 2485745, 2518432, 2551479, 2585065, 2621565, 2661763, 2704212, 2748417, 2795635, 2846182, 2898732, 2952859, 3009855, 3070629, 3134988, 3203099, 3275301, 3350180, 3425280, 3500335, 3577790, 3659619, 3745358, 3833562, 3923542, 4015585, 4111015, 4211926, 4319371, 4432217, 4549309, 4671922, 4802304, 4941023, 5088058, 5245199, 5414480, 5595160, 5785398, 5986322, 6201210, 6431023, 6673868, 6928562, 7195489, 7474193, 7763523, 8064469, 8380019, 8712211, 9061985, 9431390, 9822673, 10235506, 10668222, 11121328, 11596799, 12095006, 12616457, 13166006, 13751115, 14376061, 15041588, 15749496, 16503173, 17304121, 18152854, 19053275, 20011751, 21032080, 22115663]
55922B2115663J149945J219953J290093J360046J436250J522994J617290J718572
55914C3430806J835279J974259K131475K301459K487955K696257K923822L169298
55906E2950610L443175L758449M118850M528205N003609N567615O236540P028832
55898I2635885P973403R094443J0399360J1896522J3609771J5559382J7750534
55891A78919300K0200453K2941219K5956505K9147638L2386121L5464122L7765011
55884C82780369L7957793L4340319K5926118J3433787q01199j3998806k4211918
55877D55426463l0811630l4155445l5005934l4138969l2193409k9649329k6854794
55870B32616953k4055950k1405765j8969427j6754714j4752392j2953593j1348457
$$ y = [22115663, 23265608, 24485561, 25775654, 27135700, 28571950, 30094944, 31712234, 33430806, 35266085, 37240344, 39371819, 41673278, 44161233, 46857490, 49781312, 52950610, 56393785, 60152234, 64271084, 68799289, 73802898, 79370513, 85607053, 92635885, 100609288, 109703731, 120103091, 131999613, 145609384, 161168766, 178919300, 199119753, 222060972, 248017477, 277165115, 309551236, 345015358, 382780369, 420738162, 455078481, 481004599, 494438386, 493637187, 479638381, 455426463, 424614833, 390459388, 355453454, 321314485, 289121076, 259471747, 232616953, 208561003, 187155238, 168185811, 151431097, 136678705, 123725112, 112376655]
55863A12376655r930083q699724p656626o784296o054667n441300m920665m467212
55855E8422082m059131l687438l351498l048414k773772k528295k314568k129124
55847C4529842j964705j818098j689050j574127j468473j371668j285609j208433
55839B2149679j136276j068913j007931r51162q94569q38179p84932p35351o88159
55830A4044207o44505o06346n71901n37490n03039m71499m44026m19545l97776
55821I448080l78760l60808l42692l26453l14319l04518k93691k81632k69890
55812F575317k57554k42607k25876k09565j93309j75769j58829j46197j38839
55803D826772j35510j36175j40962j47076j51176j53806j57304j60327j58847
$$ y = [112376655, 102446572, 93746848, 86090222, 79305926, 73251259, 67809959, 62889294, 58422082, 54362951, 50675513, 47324015, 44275601, 41501829, 38973534, 36658966, 34529842, 32565137, 30747039, 29057989, 27483862, 26015389, 24643721, 23358112, 22149679, 21013403, 19944490, 18936559, 17985397, 17090828, 16252649, 15467717, 14732366, 14044207, 13399702, 12793356, 12221455, 11683965, 11180926, 10709427, 10265401, 9845856, 9448080, 9069320, 8708512, 8365820, 8039367, 7725048, 7420530, 7126839, 6845207, 6575317, 6317763, 6075156, 5849280, 5639715, 5446406, 5270637, 5111808, 4965611, 4826772, 4691262, 4555087, 4414125, 4267049, 4115873, 3962067, 3804763, 3644436, 3485589]
55794C485589j52027j42897j33636j24132j14753j06338r7610q6653p4789o5211
55784B387543n7790m9415l9500l0898k4814j9107j2892r115j0875j7860k7543
55773B087734l7380m4965m8578m8716m7211m4477l9738l3878k9378k7111k5889
55762A660413k5467k7084l0452l3068l3606l3494l4230l5437l6472l7679l8979
55751A294445l9223l7903l5796l3248k9766k5853k3186k2240k1569k0060j8056
55740I87545j5830j3019j0187q809q822q262o176l947k832k191j214o13j324l107
55726I01212n353p822r804j0267r721j0186j2278j4107j4182j3521j3419j2942
55714G67610j0573p215n503o664r559j2434j4375j5371j6015j6953j8016j8276
$$ y = [3485589, 3333562, 3190665, 3057029, 2932897, 2818144, 2711806, 2614196, 2527543, 2452754, 2387543, 2329753, 2280338, 2240838, 2209940, 2185126, 2166019, 2153127, 2144012, 2133137, 2115277, 2087734, 2050354, 2005389, 1956811, 1908095, 1860884, 1816407, 1776669, 1742791, 1713413, 1686302, 1660413, 1634946, 1607862, 1577410, 1544342, 1510736, 1477242, 1443012, 1407575, 1371103, 1333424, 1294445, 1255222, 1217319, 1181523, 1148275, 1118509, 1092656, 1069470, 1047230, 1025661, 1005601, 987545, 971715, 958696, 948509, 939700, 930878, 922616, 916440, 912493, 909661, 907470, 906256, 905643, 904319, 901212, 895859, 888037, 878233, 867966, 858245, 848059, 835781, 821674, 807492, 793971, 780552, 767610, 757037, 749822, 744319, 737655, 728096, 715662, 701287, 685916, 669901, 652948, 634932, 616656]
55702F16656j7394j6220j5518j4947j4057j3455j4076j5789j7630j8979j9804
55691D38787k0106j9870j9388j8998j8498j7228j4629j0621n625m22M123P233
55679C04758Q289P136M590K126N83l88j227j626j395j178j313q70Q10K441K203
55664C24939K56j794l402n136o606o589n407m965n854o335m924k434n59L4m86
55649B70738j810l122l257k063o82P5N67J173J490J183N23l78j746l228m113m659
55633B50691n714o679n765k885l37M82J080L165N688O558O019O236P993R737R830
55618B86099Q359O616N771O022O383N486L043J48k151l779m727m318k458p22r20
55603C08852k776m174l528j309O63R26m79k064k327j185L37J676L032M067L716
$$ y = [616656, 599262, 583042, 567524, 552577, 538520, 525065, 510989, 495200, 477570, 458591, 438787, 418681, 398811, 379423, 360425, 341927, 324699, 310070, 299449, 293824, 293402, 297525, 304758, 313047, 320183, 324773, 326899, 327482, 327094, 325867, 324241, 322846, 321668, 320355, 319485, 320295, 322736, 324939, 325195, 323401, 319999, 314863, 308257, 301668, 296261, 291296, 285442, 279107, 274183, 271749, 271190, 271224, 270738, 268928, 265806, 262549, 260486, 259804, 259879, 260446, 261619, 263109, 264292, 264815, 264437, 262691, 259463, 255350, 250691, 244977, 238298, 232533, 229648, 229311, 229793, 230873, 234038, 239726, 246284, 252303, 258539, 266532, 276269, 286099, 294458, 301074, 306845, 312867, 319250, 324736, 327779, 327927, 325776, 321997, 317270, 312952, 310494, 309772, 308852, 306076, 301902, 298374, 297065, 297728, 298654, 298175, 296111, 293784, 292599, 292936, 294612, 297644, 301711, 305427]
55588C05427J832j85j186j621k255k796k779k820l598m542m769m630m960n406
55574B65712n071m357m650o128p422p553o917o074m903l499k864l734n348o212
55560A90980n963n684o287p204p248o466o231p186p915o621l558p46N67Q96R35
55545A22269N24k58l61Q34K325K697J922J002L57m30j541k443k476j487m3P47
55529A23638P0j577k613k028l68J166J999K262K230K183K355K660K996L864N849
55514A44686Q293R638R497R241R906J0784J1073J1625J3679J6689J8953J9968
55502B94032K0716K1748K2282K1337J8792J5065J0408M873j278p205j1753j4481
55490C94536j6306j8406k0456k1114k0267j9413j9179j8195j5415j2140j0316
$$ y = [305427, 307259, 307074, 305888, 304267, 302012, 299216, 296437, 293617, 290019, 285477, 280708, 276078, 271118, 265712, 260641, 256284, 251634, 245506, 238084, 230531, 223614, 217540, 212637, 209138, 206274, 202540, 197192, 190980, 185017, 179333, 173046, 165842, 158594, 152128, 145897, 138711, 130796, 124175, 120617, 119871, 120438, 121334, 122269, 122793, 122535, 122174, 123008, 125333, 128030, 129952, 130954, 131311, 130881, 129340, 126897, 124421, 122934, 122891, 123638, 123708, 122131, 119518, 117490, 117122, 118288, 120287, 122549, 124779, 126962, 129317, 131977, 134973, 138837, 144686, 152979, 162617, 172114, 181355, 191261, 202045, 213118, 224743, 238422, 255111, 274064, 294032, 314748, 336496, 358778, 380115, 398907, 413972, 424380, 429253, 427975, 420770, 409017, 394536, 378230, 359824, 339368, 318254, 297987, 278574, 259395, 241200, 225785, 213645, 203329]
55479B03329r993r929r718r583q899o931m582l609m209n020n379n822o371o095
55465A07189m806l599l138k675j408K32J241J252N38m60j214j239n26M81J434
55450I3302K147K252J498L65k63j32K74N63O85M70l37j524k507l080l511l991
55434H6211m504n052n429n071l809k473j961j961j557p53l71n41n64k75l87j153
55418E0350j761j485o24O5J28p05k520m623n643m781k659n87O70J184J310J091
55402B9410K51j273k821l426l020k550k490j958k00J752K078N31j373k357k299
55387A0255j337N41K649L622K854J186k04q77r54o77m45n18n16P3R15J182Q76
55370A8625P40P90J31j320k237j627j85P88R28O13P1m69m51L49J205J240N48r6
$$ y = [203329, 193336, 183407, 173689, 164106, 155207, 148276, 143694, 140085, 135876, 130856, 125477, 119655, 113284, 107189, 102383, 98784, 95646, 92971, 91563, 91795, 93036, 94288, 94826, 94366, 93152, 91913, 91387, 91868, 93302, 95449, 97701, 99199, 99564, 99301, 99169, 99443, 100006, 100691, 101161, 100824, 99300, 96793, 93713, 90202, 86211, 81707, 76655, 71226, 66155, 62346, 59873, 57912, 55951, 54394, 53641, 53270, 52729, 52165, 51890, 51503, 50350, 48589, 47104, 46480, 46545, 46673, 45968, 43448, 38825, 33182, 28401, 25742, 25155, 25825, 27009, 28319, 29410, 29661, 28388, 25567, 22141, 19121, 16571, 14081, 12123, 11923, 13675, 15753, 16284, 14911, 12554, 10255, 8918, 9459, 12108, 15730, 18584, 19770, 19566, 18689, 17735, 17058, 16613, 16095, 15579, 15652, 16567, 17749, 18625, 19365, 20155, 20286, 18966, 16729, 15102, 14917, 15705, 16633, 17246, 17317, 16848, 16397, 16746, 17951, 19191, 19739, 19643]
55352A9643k49l1L29O56Q01Q14J002J531K204K787L170L144K507J608J211J537
55336D2664J921J672P74m75j871l020l252k426j400j134j519j541n48Q77J356
55321C2078R4k022k968j697N62J704J238M87M38M10o56k530l845l492j579N51
55305A8773J228j2j691j988j025n04j024j224j85Q64M29q57j196l89M2o24j215
55288I402m83J120K138J955J275R15P58J52r19j563j199m81l17l15P68K934M437
55271B0577L915J981L1j662l555n267n673m454k596j161m02j97n47b47j458m03
55255b108c10C594M585L734K544K037J825Q62p56j754j570j192j475j647n71J198
55239A1414J949J168J07l4N86J155J232P11l05j093o37J020K425K481J916K117
$$ y = [19643, 19394, 19363, 19692, 20348, 21149, 21963, 22965, 24496, 26700, 29487, 32657, 35801, 38308, 39916, 41127, 42664, 44585, 46257, 47031, 46556, 44685, 41665, 38413, 35987, 34587, 33453, 31934, 30393, 29845, 30722, 32078, 32172, 30150, 27182, 25485, 26047, 27751, 28989, 29476, 29914, 30324, 29668, 27138, 23293, 19801, 18222, 18773, 20001, 19989, 18298, 16310, 15285, 14781, 13757, 12533, 12348, 13212, 13641, 12784, 11588, 11199, 11241, 10617, 9402, 8919, 10039, 12177, 14132, 15407, 16322, 17080, 17232, 16313, 14750, 13551, 13070, 12753, 12438, 13206, 16140, 20577, 24492, 26473, 26504, 24842, 21287, 16020, 10347, 5893, 3297, 2136, 1734, 1537, 990, -247, -1705, -2108, -310, 3594, 8179, 11913, 14457, 16494, 18319, 19181, 18425, 16671, 15101, 13909, 12434, 10787, 10216, 11414, 13363, 14531, 14638, 14604, 15190, 16345, 17577, 18288, 17983, 16890, 16253, 17273, 19698, 22179, 24095, 26212]
55223B6212K934K945J678K06q13k213m541o387n932l477r89N17J519K057J241
55208A4957p31j891j028M54N45o94j802k234k359j910l69J464K149J719J416J321
55192A1007K43j817l043k376r51j23M07J421K512K834K510K127J565M79p10j200
55176A4885q07J05J118J647J141J1m95K5M94K10J54J320K765K853J635N41O5n89
55158B7078j667k251j742q34n42j091k042k795k797j821k31J361K672L618L924
55143B0840L464K700K152J661Q35Nj23L19L80l86j324j621j248p41m91m74l86
55126B5562J7N25N43k29j255j617q85N10J578J401l4j367q69J585M014M269K132
55109C5880p51k531k326o32Q99P28q56j912j345k66j03m55j48O09O85J07j07J09
$$ y = [26212, 29146, 32091, 33769, 33975, 33162, 30949, 26408, 20021, 14089, 10612, 9623, 10140, 11659, 13716, 14957, 14226, 12335, 11307, 11761, 12306, 11612, 9810, 7576, 5217, 3307, 2938, 4402, 6551, 8270, 9686, 11007, 11250, 9433, 6390, 4014, 3063, 2940, 3347, 4768, 7280, 10114, 12624, 14751, 16316, 16795, 16085, 14885, 14078, 14183, 15301, 16948, 18089, 18100, 17605, 17630, 18124, 18334, 18488, 19808, 22573, 25426, 27061, 27602, 27667, 27078, 25411, 23160, 21418, 20584, 20042, 18951, 16909, 14114, 11317, 9496, 9265, 10626, 13298, 16916, 20840, 24304, 27004, 29156, 30817, 31652, 31657, 31534, 31853, 32233, 31847, 30523, 28902, 27654, 26913, 26422, 25948, 25562, 25579, 26104, 26647, 26418, 25163, 23546, 22661, 23171, 24749, 26150, 26116, 24749, 23880, 25465, 29479, 33748, 35880, 35129, 32598, 30272, 29640, 30539, 31267, 30411, 28499, 27154, 26888, 26785, 26330, 26182, 26791, 27476, 27583, 27476, 27585]
55091B7585j93j067j433q93j57N51J810L295L495J960K27m59q47j853k473j292
55075B8256Q30J558L51q54n57L30J19j190k133j816o49P14K125L411L909L245
55059C7649K129J621J789J837J592J877L059M106L840K502J349J112J552K148
55045F8162K377J745L84o30n06Ql63j478k035j664j331j493j344m60J82l34j409
55028E9811j851j464p63M8Q78J178O09j20r2N30Q99Q30P61P05L05k11k87j53n17
55009F1096j059n85R01J679O74q30j028k36j75j084j247K89K094K195N99r60j223
54992F1100n02Q6k06j222j924j154J086L213L515J899j59j230r94L0J112J744
54976F6394K015K441K933K347m7k917l847k043Q84K927L392K616J268L96Q11J767
$$ y = [27585, 27392, 26325, 24892, 23999, 23842, 24393, 26203, 29498, 32993, 34953, 35180, 34721, 33874, 32021, 29548, 28256, 29086, 30644, 30995, 30141, 29584, 29914, 30033, 28843, 26710, 24894, 24245, 24959, 27084, 30495, 34404, 37649, 39778, 41399, 43188, 45025, 46617, 48494, 51553, 55659, 59499, 62001, 63350, 64462, 66014, 68162, 70539, 72284, 72668, 72038, 71532, 71540, 71177, 69699, 67664, 66000, 64669, 63176, 61832, 61372, 61554, 61220, 59811, 57960, 56496, 55733, 55781, 56659, 57837, 58446, 58326, 58234, 58764, 59663, 60493, 61254, 61959, 62264, 62053, 61766, 61613, 61096, 60037, 59452, 60353, 62032, 62706, 61876, 60848, 60612, 60437, 59353, 58106, 58395, 60489, 62684, 63283, 62323, 61100, 60598, 60684, 60478, 59256, 57332, 56178, 57264, 60477, 63992, 65891, 65732, 64502, 63508, 63538, 64650, 66394, 68409, 70850, 73783, 76130, 76083, 73166, 69319, 67276, 68160, 71087, 74479, 77095, 78363, 78759, 79570, 81337]
54960H1337J404p24k723k802j521m88J0P03J510J700J387J355J484Q58n44j526
54944H1420j333n60j21j1M72J786L508M403L475J286l33m63k87j220k667k892
54928H6463j617k87J04n5k11m05n69k98K40K10p21j857k342j874o12P74J097k00
54910G7840j943k384j422m35L4R32K755M464M918M161K791J306N18J261L007M069
54894A01872L909L912M989N976N635M888N381O717P045N989N154N715O988P823
54880A81993Q113Q369Q719R030R516J0447J1547J2141J1930J1200R997P616L454
54867C04072j645n701p715q770j0361j2253j3088j2668j2234j2446j2502j1628
54855A83061j0251r063q028o940o113n671m972l498j734m64L11J022J612J673
$$ y = [81337, 82741, 82017, 79294, 76492, 74971, 74483, 74493, 75196, 76706, 78406, 79793, 81148, 82632, 83490, 82946, 81420, 80087, 79527, 79406, 79395, 79867, 81653, 85161, 89564, 93039, 94325, 93992, 93529, 93242, 92022, 89355, 86463, 84846, 84559, 84663, 84608, 84397, 83992, 83423, 83125, 83365, 83575, 82854, 80997, 78655, 76781, 76169, 76943, 78040, 77840, 75897, 73513, 72091, 71656, 71690, 72622, 75377, 79841, 84759, 88920, 91711, 93017, 93535, 94796, 97803, 101872, 105781, 109693, 114682, 120658, 126293, 131181, 136562, 143279, 150324, 156313, 161467, 167182, 174170, 181993, 190106, 198475, 207194, 216224, 225740, 236187, 247734, 259875, 271805, 283005, 293002, 300618, 304072, 302427, 296726, 289011, 280241, 269880, 257627, 244539, 231871, 219637, 207191, 194689, 183061, 172810, 163747, 155719, 148779, 142666, 136995, 132023, 128525, 126791, 126327, 126638, 127660, 129272, 130945]
54841A30945J172N93N50J558L748O565R174J1334J3242J4555J4552J3427J2237
54828B33652J1196R276O157L148J254l94k921n734p650r039j1043j3278j4152
54815B00472j3372j2348j1960j1548j0521r440q779p757n479k509m44j61j077
54802A05077j980k147j619q84l83k21j01M83J740L070L344K129M76j43L67P10
54786A09918N6r53j324r99o08o91j622l514n528o110m654k377r36q21j660l093
54770G5084m405m270k221J58Q41j38r81o18L41J028J366J483J218O06P0j19j9
54753F9424L31Q55J118Q17M86Q65J645J774J124P81J358J889J162m17j057L53
54737H2508K887M490M166L015K883M220N813O549O686P049P807Q608R260R784
$$ y = [130945, 132117, 132710, 133260, 134818, 138566, 145131, 154305, 165639, 178881, 193436, 207988, 221415, 233652, 244848, 254124, 260281, 263429, 264683, 264289, 261368, 255634, 247984, 238945, 227902, 214624, 200472, 187100, 174752, 162792, 151244, 140723, 131283, 122504, 114747, 109268, 106759, 106315, 106154, 105077, 103097, 100950, 99331, 98447, 98064, 97843, 97742, 98225, 99965, 103035, 106379, 108508, 108984, 108841, 109208, 109918, 109974, 109021, 107697, 106698, 106090, 105399, 103777, 100263, 94735, 88625, 83971, 81594, 80658, 79837, 78177, 75084, 70679, 66409, 64188, 64346, 65187, 65049, 64068, 63450, 63791, 64819, 66185, 67668, 68886, 69492, 69562, 69443, 69424, 69755, 70610, 71728, 72545, 73031, 73896, 75541, 77315, 78439, 79220, 80578, 82467, 83629, 83212, 82155, 82508, 85395, 89885, 94051, 97066, 99949, 104169, 109982, 116531, 123217, 130266, 138073, 146681, 155941, 165725]
54723A65725J0304J1395J3713J6708J8519J7975J5867J3502J1011Q178N722M196
54711C12815K468q17m795p360q232q926r797r378p250n315n174n863n411l407
54697B33558r82Q81J894K109J934K072K767L615M365N314O592P806Q729R448R677
54682B99779Q914P542O662O453N961M947M517N213N884N467M449L351J198k866
54668C67471p561j0888j2918j5200j7935j9659j9705j8927j7708j5208j1341p895
54656A92526o513o656o689o175o003o593p168o805n555m288l759l876l738k607
54642A16101q95O6l52j168r87K05J135J068P65J255K344K953K589J775J107N94
54626A28555N5l27k71J32N54P96P95N36K61M87J370K244K272J445O83R70K654
$$ y = [165725, 176029, 187424, 201137, 217845, 236364, 254339, 270206, 283708, 294719, 302897, 308619, 312815, 315283, 314466, 309671, 302311, 294079, 285153, 275356, 265978, 258728, 253413, 248239, 242376, 236965, 233558, 232576, 233457, 235351, 237460, 239394, 241466, 244233, 247848, 252213, 257527, 264119, 271925, 280654, 290102, 299779, 308693, 316235, 322897, 329350, 335311, 340258, 344775, 349988, 355872, 361339, 365788, 369139, 370337, 367471, 359910, 349022, 336104, 320904, 302969, 283310, 263605, 244678, 226970, 211762, 200421, 192526, 186013, 179357, 172668, 166493, 160490, 153897, 146729, 139924, 134369, 130081, 126322, 122446, 118708, 116101, 115206, 115272, 114920, 113752, 112765, 112970, 114105, 115173, 115938, 117193, 119537, 122490, 125079, 126854, 127961, 128555, 128610, 128283, 128012, 128144, 128698, 129494, 130289, 130825, 131086, 131573, 132943, 135187, 137459, 138904, 139587, 140557, 143211]
54609A43211N285P695Q408O682L418O70k5J195K889L613K956J708J048J445K353
54594A92551K923K822K227J593J646L025N390P366Q103Q376R352J0761J1390J1161
54580B78686J1359J2598J3841J3969J3355J3052J3020J2006Q967M152j067n187
54568C88751p558q647r291r825j0188j0609j1463j2492j2801j1900j0308q964
54556B64705q355q192p523n488k545o41j258l412m731m402l853m316n093m937
54542A99959l904k930k424k248k428l025l676l995m041l915l410k548j914j909
54528A57592k272k796l716m748m706l050j038j90k56m4L32l18j935k783j931o59
54512A27482n39j170r36M97J611J032o99j774j202K55J188J222J087J274J311
$$ y = [143211, 148496, 156191, 164599, 171281, 174699, 175369, 175344, 176539, 179428, 183041, 185997, 187705, 188753, 190198, 192551, 195474, 198296, 200523, 202116, 203762, 206787, 212177, 219543, 227646, 236022, 245374, 256135, 267525, 278686, 290045, 302643, 316484, 330453, 343808, 356860, 369880, 381886, 390853, 395005, 393938, 388751, 381193, 372546, 363255, 353430, 343242, 332633, 321170, 308678, 295877, 283977, 273669, 264705, 256350, 248158, 240635, 235147, 232602, 231961, 230703, 227291, 222560, 218158, 214305, 209989, 204896, 199959, 196055, 193125, 190701, 188453, 186025, 183000, 179324, 175329, 171288, 167373, 163963, 161415, 159501, 157592, 155320, 152524, 148808, 144060, 139354, 136304, 135266, 135076, 134820, 134776, 135108, 134790, 132855, 130072, 128141, 127482, 126943, 125773, 124837, 125334, 126945, 127977, 127278, 125504, 124302, 124557, 125745, 126967, 128054, 129328, 130639]
54497A30639O79j02jJ140K272K308J232Kl41N36K085L363L802L604L421L712M393
54480A62744N046N265M957M301L489K620J959J987K853M024M866N451O267P293
54466B23122P963P939P313O059M079J832Q9j084k376m049n613o773p815q725q828
54451B13133p787o138m470k960k042k294l106k844j258l06j298k518j500J168
54437A75780K397Q37j432j823l72Q37M60o35n30J363L241K802L58j104L27K930
54421A85436L860L070K716L463L741K734J597J210Q75J26j10O47J145L39p80p33
54405B09336J97P88Q89R96P68k22q64L22K520L156J420o74j242q67r26j205o50
54388B13742M65Q26J31o67j119j866l164m078l824k941k426k397k413k487k788
$$ y = [130639, 131318, 131216, 131215, 132355, 134627, 136935, 138167, 138169, 137828, 138364, 140449, 143812, 147614, 151218, 154639, 158351, 162744, 167790, 173055, 178012, 182313, 185802, 188422, 190381, 192368, 195221, 199245, 204111, 209562, 215829, 223122, 231085, 239024, 246337, 252396, 256475, 258307, 258396, 257312, 254936, 250887, 245274, 238501, 230686, 221961, 213133, 205346, 199208, 194738, 191778, 189736, 187442, 184336, 181492, 180234, 179928, 178630, 176112, 174612, 175780, 178177, 179014, 177582, 175759, 175387, 176224, 176684, 176049, 175519, 176882, 180123, 182925, 183283, 182179, 182506, 185436, 189296, 192366, 195082, 198545, 202286, 205020, 206617, 207827, 208702, 208828, 208718, 209365, 210510, 210849, 210069, 209336, 209533, 210321, 211210, 212206, 212974, 212752, 211888, 212210, 214730, 217886, 219306, 218632, 217390, 216523, 215597, 214392, 213742, 214207, 215033, 215164, 214497, 213378, 211512, 208348, 204270, 200446, 197505, 195079, 192682, 190269, 187782, 184994]
54373A84994k842k028p34O3K12L68N77J35r30j504j034l00R6P52K024K770J903
54356A84522K90m60l81o52j156n40J292K687K738K560L257M129L978L048K482
54341B07794K670L274M183N332O079N826M971M285L670K524J100L27K82m8j203
54326B51066k355k485j768j297j788l010m176m547l930k895k289k385k707k813
54312B12621k810k811k426j415m93o38j516j514K25K401K940J391p57j963k057
54297B01178j633r08L06J789K821K831J943Q33K04K86P66J247J742K408K894K498
54281B21205J228J61J96Q90J029J43j188k335l241l921m118l799l567m042m944
54266A93697n271m410k949k162k716m031m909m678l615k432j679j536j875k314
$$ y = [184994, 182152, 180124, 179390, 179453, 179665, 180033, 180610, 180745, 179815, 178311, 177277, 176977, 177073, 177825, 179849, 182619, 184522, 184812, 184352, 183971, 183319, 182163, 181623, 182915, 185602, 188340, 190900, 194157, 198286, 202264, 205312, 207794, 210464, 213738, 217921, 223253, 229332, 235158, 240129, 244414, 248084, 250608, 251708, 252035, 252317, 252269, 251066, 248711, 246226, 244458, 243161, 241373, 238363, 234187, 229640, 225710, 222815, 220526, 218141, 215434, 212621, 209811, 207000, 204574, 203159, 202666, 202028, 200512, 198998, 199223, 201624, 204564, 205955, 205198, 203235, 201178, 199545, 198637, 198943, 200732, 203553, 206384, 208327, 209160, 209364, 209650, 210416, 211663, 213405, 215813, 218707, 221205, 222433, 222594, 222790, 223680, 224709, 224852, 223664, 221329, 218088, 214167, 210049, 206250, 202683, 198641, 193697, 188426, 184016, 181067, 178905, 176189, 172158, 167249, 162571, 158956, 156524, 154845, 153309, 151434, 149120]
54252A49120k446k176j724j371j313j580j931k072k233l030m284m615l243j595
54238A15507j690l149l577k081m64k61o43m28j91p39j173n48j05j420l282l105
54222I2651r55N86N31N28J398J467l62k366k430r91Q5J51k08o57j090j038m45
54205H6855k82j107j859j324o5M49K8k93l2L63N97P98R26R13J098J615J719P86
54187I1185m35p41k04K66O58J614K624K188J77j586j695r11p78j490k010j619
54171H7243n87L08M44m1o1J370L561M369K669r8j522r00L34N34o83k527l810l623
54153H6980j992l4J081J366J685K182J866J58j835k378j194K29M46n40j747k420
54137H3853k335j526m65j19j083k542k896j600K14J204J223Q67L09o53j623j666
$$ y = [149120, 146674, 144498, 142774, 141403, 140090, 138510, 136579, 134507, 132274, 129244, 124960, 120345, 117102, 115507, 113817, 110668, 107091, 105010, 104546, 104285, 103642, 103214, 103023, 102284, 101111, 100563, 100458, 99038, 95756, 92651, 91696, 92282, 92813, 93341, 94739, 96206, 95844, 93478, 91048, 90057, 90142, 90293, 90085, 89428, 88338, 87300, 86855, 86573, 85466, 83607, 82283, 82218, 82667, 82695, 82402, 82370, 82733, 83330, 84128, 85054, 85967, 87065, 88680, 90399, 91185, 90750, 90009, 89805, 90071, 90729, 92343, 94967, 97155, 97332, 95746, 94051, 93140, 92362, 90872, 88862, 87243, 86656, 86964, 87408, 87367, 87306, 88676, 92237, 96606, 99275, 99177, 97655, 96755, 97089, 97623, 96940, 94413, 90603, 86980, 84988, 84954, 86035, 87401, 89086, 91268, 93134, 93292, 91457, 89079, 87885, 88114, 88560, 88020, 86273, 83853, 81518, 79992, 79527, 79408, 78325, 75783, 72887, 71287, 71501, 72705, 73928, 74795, 75104, 74451, 72828, 71162]
54121G1162n04Q81J214K86r22j308p72k03l61q63n96Q05K331K725J882N88p07
54104G5638k059l054k706p38J654K963K891K193J427N59l94j126j485j520j070
54089G3173J2J088J039k26j414j569j331j600j757o27J277K136J604J423K619
54074G5847L779L248J704R64J191J011rq54r76j025j299j036J27J184J068J58
54058H5082l47P4R96J725J676O15j004k249k722k905l180l115k196p52M03R17
54042G3018R25M63m83j517j925j335q8J102J769K022K257K439K023Q91m1J19Q57
54025H2496Q75qn88n0J075J881K014J306k70j802j862m06Q34O81M6K59J013J238
54007H8732R66R06R21M95J14O39J619J717P19k48m04P3R07J829J950O11j073j089
$$ y = [71162, 70658, 71539, 72753, 73039, 72117, 70809, 70037, 69834, 69473, 68610, 68014, 68819, 71150, 73875, 75757, 76345, 75638, 73579, 70525, 67819, 67081, 68735, 71698, 74589, 76782, 78209, 78768, 78374, 77248, 75763, 74243, 73173, 73185, 74273, 75312, 75086, 73672, 72103, 70772, 69172, 67415, 66788, 68065, 70201, 71805, 73228, 75847, 79626, 82874, 84578, 85542, 86733, 87744, 87735, 86881, 85905, 84880, 83581, 82545, 82672, 83856, 84924, 85082, 84735, 84809, 85805, 87530, 89206, 89821, 88817, 86568, 83846, 80941, 77761, 74646, 72450, 71698, 72101, 73018, 73943, 74406, 73923, 72406, 70481, 69146, 69058, 70160, 71929, 73951, 76208, 78647, 80670, 81561, 81520, 81639, 82496, 83371, 83363, 82775, 82725, 83800, 85681, 87695, 89001, 88731, 86929, 85067, 84661, 85495, 86176, 86222, 86481, 87494, 88732, 89698, 90604, 91525, 92020, 92134, 92773, 94392, 96109, 96828, 96580, 96176, 96249, 97156, 98985, 100935, 101546, 100473, 99384]
53989I9384O75K131J974J354J801K963L524L231K694K047J166P25J566L188M129
53974A32552L955L731M230M706M086K710K008K741M275N609O391O569N855M318
53960A93736L185L966O470Q537Q306O200M145L295L275L361L386L460L474L198
53946B57994K545J614N94m01j513k861l917l770k380j118j284k550l658m299n238
53931B29758o641p396o477m309k338j683k347l435l968l776l482l455l158k020
53917A75273n30K76J32l91r37j528j941j866j619j659j533m09J184J455k94k510
53901A63103l187k029k37J096J692J838J975K354K679K443J691R73N47L18O38
53886A75894K104M265N438M530K391Q01O32J492K623L510L994M281M730N503O608
$$ y = [99384, 100059, 102190, 104164, 105518, 107319, 110282, 113806, 117037, 119731, 121778, 122944, 123669, 125235, 128423, 132552, 136507, 140238, 144468, 149174, 153260, 155970, 157978, 160719, 164994, 170603, 176994, 183563, 189418, 193736, 196921, 200887, 207357, 215894, 224200, 230400, 234545, 237840, 241115, 244476, 247862, 251322, 254796, 257994, 260539, 262153, 262747, 262346, 260833, 257972, 254055, 250285, 247905, 246787, 245503, 242953, 239295, 234996, 229758, 223117, 215721, 209244, 204935, 202597, 200914, 198567, 195132, 191164, 187388, 183906, 180451, 177293, 175273, 174743, 175019, 175151, 174760, 173823, 172295, 170354, 168488, 166869, 165210, 163677, 163268, 164452, 165907, 165613, 163103, 159916, 157887, 157650, 158746, 160438, 162276, 164251, 166605, 169284, 171727, 173418, 174391, 174938, 175256, 175894, 177998, 182263, 187701, 192231, 194622, 195423, 196055, 197547, 200170, 203680, 207674, 211955, 216685, 222188, 228796]
53871B28796P932Q778P838M785J611Q67K469L844L664L423M445N339M092J316
53857B89199o46r87q02o17M06K591M780N746N648N559O199P378Q236Q109P496
53842C48295P679Q911R722Q869P227O502O671O182M472K721J934J749J389N94
53828D22917p36k734m837n907n560m623l919l422k907k690l238m680o949r659
53814C61056j1737j2088j0933r684r160q800q010p207o951o966o740o357o028
53801B50395n481m602m008m204m698m728m411m380m796n359n836n904n033l405
53787A83550k393l020m347m557l419k380k317k610k625k773l330l428k097K39
53773A44493K226L094L019K292R92n04j397j076L10J971L108L427L157K518J408
$$ y = [228796, 236728, 245506, 253344, 258129, 259740, 260607, 263076, 266920, 270584, 274007, 278452, 283791, 287883, 289199, 288553, 287566, 286764, 286147, 286553, 289144, 293924, 299670, 305318, 310877, 317076, 324454, 332690, 340799, 348295, 355974, 364885, 374607, 383476, 390703, 397205, 403876, 410058, 414530, 417251, 419185, 420934, 422323, 422917, 422181, 419447, 414610, 408703, 403143, 398520, 394601, 391179, 388272, 385582, 382344, 377664, 370715, 361056, 349319, 337231, 326298, 316614, 307454, 298654, 290644, 283437, 276486, 269520, 262780, 256423, 250395, 244914, 240312, 236304, 232100, 227402, 222674, 218263, 213883, 209087, 203728, 197892, 191988, 186955, 183550, 181157, 178137, 173790, 169233, 165814, 163434, 161117, 158507, 155882, 153109, 149779, 146351, 144254, 144493, 146719, 149813, 152832, 155124, 156116, 155612, 154215, 153139, 153449, 155420, 158528, 161955, 165112, 167630, 169038]
53758A69038j38j434j758j409j376j767j513j13J336J696J492J992L149L888M077
53743A77160M629N548N539M133K873L407N351P053P620P340O725O263O537P553
53729B57731Q264P759O588N930N890N683N158M757M151K504L09o64K33J441J318
53714C17052J45q75j454j884j866j046l33j202l642n915o523n718m790m513m646
53699B72790m571m083l465k846j819k08R92L67j930l936m201l390k884k741k294
53684B35781j900k534l886m433l568k315j675j480j193p56j82O30J210O53r19
53669B13433k038j779j123j484k624l182k788k452k811l127k413p58R41K162L068
53654A93025L774L815K647O00j083j312j24J614L125L994L827K515Q88K65Q91
$$ y = [169038, 168900, 167466, 165708, 164299, 162923, 161156, 159643, 159530, 160866, 162562, 164054, 166046, 169195, 173083, 177160, 181789, 187337, 192876, 197009, 199882, 203289, 208640, 215693, 223313, 230653, 237378, 243641, 250178, 257731, 265995, 273754, 280342, 286272, 292162, 297845, 303003, 307760, 311911, 314415, 314724, 314060, 314293, 315734, 317052, 317197, 316322, 314868, 312984, 311118, 310072, 309739, 308537, 304895, 298980, 292457, 286739, 281949, 277436, 272790, 268219, 264136, 260671, 257825, 256006, 255798, 256790, 257157, 255227, 251291, 247090, 243700, 240816, 238075, 235781, 233881, 231347, 227461, 223028, 219460, 217145, 215470, 213990, 212797, 212041, 211859, 212489, 213699, 214352, 213433, 211395, 209616, 208493, 207009, 204385, 201203, 198415, 195963, 193152, 190025, 187612, 186854, 187795, 189957, 193025, 196799, 200614, 203261, 203861, 202778, 201466, 201342, 202956, 206081, 210075, 213902, 216417, 217305, 217570, 218461]
53639B18461J449Q17k47l5J649L035K720J653J956M090O172O366N123M271M468
53624B61948M673M235M136N362O948O900M773K227J010J261J941K118J626J053
53610C10211J178J970K271J254j33k15R78J678R82Rj33j3n33j184r83k15J63J55
53592C17440L69N45K2o41j77J280K137J660Q16L96k15j467k275j536j72j76j794
53575C16212l055k389n27P89J296K329M497O337N888L229M44q33r45r67r88m28
53559C30889O89J907L358N333O939O604M334K219J999L028L576L400L820N501
53545C83596P380Q097P675P275P652Q381Q560P889O854O098N840N901O048O143
53531D83389O225O542P261P926P589N831L506K009J970K983M275N174N236M555
$$ y = [218461, 219910, 220727, 220480, 220445, 222094, 225129, 227849, 229502, 231458, 235548, 241720, 248086, 253209, 257480, 261948, 266621, 270856, 274992, 280354, 287302, 294202, 298975, 301202, 302212, 303473, 305414, 307532, 309158, 310211, 311389, 313359, 315630, 316884, 316751, 316536, 317514, 319192, 320174, 320183, 320050, 320037, 319504, 318320, 317337, 317122, 317285, 317440, 317809, 318354, 318376, 317735, 317558, 318838, 320975, 322635, 323451, 323847, 323632, 322165, 319890, 318354, 318182, 318006, 316212, 313157, 310768, 310241, 311030, 312326, 314655, 319152, 325489, 331377, 334606, 335050, 334217, 333272, 332305, 331317, 330889, 331578, 333485, 336843, 342176, 349115, 355719, 360053, 362272, 364271, 367299, 370875, 374275, 378095, 383596, 390976, 399073, 406748, 414023, 421675, 430056, 438616, 446505, 453359, 459457, 465297, 471198, 477246, 483389, 489614, 496156, 503417, 511343, 518932, 524763, 528269, 530278, 532248, 535231, 539506, 544680, 549916, 554471]
53517E54471L901L890M106L658K496J399P82M58M99J234K136J831j56k469l370
53502E74866k524r17L15N58o5p23o69k97n11r58k33J595K327P06j349j222P40
53485E71639K081J979J901K681L250K789K189K515L378L793L660L573L925M830
53471F14183O212P505Q006P876Q102R147J0499J1781J3275J4831J5382J4424J3218
53458G54441J3526J5629J8247K0071K0823K1110K1752K2934K3973K4347K4884
53447I81737K6908L0189L2940L4277L5290L7010L8722L9350L9264L9435L9871
53436A374993M0245M1176M3277M5686M7105M7708M8317M8304M6341M3116M1311
53425A867579M2402M5112M7357M8240M7722M5970M3837M2719M3174M4445M5754
$$ y = [554471, 558372, 562262, 566368, 570026, 572522, 573921, 574703, 575161, 575660, 576894, 579030, 580861, 580705, 578236, 574866, 572342, 571425, 571740, 572298, 572233, 571510, 570841, 570544, 570033, 569075, 568842, 570437, 572764, 573470, 572121, 570899, 571639, 573720, 575699, 577600, 580281, 583531, 586320, 588509, 591024, 594402, 598195, 601855, 605428, 609353, 614183, 620395, 627900, 635906, 643782, 651884, 661031, 671530, 683311, 696586, 711417, 726799, 741223, 754441, 767967, 783596, 801843, 821914, 842737, 863847, 885599, 908533, 932506, 956853, 981737, 1008645, 1038834, 1071774, 1106051, 1141341, 1178351, 1217073, 1256423, 1295687, 1335122, 1374993, 1415238, 1456414, 1499691, 1545377, 1592482, 1640190, 1688507, 1736811, 1783152, 1826268, 1867579, 1909981, 1955093, 2002450, 2050690, 2098412, 2144382, 2188219, 2230938, 2274112, 2318557, 2364311]
53414B364311M6914M7376M6157M3355M0389L7903L4872L0825K7504K6619K6982
53403B773207K5806K2430J8929J7008J5963J4262J1735R308P339N139K002j885
53391B921243n556q215j0025j2019j5113j9190k3242k6346k8426l0165l2329l4996
53379B675621l7398l8662l8764l8527l8635l8968l9055l8788l8469l8305l8187
53368B251863l7845l7154l6319l5660l4926l3085k9394k4599k0325j7182j4339
53357A931035j1239q717p611o953m590M23O641J1569J3972J5050J7321K2024K7700
53344B006625L1916L4242L6418L9536M2561M4493M6391M9814N4278N8010O0605
53333B504889O3125O5872O8063O9852P2682P6976Q1205Q4122Q6501Q9462R2407
$$ y = [2364311, 2411225, 2458601, 2504758, 2548113, 2588502, 2626405, 2661277, 2692102, 2719606, 2746225, 2773207, 2799013, 2821443, 2840372, 2857380, 2873343, 2887605, 2899340, 2908648, 2915987, 2921126, 2923128, 2921243, 2915687, 2907472, 2897447, 2885428, 2870315, 2851125, 2827883, 2801537, 2773111, 2742946, 2710617, 2675621, 2638223, 2599561, 2560797, 2522270, 2483635, 2444667, 2405612, 2366824, 2328355, 2290050, 2251863, 2214018, 2176864, 2140545, 2104885, 2069959, 2036874, 2007480, 1982881, 1962556, 1945374, 1931035, 1919796, 1911079, 1903468, 1896515, 1891925, 1892348, 1898989, 1910558, 1924530, 1939580, 1956901, 1978925, 2006625, 2038541, 2072783, 2109201, 2148737, 2191298, 2235791, 2282182, 2331996, 2386274, 2444284, 2504889, 2568014, 2633886, 2701949, 2771801, 2844483, 2921459, 3002664, 3086786, 3173287, 3262749, 3355156]
53322C355156R4144R5243R7546J01496J05368J07449J07795J07381J06479J04698
53312D382755J02159R9755R8068R6505R3820Q9421Q3944P8424P3032O6967N9661
53301E324511N1779M4640L8669L2958K6570J9975J4403R783M179m061j4022k3152
53289E526232l0432l7562m6572n7256o7695p6633q4309r1218r7252j02115j05804
53278D729384j08314j09560j09819j09724j09501j08621j06625j04026j01963
53269C761231j01051j00734r9883r7879r5108r2371q9956q7489q4551q1044p6955
53258B754210p2374o7914o4344o1360n7451n1817m5830m1538l9040l6433l2216
53247B183893k6760k1432j7333j5001j4216j3731j2092r056n463j653K690O883
$$ y = [3355156, 3449300, 3544543, 3642089, 3743585, 3848953, 3956402, 4064197, 4171578, 4278057, 4382755, 4484914, 4584669, 4682737, 4779242, 4873062, 4962483, 5046427, 5124851, 5197883, 5264850, 5324511, 5376290, 5420930, 5459599, 5492557, 5519127, 5539102, 5553505, 5563288, 5567467, 5563406, 5549384, 5526232, 5495800, 5458238, 5411666, 5354410, 5286715, 5210082, 5125773, 5034555, 4937303, 4835188, 4729384, 4621070, 4511510, 4401691, 4291967, 4182466, 4073845, 3967220, 3863194, 3761231, 3660180, 3559446, 3459563, 3361684, 3266576, 3174205, 3084249, 2996760, 2912209, 2831165, 2754210, 2681836, 2613922, 2549578, 2488218, 2430767, 2378950, 2333120, 2291582, 2252542, 2216109, 2183893, 2157133, 2135701, 2118368, 2103367, 2089151, 2075420, 2063328, 2054272, 2048809, 2047156, 2049846, 2056729]
53235B056729R022Q426P268Q343J1924J5987J8956K0973K2772K4771K7326L0644
53223B263141L4083L6580L8163M0108M3113M6138M7733M7928M7910M8194M8027
53212B741118M6591M4088M1297L8623L6038L3608L1464K9344K6743K3743K1219
53201C113876J9693J8334J5706J1580P328M210J760j557o298j1343j5492j9216
53189C138581k4103l0574l6865m0948m3083m5569m9841n4735n8163n9660o0406
53178B634634o1296o2156o2659o2877o2723o1873o0493n9158n7814n5804n3302
53167A974479n1668n1681n2364n2303n1343n0087m8587m6687m5087m4728m5278
53156A434666m5361m4180m1921l8735l4612l0363k7459k6389k6153k5734k5153
$$ y = [2056729, 2065751, 2074177, 2081445, 2089788, 2101712, 2117699, 2136655, 2157628, 2180400, 2205171, 2232497, 2263141, 2297224, 2333804, 2371967, 2412075, 2455188, 2501326, 2549059, 2596987, 2644897, 2693091, 2741118, 2787709, 2831797, 2873094, 2911717, 2947755, 2981363, 3012827, 3042171, 3068914, 3092657, 3113876, 3133569, 3151903, 3167609, 3179189, 3186517, 3190727, 3192487, 3190930, 3184632, 3173289, 3157797, 3138581, 3114478, 3083904, 3047039, 3006091, 2963008, 2917439, 2867598, 2812863, 2754700, 2695040, 2634634, 2573338, 2511182, 2448523, 2385646, 2322923, 2261050, 2200557, 2141399, 2083585, 2027781, 1974479, 1922811, 1871130, 1818766, 1766463, 1715120, 1665033, 1616446, 1569759, 1524672, 1479944, 1434666, 1389305, 1345125, 1303204, 1264469, 1229857, 1199494, 1172035, 1145646, 1119493, 1093759, 1068606]
53145A068606k4632k3838k2621k1639k1424k1449k0943j9986j9044j8076j7061
53134H37893j6720j7511j8319j7604j5679j4365j4260j4006j2807j1975j2915
53123F71732j4842j5935j5800j5279j4496j2883j0905r991j0350j0517r624q745
53111E22365r122j0198j0505r644q411p492p029p035p337p500p499p959q964r253
53097D04417p752n411m257m827n806o097n856n419m651l784l634m318m735m048
53083C33822k786j947j775k010k524k959k606j489q40j500k477k119l95J057J074
53068C10526J41o15q05r10j529k620l310k606o54J031J127O2o31k58M47N60P1
53051C00027m84q49j229j925k954l835l882k971j830j175p68J1Q95Q35m52j850
$$ y = [1068606, 1043974, 1020136, 997515, 975876, 954452, 933003, 912060, 892074, 873030, 854954, 837893, 821173, 803662, 785343, 767739, 752060, 737695, 723435, 709429, 696622, 684647, 671732, 656890, 640955, 625155, 609876, 595380, 582497, 571592, 561601, 551251, 540734, 531110, 522365, 513243, 503045, 492540, 482896, 474485, 466993, 459964, 452929, 445592, 438092, 430593, 422634, 413670, 404417, 396665, 391254, 386997, 382170, 376364, 370267, 364411, 358992, 354341, 350557, 346923, 342605, 337870, 333822, 331036, 329089, 327314, 325304, 322780, 319821, 317215, 315726, 314886, 313386, 310909, 308790, 308395, 309452, 310526, 310667, 310052, 309247, 308337, 306808, 304188, 300878, 298272, 297618, 298649, 299776, 299838, 299207, 298949, 299396, 299956, 300027, 299543, 298694, 297465, 295540, 292586, 288751, 284869, 281898, 280068, 278893, 278125, 278136, 279031, 279866, 279414, 277564]
53035B77564k164j513q97p91q39o82m67l84k87q1j50p89j351o91J210K701K274
53018B72663O58R6J538L532M239L568K608J813Q29k90q96q04o81j167k228l374
53002B82104l971l441j934p95j466l644n256m749k839j544k020l759n532o513
52988B34641o605o212n700n021l935k645j814j805k359l161m238n353n544m067
52974A76182j640N0J74l95l52M09O76o76l337n463n101k110J250K264N23j744
52958A60710k396j713j333j513q68J075K507J460j476l721l739k473j641j606
52944A43273j569j152r32j375j922j627l93Q95J526J737J989K000J139l18j286
52929A41985j239p63m82l03k8J61L19Q83J571J229k63j112l8J457J018j032k151
$$ y = [277564, 275400, 273887, 272990, 272199, 271360, 270678, 270211, 269827, 269540, 269459, 269309, 268520, 267169, 266478, 267688, 270389, 272663, 273321, 273417, 274955, 278487, 282726, 286294, 288902, 290715, 291544, 291254, 290358, 289554, 288873, 287706, 285478, 282104, 278133, 274692, 272758, 271963, 270497, 266853, 261597, 256848, 254009, 252465, 250445, 246686, 241154, 234641, 228036, 221824, 216124, 211103, 207168, 204523, 202709, 200904, 198545, 195384, 191146, 185793, 180249, 176182, 174542, 174592, 174766, 174371, 174019, 174428, 175104, 174428, 171091, 165628, 160527, 158417, 159667, 161931, 162454, 160710, 158314, 156601, 155268, 153755, 152887, 153962, 156469, 157929, 156453, 152732, 148993, 146520, 144879, 143273, 141704, 140552, 139620, 138245, 136323, 134696, 134303, 135198, 136724, 138461, 140450, 142450, 143589, 143271, 141985, 140746, 139983, 139501, 139198, 139170, 139331, 139650, 140533, 142104, 143333, 143070, 141958, 141920, 143377, 144395, 143363, 141212]
52912A41212j324j86k33r88j471j570j281l16Q40J134Q95J649L308L747K331J437
52896A49184K651L764K146p50j370N82K093J781J561K862M178L697K097J359K160
52881A77995L689M994N500N021L989L117K509J805J322J884L357M486M648M535
52867B28851M657M378L190J828J266J342J267P90J41o79j779k901l588l567k712
52852B32484j121M24P17o16k462l282k683j696j743l310n369o107m679k143l31
52837A98083K2m86j059j314j111p22r86k221l180k349p7J804K443K554K559J853
52821A95813L50q67j116j024j208j360j230j215j223m78Q20J179O8r84q33n67
52805A86125j504k730k544j205k99j17L29J068R89j51j214j310n71P15K401L738
$$ y = [141212, 139888, 139702, 139469, 138481, 137010, 135440, 134159, 133843, 134683, 135817, 136712, 138361, 141669, 145416, 147747, 149184, 151835, 155599, 157745, 156995, 155625, 156207, 158300, 160081, 161642, 164504, 168682, 172379, 174476, 175835, 177995, 181684, 186678, 192178, 197199, 201188, 204305, 206814, 208619, 209941, 211825, 215182, 219668, 224316, 228851, 233508, 237886, 241076, 242904, 244170, 245512, 246779, 247569, 247710, 247031, 245252, 242351, 238763, 235196, 232484, 231363, 231787, 232504, 231888, 229426, 226144, 223461, 221765, 220022, 216712, 211343, 205236, 200557, 198414, 198083, 198105, 197619, 196560, 195246, 194135, 193413, 192427, 190206, 187026, 184677, 184600, 186404, 188847, 191401, 193960, 195813, 196163, 195296, 194180, 193156, 191948, 190588, 189358, 188143, 186920, 186442, 187262, 188441, 188509, 187525, 186692, 186125, 184621, 181891, 179347, 178142, 177843, 177726, 178055, 179123, 180112, 179961, 178747, 177437, 176866, 177581, 179982, 183720]
52789A83720L686K263O30l31o66m79M73K124L770M718M765M026K873J828J034
52774B14434M7j306k291k259j650j116k93J304K678K222J31j553j480k63R05J553
52758B11063J555Q33m6j19O35J260J486K123L220L396J979O04J182L176M320L586
52742B40253J952M02j203k967m040l687k552k041k767m120n061m905l649k150
52728B03465j790l170n025n220l198q35l41j916l988n197n161l905j850l95r85
52713A60489l146m556l676j396M23J040Q24K06m33o41n88j097k226k666j671n16
52697A40370p88j987k394j647q48m81j54k46j848m597o258n276k565k00P56M69
52681A12306m94j537k111k082j684j064l67k19j251k968l873k971o84J694K930
$$ y = [183720, 187406, 189669, 190299, 189968, 189302, 188823, 189296, 191420, 195190, 199908, 204673, 208699, 211572, 213400, 214434, 214481, 213175, 210884, 208625, 206975, 205859, 205566, 206870, 209548, 211770, 211901, 210348, 208868, 208605, 209510, 211063, 212618, 213451, 213405, 213286, 213921, 215181, 216667, 218790, 222010, 225406, 227385, 227989, 229171, 232347, 236667, 240253, 242205, 242607, 241404, 238437, 234397, 230710, 228158, 226117, 223350, 219230, 214169, 209264, 205615, 203465, 201675, 198505, 193480, 188260, 185062, 184227, 183886, 181970, 177982, 172785, 167624, 163719, 161869, 161474, 160489, 157343, 152787, 149111, 147715, 148138, 149178, 150002, 150208, 149775, 149134, 148546, 147449, 145223, 142557, 140886, 140370, 139582, 137595, 135201, 133554, 132706, 132225, 132071, 131825, 129977, 125380, 119122, 113846, 111281, 111081, 111837, 112306, 111812, 110275, 108164, 106082, 104398, 103334, 102967, 102748, 101497, 98529, 94656, 91685, 91001, 92695, 95625]
52666I5625K510J207O42J365J855N92j422j909p08J02m36q66K3J373J955J855
52650A03763J405K68j189j406K5J135L56r85q79J34J50p36p50K94O11n30j602
52633A00064j203J30J042R50O5r55j036M11K250K546J086k42j23L85m23k349l446
52616I9152k247P95L790M956M043K453J688J724J608J333J929L516M680M437L661
52601A37518L552L731K977J320J39L23J339K077J822O51m99l47J314K877K492
52586A61286K89j937l137l886m633m585l171j550j387k593l566l364k501j620
52572A23645o38M21P95L6j077j382p77p0L72J051K332L574L586J919m10j655j131
52555A30591k08r26l347n114m197j466M72N17JL49J230J469Q46J32q9J54O52J194
$$ y = [95625, 98135, 99342, 99984, 101349, 103204, 103796, 102374, 100465, 99757, 99859, 99423, 98557, 98580, 99953, 101908, 103763, 105168, 105436, 104247, 102841, 102866, 104001, 104357, 103372, 102493, 102627, 102777, 102041, 101291, 101585, 102196, 101666, 100064, 98861, 98991, 100033, 100983, 101048, 100093, 99057, 99468, 101718, 104264, 105350, 105108, 104985, 105370, 104947, 102598, 99152, 96905, 97700, 101490, 106446, 110489, 112942, 114630, 116354, 117962, 119295, 121224, 124740, 129420, 133857, 137518, 141070, 144801, 147778, 149098, 149237, 149560, 150899, 152976, 154798, 155449, 154950, 154603, 155917, 158794, 161286, 161575, 159638, 156501, 152615, 147982, 143397, 140226, 138676, 137289, 134696, 131130, 127766, 125265, 123645, 123007, 123428, 124223, 124259, 123182, 121800, 121023, 120953, 121325, 122376, 124708, 128282, 131868, 133787, 133377, 131722, 130591, 130383, 129457, 126110, 120996, 116799, 115333, 115805, 116322, 116323, 116672, 117902, 119371, 120217, 120349, 120260, 120414, 121066, 122260]
52537A22260J404R47o5j127j714j487l48J329K656K775J630N7q59o23L26J058
52521A28219J066O60L91L38K92L92R30J611J779J509J695K660L385K738R79n62
52505A48082r22j45J260K695L428K875J268l16q13%J481K744L299L234K873K274
52489A73317J255j71j532k210j944r75K06J180J771J845J014r70l314m281k841
52474A62350n7J956K290J710J098M23n09j307j438q20L61J697K337J559k9q18
52458A70803j48R29J287J059P13Jj006r18J332M257M915K368j098k617j653J12
52442A80336R75O68k8n23r39j497j796j244p5P73Q74P10O43M44J87N04J332J477
52424A82821L93o23j51J164J526N25n79q02l78L7O7m11r61n62J133K825L009J875
$$ y = [122260, 123664, 124611, 124546, 123419, 121705, 120218, 119870, 121199, 123855, 126630, 128260, 128317, 127458, 126835, 127161, 128219, 129285, 129945, 130336, 130674, 130966, 131358, 132288, 133899, 135678, 137187, 138882, 141542, 144927, 147665, 148644, 148082, 147160, 147015, 148275, 150970, 154398, 157273, 158541, 158225, 157412, 157412, 158893, 161637, 164936, 168170, 171043, 173317, 174572, 174401, 172869, 170659, 168715, 167740, 167946, 169126, 170897, 172742, 173756, 172786, 169472, 165191, 162350, 162293, 164249, 166539, 168249, 169347, 169770, 169261, 167954, 166516, 165696, 166057, 167754, 170091, 171650, 171621, 170803, 170655, 171584, 172871, 173930, 174643, 174644, 173638, 172720, 174052, 178309, 183224, 185592, 184494, 181877, 180224, 180336, 181311, 181979, 181951, 181428, 180489, 178992, 177196, 175952, 175877, 176650, 177524, 178234, 178877, 179321, 179508, 180012, 181344, 182821, 183214, 182591, 182440, 183604, 185130, 185655, 185076, 184274, 183896, 183933, 184000, 183589, 182628, 182066, 183199, 186024, 189033, 190908]
52406A90908P22p7j004j772j498n15j54o93j024p04n35q01o77K6K19n57j164p50
52388A79950j26k48o52n57l44o37q95k22J098K100K518K602K173R25p00j867k227
52371A82891j766m78J069J615O19q38j476j508j851k359k026n65J330K943L875
52356A81475L812K968K293K292K229J497R68J602K484K029O47K61J196J671P56
52341B08180j87J85J170J375O80k53j307k425k682j258J114K777K966K172J072
52326B13579J37k0R48K270K545J490L83M77J506K335K579K780L060K543Q27p56
52310B36683m32J439K371R14j241j316J109L917N216M845L372J267n37q91L8N78
52294B57332k74j488j654q74J2J020K455L430K681P42k48P83K584L374K860J944
$$ y = [190908, 191630, 191553, 190549, 188777, 187279, 186764, 186610, 185917, 184893, 184189, 183654, 182853, 182176, 182202, 182421, 181864, 180700, 179950, 179824, 179576, 178924, 178367, 178023, 177386, 176491, 176269, 177367, 179467, 181985, 184587, 186760, 187685, 186985, 185118, 182891, 181125, 180647, 181716, 183331, 183950, 183112, 181636, 180128, 178277, 175918, 173892, 173327, 174657, 177600, 181475, 185287, 188255, 190548, 192840, 195069, 196566, 197534, 199136, 201620, 203649, 204296, 204557, 205753, 207424, 208180, 207993, 208178, 209348, 210723, 211403, 211150, 209843, 207418, 204736, 203478, 204592, 207369, 210335, 212507, 213579, 213716, 213696, 214644, 216914, 219459, 220949, 221332, 221809, 223315, 225650, 228229, 231009, 234069, 236612, 237439, 236683, 236251, 237690, 240061, 240975, 239734, 238418, 239527, 243444, 248660, 253505, 256877, 258144, 257607, 256716, 256754, 257332, 257058, 255570, 253916, 253042, 253054, 254074, 256529, 259959, 262640, 263382, 263134, 263917, 266501, 269875, 272735, 274679]
52278B74679J363J304J801K722L541L679L074K245J793J936K299K243J576R40
52264C05195J113J979K644K564K062J707J679J924K287K376J857J188J410K797
52250C32782M351N113N357N726N922N278M358M634O408Q188Q518P659O845O716
52236D17855P158Q151R713J1271J1920J1520J0827J0392R933R080Q197P893Q066
52223E41976Q123Q021Q451R648J0697J0609R714R206R407R391Q617P942Q370R516
52209F69688J0301J0556J0821J0741R277O746N186N877P677Q758R024R441R826
52196G83919R041P140N717N692O162N990N359N040M992M633L925L347L180L365
52182H57502L755L900L050J083q01j119K84K244L748M726N470O064O597P264P954
$$ y = [274679, 276042, 277346, 279147, 281869, 285410, 289089, 292163, 294408, 296201, 298137, 300436, 302679, 304255, 305195, 306308, 308287, 310931, 313495, 315557, 317264, 318943, 320867, 323154, 325530, 327387, 328575, 329985, 332782, 337133, 342246, 347603, 353329, 359251, 364529, 368887, 373521, 379929, 388117, 396635, 404294, 411139, 417855, 425013, 433164, 442877, 454148, 466068, 477588, 488415, 498807, 508740, 517820, 526017, 533910, 541976, 550099, 558120, 566571, 576219, 586916, 597525, 607239, 616445, 625852, 635243, 643860, 651802, 660172, 669688, 679989, 690545, 701366, 712107, 721384, 728130, 733316, 739193, 746870, 755628, 764652, 774093, 783919, 792960, 800100, 805817, 811509, 817671, 823661, 829020, 834060, 839052, 843685, 847610, 850957, 854137, 857502, 861257, 865157, 868207, 869290, 868489, 867370, 867654, 869898, 873646, 878372, 883842, 889906, 896503, 903767, 911721]
52167I11721Q174P816P541Q013Q947R435R168Q920R569J0909J1800J1564J0857
52154A034434J0849J1769J2752J3113J3108J3140J2872J1687R775Q009O766N543
52142A163817L867K044P21J54J61N42J175J796K002J491K83j204k272k433j976
52127A170168j853k666l821m031k789j112n88j672l192l684l097k852m142o463
52113A128206q104p912o243m182k417j167p94j783l885n872o546n853m664l544
52099A065240k336j046m53j254k944m259m599m459m381m354m439n199o767q023
52085A010727p631n741l956l426l647l373k292j356j637l074m492m810m226l965
52071I57101m752n930o490o525o894p494o968m613j795o70j843l983n574o094
$$ y = [911721, 919895, 927711, 935252, 943265, 952212, 961647, 970815, 979735, 989304, 1000213, 1012013, 1023577, 1034434, 1045283, 1057052, 1069804, 1082917, 1096025, 1109165, 1122037, 1133724, 1143499, 1151508, 1158274, 1163817, 1167684, 1169728, 1170449, 1170603, 1170764, 1171306, 1172481, 1174277, 1176279, 1177770, 1178053, 1176849, 1174577, 1172144, 1170168, 1168315, 1165649, 1161828, 1157797, 1155008, 1153896, 1153308, 1151636, 1148444, 1144760, 1141663, 1138811, 1134669, 1128206, 1120102, 1112190, 1105947, 1101765, 1099348, 1098181, 1097387, 1095604, 1091719, 1085847, 1079301, 1073448, 1068784, 1065240, 1062904, 1061858, 1061405, 1060151, 1057207, 1052948, 1048349, 1043890, 1039509, 1035155, 1030716, 1025517, 1018750, 1010727, 1003096, 997355, 993399, 989973, 986326, 982953, 980661, 979305, 977668, 974594, 970102, 965292, 961066, 957101, 952349, 946419, 939929, 933404, 926510, 919016, 912048, 907435, 905640, 904970, 903127, 899144, 893570, 887476]
52057H87476n555l941j740k69n20j893k899l099l382m112m052k071P59K007Q44
52042H57553r54j239K13K133L550M352M635M551M616N307O321O903O999P485R085
52027I21510J1509J3742J4848J4587J3692J3428J4391J5746J6204J5619J5041
52016A080317J5275J6100J6864J7042J6240J4580J3218J3444J4866J5531J4392
52005A247869J2562J1455J0761R366P355N753M771L792K909L038M156M681L230
51992A331698L48k073k681j891j392k449m413n236l977k224k180l786n056n013
51978A289675m785n464o375o240m983l473k377j996k529l645m357m046l145k347
51964A233913j861j884k731l746l257q24J489J609L07j57N27P66K25L43J291R43
$$ y = [887476, 881921, 877980, 876240, 875971, 875451, 873558, 870659, 867560, 864178, 860066, 856014, 853943, 854702, 856709, 857553, 856599, 855360, 855573, 857706, 861256, 865608, 870243, 874794, 879410, 884717, 891038, 897941, 904940, 912425, 921510, 933019, 946761, 961609, 976196, 989888, 1003316, 1017707, 1033453, 1049657, 1065276, 1080317, 1095592, 1111692, 1128556, 1145598, 1161838, 1176418, 1189636, 1203080, 1217946, 1233477, 1247869, 1260431, 1271886, 1282647, 1292013, 1299368, 1305121, 1309892, 1313684, 1316593, 1319631, 1323787, 1328468, 1331698, 1332046, 1329973, 1327292, 1325401, 1324009, 1321560, 1317147, 1311911, 1307934, 1305710, 1303530, 1299744, 1294688, 1289675, 1284890, 1279426, 1273051, 1266811, 1261828, 1258355, 1255978, 1253982, 1251453, 1247808, 1243451, 1239405, 1236260, 1233913, 1232052, 1230168, 1227437, 1223691, 1220434, 1219610, 1221099, 1222708, 1223015, 1222858, 1223385, 1224151, 1224376, 1224719, 1226010, 1226953]
51948A226953j839m877n449m048l480n006p198q450q887r517j0698j2051j3123
51935A132330j3799j4315j4955j5580j5686j5373j5772j7781k0583k2279k2015
51924I44192k0803k0138k0481k1327k2086k2485k2445k1926k0948j9820j9336
51913G12397k0334k2562k4283k3744k1060j8059j6215j5468j5063j4769j4653
51902E06187j4458j3793j2855j2372j2822j3922j4801j4463j2438r243o150m196
51890C64674l412l172l084l363m362n934p321p581o307m067k152j615k426l557
51876C06321l991l698l433l656l887l377k146q78J7O28P41l49k741n298o677o589
51860B60987n533l880j921l96O3j17%M33K27r89k230k264r84N94J302P58l96j163
$$ y = [1226953, 1225114, 1220237, 1214788, 1210740, 1207260, 1202254, 1195056, 1186606, 1177719, 1168202, 1157504, 1145453, 1132330, 1118531, 1104216, 1089261, 1073681, 1057995, 1042622, 1026850, 1009069, 988486, 966207, 944192, 923389, 903251, 882770, 861443, 839357, 816872, 794427, 772501, 751553, 731733, 712397, 692063, 669501, 645218, 621474, 600414, 582355, 566140, 550672, 535609, 520840, 506187, 491729, 477936, 465081, 452709, 439887, 425965, 411164, 396701, 384263, 375020, 368870, 364674, 361262, 358090, 355006, 351643, 347281, 341347, 334026, 326445, 320138, 316071, 313919, 312304, 309878, 306321, 302330, 298632, 295199, 291543, 287656, 284279, 282133, 281255, 281272, 281900, 282641, 282292, 279551, 274253, 267576, 260987, 255454, 251574, 249653, 249257, 249320, 249203, 249203, 249636, 249863, 248874, 246644, 244380, 243396, 243990, 245292, 246050, 245654, 244491]
51842B44491j349j685k441k653j531mM09k18n27j87k02q83j268r91r16j370j402
51825B27273o57l15j046j660j020J14O67J033J680J405p35k886k400K06J750P96
51809B24205q65j329p94j40N50J115Q40j03k56J005K297K212J228N94M11J40M7
51792B31157P32J749J990J220K69j23Q8O28J133J273J155J402K261L007K753J632
51776B52326O28N04J236K271K851K401J063l61j240j648j870j846j339k16J657
51761B56417M133O130O060L692Q60m67k71J02J03M24J556K929L678L482K539J322
51745B92689N32P88K050L537M337L952K615J223P60J378K257K655K760L151L863
51730C28547M457M779N042N351N611N773N788N537N120M964N311N922O454O678
$$ y = [244491, 243142, 241457, 239016, 236363, 234832, 234828, 235237, 235019, 234492, 234305, 234103, 233220, 231952, 230961, 230045, 228675, 227273, 226616, 226301, 225255, 223595, 222575, 222689, 223356, 224389, 226069, 227474, 226739, 223853, 221453, 221659, 223409, 224205, 223340, 222011, 221217, 221077, 221627, 222742, 223582, 223479, 223223, 224228, 226525, 228737, 229965, 230559, 230970, 231110, 231157, 231889, 233638, 235628, 236848, 237117, 236994, 237082, 237710, 238843, 240116, 241271, 242673, 244934, 247941, 250694, 252326, 252954, 253458, 254694, 256965, 259816, 262217, 263280, 262919, 261679, 260031, 258161, 256315, 254976, 254760, 256417, 260550, 266680, 272740, 276432, 277292, 276825, 276554, 276656, 276759, 277183, 278739, 281668, 285346, 288828, 291367, 292689, 293221, 294009, 296059, 299596, 303933, 307885, 310500, 311723, 312483, 313861, 316118, 318773, 321533, 324684, 328547, 333004, 337783, 342825, 348176, 353787, 359560, 365348, 370885, 376005, 380969, 386280, 392202, 398656, 405334]
51716D05334O074M043J080j205k022k556m137o020o361m904l178k276j926j689
51702C80257j612j407n35N62O45m35j357j330j119j434j678j262p92q79r13k93
51686C66418J12p87k358l060k669k121j663q25p1n72k099k871k080j064j221k111
51670C40958k639k849l255l302k075n1J273J406J211J177P61k07o85J43J479J856
51654C35201R14n47j921l093l684k999j149O43J239O85j48n44l26K88P98P79M99
51637C26635P38J616K078J141o72j871j804j102n36k66m26j397l011m188m001
51622C12934k720j308m03k08q39j943k420j486J13Q15J83p62j240j668k533l413
51606B93102l830m266n249o054n508l848k455j762q05P54J637R25k01k8J067J120
$$ y = [405334, 411408, 415451, 416531, 415326, 413304, 410748, 406611, 400591, 394230, 389326, 386148, 383872, 381946, 380257, 378645, 377238, 376703, 377265, 377910, 377475, 376118, 374788, 373669, 372235, 370557, 369295, 368503, 367624, 366711, 366418, 366530, 365743, 363385, 360325, 357656, 355535, 353872, 353047, 352976, 352404, 350305, 347434, 345354, 344290, 343069, 340958, 338319, 335470, 332215, 328913, 326838, 326787, 328060, 329466, 330677, 331854, 332615, 332408, 331723, 331866, 333345, 335201, 336115, 335568, 333647, 330554, 326870, 323871, 322722, 323365, 324604, 325289, 325141, 324597, 324271, 324559, 325357, 326136, 326635, 327373, 328989, 331067, 332208, 331536, 329665, 327861, 326759, 326223, 325957, 325531, 324134, 321123, 316935, 312934, 310214, 308906, 308503, 308295, 307456, 305513, 303093, 301607, 301720, 302535, 302718, 301956, 300716, 299048, 296515, 293102, 289272, 285006, 279757, 273703, 268195, 264347, 261892, 260130, 259325, 260079, 261716, 262641, 262440, 262412, 263479, 264599]
51590B64599n55k448l001k290j197j29O90P00k82j354j388k92J177K372K911K429
51574B61942R45p05j625j811j664r80O63K617L383K341M65r07j302q42L45J861
51558B64726K791K442J260N97J444L448N082M871K812M61o27l99J47N83J403K796
51542B93837M017M266L555K382J246O87R98J538J140k54j198o37N99J103R00J003
51526C15182J493J485R16J042K677M899O036N308L251J081L2O04J981K655K044
51511C50686J088Q43R60K59j509l182l484k307o57K36k52j731l000l028k005j100
51495C31817j012j105m07Q24J234J80j263j514m17O18K71j248k529k509j538r97
51479C20405j744k918k698m47K296L493K887J921J622J580J193R00J431K491K980
$$ y = [264599, 264044, 261596, 258595, 256305, 255108, 254979, 255669, 256369, 256087, 254733, 253345, 253053, 254230, 256602, 259513, 261942, 262887, 262182, 260557, 258746, 257082, 256102, 256765, 259382, 262765, 265106, 265571, 264664, 263362, 262520, 262865, 264726, 267517, 269959, 271219, 271816, 273260, 276708, 281790, 286661, 289473, 289934, 289307, 288908, 289055, 289638, 291041, 293837, 297854, 302120, 305675, 308057, 309303, 309990, 310988, 312526, 313666, 313412, 312214, 311577, 312176, 313279, 314179, 315182, 316675, 318160, 319076, 320118, 322795, 327694, 333730, 339038, 342289, 343370, 343402, 344006, 345987, 348642, 350686, 351774, 352617, 353577, 353836, 352327, 349145, 345661, 343354, 342697, 342933, 342681, 340950, 337950, 334922, 332917, 331817, 330805, 329700, 329293, 330117, 331351, 331531, 330268, 328754, 328337, 328955, 329226, 327978, 325449, 322940, 321402, 320405, 318661, 315743, 313045, 312598, 314894, 318387, 321274, 323195, 324817, 326397, 327590, 328490, 329921, 332412, 335392]
51464C35392K367J268P33J248K306K804K127R95P48J533J857M31k022l468k684
51449C45635j07K946N108N361L745J678P63J121J585J449J195J415K004K697L464
51434C80059L897L162J237m25l74J052K184K043J246R60J607K702L510L584K878
51419D09322J570k7j388j813j086n7m5j317k656k894k422k569l811n261n956n844
51403C73746n324m486l246j945j306j708k724l407l108k021r71n43n17k77L11
51388C42474P36N32r9n18l22L21Q58P73k0j099j907k364k933l865m570m186k806
51371C21005j725k015l171l709l028k167k430l738m920n248n097n062n127m901
51357B68667m220l108j617j33M98j40j090q13Q20K019J110j359l295l603l135
$$ y = [335392, 337759, 339027, 339760, 341008, 343314, 346118, 348245, 349240, 349988, 351521, 353378, 353809, 351787, 348319, 345635, 345528, 348474, 353582, 358943, 362688, 364366, 365129, 366250, 367835, 369284, 370479, 371894, 373898, 376595, 380059, 383956, 387118, 388355, 387930, 387556, 388608, 390792, 392835, 394081, 395041, 396648, 399350, 402860, 406444, 409322, 410892, 410865, 409477, 407664, 406578, 406521, 406476, 405159, 402503, 399609, 397187, 394618, 390807, 385546, 379590, 373746, 368422, 363936, 360690, 358745, 357439, 355731, 353007, 349600, 346492, 344471, 343500, 342957, 342440, 342163, 342474, 343210, 343742, 343643, 343125, 342803, 343124, 343982, 344755, 344735, 343636, 341729, 339365, 336432, 332567, 327997, 323811, 321005, 319280, 317265, 314094, 310385, 307357, 305190, 302760, 299022, 294102, 288854, 283757, 278695, 273568, 268667, 264447, 261339, 259722, 259589, 260087, 259947, 258857, 258044, 258864, 260883, 261993, 260634, 257339, 253736, 250601]
51342B50601k999k937j994k48J080J180N24N9kk78j318k821l715l165j647o25
51326B31695p68r82rJ362J015j424l685l722k296j512j715j300O35K929L909L297
51310B27429K135J451J352J021l78k536l926l447j736k92L66O76N71m96k070k570
51294B17550j269P60K163K687K476J229r06k524k329r21j80j086k911m300m470
51279B05969l526k419k350l612n065n289m040k216q26m45j183k414l021k612k048
51264A64903k059j950q03N78N13r53j803q51O81J023J01r06j306j169n09P44J986
51247A58220K161R62n93j020J36J683J817N5j913j942M7J912J904N96l17m37q27
51230A62444k067l253l183j795JJ432K245K298J497K88m66m27k90p76j457j273
$$ y = [250601, 247602, 244665, 242671, 242423, 243503, 244683, 245207, 245266, 245264, 244986, 243668, 240847, 237132, 233967, 232320, 231695, 230927, 229945, 229936, 231298, 232313, 230889, 227204, 223482, 221186, 219674, 217959, 216659, 217294, 220223, 224132, 227429, 229564, 231015, 232367, 233388, 233010, 230474, 226548, 223101, 221365, 221073, 221439, 222115, 222686, 222190, 220120, 217550, 216281, 217041, 219204, 221891, 224367, 225596, 224690, 222166, 219837, 218916, 218736, 217650, 214739, 210439, 205969, 202443, 200024, 197674, 194062, 188997, 183708, 179668, 177452, 176626, 176181, 174998, 172584, 169563, 166951, 164903, 162844, 160894, 160091, 160669, 161182, 160229, 158426, 157575, 158256, 159279, 159380, 158474, 157168, 155999, 155490, 156234, 158220, 160381, 161343, 160750, 159730, 159866, 161549, 163366, 163421, 161508, 159566, 159613, 161525, 163429, 164025, 163708, 163271, 162444, 160377, 157124, 153941, 152146, 152147, 153579, 155824, 158122, 159619, 159907, 159441, 159014, 158724, 157948, 156491, 155218]
51214A55218q4J062J445J448J461R59m24j709j618m36L52J08n04j021j852l142
51198A51263m161m265l556k200j03K086K819J403p43j567n73J184K630L288K858
51183A50363J453P9k19L14M80p6l25N89K070K760K077O08p01j371j521j454j214
51166A53912o06K66Q80R73J138K129L581M066K821R26J56R55K049K118J182R1
51150A76637p23j315j418n07J220K728L345L325K845J425q16k333j897n28j90
51135A81798r24j035q5L65m67j174n76K37j80j149j113j98L87P27J835L242L246
51118A84936J666L30L89R72J089J066J143L11j990m193m247k379p53n67q70m25
51102A76478M49N56k60p94j76Q04O51o97j530o02J084J517K99j176j783j798j757
$$ y = [155218, 155134, 156196, 157641, 159089, 160550, 161509, 161085, 159376, 157758, 157322, 157674, 157782, 157278, 156257, 154405, 151263, 147102, 142837, 139281, 137081, 136978, 139064, 141883, 143286, 142543, 140976, 140403, 141587, 144217, 147505, 150363, 151816, 151895, 151676, 151990, 152470, 152394, 152069, 152658, 154728, 157488, 159565, 160173, 159472, 158101, 156580, 155126, 153912, 153306, 153572, 154452, 155425, 156563, 158692, 162273, 166339, 169160, 170086, 170242, 171197, 173246, 175364, 176546, 176637, 175914, 174599, 173181, 172674, 173894, 176622, 179967, 183292, 186137, 187562, 186746, 184413, 182516, 181988, 181798, 180874, 179839, 179754, 180119, 179652, 178478, 177902, 178139, 177959, 176810, 175697, 175499, 175886, 176613, 178448, 181690, 184936, 186602, 186932, 187321, 188293, 189382, 190448, 191591, 191902, 189912, 185719, 181472, 179093, 178340, 177773, 176903, 176478, 176927, 177483, 177223, 176429, 176253, 177057, 177708, 177011, 175481, 174879, 175963, 177480, 177779, 176603, 174820, 173022, 171265]
51085A71265j530j023q13j320j999k020j244p8J138K092K443K251J953J522L24
51070A72961j643l185l254k207r98J50J252J526K84j417j566K15K043K207J150
51055A67518M61O92J020O14l55j062j006n52n50j228j626n19J958M091M317K840
51039A76613J196M88N99R58J514K471L386L233J701O4J12K100M305M897L812K358
51023B09807J445Q52J09o48r54o74o6N76J085J340J186N23m55j067n93Q24J904
51006B15194J347p30k900l819l192j434Q00K552K754J159j175k840l334l087k494
50991A98801j504p8J358K117J643n2k016k768j738k03K9r81j193O03K808K885
50975A99711P05j260j134L18J275J385J802L166M556M522K703K47j244j138k38
$$ y = [171265, 169735, 168712, 167899, 166579, 164580, 162560, 161316, 161238, 162376, 164468, 166911, 169162, 171115, 172637, 172961, 171318, 168133, 164879, 162672, 161674, 161824, 163076, 164602, 164886, 163469, 161903, 162118, 164161, 166368, 167518, 167979, 168671, 169691, 170305, 169950, 168888, 167882, 167330, 166780, 165552, 163926, 163407, 165365, 169456, 173773, 176613, 177809, 178297, 178896, 179854, 181368, 183839, 187225, 190458, 192159, 192223, 192335, 194435, 198740, 203637, 207449, 209807, 211252, 212104, 212213, 211565, 210611, 209937, 209871, 210447, 211532, 212872, 214058, 214581, 214126, 213059, 212466, 213290, 215194, 216541, 215811, 212911, 209092, 205900, 204466, 205266, 207818, 210572, 211731, 210556, 207716, 204382, 201295, 198801, 197297, 197219, 198577, 200694, 202337, 202285, 200269, 197501, 195763, 195560, 195589, 194608, 193415, 194018, 196826, 199711, 200416, 199156, 198022, 198340, 199615, 201000, 202802, 205968, 210524, 215046, 217749, 217996, 216752, 215614, 215376]
50960B15376L93P94J802L360M128L143J203r4j4J228L249N345O172M944K735J439
50944B55203J487J832J937K376L257L669L269K972L379L769L627L811N042O323
50930C01953O383N863O351P634P833O384N154N899P983R581J0255J1081J2619
50917D04973J3953J4021J3146J2641J3300J4787J6517J8359K0225K1640K2403
50906E85965K3218K4818K6780K8176K9312L1447L4695L7570L9223M0696M3029
50895I44929M5336M6050M5221M4132M3244M1970M0197L8636L7613L6552L4698
50884A398578L1553K6945K1647J7503J5672J4949J3185J0172P656O572O051N472
50872A575955N712P405R348R730Q023M798O09m014q313j2123j6365k1722k7289
$$ y = [215376, 215769, 216563, 218365, 221725, 225853, 228996, 230199, 230105, 230091, 231319, 234568, 239913, 246085, 251029, 253764, 255203, 256690, 258522, 260459, 262835, 266092, 269761, 273030, 276002, 279381, 283150, 286777, 290588, 295630, 301953, 308336, 314199, 320550, 328184, 336017, 342401, 347555, 353454, 361437, 371018, 381273, 392354, 404973, 418926, 432947, 446093, 458734, 472034, 486821, 503338, 521697, 541922, 563562, 585965, 609183, 634001, 660781, 688957, 718269, 749716, 784411, 821981, 861204, 901900, 944929, 990265, 1036315, 1081536, 1125668, 1168912, 1210882, 1251079, 1289715, 1327328, 1363880, 1398578, 1430131, 1457076, 1478723, 1496226, 1511898, 1526847, 1540032, 1550204, 1557860, 1564432, 1570483, 1575955, 1581667, 1589072, 1598420, 1608150, 1616173, 1620971, 1621580, 1617566, 1609253, 1597130, 1580765, 1559043, 1531754]
50859A531754l1553l4336l6726l9238m1235m2264m3022m4416m6117m6641m4861
50848A081345m1285l7610l5075l3378l1371k8490k5102k1706j8461j5500j3015
50837G80352j0820q434n825l637k412k115k443l039l217k253l68J184J528J147
50823G39648J140J922L027L768L809L445L476M304N181N076M294M196N046N519
50809G93851M917M503N536P209Q042Q464J0155J3205J5678J6403J6607J8152K1217
50796I43939K4425K6702K8247L0028L2712L6127L9680M3302M7628N2948N8424
50785A364162O3068O7177P1942P7632Q3066Q7122R0060R2901R6053R8967J00743
50774B292893J00709R8544R4343Q8612Q1998P4910O7342N9113N0332M1694L4138
$$ y = [1531754, 1500201, 1465865, 1429139, 1389901, 1348666, 1306402, 1263380, 1218964, 1172847, 1126206, 1081345, 1040060, 1002450, 967375, 933997, 902626, 874136, 849034, 827328, 808867, 793367, 780352, 769532, 761098, 755273, 751636, 749224, 747109, 744666, 741627, 738410, 736157, 735789, 736973, 738501, 739648, 740788, 742710, 745737, 749505, 753314, 756759, 760235, 764539, 769720, 774796, 779090, 783286, 788332, 793851, 798768, 803271, 808807, 816016, 824058, 832522, 842677, 855882, 871560, 887963, 904570, 922722, 943939, 968364, 995066, 1023313, 1053341, 1086053, 1122180, 1161860, 1205162, 1252790, 1305738, 1364162, 1427230, 1494407, 1566349, 1643981, 1727047, 1814169, 1904229, 1997130, 2093183, 2192150, 2292893, 2393602, 2492146, 2586489, 2675101, 2757099, 2832009, 2899351, 2958464, 3008796, 3050490, 3084628]
50763C084628K8170K3676K0376J8105J6700J6108J6778J9227K2799K5549K6023
50752C318139K4629K2480J9400J4070N866m372j5429k6634l7649m8220n8390o8304
50740C145586p7526q5017q9950r2020r1012q6894q0732p4587o9723o5183n8899
50729B274043n0225m0795l2565k5445j7524p787K122R609J4192J7729K1602K5054
50717B190010K6940K7763K8592K8801K6546K1388J5019R373N070J775j207m813
50705B375257r515j4437j8230k1106k4748k9904l5335l9795m3683m7761n1326
50694B039417n2937n2420n1023m9783m8662m7039m4390m0648l6384l2346k8433
50683A555352k3659j7765j2134q207n466k165K175O366R701J3272J8424K4801
$$ y = [3084628, 3112798, 3136474, 3156850, 3174955, 3191655, 3207763, 3224541, 3243768, 3266567, 3292116, 3318139, 3342768, 3365248, 3384648, 3398718, 3404584, 3400212, 3384783, 3358149, 3320500, 3272280, 3213890, 3145586, 3068060, 2983043, 2893093, 2801073, 2710061, 2623167, 2542435, 2467848, 2398125, 2332942, 2274043, 2223818, 2183023, 2150458, 2125013, 2107489, 2099702, 2101824, 2111433, 2125625, 2143354, 2164956, 2190010, 2216950, 2244713, 2273305, 2302106, 2328652, 2350040, 2365059, 2374432, 2379502, 2381277, 2380070, 2375257, 2365742, 2351305, 2333075, 2311969, 2287221, 2257317, 2221982, 2182187, 2138504, 2090743, 2039417, 1986480, 1934060, 1883037, 1833254, 1784592, 1737553, 1693163, 1652515, 1616131, 1583785, 1555352, 1531693, 1513928, 1501794, 1493587, 1488121, 1485956, 1488131, 1494497, 1504198, 1517470, 1535894, 1560695]
50671A560695L0752L5286L8873M2456M6398N0582N5021N9772O4287O7347O8023
50660B119492O6604O4271O1820N9013N5158N0058M4203L8256L2340K5863J8169
50649B635247R611J730m034p582r683j0547r761p496m721j953J231M964Q402J0832
50635B616240J2619J4232J5150J4672J3068J0789P075Q12p268j4576j9156k1294
50623B642363k2305k2774k2495k1325j9260j6031j1421n932o63L716P634J2072
50611B523579J7361K2813K7816L2967L9496M7564N5920O3682P1505Q0170Q8676
50600C071549R4897R7850R8207R6681R3164Q7648Q0818P3226O4916N6420M9117
50589C964493M3838L9710L5151K9437K2735J5311P777J481k516m787o765q653
$$ y = [1560695, 1591447, 1626733, 1665606, 1708062, 1754460, 1805042, 1860063, 1919835, 1984122, 2051469, 2119492, 2186096, 2250367, 2312187, 2371200, 2426358, 2476416, 2520619, 2558875, 2591215, 2617078, 2635247, 2644858, 2646588, 2642554, 2634972, 2625289, 2614742, 2604981, 2597485, 2592764, 2590811, 2592042, 2597006, 2605408, 2616240, 2628859, 2643091, 2658241, 2672913, 2685981, 2696770, 2703845, 2704657, 2697389, 2682813, 2663657, 2642363, 2620058, 2597284, 2574789, 2553464, 2534204, 2518173, 2506752, 2500820, 2500157, 2503873, 2511507, 2523579, 2540940, 2563753, 2591569, 2624536, 2664032, 2711596, 2767516, 2831198, 2902703, 2982873, 3071549, 3166446, 3264296, 3362503, 3459184, 3552348, 3639996, 3720814, 3794040, 3858956, 3915376, 3964493, 4008331, 4048041, 4083192, 4112629, 4135364, 4150675, 4158452, 4159933, 4157417, 4152630, 4145865, 4137212]
50577D137212r223p833n472l195n93L302Q242J2933J6677J9720K1981K2536K0759
50564D237046J7191J2705P439J198n611j2166j8151k3652k8379l1817l4177l6126
50552D085500l7344l6394l2529k6740k0353j3625o657q35K251L001L384M205M156
50539C928020J814k922r863j9437l1332m3528n4116o3390p2619q1391q8018r2361
50527C370857r6203j00161j02087r9880r4706q9744q6282q2696p7351p0877o4939
50516B405931n9789n4135m7047l9093l1686k5897k1956j9253j6507j2569p606
50505B070393l312j217p29N33M074Q732J2117J3544J4718J7535K2088K7200L2049
50492B217725L6475M0246M3259M6430N1506N9365O8953P8174Q5549R0936R5099
$$ y = [4137212, 4127989, 4120156, 4114684, 4111489, 4110896, 4114198, 4122440, 4135373, 4152050, 4171770, 4193751, 4216287, 4237046, 4254237, 4266942, 4274381, 4275579, 4269968, 4257802, 4239651, 4215999, 4187620, 4155803, 4121626, 4085500, 4048156, 4011762, 3979233, 3952493, 3932140, 3918515, 3911858, 3911023, 3913274, 3916275, 3919659, 3923864, 3928020, 3929834, 3926912, 3917049, 3897612, 3866280, 3822752, 3768636, 3705246, 3632627, 3551236, 3463218, 3370857, 3274654, 3174493, 3072406, 2972526, 2877820, 2788076, 2701794, 2619098, 2541747, 2470870, 2405931, 2346142, 2292007, 2244960, 2205867, 2174181, 2148284, 2126328, 2107075, 2090568, 2077999, 2070393, 2067081, 2065864, 2065135, 2065668, 2069742, 2078474, 2090591, 2104135, 2118853, 2136388, 2158476, 2185676, 2217725, 2254200, 2294446, 2337705, 2384135, 2435641, 2495006, 2563959, 2642133, 2727682, 2818618, 2913717]
50481B913717R8909J02653J05759J07363J07224J05871J03879J01518R9323R8206
50471C944422R8590R9918J01641J04107J07767J11890J15055J16851J18346J20834
50461E039421J24789J29940J35689J41350J46540J51161J54528J54999J51591
50452F330008J45610J39052J31348J19464J01989Q1202N9852L7581J2475j5008
50442G143573m2048o6944r0169j11708j29702j42690j51294j56429j57158j51932
50432E943499j41083j26634j10103r1896p2645n3733l6298k0732p477K455P951
50421E293304Q194K485r464k6653m6824o7881q8967j09802j29498j46506j59560
50410D518828j68277j73027j74567j73673j70723j65670j58590j50074j40876
$$ y = [2913717, 3012626, 3115279, 3221038, 3328401, 3435625, 3541496, 3645375, 3746893, 3846216, 3944422, 4043012, 4142930, 4244571, 4348678, 4456445, 4568335, 4683390, 4800241, 4918587, 5039421, 5164210, 5294150, 5429839, 5571189, 5717729, 5868890, 6023418, 6178417, 6330008, 6475618, 6614670, 6746018, 6865482, 6967471, 7048673, 7108525, 7146106, 7158581, 7143573, 7101525, 7034581, 6944412, 6832704, 6703002, 6560312, 6409018, 6252589, 6095431, 5943499, 5802416, 5675782, 5565679, 5473783, 5401138, 5347405, 5311107, 5290375, 5282898, 5285353, 5293304, 5301498, 5303983, 5294519, 5267866, 5221042, 5153161, 5064194, 4954392, 4824894, 4678388, 4518828, 4350551, 4177524, 4002957, 3829284, 3658561, 3492891, 3334301, 3184227, 3043351]
50401C043351j31439j21995j12931j04614r7048r0016q3394p7032p0526o3772
50391B090584n7464n2363m8016m3014l6815l0531k5526k1827j8473j4833j0930
50380A730792o881k775J036M179O802R328J1790J3776J5120J6285J8137K1493
50368A839082K6451L1788L5609L7331L8525M1086M5007M9060N3006N7568O2409
50357B316922O6013O8003O9774P2035P3537P3420P3279P5085P8282Q0891Q2821
50346C130062Q5817R0328R4549R6967R7969R8338R7812R6017R3441R0361Q5953
50335D157614P9505P1626O3068N3137M0593K5714J0172n035k0348l6332n2605
50324D387109o8333q2904r5705j05815j12373j15049j14114j10297j04537r7348
$$ y = [3043351, 2911912, 2789917, 2676986, 2572372, 2475324, 2385308, 2301914, 2224882, 2154356, 2090584, 2033120, 1980757, 1932741, 1889727, 1852912, 1822381, 1796855, 1775028, 1756555, 1741722, 1730792, 1723911, 1721136, 1722172, 1726351, 1733153, 1742481, 1754271, 1768047, 1783167, 1799452, 1817589, 1839082, 1865533, 1897321, 1932930, 1970261, 2008786, 2049872, 2094879, 2143939, 2196945, 2254513, 2316922, 2382935, 2450938, 2520712, 2592747, 2666284, 2739704, 2812983, 2888068, 2966350, 3047241, 3130062, 3215879, 3306207, 3400756, 3497723, 3595692, 3694030, 3791842, 3887859, 3981300, 4071661, 4157614, 4237119, 4308745, 4371813, 4424950, 4465543, 4491257, 4501429, 4496394, 4476046, 4439714, 4387109, 4318776, 4235872, 4140167, 4034352, 3921979, 3806930, 3692816, 3582519, 3477982, 3380634]
50314C380634q8515p7747o5520n2786m0147k8089j7834j0721o584l969k553m013
50302B982156r539j7646k5927l4192m4041n5541o6192p3598p7589p9168p8959
50291B419764p7653p6567p6244p5444p2920o9491o6851o4883o1903n7368n2449
50280A667991m7844m2981l7942l4262l2510l0687k6757k1703j8279j7191j6451
50269A341384j4470j1903r882q051n557k890j279o03O59L181N780P243Q221J0067
50255A321900J2267J2619J0454Q263Q893J1898J4181J4017J2744J2258J2609J3019
50243A465122J3811J5711J7992J9072J8888J9078K0389K1118J9030J4185R034
50232A653430N734M022K015j271m723o632o938p261q802j0999j2702j3894j5629
$$ y = [3380634, 3292119, 3214372, 3148852, 3096066, 3055919, 3027830, 3009996, 2999275, 2992691, 2988722, 2986169, 2982156, 2972617, 2954971, 2929044, 2894852, 2850811, 2795270, 2729078, 2655480, 2577891, 2498723, 2419764, 2342111, 2265544, 2189300, 2113856, 2040936, 1971445, 1904594, 1839711, 1777808, 1720440, 1667991, 1620147, 1577166, 1539224, 1504962, 1472452, 1441765, 1415008, 1393305, 1375026, 1357835, 1341384, 1326914, 1315011, 1305129, 1297078, 1291521, 1288631, 1287352, 1286749, 1287408, 1290589, 1296369, 1303612, 1311833, 1321900, 1334167, 1346786, 1357240, 1365503, 1374396, 1386294, 1400475, 1414492, 1427236, 1439494, 1452103, 1465122, 1478933, 1494644, 1512636, 1531708, 1550596, 1569674, 1590063, 1611181, 1630211, 1644396, 1653430, 1659164, 1663186, 1665201, 1663930, 1659207, 1652575, 1645637, 1638376, 1629574, 1618575, 1605873, 1591979, 1576350]
50219A576350j8561k2096k4939k6089k5574k4400k3517k2732k1238j9213j7877
50208A330114j7594j7218j6041j5152j5555j6111j5089j3016j1932j2156j1979
50197A168271j0706r852j0475j1253j0382q000n556l768k472j723j849k630l310
50184A086295l280k322n55J403K745L257L385L301K685J728J339J783K051J369
50170A105184M00L7j90j304k957l603k580j015n34j699l848n950p476q605r483
50155A056377r509q010n711m445m789n080l647j100O44R07M78j03r42j691j597
50140A011782q44n30r48j049m7J359J936J403N21J84O95J617K201K243K358K861
50124A025742K826J169j465l118k885j801j098q74q87j499k850m112m528m581
$$ y = [1576350, 1557789, 1535693, 1510754, 1484665, 1459091, 1434691, 1411174, 1388442, 1367204, 1347991, 1330114, 1312520, 1295302, 1279261, 1264109, 1248554, 1232443, 1217354, 1204338, 1192406, 1180250, 1168271, 1157565, 1147713, 1137238, 1125985, 1115603, 1107603, 1102047, 1098279, 1095807, 1094084, 1092235, 1089605, 1086295, 1083015, 1080693, 1080138, 1081541, 1084286, 1087543, 1090928, 1094229, 1096914, 1098642, 1099981, 1101764, 1103815, 1105184, 1105584, 1105621, 1105431, 1104127, 1101170, 1097567, 1094987, 1093972, 1093438, 1091739, 1087891, 1081941, 1074465, 1065860, 1056377, 1046868, 1038858, 1033147, 1028702, 1023913, 1018833, 1015186, 1014086, 1014730, 1015637, 1016115, 1016012, 1015070, 1013379, 1011782, 1010938, 1010408, 1009460, 1008411, 1008364, 1009723, 1011659, 1013062, 1013583, 1013767, 1014462, 1016079, 1018280, 1020523, 1022881, 1025742, 1028568, 1029737, 1028272, 1025154, 1022269, 1020468, 1019370, 1018496, 1017609, 1016110, 1013260, 1009148, 1004620, 1000039]
50110A000039n101n669n028k968q03J41j48o23k53J200L036M150M214M149N028
50095A001364O561P354O704N430M754N086O229Q015R908J0629R296O937N768O610
50081A100645Q023Q509Q594R723J1733J2947J2568J1632J1254J1269J1227J1476
50069A229600J2283J2890J2618J2201J2664J3309J2411R914P922Q073R691J1241
50057A364817J2476J4188J6503J8609K0014K1237K3095K5939K9697L4259L9484
50046A620318M4941M9920N4096N8267O4030P2189Q1561R0042R6829J02929J09186
50035B444308J14615J17348J16676J13256J07555R9222Q8397P6834O6921N9708
50025C404840N4455N0088M6421M3491M0184L4303K4289J0344o251k4393m3287
$$ y = [1000039, 994938, 989269, 984241, 981273, 980470, 980611, 980463, 979840, 979587, 980787, 983823, 987973, 992187, 996336, 1001364, 1007925, 1015279, 1021983, 1027413, 1032167, 1037253, 1043482, 1051497, 1061405, 1072034, 1081330, 1088267, 1094035, 1100645, 1108668, 1117177, 1125771, 1135494, 1147227, 1160174, 1172742, 1184374, 1195628, 1206897, 1218124, 1229600, 1241883, 1254773, 1267391, 1279592, 1292256, 1305565, 1317976, 1327890, 1335812, 1343885, 1353576, 1364817, 1377293, 1391481, 1407984, 1426593, 1446607, 1467844, 1490939, 1516878, 1546575, 1580834, 1620318, 1665259, 1715179, 1769275, 1827542, 1891572, 1963761, 2045322, 2135364, 2232193, 2335122, 2444308, 2558923, 2676271, 2792947, 2906203, 3013758, 3112980, 3201377, 3278211, 3345132, 3404840, 3459295, 3509383, 3555804, 3599295, 3639479, 3673782, 3698071, 3708415, 3702164, 3677771, 3634484]
50014C634484o1800p8473r2170j02396j08984j11982j11835j09251j04809r9010
50004B653774r2622q6418q0461p4227o7526o0958n5185n0197m5575m1128l7065
49993A962412l3727l1367k9851k8403k5964k2216j8104j4980j3283j2234j0800
49982A721483q737o603m874l347j621k1N29j93j068p95O23K111L007L695M775
49967A708964O270P666Q243P428N537M079M539O642Q530Q856Q002P123O945P758
49953A806582R579J1666J2759J2670J2888J4682J7247J8773J9073J9838K2317
49942A978074K5871K9116L1573L3705L6034L8901M2689M7467N2403N6231N8703
49931B430767O1308O5934P2862Q0600Q7921R5356J04022J13665J23026J31937
$$ y = [3634484, 3572684, 3494211, 3402041, 3299645, 3190661, 3078679, 2966844, 2857593, 2752784, 2653774, 2561152, 2474734, 2394273, 2320046, 2252520, 2191562, 2136377, 2086180, 2040605, 1999477, 1962412, 1928685, 1897318, 1867467, 1839064, 1813100, 1790884, 1772780, 1757800, 1744517, 1732283, 1721483, 1712746, 1706143, 1701269, 1697922, 1696301, 1696280, 1696809, 1696616, 1695548, 1694753, 1695376, 1697487, 1700494, 1704189, 1708964, 1715234, 1722900, 1731143, 1738571, 1744108, 1748187, 1752726, 1759368, 1767898, 1776754, 1784756, 1791879, 1798824, 1806582, 1816161, 1827827, 1840586, 1853256, 1866144, 1880826, 1898073, 1916846, 1935919, 1955757, 1978074, 2003945, 2033061, 2064634, 2098339, 2134373, 2173274, 2215963, 2263430, 2315833, 2372064, 2430767, 2492075, 2558009, 2630871, 2711471, 2799392, 2894748, 2998770, 3112435, 3235461, 3367398]
49921C367398J41649J52676J63482J71839J76489J76770J71949J62321J50287
49912D834860J38787J28797J19407J10210J02174R5897R0194Q2883P2240N7252
49902E832701L7434J3144j4309m3418p3137j02452j29653j52586j69861j81692
49892E016171j89538j94782j97818j98360j96480j92807j87605j80431j71219
49883C307131j61167j51682j42803j33537j23522j13494j04171r5600q7669q0386
49873B113100p3558o7008o1249n7011n3857n0335m5890m1636l8708l6756l4854
49862A552238l2959l1509l0328k8940k7518k6358k4850k2190j9087j7396j7703
49851A273400j8389j7651j5564j3410j1681r796p517n603m796m902n326n897o604
$$ y = [3367398, 3509047, 3661723, 3825205, 3997044, 4173533, 4350303, 4522252, 4684573, 4834860, 4973647, 5102444, 5221851, 5332061, 5434235, 5530132, 5620326, 5703209, 5775449, 5832701, 5870135, 5883279, 5868970, 5825552, 5752415, 5649963, 5520310, 5367724, 5197863, 5016171, 4826633, 4631851, 4434033, 4235673, 4039193, 3846386, 3658781, 3478350, 3307131, 3145964, 2994282, 2851479, 2717942, 2594420, 2480926, 2376755, 2281155, 2193486, 2113100, 2039542, 1972534, 1911285, 1854274, 1800417, 1750082, 1704192, 1662556, 1623848, 1587092, 1552238, 1519279, 1487770, 1457442, 1428502, 1400984, 1374626, 1349776, 1327586, 1308499, 1291103, 1273400, 1255011, 1237360, 1221796, 1208386, 1196705, 1186909, 1179392, 1173789, 1168993, 1164091, 1158765, 1152868, 1146264]
49838A146264o878n998m172k483j528q93k04K59O17K093N428R167J0966J0532
49824A163170R779J0022J0631J0946J1793J3981J6654J8519J9767K1480K3858
49813A330600K6492K9605L3423L6917L9133M1538M6906N5571O4781P2419P9359
49802A856744Q7140R5225J02240J08416J14877J21189J25427J26418J24281J19041
49792B980998J10339R8763Q6051P3724O2619N3807M8349M5571M2856L8020L0884
49781C671981K1808R771o793k7818n1350p5128r7316j16067j29780j38155j42213
$$ y = [1146264, 1139386, 1133388, 1129216, 1126733, 1125205, 1124312, 1124108, 1124367, 1124984, 1127077, 1132505, 1141672, 1152638, 1163170, 1172949, 1182971, 1193602, 1204548, 1216341, 1230322, 1246976, 1265495, 1285262, 1306742, 1330600, 1357092, 1386697, 1420120, 1457037, 1496170, 1537708, 1584614, 1640185, 1704966, 1777385, 1856744, 1943884, 2039109, 2141349, 2249765, 2364642, 2485831, 2611258, 2737676, 2861957, 2980998, 3091337, 3190100, 3276151, 3349875, 3412494, 3466301, 3514650, 3560221, 3603077, 3641097, 3671981, 3693789, 3703560, 3696767, 3668949, 3617599, 3542471, 3445155, 3329088, 3199308, 3061153, 2918940]
$$ [...]
##END NTUPLES=NMR SPECTRUM
##END=
