##TITLE=coffee_type CCPA01-ROVE100E_60-40%
COFFEE_meoh_noesyp64 COFFEE_meoh {C:\Bruker\TOPSPIN} Administrator 8
##JCAMPDX= 6.0         $$ Bruker NMR JCAMP-DX V2.0
##DATA TYPE= NMR SPECTRUM
##DATA CLASS= NTUPLES
##ORIGIN= Bruker BioSpin GmbH
##OWNER= Administrator
$$ 1.72 TOPSPIN		Version 2.1
$$ 2012-05-18 15:51:39.073 -0700  Administrator@X
$$ Compression mode = diff/dup
##.OBSERVE FREQUENCY= 400.13188235
##.OBSERVE NUCLEUS= ^1H
##.ACQUISITION MODE= SIMULTANEOUS (DQD)
##.ACQUISITION SCHEME= undefined
##.AVERAGES= 64
##.DIGITISER RES= 22
##SPECTROMETER/DATA SYSTEM= spect
##.PULSE SEQUENCE= noesygpps1d.comp
##.SOLVENT NAME= COFFEE_meoh
##.SHIFT REFERENCE= INTERNAL, COFFEE_meoh, 1, 14.98061
##AUDIT TRAIL= $$ (NUMBER, WHEN, WHO, WHERE, PROCESS, VERSION, WHAT)
$$ ##TITLE= Audit trail, TOPSPIN		Version 2.1
$$ ##JCAMPDX= 5.01
$$ ##ORIGIN= Bruker BioSpin GmbH
$$ ##OWNER= Administrator
$$ $$ C:\Bruker\TOPSPIN/data/Administrator/nmr/12-COFFEE-2502/182/pdata/1/auditp.txt
$$ ##AUDIT TRAIL=  $$ (NUMBER, WHEN, WHO, WHERE, PROCESS, VERSION, WHAT)
(   1,<2012-02-25 20:09:31.125 -0500>,<Administrator>,<TOPSPIN>,<go>,<TOPSPIN 2.1>,
      <created by zg
	started at 2012-02-25 19:58:00.875 -0500,
	POWCHK enabled, PULCHK disabled,
       configuration hash MD5:
       B0 76 FB 9C 50 81 44 7D 18 B3 26 32 4E 60 AD 96
       data hash MD5: 64K
       7B 85 ED BA CD 76 4C 1D 7D AB C8 4D CB A3 7A D2>)
(   2,<2012-02-25 20:09:33.844 -0500>,<Administrator>,<TOPSPIN>,<proc1d>,<TOPSPIN 2.1>,
      <Start of raw data processing
       efp LB = 0.3 FT_mod = 6 PKNL = 1 PHC0 = 0 PHC1 = 0 SI = 128K 
       data hash MD5: 128K
       5C 78 D2 01 BC 91 3F A9 12 E3 BF CA 43 73 1F 18>)
(   3,<2012-02-25 20:09:35.125 -0500>,<Administrator>,<TOPSPIN>,<proc1d>,<TOPSPIN 2.1>,
      <pk PHC0 = 24.21387 PHC1 = 0 
       data hash MD5: 128K
       77 BC A9 4C DE 06 C2 D9 F0 CF AF CB 1B BA EC CE>)
(   4,<2012-02-25 20:09:35.391 -0500>,<Administrator>,<TOPSPIN>,<proc1d>,<TOPSPIN 2.1>,
      <abs ABSG = 1 
       data hash MD5: 128K
       EB D3 6D 9D 57 D5 63 7F B4 62 AF FB AA AC EB E7>)
(   5,<2012-02-25 20:09:35.469 -0500>,<Administrator>,<TOPSPIN>,<proc1d>,<TOPSPIN 2.1>,
      <abs ABSG = 2 
       data hash MD5: 128K
       12 E4 44 45 93 62 F3 F6 D9 6A A6 07 74 2A 66 9B>)
(   6,<2012-02-25 20:09:35.516 -0500>,<Administrator>,<TOPSPIN>,<proc1d>,<TOPSPIN 2.1>,
      <abs ABSG = 3 
       data hash MD5: 128K
       47 AE 92 10 7D 92 EB B5 55 E9 BA 8C A9 99 79 A6>)
(   7,<2012-02-25 20:09:35.594 -0500>,<Administrator>,<TOPSPIN>,<proc1d>,<TOPSPIN 2.1>,
      <abs ABSG = 4 
       data hash MD5: 128K
       E4 4F 72 46 0B 67 57 DF E8 8F 2C D5 C1 FC B1 6F>)
(   8,<2012-02-25 20:09:35.641 -0500>,<Administrator>,<TOPSPIN>,<proc1d>,<TOPSPIN 2.1>,
      <abs ABSG = 5 
       data hash MD5: 128K
       BB 01 60 CC 24 E5 9E 5C E5 9D 5A E6 36 68 C1 C4>)
(   9,<2012-02-25 20:09:35.937 -0500>,<Administrator>,<TOPSPIN>,<audit>,<TOPSPIN 2.1>,
      <user comment:
       ICON-NMR User ID: Administrator
$$ [...]
150 150 150 150 150 150 150 150
##$TP07= 0
##$TPNAME0= <>
##$TPNAME1= <>
##$TPNAME2= <>
##$TPNAME3= <>
##$TPNAME4= <>
##$TPNAME5= <>
##$TPNAME6= <>
##$TPNAME7= <>
##$TPOAL= (0..7)
0.5 0.5 0.5 0.5 0.5 0.5 0.5 0.5
##$TPOFFS= (0..7)
0 0 0 0 0 0 0 0
##$TUNHIN= 0
##$TUNHOUT= 0
##$TUNXOUT= 0
##$USERA1= <user>
##$USERA2= <user>
##$USERA3= <user>
##$USERA4= <user>
##$USERA5= <user>
##$V9= 5
##$VALIST= <valist>
##$VCLIST= <CCCCCCCCCCCCCCC>
##$VD= 0
##$VDLIST= <DDDDDDDDDDDDDDD>
##$VPLIST= <PPPPPPPPPPPPPPP>
##$VTLIST= <TTTTTTTTTTTTTTT>
##$WBST= 1024
##$WBSW= 4
##$XGAIN= (0..3)
0 0 0 0
##$XL= 0
##$YL= 0
##$YMAX_a= 13684560
##$YMIN_a= -6105293
##$ZGOPTNS= <>
##$ZL1= 120
##$ZL2= 120
##$ZL3= 120
##$ZL4= 120
##$ABSF1= 14.98061
##$ABSF2= -5.57192
##$ABSG= 5
##$ABSL= 3
##$ALPHA= 0
##$AQORDER= 0
##$ASSFAC= 0
##$ASSFACI= 0
##$ASSFACX= 0
##$ASSWID= 0
##$AUNMP= <proc_prof1d_extract>
##$AXLEFT= 0
##$AXNAME= <>
##$AXNUC= <1H>
##$AXRIGHT= 0
##$AXTYPE= 0
##$AXUNIT= <>
##$AZFE= 0.1
##$AZFW= 0.1
##$BCFW= 0
##$BC_mod= 0
##$BYTORDP= 0
##$COROFFS= 0
##$CY= 15
##$DATMOD= 1
##$DC= 0
##$DFILT= <>
##$DTYPP= 0
##$F1P= 0
##$F2P= 0
##$FCOR= 0.5
##$FTSIZE= 131072
##$FT_mod= 6
##$GAMMA= 0
##$GB= 0
##$INTBC= 1
##$INTSCL= 1
##$ISEN= 128
##$LB= 0.3
##$LEV0= 0
##$LPBIN= 0
##$MAXI= 10000
##$MC2= 0
##$MEAN= 0
##$ME_mod= 0
##$MI= 0
##$NCOEF= 0
##$NC_proc= -3
##$NLEV= 6
##$NOISF1= 0
##$NOISF2= 0
##$NSP= 0
##$NTH_PI= 0
##$NZP= 0
##$OFFSET= 14.98061
##$PC= 1
##$PHC0= 24.21387
##$PHC1= 0
##$PH_mod= 1
##$PKNL= yes
##$PPARMOD= 0
##$PPDIAG= 0
##$PPIPTYP= 0
##$PPMPNUM= 2147483647
##$PPRESOL= 1
##$PSCAL= 4
##$PSIGN= 0
##$PYNMP= <proc.py>
##$REVERSE= no
##$SF= 400.13
##$SI= 131072
##$SIGF1= 0
##$SIGF2= 0
##$SINO= 400
##$SIOLD= 131072
##$SPECTYP= <>
##$SREGLST= <1H.CDCl3>
##$SSB= 0
##$STSI= 131072
##$STSR= 0
##$SW_p= 8223.68421052632
##$SYMM= 0
##$S_DEV= 0
##$TDeff= 65536
##$TDoff= 0
##$TI= <>
##$TILT= no
##$TM1= 0
##$TM2= 0
##$TOPLEV= 0
##$USERP1= <user>
##$USERP2= <user>
##$USERP3= <user>
##$USERP4= <user>
##$USERP5= <user>
##$WDW= 1
##$XDIM= 131072
##$YMAX_p= 524130001
##$YMIN_p= -282329921
##$CURPLOT= <Network HP LaserJet P1505>
##$CURPRIN= <$Network HP LaserJet P1505>
##$DFORMAT= <normdp>
##$LAYOUT= <+/1D_H.xwp>
##$LFORMAT= <normlp>
##$PFORMAT= <normpl>
##$SURQMSG= 1
$$ End of Bruker specific parameters
$$ ---------------------------------
##NTUPLES= NMR SPECTRUM
##VAR_NAME=  FREQUENCY,     SPECTRUM/REAL,   SPECTRUM/IMAG
##SYMBOL=    X,             R,               I
##VAR_TYPE=  INDEPENDENT,   DEPENDENT,       DEPENDENT
##VAR_FORM=  AFFN,          ASDF,            ASDF
##VAR_DIM=   131072,        131072,          131072
##UNITS=     HZ,            ARBITRARY UNITS, ARBITRARY UNITS
##FACTOR=    0.0627417313425165, 1,          1
##FIRST=     8223.62146879498, 3713,         -93415
##LAST=      0,             8081,            -91849
##MIN=       0,             -282329921,      0
##MAX=       8223.62146879498, 524130001,    0
$$ Real data points
##PAGE= N=1
##DATA TABLE= (X++(R..R)), XYDATA
$$ [...]
60722A243828J1353J1357J1128J0604R662Q508P465O098L738J091j55J94L73o30
60708A324614j555j104j69l68j519k023j013R77K893L723K867Q22j175k686m463
60693A319821o649p875p143n488m619m674m552l751k686j726r73o41p71j044j409
60678A265820k321l633m128l061j344l97m80r84j584k185k535k820l739n128n562
60663A225919m480l575m542o423o933n841n068n658o535o525n938n676o061o974
60649A145690q091q552p560n792n288p170j0170j2089j2289j1975j2233j2596
60637A031885j1982j0593j0074j1454j3610j4562j3942j3057j2666j2014j0513
60626H97418q991q406q321p695o430n172m167l255k511k084j883k024k878l870
$$ plain form
60722 1243828 1255181 1266538 1277666 1288270 1297932 1306440 1313905 1320003 1323741 1324832 1324677 1324871 1325244 1324614
60708 1324614 1323059 1321955 1321786 1321418 1319899 1317876 1316863 1317840 1320733 1324456 1327323 1328145 1326970 1324284 1319821
60693 1319821 1313172 1305297 1298154 1292666 1288047 1283373 1278821 1275070 1272384 1270658 1269685 1269044 1268273 1267229 1265820
60678 1265820 1263499 1259866 1255738 1252677 1251333 1250936 1250456 1249472 1247888 1245703 1243168 1240348 1236609 1231481 1225919
60663 1225919 1221439 1217864 1213322 1206899 1199966 1194125 1189057 1183399 1176864 1170339 1164401 1158725 1152664 1145690
60649 1145690 1137599 1129047 1121487 1115695 1110407 1103237 1093067 1080978 1068689 1056714 1044481 1031885
60637 1031885 1019903 1009310 999236 987782 974172 959610 945668 932611 919945 907931 897418
60626 897418 888427 880021 871700 864005 857575 852403 848236 844981 842470 840386 838503 836479 833601 829731
60612H29731l318n52K620L973L706L813N125O663P579Q045Q126P521O822P519
60598H97373R995J2601J3536J2914J2344J2882J3988J4346J3512J2757J3930J7218
60586A057396K0566K1911K1352K0278J9083J7134J4625J2752J1923J1257J0283
60575A238560R773J0358J1531J2554J3204J2962J0783O722K701M24p39k528n057
60562A321248o860p489q396j0767j3661j5247j5017j3960j2979j2104j1171j0343
60550A183254r702q962p958o885n746m002j357J619M179O341Q494J0442J1748
60537A181465J2745J4099J5388J5438J4212J3019J2308J0763P541M185K890L652
60525A307705M499M133L051K359K609L637M555M244K800K072L490N765O160L944
$$ plain form
60612 829731 826413 825861 828481 832454 836160 839973 845098 851761 859340 867385 875511 883032 889854 897373
60598 897373 907368 919969 933505 946419 958763 971645 985633 999979 1013491 1026248 1040178 1057396
60586 1057396 1077962 1099873 1121225 1141503 1160586 1177720 1192345 1205097 1217020 1228277 1238560
60575 1238560 1248333 1258691 1270222 1282776 1295980 1308942 1319725 1326447 1329148 1329572 1328833 1326305 1321248
60562 1321248 1314388 1306899 1298503 1287736 1274075 1258828 1243811 1229851 1216872 1204768 1193597 1183254
60550 1183254 1173552 1164590 1156632 1149747 1144001 1139999 1138642 1140261 1144440 1150781 1159275 1169717 1181465
60537 1181465 1194210 1208309 1223697 1239135 1253347 1266366 1278674 1289437 1296978 1301163 1304053 1307705
60525 1307705 1312204 1316337 1319388 1321747 1324356 1327993 1332548 1336792 1339592 1341664 1345154 1350919 1357079 1361023
60511A361023R81j102k677m636o829q774j0603j2324j3207j2891j2236j2099j1939
60498A252687j0745q769p314p017p228p042o151m773l372k387j718o12J494M147
60484A191200O385P782Q614R318J0493J2976J7013K1474K4954K7672L1093L5437
60472A404411L9067M1286M4398N1257O1295P0783P7195Q1555Q5788Q9360Q9822
60461B136217Q5624P6889O3994M7266K8338J0372l785j3000j7259j6835j2596
60450B385225o303L38O538J1825J5151J5421J2726Q423L988K78k278l318k526
60437B445488K22M771J0690J7542K5221L3874M3483N3872O5005P6881Q9050J00832
60425B966931J12105J23194J33739J42425J48408J52399J55929J60189J66285
$$ plain form
60511 1361023 1362004 1360902 1358225 1353589 1346760 1337986 1327383 1315059 1301852 1288961 1276725 1264626 1252687
60498 1252687 1241942 1233173 1225859 1218842 1211614 1204572 1198421 1193648 1190276 1187889 1186171 1185559 1187053 1191200
60484 1191200 1197585 1205367 1213981 1223299 1233792 1246768 1263781 1285255 1310209 1337881 1368974 1404411
60472 1404411 1443478 1484764 1529162 1580419 1641714 1712497 1789692 1871247 1957035 2046395 2136217
60461 2136217 2221841 2298730 2362724 2409990 2438328 2448700 2444915 2431915 2414656 2397821 2385225
60450 2385225 2378922 2379260 2385798 2397623 2412774 2428195 2440921 2449344 2453332 2453610 2451332 2448014 2445488
60437 2445488 2445710 2450481 2461171 2478713 2503934 2537808 2581291 2635163 2700168 2777049 2866099 2966931
60425 2966931 3079036 3202230 3335969 3478394 3626802 3779201 3935130 4095319 4261604
60416D261604J76028J91548K14171K44094K80901L23838L71896M24011M78872
60407F966963N33831N84025O22638O41571O32003N86067N00124L77138K25712
60398A1670072N7382j14965k77589m17597n25735n98045o35518o43061o28166
60389G886778n98737n60888n18546m74576m31319l90144l51503l15831k83687
60380C961547k54964k28834k04941j83918j66136j50581j35774j21586j09370
60371B405443j00070r2736q5361p7053o8936o2759n9012n6736n4718n2298m9231
60360A646533m5642m2178l9373l6763l3454k9655k6589k4598k2683k0406j8816
60349A306376j8524j8271j6791j4933j4208j4188j3335j1835j1397j2281j2637
$$ plain form
60416 4261604 4437632 4629180 4843351 5087445 5368346 5692184 6064080 6488091 6966963
60407 6966963 7500794 8084819 8707457 9349028 9981031 10567098 11067222 11444360 11670072
60398 11670072 11727454 11612489 11334900 10917303 10391568 9793523 9158005 8514944 7886778
60389 7886778 7288041 6727153 6208607 5734031 5302712 4912568 4561065 4245234 3961547
60380 3961547 3706583 3477749 3272808 3088890 2922754 2772173 2636399 2514813 2405443
60371 2405443 2305373 2212637 2127276 2050223 1981287 1918528 1859516 1802780 1748062 1695764 1646533
60360 1646533 1600891 1558713 1519340 1482577 1449123 1419468 1392879 1368281 1345598 1325192 1306376
60349 1306376 1287852 1269581 1252790 1237857 1223649 1209461 1196126 1184291 1172894 1160613 1147976
60338A147976j1190q803o773n265m171l930m446m377k704k56J347J669J538J692
60324A102307K150K545K414J437k8r87r76q78k064m750p696r368r230p946o620
60309A060310n748m956l730k188q86j64j00o72j433j350J01J820K215J331P92
60294A045342J394K073J799J223J436K144K243J701J617K520L722M448M822N364
60280A081848O070O463O331O106O418P365Q240Q157P027N822N748P097Q987J0226
60266A181905J0336R744R131Q952R664J1769J4972J7584J7765J5567J2780J0503
60254A330672P916M057l67l982o662r213j1723j3528j4407j4531j3667j1789j0129
60241A232647r987j0560r637o680l538j752q46M6N89M13M68J758L531M089K938
$$ plain form
60338 1147976 1136786 1127983 1121210 1115945 1111774 1107844 1103398 1099021 1096317 1096061 1097408 1099077 1100615 1102307
60324 1102307 1104457 1107002 1109416 1110853 1110825 1109838 1108862 1107984 1105920 1101170 1093474 1084106 1074876 1066930 1060310
60309 1060310 1054562 1049606 1045876 1043688 1042802 1042638 1042538 1041866 1040433 1039083 1039184 1041004 1043219 1044550 1045342
60294 1045342 1046736 1048809 1050608 1051831 1053267 1055411 1057654 1059355 1060972 1063492 1067214 1071662 1076484 1081848
60280 1081848 1087918 1094381 1100712 1106818 1113236 1120601 1128841 1136998 1144025 1149847 1155595 1162692 1171679 1181905
60266 1181905 1192241 1201985 1211116 1220068 1229732 1241501 1256473 1274057 1291822 1307389 1320169 1330672
60254 1330672 1338588 1342645 1342278 1338296 1331634 1322421 1310698 1297170 1282763 1268232 1254565 1242776 1232647
60241 1232647 1222660 1212100 1202463 1195783 1192245 1190493 1189647 1189693 1190282 1190695 1191163 1192921 1196452 1200541 1203479
60226A203479J098l40j059j236j211j279j246n60O87J523J507J736L465O276Q529
60211A221369R447R716J0113J0519J0474R868Q859P746P311Q630J1958J6030J9034
60198A361074K0283K0644K1377K2939K5092K7664L0649L3787L6692L9551M3075
60187A682827M7540N2439N7338O2370O7482P2077P6074Q0530Q6237R2428R8005
60176B475347J03367J09617J16392J22151J26375J29645J31467J30131J25503
60167C569995J19937J15122J09374R9785Q6264P1837N9155M8073L6807K4432J1758
60156D352539J90r708j8276k5539l0579l2641l2226l0136k5768j7871p063L969
60144D126891J3399K2131L2044M3566N5830O8126Q0143R1553J02364J12907J22529
$$ plain form
60226 1203479 1204577 1204237 1203178 1201942 1200731 1199452 1198206 1197646 1198333 1199856 1201363 1203099 1206564 1212840 1221369
60211 1221369 1230816 1240532 1250645 1261164 1271638 1281506 1290365 1298111 1305422 1314052 1326010 1342040 1361074
60198 1361074 1381357 1402001 1423378 1446317 1471409 1499073 1529722 1563509 1600201 1639752 1682827
60187 1682827 1730367 1782806 1840144 1902514 1969996 2042073 2118147 2198677 2284914 2377342 2475347
60176 2475347 2578714 2688331 2804723 2926874 3053249 3182894 3314361 3444492 3569995
60167 3569995 3689932 3805054 3914428 4014213 4100477 4172314 4231469 4279542 4316349 4340781 4352539
60156 4352539 4352729 4343021 4324745 4299206 4268627 4235986 4203760 4173624 4147856 4129985 4122922 4126891
60144 4126891 4140290 4162421 4194465 4238031 4293861 4361987 4442130 4533683 4636047 4748954 4871483
60133D871483J29105J31006J28928J24621J18433J09364R7217Q3188O8278N2246
60123E913869L4531J5444l779k1776l7799n1957o4434p4334p9906q0532p7773
60112E471554p3543o7702n8535m5353k9582j3216K882J8919L5289N1999O8409
60101E361121Q3259R5195J03412J07597J07523J03116R4755Q2993O8209N1007
60091F258187L2814J5465K25j2442k2368k9501l4038l6076l5149l0594k2431j1465
60079F072627J391J5602L1126M8532O8684R1502J15198J37749J59228J81815K07178
60068G130632K34710K62815K90929L19266L47051L72288L93487M10655M24054
60059A0185887M32670M34587M28485M14146L91733L61455L23943K80183K30853
$$ plain form
60133 4871483 5000588 5131594 5260522 5385143 5503576 5612940 5710157 5793345 5861623 5913869
60123 5913869 5948400 5963844 5960065 5938289 5900490 5848533 5784099 5709765 5629859 5549327 5471554
60112 5471554 5398011 5330309 5271774 5226421 5196839 5183623 5186505 5205424 5240713 5292712 5361121
60101 5361121 5444380 5539575 5642987 5750584 5858107 5961223 6055978 6138971 6207180 6258187
60091 6258187 6291001 6306466 6306691 6294249 6271881 6242380 6208342 6172266 6137117 6106523 6084092 6072627
60079 6072627 6074018 6089620 6120746 6169278 6237962 6329464 6444662 6582411 6741639 6923454 7130632
60068 7130632 7365342 7628157 7919086 8238352 8585403 8957691 9351178 9761833 10185887
60059 10185887 10618557 11053144 11481629 11895775 12287508 12648963 12972906 13253089 13483942
60050A3483942J76329J17574N6255o308o9429j31723j90261k41888k84826l18373
60040A2591292l41837l54969l58762l54698l43461l25548l02455k75889k46153
60031I687520k12947j77559j42386j08291p4342m0593r206J7976M1062O0558P5931
60020I117723Q6873R4229R8174R6836Q8515P4260N6701L7187J5667p310l0465
60009I728390n3415p6647r9687j20735j38395j52714j64219j72854j78320j80846
59999H390558j81214j80094j77432j72516j65022j55900j46499j36673j24868
59990F950340j10432r4572p8211o0276l9652j7704K954K1721M0118N8719P5895
59979F748900Q9988J01108J09958J16031J17859J14525J06176R3566P7579N8879
$$ plain form
60050 13483942 13660271 13777845 13834100 13827792 13758363 13626640 13436379 13194491 12909665 12591292
60040 12591292 12249455 11894486 11535724 11181026 10837565 10512017 10209562 9933673 9687520
60031 9687520 9474573 9297014 9154628 9046337 8971995 8931402 8922196 8940172 8981234 9041792 9117723
60020 9117723 9204596 9298825 9396999 9493835 9582350 9656610 9713311 9750498 9766165 9758855 9728390
60009 9728390 9674975 9598328 9498641 9377906 9239511 9086797 8922578 8749724 8571404 8390558
59999 8390558 8209344 8029250 7851818 7679302 7514280 7358380 7211881 7075208 6950340
59990 6950340 6839908 6745336 6667125 6606849 6567197 6549493 6552447 6574168 6614286 6673005 6748900
59979 6748900 6838888 6939996 7049954 7165985 7283844 7398369 7504545 7598111 7675690 7734569
59969G734569L7760J4449j0247l5031n8950q1717j02889j21126j34775j43234
59959G098809j47418j48687j47479j43273j35721j25303j12738r8441q3027o7516
59949E889206n2175l5766j7259K092J9905L5848N2042O9971Q8679J06718J24109
59938F283370J41185J56768J68954J76915J80686J79776J73316J61330J45028
59929G767328J25862J04721Q1623N5991K7887r41k8179n3296p7321j00049j19142
59918G784484j32729j41103j44791j42923j35156j23632j10986r7578q2411o5586
59908F607589m7862k8974q701J1256K8857M4782O1488P9317R5770J08780J18685
59897G070987J26530J32300J35384J35372J31991J25473J17201J08786J00386
$$ plain form
59969 7734569 7772329 7786778 7776531 7741500 7682550 7600833 7497944 7376818 7242043 7098809
59959 7098809 6951391 6802704 6655225 6511952 6376231 6250928 6138190 6039749 5956722 5889206
59949 5889206 5837031 5801265 5784006 5786098 5806003 5841851 5893893 5963864 6052543 6159261 6283370
59938 6283370 6424555 6581323 6750277 6927192 7107878 7287654 7460970 7622300 7767328
59929 7767328 7893190 7997911 8079534 8135525 8163412 8162471 8134292 8080996 8003675 7903626 7784484
59918 7784484 7651755 7510652 7365861 7222938 7087782 6964150 6853164 6755586 6673175 6607589
59908 6607589 6559727 6530753 6522052 6533308 6562165 6606947 6668435 6747752 6843522 6952302 7070987
59897 7070987 7197517 7329817 7465201 7600573 7732564 7858037 7975238 8084024 8184410
59888H184410R1026Q0642P0597O2252N6198N2793N2289N4490N9602O9179Q4761
59877H918239J05617J29141J53736J80056K09397K42046K77140L12804L46280
59868A0874456L75022L97767M13667M20729M16126L97671L64056L14570K50298
59859A4224362J75053R3439Q497p7203j59054k31459k91246l38029l71604l91494
59849A2641262l99007l96978l87054l69498l45893l19290k90964k59737k25517
59840I647324j90917j57955j25594r2188n8336k5444O600L8176O7635R2424J11765
59829I313490J26622J37584J44027J44742J38137J22417R6848O2526K1389k4890
59819A0282892p4356j24043j70730k12070k46615k73686k93597l07033l13837
$$ plain form
59888 8184410 8275436 8356078 8426675 8488927 8545125 8597918 8650207 8704697 8764299 8833478 8918239
59877 8918239 9023856 9152997 9306733 9486789 9696186 9938232 10215372 10528176 10874456
59868 10874456 11249478 11647245 12060912 12481641 12897767 13295438 13659494 13974064 14224362
59859 14224362 14399415 14492854 14501351 14424148 14265094 14033635 13742389 13404360 13032756 12641262
59849 12641262 12242255 11845277 11458223 11088725 10742832 10423542 10132578 9872841 9647324
59840 9647324 9456407 9298452 9172858 9080670 9022334 8996890 9003490 9041666 9109301 9201725 9313490
59829 9313490 9440112 9577696 9721723 9866465 10004602 10127019 10223867 10286393 10307782 10282892
59819 10282892 10208536 10084493 9913763 9701693 9455078 9181392 8887795 8580762 8266925
59810H266925l13638l08030l00283k91875k80883k65142k45771k26014k07645
59801E827644j90092j72401j54501j36875j20238j05315r2049p9368o6745n5457
59791D654603m7316m2466l9470l7255l5951l5644l5306l3523l0079k6414k4190
59780D266989k3341k2183j9844j7888j8517k1795k6017l0467l6006m2769m9068
59769C959094n3328n5555n6263n5314n2697m9273m5848m2335l8405l3991k8772
59758C447313k2236j4760p453n27O904J4986K2685K9806L7896M8044N9069O8655
59746C690382P5203P8010P7257P4699P2909P2731P2733P1752P0206O7905O2704
59735D486491N3083M0759K8996J9505J2297P315M604L971N853J1471K0814L1793
$$ plain form
59810 8266925 7953287 7645257 7344974 7053099 6772216 6507074 6261303 6035289 5827644
59801 5827644 5637552 5465151 5310650 5173775 5053537 4948222 4856173 4776805 4710060 4654603
59791 4654603 4607287 4564821 4525351 4488096 4452145 4416501 4381195 4347672 4317593 4291179 4266989
59780 4266989 4243648 4221465 4201621 4183733 4165216 4143421 4117404 4086937 4050931 4008162 3959094
59769 3959094 3905766 3850211 3793948 3738634 3685937 3636664 3590816 3548481 3510076 3476085 3447313
59758 3447313 3425077 3410317 3402864 3402337 3409241 3424227 3446912 3476718 3514614 3562658 3621727 3690382
59746 3690382 3765585 3843595 3920852 3995551 4068460 4141191 4213924 4285676 4355882 4423787 4486491
59735 4486491 4539574 4580333 4609329 4628834 4641131 4648446 4653050 4657021 4662874 4674345 4695159 4726952
59723D726952M2775N4604O8619Q4260J00446J17829J37500J58757J80491K03725
59713E875958K30271K59497K88897L17252L44590L69131L86550L92267L82332
59704H846745L52318K98462K21408J27678K7227o9400j52284k13951k52163k70099
59694H915941k72932k64639k47947k25596k00355j74237j48211j22363r6262o9774
59684G093625m3625j8766M627K6876M7984O7916Q7459J07837J29421J51594J73744
59673G828692J95872K18467K42471K68887K97658L27422L57300L88350M22275
59664A0547394M59109M97314N35832N74949O15248O56550O97683P36561P70876
59655A6091516P99311Q21409Q35454Q37829Q26153Q02633P72872P41698P11504
$$ plain form
59723 4726952 4769727 4824331 4892950 4977210 5077656 5195485 5332985 5491742 5672233 5875958
59713 5875958 6106229 6365726 6654623 6971875 7316465 7685596 8072146 8464413 8846745
59704 8846745 9199063 9497525 9718933 9846611 9873838 9804438 9652154 9438203 9186040 8915941
59694 8915941 8643009 8378370 8130423 7904827 7704472 7530235 7382024 7259661 7163399 7093625
59684 7093625 7050000 7031234 7035861 7062737 7110721 7178637 7266096 7373933 7503354 7654948 7828692
59673 7828692 8024564 8243031 8485502 8754389 9052047 9379469 9736769 10125119 10547394
59664 10547394 11006503 11503817 12039649 12614598 13229846 13886396 14584079 15320640 16091516
59655 16091516 16890827 17712236 18547690 19385519 20211672 21014305 21787177 22528875 23240379
59646B3240379O83918O61094O44910O36178O34662O38660O44319O46499O40820
59637B9071439O24596N96259N54835M99876M31435L50740K61539J69968Q1897
59628C2642584R86p0083j27860j69270j93663k02078j95321j74211j40614r6168
59618C1274302m0767K5479R9525J77206K57552L42662M32990N25113O14590O98473
59608C4407125P74079Q37191Q82594R04921Q98280Q56693P76180O55883M97255
59599D1490201L03925Q3263j53103l91141o16648q16650r81172j105137j188168
59590C6625370j232602j242494j223797j183323j126926j059843r88513r20281
59582B7647591q61361q16983p92990p93936q18080q56350q97452r32703r55818
$$ plain form
59646 23240379 23924297 24585391 25230301 25866479 26501141 27139801 27784120 28430619 29071439
59637 29071439 29696035 30292294 30847129 31347005 31778440 32129180 32390719 32560687 32642584
59628 32642584 32643570 32573487 32445627 32276357 32082694 31880616 31685295 31511084 31370470 31274302
59618 31274302 31233535 31259014 31358539 31535745 31793297 32135959 32568949 33094062 33708652 34407125
59608 34407125 35181204 36018395 36900989 37805910 38704190 39560883 40337063 40992946 41490201
59599 41490201 41794126 41877389 41724286 41333145 40716497 39899847 38918675 37813538 36625370
59590 36625370 35392768 34150274 32926477 31743154 30616228 29556385 28567872 27647591
59582 27647591 26786230 25969247 25176257 24382321 23564241 22707891 21810439 20877736 19921918
59573A9921918r61688r48285r18530q77994q31018p79977p26805o73443o21360
59564A2582818n71935n26648m85776m47705m10697l74746l40854l09470k80728
59555H834259k55225k33174k13428j94674j77142j62057j49818j39804j31583
59546G177354j25288j21089j19120j19627j22316j25826j28604j30119j30788
59537F054577j31020j30816j29827j27421j23206j17842j12470j06967r9856r0662
59527D884490q1188p3331o6498n8667m9314l9852l1376k3493j5606q020j317M598
59515D440426J0209J5659K0737K5361K9700L3728L6944L8885L9976M1505M4319
59504D777449M7988N1829N6385O2788P0880P9233Q7202R5650J05249J15530J26287
$$ plain form
59573 19921918 18960230 18011945 17093415 16215421 15384403 14604426 13877621 13204178 12582818
59564 12582818 12010883 11484235 10998459 10550754 10140057 9765311 9424457 9114987 8834259
59555 8834259 8579034 8345860 8132432 7937758 7760616 7598559 7448741 7308937 7177354
59546 7177354 7052066 6930977 6811857 6692230 6569914 6444088 6315484 6185365 6054577
59537 6054577 5923557 5792741 5662914 5535493 5412287 5294445 5181975 5075008 4975152 4884490
59527 4884490 4803302 4729971 4663473 4604806 4555492 4515640 4484264 4460771 4445165 4437145 4435828 4440426
59515 4440426 4450635 4466294 4487031 4512392 4542092 4575820 4612764 4651649 4691625 4733130 4777449
59504 4777449 4825437 4877266 4933651 4996439 5067319 5146552 5233754 5329404 5434653 5550183 5676470
59493E676470J38604J53227J68936J83865J97844K12161K27540K43532K59573
59484G461752K75295K89765L01528L09676L14104L14700L11146L03517K92272
59475A0173755K77475K59022K37909K16256J95033J72328J45005J12469P8061
59466A1867313M6413J9932j608j8665l0329l5420l4100k7531j6434p49J9509M3809
59454A1832140P1419J01370J31920J60499J84112J99542K03603J94220J71325
59445A3250150J36228R0255L4726k8027r4680j62183k28142k89778l43444l85818
59435A1979287m15273m31953m37003m31998m18738l99213l75524l49407l21550
59426H398628k91958k61375k31663k04164j78411j53351j29009j05784q2953n9577
$$ plain form
59493 5676470 5815074 5968301 6137237 6321102 6518946 6731107 6958647 7202179 7461752
59484 7461752 7737047 8026812 8328340 8638016 8952120 9266820 9577966 9881483 10173755
59475 10173755 10451230 10710252 10948161 11164417 11359450 11531778 11676783 11789252 11867313
59466 11867313 11913726 11933658 11932050 11913385 11883056 11847636 11813536 11786005 11769571 11768822 11788331 11832140
59454 11832140 11903559 12004929 12136849 12297348 12481460 12681002 12884605 13078825 13250150
59445 13250150 13386378 13476633 13511359 13483332 13388652 13226469 12998327 12708549 12365105 11979287
59435 11979287 11564014 11132061 10695058 10263060 9844322 9445109 9069585 8720178 8398628
59426 8398628 8106670 7845295 7613632 7409468 7231057 7077706 6948697 6842913 6759960 6700383
59416F700383l6364j4848N081K5084M6016O7488Q9697J13340J37377J59137J77451
59405G469842J93646K08482K20158K26598K27791K24336K15351J99519J76796
59396I362519J47311J09989O4496J3754l7536q6479j32388j74347k10693k40836
59386H815790k65475k84436k96159l00179k98604k94047k87041k76603k62777
59377F250469k47350k32024k16972k01632j86340j72341j60169j48814j36980
59368D547847j24655j12810j01839r1252q0888p1444o3387n6096m8600m0729l2983
59357C723164k5683j8689j1822n102J330P379J2931J7787K1925K6071L1433L7823
59345C818547M2146M0545L3161K5412K3025K6656L2910L9532M7233N6990O8200
$$ plain form
59416 6700383 6664019 6649171 6654252 6679336 6725352 6792840 6882537 6995877 7133254 7292391 7469842
59405 7469842 7663488 7871970 8092128 8318726 8546517 8770853 8986204 9185723 9362519
59396 9362519 9509830 9619819 9684315 9698069 9660533 9574054 9441666 9267319 9056626 8815790
59386 8815790 8550315 8265879 7969720 7669541 7370937 7076890 6789849 6513246 6250469
59377 6250469 6003119 5771095 5554123 5352491 5166151 4993810 4833641 4684827 4547847
59368 4547847 4423192 4310382 4208543 4117291 4036403 3964959 3901572 3845476 3796876 3756147 3723164
59357 3723164 3697481 3678792 3666970 3661868 3663198 3670577 3683508 3701295 3723220 3749291 3780724 3818547
59345 3818547 3860693 3901238 3934399 3959811 3982836 4009492 4042402 4081934 4129167 4186157 4254357
59334D254357P9776R0628R8530J01093R9213R7787J01530J11171J24410J38997
59324E297492J53765J68435J84099K03007K26429K53176K81079L09260L38243
59315G414985L68826M01627M36958M74347N12721N51267N89007O23457O51252
59306A2024447O70535O81097O81750O69959O45427O11951N73994N33039M89110
59297A7581309M44161M01385L61930L24565K88134K52428K16729J79222J37995
59288B0187858R1693L9485j8562q1313j47454k15811k83993l47866m03810m50859
59278A8369368m89531n19491n39837n50922n54243n50816n40896n24859n03274
59269A3595499m76630m46079m13864l81880l50382l18978k88133k58620k30667
$$ plain form
59334 4254357 4334133 4424761 4523291 4624384 4723597 4821384 4922914 5034085 5158495 5297492
59324 5297492 5451257 5619692 5803791 6006798 6233227 6486403 6767482 7076742 7414985
59315 7414985 7783811 8185438 8622396 9096743 9609464 10160731 10749738 11373195 12024447
59306 12024447 12694982 13376079 14057829 14727788 15373215 15985166 16559160 17092199 17581309
59297 17581309 18025470 18426855 18788785 19113350 19401484 19653912 19870641 20049863 20187858
59288 20187858 20279551 20319036 20300474 20219161 20071707 19855896 19571903 19224037 18820227 18369368
59278 18369368 17879837 17360346 16820509 16269587 15715344 15164528 14623632 14098773 13595499
59269 13595499 13118869 12672790 12258926 11877046 11526664 11207686 10919553 10660933 10430266
59260A0430266k04820j82490j64134j48122j33128j20547j12561j08763j06832
59251I148869j05768j06312j08668j12083j16230j20778j24001j24253j22563
59242H108213j21307j20384j17268j11003j03370r5673q7219p7881o9352o2315
59232G142441n4664m4379l2357k0687r687J492J2708K3382L4376M7212O1737P6313
59220G237887R0252J04418J19342J34114J47625J59871J71376J82063J91209J98079
59210H736236K01966K01769J96226J84829J68241J47422J22432R2578N7932K0350
59200A0129981j7348n3003q5746j15193j40514j60496j74803j85355j95962k09543
59190H792018k25284k39099k47150k48450k44053k34974k21838k05754j88431
$$ plain form
59260 10430266 10225446 10042956 9878822 9730700 9597572 9477025 9364464 9255701 9148869
59251 9148869 9043101 8936789 8828121 8716038 8599808 8479030 8355029 8230776 8108213
59242 8108213 7986906 7866522 7749254 7638251 7534881 7439208 7351989 7274108 7204756 7142441
59232 7142441 7087777 7043398 7011041 6990354 6980667 6982159 6994867 7018249 7052625 7099837 7161574 7237887
59220 7237887 7328139 7432557 7551899 7686013 7833638 7993509 8164885 8346948 8538157 8736236
59210 8736236 8938202 9139971 9336197 9521026 9689267 9836689 9959121 10051699 10109631 10129981
59200 10129981 10112633 10059630 9973884 9858691 9718177 9557681 9382878 9197523 9001561 8792018
59190 8792018 8566734 8327635 8080485 7832035 7587982 7353008 7131170 6925416 6736985
59181F736985j71328j55019j39065j22381j04467q6544p0560n6765m3304k8608
59171E758944j2963L014J9830L7844N5963P3270R1035J11321J34270J58509J83627
59160F614664K10440K39005K68238K97495L26894L55755L82118M04030M20038
59151I518677M28191M25811M10739L82023L39360K82997K14557J37240N4835k9103
59141A2165327j11361j89017k59227l18606l63601l92511m06877m09955m04147
59132I310025l90777l71618l48937l24068k97318k69520k42511k17804j95528
59123F651944j74870j54971j35507j17031j00576q6272p2758n8708m4395l1036
59113E675820j9235r062q33N630J1928J9667K8247L5508M0471M4042M7057M9024
$$ plain form
59181 6736985 6565657 6410638 6271573 6149192 6044725 5958181 5887621 5830856 5787552 5758944
59171 5758944 5745981 5748995 5768825 5806669 5862632 5935902 6026937 6138258 6272528 6431037 6614664
59160 6614664 6825104 7064109 7332347 7629842 7956736 8312491 8694609 9098639 9518677
59151 9518677 9946868 10372679 10783418 11165441 11504801 11787798 12002355 12139595 12194430 12165327
59141 12165327 12053966 11864949 11605722 11287116 10923515 10531004 10124127 9714172 9310025
59132 9310025 8919248 8547630 8198693 7874625 7577307 7307787 7065276 6847472 6651944
59123 6651944 6477074 6322103 6186596 6069565 5968989 5882717 5809959 5751251 5706856 5675820
59113 5675820 5656585 5647523 5646690 5652320 5664248 5683915 5712162 5747670 5788141 5832183 5879240 5928264
59101E928264M9078M6948M2819L7098L0421K3096J4666M840n449j4918k3581l2470
59089F100812m1898n0973n8546o3690o5758o5140o3622o2748o2064n9981n5944
59078E450448n0576m4154l6379k7493j8406r818k059M685J0988J8291K7292L6880
59066E359699M5736N4073O2537P0747P8578Q7622R9098J11320J21559J29679J37486
59055F358134J45277J51735J56803J61690J66095J68194J67665J66077J63903
59046G805573J59733J52927J44659J35832J26296J16612J08140J00785R2887Q3952
59036I027396P5061O5999N4312L7888J6199j1364m5490q4318j23674j61210j97747
59025H653052k33218k64113k86884l01592l10247l13482l11001l03509k92269
$$ plain form
59101 5928264 5977342 6024290 6067109 6104207 6134628 6157724 6172390 6177230 6171781 6156863 6133282 6100812
59089 6100812 6058914 6007941 5949395 5885705 5819947 5754807 5691185 5628437 5566373 5506392 5450448
59078 5450448 5399872 5355718 5319339 5291846 5273440 5263622 5261563 5266248 5277236 5295527 5322819 5359699
59066 5359699 5405435 5459508 5522045 5592792 5671370 5758992 5858090 5969410 6090969 6220648 6358134
59055 6358134 6503411 6655146 6811949 6973639 7139734 7307928 7475593 7641670 7805573
59046 7805573 7965306 8118233 8262892 8398724 8525020 8641632 8749772 8850557 8943444 9027396
59036 9027396 9102457 9168456 9222768 9260656 9276855 9265491 9220001 9135683 9012009 8850799 8653052
59025 8653052 8419834 8155721 7868837 7567245 7256998 6943516 6632515 6329006 6036737
59016F036737k78071k62341k47607k35012k22725k08646j93443j79203j66372
59007D043317j53975j41937j31243j22316j14759j08212j02346r6499r0358q4380
58997B897292p8703p2576o5641n8834n3204m8788m5300m2803m0989l9076l7070
58986B314308l5778l4926l2989k9654k6663k5123k3924k1949j9877j8147j5193
58975B030085r844l894n4J542K703M092M910M998N194N891O834Q011R318R928
58961B079714R293Q187P578P147O212N241M960M766L658K171J749K514L138K763
58947B149091J839J342K068M159O450O940N070K708J742J396o60n195j0717j5353
58933B150880j8150j8932j8335j7679j7668j7423j5688j2574r230o359m025k308
$$ plain form
59016 6036737 5758666 5496325 5248718 5013706 4790981 4582335 4388892 4209689 4043317
59007 4043317 3889342 3747405 3616162 3493846 3379087 3270875 3168529 3072030 2981672 2897292
58997 2897292 2818589 2746013 2680372 2621538 2568334 2519546 2474246 2431443 2390454 2351378 2314308
58986 2314308 2278530 2243604 2210615 2180961 2154298 2129175 2105251 2083302 2063425 2045278 2030085
58975 2030085 2020241 2016347 2016293 2017835 2020538 2024630 2029540 2034538 2039732 2045623 2052457 2060468 2069786 2079714
58961 2079714 2089007 2097194 2104772 2111919 2118131 2123372 2128332 2133098 2136756 2138927 2140676 2143190 2146328 2149091
58947 2149091 2150930 2152272 2154340 2158499 2164949 2171889 2176959 2179667 2181409 2182805 2182145 2176950 2166233 2150880
58933 2150880 2132730 2113798 2095463 2077784 2060116 2042693 2027005 2014431 2005201 1998842 1994817 1992509
58921A992509j046N15K714M762O088P662J0720J4644J7611J8987J9787K0929K2364
58908B138246K3925K5883K8400L1129L3573L5394L6455L6818L6562L5507L3625
58897B495517L1823L1341L2170L3008L3257L3914L5953L8973M2177M5488M8980
58886B902601N2273N5445N9346O4137O8697P2455P6516Q1797Q7392R2197R7088
58875C709944J03802J12423J21558J30427J39439J49069J59364J70234J81259
58866D977519J91694K01669K12726K26258K42016K58978K76949K96299L16891
58857G200999L38425L61335L86444M13987M43569M74513N05984N37554N70024
58848A1232834O04462O40019O73889P03718P28456P46412P54532P50576P33919
$$ plain form
58921 1992509 1991463 1991978 1994692 1999454 2005542 2013204 2023924 2038568 2056179 2075166 2094953 2115882 2138246
58908 2138246 2162171 2188054 2216454 2247583 2281156 2316550 2353005 2389823 2426385 2461892 2495517
58897 2495517 2527340 2558681 2590851 2623859 2657116 2691030 2726983 2765956 2808133 2853621 2902601
58886 2902601 2954874 3010319 3069665 3133802 3202499 3274954 3351470 3433267 3520659 3612856 3709944
58875 3709944 3813746 3926169 4047727 4178154 4317593 4466662 4626026 4796260 4977519
58866 4977519 5169213 5370882 5583608 5809866 6051882 6310860 6587809 6884108 7200999
58857 7200999 7539424 7900759 8287203 8701190 9144759 9619272 10125256 10662810 11232834
58848 11232834 11837296 12477315 13151204 13854922 14583378 15329790 16084322 16834898 17568817
58839A7568817P03123O54820N86763N00236L98030K82131J55557K4372j04689
58830B0769160k27574l41731m43158n27376n92693o40168o71138o86937o90313
58821A5948072o84436o70736o49723o23538n95440n66933n37460n06974m77006
58812A0635826m49019m23170l98852l75348l52196l29902l09748k91995k75062
58803G430534k57581k40219k24190k09232j94563j80654j68262j56801j45522
58794E653510j35135j26229j17265j06429r4675q4551p6610o9104o0688n1300
58784D731524m1057l0494k1296j4408p874J095J2282K3055L2405M1788N2002O1952
58772D840974P0969Q0005Q9808R9849J09770J20453J32899J47022J61821J76080
$$ plain form
58839 17568817 18271940 18926760 19513523 20013759 20411789 20693920 20849477 20873849 20769160
58830 20769160 20541586 20199855 19756697 19229321 18636628 17996460 17325322 16638385 15948072
58821 15948072 15263636 14592900 13943177 13319639 12724199 12157266 11619806 11112832 10635826
58812 10635826 10186807 9763637 9364785 8989437 8637241 8307339 7997591 7705596 7430534
58803 7430534 7172953 6932734 6708544 6499312 6304749 6124095 5955833 5799032 5653510
58794 5653510 5518375 5392146 5274881 5168452 5073777 4989226 4912616 4843512 4782824 4731524
58784 4731524 4690467 4659973 4638677 4624269 4616395 4617490 4629772 4652827 4685232 4727020 4779022 4840974
58772 4840974 4911943 4991948 5081756 5181605 5291375 5411828 5544727 5691749 5853570 6029650
58762F029650J89255K02470K17777K35427K53095K69349K86416L07314L31572
58753H322325L56375L81140M07944M37766M69216N01216N34234N68326O02175
58744A2580717O34526O64673O90991P10615P20825P19411P03844O71749O22075
58735A8719426N54461M68148L63668K45079J18501j1255j40655k64829l77823
58726A9674721m75642n56889o20581o65838o93902p08130p11365p04958o90231
58717A3847185o68960o42437o11960n79996n48862n18592m88295m59064m32985
58708H896034m09675l86606l62981l40522l20325l01532k83475k66462k50109
58699E974347k33434k17054k02863j91025j79662j67792j56184j45026j33387
$$ plain form
58762 6029650 6218905 6421375 6639152 6874579 7127674 7397023 7683439 7990753 8322325
58753 8322325 8678700 9059840 9467784 9905550 10374766 10875982 11410216 11978542 12580717
58744 12580717 13215243 13879916 14570907 15281522 16002347 16721758 17425602 18097351 18719426
58735 18719426 19273887 19742035 20105703 20350782 20469283 20458028 20317373 20052544 19674721
58726 19674721 19199079 18642190 18021609 17355771 16661869 15953739 15242374 14537416 13847185
58717 13847185 13178225 12535788 11923828 11343832 10794970 10276378 9788083 9329019 8896034
58708 8896034 8486359 8099753 7736772 7396250 7075925 6774393 6490918 6224456 5974347
58699 5974347 5740913 5523859 5320996 5129971 4950309 4782517 4626333 4481307 4347920
58690D347920j21503j11061j02606r4949q7524q0936p4798o7699n9778n2829m7393
58679C446844m2367l7808l5238l4625l4120l3550l4936l8529m1492m2089m2061
58668C030029m3194m4347m4011m3218m3647m4803m5301m5367m6101m7493m8902
58657B533645n0423n2345n4246n5680n6750n7226n6354n4329n2579n1836n1176
58646A940701m9548m6953m3818m0565l7972l6479l5028l2311k8998k6736k5275
58635A537018k3097k0663k0057k1244k1756k0631j9550j9319j8535j6699j5406
58624A320061j5061j3667j0374p184n426l556l42K710M154N229P402R784J1041
58611A304771J1522J1477R637N818K578J844K129J406M84Q38J333Q5k090l249
$$ plain form
58690 4347920 4226417 4115356 4012750 3917801 3830277 3749341 3674543 3606844 3547066 3494237 3446844
58679 3446844 3404477 3366669 3331431 3296806 3262686 3229136 3194200 3155671 3114179 3072090 3030029
58668 3030029 2986835 2942488 2898477 2855259 2811612 2766809 2721508 2676141 2630040 2582547 2533645
58657 2533645 2483222 2430877 2376631 2320951 2264201 2206975 2150621 2096292 2043713 1991877 1940701
58646 1940701 1891153 1844200 1800382 1759817 1721845 1685366 1650338 1618027 1589029 1562293 1537018
58635 1537018 1513921 1493258 1473201 1451957 1430201 1409570 1390020 1370701 1352166 1335467 1320061
58624 1320061 1305000 1291333 1280959 1273775 1268349 1264793 1264451 1267161 1271315 1276544 1283946 1293730 1304771
58611 1304771 1316293 1327770 1337407 1343225 1345803 1347647 1349776 1351182 1351666 1352504 1353837 1353922 1351832 1348583
58597A348583l913n989r041j0755j0580j0155j0215r599p614n341m147m090m046
58584A253098k618Q44N409R234J1543J3272J5321J7321J8806K0353K2724K5784
58572A411091K9052L2381L5516L7992L9935M2000M4397M7056N0532N5204O0013
58561A885169O3938O8299P5017Q2907Q8952R3432J00230J11163J23548J34711
58551B827366J45348J56653J67567J77157J86667J96686K04959K09443K10979
58542D482825K10330K05004J91843J70729J43088J08958O8671K5694j5540n3670
58532E537932q9422j21541j46763j63723j74389j81356j85260j85067j79917j70668
58522C939826j59815j49272j38457j25953j12709j01332r2140q2721p2134o2586
$$ plain form
58597 1348583 1344670 1338681 1329640 1318885 1308305 1298150 1287935 1278336 1270722 1265381 1261234 1257144 1253098
58584 1253098 1250480 1251324 1256733 1265967 1277510 1290782 1306103 1323424 1342230 1362583 1385307 1411091
58572 1411091 1440143 1472524 1508040 1546032 1585967 1627967 1672364 1719420 1769952 1825156 1885169
58561 1885169 1949107 2017406 2092423 2175330 2264282 2357714 2457944 2569107 2692655 2827366
58551 2827366 2972714 3129367 3296934 3474091 3660758 3857444 4062403 4271846 4482825
58542 4482825 4693155 4898159 5090002 5260731 5403819 5512777 5581448 5607142 5591602 5537932
58532 5537932 5448510 5326969 5180206 5016483 4842094 4660738 4475478 4290411 4110494 3939826
58522 3939826 3780011 3630739 3492282 3366329 3253620 3152288 3060148 2977427 2905293 2842707
58512B842707n5851n0852m6237m2429l9580l6128l1356k6855k3801k1154j8194
58501B450270j6094j5409j4818j4202j6008k1504k8601l5323m2269m9362n3781
58490B142899n4067n3193n4279n6000n5424n2740m9869m6851m3056l9739l7874
58479A599807l5609l1224k6755k5193k5890k5929k4445k2537k0604j8743j8030
58468A324848j8508j7811j4582j1146j0014j0146r729r910j2082j4096j3381j1621
58456A171822j2045j3921j3988j1878r802q205n997l912l473l538j929M01P86
58443A084321m93q41J56Q66J474L676O999R243J0273J1802J3700J4170J3330J3203
58429A181879J4295J5287J5791J6434J6515J4546J0762O579K346j898m747n485
$$ plain form
58512 2842707 2786856 2736004 2689767 2647338 2607758 2571630 2540274 2513419 2489618 2468464 2450270
58501 2450270 2434176 2418767 2403949 2389747 2373739 2352235 2323634 2288311 2246042 2196680 2142899
58490 2142899 2088832 2035639 1981360 1925360 1869936 1817196 1767327 1720476 1677420 1637681 1599807
58479 1599807 1564198 1532974 1506219 1481026 1455136 1429207 1404762 1382225 1361621 1342878 1324848
58468 1324848 1306340 1288529 1273947 1262801 1252787 1242641 1232912 1223002 1210920 1196824 1183443 1171822
58456 1171822 1159777 1145856 1131868 1119990 1110188 1101983 1095986 1092074 1088601 1085063 1083134 1083535 1084321
58443 1084321 1083828 1082987 1083143 1084009 1085483 1089159 1096158 1105401 1115674 1127476 1141176 1155346 1168676 1181879
58429 1181879 1196174 1211461 1227252 1243686 1260201 1274747 1285509 1292088 1294434 1292536 1287789 1282304
58417A282304o445j0106j5042j7953j8358j8046j7332j5621j4351j5422j7583
58406A116045j8068j6773j5291j3204r470o222o556r234j0018p945n957n498m801
58393I87008k775o40P73K003L021L327L797N579P617Q187Q123R319J1051J1082
58379A057472R624Q830R266J0185J2042J5205J7564J7229J6170J7040J7985J5213
58367A223825R408M646J801j816o578r522r534q953r445j0135j0143r477p575
58354A156502m302j805j914k726j433R85K061L099P070J2612J5466J5153J4857
58341A215625J5337J4406J2029J0409R059N282k95l962m974o193q431r278p923
58328A241091o272m993l234k243m043o474m880Q89O228Q831J0721J2953J3727
$$ plain form
58417 1282304 1275859 1265753 1250711 1232758 1214400 1196354 1179022 1163401 1149050 1133628 1116045
58406 1116045 1097977 1081204 1065913 1052709 1043239 1037017 1030461 1021227 1011209 1003264 997307 991809 987008
58393 987008 984233 983593 984366 986369 989390 992717 996514 1002093 1009710 1017897 1026020 1035339 1046390 1057472
58379 1057472 1067096 1075926 1085192 1095377 1107419 1122624 1140188 1157417 1173587 1190627 1208612 1223825
58367 1223825 1233233 1237879 1239680 1237864 1231286 1221764 1212230 1203277 1193832 1183697 1173554 1164077 1156502
58354 1156502 1152200 1150395 1148481 1145755 1144322 1145307 1147368 1150467 1157537 1170149 1185615 1200768 1215625
58341 1215625 1230962 1245368 1257397 1267806 1276865 1282147 1281852 1277890 1272916 1266723 1258292 1249014 1241091
58328 1241091 1234819 1229826 1226592 1224349 1220306 1213832 1208952 1209841 1216069 1224900 1235621 1248574 1262301
58315A262301J2647J1807J1795J1029R477Q724Q406P165O515Q765J1886J2044
58303A382561J0475J1692J5399J6767J4859J3890J5591J6974J6727J7297J9386
58292A551618K0390J9551J8993J8868J7249J5267J6174J8833J8540J4895J2210
58281A742588J1631R908O636N369O264N168J760J146N253R611J1025J1636J3270
58268A841265J4415J5131J8296K3580K6513K5851K5685K8233L0719L1288L1741
58257B112717L2658L2065L0527L1324L4284L5868L6040L8076M1024M0138L5709
58246B500430L3180L3340L1021K5089K0808K0268J9437J7034J7401K1800K5614
58235B765422K6949K9320L3340L4675L2955L3555L7882M1125M2104M5562N1918
$$ plain form
58315 1262301 1274948 1286755 1298550 1309579 1319056 1327780 1336186 1343351 1349866 1358631 1370517 1382561
58303 1382561 1393036 1404728 1420127 1436894 1451753 1465643 1481234 1498208 1514935 1532232 1551618
58292 1551618 1572008 1591559 1610552 1629420 1646669 1661936 1678110 1696943 1715483 1730378 1742588
58281 1742588 1754219 1764127 1770763 1776132 1782396 1787564 1789324 1790470 1795723 1805334 1816359 1827995 1841265
58268 1841265 1855680 1870811 1889107 1912687 1939200 1965051 1990736 2018969 2049688 2080976 2112717
58257 2112717 2145375 2177440 2207967 2239291 2273575 2309443 2345483 2383559 2424583 2464721 2500430
58246 2500430 2533610 2566950 2597971 2623060 2643868 2664136 2683573 2700607 2718008 2739808 2765422
58235 2765422 2792371 2821691 2855031 2889706 2922661 2956216 2994098 3035223 3077327 3122889 3174807
58224C174807N5140N4034N5055O0394O4096O4112O6881P5135Q2117Q3411Q4045
58213C919227Q8235R2446R4196R7409J03250J05698J02096R8345R8262R7762R4672
58202D991598R3733R6596R7670R5366R6546J04396J13016J19110J27271J38541
58192F073843J46390J49659J56553J69909J81949J89441J99842K16055K30345
58183G713986K40379K55509K79054L00558L14431L30018L53735L78016L98132
58174A0563818M23044M58436M95742N29387N68175O18175O71644P24425P85976
58165A5838822Q59978R34097J001819J074843J160748J249394J335477J432150
58157B4887328J546928J667030J784743J912982K058763K207733K354135K518467
$$ plain form
58224 3174807 3229947 3283981 3339036 3399430 3463526 3527638 3594519 3669654 3751771 3835182 3919227
58213 3919227 4007462 4099908 4194104 4291513 4394763 4500461 4602557 4700902 4799164 4896926 4991598
58202 4991598 5085331 5181927 5279597 5374963 5471509 5575905 5688921 5808031 5935302 6073843
58192 6073843 6220233 6369892 6526445 6696354 6878303 7067744 7267586 7483641 7713986
58183 7713986 7954365 8209874 8488928 8789486 9103917 9433935 9787670 10165686 10563818
58174 10563818 10986862 11445298 11941040 12470427 13038602 13656777 14328421 15052846 15838822
58165 15838822 16698800 17632897 18634716 19709559 20870307 22119701 23455178 24887328
58157 24887328 26434256 28101286 29886029 31799011 33857774 36065507 38419642 40938109
58149D0938109K714625K928708L153087L410776L721431M076117M472676M940891
58141G0356420N503775O153368O898683P796180Q896241J0204046J1728227J3506595
58133A41043535J5536007J7755157K0178515K2983576K6373403L0384387L4810549
58126C09065129L9024843M1582008M0234954L3076741K0227490M370845j0673686
58119D76908324k2107847k9161147l2518591l3267271l2350228l0497425k8217321
58112B68788494k5779737k3305307k0886276j8603823j6492612j4559575j2821894
58105A36339270j1290904r944216q749976p701480o801247o029534n355019m763259
58097G5703635m252137l808961l410829l041323k692341k353726k012777j663140
$$ plain form
58149 40938109 43652734 46581442 49734529 53145305 56866736 60942853 65415529 70356420
58141 70356420 75860195 82013563 88912246 96708426 105604667 115808713 127536940 141043535
58133 141043535 156579542 174334699 194513214 217496790 243870193 274254580 309065129
58126 309065129 348089972 389671980 429906934 462983675 483211165 487582010 476908324
58119 476908324 454800477 425639330 393120739 359853468 327503240 297005815 268788494
58112 268788494 243008757 219703450 198817174 180213351 163720739 149161164 136339270
58105 136339270 125048366 115104150 106354174 98652694 91851447 85821913 80466894 75703635
58097 75703635 71451498 67642537 64231708 61190385 58498044 56144318 54131541 52468401
58089E2468401j306276r41569n57729j39271L15857P92287J278807J785808K335621
58080E6031936K962057L734201M701254N686068O135814N367397L148124L5732
58072H7802583k956678n061213o122683o399514o198042n733116n166370m612115
58064D5552852m107084l642325l221952k859857k546667k263196k011175j798143
58056B3102453j609532j427478j261864j132996j036515r52505q76702q16555
58048A3988306p67519p18414o71731o35959o05614n69128n28738m93526m60716
58039H536961m22312l82757l52323l29809l08174k90168k81997k78101k68022
58030E623298k52820k40364k30284k17356k03702j94251j85899j73772j62139
$$ plain form
58089 52468401 51162125 50220556 49662827 49523556 49839413 50631700 51910507 53696315 56031936
58080 56031936 58993993 62728194 67429448 73115516 79251330 84618727 87766851 87802583
58072 87802583 84845905 79784692 73662009 67262495 61064453 55331337 50164967 45552852
58064 45552852 41445768 37803443 34581491 31721634 29174967 26911771 24900596 23102453
58056 23102453 21492921 20065443 18803579 17670583 16634068 15681563 14804861 13988306
58048 13988306 13220787 12502373 11830642 11194683 10589069 10019941 9491203 8997677 8536961
58039 8536961 8114649 7731892 7379569 7049760 6741586 6451418 6169421 5891320 5623298
58030 5623298 5370478 5130114 4899830 4682474 4478772 4284521 4098622 3924850 3762711
58021C762711j56891j53596j45054j34066j26781j20407j09769r9156r5057r3633
58011B528301q7877q0770p8734p8379p2778o5091o2829o3710o0246n3698n0614
58000A773575m9774m5316l9071l7355l8764l7142l3550l3613l6026l5183l2395
57989A355386l3042l5262l2792k6764k3545k2936j9605j4423j3386j6343j7250
57978A100038j4864j3477j3875j2842j0740j0582j0827p860m199n363r886j1398
57966I74125r381q876j0524j0003o922n537o726p255o725p568q680o651k869j945
57952H74463l615l508j206l08j121n61J244J263l6N51K518K556J121J534L479
57937H78374L856L015L664M804L324L17o99k98j350k558q41J736P79k547l825
$$ plain form
58021 3762711 3605820 3452224 3307170 3173104 3046323 2925916 2816147 2716991 2621934 2528301
58011 2528301 2440424 2359654 2280920 2202541 2129763 2064672 2001843 1938133 1877887 1824189 1773575
58000 1773575 1723801 1678485 1639414 1602059 1563295 1526153 1492603 1458990 1422964 1387781 1355386
57989 1355386 1322344 1287082 1254290 1227526 1203981 1181045 1161440 1147017 1133631 1117288 1100038
57978 1100038 1085174 1071697 1057822 1044980 1034240 1023658 1012831 1004971 1000772 995409 985523 974125
57966 974125 964744 955868 945344 935341 928419 922882 916156 908901 902176 894608 885928 879277 876408 874463
57952 874463 870848 867340 866134 865826 864705 864144 865388 866651 866615 867166 869684 872240 873361 874895 878374
57937 878374 882230 885245 888909 893713 897037 897354 896655 896357 895007 892449 891608 893344 894123 891576 887751
57922H87751l819o529j0620j1283r405j0080j2734j1846p382n278o889o957l427
57909G81502o59j040j473k67J20o79P02M452N990L714J761K666L575K239O42J14
57893H03359j494n087p951q466q403q696p845o175o612r330j0620q738o119m196
57879G03627j192L128N680N297N171P619J0636J1753J1515J1143J0296Q836P621
57866H01130O244L198r43l868n404p443r874j0685j0338j1579j4476j6060j5441
57853G04461j4885j5272j4984j3848j3588j3726j1654p479m356l321k382j210
57841E87756j810l761l800j220R38J225J628L149M152M228N148O919P356O362
57827F18270O223P041O639N383N939P658O828L377J486K268J798j771n090n800
$$ plain form
57922 887751 883932 877403 866783 855500 846095 836015 823281 811435 804053 798775 791886 784929 781502
57909 781502 780843 779803 778330 778063 778183 777504 778206 782658 788648 792362 794123 796789 800364 802603 803245 803359
57893 803359 801865 796778 788827 780361 771958 763262 755417 749242 742630 733300 722680 713942 707823 703627
57879 703627 702435 705563 711243 716540 721711 729330 739966 751719 763234 774377 784673 793509 801130
57866 801130 807374 810572 809629 805761 800357 792914 783040 772355 762017 750438 735962 719902 704461
57853 704461 689576 674304 659320 645472 631884 618158 606504 599025 594669 591348 588966 587756
57841 587756 585946 582185 578385 577165 578103 579328 580956 584105 588257 592485 597633 604552 611908 618270
57827 618270 624493 631534 638173 643556 649495 657153 663981 667358 668844 671112 672910 671139 666049 660249
57813F60249o114p730q570p348o347o954p103n757n154o124n882l039j61J169
57799E85135K904N730O794N135M327O473Q554Q198P982J0118J1635R427N995N386
57785F83793O764O580M351K099M11j174k049k067k945n315o982o727o926r422
57771F60391j1824j1221q770p275o752n698m457m088l912l121k794l678m167l060
57757E79574k121l233n182n767n063m433m369n208p491r860r556o872n766p896
57743D96757r699q150n603n580p129p108n245l230j235J043K175J324P16K498
57729D51534N243O631P361R138J1133J1805J2162J3857J5884J6370J5632J4448
57717E91198J1674P012L795N019Q430R385P126M428K531L81k092l677m471n561
$$ plain form
57813 660249 654135 646405 637835 630487 624140 617186 610083 604326 599172 593048 587166 584127 583966 585135
57799 585135 588039 593769 600563 605698 610025 616498 625052 633250 641232 651350 662985 672412 678407 683793
57785 683793 690557 697137 701488 703587 703998 702824 700775 698708 695763 690448 683466 676739 669813 660391
57771 660391 648567 637346 628576 621301 614549 608851 604394 600306 596394 593273 590479 586801 582634 579574
57757 579574 577453 574220 569038 563271 558208 553775 549406 544198 536707 526847 517291 510419 504653 496757
57743 496757 487058 478908 473305 467725 460596 453488 448243 445013 443778 444821 446996 448320 449036 451534
57729 451534 456777 463408 470769 479907 491040 502845 515007 528864 544748 561118 576750 591198
57717 591198 602872 609884 613679 618698 627128 636513 643639 648067 650598 650979 648887 645210 640739 635178
57703F35178o698p011p157q135r008q380p103o808o966o130m901m885n676n594
57689E40726m469l284k131q49m59j518k279q57J943M157N538O724P182O402N493
57674E62319N332M908L735L613N400O521M848K671L268N646O641O355P249R215
57660F37721R905R177R195J0449J1434J1974J3330J5268J6261J6357J6859J7559
57648G95489J7263J6630J7381J9179K0213K0474K1512K3453K5182K7032L0281
57637A034089L4418L7809M0633M4320M8480N1225N2190N2492N2392N1679N1634
57626A551361N3650N6680N9075O2103O8483P8090Q8354R8254J08676J19624J30667
57615B475017J43343J59280J76373J90766K02176K13092K23036K28290K27574
$$ plain form
57703 635178 628480 621469 614312 606177 597169 588789 581686 574878 567912 561782 556881 551996 546320 540726
57689 540726 536257 532973 530842 529993 529534 528016 525737 524880 526823 530980 536518 543242 550424 556826 562319
57674 562319 567651 572559 576294 579907 585307 591828 596676 599347 602615 608261 614902 621257 628506 637721
57660 637721 647626 656803 665998 676447 687881 699855 713185 728453 744714 761071 777930 795489
57648 795489 812752 829382 846763 865942 886155 906629 928141 951594 976776 1003808 1034089
57637 1034089 1068507 1106316 1146949 1191269 1239749 1290974 1343164 1395656 1448048 1499727 1551361
57626 1551361 1605011 1661691 1720766 1782869 1851352 1929442 2017796 2116050 2224726 2344350 2475017
57615 2475017 2618360 2777640 2954013 3144779 3346955 3560047 3783083 4011373 4238947
57606D238947K23273K16128K03521J84292J60227J30304Q8053K8729m2869j14367
57596E316238j74081k15898k39058k46581k43354k33462k19057k01827j84023
57587C358897j67208j51427j36435j22597j10091r8496q7665p7771o8274n8328
57577B280605m8383l9879l3129k7024k0897j5073r529l770J942O938J1761J7618
57565B121180K4337L0702L6693M3241M9989N5691O1033O8523P8986R0424J00872
57554B761671J10298J19007J26392J32236J37336J41749J43757J41293J33235
57545C946974J18988R8193P1451M0332O625k7517n9210q6208j08325j26172j39226
57534C735905j46870j50320j51224j49165j43198j35295j29043j24945j20020
$$ plain form
57606 4238947 4462220 4678348 4881869 5066161 5226388 5356692 5444745 5473474 5430605 5316238
57596 5316238 5142157 4926259 4687201 4440620 4197266 3963804 3744747 3542920 3358897
57587 3358897 3191689 3040262 2903827 2781230 2671139 2572643 2484978 2407207 2338933 2280605
57577 2280605 2232222 2192343 2159214 2132190 2111293 2096220 2086691 2082921 2084863 2091801 2103562 2121180
57565 2121180 2145517 2176219 2212912 2256153 2306142 2361833 2422866 2491389 2570375 2660799 2761671
57554 2761671 2871969 2990976 3117368 3249604 3386940 3528689 3672446 3813739 3946974
57545 3946974 4065962 4164155 4235606 4275938 4282563 4255046 4195836 4109628 4001303 3875131 3735905
57534 3735905 3589035 3438715 3287491 3138326 2995128 2859833 2730790 2605845 2485825
57525B485825j12470j03812r6002q9190q3115p7987p3164o7334o0864n5655n1994
57514A614238m8068m3298l9546l7885l6602l3742k9619k5587k2209j9768j8706
57503A259208j8463j7474j5279j3103j1684j0213q113o029m367k708j176m82r
57490A150108J945N228P376P158O535P866J0953J4092J6402J7990J9229K0876
57478A285758K3546K6449K8056K8484K9493L1700L3724L4755L5938L8440M2095
57467A638438M6682N2442N8531O3263O6916P2089P9890Q7936R3648R7520J01428
57456B458783J05431J08160J08953J07669J03333R4611Q1247O3993M3869K2154
57446C298203K94k0881m0990n8892p2941q2794q9513r3623r4689r3165r0686q7839
$$ plain form
57525 2485825 2373355 2269543 2173541 2084351 2001236 1923249 1850085 1782751 1721887 1666232 1614238
57514 1614238 1566170 1522872 1483326 1445441 1408839 1375097 1345478 1319891 1297682 1277914 1259208
57503 1259208 1240745 1223271 1207992 1194889 1183205 1172992 1164879 1158850 1154483 1151775 1150599 1150117 1150108
57490 1150108 1152053 1157281 1164657 1171815 1178350 1186216 1197169 1211261 1227663 1245653 1264882 1285758
57478 1285758 1309304 1335753 1363809 1392293 1421786 1453486 1487210 1521965 1557903 1596343 1638438
57467 1638438 1685120 1737562 1796093 1859356 1926272 1998361 2078251 2166187 2259835 2357355 2458783
57456 2458783 2564214 2672374 2781327 2888996 2992329 3086940 3168187 3232180 3276049 3298203
57446 3298203 3298497 3277616 3236626 3177734 3104793 3021999 2932486 2838863 2744174 2651009 2560323 2472484
57434B472484q3542p7460p1148o5776o0561n4551m8199m2124l6000k9925k5150
57423A878048k2089j9122j4767r739n535k166J241M637P247R047J1003J4127J8737
57410A870669K4143K8938L2432L5683M0172M5611N0454N4207N7746O1617O5896
57399B367568P1395P8847Q6937R3353R7720J01241J03569J02604R7404Q8537P5526
57388C364701N7226L5050J2435r467l2046n4451p2635q4681r3196j00351j04387
57377B918198j03601j00229r7158r3640q7725q0603p5014p0889o5941n9593n3498
57366B030307m8855m5434m2626l9707l5926l1705k8565k6655k4075j9950j6237
57355A670572j4802j4684j4030j2787j1484r365n947k790j468j238o29L76J458
$$ plain form
57434 2472484 2388942 2311482 2240334 2174558 2113997 2059446 2011247 1969123 1933123 1903198 1878048
57423 1878048 1855959 1836837 1822070 1812331 1806796 1804630 1805871 1810508 1817755 1826802 1837805 1851932 1870669
57410 1870669 1894812 1923750 1956182 1991865 2032037 2077648 2128102 2182309 2240055 2301672 2367568
57399 2367568 2438963 2517810 2604747 2698100 2795820 2897061 3000630 3103234 3200638 3289175 3364701
57388 3364701 3421927 3456977 3469412 3459945 3427899 3373448 3300813 3216132 3122936 3022585 2918198
57377 2918198 2814597 2714368 2617210 2523570 2435845 2355242 2280228 2209339 2143398 2083805 2030307
57366 2030307 1981452 1936018 1893392 1853685 1817759 1786054 1757489 1730834 1706759 1686809 1670572
57355 1670572 1655770 1641086 1627056 1614269 1602785 1593420 1587473 1584683 1583215 1581977 1581348 1581724 1583182
57342A583182L357O049P518O569N094N359O829P865Q563R481R621Q396P728R367
57328A684978J1750J2431J2001J2545J3715J3549J2133J1267J1306J1267J1255
57317A818197J2068J3067J3073J2658J3108J4042J4449J4911J6091J6387J4054
57306A972105J0725R640J1144J2997J4353J6198J8262J8888J7992J7269J7322
57295B136895J7303J7321J8594K1017K2969K3641K3535K2889K1757K1226K2368
57284B369515K4292K5366K5727K6451K7031K6241K4773K4359K4813K4616K3818
57273B647002K3633K3759K3156K2910K5018K8460K9891K8444K6738K6675K7331
57262B933017K7563K7756K8048K7532K6230K5674K6689K8334K9606L0410L0714
$$ plain form
57342 1583182 1586539 1592588 1600106 1606675 1611769 1617128 1623957 1631822 1640385 1649866 1659487 1667883 1675611 1684978
57328 1684978 1696728 1709159 1721160 1733705 1747420 1760969 1773102 1784369 1795675 1806942 1818197
57317 1818197 1830265 1843332 1856405 1869063 1882171 1896213 1910662 1925573 1941664 1958051 1972105
57306 1972105 1982830 1992470 2003614 2016611 2030964 2047162 2065424 2084312 2102304 2119573 2136895
57295 2136895 2154198 2171519 2190113 2211130 2234099 2257740 2281275 2304164 2325921 2347147 2369515
57284 2369515 2393807 2419173 2444900 2471351 2498382 2524623 2549396 2573755 2598568 2623184 2647002
57273 2647002 2670635 2694394 2717550 2740460 2765478 2793938 2823829 2852273 2879011 2905686 2933017
57262 2933017 2960580 2988336 3016384 3043916 3070146 3095820 3122509 3150843 3180449 3210859 3241573
57251C241573L0511L0697L2111L3754L3961L3088L3015L4220L5578L6658L7834
57240C613000L8476L7677L6507L6885L8432L9144L8838L8910L9089L7878L6202
57229D031038L6779L9440M0915M0209M0305M3012M5765M5725M3893M2741M2300
57218D492122M1168L9577L8902L9297L9748L9649L8853L7051L4394L1940L0408
57207D903109K9219K7379K4610K1230J7793J5040J3328J2124J1021J0857J2491
57196E098201J5002J6835J8289K0845K4265K6653K7397K7850K8928L0105L0908
57185E365278L1396L1055K9290K7089K6219K6740K7289K7559K8180K8563K7466
57174E676124K5564K4664K4437K2896K0149J8624J9217K0337K1233K3117K6323
$$ plain form
57251 3241573 3272084 3302781 3334892 3368646 3402607 3435695 3468710 3502930 3538508 3575166 3613000
57240 3613000 3651476 3689153 3725660 3762545 3800977 3840121 3878959 3917869 3956958 3994836 4031038
57229 4031038 4067817 4107257 4148172 4188381 4228686 4271698 4317463 4363188 4407081 4449822 4492122
57218 4492122 4533290 4572867 4611769 4651066 4690814 4730463 4769316 4806367 4840761 4872701 4903109
57207 4903109 4932328 4959707 4984317 5005547 5023340 5038380 5051708 5063832 5074853 5085710 5098201
57196 5098201 5113203 5130038 5148327 5169172 5193437 5220090 5247487 5275337 5304265 5334370 5365278
57185 5365278 5396674 5427729 5457019 5484108 5510327 5537067 5564356 5591915 5620095 5648658 5676124
57174 5676124 5701688 5726352 5750789 5773685 5793834 5812458 5831675 5852012 5873245 5896362 5922685
57163E922685K9457L2188L5857M0509M4450M7594N1910N7415O1125O1547O0939
57152F445676O1364O1511N9558N6400N3697N0892M6462M0417L3820K7390K1998
57141F959185J8656J6745J4101J0047O241L417j34n252r594j0785j0033j0421
57129F982173j2976j6293j9050k1244k3593k6757l0554l3633l4869l5069l5804
57118F692331l6787l6324l4142l1503k8573k4150j8118j1590m634L315J0794J5253
57106F495872J6951J8481K0018J8609J2955N218l117j3514k7140m2749n9233p7107
57094F365244r6055j14144j30819j47520j63919j76684j83382j84567j81180j73322
57084D813652j62822j53380j46779j42268j40527j44130j52889j62898j71724
$$ plain form
57163 5922685 5952142 5984330 6020187 6060696 6105146 6152740 6204650 6262065 6323190 6384737 6445676
57152 6445676 6507040 6568551 6628109 6684509 6738206 6789098 6835560 6875977 6909797 6937187 6959185
57141 6959185 6977841 6994586 7008687 7018734 7024975 7028392 7028258 7023006 7013412 7002627 6992594 6982173
57129 6982173 6969197 6952904 6933854 6912610 6889017 6862260 6831706 6798073 6763204 6728135 6692331
57118 6692331 6655544 6619220 6585078 6553575 6525002 6500852 6482734 6471144 6466510 6469825 6480619 6495872
57106 6495872 6512823 6531304 6551322 6569931 6582886 6588104 6584987 6571473 6544333 6501584 6442351 6365244
57094 6365244 6269189 6155045 6024226 5876706 5712787 5536103 5352721 5168154 4986974 4813652
57084 4813652 4650830 4497450 4350671 4208403 4067876 3923746 3770857 3607959 3436235
57075C436235j80631j90493k00072k09828k22702k39273k56666k73943k93745
57066A368882l16874l40504C47746d1789m18608m47494m74882n04187n37040n70335
57056b994335o03193o40843o87980p44196q09541q88311r83321j092719j216963
57047a0661402j362878j536797j740050j975444k251228k574361k947282l375518
57039b8424960l869574m433516n060279n744333o490218p302998q181205r125911
57031g8632994j0142647j1220902j2318966j3378648j4347151j5177237j5813126
57024a71031671j6173458j6129519j5518754j4258505j2501299j0622014q941119
57017b65176339p424995n709061l442171n77355K665988O027740R319880J2369056
$$ plain form
57075 3436235 3255604 3065111 2865039 2655211 2432509 2193236 1936570 1662627 1368882
57066 1368882 1052008 711504 347746 -41789 -460397 -907891 -1382773 -1886960 -2424000 -2994335
57056 -2994335 -3597528 -4238371 -4926351 -5670547 -6480088 -7368399 -8351720 -9444439 -10661402
57047 -10661402 -12024280 -13561077 -15301127 -17276571 -19527799 -22102160 -25049442 -28424960
57039 -28424960 -32294534 -36728050 -41788329 -47532662 -54022880 -61325878 -69507083 -78632994
57031 -78632994 -88775641 -99996543 -112315509 -125694157 -140041308 -155218545 -171031671
57024 -171031671 -187205129 -203334648 -218853402 -233111907 -245613206 -256235220 -265176339
57017 -265176339 -272601334 -278310395 -281752566 -282329921 -279663933 -273636193 -264316313 -251947257
57009b51947257J4964172J6910903J8113263J8590569J8443742J7817130J6861673
57002a30245805J5700858J4422488J3096506J1784760J0529931R350496Q255362
56995d7105404P255024O354960N550093M833342M202671L655024L180991K770907
56987i302392K420359K125277J876824a214971B67597J323489J181360J053377
56979C825823R40619Q42478P54883O75655O06615N48136M96010M45964L97285
56970I533468L50205L04030K59983K21922J91743J67132J45341J25764J07500
56961A1407088Q8382O8350N0346L5774K2110O592j0923l0296n2609p7078r9431
56950A1408305j16100j27922j37822j46978j55281j63674j73919j87114k03547
$$ plain form
57009 -251947257 -236983085 -220072182 -201958919 -183368350 -164924608 -147107478 -130245805
57002 -130245805 -114544947 -100122459 -87025953 -75241193 -64711262 -55360766 -47105404
56995 -47105404 -39850380 -33495420 -27945327 -23111985 -18909314 -15254290 -12073299 -9302392
56987 -9302392 -6882033 -4756756 -2879932 -1214971 267597 1591086 2772446 3825823
56979 3825823 4766442 5608920 6363803 7039458 7646073 8194209 8690219 9136183 9533468
56970 9533468 9883673 10187703 10447686 10669608 10861351 11028483 11173824 11299588 11407088
56961 11407088 11495470 11563820 11614166 11649940 11672050 11678642 11667719 11637423 11584814 11507736 11408305
56950 11408305 11292205 11164283 11026461 10879483 10724202 10560528 10386609 10199495 9995948
56941I995948k22792k43192k62612k80163k95738l08016l15109l17291l16514
56932G434521l12869l04012k88471k67049k40469k08187j69689j24293p0563j1447
56922E437472L8102N4131K0361n7587j55623k47136l15241l54695l68410l63371
56912C688003l46753l23401k96030k66628k36712k07157j78795j52745j29577
56903A550205j08843q9966p2766n6894m1957k8648j8472j1866p929o620r479j6989
56891A079776k6566l4584l9687m2941m5436m6840m6083m2607l7007l0752k5011
56880F62262j9758j4534r870o885n370l472K46N247R866J2909J4126J3808J2160
56867F70735Q638K173p073j6574k3377k7039k9335l1189l1603k9860k7047k4640
$$ plain form
56941 9995948 9773156 9529964 9267352 8987189 8691451 8383435 8068326 7751035 7434521
56932 7434521 7121652 6817640 6529169 6262120 6021651 5813464 5643775 5519482 5448919 5437472
56922 5437472 5475574 5529705 5550066 5492479 5336856 5089720 4774479 4419784 4051374 3688003
56912 3688003 3341250 3017849 2721819 2455191 2218479 2011322 1832527 1679782 1550205
56903 1550205 1441362 1351396 1278630 1221736 1179779 1151131 1132659 1120793 1112864 1106244 1096765 1079776
56891 1079776 1053210 1018626 978939 935998 890562 843722 797639 755032 718025 687273 662262
56880 662262 642504 627970 618100 611215 605845 602373 602619 607866 617732 630641 644767 658575 670735
56867 670735 679373 681546 674473 657899 634522 607483 578148 546959 515356 485496 458449 433809
56855D33809k2842k0977j8466j4975j0784p367o325p210p756o815n588n288n259
56842B94157m605m132m950o163n842l901k259k099k474k085j067k99K39J436L678
56827B59634O423R088J1567J3548J4132J2720R864O632L588J216N58J990L785
56814C54745L736K441K978O592J0766J2745J3096J4227J7000K0692K4865K9192
56802E13075L2467L4074L5691L9206M3424M4970M2081L5292K5034J1462l030j4083
56790H39663j9439k0908k1347k1354j9936j6840j2745q125l051K280P657J3194
56778G19049J9294K6473L5033M4447N3436O1208O7861P2375P1061N9983L9090
56767A269310J2761j3468l5460n0526n7599n8169n5376n1309m5996l9152l1504
$$ plain form
56855 433809 410967 389990 371524 356549 345765 338398 332073 324863 317107 310292 304704 299416 294157
56842 294157 289552 285420 280470 274307 268465 264564 262305 260206 257732 255647 254580 254281 254520 255956 259634
56827 259634 266057 275145 286712 300260 314392 327112 336976 343608 347196 348412 348970 350960 354745
56814 354745 358481 360922 363900 370492 381258 394003 407099 421326 438326 459018 483883 513075
56802 513075 545542 579616 615307 654513 697937 742907 784988 820280 845314 856776 853746 839663
56790 839663 820224 799316 777969 756615 736679 719839 707094 698969 695918 698198 705855 719049
56778 719049 738343 764816 799849 844296 897732 958940 1026801 1099176 1170237 1230220 1269310
56767 1269310 1282071 1268603 1233143 1182617 1125018 1066849 1011473 960164 914168 875016 843512
56756H43512k4065j7299j1311n714O79Q692J7228K4304K9798L5563M2356M7964
56744I91707M8818M2440K8443Q829j2081k9525m1113m7377m9842m9642m7659m4420
56732G98578l9641l3235k6612k1457j7423j2847p574l035N31M563R520J4078J7474
56719F82920K0361K2356K1104J5038N366n610j6236k4858k9794l1459l2365l3565
56707E93258l2961k8855k3167j9051j6911j5008j2728j0966r992r227q764r214
56695C96414j0240j0701j0127q922p494o270o006o790p251o008l621j900j626
56682C09458j967j935j341m83K09L40n9m16m25m96j051j952k966m030m658m023
56666B84205k298q79n96p49p07j224l057n250o271o037n515m883l549j622j23
$$ plain form
56756 843512 819447 802148 790837 785123 785802 794494 811722 836026 865824 901387 943743 991707
56744 991707 1040525 1082965 1111408 1120237 1108156 1078631 1037518 990141 940299 890657 842998 798578
56732 798578 758937 725702 699090 677633 660210 647363 639789 636754 637285 641848 651368 665446 682920
56719 682920 703281 725637 746741 761779 767145 761535 745299 720441 690647 659188 626823 593258
56707 593258 560297 531442 508275 489224 472313 457305 444577 433611 423619 414392 405628 396414
56695 396414 386174 375473 365346 356424 348930 342660 336654 329864 322613 316605 312984 311084 309458
56682 309458 307491 305556 304215 303732 303941 304281 304222 303806 303381 302885 301834 299882 296916 292886 288228 284205
56666 284205 281907 281028 280432 279683 278976 277752 274695 269445 263174 257137 251622 246739 243190 241568 241445
56651B41445K42m17j629k642k471p95J376K686K751J927M99j043j595n48J073
56636B40859J725J390J331K037K697K776K888L501L817K727N02j273j533r30r26
56621B61588j920k859k697j502Q0J659K748K493Q68n00q4J407K113J789J675J759
56605B68617N89j775k885j218J442K383J339J01j68L06J046J880K566K780K273
56590B79276Q61j102k245j389N13J236M20Q7J304K380J633P4m31o4k16r86j471
56573B79880j612j837j674n66N42K67j064k052k405k761k833j747L4J030J006
56558B64208J020J235O19q37j507n61N80K46j106j644o45P46J122L25p20j218
56542B61863j125p18k5Q91J538J537J329J474J507O83k89J80J939K818J731L85
$$ plain form
56651 241445 241687 241270 239641 236999 234528 233733 235109 237795 240546 242473 242972 241929 240334 239786 240859
56636 240859 242584 243974 245305 247342 250039 252815 255703 259204 263021 265748 266250 264977 263444 262514 261588
56621 261588 259668 256809 254112 252610 252690 254349 257097 259590 260458 259958 259874 261281 263394 265183 266858 268617
56605 268617 269206 267431 264546 263328 264770 267153 268492 268593 268425 268731 269777 271657 274223 277003 279276
56590 279276 280137 279035 276790 275401 275914 277150 277570 277657 278961 281341 282974 283048 282617 282553 282337 281351 279880
56573 279880 278268 276431 274757 274191 274733 275000 273936 271884 269479 266718 263885 262138 262172 263202 264208
56558 264208 265228 266463 267082 266245 264738 264177 264757 265003 263897 262253 261608 262354 263476 263801 263081 261863
56542 261863 260738 260020 259995 260886 262424 263961 265290 266764 268271 268954 268665 268845 270784 273602 275333 275718
56526B75718P54K325L169K601J365K59l9J183L466M725L562J340M17J179K303
56511C04327L132L977M723M949N126N827O223N077L039K154L117M745O034P047
56497C69497P748P762P514P946Q810Q839P922P463Q072Q500P605O058N227N469
56483D74432O304P246P649O669M303J857M87k94j811m158n868n750m454l720m236
56468D78656m821l982k003p82j686m182o683q007p787o369m816m352n140o095
56454D11951o241n629m652l400k123j407j301j216j217k286m556o496o725n596
56440C59106m068k348p44m15j755l166l009j839j167j095q89q28j449j769n29
56425C34036J332J740O76P5O17R75N17M85J679K979L108K401J920J949K301L047
$$ plain form
56526 275718 276472 278797 281966 284567 285932 286191 286152 287335 290801 295526 299088 300428 300845 302024 304327
56511 304327 307459 311436 316159 321108 326234 332061 338284 343361 346400 348554 351671 356416 362450 369497
56497 369497 377245 385007 392521 400467 409277 418116 426038 433501 441573 450073 457678 463736 468963 474432
56483 474432 480736 487982 495631 502300 506603 508460 508947 508653 506842 502684 496816 491066 486612 482892 478656
56468 478656 473835 469853 467850 467068 465382 461200 454517 446510 438723 432354 427538 423186 418046 411951
56454 411951 405710 400081 395429 392029 389906 388499 387198 385982 384765 382479 377923 371427 364702 359106
56440 359106 355038 352690 351946 351531 349776 346610 343601 341762 340595 339500 338611 337783 336334 334565 334036
56425 334036 335368 337108 337784 337859 338476 339451 339968 340453 342132 345111 348219 350620 352540 354489 356790 359837
56409C59837M177N117N269M675L945L845M805O237O623N076K676J414K031L723
56395D19450N585P194P981P398N934M944N071N545N309M356L677M047M900M639
56381D96030K571K83r4J165J759R73P43K095K942J321j153j630m24k55j938l522
56365E00866l533k584j774j507j978l062l825l740l837m998n870m738k664k179
56351D54577l347l921l276l176m400n533n720n768n728m188j226N70m69k684l554
56336D02157k766j465k22P70R47L42J74J198K483K840K341J471O9j719k645j784
56320D04191m6R68R63Q28J129J626J922J848J448J015Q69R29R04Q51R60R01K29
56303D21535o53q51k38O12J543K729L566L054J489M60Q34J767K048J429M06l88
$$ plain form
56409 359837 364014 369131 374400 379075 383020 386865 391670 397907 404530 409606 412282 413696 415727 419450
56395 419450 425035 432229 440210 447608 453542 458486 463557 469102 474411 478767 482444 486491 491391 496030
56381 496030 498601 498884 498790 499955 501714 502687 503430 505525 508467 509788 508635 507005 506581 506326 504388 500866
56365 500866 497333 494749 492975 491468 489490 486428 482603 478863 475026 470028 464158 459420 456756 454577
56351 454577 451230 447309 444033 440857 436457 430924 425204 419436 413708 409520 408294 408864 408395 405711 402157
56336 402157 399391 397926 397704 398474 399421 399763 399937 401135 403618 406458 408799 410270 410339 408620 405975 404191
56320 404191 404145 405113 406076 406904 408033 409659 411581 413429 414877 415892 416761 417690 418594 419445 420405 421306 421535
56303 421535 420882 420031 419793 420405 421948 424677 428243 431297 432786 433246 434080 435847 437895 439324 439730 439342
56287D39342l10R53K977N005O586P320O637M766L231L177L927M272M389M921N294
56272E02487M807M506N739P569P927O923O386O500N753M300M342O462Q361Q269
56258E90331P359P586R029J0526J1343J1282J0495R761R822J0152R775R118R292
56245G15871R849R410Q406Q586R705R464P313N438N061M579K685O87Ll25j714
56230G95018l386l564k121l43R83J997K977M109N473O808P784Q472Q781Q075O795
56215H47858P442J1720J7286K0063J9605J9250K0947K3212K4676K6255K8626L0714
56203A097654L2181L4682L9138M4143M8470N2814N7710O2266O6328P1462P8270
56192A685118Q5021R0513R5866J02066J07973J12403J15758J18039J17601J13780
$$ plain form
56287 439342 439032 439985 442962 447967 454553 461873 468510 473276 476507 479684 483611 487883 492272 497193 502487
56272 502487 507294 511800 517539 525108 533035 539958 546344 552844 558597 562897 567239 573701 582062 590331
56258 590331 597690 605276 614305 624831 636174 647456 657951 667712 677534 687686 697461 706579 715871
56245 715871 725720 735130 743536 752122 761827 771291 778604 784042 789103 793682 796367 797054 797057 796732 795018
56230 795018 791632 788068 785947 785604 786587 788584 791561 795670 801143 807951 815735 824207 832988 841063 847858
56215 847858 855300 867020 884306 904369 923974 943224 964171 987383 1012059 1038314 1066940 1097654
56203 1097654 1129835 1164517 1203655 1247798 1296268 1349082 1406792 1469058 1535386 1606848 1685118
56192 1685118 1770139 1860652 1956518 2058584 2166557 2278960 2394718 2512757 2630358 2744138
56182B744138J08491J03374R7355Q8815P8070O5888N1753L5619J9593N780n936
56171C392940j6355k5126l2022l8107m3668m6904m6731m5217m5212m6893m8576
56160B958129m9633n0724n2315n4498n7380o0484o2877o4581o6530o8587o9392
56149B301128o8694o7694o6658o4573o1730n9828n8779n6559n3018n0443m9108
56138A644044m6070m0257l4975l2921l2176k9841k6469k4014k2299k0549j9662
56127A314811k0040j9625j7044j4256j3266j2772j0991r130q789q424n938k676
56115A171860j285j364o01J323L134M708O420P335O892O808Q567J0676J1161J0994
56101A246628J2195J4388J6082J7460J9118J9920J9082J8373J9409K0656K0152
$$ plain form
56182 2744138 2852629 2956003 3053358 3142173 3220243 3286131 3337884 3373503 3393096 3398876 3392940
56171 3392940 3376585 3351459 3319437 3281330 3237662 3190758 3144027 3098810 3053598 3006705 2958129
56160 2958129 2908496 2857772 2805457 2750959 2693579 2633095 2570218 2505637 2439107 2370520 2301128
56149 2301128 2232434 2164740 2098082 2033509 1971779 1911951 1853172 1796613 1743595 1693152 1644044
56138 1644044 1597974 1557717 1522742 1489821 1457645 1427804 1401335 1377321 1355022 1334473 1314811
56127 1314811 1294771 1275146 1258102 1243846 1230580 1217808 1206817 1197687 1188898 1180474 1174536 1171860
56115 1171860 1170575 1169211 1168610 1169933 1173067 1177775 1184195 1191530 1198422 1205230 1213797 1224473 1235634 1246628
56101 1246628 1258823 1273211 1289293 1306753 1325871 1345791 1364873 1383246 1402655 1423311 1443463
56090A443463J9002J9145J9883J9954K0695K3596K6851K8257K9599L4188M1654
56079A726287M9110N5906O3264P0604P6284Q1137Q7543R5932J05464J16966J31673
56068B660170J48331J65030J82721K03230K25007K44389K59829K71094K75460
56059D635261K69051K51896K28380K03044J78647J57210J39330J22640J03613
56050F289072Q0672N3956K3946p061l4192n3952o7839p9716r1769j05561j24035
56039E883521j48378j74797j98030k16216k29080k34091k28890k15751j99414
56030D038874j81848j62815j43657j26436j10796r5524q1764p1234o3082n5799
56020B945919n0142m6774m3553l8756l4272l1826k9155k4007j8595j5668j3489
$$ plain form
56090 1443463 1462465 1481610 1501493 1521447 1542142 1565738 1592589 1620846 1650445 1684633 1726287
56079 1726287 1775397 1831303 1894567 1965171 2041455 2122592 2210135 2306067 2411531 2528497 2660170
56068 2660170 2808501 2973531 3156252 3359482 3584489 3828878 4088707 4359801 4635261
56059 4635261 4904312 5156208 5384588 5587632 5766279 5923489 6062819 6185459 6289072
56050 6289072 6369744 6423700 6447646 6440585 6406393 6352441 6284602 6204886 6113117 6007556 5883521
56039 5883521 5735143 5560346 5362316 5146100 4917020 4682929 4454039 4238288 4038874
56030 4038874 3857026 3694211 3550554 3424118 3313322 3217798 3136034 3064800 3001718 2945919
56020 2945919 2895777 2849003 2805450 2766694 2732422 2700596 2671441 2647434 2628839 2613171 2599682
56009B599682r526n582m065k676J430N612O008M752O513J0694J3492J5137J8372
55996B659843K2198K3883K4951K8477L2560L3334L2341L3920L7426L9115L9663
55985C007711M2524M6611M8139M8039N0189N3892N5473N5779N8524O2714O4215
55974C593810O3473O4362O6941O8694P0968P6545Q2842Q5302Q5483Q7979R1938
55963D438337R3964R6459J03815J12972J17490J18792J23471J31710J38486J44155
55953E619651J53108J63679J70240J73954J80830J90761J99097K07154K19840
55944G278314K34991K46700K57251K73593K94111L11569L27079L48066L74387
55935I946061L99971M26039M58562M95114N28981N63969O09446O63297P16302
$$ plain form
56009 2599682 2590156 2584574 2580509 2577833 2579263 2584875 2590883 2595635 2602148 2612842 2626334 2641471 2659843
55996 2659843 2682041 2705924 2730875 2759352 2791912 2825246 2857587 2891507 2928933 2968048 3007711
55985 3007711 3050235 3096846 3144985 3193024 3243213 3297105 3352578 3408357 3466881 3529595 3593810
55974 3593810 3657283 3721645 3788586 3857280 3928248 4004793 4087635 4172937 4258420 4346399 4438337
55963 4438337 4532301 4628760 4732575 4845547 4963037 5081829 5205300 5337010 5475496 5619651
55953 5619651 5772759 5936438 6106678 6280632 6461462 6652223 6851320 7058474 7278314
55944 7278314 7513305 7760005 8017256 8290849 8584960 8896529 9223608 9571674 9946061
55935 9946061 10346032 10772071 11230633 11725747 12254728 12818697 13428143 14091440 14807742
55926A4807742P70700Q36481R11475R84101J054347J132689J219795J307605J399094
55917B4424029J505548J625255J746813J872027K012310K164788K317675K477714
55909D0146159K664834K881214L115042L373262L678766M036802M439102M899950
55901F9235131N450672O101117O850001P732119Q807482J0105103J1629803J3417901
55893A39329329J5518902J7927802K0622047K3668482K7187720L1186109L5495982
55886C10936373L9778251M3236286M4186387M0365174L0386944J5240586j807658
55879E22322343j7029022k8119440l4679165l7464414l7538822l5898937l3355099
55872B98237444l0440003k7423245k4451067k1640539j9062535j6732742j4659707
$$ plain form
55926 14807742 15578442 16414923 17326398 18310499 19364846 20497535 21717330 23024935 24424029
55917 24424029 25929577 27554832 29301645 31173672 33185982 35350770 37668445 40146159
55909 40146159 42810993 45692207 48807249 52180511 55859277 59896079 64335181 69235131
55901 69235131 74685803 80786920 87636921 95369040 104176522 114281625 125911428 139329329
55893 139329329 154848231 172776033 193398080 217066562 244254282 275440391 310936373
55886 310936373 350714624 393950910 438137297 478502471 508889415 524130001 522322343
55879 522322343 505293321 477173881 442494716 405030302 367491480 331592543 298237444
55872 298237444 267797441 240374196 215923129 194282590 175220055 158487313 143827606
55865A43827606j2859284j1314569r974127q804785p806390o967981o251793n630167
55857G4218510n100198m651947m256621l896519l576026l293833l032749k785409
55849D3625208k563065k370017k193646k027557j880913j756540j641628j528460
55841B7663382j424526j334417j250430j168578j096195j036301r80505r23923
55833A8448507q71947q26650p81415p34502o93376o60239o27127n90361n56247
55824A2106643n27761m99059m68079m41403m21493m01662l78730l58456l43360
55815H266640l27111l06219k86065k70104k53867k34771k17588k05123j93376
55806E972416j80626j71552j67813j64288j59398j59415j67299j76300j80043
$$ plain form
55865 143827606 130968322 119653753 109679626 100874841 93068451 86100470 79848677 74218510
55857 74218510 69118312 64466365 60209744 56313225 52737199 49443366 46410617 43625208
55849 43625208 41062143 38692126 36498480 34470923 32590010 30833470 29191842 27663382
55841 27663382 26238856 24904439 23654009 22485431 21389236 20352935 19372430 18448507
55833 18448507 17576560 16749910 15968495 15233993 14540617 13880378 13253251 12662890 12106643
55824 12106643 11578882 11079823 10611744 10170341 9748848 9347186 8968456 8610000 8266640
55815 8266640 7939529 7633310 7347245 7077141 6823274 6588503 6370915 6165792 5972416
55806 5972416 5791790 5620238 5452425 5288137 5128739 4969324 4802025 4625725 4445682
55797D445682j80604j81488j80736j76174j70134j63897j54310j40328j26369
55788B971642j15317j04780r3685q5427q0730p4422o3282n0674l9919l0051k1742
55777B211613k0208k7536l8240m6568n2459n6611n6217n0218m3275l9859l8827
55766A741595l7501l6280l5811l4404l1841l1242l3817l6184l5849l4976l5834
55755A357856l6839l6053l4510l3467l2184l0610l0216l0334k7861k2432j7579
55744A025771j5280j3732j1681j0159q688n047j43K128J297J022K229J622j459
55731I67880l174k323k745n991q187p248o839r534j2196j2110j1961j4414j7014
55718H54144j6737j4970j3910j2478r699p738p820p548n927o399j1018j6159j8074
$$ plain form
55797 4445682 4265078 4083590 3902854 3726680 3556546 3392649 3238339 3098011 2971642
55788 2971642 2856325 2751545 2657860 2572433 2491703 2417281 2353999 2303325 2263406 2233355 2211613
55777 2211613 2191405 2163869 2125629 2079061 2026602 1969991 1913774 1863556 1820281 1780422 1741595
55766 1741595 1704094 1667814 1632003 1597599 1565758 1534516 1500699 1464515 1428666 1393690 1357856
55755 1357856 1321017 1284964 1250454 1216987 1184803 1154193 1123977 1093643 1065782 1043350 1025771
55744 1025771 1010491 996759 985078 974919 966231 961184 961041 963169 964466 965488 967717 969339 967880
55731 967880 964706 962383 959638 953647 945460 938212 931373 921839 909643 897533 885572 871158 854144
55718 854144 837407 822437 808527 796049 786350 778612 770792 763244 757317 750918 739900 723741 705667
55705G05667j8253j9165j9061j5721j1467r590r155p761o420p328r546j0899j1618
55692E49683j2383j1630q379m996l638k835r69N0j752m388n309n885q384j1190
55678D67995j1185q820o870o016n355n344o663p690o473l929k293k048k592l957
55664C88760n576n783m926o129j0278j3379j1981q301o465o511n921m588m117
55651B94805m090k993j450r39p34N92K072J987J170J543K700K969K487K336J988
55636C04443N17j024j234r49j556k205j485k72m6J02J809M131M910M373M501N778
55620C21793P177Q426R661R875Q019M960K211j61k617m493n272n913o911o717
55606C40038m378j947j755k881k938j861j340j642j690j299j053p57n0N06O26
$$ plain form
55705 705667 687414 668249 649188 633467 622000 612410 603255 595494 589074 581746 572200 561301 549683
55692 549683 537300 525670 517291 512295 508657 505822 504853 504903 503151 498763 493454 487569 479185 467995
55678 467995 456810 447990 441120 435104 429749 424405 417742 410052 403579 399650 397357 395309 392717 388760
55664 388760 383184 377401 372475 366346 356068 342689 330708 322407 315942 309431 303510 298922 294805
55651 294805 290715 287722 286272 285333 284599 285191 287263 289250 290420 291963 294663 297632 300119 302455 304443
55636 304443 304960 303936 302702 301753 300197 297992 296507 296235 296189 296291 298100 302231 307141 311514 316015 321793
55620 321793 328970 337396 347057 356932 364951 369911 372122 371961 369344 364851 359579 353666 346755 340038
55606 340038 335660 333713 331958 329077 326139 324278 322938 321296 319606 318307 317254 316497 316447 316953 317579
55591C17579J345L200M786M774L765K637R21j514l281l826m644o365p145o088
55577C06144n438o884q457q010p108q054r509q790o621n838o819p629p553p354
55563B02080p159o817p010p475o057k252N51m86l165l771k796l100m422m254k760
55548A41107k235k507j410O85J144k99j333j373k116l568l429r72J804L364M046
55533A32908M077L047J576Q20K77j342l322l764k745j858j137N67K594L182K866
55518A37746L835O005P129O809P026Q465R649J0091J1051J2697J3665J4021J5529
55505B63718J8346K0471K1133K1822K3161K3715K2769K1317J9264J4521O347k739
55493D73845r845j4628j8220k1152k3329k4575k4314k2228j9549j8078j7609j6270
$$ plain form
55591 317579 318924 322124 326910 331684 335449 338086 339007 337493 334212 330386 325742 319377 312232 306144
55577 306144 300706 293822 285365 277355 270247 262193 252684 243894 237273 231435 224616 216987 209434 202080
55563 202080 194921 188104 181094 173619 167562 165310 165861 165375 162210 158439 155643 152543 148121 143867 141107
55548 141107 138872 136365 134955 135640 136784 136485 135152 133779 131663 128095 124666 123694 125498 128862 132908
55533 132908 136985 140032 141608 142428 142705 141363 138041 134277 131532 129674 128537 129104 131698 134880 137746
55518 137746 141581 147586 154715 161524 168550 177015 186664 196755 207806 220503 234168 248189 263718
55505 263718 282064 302535 323668 345490 368651 392366 415135 436452 455716 470237 476584 473845
55493 473845 464000 449372 431152 410000 386671 362096 337782 315554 296005 277927 260318 244048
55481B44048j3724j1847j1735j1962j0782q308n768l952l052k821k585k025j836
55468A53651k471k794j603J15M01o47j100k37Q15J191J084N91k52o34j52k53k174
55451A45531m171l584j258q62l743p270q574p277m361j104O47j85j956k169j269
55436I8395j759l708m492l307k314k559k414j300j331l518n483m992l076j736
55422E6406j027l67l24j134j463n87J26l46p91j24L78p40k554l523m007m775m577
55405C0571j976J464K505N12j860k218q90L76N70p7q11r72m18M12R03O17l97j310
55387B7001q71J043K692K328N45o20n58m13o26k63Q91J602J235Q05J116J475J128
55370C8510M36j55q82j592j430m71j62j063j700p91P77J510J567J944K441K143
$$ plain form
55481 244048 230324 218477 206742 194780 183998 175690 169922 165970 162918 160097 157512 155487 153651
55468 153651 151180 148386 146783 146898 147299 146652 145552 145315 146130 147321 148405 148996 148744 148110 147958 147705 145531
55451 145531 141360 137776 136518 135656 131913 124643 116069 108792 104431 103327 103974 103789 101833 99664 98395
55436 98395 96636 92928 88436 85129 82815 80256 77842 76542 75211 71693 66210 61218 58142 56406
55422 56406 55379 55012 54688 53554 52091 51504 51630 51284 50493 50369 50747 50007 47453 43930 39923 35148 30571
55405 30571 28595 30059 32564 33076 31216 28998 28108 28484 29054 28977 28166 27194 26776 27188 28091 28708 28311 27001
55387 27001 26130 27173 29865 32193 32738 32118 31560 31147 30521 30258 31149 32751 33986 34791 35907 37382 38510
55370 38510 38946 38791 37909 36317 34887 34416 34254 33191 31491 30700 31477 32987 34554 36498 38939 41082
55354D1082J338J324K248K533Q67j893l372k158P05L016L937M368M817M316K341
55339F5469M03M9M47j53j368j372k00J25j234k902l762m171m215k970m38J673
55323D5381K048J171K5j201k376k862k442j675r46j85L62L23N1K6k81j299j679
55306C4441J05K810L583K019M38m3o53j789j894o17O0o27n76J436L061J901n43
55289D3112j172N7N25q98k578k787j652l95J15j04m36m44m92j055j737j887j926
55272B6246k602l120j980L55J685J267N71M43j5j023j061N60K265K541J748O35
55256B8515q10j996j562J38P32n80j470k17J429J127m66j226q95n79l56L81J296
55239B3461J778K152K656K448J133j9J6L05k92j181j423j487j869j543L32K546
$$ plain form
55354 41082 42420 43744 45992 48525 49392 47499 44127 41969 42674 45690 49627 53995 58812 63128 65469
55339 65469 65872 65921 66368 66215 64847 63475 63275 63400 62166 59264 55502 51331 47116 44146 43708 45381
55323 45381 47429 48600 48625 47424 45048 42186 39744 38069 37123 36938 37300 37623 37674 37700 37419 36120 34441
55306 34441 34546 37356 40939 42958 43396 43353 42700 40911 39017 38400 38460 37833 37257 38693 41754 43655 43112
55289 43112 41940 41997 42522 41624 39046 36259 34607 34212 34327 34223 33787 33343 32851 31796 30059 28172 26246
55272 26246 23644 20524 18544 18899 20584 21851 22422 22865 22850 21827 20766 21326 23591 26132 27880 28515
55256 28515 27705 25709 24147 24285 25017 24437 22967 22750 24179 25306 24840 23614 22719 22140 21784 22165 23461
55239 23461 25239 27391 30047 32495 33628 33609 33625 33930 33638 32457 31034 29547 27678 26135 26467 29013
55223B9013L494L306K622R39j809l692l112j303l81k57L14J034Q64L52O55J308
55207C3347J299J274K214K944J721n82j694j676k489m154m331k084N79J517P59
55192B8644m91j379j427n96L27M53l4m52q41j443j570n33P91R54Q1m74k46O7J09
55173B1940J09Kl25k82O00J633J994J985K042J495l1j026J00K387L541L072K223
55156D1459J465L18q09q62j12J47l11p96j470k842l841k785l36Q68j26j332o90
55139B7945J533L676M364L040L19j916k094p17N22J040J288J048k11j508j062
55124C7267R32K211J471j29q22k31O94O36j100l400l761j387J009M45k126l190
55108B8519j632M60J578K230K403R37j605k454m60K061K732K185K117K434K096
$$ plain form
55223 29013 32507 35813 38435 39374 37565 33873 30761 29458 29077 28820 29134 30168 31032 31384 32039 33347
55207 33347 34646 35920 38134 41078 42799 42217 40523 38847 36358 32204 27873 25789 26368 27885 28644
55192 28644 28153 26774 25347 24751 25078 25531 25497 25045 24204 22761 21191 20658 21449 22403 22484 22010 21764 21831 21940
55173 21940 22049 22051 21726 21444 22044 23677 25671 27656 29698 31193 31162 30136 30236 32623 36164 39236 41459
55156 41459 42924 43242 42433 41571 41459 41606 41295 40499 39029 36187 32346 29561 29225 30093 29967 28635 27945
55139 27945 29478 33154 37518 40558 40877 38961 36867 36150 36672 37712 39000 40048 39837 38329 37267
55124 37267 38199 40410 41881 41752 40930 40699 41393 42029 40929 37529 33768 32381 33390 33835 31709 28519
55108 28519 26887 27347 28925 31155 33558 34495 32890 30436 29976 32037 34769 36954 39071 41505 43601
55093D3601J188K88q65k437l296k409n44Q70J685K455K791J857J03j083j283j392
55077D1529j954k262j494k5R52R21O18Q28J068K22j499k361j471j41J74K32J719
55060C7056M244N586M798L262K442K248K104K152K662L249L255K286K24k427m214
55045F8927l793j535P99K063K375J939M90j700l397l556k332p76R5kl02K78J579
55028F1152K080J046j32J08J227J659J249R07O29j59q48k75J138J839J464P95
55012G3879r0j452k139p03J824K850K024J458J949J887M85p94r72j024j427r32
54996G6823P44J596M55p80l9J691K077Q84m27j180j637j597p46K18M14J35K05
54979G8836N12M14q7n04o30l44O38K056L001L121L006K858K068P80L56J219J648
$$ plain form
55093 43601 44789 45077 44212 41775 38479 36070 35526 36396 38081 40536 43327 45184 45287 44204 42921 41529
55077 41529 39575 37313 35819 35794 36746 37667 38285 39113 40181 40403 38904 36543 35072 34931 35105 35337 37056
55060 37056 41300 46886 51684 54946 57388 59636 61740 63892 66554 69803 73058 75344 75568 73141 68927
55045 68927 65134 63599 64398 66461 68836 70775 71265 69565 66168 62612 60280 59504 59599 59597 59295 59573 61152
55028 61152 63232 64278 64146 64254 65481 67140 68389 69296 69925 69766 68918 68643 69781 71620 73084 73879
55012 73879 73789 72337 70198 69495 71319 74169 76193 77651 79600 81487 81972 81178 80206 79182 77755 76823
54996 76823 77567 79163 79618 78838 78799 80490 82567 83451 83024 81844 80207 78610 77864 78082 78496 78631 78836
54979 78836 79348 79762 79675 79171 78541 78197 78835 80891 83892 87013 90019 92877 94945 95725 96081 97300 98948
54962I8948J28k276l295k353p70K13L13k14p06k54J366L251M448M893M879M444
54946A13015L775L275K713J364n60j847k118k306k771k648j820j583k233j954
54932A04302K30K257J780l52j585j452j502k219k463j827j294j362j283n45K65
54917I2950M75J50k18q4Q62J975J690n81k959k877k31K517L424L040K953L520
54901A06606L747K944J766J476K380L383L388K718K479K873L227L538M556O045
54887A51126O607N876N335O078P259P895Q705J0632J2739J3389J2712J2236J2510
54874B73099J2672J2031J0637Q571N901L110M21k944p536j2052j4338j4040j3002
54861B62530j2862j3420j3592j3050j2265j1497j0278p964m750j860m37l84q20
$$ plain form
54962 98948 99076 96800 93505 91152 90382 90595 90908 90694 89988 89734 91100 94351 98799 103692 108571 113015
54946 113015 116790 120065 122778 124142 123582 121735 119617 117311 114540 111892 110072 108489 106256 104302
54932 104302 104532 106789 108569 108217 106632 105180 103678 101459 98996 97169 95875 94513 93230 92685 92950
54917 92950 93425 93575 93357 93273 94135 96110 97800 97219 94260 91383 91152 93669 97093 100133 103086 106606
54901 106606 110353 113297 115063 116539 118919 122302 125690 128408 130887 133760 136987 140525 145081 151126
54887 151126 157733 163609 168944 175022 182281 190176 198881 209513 222252 235641 248353 260589 273099
54874 273099 285771 297802 308439 317010 322911 326021 326442 323498 315962 303910 289572 275532 262530
54861 262530 249668 236248 222656 209606 197341 185844 175566 167602 162852 160992 160555 160171 159351
54848A59351j340j957k057q51J141K511L140M199N683O053N182N438Q279J1797
54834B06569J3459J3559J3860J4360J3800J2213J0419P876L651j100m196n833
54822B98637q223j1771j4215j4074j2681j1904j1781j1453j0901j0591j0395r749
54810A60899q334o219l921k400k299l113l860m204m125l092r23R86R36n77j252
54795A18502p6J560K088J612J060Q80J156J878K454J985N55p19j288j807k722
54780A27118l298k819j848j547k221l144l430k744j541q24j248k336l005k839
54766I4274k380k225k463k897l218k957j980q66k41O3N09R83J254J828L163M370
54750H7217M059K507J495J809K324K020J456J513J782J291J40n09J58J843L610
$$ plain form
54848 159351 158011 156054 153997 153146 154287 156798 159938 164137 169820 175873 181055 186493 194772 206569
54834 206569 220028 233587 247447 261807 275607 287820 298239 306115 309766 308666 304470 298637
54822 298637 290414 278643 264428 250354 237673 225769 213988 202535 191634 181043 170648 160899
54810 160899 152565 146346 142425 140025 137726 134613 130753 126549 122424 119332 118409 119395 120331 119754 118502
54795 118502 118426 119986 122074 123686 124746 125626 126782 128660 131114 133099 133654 132935 131647 129840 127118
54780 127118 123820 121001 119153 117606 115385 112241 108811 106067 104526 103702 102454 100118 97113 94274
54766 94274 91894 89669 87206 84309 81091 78134 76154 75288 75047 75110 75619 76602 77856 79684 82847 87217
54750 87217 91276 93783 95278 97087 99411 101431 102887 104400 106182 107473 107613 107104 107262 109105 112715
54735A12715M725N072M957M703M607N220O996R388J0970J1186J1221J2382J4299
54722B18441J5733J6488J7152J7455J6464J4168J1383Q176L927q77m550o234o725
54709C21001o930o889o680o862p510p873p579p041o298m770k649j227j091j194
54695B46408m34R64K390M011O044P882R041J0057J1399J2289J1817J0607J0111
54682C42586J0491J0507R452Q174P873Q617R308Q662O117K094k348o213r147j1573
54668C94600j4336j7872k1328k2945k1867j9316j7206j5900j4391j2544j1581
54657B05314j1932j1957r942o511l933l406l903l693k147j14J037O35p79k065
54643A46604k685l045l691m418m389k962m46J779K102J78k434l641k830j113K43
$$ plain form
54735 112715 117440 122512 127469 132172 136779 141999 148995 158383 169353 180539 191760 204142 218441
54722 218441 234174 250662 267814 285269 301733 315901 327284 335460 339387 338510 333960 327726 321001
54709 321001 314071 307182 300502 293640 286130 278257 270678 263637 257339 252569 249920 248693 247602 246408
54695 246408 245974 246938 249328 253339 259383 267265 276306 286363 297762 310051 321868 332475 342586
54682 342586 353077 363584 373036 381210 389083 397700 407008 415670 421787 423881 421533 415320 406173 394600
54668 394600 380264 362392 341064 318119 296252 276936 259730 243830 229439 216895 205314
54657 205314 193382 181425 171483 164972 161039 157633 153730 150037 147890 147776 148813 149448 148669 146604
54643 146604 143919 140874 137183 132765 128376 125414 124968 126747 128849 129027 126593 122952 120122 119009 119252
54628A19252R91J551K230K959L251K498Q78j15R42L420N021M408K598J288Q62
54613A52034O20K91L68J253K732M298N597O565P245P389O482M536K659K148K980
54598B07197L802L504K248J071R82K320M175M714L128J214J709M824P693P914
54584B56495O422N959P689J0463J2862J4638J6142J7259J7480J6575J4907J2891
54572D09782J0280O363J127m136p974j0281j2089j4025j5646j6133j5060j2775
54560C19433j0582j0074j1248j1883j0120p197n941o794p338o049m310l826m028
54547B20043l471k248j514j638k284l380m624m789l076o91L17m71j726k398k646
54532A85404k876l032l046l143l406l534l225k587k154k453l297l541k331n13
$$ plain form
54628 119252 120243 121794 124024 126983 130234 132732 133610 133495 134437 137857 142878 147286 149884 151172 152034
54613 152034 152654 152945 153313 154566 157298 161596 167193 173758 181003 188392 194874 199410 202069 204217 207197
54598 207197 210999 214503 216751 217822 218804 221124 225299 230013 233141 234355 236064 240888 248581 256495
54584 256495 262917 268876 276565 287028 299890 314528 330670 347929 365409 381984 396891 409782
54572 409782 420062 426425 427552 423416 415442 405161 393072 379047 363401 347268 332208 319433
54560 319433 308851 298777 287529 275646 265526 258329 252388 245594 238256 232207 227897 224071 220043
54547 220043 216572 214324 212810 211172 208888 205508 200884 196095 193019 192328 192645 192174 190448 188050 185404
54532 185404 182528 179496 176450 173307 169901 166367 163142 160555 158401 155948 152651 149110 146779 146266
54518A46266J31o90j348q15j78p08j594j171M90J732J655Q32q0r69j548j265k46
54501A40494O31Q16O37P20J461K884M351M639L146Q29p88j279j169n84P85K447
54485A60020L315L227L113L320L034J942J248K143M012N194N151M918N543O812
54471B12992P731P699O991O304O088O287O541O485N829M371K203k46k640n091
54457B71544p662r656j0021q693o954n964n349m030k157j257k064l251l240k542
54443A98704k931m426m847k929m19J76j108k074j470p4J041J691J838J166o9r84
54427A83285j324j650j937j206P10K329K494K181L145N343O862O117L326kk197
54412B07476k264m26K018L684L978L065J552M14N10J591K330J747J70j447k411
$$ plain form
54518 146266 146397 145707 144359 143544 143366 142658 141064 139893 140383 142115 143770 144602 144522 143553 142005 140740 140494
54501 140494 141125 141941 142578 143298 144759 147643 151994 156633 159779 160608 159820 158541 157372 156788 157573 160020
54485 160020 163335 166562 169675 172995 176029 177971 179219 181362 185374 190568 195719 200637 206180 212992
54471 212992 220723 228422 235413 241717 247805 254092 260633 267118 272947 277318 279521 279275 276635 271544
54457 271544 263882 254226 244205 235512 228558 222594 217245 213215 211058 209801 207737 204486 201246 198704
54443 198704 195773 191347 186500 183571 183152 183328 182220 180146 178676 178602 179643 181334 183172 184338 184269 183285
54427 183285 181961 180311 178374 177168 177878 180207 182701 184882 188027 193370 200232 206349 209675 209673 207476
54412 207476 205212 204786 206804 210488 214466 217531 219083 219497 220007 221598 223928 225675 225845 224398 221987
54397B21987k277q76R36J612P93pM77J369J100l9k91R11K147J981M93j418l167
54380B25731m540n388n730n797n644n007l661j783l2P27P4j363k359k434k238
54365A80556k350k362j624k75J064K030K321J505j07j057l51J052J524J198J725
54350A84849L633N233M750K634J076J600L597N087M823L476K678L086M012M772
54336B35306N373N567M510K282N78O77J513J174l20j243q16p1j00r55k404m266
54320B46805n648n246l074r97q81k790n214o400n359k424P22K232J677J47j095
54305B12455j504r93J35J007P91j91q22o73l04o6K90O04J81p91q86O03K314K389
54287B14539Q84m13k64P53J310J045R59K239M716O589O023L043m83k734l357l115
$$ plain form
54397 221987 219710 218834 219770 221382 222175 222168 222645 224014 225114 225075 224784 225695 227842 229823 230316 228898 225731
54380 225731 221191 215803 210073 204276 198632 193625 189964 188181 188149 188876 188950 187587 185228 182794 180556
54365 180556 178206 175844 174220 173945 175009 177039 179360 180865 180758 179701 179350 180402 181926 183124 184849
54350 184849 188482 193715 198465 201099 202175 203775 207372 212459 217282 220758 223436 226522 230534 235306
54336 235306 240679 246246 250756 253038 253616 254293 255806 256980 256660 255417 254601 254530 254430 253475 251071 246805
54320 246805 241157 235911 232837 231840 230959 228169 222955 216555 211196 208772 209494 211726 213403 213550 212455
54305 212455 210951 209958 210093 211100 211891 211700 210878 210205 209901 209835 210125 210729 210910 210119 209233 209836 212150 214539
54287 214539 215423 215010 214746 215499 216809 217854 218813 221052 225768 232357 238380 241423 240940 238206 234849 231734
54271B31734k792k769l027l187k885k391k485l417m460m781m404l968l749l351
54257A84068k328r08q8q38l028n302o304n884m800l482j868l79q0j426l460m813
54241A39080n120m847m106k436M2K011K132O33r43j703k307l428m198l388j715
54226A09707j327k713l713k483q7J112N53m58r69j022n14Q71K582L477L300K751
54210A11067K039O81j220k736l367l422k952j568L58J623J759J524J399Q74j22
54195A05937m56N66J782J572J13r05n28M60P73J43n82n51J05M81J43k50OM80K09
54176A09498p01j151o27K52Q52J191J283R46M44L06K54n68k042k932k683k037
54160A02285j401j31J675K290O48j640k193r14L57O65O14N44j88j747l077l191
$$ plain form
54271 231734 228942 226173 223146 219959 217074 214683 212198 208781 204321 199540 195136 191168 187419 184068
54257 184068 181740 180832 180744 179906 176878 171576 165272 159388 154588 151106 149238 148859 148779 147353 143893 139080
54241 139080 133960 129113 125007 122571 122613 124624 126756 127389 126446 124743 122436 119008 114810 111422 109707
54226 109707 108380 105667 101954 99471 99384 100496 101049 100591 99622 98600 98086 98957 101539 105016 108316 111067
54210 111067 113106 113787 112567 109831 106464 103042 100090 98522 98880 100503 102262 103786 105185 106059 105937
54195 105937 105481 106047 107829 109401 109514 108609 108081 108541 109314 109457 108875 108324 108429 108910 109053 108803 108809 109289 109498
54176 109498 108797 107646 107019 107271 108123 109314 110597 111543 111987 112293 112547 111979 109937 107005 104322 102285
54160 102285 100884 100753 102428 104718 105366 103726 101533 100619 100976 101641 102255 102799 102611 100864 97787 94596
54144I4596k343j378n94K65J260K092K469K356J768N89j200k961l551k502q66
54129I0000k51j000k009k304j927j216l75P4m14j170o87J012J792K61j975k466
54113G7345j284n30j058j628j270o12m98p39p94o28l55J21O73Q82P15N67M37l1
54095G1313m78J83K052L439K657J72j854k024r53p9O6J27Q62K152L121K986J682
54078H5424j79j712k137j272K24J329J688J795K071K266K183K292K925L260K127
54063A02284k11k049k132r00L05O06n0j199k099k174j640j256j238r25O4R50P23
54046H9059l24q43k15O77O97r9p81r26j096j839k818l172k503j120M88J982L003
54029H0170L179K529J708J496K089K887L028K096N29p05r96o62m59o22o49j27
$$ plain form
54144 94596 92253 90875 90281 90546 91806 93898 96367 98723 100491 101080 99880 96919 93368 90866 90000
54129 90000 89749 88749 86740 84436 82509 81293 80918 80992 80578 79408 78721 79733 81525 81786 79811 77345
54113 77345 76061 75531 74473 72845 71575 70963 70465 69726 68932 68304 67949 68070 68743 69625 70340 70907 71344 71313
54095 71313 70835 71018 73070 76509 79166 79338 77484 75460 74507 74428 74494 74621 75483 77635 80756 83742 85424
54078 85424 85245 83533 81396 80124 80348 81677 83365 85160 87231 89497 91680 93972 96897 100157 102284
54063 102284 102073 100024 97892 96992 97297 97903 97853 96654 94555 92381 90741 89485 88247 87322 87386 88336 89059
54046 89059 88735 87892 87677 88354 89051 88952 88171 87245 86149 84310 81492 78320 75817 74697 75185 77167 80170
54029 80170 83349 85878 87586 89082 91171 94058 97086 99182 99711 99006 98010 97348 96889 96267 95618 95491
54013I5491O63J054O44m21j527j851r80N49J694K070K337L132M096M300L390J900
53997A16541O75K36M90Q11O31J76K17R15J438J193P53R51J530J527P49j71r13
53980A27749j655k020j079J119K992L254K623K857M468O308P182O986O245N480
53966A72509N295O216P838Q745Q033O580O083O955P978P980P035N818M713M032
53952B65810M293N388O005M853K377L84q6K67K58l49j033j588k378l657n004n616
53936B69924n174m392m399n442o443o248m995l806l442l830m594n257n022l354
53922B03526r96K91n52k771m540m460k493O0J505J230K74m1K79L37j04n79j058
53905A89908j792k164j266K64P02j09l93N96J202J00j359j207K01J133J315J710
$$ plain form
54013 95491 96154 97208 97852 97431 95904 94053 93073 93622 95316 97386 99723 102855 106951 111251 114641 116541
53997 116541 117216 117452 117942 118753 119384 119560 119777 120692 122130 123323 124076 125027 126557 128084 128833 128662 127749
53980 127749 126094 124074 122995 124114 127106 130360 132983 135840 140308 146616 153798 160784 167029 172509
53966 172509 177804 184020 191858 200603 208636 215216 221299 228254 236232 244212 251247 257065 261778 265810
53952 265810 270103 275491 281496 286349 288726 289110 289024 289291 289549 289200 288167 286579 284201 280544 275540 269924
53936 269924 264750 260358 255959 250517 244074 237826 232831 229025 225583 221753 217159 211902 206880 203526
53922 203526 202530 202821 202269 199498 194958 190498 188005 188065 189570 190800 191074 191033 191312 191649 191545 190966 189908
53905 189908 188116 185952 184686 184950 185652 185543 185150 185746 186948 187048 185689 184482 184683 185816 187131 188841
53889A88841K323K270J759J890K547K401J247N96J366K574K959K708K823L659
53875B19963M754N456N357M730M617N764P410Q031P363O580O343N903M587K975
53861B99833J896J279P80O47J109J633J715J817K597L683M197M163M459N434O407
53846C41649O588N919N015M709N658P768J0027J1308J1342J0570R273P395N139
53833D42360L039J361k0j099j646j740j767j713j155l09l44k024m501o252o819
53818D17371o886o969o993p026p379p918q237q591r581j0617j0075p702n502n263
53804C08632o276o840o944p734r010r257q061o648n899n471n145n241n323m243
53790B16540k183r76j576k787l450m162n495o199m968k845j910k278k336j538
$$ plain form
53889 188841 191164 193434 195193 197083 199630 202031 203278 203874 205240 207814 210773 213481 216304 219963
53875 219963 224717 230173 235530 240260 244877 250641 258051 266082 273445 280025 286368 292271 296858 299833
53861 299833 301729 303008 303788 304435 305544 307177 308892 310709 313306 316989 321186 325349 329808 335242 341649
53846 341649 348237 354156 359171 363880 369538 377306 387333 398641 409983 420553 429826 437221 442360
53833 442360 445399 446760 446740 445641 443995 442255 440488 438775 437620 437311 436967 434943 430442 424190 417371
53818 417371 410485 403516 396523 389497 382118 374200 365963 357372 347791 337174 327099 319397 313895 308632
53804 308632 302356 295516 288572 280838 271828 262571 254510 247862 241963 236492 231347 226106 220783 216540
53790 216540 214357 213381 211805 209018 205568 201406 195911 189712 184744 181899 179989 177711 175375 173837
53776A73837j048j622k445k406j295M25K077K902K599J798J312J090N82k67j083
53761A76456j702j815p00J546L173K689J162Q90K084K742J827N92K07K1p75j348
53745A87049m24J629L235L601L375L571M512N698O289N947N281N121N475N837
53731B46196O384P858J0026J1320J0555Q270N901M294L540L612M373N272N517
53718C33118M542K342l58k312k656j652j90J171K042J602n90l303m446l601k522
53703C23187k753l891m792n231n492n329m472l508l215l289k647q45J438L152
53689B82313L590K594M91k100m644o679p606p060n584m267l538k961k367k212
53675B39970k449k060n78P23J70k107m124m142k237J22J488J432M98o68j892k987
$$ plain form
53776 173837 172789 171167 168722 166316 165021 165446 167523 170425 173024 174822 176134 177224 177806 177539 176456
53761 176456 174754 172939 172239 173785 176958 179647 180809 181699 183783 186525 188352 188944 189151 189172 188397 187049
53745 187049 186625 188254 191489 195090 198465 202036 206548 212246 218535 224482 229763 234884 240359 246196
53731 246196 252580 260438 270464 281784 292339 300609 306510 310804 314344 317956 322329 327601 333118
53718 333118 337660 340002 339644 337332 334676 333024 332834 334005 336047 337649 337059 333756 329310 325709 323187
53703 323187 320434 316543 311751 306520 301028 295699 291227 287719 284504 281215 278568 277723 279161 282313
53689 282313 285903 288497 288988 286888 282244 275565 267959 260899 255315 251048 247510 244549 242182 239970
53675 239970 237521 235461 234883 235606 235776 233669 229545 225403 223166 223288 224776 226208 226706 226038 224146 221159
53659B21159l196k020m89l67j701k306n33K389L785K757Q90J16Q39K192L210L508
53643B30233L293L055L044L021K567J576M35j77K36J464K548K716K191J805K040
53628B60047K860M176N646O432O133N705O276P245P010N509M332M077L558K297
53614C31303J650K251K288J70k591l317j946o91n61m33N33J609K006J968J881
53599C36120J587J083Q66J213J835K444K843K523J159m73j113o98m56j088j887
53584C45958j982j534j247j399j801k118j961j165q2P87J426J967J990J162L89
53569C40390J070K893L752K495N60rQ30J670J990K483L432M117M143M071M245
53554C78132L980K703J284J260K878M772N661N589N286N040M855N173O473Q332
$$ plain form
53659 221159 217963 215943 215454 215087 213386 211080 210547 212936 216721 219478 220368 220484 221323 223515 226725 230233
53643 230233 233526 236581 239625 242646 245213 246789 247224 247047 247283 248747 251295 254011 256202 258007 260047
53628 260047 262907 267083 272729 279161 285294 290999 297275 304520 311530 317039 321371 325448 329006 331303
53614 331303 332953 335204 337492 337662 335071 331754 329808 329117 328556 328123 328656 330265 332271 334239 336120
53599 336120 337707 338790 339656 340869 342704 345148 347991 350514 351673 351200 350087 349389 348933 347845 345958
53584 345958 343976 342442 341195 339796 337995 335877 333916 332751 332669 333456 334882 336849 338839 340001 340390
53569 340390 341460 344353 348105 350600 351160 351151 351981 353651 355641 358124 361556 365673 369816 373887 378132
53554 378132 382112 384815 386099 387359 390237 395009 400670 406259 411545 416585 421440 426613 433086 441418
53540D41418R590R555Q435O671M660L207L245M659O126O678O824P530Q699R363
53526E36660Q992P946O864O173N965N938N677N195M823M417L427K119J635K296
53512F08127K797K117J156J137J324K03j658k047n39P21L15l55M69J984K135Q85
53496F18771J85R05J642R93m61j355j613k046k377j243J519L955M301L307L000
53481F29483L683L758K487J228J231J793J755J589K498M208N290N474O089P991
53467F78557J0297J1525J1210J0090R294R555J0732J2058J3220J4840J7365J9966
53455H28709K1443K1767K1805K1885K1835K2119K3506K5591K7150K8063K9388
53444A093261L1305L2656L3144L4217L6644L8837L9201L8916M0430M3708M6084
$$ plain form
53540 441418 451008 460563 468998 475669 480329 483536 486781 491440 497566 504244 511068 518598 527297 536660
53526 536660 545652 553598 560462 566635 572600 578538 584215 589410 594233 598650 602077 604196 605831 608127
53512 608127 610924 613041 614197 615334 616658 616861 615203 613156 612617 613338 613653 613298 613767 615751 617886 618771
53496 618771 618956 619861 621503 622496 622035 620680 619067 617021 614644 613401 614920 618875 623176 626483 629483
53481 629483 633166 636924 639411 640639 641870 643663 645418 647007 649505 653713 659003 664477 670566 678557
53467 678557 688854 700379 711589 721679 730973 740528 751260 763318 776538 791378 808743 828709
53455 828709 850152 871919 893724 915609 937444 959563 983069 1008660 1035810 1063873 1093261
53444 1093261 1124566 1157222 1190366 1224583 1261227 1300064 1339265 1378181 1418611 1462319 1508403
53433A508403M6052M5349M6403M9004N0730N0116M8246M7128M7427M8135M7980
53422B034973M6591M4606M3214M3505M5643M8524N0707N1760N2186N1910M9904
53411B563523M5918M1676L9229L8482L7378L4466L0331K6650K4590K4086K3845
53400B930174K2219J8805J5154J3083J2536J1958J0436Q249N560K076j867n421
53388C042962q741j2961j8114k2474k4886k6401k8621l1595l4438l7070l9914
53377B757747m2499m3870m4109m4311m4936m5216m4312m2326m0021l8127l7002
53366B291018l6536l6124l5060l3083l0515k7900k5568k3441k1263j9096j7349
53355A985083j5924j3640r334l532J722M991O830Q935J2503J7523K2946K7393
$$ plain form
53433 1508403 1554455 1599804 1646207 1695211 1745941 1796057 1844303 1891431 1938858 1986993 2034973
53422 2034973 2081564 2126170 2169384 2212889 2258532 2307056 2357763 2409523 2461709 2513619 2563523
53411 2563523 2609441 2651117 2690346 2728828 2766206 2800672 2831003 2857653 2882243 2906329 2930174
53400 2930174 2952393 2971198 2986352 2999435 3011971 3023929 3034365 3042614 3048174 3050250 3048383 3042962
53388 3042962 3034221 3021260 3003146 2980672 2955786 2929385 2900764 2869169 2834731 2797661 2757747
53377 2757747 2715248 2671378 2627269 2582958 2538022 2492806 2448494 2406168 2366147 2328020 2291018
53366 2291018 2254482 2218358 2183298 2150215 2119700 2091800 2066232 2042791 2021528 2002432 1985083
53355 1985083 1969159 1955519 1946185 1942653 1944375 1949366 1956196 1965131 1977634 1995157 2018103 2045496
53343B045496L0393L2964L6298L9992M2725M4558M7035N0605N3741N5516N7451
53332B536774O1317O6370P0450P3111P5932P9989Q4487Q8139R0743R3152R6238
53321C416702R9959J03137J04515J04327J04227J05285J06941J08406J09916J11517
53311D474932J11861J09681J05717J01683R7834R3230Q7785Q2340P6908P0645
53301E412616O3557N6564M9815M2607L5197K8901K3874J8501J1609L796m207j2897
53289E729933k2653l2345m0656m7974n5768o4625p3912q2804r0723r7177j02014
53278E019282j05519j07718j08177j07207j06476j07283j08771j08961j07382
53269D051788j05410j04027j02612j00380r7843r5944r4372r1821q7875q3730
$$ plain form
53343 2045496 2075889 2108853 2145151 2185143 2227868 2272426 2319461 2370066 2423807 2479323 2536774
53332 2536774 2598091 2664461 2734911 2808022 2883954 2963943 3048430 3136569 3227312 3320464 3416702
53321 3416702 3516661 3619798 3724313 3828640 3932867 4038152 4145093 4253499 4363415 4474932
53311 4474932 4586793 4696474 4802191 4903874 5001708 5094938 5182723 5265063 5341971 5412616
53301 5412616 5476173 5532737 5582552 5625159 5660356 5689257 5713131 5731632 5743241 5747037 5742830 5729933
53289 5729933 5707280 5674935 5634279 5586305 5530537 5465912 5392000 5309196 5218473 5121296 5019282
53278 5019282 4913763 4806045 4697868 4590661 4484185 4376902 4268131 4159170 4051788
53269 4051788 3946378 3842351 3739739 3639359 3541516 3445572 3351200 3259379 3171504 3087774
53259C087774q0713p8634p6171p2572o8307o3948n9242n3793m8120m3269l9501
53248B403504l6121l2613k9171k6029k3016k0145j7883j6266j4329j1132p092
53237B169707l578j221O85L032N814Q504J0933J3247J5346J7056J8868K1698K5518
53224B305609K9030L1340L3353L6444M0108M2399M2825M3351M5715M8987N0838
53213B749999N0308M8172M5423M2700M0707L9688L8697L6643L3846L1375K9206
53202C186764K6459K3253K0568J8351J5487J1887Q736O213K925j653o092r462
53190C303436j2973j7676k2403k5891k9505l5378m2705m8440n1549n4102n7761
53179B905053o1392o3181o3391o3661o4486o4795o3669o1507n9377n7867n6752
$$ plain form
53259 3087774 3007061 2928427 2852256 2779684 2711377 2647429 2588187 2534394 2486274 2443005 2403504
53248 2403504 2367383 2334770 2305599 2279570 2256554 2236409 2218526 2202260 2187931 2176799 2169707
53237 2169707 2166129 2164908 2165593 2168625 2174439 2182943 2193876 2207123 2222469 2239525 2258393 2280091 2305609
53224 2305609 2334639 2365979 2399332 2435776 2475884 2518283 2561108 2604459 2650174 2699161 2749999
53213 2749999 2800307 2848479 2893902 2936602 2977309 3016997 3055694 3092337 3126183 3157558 3186764
53202 3186764 3213223 3236476 3257044 3275395 3290882 3302769 3311505 3317718 3320643 3318990 3312898 3303436
53190 3303436 3290463 3272787 3250384 3224493 3194988 3159610 3116905 3068465 3016916 2962814 2905053
53179 2905053 2843661 2780480 2717089 2653428 2588942 2524147 2460478 2398971 2339594 2281727 2224975
53168B224975n5558n4166n2719n1277m9882m8932m8842m9207m9034m8088m7265
53157A670005m7098m6813m5515m3526m1567l9386l6365l2978l0431k9126k8495
53146A248705k8020k7392k6130k4283k3052k3331k4046k3463k1865k1039k1189
53135I84895k0511j8311j6421j6525j7811j8587j8672j8793j8755j7845j6385
53124G86279j5512j5689j6526j7658j8809j9242j8211j6012j3927j2971j3001
53113F08721j2993j2191j1131j1220j2767j3909j2701r999q575r272r955q913
53101D75095p238o688p102p441p761q371q491p597o783o815o156l337n7P15j000
53086C90973k639l228m023n207n302m303m121n050m825k572o65r46j782j062K41
$$ plain form
53168 2224975 2169417 2115251 2062532 2011255 1961373 1912441 1863599 1814392 1765358 1717270 1670005
53157 1670005 1622907 1576094 1530579 1487053 1445486 1406100 1369735 1336757 1306326 1277200 1248705
53146 1248705 1220685 1193293 1167163 1142880 1119828 1096497 1072451 1048988 1027123 1006084 984895
53135 984895 964384 946073 929652 913127 895316 876729 858057 839264 820509 802664 786279
53124 786279 770767 755078 738552 720894 702085 682843 664632 648620 634693 621722 608721
53113 608721 595728 583537 572406 561186 548419 534510 521809 511810 503235 493963 484008 475095
53101 475095 467857 461169 454067 446626 438865 430494 422003 414406 407623 400808 394652 391315 391258 391973 390973
53086 390973 388334 385106 381083 375876 370574 366271 362150 357100 352275 349703 349038 348092 346310 345248 345489
53071C45489J5j410k290k668l689m700l888j516M9l63j541k075j783p68R14K276
53055C22052J883p8j669j742j283j557k242k232j318j72P21J326J576J224J02
53040C16591j579l005l120j718L5Q20O09J34n74j884k981k253L99K995L917L651
53024C12037L417L332K987K820L369L811K732K66j850k587k789l614m797n277
53010C13857m970m861n494o207o239n820n528n014l373q93O01k50k552m194m225
52995B54838l430k729k115j408j199k262m328n918n577l183j75J526J033r23k802
52980B21348l538l075k085j442j680k592l477l941m040l598k102J23J404L99k112
52965A89592m052m378l714k828j758m94M78P51M30j87p99r91o19k49m71r43j038
$$ plain form
53071 345489 345504 344094 341804 339136 335447 330747 326859 325343 325392 325029 323488 321413 319630 318862 319776 322052
53055 322052 323935 323857 322188 320446 319163 317606 315364 313132 311814 311642 312363 313689 315265 316489 316591
53040 316591 315012 312007 308887 307169 307204 308024 308633 308767 308193 306309 303328 301075 301474 304469 308386 312037
53024 312037 315454 318786 321773 324593 327962 331773 334505 334771 332921 330334 327545 323931 319134 313857
53010 313857 308887 304026 298532 292325 286086 280266 274738 269724 266351 265458 266059 265809 263257 259063 254838
52995 254838 251408 248679 246564 245156 243957 241695 237367 231449 225872 222689 222514 224040 225073 224150 221348
52980 221348 217810 214735 212650 211208 209528 206936 203459 199518 195478 191880 189778 189901 191305 191704 189592
52965 189592 185540 181162 177448 174620 172862 172368 172846 173597 174027 173840 173041 172050 171431 171182 170711 169768 168730
52948A68730j130k051l256l047j029J013J347K27q96j084j55J573K969K545J68
52933A65924k378l386k926k000j029j03L25J54K53J107J722J188N50J408L153
52918A63962L487J687m00j002n18l17p04j013q81n46k99k60m70o65k75R50K350
52901A65086K832J966N14k97L2R46J743K476L453M165L702K408J963L155M525
52886A98669M244K673J820K665M219N172N247M736L786K618J841K000L082M513
52872B47285N479N388M477L649L274K451K81k490m050l677k362j381j175j745
52858B55404l000m302m587l529j977q55j70M55R47R06K16q90k004k601k308j376
52842B30329n19j97m74j476l159m556m222k012L67J210O74K09O08J378J782J681
$$ plain form
52948 168730 167600 165549 162293 159246 158217 159230 160577 160804 159908 158824 158669 160242 163211 165756 165924
52933 165924 163546 160160 157234 155234 154205 154102 154427 154581 154834 155941 157663 158851 159401 160809 163962
52918 163962 167449 169136 168736 167734 167216 166899 166195 165182 164301 163755 163456 163196 162726 162061 161786 162736 165086
52901 165086 167918 169884 170398 170101 170133 171079 172822 175298 178751 182916 186618 189026 190989 194144 198669
52886 198669 202913 205586 207406 210071 214290 219462 224709 229445 233231 235849 237690 239690 242772 247285
52872 247285 252764 258152 262629 266278 269552 272003 272284 269794 265744 262067 259705 258324 257149 255404
52858 255404 252404 248102 243515 239986 238009 237154 236984 237439 238386 239292 239508 238618 236614 234013 231705 230329
52842 230329 229810 229613 229139 227663 224504 219948 215726 213714 214081 215291 215965 216174 216782 218160 219942 221623
52826B21623J371J030N19l94j597k504k635k212j837j542q91K5M77K86J35K47
52810B12101k78j906l359l027j239K13N62O92J229J503J075R84K285M058M212
52795B19105K213j73j153r79j031j525j281K58J873K152J484J489K738M085M389
52780B33644L900L372K762J645M71K87J305K512K859K212J019k52j136j258p61
52765B52581l19l47n79o38n32k87M64J914L381L917L475K845K503K113J272J52
52749B71915q24j406j404p35N3o3j377k881l456l162k750k407j976k087l752o465
52733B37223q000o833m009j866j345j499j279q86j161k428m178n531n747m649
52719A87812k827j286o45o75p86q28j143j816k262j902j071p11j179j855k146
$$ plain form
52826 221623 222994 224024 224543 224149 222552 220048 217413 215201 213364 211822 210931 210956 211433 211719 211854 212101
52810 212101 211823 209917 206558 203531 202292 202505 203067 203759 204988 206491 207566 208550 210835 214893 219105
52795 219105 221318 221145 219992 219013 217982 216457 215176 215434 217307 219459 220943 222432 225170 229255 233644
52780 233644 237544 240916 243678 245323 245794 246081 247386 249898 252757 254969 255988 255736 254600 253342 252581
52765 252581 252262 251915 251336 250698 250166 249879 250343 252257 255638 259555 263030 265875 268378 270491 271763 271915
52749 271915 271091 269685 268281 267546 267599 267536 266159 263278 259822 256660 253910 251503 249527 247440 243688 237223
52733 237223 229223 222390 218381 216515 215170 213671 212392 211506 210345 207917 203739 198208 192461 187812
52719 187812 184985 183699 183054 182379 181593 180765 179622 177806 175544 173642 172571 171860 170681 168826 166680
52704A66680k253k553k815k650k302k208k161j713j152j151j532j509j072j014
52690A40595j467j572r32k51p5K8L81L99m25j562k167k011j185R0Q09l59l055
52673A27241m840m086k174j478k142k429j553l53M82J132J655J721J446J300J138
52658A17060M58m85r70r90j076j112n44L66P94P35Q45J047O77l8j04N10P50K46
52640A18169j64MR7n23j693k945l777l458j827j34L48L70J624L770M600L424J978
52623A19863J456R40l01j152o30M46J134J896L042L474K636K060L118M611M639
52608A47232L547K995L139K861K121J935K440K864L026L164K639O65j932l378
52594A73318l312k827k458j800j086j322k591l674l752l270k947k933l067k973
$$ plain form
52704 166680 164427 161874 159059 156409 154107 151899 149738 148025 146873 145722 144190 142681 141609 140595
52690 140595 139128 137556 136624 136373 136298 136326 136707 137106 136681 135119 132952 130941 129756 129846 130655 130296 127241
52673 127241 122401 118315 116141 114663 112521 110092 108539 108186 108668 109800 111455 113176 114622 115922 117060
52658 117060 117518 117033 116063 115073 113997 112885 112341 112707 113501 114236 115081 116128 116805 116767 116663 117173 117923 118169
52640 118169 118005 118009 118106 117583 115890 112945 109168 105710 103883 103749 104097 104467 106091 109861 114461 117885 119863
52623 119863 121319 122259 121958 120806 120176 120622 121756 123652 126694 130168 132804 134864 137982 142593 147232
52608 147232 150779 153774 156913 159774 161895 163830 166270 169134 172160 175324 177963 178628 176696 173318
52594 173318 170006 167179 164721 162921 161835 160513 157922 154248 150496 147226 144279 141346 138279 135306
52580A35306k029l05P77k2j834k621j847p14R8J120K374K732J615j10j417k126
52564A30997k220j476l14J73k82o83l35J99K67J11N5k77j124j796j495m08O68
52547A22060J238J137L88m54l46J163L197M326L843K140K61q24r31p64r50j091
52531A34393m23Q78J831J982J663J016r4j166j198%J621L100M397N005M082K108
52515A59195Q97J326K156J961J072P28J227J755J478J66j487k022n93J571K341
52500A71771J599J241J889J756o4j483m77J599K127J151O16P20J9j237j016R47
52484A81158K302J587J95k58l85j338k522k633j829j198r67p00n44p84o38R18
52468A72364L153L958K539N20j31N99J288J234J100J526J969J522M12q2P35K017
$$ plain form
52580 135306 133277 132972 133749 133727 131893 129272 127425 126711 126809 127929 130303 133035 134650 134540 133123 130997
52564 130997 128777 127301 126987 127160 126878 126195 125860 126059 126326 126437 126492 126215 125091 123295 121800 121392 122060
52547 122060 123298 124435 124823 124369 124023 125186 128383 132709 136552 138692 138953 138129 137198 136434 135484 134393
52531 134393 133970 134848 136679 138661 140324 141340 141246 140080 138882 138882 140503 143603 148000 153005 157087 159195
52515 159195 160092 161418 163574 165535 166607 167335 168562 170317 171795 171961 170474 168452 167859 169430 171771
52500 171771 173370 174611 176500 178256 178192 176709 176232 177831 179958 181109 181725 182445 182464 181227 180211 181158
52484 181158 183460 185047 185242 184984 184599 183261 180739 178106 176277 175079 174112 173412 172868 172084 171446 172364
52468 172364 175517 179475 182014 182534 182403 183002 184290 185524 186624 188150 190119 191641 192053 191971 192706 194723
52452A94723K456J846R51K37m86j171j285p44l24o72j415j799j699j459j065k32
52436A87862Q49J514J457J035O30K31k18n32o26p55j027r85j58J134K067K290
52420A94768K132J745Q48m54j273j028l28k6J30Q74J693J145q33k233j433O79
52404A96406J991J798J028L95l13j132j390o24Q09K289L265L016J046j780l370
52389B03434k458n2J743K000J456J108J054O83m00j774k459j872o66j36o46j159
52373A99856p24J55M00Q3K97J342K193K123J887K442L227K712O61j245j441l51
52357B13617M49M59O18J449J907Q30j145k228j809r67n27J62J727L114K704O17
52341B20977j307j787j126Q7J898M015N085M053J659l68j196j122l81J124K935
$$ plain form
52452 194723 197179 199025 199976 200213 199727 198556 197271 196527 196203 195531 194116 192317 190618 189159 188094 187862
52436 187862 188711 190225 191682 192717 193347 193578 193360 192828 192202 191447 190420 189435 189277 190411 192478 194768
52420 194768 196900 198645 199493 199039 197766 196738 196410 196384 196514 197388 199081 200226 199393 197160 195727 196406
52404 196406 198397 200195 201223 201618 201305 200173 198783 198159 198968 201257 204522 207538 208584 206804 203434
52389 203434 200976 200924 202667 204667 206123 207231 208285 208968 208568 206794 204335 202463 201797 201661 201015 199856
52373 199856 199132 199287 199687 199770 200067 201409 203602 205725 207612 210054 213281 215993 216654 215409 213968 213617
52357 213617 214066 214525 215143 216592 218499 219329 218184 215956 214147 213180 212653 212815 214542 217656 220360 220977
52341 220977 219670 217883 216757 216844 218742 222757 227842 231895 233554 233186 231990 230868 230487 231611 234546
52326B34546L992L823L096K663K582K413J937J270O74M29O07Q39Q88J442L478
52311B64679O424P858N955J746j846k944k013n82K70K05m93r09q8J845L564L810
52295B87481K562Q34k50l6J315K756L100K318J636J866K142J070j103k455j652
52280C01584M56J918J790P45j1J44J060K107K576K253J754J948K928L829L933
52265C29014L509L256L240L009K581K593L298M036M039L320K446J828J734K605
52251C70508M681P312R167R339Q027O248N084N064N822O367O101N489N448O160
52237D60817P046P826Q857J0214J1187J1196J0678J0477J0639J0531R981R586
52225E79035R760J0112J0088R782R756J0252J0997J1656J2084J2146J1711J0883
$$ plain form
52326 234546 238538 242361 245457 248120 250702 253115 255052 256322 256996 257425 258032 258871 259759 261201 264679
52311 264679 271103 278961 284916 286662 284816 281872 279859 279277 279547 279752 279259 278350 278262 280107 283671 287481
52295 287481 290043 290877 290627 290591 291906 294662 297762 300080 301716 303582 305724 306794 305691 303236 301584
52280 301584 302040 303958 305748 306493 306482 306626 307686 309793 312369 314622 316376 318324 321252 325081 329014
52265 329014 332523 335779 339019 342028 344609 347202 350500 354536 358575 361895 364341 366169 367903 370508
52251 370508 375189 382501 391668 401007 409034 415282 420366 425430 431252 437619 443720 449209 454657 460817
52237 460817 467863 475689 484546 494760 505947 517143 527821 538298 548937 559468 569449 579035
52225 579035 588795 598907 608995 618777 628533 638785 649782 661438 673522 685668 697379 708262
52213G08262J0021R457R468J0415J2331J4215J4534J2946J0913R921R588Q626
52201H40697P246P095Q659J0239J0241R115Q100P216N913M743M687N213M776L316
52187I37256K542L366M479M257K900J839J814K454L140L542L558L391L298L120
52173I80956K605K437L971P184R881R992Q159O807P099Q074Q729R364J0503J1733
52159A087494J2495J3126J4156J5150J5223J4424J3583J2943J1964J0684J0128
52148A231370J0748J1346J0518Q636P218O579N490L389J509J037J295Q72l25j393
52134A298289k179l282m486m817m202l651l452k733j382r46k472m545m864l223
52120A252055j660j835l357m665m716l688k614k447l202m028m354m491m747m698
$$ plain form
52213 708262 718283 727740 737208 747623 759954 774169 788703 801649 812562 822483 832071 840697
52201 840697 847943 855038 863697 873936 884177 893292 901392 908608 914521 919264 923951 929164 933940 937256
52187 937256 939798 943164 947643 951900 954800 956639 958453 960907 964047 967589 971147 974538 977836 980956
52173 980956 983561 985998 989969 997153 1007034 1017026 1025185 1031992 1039091 1047165 1055894 1065258 1075761 1087494
52159 1087494 1099989 1113115 1127271 1142421 1157644 1172068 1185651 1198594 1210558 1221242 1231370
52148 1231370 1242118 1253464 1263982 1272618 1279836 1286415 1291905 1295294 1296803 1297840 1299135 1300007 1299682 1298289
52134 1298289 1296110 1292828 1288342 1283525 1279323 1275672 1272220 1269487 1268105 1267159 1264687 1260142 1255278 1252055
52120 1252055 1250395 1248560 1245203 1240538 1235822 1232134 1229520 1227073 1223871 1219843 1215489 1210998 1206251 1201553
52106A201553l908k945k714l159l530l679m029m392m083l312l301m479n640n596
52092A146786m860m801n609o192n882n283n140n201m800m174m318n481o441n971
52078A072633m595m050m921n687m709k457r88j517l348n089o033o158n613m696
52064A012772l880l463l384l616m307n253n673n022l882l582m786o700p719o871
52050I44634m667k597j726j778j710j008j22M45R48J962L370M273M081L277K990
52035I52372L866N553P229Q379R012R327R428R387R462J0100J1581J3635J5409
52022A074740J6125J5979J6102J7348J9198K0355K0302J9758J9436J9048J7988
52011A276379J6480J5455J5435J6000J6289J5697J4232J2546J1374J0660R564
$$ plain form
52106 1201553 1197645 1194700 1191986 1188827 1185297 1181618 1177589 1173197 1169114 1165802 1162501 1158022 1152382 1146786
52092 1146786 1141926 1137125 1131516 1125324 1119442 1114159 1109019 1103818 1099018 1094844 1090526 1085045 1078604 1072633
52078 1072633 1068038 1063988 1059067 1053380 1048671 1046214 1045226 1043709 1040361 1035272 1029239 1023081 1017468 1012772
52064 1012772 1008892 1005429 1002045 998429 994122 988869 983196 978174 974292 970710 965924 959224 951505 944634
52050 944634 939967 937370 935644 933866 932156 931148 931026 931471 932419 934381 937751 942024 946105 949382 952372
52035 952372 956238 961791 969020 977399 986411 995738 1005166 1014553 1024015 1034115 1045696 1059331 1074740
52022 1074740 1090865 1106844 1122946 1140294 1159492 1179847 1200149 1219907 1239343 1258391 1276379
52011 1276379 1292859 1308314 1323749 1339749 1356038 1371735 1385967 1398513 1409887 1420547 1430111
52000A430111P756O315O491P761Q052O189L300J392J099J421J261M36p74k361
51986A478449m462o708q188q279p392o613o439o301n574m666m534n243n765n370
51972A392915m513m009l811l231k037q48m93j189k329k765j763J79J651J893J574
51957A371224J552J501O47n26o51L31P67l10j690j965j842k910m764n363m240
51942A351761l523n012p822r907j0756j1378j2498j4080j5980j7850j8816j8524
51930A205615j8139j9024k0759k1923k2533k3947k6100k6897k5174k2746k2200
51919I56173k3769k5621k6363k5971k4872k3520k2700k3058k4213k5028k4713
51908F86345k3279k1144j8925j7239j6179j5310j4675j5031j6272j6498j4042
$$ plain form
52000 1430111 1437867 1444182 1450673 1458434 1466486 1472675 1475975 1477367 1478466 1479887 1481148 1481584 1480810 1478449
51986 1478449 1473987 1467279 1459091 1450812 1443420 1436807 1430368 1424067 1418493 1413827 1409293 1404050 1398285 1392915
51972 1392915 1388402 1384393 1380582 1377351 1375314 1374466 1373973 1372784 1370455 1367690 1365927 1366106 1367757 1369650 1371224
51957 1371224 1372776 1374277 1374924 1374398 1373747 1374078 1374845 1374535 1372845 1370880 1369038 1366128 1361364 1356001 1351761
51942 1351761 1348238 1343226 1335404 1325497 1314741 1303363 1290865 1276785 1260805 1242955 1224139 1205615
51930 1205615 1187476 1168452 1147693 1125770 1103237 1079290 1053190 1026293 1001119 978373 956173
51919 956173 932404 906783 880420 854449 829577 806057 783357 760299 736086 711058 686345
51908 686345 663066 641922 622997 605758 589579 574269 559594 544563 528291 511793 497751
51897D97751r990p248p112q280r291j0175j1131j1134r246o461m879n318o683
51884C90803p632p942q120q248p725o097l893k368k210k707k602j719j186j895
51870C26459l277m049l769l152k964l143l102k547j744j107q71j135j984l172
51856B90443l886l372j946r56j281k293k727k299j861j978k122j452o1R75P18
51841B65902n81j658j534n86n3n56j552k285k627k675k336j800j759k425k939
51826B40536k561j851j643j486l77J230J664L43j461k435k384j320J030M097O044
51811B39426N651L831K352J746J356P88K57j98q15j527j900j702j039j38O53J026
51795B49767J194J745K600K753J710M55P6J02n38j368p52J475L352L422K590K417
$$ plain form
51897 497751 487761 480513 473401 465121 455830 445655 434524 423390 414144 407683 402804 397486 390803
51884 390803 383171 375229 367109 358861 351136 345039 341146 338778 336568 333861 331259 329540 328354 326459
51870 326459 323182 319133 315364 312212 309248 306105 303003 300456 298712 297605 296734 295599 293615 290443
51856 290443 286557 283185 281239 280283 279002 276709 273982 271683 269822 267844 265722 264270 264209 265184 265902
51841 265902 265321 263663 262129 261543 261490 260934 259382 257097 254470 251795 249459 247659 245900 243475 240536
51826 240536 237975 236124 234481 232995 232618 233848 235512 235855 234394 231959 229575 228255 229285 233382 239426
51811 239426 245077 248908 251260 253006 254362 255150 255407 255209 254394 252867 250967 249265 248226 248088 248741 249767
51795 249767 250961 252706 255306 258059 259769 260224 260300 260402 259864 258496 257744 259219 262571 265993 268583 271000
51779B71000K754K437J605J592K587L006J807N3p52q20j237j676o57J840L691
51764B87230L219J246k54m76J43J144J994J648j86j777j096J255K627K079J579
51749C00375K671L929L211J034k28K46R78P49J72L59J332K307K781K847K925L488
51733C29176M550N298M817L364K405L087N009O742P162O265M979M484N245O522
51719C99105P025O310N241M940N554O318O560O192N318L774J409j286l131l274
51705D50055k193j469k254m177n879o439n955m994l961l048k365j859j417j122
51691D02923j112j095n56L73P04j95j554k048j529j074j289j491r10K5L70K5l84
51674C91183n97p73o91QO80k5k242m234m355k928j483p94n27l72n01j005j584
$$ plain form
51779 271000 273754 276191 277796 279388 281975 284981 286788 286841 286089 285269 284032 282356 281699 283539 287230
51764 287230 290449 291695 291441 290965 291108 292252 294246 295894 295708 293931 292835 294090 296717 298796 300375
51749 300375 303046 306975 310186 311220 310992 311238 312216 312965 313137 313496 314828 317135 319916 322763 325688 329176
51733 329176 333726 339024 343841 347205 349610 352697 357706 364448 371610 377875 382854 387338 392583 399105
51719 399105 406130 412440 417681 422621 428175 434493 441053 447245 452563 456337 457746 456460 453329 450055
51705 450055 447862 446393 444139 439962 434083 427644 421689 416695 412734 409686 407321 405462 404045 402923
51691 402923 401811 400716 400160 400533 401237 401042 399488 397440 395911 394837 393548 392057 391147 391172 391542 391567 391183
51674 391183 390586 389813 389122 389130 389810 389785 387543 383309 378954 376026 374543 373749 373222 372850 372349 371344 369760
51657C69760j836j513p10j57p44k179k738j319Q17J493L87r25j464j769k178j832
51641C53093j78J802K793K732K327J714N69q78j820j748q07N18J687K221J950
51626C65975J070m2q26o32N22J343M22j785l121k293l61Q58Q14j01j736l959n827
51609C50321o370n901n531n590n462m850m148l560k761j691r23r38j468j848j704
51594B97576j209q71j047j569j924j960k082k508k737k232j223l35K69P44R08
51579B79800M28l54n36K22J224J575J185P21O67P67M07m58j178j296j217j423
51563B80534j452m82J199K320K345J983J820J629J440J889K760K577Q38o85k13
51548B98502J469K337K142K189K783L028K932L552M767N050M057L455M210M826
$$ plain form
51657 369760 367924 366411 365701 365544 364800 362621 359883 358564 359381 360874 361261 360336 358872 357103 354925 353093
51641 353093 352915 354717 357510 360242 362569 364283 364852 363974 362154 360406 359599 360117 361804 364025 365975
51626 365975 367045 367003 366177 365545 366067 367410 367832 366047 362926 360633 360272 361130 361944 361843 360107 356148 350321
51609 350321 343951 338050 332519 326929 321467 316617 312469 308909 306148 304457 303534 302596 301128 299280 297576
51594 297576 296367 295496 294449 292880 290956 288996 286914 284406 281669 279437 278214 277879 278148 278892 279800
51579 279800 280228 279874 279338 279560 280784 282359 283544 284265 284932 285699 286106 285648 284470 283174 281957 280534
51563 280534 279082 278600 279799 282119 284464 286447 288267 289896 291336 293225 295985 298562 299400 298715 298502
51548 298502 299971 302308 304450 306639 309422 312450 315382 318934 323701 328751 332808 336263 340473 345299
51534C45299L682J653Q07J369J768J185M05O7l34j278k168k214j678j409j403
51519C45751o49J471M128N880O204N739N148M377L251K110J452J243J106Q96N73
51504C88680m9r13j308n42J077K589L512L904L453J581j303l538l837k691j610
51489C89005j422j790k206k752l705m798n278m816m016l742l928l591k173m14
51475C44374M47J9j054j835j617m3K512M823N740N291M435L777L022J839P23O47
51459C73100J910L485L770K196O3p30K53J740K604K965L183K818J495o5q10p17
51443C97260m47k24J04M59Q85J902L406M011K804J148J036K038J878Jj451p51
51427D14059J036J867J499J346K336L831M401L290J436Q86K558M790N226L798
$$ plain form
51534 345299 348981 350634 351441 352810 354578 355763 356168 356235 355901 354623 352455 350241 348563 347154 345751
51519 345751 345102 346573 350701 356581 362785 368524 373672 378049 381300 383410 384862 386105 387211 388107 388680
51504 388680 388631 387718 386410 385868 386945 389534 393046 396950 400403 401984 400681 397143 393306 390615 389005
51489 389005 387583 385793 383587 380835 377130 372332 367054 362238 358222 354480 350552 346961 344788 344374
51475 344374 344821 344840 343786 341951 340334 340291 342803 347626 353366 358657 363092 366869 369891 371730 372453 373100
51459 373100 375010 378495 382265 384461 384524 383794 384047 385787 388391 391356 394539 397357 398852 398787 397977 397260
51443 397260 396813 396589 396693 397152 398037 399939 403345 407356 410160 411308 412344 414382 416260 416261 414810 414059
51427 414059 415095 416962 418461 419807 422143 425974 430375 433665 435101 435987 438545 443335 448561 452359
51413D52359K394J767P24j165k294j572m57q62k403l372l424l577m185m639m798
51398D24496n212o034o919p837q838r067p343l912n51J331J828J613R55O9l66
51383C74213J26J018J233K63j431k896l261k035N66L355M615L379L70k633m491
51368C72391n377n773n571m717m008m168m516l763k100j238k062l480m190m430
51354C16998n050n770n511m164k900k676l160l372l009k687k917l090k116j41
51340B70435J078L58j020q60P55J363m41l057m147l496k511j942j491j112j307
51325B52605k112k772k598j583k80O02O46J64o7J75J83o75j982k711k323j074
51309B36198L97J375J412P37M0l63p78j386j808j593n80J175L089L763K171n74
$$ plain form
51413 452359 454753 456520 457244 456079 453785 452213 451756 450894 448491 445119 441695 438118 433933 429294 424496
51398 424496 419284 413250 406331 398494 389656 380589 373246 369334 368783 370114 371942 373555 374510 374579 374213
51383 374213 374339 375357 376590 376853 375422 372526 369265 367230 367796 371151 375766 379145 379515 376882 372391
51368 372391 367014 361241 355670 350953 346945 342777 338261 334498 332398 331160 329098 325618 321428 316998
51354 316998 311948 306178 300667 296503 293603 290927 287767 284395 281386 278699 275782 272692 270576 270435
51340 270435 271513 271871 270851 269991 270746 272109 271668 268611 264464 260968 258457 256515 255024 253912 252605
51325 252605 250493 247721 245123 243540 243260 243862 244508 244672 244605 244780 244963 244288 242306 239595 237272 236198
51309 236198 236595 237970 239382 240119 240159 239796 239018 237632 235824 234231 233651 234826 237915 241678 243849 243275
51293B43275j980j179J75N09L87R42J744J623O16m04j228k027k365j856j242j379
51277B35611j764j494j057j575k757l359l242l298l451k760j516j221k107k607
51263B03403k046j985l608n365m788j891P71J200j39j524j970j653j056l69K99
51248A79279O70N71K04k76j226k866m296m094k184j01J071J778K443K156K83j695
51232A71717j681K56K125K682K311J511K36j170j927j913j587q63N78J928J864
51217A76067O34j30J01J55n12q02q9M42k54j291j378r06j112j978k406j915j028
51200A63598l66k79q93j700j654m36R37J501J538J653J493N63n08p94o53j082
51184A62918j800j489P6J569J967J680J462J312R70N88L16j30r09j556j563j077
$$ plain form
51293 243275 241295 240116 240291 240800 241187 242129 243873 245496 246112 245708 244480 242453 240088 238232 236990 235611
51277 235611 233847 232353 231296 229721 226964 223605 220363 217065 213614 210854 209338 208117 206010 203403
51263 203403 201357 199372 195764 190399 185611 183720 184491 185691 185552 184028 182058 180405 179349 178980 179279
51248 179279 179949 180520 180724 180448 179222 176356 172060 167966 165782 165681 166752 168530 170973 173129 173412 171717
51232 171717 170036 170292 172417 175099 177410 178921 179157 177987 176060 174147 172560 171697 172275 174203 176067
51217 176067 176701 176571 176672 176827 176315 175513 175424 175866 175612 174321 172943 172037 170925 168947 166541 164626 163598
51200 163598 163232 162953 162060 160360 158706 158270 159207 160708 162246 163899 165392 165955 165447 164653 164000 162918
51184 162918 161118 159629 159705 161274 163241 164921 166383 167695 168665 169253 169569 169439 168530 166974 165411 164334
51168A64334n55j01L76O71M54l8k3R33K337L197K917J714K86p15r19k54R85K124
51150A77723K448J798P83L23Q74K009K727K255Q44l30j42J387L146L957L415J966
51134B05183N21M6R26K363K719J048j727l573l400k088j278j441j545n44J241
51119A98451K530K458J217m33j822k492k207j122J57Q08K35j324k564k021J21
51104A91992J704R71j088j928q65K31j06r39o85N49J587J933J676N78j285k668
51088A91657k448j286o90q81j124j566k929m433m119j717N00N40j002k223k294
51073A65985j612n38R05K338L003K487J223J50r8K49N04N74R40J419R93l57p90
51056A77375R36L093K868J85k324k910k178j015N83K120K316J210O06J371K106
$$ plain form
51168 164334 163779 163678 164054 164725 165179 165141 165118 166051 168388 171585 174502 176216 176502 175787 174868 174614 175599 177723
51150 177723 180171 181969 182752 183075 183949 185958 188685 190940 191784 191454 191312 192699 195845 199802 203217 205183
51134 205183 205704 205750 206676 209039 211758 212806 211079 207506 204106 202018 200740 199299 197754 197210 198451
51119 198451 200981 203439 204656 204223 202401 199909 197702 196580 196737 197545 197780 196456 193892 191871 191992
51104 191992 193696 194667 193579 191651 190786 191017 190911 189972 189287 189836 191423 193356 195032 195610 194325 191657
51088 191657 189209 187923 187233 186352 185228 183662 180733 176300 172181 170464 170964 171504 170502 168279 165985
51073 165985 164373 163835 164740 167078 170081 172568 173791 173941 173843 174092 174596 175170 176110 177529 178522 178165 177375
51056 177375 178311 181404 184272 184457 182133 179223 177045 176030 176613 178733 181049 182259 182865 184236 186342
51041A86342J640J061J774L089L392K500J328J89r08j227k04J292K064K336L027
51026B07695L841L651K307P44m17j029o15J166L403M598M396L569K481P78j348
51011B35220k833k883j738k39P35N81m99j470j621j367j340j233n10L30L81j04
50995B21410p6O16J056P32K7p30j546k106k004j658j889k446k201j062l70q20
50979B06933j211j03J963L041K236P08K01J056K086K173J493R04N38p1o12P9K062
50962B23476L505K842R27j72K23J227K315L764N335O069N598M427K776M91j686
50947B61117k205o69J456K699L089L251L061K182J178J085K163L698M871N263
50933B92239M793L774K934L033M265O032P263P280O671P030R189J1953J3289J2739
$$ plain form
51041 186342 187982 189043 190817 193906 197298 199798 201126 201315 200407 199180 198976 200268 202332 204668 207695
51026 207695 211536 215187 217494 218238 217821 216792 216177 217343 220746 225344 229740 233309 235790 236568 235220
51011 235220 232387 229504 227766 227527 228262 228843 228344 226874 225253 223886 222546 221313 220803 221133 221514 221410
50995 221410 221334 221950 223006 223738 223765 223035 221489 219383 217379 215721 213832 211386 209185 208123 207753 206933
50979 206933 205722 205619 207582 210623 212859 213567 213768 214824 216910 219083 220576 221480 222018 221947 221335 221414 223476
50962 223476 226981 229823 230750 230578 230801 232028 234343 238107 243442 249511 255109 259536 262312 262803 261117
50947 261117 258912 258243 259699 262398 265487 268738 271799 273981 275159 276244 278407 282105 286976 292239
50933 292239 297032 300806 303740 306773 311038 317070 324333 331613 338284 345314 354503 366456 379745 392484
50919C92484J1795J1858J2823J3911J4977J6301J7748J8906J9802K0937K2631
50908E74173K4623K6408K7814K9283L1462L4382L7307L9613M1440M3219M5071
50897I54795M7212N0202N3840N6412N6320N4267N2405N1343M9498M5850M1714
50886A513858L8951L7527L5839L2684K8036K2555J7257J3231J0922R842R343R138
50874A779183Q801P576N451L692L375L847L492J649j132m448q560j3549j8882
50861A770495k4081k9119l3988l8376m2090m5284m8068n0299n1909n2980n3211
50850A301090n1806m8450m4188m0697l8618l7047l4789l1574k7852k3963k0113
50839I01993j6770j4387j2809j1555j0544r769q558o188l346j639j366j069J26
$$ plain form
50919 392484 404279 416137 428960 442871 457848 474149 491897 510803 530605 551542 574173
50908 574173 598796 625204 653018 682301 713763 748145 785452 825065 866505 909724 954795
50897 954795 1002007 1052209 1106049 1162461 1218781 1273048 1325453 1376796 1426294 1472144 1513858
50886 1513858 1552809 1590336 1626175 1658859 1686895 1709450 1726707 1739938 1750860 1760702 1770045 1779183
50874 1779183 1787984 1795560 1801011 1804703 1808078 1811925 1815417 1817066 1815934 1811486 1802926 1789377 1770495
50861 1770495 1746414 1717295 1683307 1644931 1602841 1557557 1509489 1459190 1407281 1354301 1301090
50850 1301090 1249284 1200834 1156646 1115949 1077331 1040284 1005495 973921 946069 922106 901993
50839 901993 885223 870836 858027 846472 835928 826159 817601 811413 808067 806428 805062 803993 804119
50826H04119J093O19n71j045o93o2J287L775N952N818L905K908M186O459Q102
50811H45852Q774Q427O842M883M332N588P150Q184R783J2675J5546J7137J8362
50798I73535K0637K3490K5668K7505L0271L3888L7272M0520M4856N0511N6373
50787A364526O1845O7556P3891Q0180Q5735R0788R5934J01351J06676J11255J14511
50776B354248J16579J18214J19459J18839J14727J07233R7938Q8061P7808O7219
50766C380325N6511M5708L4998K5448J8477J4393J2348J1596J2017J3502J5803
50755C641126J8971K2810K5833K5867K2102J5717Q178k19r857k0827l3059m6466
50743C670176o0337p3103q3463r1410r7686j02563j05636j06483j05008j01232
$$ plain form
50826 804119 805212 805831 805260 804215 803522 803460 804747 808522 814474 820292 824197 827105 831291 837750 845852
50811 845852 854626 863053 869895 874778 879110 884698 891848 900032 909815 922490 938036 955173 973535
50798 973535 994172 1017662 1043330 1070835 1101106 1134994 1172266 1212786 1257642 1308153 1364526
50787 1364526 1426371 1493927 1567818 1647998 1733733 1824521 1920455 2021806 2128482 2239737 2354248
50776 2354248 2470827 2589041 2708500 2827339 2942066 3049299 3147237 3235298 3313106 3380325
50766 3380325 3436836 3482544 3517542 3542990 3561467 3575860 3588208 3599804 3611821 3625323 3641126
50755 3641126 3660097 3682907 3708740 3734607 3756709 3772426 3780604 3780385 3770528 3749701 3716642 3670176
50743 3670176 3609839 3536736 3453273 3361863 3264177 3161614 3055978 2949495 2844487 2743255
50733B743255r5230q7328p8193o8648n9312n0360m1535l2548k3420j4427n779
50722B186475K488J0370J7722K3989K8259L0087L0310L0374L0535K9393K5717
50711B445719J9993J3629P412J527l680q046j2165j6470k0379k3447k6814l1868
50699B345411l7802m2375m5064m7576n0809n3387n4026n3488n2788n1013m6801
50688A810282m1122l6595l4243l2513k9692k5843k1808j7434j1733m556K682Q203
50676A565628J1583J4078J7278K1739K7044L2738L8645M4493M9934N5077O0387
50665A938624O5945P1194P5420P8120P8977P8085P6069P3307O9243O3324N6343
50654B724651M9657M3188L5604K6719J8025J0353K653n791j3427j8051j9360j8534
$$ plain form
50733 2743255 2648025 2560697 2482504 2413856 2354544 2304184 2262649 2230101 2206681 2192254 2186475
50722 2186475 2188963 2199333 2217055 2241044 2269303 2299390 2329700 2360074 2390609 2420002 2445719
50711 2445719 2465712 2479341 2486753 2488280 2484600 2476554 2464389 2447919 2427540 2404093 2377279 2345411
50699 2345411 2307609 2265234 2220170 2172594 2121785 2068398 2014372 1960884 1908096 1857083 1810282
50688 1810282 1769160 1732565 1698322 1665809 1636117 1610274 1588466 1571032 1559299 1554743 1557425 1565628
50676 1565628 1577211 1591289 1608567 1630306 1657350 1690088 1728733 1773226 1823160 1878237 1938624
50665 1938624 2004569 2075763 2151183 2229303 2308280 2386365 2462434 2535741 2604984 2668308 2724651
50654 2724651 2774308 2817496 2853100 2879819 2897844 2908197 2910850 2905059 2891632 2873581 2854221 2835687
50642B835687j6252j2588q132l691P27N224Q782J0196R901R349Q631O173R43o292
50628B848658j4109k1550k7995l2913l6190l7953l8075l6469l3558k9545k3824
50617B516477j6403r337m846k153J783Q117J4832K0167K5163L1611L9408M7538
50605B672357N6109O5638P5289Q3553Q9972R4782R7531R7520R5048R0881Q5003
50594C603683P7253O8643O0525N2934M5303L8307L3251K9781K6087K1419J6655
50583D073841J2208P255J676k973n354n792n023k841R44N355R299J2968J7057
50570D118620K1284K4791K7398K9308K9943K8282K4344J9335J4202Q716K198n355
50558D343066j2998j9540k4539k8658l2563l5498l5721l2708k8075k3686j9568
$$ plain form
50642 2835687 2819435 2806847 2798715 2795024 2795751 2800975 2809757 2819953 2829854 2839203 2847834 2854007 2854950 2848658
50628 2848658 2834549 2812999 2785004 2752091 2715901 2677948 2639873 2603404 2569846 2540301 2516477
50617 2516477 2500074 2490737 2485891 2483738 2485521 2493638 2508470 2528637 2553800 2585411 2624819 2672357
50605 2672357 2728466 2794104 2869393 2952946 3042918 3137700 3235231 3332751 3427799 3518680 3603683
50594 3603683 3680936 3749579 3810104 3863038 3908341 3946648 3979899 4009680 4035767 4057186 4073841
50583 4073841 4086049 4093304 4094980 4092007 4086653 4080861 4075838 4072997 4073941 4079296 4088595 4101563 4118620
50570 4118620 4139904 4164695 4192093 4221401 4251344 4279626 4303970 4323305 4337507 4346223 4348421 4343066
50558 4343066 4330068 4310528 4285989 4257331 4224768 4189270 4153549 4120841 4092766 4069080 4049512
50547D049512j4593q544k439K826O992R728J0461R038N703M19p052j6346k6600
50534D019105l7426m9001o1149p2967q3542r2411r9231j03710j05994j06469j05203
50523C102002j02209r8277r4570r1189q7066q1598p5484o9492o3282n6175m8454
50512B234206m1141l4876k9567k4779j9936j4588r009m136l56L215P560J2310
50500B078903J6114J8279J9271J9851K0486K1593K3546K6360K9804L3967L9093
50489B347267M4833N0363N5484O1135O8373P7155Q6270R4198R9884J03046J04163
50478C192171J04045J03222J01684R9344R6541R4055R2716R3095R5329R9096J03694
50467D274992J08291J12227J15299J17928J20936J24935J29911J35517J41507
$$ plain form
50547 4049512 4034919 4026375 4023936 4026762 4033754 4043482 4053943 4062981 4068684 4069103 4062051 4045705 4019105
50534 4019105 3981679 3932678 3871529 3798562 3715020 3622609 3523378 3419668 3313674 3207205 3102002
50523 3102002 2999793 2901516 2806946 2715757 2628691 2547093 2471609 2402117 2338835 2282660 2234206
50512 2234206 2193065 2158189 2128622 2103843 2083907 2069319 2060310 2056174 2055818 2059033 2066593 2078903
50500 2078903 2095017 2113296 2132567 2152418 2172904 2194497 2218043 2244403 2274207 2308174 2347267
50489 2347267 2392100 2442463 2497947 2559082 2627455 2704610 2790880 2885078 2984962 3088008 3192171
50478 3192171 3296216 3399438 3501122 3600466 3697007 3791062 3883778 3976873 4072202 4171298 4274992
50467 4274992 4383283 4495510 4610809 4728737 4849673 4974608 5104519 5240036 5381543
50458E381543J47657J53404J58122J61709J64352J65532J63812J57993J47987
50449F802111J34182J16544R5192P1497M7376K3212k539l0878o0132q7087j09802
50438F999676j28335j43037j53495j59288j60558j57081j47958j33194j14949
50429E701781r5920p6896n7095l6783j8119l096Q091J5890J9532J7350Q427o839
50417E476323k7474n2247p9193j05659j29217j48483j63101j73230j79109j81034
50407D237576j79654j76131j71492j65826j58670j50341j42153j34721j26946
50398B831642j17632j07576r8729r1430q3989p5317o6613n9600n4086m8431m1849
50387A986390l5181k9630k5805k3695k2539k0584j6182r658l324Q44L062M910
$$ plain form
50458 5381543 5529200 5682604 5840726 6002435 6166787 6332319 6496131 6654124 6802111
50449 6802111 6936293 7052837 7148029 7219526 7266902 7290114 7287575 7256697 7196565 7109478 6999676
50438 6999676 6871341 6728304 6574809 6415521 6254963 6097882 5949924 5816730 5701781
50429 5701781 5605861 5528965 5471870 5435087 5416968 5413872 5421963 5437853 5457385 5474735 5483162 5476323
50417 5476323 5448849 5396602 5317409 5211750 5082533 4934050 4770949 4597719 4418610 4237576
50407 4237576 4057922 3881791 3710299 3544473 3385803 3235462 3093309 2958588 2831642
50398 2831642 2714010 2606434 2507705 2416275 2332286 2256969 2190356 2130756 2076670 2028239 1986390
50387 1986390 1951209 1921579 1895774 1872079 1849540 1828956 1812774 1803116 1799792 1800636 1803698 1808608
50375A808608P311R983J2335J4187J5836J8026K1529K6149L0528L3698L6475M0335
50363B075000M5145M9194N1703N3889N7033O0619O3374O5204O6888O8373O8785
50352B725207O8176O8221P0663P5521Q1037Q5253Q7683Q9699R2974R7352J00763
50341C642549J01698J01009J00282R9151R5614Q9021Q1109P3607O6082N7017M5989
50330D553128L3789K0760O091j1131l0753n1308p0729q7358j00582j10545j17279
50319D034083j20541j20401j17369j11740j03344r2324p9829o7424n5986m5378
50309C119747l4920k4159j3485m381J474L590K842J1n412j4467k6869m0381n2144
50296B911446o0635o6448p1205p5667p9053q0408q0182p9794p9761p9066p6557
$$ plain form
50375 1808608 1815919 1825902 1838237 1852424 1868260 1886286 1907815 1933964 1964492 1998190 2034665 2075000
50363 2075000 2120145 2169339 2221042 2274931 2331964 2392583 2455957 2521161 2588049 2656422 2725207
50352 2725207 2793383 2861604 2932267 3007788 3088825 3174078 3261761 3351460 3444434 3541786 3642549
50341 3642549 3744247 3845256 3945538 4044689 4140303 4229324 4310433 4384040 4450122 4507139 4553128
50330 4553128 4586917 4607677 4613768 4602637 4571884 4520576 4449847 4362489 4261907 4151362 4034083
50319 4034083 3913542 3793141 3675772 3564032 3460688 3368364 3288535 3221111 3165125 3119747
50309 3119747 3084827 3060668 3047183 3042802 3044276 3047866 3050708 3050719 3045307 3030840 3003971 2963590 2911446
50296 2911446 2850811 2784363 2713158 2637491 2558438 2478030 2397848 2318054 2238293 2159227 2082670
50285B082670p2374o7696o3564o0122n6636n2152m6580m1113l7126l4671l2594
50274A518042l0009k6905k3541k0100j6984j4469j2154r627p455o388n735m027
50262A340648j283J066K677M703P337R135R658J0542J2689J4556J4849J4833J5966
50249A457376J7197J6965J6209J6653J7583J7289J6687J8071K0833K1880K0385
50238A657128J8738J8337J7730J5782J3478J1265P685K409k007l646m204o160
50226A746535q822r782r023q857j0555j3415j6710k0269k3181k4154k3552k3322
50214A554893k4436k5832k6241k5707k4753k3348k1471j9823j9053j8765j8052
50203A307412j6796j5730j5298j5118j4783j4497j4443j3867j1787q762o840p127
$$ plain form
50285 2082670 2010296 1942600 1879036 1818914 1762278 1710126 1663546 1622433 1585307 1550636 1518042
50274 1518042 1488033 1461128 1437587 1417487 1400503 1386034 1373880 1364253 1356798 1350410 1344675 1340648
50262 1340648 1339365 1340431 1343108 1347811 1355148 1364283 1373941 1384483 1397172 1411728 1426577 1441410 1457376
50249 1457376 1474573 1491538 1507747 1524400 1541983 1559272 1575959 1594030 1614863 1636743 1657128
50238 1657128 1675866 1694203 1711933 1727715 1741193 1752458 1760143 1762552 1760545 1756899 1752695 1746535
50226 1746535 1737713 1727931 1718908 1710051 1699496 1686081 1669371 1649102 1625921 1601767 1578215 1554893
50214 1554893 1530457 1504625 1478384 1452677 1427924 1404576 1383105 1363282 1344229 1325464 1307412
50203 1307412 1290616 1274886 1259588 1244470 1229687 1215190 1200747 1186880 1175093 1166331 1159491 1152364
50191A152364q216q097o747n536m634k940n25Q34K27r48r80J62J622L057M176
50176A123819M299L609L542M604N063L440J115N26J566J947O54j203k882m940
50162A145159p288q484p841o550n782n215m474m470n939p764q327p750p236o833
50148A051206n440l104j479j595k412k394j535q30l38R23L142M986N183M211L562
50133A054086L738L832L129K183J830J726O96j632m119n206m417k667j369j280
50119A050530k122l080l635l901m288m991n934o886p533p565o879n734m602l848
50105I79532l450k979k012o99L66J015J806K940L518K807J967L028N943Q088P498
50090A009368N390M315M816N324M871M158L937L907L744L996N064O146O180N451
$$ plain form
50191 1152364 1144148 1136051 1129304 1123768 1119134 1116194 1115669 1116503 1116730 1115782 1114802 1114964 1116586 1119643 1123819
50176 1123819 1128118 1131727 1135269 1139873 1144936 1148376 1149491 1150017 1151583 1153530 1154184 1152981 1150099 1145159
50162 1145159 1137871 1129387 1121546 1114996 1109214 1103999 1099525 1095055 1089116 1081352 1073025 1065275 1058039 1051206
50148 1051206 1045766 1042662 1041183 1039588 1037176 1034782 1033247 1032417 1032079 1033002 1036144 1041130 1046313 1050524 1054086
50133 1054086 1057824 1061656 1064785 1066968 1068798 1070524 1071220 1069588 1065469 1060263 1055846 1053179 1051810 1050530
50119 1050530 1048408 1045328 1041693 1037792 1033504 1028513 1022579 1015693 1008160 1000595 993716 987982 983380 979532
50105 979532 976082 973103 971091 970392 970758 971773 973579 976519 980037 982844 984811 987839 993782 1001870 1009368
50090 1009368 1014758 1019073 1023889 1029213 1034084 1038242 1042179 1046086 1049830 1053826 1058890 1065036 1071216 1076667
50076A076667N330O472P976Q592Q144P419P049P062P392Q124Q976R105Q090O826
50062A183224O742Q118R759J0398R907Q989Q309Q159Q434Q643Q380Q054Q651J0511
50048A306278J2954J5342J7792K0342K2250K2997K3482K5325K9073L3849L8608
50037A568292M3147M7958N3655O0521O8204P5986Q3633R1605R9901J07303J12520
50026B412725J15834J18529J20508J19494J13245J02199Q9536P8597P0558O4470
50016C405695N9130N4352N0292M6316M1411L5270K7812J7730L054j6153l7016
50005C687893n6562p4008q9378j01313j08219j10812j11424j10877j08000j02435
49995B714865r5976r0267q4754p8002p0053o2310n5720n0118m5125m0764l7110
$$ plain form
50076 1076667 1081997 1088469 1096445 1105037 1113181 1120600 1127649 1134711 1142103 1150227 1159203 1168308 1176398 1183224
50062 1183224 1189966 1198084 1207843 1218241 1228148 1237137 1245446 1253605 1262039 1270682 1279062 1287116 1295767 1306278
50048 1306278 1319232 1334574 1352366 1372708 1394958 1417955 1441437 1466762 1495835 1529684 1568292
50037 1568292 1611439 1659397 1713052 1773573 1841777 1917763 2001396 2093001 2192902 2300205 2412725
50026 2412725 2528559 2647088 2767596 2887090 3000335 3102534 3192070 3270667 3341225 3405695
50016 3405695 3464825 3519177 3569469 3615785 3657196 3692466 3720278 3738008 3741062 3724909 3687893
50005 3687893 3631331 3557323 3467945 3366632 3258413 3147601 3036177 2925300 2817300 2714865
49995 2714865 2618889 2528622 2443868 2365866 2295813 2233503 2177783 2127665 2082540 2041776 2004666
49984B004666l3826l0417k6775k3352k0581j8244j5702j2885j0475q877p740o900
49972A788892o886p607p604n982m269m547o196o624n255m398n479o781o261m693
49958A706310m115m577m540l694l108k809j352J679M476N237M485M239N518P543
49944A715292R145J0118J1079J2467J4141J5931J8067K0735K3381K5134K6020
49933A901510K7099K8996L1021L2294L3222L4929L7549M0068M1904M3734M6463
49922B298789N0213N4816O0622O8082P6878Q6299R6333J07571J19860J31770J42018
49911C293251J50887J59451J67470J72834J73308J68390J59432J48528J37612
49902D731163J27974J19924J13003J06852J01475R6367Q9866Q0016O5775M6929
$$ plain form
49984 2004666 1970840 1940423 1913648 1890296 1869715 1851471 1835769 1822884 1812409 1803532 1795792 1788892
49972 1788892 1782006 1774399 1766795 1760813 1756544 1751997 1745801 1739177 1733922 1729524 1724045 1717264 1711003 1706310
49958 1706310 1702195 1697618 1693078 1689384 1686276 1683467 1682115 1683794 1688270 1693507 1697992 1702231 1707749 1715292
49944 1715292 1724437 1734555 1745634 1758101 1772242 1788173 1806240 1826975 1850356 1875490 1901510
49933 1901510 1928609 1957605 1988626 2020920 2054142 2089071 2126620 2166688 2208592 2252326 2298789
49922 2298789 2349002 2403818 2464440 2532522 2609400 2695699 2792032 2899603 3019463 3151233 3293251
49911 3293251 3444138 3603589 3771059 3943893 4117201 4285591 4445023 4593551 4731163
49902 4731163 4859137 4979061 5092064 5198916 5300391 5396758 5486624 5566640 5632415 5679344
49892E679344K3421m244l4228o4077r2254j18104j40455j57718j69799j78664
49882D743222j86094j91607j93563j91711j87696j83061j77622j70043j59698
49873C102127j47737j36431j27233j19519j11480j02342r3124q5031p7873p0745
49863B030612o3656n7583n2991m9257m5766m2726m0531l8896l7246l5539l4111
49852A532310l2756l0760k7951k5196k3468k2827k2618k2256k1395j9745j7519
49841A265819j5693j5015j4930j4346j3356j2916j2883j1891r715q136q423r355
$$ plain form
49892 5679344 5702765 5698521 5664293 5600216 5507962 5389858 5249403 5091685 4921886 4743222
49882 4743222 4557128 4365521 4171958 3980247 3792551 3609490 3431868 3261825 3102127
49873 3102127 2954390 2817959 2690726 2571207 2459727 2357385 2264261 2179230 2101357 2030612
49863 2030612 1966956 1909373 1856382 1807125 1761359 1718633 1678102 1639206 1601960 1566421 1532310
49852 1532310 1499554 1468794 1440843 1415647 1392179 1369352 1346734 1324478 1303083 1283338 1265819
49841 1265819 1250126 1235111 1220181 1205835 1192479 1179563 1166680 1154789 1145074 1136938 1128515 1119160
$$ [...]
##END NTUPLES=NMR SPECTRUM
##END=
