##TITLE=coffee_type CCPA01-ROVE100E_70-30%
COFFEE_meoh_noesyp64 COFFEE_meoh {C:\Bruker\TOPSPIN} Administrator 10
##JCAMPDX= 6.0         $$ Bruker NMR JCAMP-DX V2.0
##DATA TYPE= NMR SPECTRUM
##DATA CLASS= NTUPLES
##ORIGIN= Bruker BioSpin GmbH
##OWNER= Administrator
$$ 1.72 TOPSPIN		Version 2.1
$$ 2012-05-18 15:51:58.151 -0700  Administrator@X
$$ Compression mode = diff/dup
##.OBSERVE FREQUENCY= 400.13188235
##.OBSERVE NUCLEUS= ^1H
##.ACQUISITION MODE= SIMULTANEOUS (DQD)
##.ACQUISITION SCHEME= undefined
##.AVERAGES= 64
##.DIGITISER RES= 22
##SPECTROMETER/DATA SYSTEM= spect
##.PULSE SEQUENCE= noesygpps1d.comp
##.SOLVENT NAME= COFFEE_meoh
##.SHIFT REFERENCE= INTERNAL, COFFEE_meoh, 1, 14.98061
##AUDIT TRAIL= $$ (NUMBER, WHEN, WHO, WHERE, PROCESS, VERSION, WHAT)
$$ ##TITLE= Audit trail, TOPSPIN		Version 2.1
$$ ##JCAMPDX= 5.01
$$ ##ORIGIN= Bruker BioSpin GmbH
$$ ##OWNER= Administrator
$$ $$ C:\Bruker\TOPSPIN/data/Administrator/nmr/12-COFFEE-2502/202/pdata/1/auditp.txt
$$ ##AUDIT TRAIL=  $$ (NUMBER, WHEN, WHO, WHERE, PROCESS, VERSION, WHAT)
(   1,<2012-02-25 20:56:07.172 -0500>,<Administrator>,<TOPSPIN>,<go>,<TOPSPIN 2.1>,
      <created by zg
	started at 2012-02-25 20:44:36.969 -0500,
	POWCHK enabled, PULCHK disabled,
       configuration hash MD5:
       B0 76 FB 9C 50 81 44 7D 18 B3 26 32 4E 60 AD 96
       data hash MD5: 64K
       AB D9 A0 59 2A 49 DB 30 3F 05 9B 61 EF D0 F0 AD>)
(   2,<2012-02-25 20:56:09.875 -0500>,<Administrator>,<TOPSPIN>,<proc1d>,<TOPSPIN 2.1>,
      <Start of raw data processing
       efp LB = 0.3 FT_mod = 6 PKNL = 1 PHC0 = 0 PHC1 = 0 SI = 128K 
       data hash MD5: 128K
       4D EA CD 13 6C C0 A1 8B ED 8E 17 0C 17 E6 5D E3>)
(   3,<2012-02-25 20:56:11.141 -0500>,<Administrator>,<TOPSPIN>,<proc1d>,<TOPSPIN 2.1>,
      <pk PHC0 = 23.59863 PHC1 = 0 
       data hash MD5: 128K
       DF AE CD 91 D3 59 7B 09 38 06 2F 5B 9B 58 23 64>)
(   4,<2012-02-25 20:56:11.406 -0500>,<Administrator>,<TOPSPIN>,<proc1d>,<TOPSPIN 2.1>,
      <abs ABSG = 1 
       data hash MD5: 128K
       00 D8 31 08 1A A5 68 A6 86 E0 12 E6 97 3C AA CD>)
(   5,<2012-02-25 20:56:11.484 -0500>,<Administrator>,<TOPSPIN>,<proc1d>,<TOPSPIN 2.1>,
      <abs ABSG = 2 
       data hash MD5: 128K
       57 60 00 E9 70 83 30 98 37 B2 0D 58 0C D0 CC C1>)
(   6,<2012-02-25 20:56:11.547 -0500>,<Administrator>,<TOPSPIN>,<proc1d>,<TOPSPIN 2.1>,
      <abs ABSG = 3 
       data hash MD5: 128K
       D2 0F 81 22 EF 5B CF B5 44 1D 68 30 06 21 0D 4C>)
(   7,<2012-02-25 20:56:11.625 -0500>,<Administrator>,<TOPSPIN>,<proc1d>,<TOPSPIN 2.1>,
      <abs ABSG = 4 
       data hash MD5: 128K
       41 3B AC 7C DD 34 2E 6C 77 23 0C 9B 1D D9 1E E8>)
(   8,<2012-02-25 20:56:11.687 -0500>,<Administrator>,<TOPSPIN>,<proc1d>,<TOPSPIN 2.1>,
      <abs ABSG = 5 
       data hash MD5: 128K
       CE A5 33 13 95 39 8E E5 C9 AF 55 EB B5 60 ED CF>)
(   9,<2012-02-25 20:56:12.000 -0500>,<Administrator>,<TOPSPIN>,<audit>,<TOPSPIN 2.1>,
      <user comment:
       ICON-NMR User ID: Administrator
$$ [...]
150 150 150 150 150 150 150 150
##$TP07= 0
##$TPNAME0= <>
##$TPNAME1= <>
##$TPNAME2= <>
##$TPNAME3= <>
##$TPNAME4= <>
##$TPNAME5= <>
##$TPNAME6= <>
##$TPNAME7= <>
##$TPOAL= (0..7)
0.5 0.5 0.5 0.5 0.5 0.5 0.5 0.5
##$TPOFFS= (0..7)
0 0 0 0 0 0 0 0
##$TUNHIN= 0
##$TUNHOUT= 0
##$TUNXOUT= 0
##$USERA1= <user>
##$USERA2= <user>
##$USERA3= <user>
##$USERA4= <user>
##$USERA5= <user>
##$V9= 5
##$VALIST= <valist>
##$VCLIST= <CCCCCCCCCCCCCCC>
##$VD= 0
##$VDLIST= <DDDDDDDDDDDDDDD>
##$VPLIST= <PPPPPPPPPPPPPPP>
##$VTLIST= <TTTTTTTTTTTTTTT>
##$WBST= 1024
##$WBSW= 4
##$XGAIN= (0..3)
0 0 0 0
##$XL= 0
##$YL= 0
##$YMAX_a= 13532712
##$YMIN_a= -6247625
##$ZGOPTNS= <>
##$ZL1= 120
##$ZL2= 120
##$ZL3= 120
##$ZL4= 120
##$ABSF1= 14.98061
##$ABSF2= -5.57192
##$ABSG= 5
##$ABSL= 3
##$ALPHA= 0
##$AQORDER= 0
##$ASSFAC= 0
##$ASSFACI= 0
##$ASSFACX= 0
##$ASSWID= 0
##$AUNMP= <proc_prof1d_extract>
##$AXLEFT= 0
##$AXNAME= <>
##$AXNUC= <1H>
##$AXRIGHT= 0
##$AXTYPE= 0
##$AXUNIT= <>
##$AZFE= 0.1
##$AZFW= 0.1
##$BCFW= 0
##$BC_mod= 0
##$BYTORDP= 0
##$COROFFS= 0
##$CY= 15
##$DATMOD= 1
##$DC= 0
##$DFILT= <>
##$DTYPP= 0
##$F1P= 0
##$F2P= 0
##$FCOR= 0.5
##$FTSIZE= 131072
##$FT_mod= 6
##$GAMMA= 0
##$GB= 0
##$INTBC= 1
##$INTSCL= 1
##$ISEN= 128
##$LB= 0.3
##$LEV0= 0
##$LPBIN= 0
##$MAXI= 10000
##$MC2= 0
##$MEAN= 0
##$ME_mod= 0
##$MI= 0
##$NCOEF= 0
##$NC_proc= -3
##$NLEV= 6
##$NOISF1= 0
##$NOISF2= 0
##$NSP= 0
##$NTH_PI= 0
##$NZP= 0
##$OFFSET= 14.98061
##$PC= 1
##$PHC0= 23.59863
##$PHC1= 0
##$PH_mod= 1
##$PKNL= yes
##$PPARMOD= 0
##$PPDIAG= 0
##$PPIPTYP= 0
##$PPMPNUM= 2147483647
##$PPRESOL= 1
##$PSCAL= 4
##$PSIGN= 0
##$PYNMP= <proc.py>
##$REVERSE= no
##$SF= 400.13
##$SI= 131072
##$SIGF1= 0
##$SIGF2= 0
##$SINO= 400
##$SIOLD= 131072
##$SPECTYP= <>
##$SREGLST= <1H.CDCl3>
##$SSB= 0
##$STSI= 131072
##$STSR= 0
##$SW_p= 8223.68421052632
##$SYMM= 0
##$S_DEV= 0
##$TDeff= 65536
##$TDoff= 0
##$TI= <>
##$TILT= no
##$TM1= 0
##$TM2= 0
##$TOPLEV= 0
##$USERP1= <user>
##$USERP2= <user>
##$USERP3= <user>
##$USERP4= <user>
##$USERP5= <user>
##$WDW= 1
##$XDIM= 131072
##$YMAX_p= 508606856
##$YMIN_p= -337262828
##$CURPLOT= <Network HP LaserJet P1505>
##$CURPRIN= <$Network HP LaserJet P1505>
##$DFORMAT= <normdp>
##$LAYOUT= <+/1D_H.xwp>
##$LFORMAT= <normlp>
##$PFORMAT= <normpl>
##$SURQMSG= 1
$$ End of Bruker specific parameters
$$ ---------------------------------
##NTUPLES= NMR SPECTRUM
##VAR_NAME=  FREQUENCY,     SPECTRUM/REAL,   SPECTRUM/IMAG
##SYMBOL=    X,             R,               I
##VAR_TYPE=  INDEPENDENT,   DEPENDENT,       DEPENDENT
##VAR_FORM=  AFFN,          ASDF,            ASDF
##VAR_DIM=   131072,        131072,          131072
##UNITS=     HZ,            ARBITRARY UNITS, ARBITRARY UNITS
##FACTOR=    0.0627417313425165, 1,          1
##FIRST=     8223.62146879498, -647,         -92227
##LAST=      0,             2946,            -92800
##MIN=       0,             -337262828,      0
##MAX=       8223.62146879498, 508606856,    0
$$ Real data points
##PAGE= N=1
##DATA TABLE= (X++(R..R)), XYDATA
$$ [...]
62984A830657L9507M0391M0140M0274M1600M3396M4443M4415M3978M3674M3244
62973B295719M2303M1307M1214M2116M2819M2206M0470L8406L5919L2022K6223
62962B720724J9119J1428L293n177j3346k0640k7184l3281l8562m2266m4238m5014
62950B484856m4967m3915m1718l8703l5192l0987k5797j9987j4486r779n379m74
62938B173472N082J0686J5637J9618K2614K4779K6399K7607K8067K7354K5769
62927B407084K4381K3956K4122K3956K3009K1462J9530J7144J4040R868M357k347
62915B610562r760j7565k5721l3833m1041m6927n2026n6853o1142o4615o7681
62904B133398p0371p1312o9294o5551o2818o1962o1002n7930n3146m8427m4695
$$ y = [1830657, 1870164, 1910555, 1950695, 1990969, 2032569, 2075965, 2120408, 2164823, 2208801, 2252475, 2295719, 2338022, 2379329, 2420543, 2462659, 2505478, 2547684, 2588154, 2626560, 2662479, 2694501, 2720724, 2739843, 2751271, 2754564, 2749387, 2736041, 2715401, 2688217, 2654936, 2616374, 2574108, 2529870, 2484856, 2439889, 2395974, 2354256, 2315553, 2280361, 2249374, 2223577, 2203590, 2189104, 2179325, 2173946, 2173472, 2178554, 2189240, 2204877, 2224495, 2247109, 2271888, 2298287, 2325894, 2353961, 2381315, 2407084, 2431465, 2455421, 2479543, 2503499, 2526508, 2547970, 2567500, 2584644, 2598684, 2608552, 2612909, 2610562, 2600802, 2583237, 2557516, 2523683, 2482642, 2435715, 2383689, 2326836, 2265694, 2201079, 2133398, 2063027, 1991715, 1922421, 1856870, 1794052, 1732090, 1671088, 1613158, 1560012, 1511585, 1466890]
62893A466890m1720l9127l6676l4018l1126k8721k7553k7455k7459k6659k4724
62882A121652k1973j9234j7242j5905j4576j3173j2356j2400j2640j2394j1754
62871I58005j1013j0068q990q457r040j0383j1623j2087j1325r277o938n953o692
62858H36159p426o359l948k260k417l650m573m505l598k487j823j679j553j267
62844G88614j319j951k466k260j849j961k265j980j285r08o80J93J497K015J308
62829G74703L93K70O69O34l11j858l243l755l410l057l270l401k335NK753N181
62813G59968O769O613M261J125n33l76l26j627k986k582o99Q04R11J60n72j019
62797G69891j347j769k309k650k393j697j249j358j537j269o00K38J130J553O53
$$ y = [1466890, 1425170, 1386043, 1349367, 1315349, 1284223, 1255502, 1227949, 1200494, 1173035, 1146376, 1121652, 1099679, 1080445, 1063203, 1047298, 1032722, 1019549, 1007193, 994793, 982153, 969759, 958005, 946992, 936924, 927934, 919477, 910437, 900054, 888431, 876344, 865019, 855742, 848804, 842851, 836159, 828733, 822374, 818426, 816166, 813749, 810099, 805526, 801021, 797423, 794936, 793113, 791434, 789881, 788614, 787295, 785344, 782878, 780618, 778769, 776808, 774543, 772563, 771278, 770370, 769690, 769883, 771380, 773395, 774703, 775096, 775366, 776035, 776669, 776358, 774500, 771257, 767502, 764092, 761035, 757765, 754364, 752029, 752034, 754787, 759968, 766737, 773350, 777611, 778736, 778203, 777827, 777501, 775874, 772888, 770306, 769607, 770411, 771322, 771482, 770910, 769891, 768544, 766775, 764466, 761816, 759423, 757726, 756477, 755119, 753582, 752313, 751713, 751951, 753081, 754634, 755287]
62782G55287j450l068k677q39M81L14n32j019j228j731k371k301j156L41J045
62767G39096N35o15j544j783j214P6J554K301J993J440J476J697J241M64N35J418
62751G48670J817J421J501K509K867J534K69J384M145N563M565L244L658N330
62737G88477O688P433Q327R552J0543J1013J1317J1929J3054J4665J6549J8456
62725I28003K0328K2122K3473K4177K5031K7360L1273L5237L8003M0253M3449
62714A258709M7615N1407N4199N6838O0071O3288O5383O6129O6017O5281O3840
62703A918777O1768N8976N4568M7403L7510K6234J4779L238q604k0280l1071m0791
62691B122507m9484n6703o1991o5745o8695p0705p1091p0048o8581o6853o3962
$$ y = [755287, 753837, 750769, 748092, 747253, 747734, 748048, 747516, 746497, 745269, 743538, 741167, 738866, 737710, 738051, 739096, 739631, 739016, 737472, 735689, 734475, 734551, 736105, 738406, 740399, 741839, 743315, 745012, 746253, 746717, 747252, 748670, 750487, 751908, 753409, 755918, 758785, 760319, 760588, 761972, 766117, 771680, 776245, 779489, 783147, 788477, 795165, 802598, 810925, 820477, 831020, 842033, 853350, 865279, 878333, 892998, 909547, 928003, 948331, 970453, 993926, 1018103, 1043134, 1070494, 1101767, 1137004, 1175007, 1215260, 1258709, 1306324, 1357731, 1411930, 1468768, 1528839, 1592127, 1657510, 1723639, 1789656, 1854937, 1918777, 1980545, 2039521, 2094089, 2141492, 2179002, 2205236, 2220015, 2223253, 2214649, 2194369, 2163298, 2122507, 2073023, 2016320, 1954329, 1888584, 1819889, 1749184, 1678093, 1608045, 1539464, 1472611, 1408649]
62680A408649n9843n6022n3501n1125m7349m2686l8784l5725l2167k8028k5024
62669I38395k4012k3475k1637j8706j6037j4067j2296j0510q757o660l935j379
62657G76924q7J45O47K029L557M526N274O461Q114R871J1561J3172J4705J6496
62643H73395J9135K2641K6072K8395K9655L0987L3616L7909M3030M7430N0113
62632A242378N1649N3557N6581O0052O3118O5776O8096O9336O8676O6403O3355
62621A928977N9387N3493M5422L6158K6545J6310M848p722k0619l2925m3708n2315
62609B013851n9068o4952p0122p3331p3593p1884p0225o9313o8093o5603o2118
62598A265549n8137n3397m7765m2423l9047l7821l7143l5409l2426k8800k4903
$$ y = [1408649, 1348806, 1292784, 1239283, 1188158, 1140809, 1098123, 1059339, 1023614, 991447, 963419, 938395, 914383, 890908, 869271, 850565, 834528, 820461, 808165, 797655, 788898, 782238, 778303, 776924, 776837, 776982, 777629, 779658, 783215, 787741, 793015, 799476, 807590, 817461, 829022, 842194, 856899, 873395, 892530, 915171, 941243, 969638, 999293, 1030280, 1063896, 1101805, 1144835, 1192265, 1242378, 1294027, 1347584, 1404165, 1464217, 1527335, 1593111, 1661207, 1730543, 1799219, 1865622, 1928977, 1988364, 2041857, 2087279, 2123437, 2149982, 2166292, 2171140, 2163418, 2142799, 2109874, 2066166, 2013851, 1954783, 1889831, 1819709, 1746378, 1672785, 1600901, 1530676, 1461363, 1393270, 1327667, 1265549, 1207412, 1154015, 1106250, 1063827, 1024780, 986959, 949816, 914407, 881981, 853181, 828278]
62587H28278k1027j8041j6788j6866j6853j5950j4690j3823j3290j2688j2022
62576F56240j1278r976p992o278n798o116o094n687n663n759m748k751j707k627
62562E73766l804l059p42J009J244Q86P99R29J334K460L909M289L091J701J754
62547E89566L117M391M850N093N982P759J0150J2607J4354J4781J4141J3621J4324
62534G14736J6310J8777K1019K2890K4533K6103K7955L0469L3424L5843L6953
62523A009012L7001L6545L5371L2910K9534K6348K3596K0309J5827J0630N157
62512A282240j017q038j4795k0071k3963k7187k9692l1120l1921l2737l3223l2657
62500I95819l1339l0046k8553k6256k3876k2783k2621k1522j8995j6764j6137
$$ y = [828278, 807251, 789210, 772422, 755556, 738703, 722753, 708063, 694240, 680950, 668262, 656240, 644962, 634986, 626994, 620716, 614918, 608802, 602708, 597021, 591358, 585599, 580851, 578100, 576393, 573766, 569962, 566903, 566161, 567170, 568414, 569300, 570099, 571028, 572362, 574822, 578731, 583020, 586111, 587812, 589566, 592683, 597074, 601924, 607017, 612999, 620758, 630908, 643515, 657869, 672650, 686791, 700412, 714736, 731046, 749823, 770842, 793732, 818265, 844368, 872323, 902792, 936216, 972059, 1009012, 1046013, 1082558, 1117929, 1150839, 1180373, 1206721, 1230317, 1250626, 1266453, 1277083, 1282240, 1281223, 1273185, 1258390, 1238319, 1214356, 1187169, 1157477, 1126357, 1094436, 1061699, 1028476, 995819, 964480, 934434, 905881, 879625, 855749, 832966, 810345, 788823, 769828, 753064, 736927]
62489G36927j6266j5884j5086j4320j3078j0955q923q094q103p998p874q262q481
62476E93603p282m804k589j628j477j194k02J646L818N108M886M255M845O680
62462F05665Q322R068R648J0634J1530J2049J2972J4864J6875J7853J8098J9002
62450G66580K1237K4180K6991K9493L1846L3950L5579L6801L7925L9024L9615
62439A123221L8992L6834L3324K8695K2978J6518J0183M564q68o969j3403j8779
62427A275290k2543k5760k9434l2854l4517l4229l3292l2750l2391l1517k9829
62416I36174k7358k4321k1419j9465j8274j6604j3884j1397j0782j1734j2173
62405G48763j0714q048n706m283l250j930k18J223J354j38j931k032J2K582L996
$$ y = [736927, 720661, 704777, 689691, 675371, 662293, 651338, 642415, 634321, 626218, 618220, 610346, 602084, 593603, 586321, 581517, 578928, 577300, 575823, 574629, 574427, 576073, 579891, 584999, 589885, 594140, 598985, 605665, 613987, 623055, 632703, 643337, 654867, 666916, 679888, 694752, 711627, 729480, 747578, 766580, 787817, 811997, 838988, 868481, 900327, 934277, 969856, 1006657, 1044582, 1083606, 1123221, 1162213, 1199047, 1232371, 1261066, 1284044, 1300562, 1310745, 1315309, 1314441, 1307472, 1294069, 1275290, 1252747, 1226987, 1197553, 1164699, 1130182, 1095953, 1062661, 1029911, 997520, 966003, 936174, 908816, 884495, 863076, 843611, 825337, 808733, 794849, 783452, 772670, 760936, 748763, 738049, 730001, 724295, 720012, 716762, 714832, 714614, 715837, 717191, 717053, 715122, 713090, 713102, 715684, 719680]
62390G19680M230M223M377M622N052N462N013L543K504L167M499M355K494N13
62376G73734j008l159o102q032p858p125p773r345r979r230q251p774p367o519
62362F74212n263l822k521j784j435m92J511L484M084L581L380M142N518P260
62348F91855R205J0489J0260R232R055J0009J0725J0505J0404J1450J3098J4185
62336H20472J4345J3736J2445J0973J0363J0810J0902R290O567M471L687L510
62324I31571L306L198L311L470L768M621N962P105P739Q460J0066J2718J6144
62311A021439K0106K4268K8026L0951L3362L6121L9950M5053N1038N6986O1931
62300A449231O5724O9218P3166P7212Q0540Q3174Q5646Q7336Q6320Q1424P3570
$$ y = [719680, 723910, 728133, 732510, 737132, 742184, 747646, 752659, 756202, 758706, 761873, 766372, 770727, 773221, 773734, 772726, 769567, 763465, 755433, 747575, 740450, 732677, 723332, 713353, 704123, 695872, 688098, 680731, 674212, 668949, 665127, 662606, 660822, 659387, 658895, 660406, 663890, 667974, 671555, 674935, 679077, 684595, 691855, 701060, 711549, 721809, 731041, 740096, 750105, 760830, 771335, 781739, 793189, 806287, 820472, 834817, 848553, 860998, 871971, 882334, 893144, 904046, 913336, 919903, 924374, 928061, 931571, 934877, 938075, 941386, 944856, 948624, 953245, 959207, 966312, 974051, 982511, 992577, 1005295, 1021439, 1041545, 1065813, 1093839, 1124790, 1158152, 1194273, 1234223, 1279276, 1330314, 1387300, 1449231, 1514955, 1584173, 1657339, 1734551, 1815091, 1898265, 1983911, 2071247, 2157567, 2238991, 2312561]
62289B312561O4332N3981M1921K8424J4754J827j0130k0792k9922l8291m7046
62278B371619n5945o3401o8547p1937p3879p3655p1212o8069o5298o1875n6504
62267A641297n0101m4896m1657l9356l7091l4742l2070k8782k5491k3080k1095
62256A262936j8250j4616j1786j0544r866q733p437o431n220l422j861j513k071
62243A161186k464k331k178k507l471m952o391o918o320n515n470o005o159n512
62229A094993m465l443k426j256pJ147K302L901O261Q930J0878J1669J2088J3067
62215A153639J4411J5472J6632J8888K1985K4374K5403K6284K8360L1596L5447
62204A412491M0011M5377N0788N5495N9675O3674O7190P0172P3595P8063Q2324
$$ y = [2312561, 2376893, 2430874, 2472795, 2501219, 2515973, 2517800, 2507670, 2486878, 2456956, 2418665, 2371619, 2315674, 2252273, 2183726, 2111789, 2037910, 1964255, 1893043, 1824974, 1759676, 1697801, 1641297, 1591196, 1546300, 1504643, 1465287, 1428196, 1393454, 1361384, 1332602, 1307111, 1284031, 1262936, 1244686, 1230070, 1218284, 1207740, 1197874, 1189141, 1181704, 1175273, 1170053, 1166631, 1164770, 1163257, 1161186, 1158722, 1156391, 1154213, 1151706, 1148235, 1143283, 1136892, 1129974, 1123654, 1118139, 1112669, 1106664, 1100505, 1094993, 1090528, 1087085, 1084659, 1083403, 1083396, 1084543, 1086845, 1090746, 1097007, 1105937, 1116815, 1128484, 1140572, 1153639, 1168050, 1183522, 1200154, 1219042, 1241027, 1265401, 1290804, 1317088, 1345448, 1377044, 1412491, 1452502, 1497879, 1548667, 1604162, 1663837, 1727511, 1794701, 1864873, 1938468, 2016531, 2098855]
62193B098855Q4448Q4031Q1929P8308P2355O3757N3095M0808K7107J2937k47j1902
62181B685481k2549l2354m0747m7579n3494n8697o2438o4247o4649o4147o2389
62170B112191n9072n4858n0715m6857m2946l8734l3981k8370k2283j7114j4029
62159A703232j2663j1699j0463r211q097o721m813k708q83O44K201L920N505O474
62145A654718O789P076Q061R739J1480J3042J5013J7843K0889K2954K3605K3463
62133A834672K3437K4118K5807K8409L1221L3429L5053L6956L9520M1790M2372
62122B196784M1083L9164L7811L6902L5363L2642K9554K7612K7586K8763K9681
62111B562945K9725K9920L1948L6329M1868M7097N1913N7245O3183O8228P0708
$$ y = [2098855, 2183303, 2267334, 2349263, 2427571, 2499926, 2563683, 2616778, 2657586, 2684693, 2697630, 2697383, 2685481, 2662932, 2630578, 2589831, 2542252, 2488758, 2430061, 2367623, 2303376, 2238727, 2174580, 2112191, 2053119, 1998261, 1947546, 1900689, 1857743, 1819009, 1785028, 1756658, 1734375, 1717261, 1703232, 1690569, 1678870, 1668407, 1659196, 1651099, 1644378, 1639565, 1636857, 1635974, 1636618, 1638819, 1642739, 1648244, 1654718, 1661507, 1668583, 1676644, 1686383, 1697863, 1710905, 1725918, 1743761, 1764650, 1787604, 1811209, 1834672, 1858109, 1882227, 1908034, 1936443, 1967664, 2001093, 2036146, 2073102, 2112622, 2154412, 2196784, 2237867, 2277031, 2314842, 2351744, 2387107, 2419749, 2449303, 2476915, 2504501, 2533264, 2562945, 2592670, 2622590, 2654538, 2690867, 2732735, 2779832, 2831745, 2888990, 2952173, 3020401, 3091109]
62100C091109P0367O7896O3405N6346M7051L7433K9472K3461J8225J2764P175
62089C524704K055k344o206r799j3228j6246j8121j7964j5547j1702p722m314
62077C403566j282J893N451R345J3403J7226K0103K1491K1694K1796K2745K4644
62065C582075K7059K9680L2394L4903L6765L7900L8709L9584M0558M1556M2691
62054C983874M4075M5533M6762M7579M7814M7282M6308M6009M7347M9865N1935
62043D504383N2573N2366N2342N2593N2704N3039N4586N7588O1110O4133O6390
62032E123807O8074O9483P1259P4095P7735Q1086Q3892Q7500R2967R8971J02747
62021F031616J02837R9958R5521R0648Q6619Q4603Q4279Q3873Q2250P9986P7573
$$ y = [3091109, 3161476, 3229372, 3292777, 3349123, 3396174, 3433607, 3463079, 3486540, 3504765, 3517529, 3524704, 3526759, 3524415, 3518209, 3508410, 3495182, 3478936, 3460815, 3442851, 3427304, 3415602, 3407880, 3403566, 3402284, 3404177, 3409628, 3418973, 3432376, 3449602, 3469705, 3491196, 3512890, 3534686, 3557431, 3582075, 3609134, 3638814, 3671208, 3706111, 3742876, 3780776, 3819485, 3859069, 3899627, 3941183, 3983874, 4027949, 4073482, 4120244, 4167823, 4215637, 4262919, 4309227, 4355236, 4402583, 4452448, 4504383, 4556956, 4609322, 4661664, 4714257, 4766961, 4820000, 4874586, 4932174, 4993284, 5057417, 5123807, 5191881, 5261364, 5332623, 5406718, 5484453, 5565539, 5649431, 5736931, 5829898, 5928869, 6031616, 6134453, 6234411, 6329932, 6420580, 6507199, 6591802, 6676081, 6759954, 6842204, 6922190, 6999763]
62010F999763P3848O7497N9428N2095M6781M2790L9166L5798L2627K9149K5223
61999G504165K1295J7137J1398L228o248j5052k2513k9374l6032m1742m5839m8923
61987G311500n2272n6390o0503o3429o4675o4665o4099o3146o1330n8103n3466
61976F649422m8104m3088l9361l7119l5487l3118k9560k5959k4013k4151k5102
61965F284360k5320k4605k3991k4289k5215k6141k7307k9630l3202l6587l8211
61954E969862l8148l7806l7880l7579l6314l5186l5807l8023l9852l9776l8181
61943E555310l6393l5129l4336l3774l3101l1927l0453k9838l1273l4741l9118
61932E185227m3412m7416n1334n5280n9243o3053o6254o8289o8989o8709o8006
$$ y = [6999763, 7073611, 7141108, 7200536, 7252631, 7299412, 7342202, 7381368, 7417166, 7449793, 7478942, 7504165, 7525460, 7542597, 7553995, 7557223, 7550975, 7535923, 7513410, 7484036, 7448004, 7406262, 7360423, 7311500, 7259228, 7202838, 7142335, 7078906, 7014231, 6949566, 6885467, 6822321, 6760991, 6702888, 6649422, 6601318, 6558230, 6518869, 6481750, 6446263, 6413145, 6383585, 6357626, 6333613, 6309462, 6284360, 6259040, 6234435, 6210444, 6186155, 6160940, 6134799, 6107492, 6077862, 6044660, 6008073, 5969862, 5931714, 5893908, 5856028, 5818449, 5782135, 5746949, 5711142, 5673119, 5633267, 5593491, 5555310, 5518917, 5483788, 5449452, 5415678, 5382577, 5350650, 5320197, 5290359, 5259086, 5224345, 5185227, 5141815, 5094399, 5043065, 4987785, 4928542, 4865489, 4799235, 4730946, 4661957, 4593248, 4525242]
61921D525242o7243o6350o4808o2211n9122n6791n5466n3573m9606m4548m1136
61910C904388m0574m1235m1045l9739l8066l6081l3645l1748l1581l2434l2015
61899C506225k9133k5000k1565j9564j8616j8179j7696j6387j3736j0027o035
61888C310287k337R27M013P512J1962J7105K1908K5539K8140L0428L3023L6449
61876C524956M1165M6886N2161N5453N6763N7595N9188O1227O2595O3047O3713
61865D144749O5894O9641P3669P6702P8975Q2346Q8747R8403J09637J20604J31271
61854E140638J43464J58945J77705J98338K19786K42052K65353K89526L14679
61845G150486L41691L71196M02520M34516M67284N01914N38137N72994O02139
$$ y = [4525242, 4457999, 4391649, 4326841, 4264630, 4205508, 4148717, 4093251, 4039678, 3990072, 3945524, 3904388, 3863814, 3822579, 3781534, 3741795, 3703729, 3667648, 3634003, 3602255, 3570674, 3538240, 3506225, 3477092, 3452092, 3430527, 3410963, 3392347, 3374168, 3356472, 3340085, 3326349, 3316322, 3310287, 3307950, 3308877, 3312890, 3320402, 3332364, 3349469, 3371377, 3396916, 3425056, 3455484, 3488507, 3524956, 3566121, 3613007, 3665168, 3720621, 3777384, 3834979, 3894167, 3955394, 4017989, 4081036, 4144749, 4210643, 4280284, 4353953, 4430655, 4509630, 4591976, 4680723, 4779126, 4888763, 5009367, 5140638, 5284102, 5443047, 5620752, 5819090, 6038876, 6280928, 6546281, 6835807, 7150486, 7492177, 7863373, 8265893, 8700409, 9167693, 9669607, 10207744, 10780738, 11382877]
61836A1382877O21733O28577O19146N89462N35822M55437L47229K13639O2269
61827A5456191r5016k45698l80125m92319n78842o38257o71864o83907o79816
61818A0990347o63804o38216o04894n66349n25362m83998m43562m05012l68840
61809F290310l34805l02535k72355k45032k20758j99015j79281j61218j44166
61800D231145j27315j10739r5563q2627p1455o0843n0085l9352k9247k0317j2663
61789C530939n785Q22O783J1045J3127J3513J2610J0158O144J568k559o350j0339
61776C581676j4072j6415j7000j6354j4687j1616p266k605J746O139J0741J4489
61764C514776J6067J5534J4078J2283R580N580J188k256m478o193p781q785q781
$$ y = [11382877, 12004610, 12633187, 13252333, 13841795, 14377617, 14833054, 15180283, 15393922, 15456191, 15361175, 15115477, 14735352, 14243033, 13664191, 13025934, 12354070, 11670163, 10990347, 10326543, 9688327, 9083433, 8517084, 7991722, 7507724, 7064162, 6659150, 6290310, 5955505, 5652970, 5380615, 5135583, 4914825, 4715810, 4536529, 4375311, 4231145, 4103830, 3993091, 3897528, 3814901, 3743446, 3682603, 3632518, 3593166, 3563919, 3543602, 3530939, 3525154, 3525976, 3532759, 3543804, 3556931, 3570444, 3583054, 3593212, 3599356, 3600924, 3598365, 3592015, 3581676, 3567604, 3551189, 3534189, 3517835, 3503148, 3491532, 3484266, 3481661, 3483407, 3489546, 3500287, 3514776, 3530843, 3546377, 3560455, 3572738, 3582318, 3587898, 3589086, 3586830, 3582352, 3576159, 3568378, 3559593, 3550812]
61751C550812p937o204k629L733J2390K1637L0194L8099M6034N4399O3243P2428
61739C876199Q1562R0232R8629J07604J17832J29189J41170J53507J66131J78847
61729E140902J91441K04069K17306K31994K48951K68591K90779L15378L42876
61720G452287L73976M08560M45739M85180N27900N75367O28276O86241P48124
61711A2331650Q12375Q77521R42613J006548J066596J117839J154075J168454
61703B0477671J153074J099156R98893Q47640O45486L98974J22664j62479m34737
61694B5146342o77156q78765j033083j138079j197270j218460j209960j178152
61686A6615417j128335j066144r97159r25638q54301p84936p18678o56057n97399
$$ y = [3550812, 3542875, 3536671, 3534042, 3537775, 3550165, 3571802, 3601996, 3640095, 3686129, 3740528, 3803771, 3876199, 3957761, 4047993, 4146622, 4254226, 4372058, 4501247, 4642417, 4795924, 4962055, 5140902, 5332343, 5536412, 5753718, 5985712, 6234663, 6503254, 6794033, 7109411, 7452287, 7826263, 8234823, 8680562, 9165742, 9693642, 10269009, 10897285, 11583526, 12331650, 13144025, 14021546, 14964159, 15970707, 17037303, 18155142, 19309217, 20477671, 21630745, 22729901, 23728794, 24576434, 25221920, 25620894, 25743558, 25581079, 25146342, 24469186, 23590421, 22557338, 21419259, 20221989, 19003529, 17793569, 16615417, 15487082, 14420938, 13423779, 12498141, 11643840, 10858904, 10140226, 9484169, 8886770]
61677H886770n43248m94197m50239m10557l74149l40767l11002k85247k62772
61668E414592k42231k22887k04791j88057j72763j59416j48336j38543j28573
61659C808995j18719j11020j06352j03143r9839r6838r4589r1530q6116p9623
61649B821226p4514p0781o6579o1924n8854n7676n5978n2262m7974m4796m2222
61638B187666l9373l7168l6742l7107l6327l4178l1909l0209k9002k8560k9052
61627A818039k9406k8338k6403k5477k6094k6693k5811k3733k1644k0210j9596
61616A544634j9889k0635k0476j8181j4044r765o841n322m248k953j739j283j803
61603A417455l027m751o905r142j0781j1375j1008j0001q573o887n009k773j16
$$ y = [8886770, 8343522, 7849325, 7399086, 6988529, 6614380, 6273613, 5962611, 5677364, 5414592, 5172361, 4949474, 4744683, 4556626, 4383863, 4224447, 4076111, 3937568, 3808995, 3690276, 3579256, 3472904, 3369761, 3269922, 3173084, 3078495, 2986965, 2900849, 2821226, 2746712, 2675931, 2609352, 2547428, 2488574, 2430898, 2374920, 2322658, 2274684, 2229888, 2187666, 2148293, 2111125, 2074383, 2037276, 2000949, 1966771, 1934862, 1904653, 1875651, 1847091, 1818039, 1788633, 1760295, 1733892, 1708415, 1682321, 1655628, 1629817, 1606084, 1584440, 1564230, 1544634, 1524745, 1504110, 1483634, 1465453, 1451409, 1441644, 1434803, 1429481, 1425233, 1422280, 1420541, 1419258, 1417455, 1414428, 1409677, 1402772, 1393630, 1382849, 1371474, 1360466, 1350465, 1341892, 1335005, 1329996, 1327223, 1327107]
61590A327107K406L912M122L617L005K479K313L062M579N463M348J652o61j202
61576A366202m73J15mk68j69N7J43N43J673K862L041K499K726M097M967L965J990
61559A393966O20n14l022o950j0508j2573j3678j4355j4269j3488j2900j2657
61547A279672j1695r673p905p457p658p548p480p933p987o657m813m057m180l452
61533A181177j280R69J950J840J649K079L288M967O454P392Q303R790J1366J1989
61519A251933J1733J2019J3911J6955K0006K2458K4416K6245K8391L1205L4552
61508A493824L7745M0193M2019M3873M6133M8371M9610M9152M7036M3661L9273
61497A980890L4330L0003K7374K6012K4326K1690J9240J7941J7033J5378J3488
$$ y = [1327107, 1329513, 1333425, 1337547, 1341164, 1344169, 1346648, 1348961, 1352023, 1356602, 1362065, 1366413, 1368065, 1367404, 1366202, 1365729, 1365844, 1365840, 1365572, 1365403, 1365460, 1365603, 1366146, 1367819, 1370681, 1373722, 1376221, 1378947, 1383044, 1388011, 1391976, 1393966, 1394586, 1394072, 1391050, 1384100, 1373592, 1361019, 1347341, 1332986, 1318717, 1305229, 1292329, 1279672, 1267977, 1258304, 1250399, 1242942, 1235284, 1227736, 1220256, 1212323, 1204336, 1197679, 1192866, 1188809, 1184629, 1181177, 1179897, 1180866, 1182816, 1184656, 1186305, 1188384, 1191672, 1196639, 1203093, 1210485, 1218788, 1228578, 1239944, 1251933, 1263666, 1275685, 1289596, 1306551, 1326557, 1349015, 1373431, 1399676, 1428067, 1459272, 1493824, 1531569, 1571762, 1613781, 1657654, 1703787, 1752158, 1801768, 1850920, 1897956, 1941617, 1980890, 2015220, 2045223, 2072597, 2098609, 2122935, 2144625, 2163865, 2181806, 2198839, 2214217, 2227705]
61486B227705J2774J3191J3148J1713R590P569N189J659k623o157p805p788p277
61473B270888p164p291o927n848m381k382R38N640J0378J4042J7469K2273K8370
61460B336005L3977L8223M2337M7803N4468O1286O8129P5926Q5288R5757J06350
61449C045549J16395J25871J35358J45750J57698J71095J85144J99006K12430
61440D494296K25603K38281K49315K57245K61080K59918K51988K35037K08232
61431F680995J73232J32979Q9885M5438J025m1529p9969j11974j35999j52257
61421F601826j62350j67625j68407j65120j59023j51047j40861j28254j14657
61412E244482j01858q9699p6646o2497m8928l7191k6831j7228q846k055M272J1684
$$ y = [2227705, 2240479, 2253670, 2266818, 2278531, 2288121, 2295690, 2300879, 2302538, 2299915, 2293758, 2285953, 2278165, 2270888, 2263724, 2256433, 2249506, 2243658, 2239277, 2236895, 2237833, 2243473, 2253851, 2267893, 2285362, 2307635, 2336005, 2369982, 2408205, 2450542, 2498345, 2552813, 2614099, 2682228, 2758154, 2843442, 2939199, 3045549, 3161944, 3287815, 3423173, 3568923, 3726621, 3897716, 4082860, 4281866, 4494296, 4719899, 4958180, 5207495, 5464740, 5725820, 5985738, 6237726, 6472763, 6680995, 6854227, 6987206, 7077091, 7122529, 7123554, 7082025, 7002056, 6890082, 6754083, 6601826, 6439476, 6271851, 6103444, 5938324, 5779301, 5628254, 5487393, 5359139, 5244482, 5142624, 5052925, 4976279, 4913782, 4864854, 4827663, 4800832, 4783604, 4774758, 4772703, 4776975, 4788659]
61400D788659K0195K8471L5852M3105N0832N7866O2115O3013O2486O2956O4701
61389E340251O6002O5784O5052O5294O6410O7068O6409O4568O1889N8487N4306
61378F041520M9008M2317L4986K8680K4073J9924J5110J0568P716N849L095m92
61366F282354l219n123q386j3614j8156j9775k0078k2280k6727l0869l3142l4648
61354F046337l6563l7781l6257l1867k6883k3601k2286k1629k0724j9884j9611
61343E749251j9680j9711k0014k0957k1936k1892k0614j8487j5157r642j977O439
61331E565623J4669K3499L4393M7882O3449Q0250R7522J14827J32424J50821J69788
61320F495147J88346K05975K22959K39103K53001K63073K68639K69214K63355
$$ y = [4788659, 4808854, 4837325, 4873177, 4916282, 4967114, 5024980, 5087095, 5150108, 5212594, 5275550, 5340251, 5406253, 5472037, 5537089, 5602383, 5668793, 5735861, 5802270, 5866838, 5928727, 5987214, 6041520, 6090528, 6132845, 6167831, 6196511, 6220584, 6240508, 6255618, 6266186, 6273902, 6279751, 6282846, 6282354, 6279135, 6274012, 6265626, 6252012, 6233856, 6214081, 6194003, 6171723, 6144996, 6114127, 6080985, 6046337, 6009774, 5971993, 5935736, 5903869, 5876986, 5853385, 5831099, 5809470, 5788746, 5768862, 5749251, 5729571, 5709860, 5689846, 5668889, 5646953, 5625061, 5604447, 5585960, 5570803, 5561161, 5559184, 5565623, 5580292, 5603791, 5638184, 5686066, 5749515, 5829765, 5927287, 6042114, 6174538, 6325359, 6495147, 6683493, 6889468, 7112427, 7351530, 7604531, 7867604, 8136243, 8405457, 8668812]
61311H668812K49156K25781J93988J55364J11594O4523J6541k9552p1532j08920
61301I475755j42709j73442k00024k21148k37291k50047k59710k64946k64989
61292G461449k60713k53288k43149k30827k17417k03633j89571j75923j63902
61283E523026j53343j42420j30303j18395j07683r6573q3421o9778n8616m9832
61273D512662m0178k7904j5132m742L295J1136J9706K7573L3010L6218L8990M2570
61261D637204M6242M8322M8187M6676M4566M1680L7869L3819L0116K6463K2647
61250E063791J9388J7045J4402J0197N303J733k27k249n474r526j4195k0188k7483
61237E052517l4507l9968m4394m8772n2755n5394n6885n8127n8893n7847n4585
$$ y = [8668812, 8917968, 9143749, 9337737, 9493101, 9604695, 9669218, 9685759, 9656207, 9584675, 9475755, 9333046, 9159604, 8959580, 8738432, 8501141, 8251094, 7991384, 7726438, 7461449, 7200736, 6947448, 6704299, 6473472, 6256055, 6052422, 5862851, 5686928, 5523026, 5369683, 5227263, 5096960, 4978565, 4870882, 4774309, 4690888, 4621110, 4562494, 4512662, 4472484, 4444580, 4429448, 4424706, 4428001, 4439137, 4458843, 4486416, 4519426, 4555644, 4594634, 4637204, 4683446, 4731768, 4779955, 4826631, 4871197, 4912877, 4950746, 4984565, 5014681, 5041144, 5063791, 5083179, 5100224, 5114626, 5124823, 5130126, 5131859, 5131632, 5129383, 5123909, 5114383, 5100188, 5080000, 5052517, 5018010, 4978042, 4933648, 4884876, 4832121, 4776727, 4719842, 4661715, 4602822, 4544975, 4490390]
61226D490390n0474m6963m3825l9805l4663k9824k6821k5437k3834k0613j6551
61215D131580j3906j3905j5180j5112j2747r887q908r886j0538q990n709k240
61203D004572J060N062J0215J6090K2376K8984L5107L9565M2633M6198N1278N6708
61191D359848O1277O6058P3100Q2426R1889R9672J05430J08931J09081J04789
61181E262501R5802Q2161O3682M0497J3548j5768m6005p5490j02279j24764j42126
61170E051759j54070j60453j61430j57771j50818j42176j33236j24791j17007
61161C750007j09820j03275r7411r2235q7827q4097q0208p4899o7813o0005n2752
61150B839665m6417m0928l6500l3032k9471k4862j9598j4627r892m708O42N098
$$ y = [4490390, 4439916, 4392953, 4349128, 4309323, 4274660, 4244836, 4218015, 4192578, 4168744, 4148131, 4131580, 4117674, 4103769, 4088589, 4073477, 4060730, 4050843, 4041935, 4032049, 4021511, 4012521, 4006812, 4004572, 4005632, 4010694, 4020909, 4036999, 4059375, 4088359, 4123466, 4163031, 4205664, 4251862, 4303140, 4359848, 4421125, 4487183, 4560283, 4642709, 4734598, 4834270, 4939700, 5048631, 5157712, 5262501, 5358303, 5440464, 5504146, 5544643, 5558191, 5542423, 5496418, 5420928, 5318649, 5193885, 5051759, 4897689, 4737236, 4575806, 4418035, 4267217, 4125041, 3991805, 3867014, 3750007, 3640187, 3536912, 3439501, 3347266, 3259439, 3175342, 3095134, 3020235, 2952422, 2892417, 2839665, 2793248, 2752320, 2715820, 2682788, 2653317, 2628455, 2608857, 2594230, 2584338, 2579630, 2580272, 2585370]
61138B585370Q465J1524J4441J6428J7248J7710J8179J7749J5468J1300N504j763
61126B737623r481j5707j9553k2387k5899k9677l1965l2342l2249l2914l4174
61115B451275l5599l7579m0469m3345m4682m4170m3081m2718m3046m3171m2682
61104A990733m1891m1007l9856l8406l6927l5344l3126l0205k7323k4972k2676
61093A619000k0024j7634j6081j4486j1517p547m557l771m695o585r431j3006
61081A489666j6260j8412j9719k0374j9642j7017j3455j0361p836n116k315n04
61069A338655J14R13L119O132Q246Q736Q507Q640Q946Q505P199N932N291M853
61055A423788M236L936M327M518L446J728J111K049L157L347L197L676M617N141
$$ y = [2585370, 2593835, 2605359, 2619800, 2636228, 2653476, 2671186, 2689365, 2707114, 2722582, 2733882, 2739386, 2737623, 2728142, 2712435, 2692882, 2670495, 2644596, 2614919, 2582954, 2550612, 2518363, 2485449, 2451275, 2415676, 2378097, 2337628, 2294283, 2249601, 2205431, 2162350, 2119632, 2076586, 2033415, 1990733, 1948842, 1907835, 1867979, 1829573, 1792646, 1757302, 1724176, 1693971, 1666648, 1641676, 1619000, 1598976, 1581342, 1565261, 1550775, 1539258, 1531711, 1527154, 1523383, 1518688, 1512103, 1502672, 1489666, 1473406, 1454994, 1435275, 1414901, 1395259, 1378242, 1364787, 1354426, 1346590, 1341474, 1339159, 1338655, 1338769, 1339682, 1342801, 1348933, 1357179, 1365915, 1374422, 1383062, 1392008, 1400513, 1407712, 1413644, 1418935, 1423788, 1428024, 1431960, 1436287, 1440805, 1444251, 1445979, 1447090, 1449139, 1452296, 1455643, 1458840, 1462516, 1467133, 1472274]
61041A472274M532K119k527q293j2512j3759j3841j5538j8731k0544j9303j6647
61029A337230j5039j4680j4037j2498j1110j0858j1394j1694j1244j0194q891
61018A205591p734p115o891o158m203j689j43j39o22l66O97K115L917N953O950
61003A190163N722L177J750K595M592O321P602Q473Q238O713N403N996Q165J0108
60989A275018J0911J1243J1894J2949J4496J6827J9469K1032K0903K0430K1428
60978A456600K3743K5392K5330K5033K6515K9388L1186L0678K9552L0167L2675
60967A766259L5415L7386L9017M0847M2840M5032M7577N0006N1590N2703N4661
60956B263333N7928O1569O4772O7727P0729P3730P7245Q2298Q8781R5248J01092
$$ y = [1472274, 1476806, 1478925, 1476398, 1468105, 1455593, 1441834, 1427993, 1412455, 1393724, 1373180, 1353877, 1337230, 1322191, 1307511, 1293474, 1280976, 1269866, 1259008, 1247614, 1235920, 1224676, 1214482, 1205591, 1197857, 1190742, 1183851, 1177693, 1173490, 1171801, 1171658, 1171519, 1170897, 1170531, 1171228, 1173343, 1177260, 1183213, 1190163, 1195885, 1199062, 1200812, 1203407, 1207999, 1214320, 1221922, 1230395, 1238633, 1245346, 1250749, 1256745, 1264910, 1275018, 1285929, 1297172, 1309066, 1322015, 1336511, 1353338, 1372807, 1393839, 1414742, 1435172, 1456600, 1480343, 1505735, 1531065, 1556098, 1582613, 1612001, 1643187, 1673865, 1703417, 1733584, 1766259, 1801674, 1839060, 1878077, 1918924, 1961764, 2006796, 2054373, 2104379, 2155969, 2208672, 2263333, 2321261, 2382830, 2447602, 2515329, 2586058, 2659788, 2737033, 2819331, 2908112, 3003360, 3104452]
60945C104452J07536J15629J24712J33990J44135J55992J69008J82413J96725
60936D434592K12427K28353K43118K57086K71235K85279K99101L14813L34879
60927F880883L59090L85973M16308M52079M92461N34424N77463O24357O77025
60918A1400063P35610Q02548Q83327R81581J097572J233497J395356J586174J802405
60909B1918133K042106K311972K619841K965455L347396L768057M200192M530523
60901D7703675M561193M119923L207387K039917R33104J29861k80781l27791j04492
60892F1981996K27543M26901K45305m28176j478601k626094l586621m199888m449569
60883D6112796m407992m174404l838720l465882l093361k739255k412903k118801
$$ y = [3104452, 3211988, 3327617, 3452329, 3586319, 3730454, 3886446, 4055454, 4237867, 4434592, 4647019, 4875372, 5118490, 5375576, 5646811, 5932090, 6231191, 6546004, 6880883, 7239973, 7625946, 8042254, 8494333, 8986794, 9521218, 10098681, 10723038, 11400063, 12135673, 12938221, 13821548, 14803129, 15900701, 17134198, 18529554, 20115728, 21918133, 23960239, 26272211, 28892052, 31857507, 35204903, 38972960, 43173152, 47703675, 52264868, 56384791, 59592178, 61632095, 62565199, 62695060, 62414279, 62086488, 61981996, 62209539, 62636440, 62881745, 62453569, 60974968, 58348874, 54762253, 50562365, 46112796, 41704804, 37530400, 33691680, 30225798, 27132437, 24393182, 21980279, 19861478]
60875A9861478j855839j619889j409241j225659j070174r40279q31659p40525
60867A0168213o63790n98861n44128m98453m59570m24120l89837l56755l26022
60858E906677k98492k74804k55461k40146k27715k17226k08108j99014j87960
60849C797751j74456j60429j48050j37531j28019j19541j12496j05945r8245q9405
60839B523634q1291p5229p0752o7024o4015o1542n8547n4401n0222m7698m6998
60828A845915m6819m6056m4454m1894l8299l4436l1801l1150l1730l2366l2686
60817A434224l2905l2822l1784k9548k6739k4398k3205k3024k2951k1883j9361
60806A145604j6092j3500j2487j2431j1444q071k877J908M496N139N310N959P095
$$ y = [19861478, 18005639, 16385750, 14976509, 13750850, 12680676, 11740397, 10908738, 10168213, 9504423, 8905562, 8361434, 7862981, 7403411, 6979291, 6589454, 6232699, 5906677, 5608185, 5333381, 5077920, 4837774, 4610059, 4392833, 4184725, 3985711, 3797751, 3623295, 3462866, 3314816, 3177285, 3049266, 2929725, 2817229, 2711284, 2613039, 2523634, 2442343, 2367114, 2296362, 2229338, 2165323, 2103781, 2045234, 1990833, 1940611, 1892913, 1845915, 1799096, 1753040, 1708586, 1666692, 1628393, 1593957, 1562156, 1531006, 1499276, 1466910, 1434224, 1401319, 1368497, 1336713, 1307165, 1280426, 1256028, 1232823, 1209799, 1186848, 1164965, 1145604, 1129512, 1116012, 1103525, 1091094, 1079650, 1071579, 1068702, 1070610, 1075106, 1080245, 1085555, 1091514, 1098609]
60793A098609Q621J0436J1761J1617J0399R964J1420J3659J4842J4628J4019J3619
60781A243594J3224J2717J2218J1324R452P043N446N303N830N893M935K717o72
60768A339024m070n666n005l804m003n609p333q610r943j1629j3287j4539j5250
60755A230276j5075j3687j1617j0064r633r744r470q446o849n012l317k019j053
60742A124290k26M16P74J184K231M059O301Q673J1131J3367J4730J4868J4137
60729A215935J3222J2653J2661J3053J3206J2571J1250R795Q535P576P208P572
60717A345237P972P294N313K962J206L31L45J159K149K412J885J365J161P11o8
60702A381434j62R59K138J911M52q50j201q87n49q43k262m283n249m224k411j572
$$ y = [1098609, 1107230, 1117666, 1129427, 1141044, 1151443, 1161407, 1172827, 1186486, 1201328, 1215956, 1229975, 1243594, 1256818, 1269535, 1281753, 1293077, 1302529, 1309572, 1315018, 1320321, 1326151, 1332044, 1336979, 1339696, 1339024, 1334954, 1329288, 1324283, 1320479, 1316476, 1310867, 1303534, 1294924, 1284981, 1273352, 1260065, 1245526, 1230276, 1215201, 1201514, 1189897, 1179833, 1170200, 1160456, 1150986, 1142540, 1135691, 1130679, 1127362, 1125343, 1124290, 1124064, 1124480, 1125254, 1126438, 1128669, 1132728, 1139029, 1147702, 1158833, 1172200, 1186930, 1201798, 1215935, 1229157, 1241810, 1254471, 1267524, 1280730, 1293301, 1304551, 1314346, 1322881, 1330457, 1337665, 1345237, 1353209, 1360503, 1365816, 1368778, 1369984, 1370315, 1370660, 1371819, 1373968, 1376380, 1378265, 1379630, 1380791, 1381502, 1381434, 1381272, 1382231, 1384369, 1386280, 1386732, 1385882, 1384681, 1383794, 1383245, 1382402, 1380140, 1375857, 1370608, 1366384, 1363973, 1362401]
60686A362401j619j270n69q76k367l535l654l867m944n679m792l124k494l188
60672A320423m125m832n769o854p272o922o844p721q914r492r513r678j0176j0424
60658A211887r811q264o211m319l215l115l602l861l365k425k082l219n543p508
60644A145347p611n988m495n047p877j1516j4298j5537j5467j4638j3735j3422
60632A015716j3800j4078j3363j1880j0872j1085j1741j1377r456o869n000m560
60620H91635n194n932n953n018l344j304O38J979K613L105M038N250O235P117
60606H95865Q405R851J0547J0400J0400J0996J1354J0946J0643J1205J1761J1297
60594A023670J0769J1984J4684J6592J6492J5683J5825J6842J7671J8010J8354
$$ y = [1362401, 1360782, 1359512, 1358943, 1358067, 1355700, 1352165, 1348511, 1344644, 1339700, 1334021, 1329229, 1326105, 1323611, 1320423, 1316298, 1311466, 1305697, 1298843, 1291571, 1284649, 1277805, 1270084, 1261170, 1251678, 1242165, 1232487, 1222311, 1211887, 1202076, 1193812, 1187601, 1183282, 1180067, 1176952, 1173350, 1169489, 1166124, 1163699, 1161617, 1158398, 1152855, 1145347, 1137736, 1131748, 1127253, 1122206, 1114329, 1102813, 1088515, 1072978, 1057511, 1042873, 1029138, 1015716, 1001916, 987838, 974475, 962595, 951723, 940638, 928897, 917520, 908064, 901195, 896195, 891635, 886441, 880509, 874556, 869538, 866194, 864890, 865528, 867507, 870120, 873225, 877263, 882513, 888748, 895865, 904270, 914121, 924668, 935068, 945468, 956464, 967818, 978764, 989407, 1000612, 1012373, 1023670, 1034439, 1046423, 1061107, 1077699, 1094191, 1109874, 1125699, 1142541, 1160212, 1178222, 1196576]
60583A196576J8844J8949J8171J6704J5414J5110J5639J5884J5104J3784J2590
60572A372769J1079Q487N411L288K323J265o48k897n001p219r508j1196j2151
60559A356002j2989j3606j3009j1329j0383j1204j2475j2623j2065j1735j0758
60548A223826p700l421m42M75J194L387O509R051J0473J1214J1684J1972J1969
60535A290191J1500J0694J0167J0134R563P298M093K267K764L778L167J342N65
60522A367523J871M000N410N994O288N976M336J723m53j426j925k982m595o132
60508A385608p397q600r681j0398j0908j1541j2164j2352j1916j0632q027m439
60496A267553j775j693l171l440j497J017K704M230O326P953Q036P690Q924J1889
$$ y = [1196576, 1215420, 1234369, 1252540, 1269244, 1284658, 1299768, 1315407, 1331291, 1346395, 1360179, 1372769, 1383848, 1392335, 1397746, 1401034, 1403357, 1404622, 1403974, 1401077, 1396076, 1388857, 1379349, 1368153, 1356002, 1343013, 1329407, 1316398, 1305069, 1294686, 1283482, 1271007, 1258384, 1246319, 1234584, 1223826, 1216126, 1212705, 1212263, 1212738, 1213932, 1217319, 1223828, 1232879, 1243352, 1254566, 1266250, 1278222, 1290191, 1301691, 1312385, 1322552, 1332686, 1342249, 1349547, 1353640, 1355907, 1358671, 1362449, 1365616, 1366958, 1367523, 1369394, 1373394, 1378804, 1384798, 1391086, 1397062, 1401398, 1403121, 1402668, 1401242, 1399317, 1396335, 1391740, 1385608, 1378211, 1369611, 1359930, 1349532, 1338624, 1327083, 1314919, 1302567, 1290651, 1280019, 1271992, 1267553, 1265778, 1264085, 1260914, 1257474, 1255977, 1256994, 1259698, 1263928, 1270254, 1278207, 1286243, 1293933, 1302857, 1314746]
60482A314746J5203J8360K2084K6446L0272L2764L4558L6866M0451M5546N1988
60471A669284N9141O6190P2599P7916Q1293Q1746P8807P2579O3327N1341L7138
60460B411361K1765P173m023j0262j2539j3036j2043p860l61P395J2513J5605
60448B415688J8849K2094K3111K1102J7812J5296J4449J5516J8253K1675K5160
60437B629005K9704L6589M5224N4010O2992P3648Q6211R9274J12208J25810J40226
60426C494901J54135J66477J77341J86857J95227K04210K16445K32750K52151
60417E280494K75153L04482L41254L82609M24579M65033N01485N27451N33367
60408I035907N11050M56529L70096K55709J20234k7743j78075l18249m35166n20363
$$ y = [1314746, 1329949, 1348309, 1370393, 1396839, 1427111, 1459875, 1494433, 1531299, 1571750, 1617296, 1669284, 1728425, 1794615, 1867214, 1945130, 2026423, 2108169, 2186976, 2259555, 2322882, 2374223, 2411361, 2433126, 2440299, 2436276, 2426014, 2413475, 2400439, 2388396, 2380536, 2380175, 2387570, 2400083, 2415688, 2434537, 2456631, 2479742, 2500844, 2518656, 2533952, 2548401, 2563917, 2582170, 2603845, 2629005, 2658709, 2695298, 2740522, 2794532, 2857524, 2931172, 3017383, 3116657, 3228865, 3354675, 3494901, 3649036, 3815513, 3992854, 4179711, 4374938, 4579148, 4795593, 5028343, 5280494, 5555647, 5860129, 6201383, 6583992, 7008571, 7473604, 7975089, 8502540, 9035907, 9546957, 10003486, 10373582, 10629291, 10749525, 10721782, 10543707, 10225458, 9790292, 9269929]
60398I269929n73278n98402o00394n83234n52179n13395m71443m28770l87356
60389D561478l48943l13603k80008k47688k17901j92008j70057j51251j34823
60380B505196j20235j07193r5673q5545p6372o8145o1633n7274n4140n0877m7246
60369A680863m3837m0822l8020l5669l3965l2281l0053k7995k7082k6699k5283
60358A319157k2631j9989j7889j5503j2509r982q801q379p604o124m207k274j035
60345A182230j256k711m016l875k128N20L082M631M938M893N506O458O654O184
60331A211110O386P691Q822Q766Q160P853P278N486K932R77J7q07k204l939n323
60316A263205n827n330m334l779m168n005n404n023m151l285k910l186l424k443
$$ y = [9269929, 8696651, 8098249, 7497855, 6914621, 6362442, 5849047, 5377604, 4948834, 4561478, 4212535, 3898932, 3618924, 3371236, 3153335, 2961327, 2791270, 2640019, 2505196, 2384961, 2277768, 2182095, 2096550, 2020178, 1952033, 1890400, 1833126, 1778986, 1728109, 1680863, 1637026, 1596204, 1558184, 1522515, 1488550, 1456269, 1426216, 1398221, 1371139, 1344440, 1319157, 1296526, 1276537, 1258648, 1243145, 1230636, 1220654, 1211853, 1203474, 1195870, 1189746, 1185539, 1183265, 1182230, 1180974, 1178263, 1174247, 1170372, 1168244, 1168764, 1171846, 1176477, 1181415, 1186308, 1191814, 1198272, 1204926, 1211110, 1217496, 1225187, 1234009, 1242775, 1250935, 1258788, 1266066, 1271552, 1274484, 1275461, 1275478, 1274671, 1272467, 1268528, 1263205, 1257378, 1252048, 1247714, 1243935, 1239767, 1234762, 1229358, 1224335, 1220184, 1216899, 1213989, 1210803, 1207379, 1204936]
60302A204936n1K298K894J541m94j868j974r93J55K40j065k600k971k138j131
60287A196779n19P0J087K475L996N446O514O920O713O097N282M797N414P042Q272
60272A266385P968O844O416O796O868O414O374O868O764N805N466O674Q141Q256
60258A362039P335O552N602L206o17m463p588j0379j2814j4030j3717j2618j1257
60245A297251r423p338o102o211o641o138m697l065j531j0J248J933K305K834
60231A254415L445L725L620L443L433L681M164M457L898K568J696K441M568O891
60217A306445Q691J0095J1357J2519J3678J4918J6022J6665J6834J6708J6417
60206A460349J6284J6900J8362J9839K0618K1169K2442K4372K6052K7232K8741
$$ y = [1204936, 1204885, 1207183, 1210077, 1211618, 1211124, 1209256, 1207282, 1206289, 1206444, 1206684, 1205619, 1203019, 1200048, 1197910, 1196779, 1196260, 1196330, 1197417, 1199892, 1203888, 1209334, 1215848, 1222768, 1229481, 1235578, 1240860, 1245657, 1251071, 1258113, 1266385, 1274353, 1281197, 1287613, 1294409, 1301277, 1307691, 1314065, 1320933, 1327697, 1333502, 1338968, 1345642, 1353783, 1362039, 1369374, 1375926, 1381528, 1384734, 1384117, 1379654, 1372066, 1361687, 1348873, 1334843, 1321126, 1308508, 1297251, 1287828, 1280490, 1274388, 1268177, 1261536, 1255398, 1250701, 1247636, 1246105, 1246095, 1247343, 1249276, 1251581, 1254415, 1257860, 1261585, 1265205, 1268648, 1272081, 1275762, 1279926, 1284383, 1288281, 1290849, 1292545, 1294986, 1299554, 1306445, 1315136, 1325231, 1336588, 1349107, 1362785, 1377703, 1393725, 1410390, 1427224, 1443932, 1460349, 1476633, 1493533, 1511895, 1531734, 1552352, 1573521, 1595963, 1620335, 1646387, 1673619, 1702360]
60195A702360L1295L4707L8277M1420M3928M6316M9720N4621N9857O3885O6979
60184B233365P1089P7383Q5027R2553R9291J05162J10233J15117J20813J27395
60174C237428J33592J38362J42009J45034J46629J45376J40932J34094J25477
60165D488933J15031J02895Q9886P6841O3844N0360L6119K1894R179j069r162
60154E044751j5779k0612k2720k2057j9552j5597r509r94Q896J8956K9117L9899
60142E014799N1320O3087P5186Q7514R9447J10394J20149J28162J33359J35486
60132F018903J35667J34542J30661J22140J09269R3981P7209N8550L8494J8958
60122F938374J024j6351l4307n1899o6953p8317q6155r0534r0929q7128p9725
$$ y = [1702360, 1733655, 1768362, 1806639, 1848059, 1891987, 1938303, 1988023, 2042644, 2102501, 2166386, 2233365, 2304454, 2381837, 2466864, 2559417, 2658708, 2763870, 2874103, 2989220, 3110033, 3237428, 3371020, 3509382, 3651391, 3796425, 3943054, 4088430, 4229362, 4363456, 4488933, 4603964, 4706859, 4796745, 4873586, 4937430, 4987790, 5023909, 5045803, 5054982, 5053913, 5044751, 5028972, 5008360, 4985640, 4963583, 4944031, 4928434, 4918925, 4917931, 4926827, 4945783, 4974900, 5014799, 5066119, 5129206, 5204392, 5291906, 5391353, 5501747, 5621896, 5750058, 5883417, 6018903, 6154570, 6289112, 6419773, 6541913, 6651182, 6745163, 6822372, 6880922, 6919416, 6938374, 6939398, 6923047, 6888740, 6836841, 6769888, 6691571, 6605416, 6514882, 6423953, 6336825, 6257100]
60111F257100o9525n7090m3112k8514j3602K416K0245L8916N6277P1253Q4579
60100F318943R6533J04996J07198J03026R4960Q4757P2061N6846M1135K6890J3655
60089G121000J69j2596k2060k7305k9690l0029k7118j9722q511M965K0107L7084
60077G006294N5648P5332R6413J19689J45143J71651J98100K24419K51262K78962
60067H622913L07028L34554L60782L85146M06883M24974M38427M46314M47585
60058A2174606M41311M27267M05771L76858L40154K96011K45973J91541J32967
60049A5032459P0162M406o1652j25569j85823k41102k89801l30416l61790l82837
60039A3128037l92726l91644l81038l62865l38894l10585k79007k44630k07570
$$ y = [6257100, 6187575, 6130485, 6087373, 6058859, 6045257, 6047673, 6067918, 6106834, 6163111, 6234364, 6318943, 6415476, 6520472, 6627670, 6730696, 6825656, 6910413, 6982474, 7039320, 7080455, 7107345, 7121000, 7121169, 7108573, 7086513, 7059208, 7029518, 6999489, 6972371, 6952649, 6944138, 6949103, 6969210, 7006294, 7061942, 7137274, 7233687, 7353376, 7498519, 7670170, 7868270, 8092689, 8343951, 8622913, 8929941, 9264495, 9625277, 10010423, 10417306, 10842280, 11280707, 11727021, 12174606, 12615917, 13043184, 13448955, 13825813, 14165967, 14461978, 14707951, 14899492, 15032459, 15102621, 15107027, 15045375, 14919806, 14733983, 14492881, 14203080, 13872664, 13510874, 13128037, 12735311, 12343667, 11962629, 11599764, 11260870, 10950285, 10671278, 10426648, 10219078]
60030A0219078j68399j28531q9692n3125j9361J1421L8919O2490Q1289R4446J01055
60019A0149590J00319R2250P8061N9259L6520J0302j7546m4142o8077r0175j11031
60008A0195330j29223j43325j54433j64867j74943j82899j87775j90349j91166
59999H676350j89542j85148j78961j71737j62724j50806j36050j19318j01176
59990G280888q2048o2794m4207k6101p619J1649L1223N0191O7812Q3812R8224
59979G401030J10822J20645J26405J27361J23584J15504J03594Q8398P0272M9160
59969H436775K5112r53k7464n3067p6932r8360j16850j32432j45333j55129j60717
59958G494650j61178j56419j47322j35548j22571j08386r1776p2591n2829l4361
$$ y = [10219078, 10050679, 9922148, 9832456, 9779331, 9759970, 9771391, 9810310, 9872800, 9954089, 10048535, 10149590, 10249909, 10342159, 10420220, 10479479, 10515999, 10526301, 10508755, 10464613, 10396536, 10306361, 10195330, 10066107, 9922782, 9768349, 9603482, 9428539, 9245640, 9057865, 8867516, 8676350, 8486808, 8301660, 8122699, 7950962, 7788238, 7637432, 7501382, 7382064, 7280888, 7198840, 7136046, 7091839, 7065738, 7058119, 7069768, 7100991, 7151182, 7218994, 7302806, 7401030, 7511852, 7632497, 7758902, 7886263, 8009847, 8125351, 8228945, 8317343, 8387615, 8436775, 8461887, 8460934, 8433470, 8380403, 8303471, 8205111, 8088261, 7955829, 7810496, 7655367, 7494650, 7333472, 7177053, 7029731, 6894183, 6771612, 6663226, 6571450, 6498859, 6446030, 6411669]
59948F411669j6514K510K2615M2102O0541P9114R8125J16416J33677J50960J68049
59937G269264J82413J91926J96792J97591J93277J82756J66887J47213J23900
59928H852019R6754O7247L7723R076j9159m7017p3741r8525j20166j36673j46832
59917H420706j51638j52622j49378j40556j26737j10225r2231p2420n1353l0908
59907G342638j1590Q298K9682N0814O9702Q6836J03638J19365J31627J39610J44918
59896H215538J48972J51210J50371J46440J40306J32243J21825J09424R6941Q6495
59886I499765P8566P2127O6743O3871O5545P2265Q2970R6910J14445J35842J60447
59875A0509496J87698K17933K51220K86006L20054L52283L82357M08537M27327
$$ y = [6411669, 6395155, 6397665, 6420280, 6462382, 6522923, 6602037, 6700162, 6816578, 6950255, 7101215, 7269264, 7451677, 7643603, 7840395, 8037986, 8231263, 8414019, 8580906, 8728119, 8852019, 8948773, 9016020, 9053743, 9062819, 9043660, 8996643, 8922902, 8824377, 8704211, 8567538, 8420706, 8269068, 8116446, 7967068, 7826512, 7699775, 7589550, 7497319, 7424899, 7373546, 7342638, 7331048, 7339346, 7369028, 7419842, 7489544, 7576380, 7680018, 7799383, 7931010, 8070620, 8215538, 8364510, 8515720, 8666091, 8812531, 8952837, 9085080, 9206905, 9316329, 9413270, 9499765, 9578331, 9650458, 9717201, 9781072, 9846617, 9918882, 10001852, 10098762, 10213207, 10349049, 10509496, 10697194, 10915127, 11166347, 11452353, 11772407, 12124690, 12507047, 12915584, 13342911]
59866A3342911M35706M32447M16839L87429L43204K84957K14438J33138M3545
59857A6034614m8985j37684k17997k88397l47679l93441m23995m40080m43556
59848A3292800m35809m18510l94499l66196l34035k97996k59724k21424j83433
59839A0381174j45015j07034p1532l8578n980K7177N8775Q6431J10020J30214
59829A0425652J45980J55268J57193J51886J38747J16424Q4548M4468j705n1807
59819A1366654j03340j53366j99238k39308k72863k99441l18443l29684l34393
59810I116578l34960l32862l27217l16330l00432k81798k62274k42100k21291
59801F497314k00505j80014j59272j38472j19124j02087q6264p0574n6120m4984
$$ y = [13342911, 13778617, 14211064, 14627903, 15015332, 15358536, 15643493, 15857931, 15991069, 16034614, 15985629, 15847945, 15629948, 15341551, 14993872, 14600431, 14176436, 13736356, 13292800, 12856991, 12438481, 12043982, 11677786, 11343751, 11045755, 10786031, 10564607, 10381174, 10236159, 10129125, 10057593, 10019015, 10013035, 10040212, 10098987, 10185418, 10295438, 10425652, 10571632, 10726900, 10884093, 11035979, 11174726, 11291150, 11375698, 11420166, 11418461, 11366654, 11263314, 11109948, 10910710, 10671402, 10398539, 10099098, 9780655, 9450971, 9116578, 8781618, 8448756, 8121539, 7805209, 7504777, 7222979, 6960705, 6718605, 6497314, 6296809, 6116795, 5957523, 5819051, 5699927, 5597840, 5511576, 5441002, 5384882, 5339898]
59791E339898l7542l2431k8543k5584k2909j9456j5055j0601o624k581K085O746
59779E147403R876J0397Q663O032L082j672j0396k2923l6098m6793n4598o0689
59767D952284o5193o7188o6702o4938o2406n8353n2395m5584l9250l3425k6901
59756D369949j8602q670J676J1274K0088K8738L7085M4018M9069N3352N8219O3595
59744D709791O8526P2548P5494P6505P4411O8845O0246M9284L7404K7217K0773
59733E341044J7612J5848J5041J6465K0648K6425L2988M1305N2560O6247Q0838
59722E727021R5731J11607J29277J48864J69971J92183K15257K39149K63857K89432
59712G582349L16009L43333L69915L92951M09283M15571M06937L76858L20670
$$ y = [5339898, 5302356, 5269925, 5241382, 5215798, 5192889, 5173433, 5158378, 5147777, 5141153, 5138572, 5140657, 5147403, 5157279, 5167676, 5176339, 5182371, 5185453, 5183781, 5173385, 5150462, 5114364, 5067571, 5012973, 4952284, 4887091, 4819903, 4753201, 4688263, 4625857, 4567504, 4515109, 4469525, 4430275, 4396850, 4369949, 4351347, 4342677, 4344353, 4355627, 4375715, 4404453, 4441538, 4485556, 4534625, 4587977, 4646196, 4709791, 4778317, 4850865, 4926359, 5002864, 5077275, 5146120, 5206366, 5255650, 5293054, 5320271, 5341044, 5358656, 5374504, 5389545, 5406010, 5426658, 5453083, 5486071, 5527376, 5579936, 5646183, 5727021, 5822752, 5934359, 6063636, 6212500, 6382471, 6574654, 6789911, 7029060, 7292917, 7582349, 7898358, 8241691, 8611606, 9004557, 9413840, 9829411, 10236348, 10613206, 10933876]
59703A0933876K39852J42285L8628o0854j47211k13829k58303k82530k90105k84052
59693I817757k67027k42206k12792j81229j49314j18189q7620n6388k4496N749
59683H484245L1989N4650P6437R9270J22847J46089J68771J91326K14058K37252
59673I826934K61651K88123L16991L47967L80637M14621M49375M84419N20026
59664A3290744N57293N97133O39247O82358P25167P66655Q05546Q40184Q69056
59655A9773383Q90811R03567R05022Q94046Q71984Q42128Q08217P73741P41919
59646B7404818P15496O96243O84739O80158O80108O81232O80413O74961O61469
59637C3559637O35610N94087N36429M64380L80400K87729J91113R5987O933p2320
$$ y = [10933876, 11173728, 11316013, 11354641, 11293787, 11146576, 10932747, 10674444, 10391914, 10101809, 9817757, 9550730, 9308524, 9095732, 8914503, 8765189, 8647000, 8559380, 8502992, 8478496, 8484245, 8516234, 8570884, 8647321, 8746591, 8869438, 9015527, 9184298, 9375624, 9589682, 9826934, 10088585, 10376708, 10693699, 11041666, 11422303, 11836924, 12286299, 12770718, 13290744, 13848037, 14445170, 15084417, 15766775, 16491942, 17258597, 18064143, 18904327, 19773383, 20664194, 21567761, 22472783, 23366829, 24238813, 25080941, 25889158, 26662899, 27404818, 28120314, 28816557, 29501296, 30181454, 30861562, 31542794, 32223207, 32898168, 33559637, 34195247, 34789334, 35325763, 35790143, 36170543, 36458272, 36649385, 36745372, 36752305, 36679985]
59627C6679985j37969j86650k16870k28989k23861k02423j66340j17710n8048
59618C5141125J1372Q8318J70012K55062L43687M35631N28692O19657P05494P82923
59608C9081973Q47463Q93698R16189R09879Q69907P91563O70937N06761L02844
59599D5791214O8815j82096m35994o79352q99074j084043j227340j326505j382364
59590C8643261j398802j382778j342207j283323j211273j132829j056318r88742
59582B8846989r35101r00693q90777r05741r38089r75940j008827j029752j034391
59573B0227678j021328r92587r51963r02764q47820p90426p33342o77333o22254
59564A2687861n69113n19562m73877m31168l91421l55580l23629k94224k66627
$$ y = [36679985, 36542016, 36355366, 36138496, 35909507, 35685646, 35483223, 35316883, 35199173, 35141125, 35152497, 35240815, 35410827, 35665889, 36009576, 36445207, 36973899, 37593556, 38299050, 39081973, 39929436, 40823134, 41739323, 42649202, 43519109, 44310672, 44981609, 45488370, 45791214, 45860029, 45677933, 45241939, 44562587, 43663513, 42579470, 41352130, 40025625, 38643261, 37244459, 35861681, 34519474, 33236151, 32024878, 30892049, 29835731, 28846989, 27911888, 27011195, 26120418, 25214677, 24276588, 23300648, 22291821, 21262069, 20227678, 19206350, 18213763, 17261800, 16359036, 15511216, 14720790, 13987448, 13310115, 12687861, 12118748, 11599186, 11125309, 10694141, 10302720, 9947140, 9623511, 9329287, 9062660]
59555I062660k41440k19054j98777j80093j63550j49676j38181j28988j22956
59546G519945j20450j19926j19354j18704j19751j23274j27608j30508j31534
59537F408836j31722j31433j29592j25118j18328j10514j02716r5274q8035q0470
59527E295634p1883o2114n1911m2250l3452k5259j7289r026j1R230J7082K2671
59515E031422K7368L3179L9895M5338M8356N0124N2163N4715N7705O1792O7341
59504E569398P3484P9231Q4759R0821R7726J05778J15693J27420J39418J50475
59494F634203J61620J74885J90486K06663K22220K37772K54223K71120K87123
59485H640315L01451L14243L25677L35050L40769L41372L36646L27497L14756
$$ y = [9062660, 8821220, 8602166, 8403389, 8223296, 8059746, 7910070, 7771889, 7642901, 7519945, 7399495, 7279569, 7160215, 7041511, 6921760, 6798486, 6670878, 6540370, 6408836, 6277114, 6145681, 6016089, 5890971, 5772643, 5662129, 5559413, 5464139, 5376104, 5295634, 5223751, 5161637, 5109726, 5067476, 5034024, 5008765, 4991476, 4982450, 4982439, 4991669, 5008751, 5031422, 5058790, 5091969, 5131864, 5177202, 5225558, 5275682, 5327845, 5382560, 5440265, 5502057, 5569398, 5642882, 5722113, 5806872, 5897693, 5995419, 6101197, 6216890, 6344310, 6483728, 6634203, 6795823, 6970708, 7161194, 7367857, 7590077, 7827849, 8082072, 8353192, 8640315, 8941766, 9256009, 9581686, 9916736, 10257505, 10598877, 10935523, 11263020, 11577776]
59476A1577776K98660K79520K58078K34685K08886J80398J49771J17647Q4323
59467A3389744N1110K1165k522j9630l1738l9370m1211l6130k4566p658J3771
59456A3272965L8916O6771R6473J26815J54915J76440J87928J88208J77102J53636
59446A4640169J16590O6294N178o3187j34886k06094k73764l35911l90645m35080
59436A2988664m66143m82616m85797m78023m61267m37490m09287l79143l48100
59427I040798l15907k82471k48698k15885j84905j56071j29151j03230p7179n0767
59417G276534k5033j182K0591M1026O1006Q1283J02415J24286J45902J66260J85138
59406H178226K02515K17703K29731K38120K42247K40286K30059K11024J84485
$$ y = [11577776, 11876436, 12155956, 12414034, 12648719, 12857605, 13038003, 13187774, 13305421, 13389744, 13440854, 13462019, 13459497, 13439867, 13408129, 13368759, 13327548, 13291418, 13266852, 13259194, 13272965, 13311881, 13378652, 13475125, 13601940, 13756855, 13933295, 14121223, 14309431, 14486533, 14640169, 14756759, 14823053, 14828231, 14765044, 14630158, 14424064, 14150300, 13814389, 13423744, 12988664, 12522521, 12039905, 11554108, 11076085, 10614818, 10177328, 9768041, 9388898, 9040798, 8724891, 8442420, 8193722, 7977837, 7792932, 7636861, 7507710, 7404480, 7327301, 7276534, 7251501, 7250319, 7270910, 7311936, 7372942, 7454225, 7556640, 7680926, 7826828, 7993088, 8178226, 8380741, 8598444, 8828175, 9066295, 9308542, 9548828, 9778887, 9989911, 10174396]
59397A0174396J51782J13288O9259K0484l2098q7038j41167j90102k30987k64035
59387I583782k90637l10932l24015l29798l29419l24226l15252l03382k89242
59378F766879k73050k55282k37205k20113k04167j88479j72269j55593j39220
59369D921501j24148j10989r9434q8560p7863o7659n8342m9739m1445l3150k4487
59358D145685j5265o177J571P788J3609J9905K6381L2832M0059M8351N5891O0083
59346D430713O0017N6712N1715M6800M4472M6780N3258O1327O9314P8125Q9494
59335E088727J03226J16674J26584J31316J31927J31649J34163J41867J55136
59326F261269J72615J92098K11826K31527K52140K74475K98572L24478L52631
$$ y = [10174396, 10326178, 10439466, 10508725, 10529209, 10497111, 10410073, 10268906, 10078804, 9847817, 9583782, 9293145, 8982213, 8658198, 8328400, 7998981, 7674755, 7359503, 7056121, 6766879, 6493829, 6238547, 6001342, 5781229, 5577062, 5388583, 5216314, 5060721, 4921501, 4797353, 4686364, 4586930, 4498370, 4420507, 4352848, 4294506, 4244767, 4203322, 4170172, 4145685, 4130420, 4124243, 4125814, 4133602, 4147211, 4167116, 4193497, 4226329, 4266388, 4314739, 4370630, 4430713, 4490730, 4547442, 4599157, 4645957, 4690429, 4737209, 4790467, 4851794, 4921108, 4999233, 5088727, 5191953, 5308627, 5435211, 5566527, 5698454, 5830103, 5964266, 6106133, 6261269, 6433884, 6625982, 6837808, 7069335, 7321475, 7595950, 7894522, 8219000, 8571631]
59317H571631L83096M15268M48892M84529N22102N59849N95761O29346O60659
59308A3271133O87955P07617P16415P12938O97139O69770O32361N86941N35699
59299A9217968M81555M28437L79483L34758K91866K49066K06738J65493J23884
59290B1879248P8753K7478l0438r3431j59141k25856k92761l58692m21045m76559
59280A9927556n23059n59935n87302o05521o15383o17756o12880o00675n81814
59271A4623231n57785n29811m98446m64313m28548l92391l56858l22883k91117
59262A0781079k61414k33007k05358j78588j53337j30580j11212r5177q1388o9274
59252I261744n9942n4813n3487n4169n6062n9877o5879p2761p8863q3501q6682
$$ y = [8571631, 8954727, 9369995, 9818887, 10303416, 10825518, 11385367, 11981128, 12610474, 13271133, 13959088, 14666705, 15383120, 16096058, 16793197, 17462967, 18095328, 18682269, 19217968, 19699523, 20127960, 20507443, 20842201, 21134067, 21383133, 21589871, 21755364, 21879248, 21958001, 21985479, 21955041, 21861610, 21702469, 21476613, 21183852, 20825160, 20404115, 19927556, 19404497, 18844562, 18257260, 17651739, 17036356, 16418600, 15805720, 15205045, 14623231, 14065446, 13535635, 13037189, 12572876, 12144328, 11751937, 11395079, 11072196, 10781079, 10519665, 10286658, 10081300, 9902712, 9749375, 9618795, 9507583, 9412406, 9331018, 9261744, 9201802, 9146989, 9093502, 9039333, 8983271, 8923394, 8857515, 8784754, 8705891, 8622390, 8535708]
59241H535708q8686r0329r2534r4882r5551r3324q8834q3188p6326o7565n6945
59230G607544m5080l2226j8499m573Q911K2319L6559N1814O7548Q3616J00213
59219G878146J16752J31852J45030J57483J70475J83402J94303K01905K06247
59210I385595K07331K04345J96698J84944J69756J50628J26647R8341O7592L5664
59200A0827541K484l1951o6826j01640j36664j71012k01348k24166k39025k48173
59190I409220k53246k53784k49182k40534k29790k17903k04686j90026j74577
59181G395492j59224j44165j28724j12136r4556p6979o0063m3426k6376q872Q772
59170F549743K6579M4750O3266Q2387J03210J26745J52657J79557K06518K33689
$$ y = [8535708, 8447022, 8356693, 8264159, 8169277, 8073726, 7980402, 7891568, 7808380, 7732054, 7664489, 7607544, 7562464, 7530238, 7511739, 7507166, 7516077, 7538396, 7574955, 7626769, 7694317, 7777933, 7878146, 7994898, 8126750, 8271780, 8429263, 8599738, 8783140, 8977443, 9179348, 9385595, 9592926, 9797271, 9993969, 10178913, 10348669, 10499297, 10625944, 10724285, 10791877, 10827541, 10830025, 10798074, 10731248, 10629608, 10492944, 10321932, 10120584, 9896418, 9657393, 9409220, 9155974, 8902190, 8653008, 8412474, 8182684, 7964781, 7760095, 7570069, 7395492, 7236268, 7092103, 6963379, 6851243, 6756687, 6679708, 6619645, 6576219, 6549843, 6540971, 6549743, 6576322, 6621072, 6684338, 6766725, 6869935, 6996680, 7149337, 7328894, 7535412, 7769101]
59160G769101K61731K91264L22446L54070L83318M07412M25408M37383M41946
59151A1094079M35855M16233L82111L33649K71295J96606J12938K4307o5943j54573
59141A3046557k37215l09112l67375m11747m42711m59756m62502m53138m36173
59132I466828m15002l89827l60184l28461k98827k72828k48298k23321j99143
59123F730937j77917j59477j42186j25616j10366r6100q1849o7767n4807m2895
59113E671957l1098j9326q378J430J0271J7913K4505L1543M0119M8616N4426N7686
59101E899664O0873O4655O6886O6303O4405O2470N9124N2503M3010L2207K0639
59090F492739Q398l416j3641k2668l1445l9568m5741m9620n1881n2793n1939m9266
$$ y = [7769101, 8030832, 8322096, 8644542, 8998612, 9381930, 9789342, 10214750, 10652133, 11094079, 11529934, 11946167, 12328278, 12661927, 12933222, 13129828, 13242766, 13267073, 13201130, 13046557, 12809342, 12500230, 12132855, 11721108, 11278397, 10818641, 10356139, 9903001, 9466828, 9051826, 8661999, 8301815, 7973354, 7674527, 7401699, 7153401, 6930080, 6730937, 6553020, 6393543, 6251357, 6125741, 6015375, 5919275, 5837426, 5769659, 5714852, 5671957, 5640859, 5621533, 5613155, 5614585, 5624856, 5642769, 5667274, 5698817, 5738936, 5787552, 5841978, 5899664, 5960537, 6025192, 6092078, 6158381, 6222786, 6285256, 6344380, 6396883, 6439893, 6472100, 6492739, 6501137, 6497721, 6484080, 6461412, 6429967, 6390399, 6344658, 6295038, 6243157, 6190364, 6138425, 6089159]
59078F089159m5452m1232l6855l1922k5578j7339q053P05Q447J6153K4528L3007
59066E965568M1072M9319N8338O7532P6182Q4836R4484J04922J15005J24200J32941
59055F914399J41775J50818J59772J67958J74823J80886J87349J94090J98955
59046H470825K00018J97862J94375J89888J82971J72943J61077J48807J35770
59037A0054536J20335J01416P8856N2138J9747j9292o3379j08833j52964j95794
59027I886766k37924k77423l10260l33754l48246l55434l56466l52076l43168
59018F972015l30594l15205k98519k82133k66068k48941k30442k12312j96178
59009D591623j81722j67979j55145j43869j33763j24011j14768j06633r9360r2301
$$ y = [6089159, 6043707, 6002475, 5965620, 5933698, 5908120, 5890781, 5882728, 5883433, 5891880, 5908033, 5932561, 5965568, 6006640, 6055959, 6114297, 6181829, 6258011, 6342847, 6437331, 6542253, 6657258, 6781458, 6914399, 7056174, 7206992, 7366764, 7534722, 7709545, 7890431, 8077780, 8271870, 8470825, 8670843, 8868705, 9063080, 9252968, 9435939, 9608882, 9769959, 9918766, 10054536, 10174871, 10276287, 10355143, 10407281, 10427028, 10407736, 10344357, 10235524, 10082560, 9886766, 9648842, 9371419, 9061159, 8727405, 8379159, 8023725, 7667259, 7315183, 6972015, 6641421, 6326216, 6027697, 5745564, 5479496, 5230555, 5000113, 4787801, 4591623, 4409901, 4241922, 4086777, 3942908, 3809145, 3685134, 3570366, 3463733, 3364373, 3272072]
58999C272072q5698q0234p5704p1227o6546o2123n8140n4427n1079m8245m5418
58988B573231m1980l8302l5418l3625l2174l0369k8217k5861k3111j9846j6417
58977B247911j3324j0655p968m842j479J445L739O096R004J1677J3102J3896J5776
58964B284378J8968K1568K2113K1453K1124K1101K0440J9334J9005J9750K0350
58953B509584J9508J7163J4289J1917J0313Q788O395K961q29m380p590j0275j2024
58940B565820j2913j3623j4422j4821j4641j4529j4878j5079j4507j3430j2289
58929B410688j0827q639n927l080r5K999N766P901R492J0502J0857J1353J3193
58916B454183J6073J8107J8458J8689K0322K2470K3464K3807K5626K9637L4303
$$ y = [3272072, 3186374, 3106140, 3030436, 2959209, 2892663, 2830540, 2772400, 2717973, 2666894, 2618649, 2573231, 2531251, 2492949, 2457531, 2423906, 2391732, 2361363, 2333146, 2307285, 2284174, 2264328, 2247911, 2234587, 2223932, 2215964, 2211122, 2209643, 2211088, 2214827, 2220923, 2229927, 2241604, 2254706, 2268602, 2284378, 2303346, 2324914, 2347027, 2368480, 2389604, 2410705, 2431145, 2450479, 2469484, 2489234, 2509584, 2529092, 2546255, 2560544, 2572461, 2582774, 2591562, 2597957, 2600918, 2600089, 2595709, 2588119, 2577844, 2565820, 2552907, 2539284, 2524862, 2510041, 2495400, 2480871, 2465993, 2450914, 2436407, 2422977, 2410688, 2399861, 2391222, 2385295, 2382215, 2382120, 2385119, 2390885, 2398786, 2408278, 2418780, 2429637, 2440990, 2454183, 2470256, 2488363, 2506821, 2525510, 2545832, 2568302, 2591766, 2615573, 2641199, 2670836, 2705139]
58905B705139L7992M0576M2752M4811M6345M6731M5927M4981M5267M6854M8401
58894C195776M9172N0218N2801N6549O0179O3337O6656P0602P5217Q0574Q6572
58883C907653R2671R8530J04413J10543J16761J23336J31013J39559J47516J54501
58873E126496J62365J72741J84615J96001K07044K19464K33538K47718K61204
58864G011186K74989K90082L06272L23129L41143L61234L83692M07998M33444
58855A0133169M60057M89014N21576N57225N93496O28244O61207O92764P22081
58846A5458833P47488P67709P81438P86130P78414P55462P15370O56854N79381
58837B2027079M83204L69029K38826R7618m6914j87732l20479m41776n47492o34290
$$ y = [2705139, 2743131, 2783707, 2826459, 2871270, 2917615, 2964346, 3010273, 3055254, 3100521, 3147375, 3195776, 3244948, 3295166, 3347967, 3404516, 3464695, 3528032, 3594688, 3665290, 3740507, 3821081, 3907653, 4000324, 4098854, 4203267, 4313810, 4430571, 4553907, 4684920, 4824479, 4971995, 5126496, 5288861, 5461602, 5646217, 5842218, 6049262, 6268726, 6502264, 6749982, 7011186, 7286175, 7576257, 7882529, 8205658, 8546801, 8908035, 9291727, 9699725, 10133169, 10593226, 11082240, 11603816, 12161041, 12754537, 13382781, 14043988, 14736752, 15458833, 16206321, 16974030, 17755468, 18541598, 19320012, 20075474, 20790844, 21447698, 22027079, 22510283, 22879312, 23118138, 23215756, 23168842, 22981110, 22660631, 22218855, 21671363, 21037073]
58827B1037073p01463p49688p79424p92263p92109p82517p63928p35873p00875
58818A4238933o63428o25776n87518n49173n13230m81178m51939m23921l96802
58809I545968l70795l45903l22546l01526k82824k65451k48500k31413k13706
58800F963304j95884j80071j67750j57178j45068j30839j17144j05981r6400q6544
58790E580445p5957o5061n3933m2561l1268k0278r725j50Q120J6066K5236L5840
58778E366774M6760N7289O7556P7510Q7063R7063J08420J20270J30865J40334
58768F299904J50788J63392J77270J91534K06514K22278K37885K52995K68773
58759H171333K86238L04903L23982L43957L66206L91588M19750M49345M79049
$$ y = [21037073, 20335610, 19585922, 18806498, 18014235, 17222126, 16439609, 15675681, 14939808, 14238933, 13575505, 12949729, 12362211, 11813038, 11299808, 10818630, 10366691, 9942770, 9545968, 9175173, 8829270, 8506724, 8205198, 7922374, 7656923, 7408423, 7177010, 6963304, 6767420, 6587349, 6419599, 6262421, 6117353, 5986514, 5869370, 5763389, 5666989, 5580445, 5504488, 5439427, 5385494, 5342933, 5311665, 5291387, 5281662, 5281512, 5289632, 5305698, 5330934, 5366774, 5413534, 5470823, 5538379, 5615889, 5702952, 5800015, 5908435, 6028705, 6159570, 6299904, 6450692, 6614084, 6791354, 6982888, 7189402, 7411680, 7649565, 7902560, 8171333, 8457571, 8762474, 9086456, 9430413, 9796619, 10188207, 10607957, 11057302, 11536351]
58750A1536351N09145N41551N77132O13536O47240O77095P03862P26600P41950
58741A7274462P47103P41036P22052O86424O30820N54680M59445L46994K20003
58732B2383019Q2776n9114j99503l32115m51903n56344o44342p14079p63676p93977
58722A7950742q08449q09828p98835p76876p47765p15255o80435o42982o03944
58713A1366373n65872n30777m98867m69028m40112m12164l86299l62887l40509
58704G359858l17887k96136k77310k61155k45445k29276k13777j99485j85605
58695E133782j72174j60383j49996j39034j27023j16089j07506r9655r0890q2203
58685C888829p5141o8993o2217n5160m9312m4918m1119l7616l4596l1811k9238
$$ y = [11536351, 12045496, 12587047, 13164179, 13777715, 14424955, 15102050, 15805912, 16532512, 17274462, 18021565, 18762601, 19484653, 20171077, 20801897, 21356577, 21816022, 22163016, 22383019, 22465795, 22406681, 22207178, 21875063, 21423160, 20866816, 20222474, 19508395, 18744719, 17950742, 17142293, 16332465, 15533630, 14756754, 14008989, 13293734, 12613299, 11970317, 11366373, 10800501, 10269724, 9770857, 9301829, 8861717, 8449553, 8063254, 7700367, 7359858, 7041971, 6745835, 6468525, 6207370, 5961925, 5732649, 5518872, 5319387, 5133782, 4961608, 4801225, 4651229, 4512195, 4385172, 4269083, 4161577, 4061922, 3971032, 3888829, 3813688, 3744695, 3682478, 3627318, 3578006, 3533088, 3491969, 3454353, 3419757, 3387946, 3358708]
58674C358708k7939k8849l1286l3780l5659l6844l7014l6332l6235l8125m1561
58663B975084m4822m7016m8697n0662n2978n5119n6637n7654n8751o0077o0799
58652B381872o0041n8068n5750n3208n0044m6481m3029l9440l5486l2324l1143
58641A876858l0726k8576k4558k1242k0335k0935k1791k2914k4130k4401k3636
58630A613614k3290k4020k4489k3420k1147j8321j4925j1335q568o585m244j575
58618A431695K6N80K046M987P100O642M992M244M370M465M714N181M586K239l32
58603A487535j522j833k282k369j574j191k592m922o567p582q721r252p874m996
58589A424258k195j05J678L398N248P755J0822J3332J4914J6871K0159K3818K6652
$$ y = [3358708, 3330769, 3301920, 3270634, 3236854, 3201195, 3164351, 3127337, 3091005, 3054770, 3016645, 2975084, 2930262, 2883246, 2834549, 2783887, 2730909, 2675790, 2619153, 2561499, 2502748, 2442671, 2381872, 2321831, 2263763, 2208013, 2154805, 2104761, 2058280, 2015251, 1975811, 1940325, 1908001, 1876858, 1846132, 1817556, 1792998, 1771756, 1751421, 1730486, 1708695, 1685781, 1661651, 1637250, 1613614, 1590324, 1566304, 1541815, 1518395, 1497248, 1478927, 1464002, 1452667, 1444099, 1437514, 1433270, 1431695, 1431721, 1432301, 1434347, 1439334, 1446434, 1453076, 1458068, 1462312, 1466682, 1471147, 1475861, 1481042, 1485628, 1487867, 1487535, 1486013, 1484180, 1481898, 1479529, 1477955, 1476764, 1474172, 1469250, 1462683, 1455101, 1446380, 1437128, 1429254, 1424258, 1422063, 1421958, 1423636, 1427034, 1432282, 1440037, 1450859, 1464191, 1479105, 1495976, 1516135, 1539953, 1566605]
58576A566605K9030L1570L3675L4966L6783M0340M4586M7723M9814N2287N5791
58565B023170O0088O5049P0330P5084P9315Q4508R1757J00301J08953J17599J26316
58554C002470J34733J43405J53986J66622J78942J89086J97911K06692K14528
58545D588375K19579K20888K17375K07128J89599J66409J38215J03228O1048J5557
58535F127401k8560p0000j08961j43467j70705j90168k02663k07997k06792k02500
58525D595588j97996j91692j80670j66293j52867j41708j30439j17688j04795
58516C211440r2941q1978p2086o3728n6079m8203m1367l7360l5131l2068k8093
58505B622406k5282k3781k1503j7805j4392j2572j2611j5644k2813l2270m0309
$$ y = [1566605, 1595635, 1627205, 1660880, 1695846, 1732629, 1772969, 1817555, 1865278, 1915092, 1967379, 2023170, 2083258, 2148307, 2218637, 2293721, 2373036, 2457544, 2549301, 2649602, 2758555, 2876154, 3002470, 3137203, 3280608, 3434594, 3601216, 3780158, 3969244, 4167155, 4373847, 4588375, 4807954, 5028842, 5246217, 5453345, 5642944, 5809353, 5947568, 6050796, 6111844, 6127401, 6098841, 6028841, 5919880, 5776413, 5605708, 5415540, 5212877, 5004880, 4798088, 4595588, 4397592, 4205900, 4025230, 3858937, 3706070, 3564362, 3433923, 3316235, 3211440, 3118499, 3036521, 2964435, 2900707, 2844628, 2796425, 2755058, 2717698, 2682567, 2650499, 2622406, 2597124, 2573343, 2551840, 2534035, 2519643, 2507071, 2494460, 2478816, 2456003, 2423733, 2383424]
58494B383424m5950n1310n7024o0715o0888n9171n7421n5424n2747n0415m9101
58483A783258m7684m5074m1809l8605l4971l0545k6521k4376k3993k3935k3033
58472A422712k1188j9107j7470j6111j4259j1989j0547j0522j0635r599q170p951
58460A265164q927r721r613q866p705o367n532n367m940l643k115q05Q79K750
58446A195192L186J871J091K288L484K603J083J371K774L121K768L515M950N419
58432A234716N462O698Q291Q068O366N245M709L230J332Q68J255J27k628m989
58418A278750o572q709j1149j2272j2315j2900j3732j3289j2267j2525j3168j1795
58406A138057r203q353q922p654m415k958m709o504n857m144k997j666L04J445
$$ y = [2383424, 2337474, 2286164, 2229140, 2168425, 2107537, 2048366, 1990945, 1935521, 1882774, 1832359, 1783258, 1735574, 1690500, 1648691, 1610086, 1575115, 1544570, 1518049, 1493673, 1469680, 1445745, 1422712, 1401524, 1382417, 1364947, 1348836, 1334577, 1322588, 1312041, 1301519, 1290884, 1281285, 1273115, 1265164, 1256237, 1246516, 1236903, 1228037, 1220332, 1213965, 1208433, 1203066, 1198126, 1194483, 1192368, 1191563, 1192442, 1195192, 1198378, 1200249, 1201340, 1203628, 1207112, 1209715, 1210798, 1212169, 1214943, 1218064, 1220832, 1224347, 1229297, 1234716, 1240178, 1246876, 1255167, 1263235, 1269601, 1274846, 1279555, 1282785, 1284117, 1284985, 1286240, 1286367, 1283739, 1278750, 1272178, 1263469, 1252320, 1240048, 1227733, 1214833, 1201101, 1187812, 1175545, 1163020, 1149852, 1138057, 1128854, 1120501, 1111579, 1103925, 1099510, 1096552, 1091843, 1085339, 1079482, 1075338, 1072341, 1070675, 1070979, 1072424]
58392A072424J287J639L277M480M348M469N802O900O833P035Q610J0321J0762
58379A148187J0355J0074J0207J1116J3049J4766J4646J3283J2544J2169J0207
58368A280603O529K776q80n316r121r815q401q358r854r578o955n540o963q297
58354A200830p183n059l286n02L804P098P712P568Q693J0326J1564J3455J6217
58341A271237J7564J6060J3335J1069Q644N597L232K016L20k433m254l866k605
58328A335916j676n69N11J08j110l9M051P803Q622P795P136O203M757M393N459
58313A389360N806M679M486O585Q706Q768Q080Q520R709J0960J3034J5865J7652
58300A512210J7870J8279J9471J9774J8857J8720J9758J9859J8884J9606K2435
$$ y = [1072424, 1073711, 1075350, 1078627, 1083107, 1087455, 1091924, 1097726, 1104626, 1111459, 1118494, 1127104, 1137425, 1148187, 1158542, 1168616, 1178823, 1189939, 1202988, 1217754, 1232400, 1245683, 1258227, 1270396, 1280603, 1287132, 1289908, 1289028, 1283712, 1274591, 1264776, 1256375, 1248017, 1238163, 1228585, 1221630, 1216090, 1209127, 1200830, 1193647, 1188588, 1185302, 1184800, 1188604, 1195702, 1203414, 1210982, 1219675, 1230001, 1241565, 1255020, 1271237, 1288801, 1304861, 1318196, 1329265, 1337909, 1343506, 1346738, 1348754, 1349074, 1346641, 1342387, 1338521, 1335916, 1334240, 1333671, 1334182, 1334290, 1333180, 1333141, 1337192, 1344995, 1353617, 1361412, 1368548, 1374751, 1379508, 1383901, 1389360, 1395166, 1399845, 1404331, 1410916, 1419622, 1428390, 1436470, 1444990, 1454699, 1465659, 1478693, 1494558, 1512210, 1530080, 1548359, 1567830, 1587604, 1606461, 1625181, 1644939, 1664798, 1683682, 1703288, 1725723]
58289A725723K3837K2196K0599K1354K2193K0663J7964J5600J2614R001P512Q954
58277A928210R887Q109O362P466R948J1679J3619J6578J8338J7543J6684J7887
58265B082310J9574K0364K2138K5795K8342K7887K7398K9742L2941L4212L4725
58254B385428L6444L8114L8330L8882M1179M2954M2236M0857M0460L9055L5298
58243B819237L2123L2073L3011L2350L1638L2954L4757L5265L6094L8607M0756
58232C198865M1326M3090M7832N2606N4820N6519N9725O2349O2992O4818P0071
58221C815013P5580P8359Q0851Q5896R1450R5160R9283J06101J13194J18220J23539
58210D882646J31323J38962J43994J48428J53653J56677J56152J56186J59394
$$ y = [1725723, 1749560, 1771756, 1792355, 1813709, 1835902, 1856565, 1874529, 1890129, 1902743, 1911744, 1919256, 1928210, 1938097, 1946206, 1952568, 1960034, 1969982, 1981661, 1995280, 2011858, 2030196, 2047739, 2064423, 2082310, 2101884, 2122248, 2144386, 2170181, 2198523, 2226410, 2253808, 2283550, 2316491, 2350703, 2385428, 2421872, 2459986, 2498316, 2537198, 2578377, 2621331, 2663567, 2704424, 2744884, 2783939, 2819237, 2851360, 2883433, 2916444, 2948794, 2980432, 3013386, 3048143, 3083408, 3119502, 3158109, 3198865, 3240191, 3283281, 3331113, 3383719, 3438539, 3495058, 3554783, 3617132, 3680124, 3744942, 3815013, 3890593, 3968952, 4049803, 4135699, 4227149, 4322309, 4421592, 4527693, 4640887, 4759107, 4882646, 5013969, 5152931, 5296925, 5445353, 5599006, 5755683, 5911835, 6068021, 6227415]
58201F227415J62453J63465J66916J75973J86952J96977K09645K27114K44488
58192G961398K58638K74410K95166L15603L31613L48473L71004L94323M13400
58183A0964028M33071M58985M87303N13318N41713N77709O16680O53409O93190
58174A5939406P42200P95331Q45050Q93775R45802R96230J040548J086089J140986
58165B4425417J201122J261243J328755J412014J505116J599016J697107J804399
58157C6234189J913261K017047K126191K252969K392701K538634K701817K896035
58149E5072844L117750L362911L647593L987593M374794M800835N286283N857418
58141H9508021O515316P261844Q133309R169099J0370832J1734775J3292817J5067389
$$ y = [6227415, 6389868, 6553333, 6720249, 6896222, 7083174, 7280151, 7489796, 7716910, 7961398, 8220036, 8494446, 8789612, 9105215, 9436828, 9785301, 10156305, 10550628, 10964028, 11397099, 11856084, 12343387, 12856705, 13398418, 13976127, 14592807, 15246216, 15939406, 16681606, 17476937, 18321987, 19215762, 20161564, 21157794, 22198342, 23284431, 24425417, 25626539, 26887782, 28216537, 29628551, 31133667, 32732683, 34429790, 36234189, 38147450, 40164497, 42290688, 44543657, 46936358, 49474992, 52176809, 55072844, 58190594, 61553505, 65201098, 69188691, 73563485, 78364320, 83650603, 89508021, 96023337, 103285181, 111418490, 120587589, 130958421, 142693196, 155986013, 171053402]
58133A71053402J7025932J9161369K1593571K4503517K7977706L1955931L6149876
58126C49421304L9676522M0737659L7148960K7798184J3824227j747185j5675378
58119D91184293k6001925l2344922l5295506l5761111l4615323l2537689k9961563
58112B64666254k7151225k4313995k1611295j9108533j6794712j4661743j2731014
58105A28293737j1016453r509370q201508p087470o141900n324085m608884l990293
58097G2413774l454626k973924k527567k107417j697032j267142q00075l01399
58089E7284592K21221P71345J338866J879353K352800K783297L226830L622230
58081G3480534L684956L034747J512248o14257k780901m478641n494388n886255
$$ y = [171053402, 188079334, 207240703, 228834274, 253337791, 281315497, 313271428, 349421304, 389097826, 429835485, 466984445, 494782629, 508606856, 506859671, 491184293, 465182368, 432837446, 397541940, 361780829, 327165506, 294627817, 264666254, 237515029, 213201034, 191589739, 172481206, 155686494, 141024751, 128293737, 117277284, 107767914, 99566406, 92478936, 86337036, 81012951, 76404067, 72413774, 68959148, 65985224, 63457657, 61350240, 59653208, 58386066, 57585991, 57284592, 57505813, 58277158, 59616024, 61495377, 63848177, 66631474, 69858304, 73480534, 77165490, 80200237, 81712485, 81098228, 78317327, 73838686, 68344298, 62458043]
58073F2458043n825137n484940n008840m493828l986209l506408l074328k701802
58065B8376551k378309k086233j823625j597454j404781j237280j096276r86631
58057A5765962r01768q29855p69486p25213o92675o62005o31576o05136n79214
58048I369034n46460n08415m72603m39330m02909l63733l28311k99121k74316
58039E733836k55097k43451k34808k22725k08925j99330j92481j81637j66716
58030C828666j54257j46414j39144j30842j24117j19080j12830j05668j00683
58021B695631r7572r3501q9176q7510q7266q4656q0041p6544p3516o8158o2206
58010A795485n9864o0153n8333n4095n1340n0434m7763m2774l8710l6266l2912
$$ y = [62458043, 56632906, 51147966, 46139126, 41645298, 37659089, 34152681, 31078353, 28376551, 25998242, 23912009, 22088384, 20490930, 19086149, 17848869, 16752593, 15765962, 14864194, 14034339, 13264853, 12539640, 11846965, 11184960, 10553384, 9948248, 9369034, 8822574, 8314159, 7841556, 7402226, 6999317, 6635584, 6307273, 6008152, 5733836, 5478739, 5235288, 5000480, 4777755, 4568830, 4369500, 4177019, 3995382, 3828666, 3674409, 3527995, 3388851, 3258009, 3133892, 3014812, 2901982, 2796314, 2695631, 2598059, 2504558, 2415382, 2327872, 2240606, 2155950, 2075909, 1999365, 1925849, 1857691, 1795485, 1735621, 1675468, 1617135, 1563040, 1511700, 1461266, 1413503, 1370729, 1332019, 1295753, 1262841]
57999A262841k8709k6562k6327k4562k0654j7722j7053j6751j6191j6747j7923
57988A033640j7573j6102j5825j6372j5410j3501j3393j4703j4367j2146j0814
57977H73434j0882j0111q409q225r752j0404r511r063r445q888p579p906r943
57964G53316j0778r167o994n470l530o81J891L594M873N306M373L852O039R797
57950G56421J1798J1514J1452J2506J2908J1929J1055J0892J0246Q795P816P817
57938H85149Q079Q627J0114J1713J1694R967P753N192J638k341n732q879j2120
57925I30854j3976j3425j2503j3488j4946j4102j1710j0723j1256j0900r250p997
57913G86578p137n069k100K6J717M810Q652J0671J0725J1075J2332J3199J3868
$$ y = [1262841, 1234132, 1207570, 1181243, 1156681, 1136027, 1118305, 1101252, 1084501, 1068310, 1051563, 1033640, 1016067, 999965, 984140, 967768, 952358, 938857, 925464, 910761, 896394, 884248, 873434, 862552, 852441, 844032, 835807, 826055, 815651, 806140, 797077, 787632, 778744, 771165, 763259, 753316, 742538, 733371, 726377, 720907, 717377, 716696, 718587, 722181, 727054, 732360, 736733, 740585, 746624, 756421, 768219, 779733, 791185, 803691, 816599, 828528, 839583, 850475, 860721, 869516, 877332, 885149, 893228, 901855, 911969, 923682, 935376, 945343, 953096, 958288, 959926, 957585, 951853, 942974, 930854, 916878, 903453, 890950, 877462, 862516, 848414, 836704, 825981, 814725, 803825, 794575, 786578, 779441, 774372, 772272, 772298, 774015, 778825, 787477, 798148, 808873, 819948, 832280, 845479, 859347]
57900H59347J5794J8183J8607J7099J5796J4617J1270N670M26l489p684j2533
57888I53103j6021j6974j6259j4520j1842r529q825q054m615M99L970N503P698
57875H64134J0743J1948J0939J0520J1445J0837P127K319k027p081j3349j8930
57863H98625k2873k6832l1598l5127l5746l4513l2877l0770k8190k5999k3975
57852E70125k0726j6500j3286j1444r207o205m220l667k669p22J37q82j681p99
57838D78254N25J156J894L073L446K892L238M993O113N414M314L949L553K943
57824E25757L423M763M588K301M81O15P19r82l252m689o132p991q328o190m021
57809E01062m057m829l848j504K40J014J503J726J950L324N649O727N942N904
$$ y = [859347, 875141, 893324, 911931, 929030, 944826, 959443, 970713, 976383, 976809, 973320, 965636, 953103, 937082, 920108, 903849, 889329, 877487, 867958, 859133, 851079, 846464, 846963, 850933, 856436, 864134, 874877, 886825, 897764, 908284, 919729, 930566, 937693, 940012, 937985, 930904, 917555, 898625, 875752, 848920, 817322, 782195, 746449, 711936, 679059, 648289, 620099, 594100, 570125, 549399, 532899, 519613, 508169, 498962, 492757, 488537, 484870, 482201, 481479, 481616, 480734, 479053, 478254, 478779, 479935, 481829, 484902, 488348, 491240, 494478, 499471, 505584, 510998, 515312, 519261, 522814, 525757, 529180, 533943, 538531, 540832, 541313, 541928, 542647, 541665, 538413, 533724, 527592, 519601, 511273, 505083, 501062, 497005, 492176, 488328, 486824, 487064, 488078, 489581, 491307, 493257, 496581, 502230, 508957, 514899, 520803]
57795E20803Q078R590P413L393J651K608L143J658m16j704k469l084l278l136
57781E44250l098l007k491k040k451l566m471m589l887k717j904k030k350j707
57767E03942o37p30j621j109R82J737o45m139o170p179q859j0900j1927j2061
57753D40684j2197j1989j0701r061q332q415q416p996o894m581j866j181l336
57740C45719n544m660j175J974L318L548L530L770N026P456R781J0976J2059J4584
57726D10362J8194K1259K3064K3763K3171K1287J9217J7871J6457J3724R908O032
57714F24309K193j970o041r501j2680j5588j7047j6651j6294j7737j9626j9198
57702D74169j6243j3183j1564j0582r035o826m413k212p61k83j27N35J682K855
$$ y = [520803, 528881, 538471, 545884, 549277, 550928, 553536, 556679, 558337, 557921, 556217, 553748, 550664, 547386, 544250, 541152, 538145, 535654, 533614, 531163, 527597, 523126, 518537, 514650, 511933, 510029, 507999, 505649, 503942, 503305, 502575, 500954, 499845, 500827, 502564, 501919, 497780, 491610, 484431, 475572, 464672, 452745, 440684, 428487, 416498, 405797, 396736, 388404, 379989, 371573, 363577, 356683, 352102, 350236, 349055, 345719, 340175, 335515, 334340, 336314, 339632, 343180, 346710, 350480, 355506, 362962, 372743, 383719, 395778, 410362, 428556, 449815, 472879, 496642, 519813, 541100, 560317, 578188, 594645, 608369, 618277, 624309, 626502, 624532, 618491, 608990, 596310, 580722, 563675, 547024, 530730, 512993, 493367, 474169, 457926, 444743, 433179, 422597, 413562, 406736, 402323, 400111, 399350, 399067, 398940, 399475, 401157, 404012]
57688D04012L977M868M766L456K210K363L553M417M466M214M085M172M502M738
57674D59799M330L697M175N943P300P037O245O434P234P547P680Q570R852J0540
57660E56383J1017J2466J4883J7176J8801J9776J9760J8640J7640J8200K0082
57649G44824K1867K2964K3904K5047K6296K7745K9496L1113L2277L3505L5506
57638A054544L8289M1611M5366M8970N1500N3286N5830N9182O1244O1231O1906
57627A632959O6207P3240Q0034Q6051R3171J02076J11658J21692J33277J46381
57617B646746J59522J72340J86109K00988K14977K26452K35751K42966K45781
57608D531632K41228K28966K11458J90946J66792J35544R3230L8202k7069r6115
$$ y = [404012, 407989, 412857, 417623, 421079, 423289, 425652, 429205, 433622, 438088, 442302, 446387, 450559, 455061, 459799, 464129, 467826, 472001, 477944, 485244, 492281, 498526, 504960, 512194, 519741, 527421, 535991, 545843, 556383, 567400, 579866, 594749, 611925, 630726, 650502, 670262, 688902, 706542, 724742, 744824, 766691, 789655, 813559, 838606, 864902, 892647, 922143, 953256, 985533, 1019038, 1054544, 1092833, 1134444, 1179810, 1228780, 1280280, 1333566, 1389396, 1448578, 1509822, 1571053, 1632959, 1699166, 1772406, 1852440, 1938491, 2031662, 2133738, 2245396, 2367088, 2500365, 2646746, 2806268, 2978608, 3164717, 3365705, 3580682, 3807134, 4042885, 4285851, 4531632, 4772860, 5001826, 5213284, 5404230, 5571022, 5706566, 5799796, 5837998, 5810929, 5714814]
57598E714814j60465k12646k48745k68910k75589k71477k59213k41941k22658
57589C553170k02891j83055j63794j45772j28592j11732r6336q3974p3715o3022
57579B300287n1846m2951l7246l1821k4194j5655q501k559L262Q497J2880J8336
57567B128489K6303L4756M1001M5960N2744O2079P2060Q1520R0718R9532J07764
57556B842926J16510J26522J35946J42490J47002J51738J55603J54387J45816
57547D118940J31190J11821Q6906N5765J9792j8598n6943r2209j21409j43539
57537D091716j59677j71094j78481j82516j83405j80335j73185j64193j55863
57528B542967j47896j38434j27616j17288j07817r8135q8697q1321p5972p0660
$$ y = [5714814, 5554349, 5341703, 5092958, 4824048, 4548459, 4276982, 4017769, 3775828, 3553170, 3350279, 3167224, 3003430, 2857658, 2729066, 2617334, 2520998, 2437024, 2363309, 2300287, 2248441, 2205490, 2168244, 2136423, 2112229, 2096574, 2088073, 2085514, 2088776, 2097273, 2110153, 2128489, 2154792, 2189548, 2230549, 2276509, 2329253, 2391332, 2463392, 2544912, 2635630, 2735162, 2842926, 2959436, 3085958, 3221904, 3364394, 3511396, 3663134, 3818737, 3973124, 4118940, 4250130, 4361951, 4448857, 4504622, 4524414, 4505816, 4448873, 4356664, 4235255, 4091716, 3932039, 3760945, 3582464, 3399948, 3216543, 3036208, 2863023, 2698830, 2542967, 2395071, 2256637, 2129021, 2011733, 1903916, 1805781, 1717084, 1635763, 1559791, 1489131]
57518A489131o4773n9683n5666n1163m5672m0583l6535l2557k8537k5802k4459
57507A023701k2873k0558j8906j8174j6573j3564j1273j1060j1201r687p090m911
57495H57831l141j185N21J582K840M975P221Q869J0625J3226J5954J7795J8891
57482I56004J9833K0842K2444K5452K9334L2159L3205L4056L6164L8955M1477
57471A289925M4200M7798N1769N5650O0235O6205P2854P9423Q6278R3526R9881
57460B047744J04449J08265J12521J16392J18141J17210J13638J06398R4100P6704
57450C115562N5159L0094K387k5548n0703p1625q8760j02876j13951j21313j24276
57439B504150j23045j19173j14388j08835j01570r2972q5039p8711p2615o5437
$$ y = [1489131, 1424358, 1364675, 1309009, 1257846, 1212174, 1171591, 1135056, 1102499, 1073962, 1048160, 1023701, 1000828, 980270, 961364, 943190, 926617, 913053, 901780, 890720, 879519, 869832, 862742, 857831, 854690, 853505, 854026, 855608, 858448, 863423, 870644, 879513, 890138, 903364, 919318, 937113, 956004, 975837, 996679, 1019123, 1044575, 1073909, 1106068, 1139273, 1173329, 1209493, 1248448, 1289925, 1334125, 1381923, 1433692, 1489342, 1549577, 1615782, 1688636, 1768059, 1854337, 1947863, 2047744, 2152193, 2260458, 2372979, 2489371, 2607512, 2724722, 2838360, 2944758, 3038858, 3115562, 3170721, 3200815, 3203202, 3177654, 3126951, 3055326, 2966566, 2863690, 2749739, 2628426, 2504150, 2381105, 2261932, 2147544, 2038709, 1937139, 1844167, 1759128, 1680417, 1607802, 1542365]
57429A542365n7804n0712m3759l6448k9789k4819k0678j5976j1148p541m841j368
57417A237482L333Q012J1893J5806K0669K5994L0497L3737L6706M0849M6413N2047
57405A563438N6400N9870O3973O9230P4902Q0676Q7075R3834R9448J02892J04268
57394B456006J03099R7764Q7571P3803N7487L7614J3161j4321m1596o6364q7779
57383B716445j05362j18931j28908j35455j37905j36142j31787j26768j21365
57374A573822j14786j07069r9201r1768q4549p7269p0057o3476n8385n5139n2645
57363F99478m9242m4762m0563l7285l4171l1001k8754k7467k5517k2289j9505
57352C38922j8393j7546j5512j3574j3557j4561j4524j3804j4327j5804j5869
$$ y = [1542365, 1484561, 1433849, 1390090, 1353642, 1323853, 1299034, 1278356, 1262380, 1251232, 1243691, 1238850, 1237482, 1240815, 1248827, 1260720, 1276526, 1297195, 1323189, 1353686, 1387423, 1424129, 1464978, 1511391, 1563438, 1619838, 1679708, 1743681, 1812911, 1887813, 1968489, 2055564, 2149398, 2248846, 2351738, 2456006, 2559105, 2656869, 2744440, 2818243, 2875730, 2913344, 2926505, 2912184, 2870588, 2804224, 2716445, 2611083, 2492152, 2363244, 2227789, 2089884, 1953742, 1821955, 1695187, 1573822, 1459036, 1351967, 1252766, 1160998, 1076449, 999180, 929123, 865647, 807262, 752123, 699478, 650236, 605474, 564911, 527626, 493455, 462454, 433700, 406233, 380716, 358427, 338922, 320529, 302983, 287471, 273897, 260340, 245779, 231255, 217451, 203124, 187320, 171451]
57341A71451j3817j1521j0288r131o888m208k551k451l309m089l978l002j886
57328I4332q68O61K649L631K690J147P24J042O07n53j298j639k461l306k784j146
57312I3428l08j114k456l427m414n651o325n756m173k076r6N70q41l053l756k432
57296D8120p76r0K9K68P17J796M212P154Q332O881M793M410N642O811P125P145
57280A12569P450Q019Q620R073R363R825J0712J1491J1312J0456J0275J1206J1932
57267B42303J1229R818R351J0256J1627J2931J4659J7158J9626K0824K0490J9675
57255D19947J9579K0330K1187K1715K2274K3215K4310K5296K6467K8166L0283
57244F82769L2808L6289M0929M5841N0016N3585N7012N9556N9846N7892N5207
$$ y = [171451, 157634, 146113, 135825, 126694, 119806, 115598, 113047, 110596, 107287, 103198, 99220, 96218, 94332, 93464, 94125, 96774, 100405, 103095, 104242, 104966, 106008, 106615, 106062, 104764, 103125, 100664, 97358, 94574, 93428, 93120, 92006, 89550, 86123, 81709, 76058, 69733, 63977, 59804, 57728, 57632, 58202, 57361, 54308, 50552, 48120, 47344, 47254, 47283, 47551, 48268, 50064, 54276, 61430, 69762, 76643, 81436, 85846, 91488, 98299, 105424, 112569, 120019, 128038, 136658, 145731, 155094, 164919, 175631, 187122, 198434, 208890, 219165, 230371, 242303, 253532, 263350, 272701, 282957, 294584, 307515, 322174, 339332, 358958, 379782, 400272, 419947, 439526, 459856, 481043, 502758, 525032, 548247, 572557, 597853, 624320, 652486, 682769, 715577, 751866, 792795, 838636, 888652, 942237, 999249, 1058805, 1118651, 1176543, 1231750]
57233A231750N2782N0084M6444M2381L9046L7003L6056L5887L6485L8159M1175
57222A687252M5206M9417N3373N7409O1600O4943O6386O6187O5207O3141N8695
57211B338816N1501M2828L4115K5754J7669J0336M626R70r56j723j485K35L890
57198B526576R326J6275K5141L6138M7623N6757O2348O5678O7694O7159O2949
57187C043664N6577N0392M4555L7977L1432K7117K5509K5133K5478K7774L2530
57176C428138L8582M5166N2901O1956P1082P9297Q6887R3911R9449J03353J07166
57165D267888J11930J16309J18204J17311J14855J11508J06827J00432R2711Q4552
57155E342527P7003P1001O6987O4872O4449O5552O7872P1415P6936Q4976R4193
$$ y = [1231750, 1284532, 1334616, 1381060, 1423441, 1462487, 1499490, 1535546, 1571433, 1607918, 1646077, 1687252, 1732458, 1781875, 1835248, 1892657, 1954257, 2019200, 2085586, 2151773, 2216980, 2280121, 2338816, 2390317, 2433145, 2467260, 2493014, 2510683, 2521019, 2525645, 2526615, 2525659, 2523936, 2522451, 2522686, 2526576, 2535902, 2552177, 2577318, 2613456, 2661079, 2717836, 2780184, 2845862, 2913556, 2980715, 3043664, 3100241, 3150633, 3195188, 3233165, 3264597, 3291714, 3317223, 3342356, 3367834, 3395608, 3428138, 3466720, 3511886, 3564787, 3626743, 3697825, 3777122, 3864009, 3957920, 4057369, 4160722, 4267888, 4379818, 4496127, 4614331, 4731642, 4846497, 4958005, 5064832, 5165264, 5257975, 5342527, 5419530, 5490531, 5557518, 5622390, 5686839, 5752391, 5820263, 5891678, 5968614, 6053590, 6147783]
57144F147783J01787J06107J07918J08523J07711J04494R9254R4039R0753Q9724
57134G158093R0142R1320R3091R5047R5969R4665R1392Q7714Q4619Q1674P8489
57123H142215P5994P5129P5038P3961P1572O9193O7886O7572O7939O8945P0218
57112H925662P1063P1219P0842O9763O7614O4591O1215N7531N3381M9152M5278
57101I607311M1202L6044L0100K4663K0500J7506J5697J5402J6510J8324J9979
57090I863238K0500J8979J5539J1279O374p61j1257k3912l6964n0476o5193q0310
57078I667036r4481j08140j22497j37111j51020j65565j83468k05529k30961k60588
57068H007676k96699l39736l87853m40082m97274n59724o26467o97406p73867
$$ y = [6147783, 6249570, 6355677, 6463595, 6572118, 6679829, 6784323, 6883577, 6977616, 7068369, 7158093, 7248235, 7339555, 7432646, 7527693, 7623662, 7718327, 7809719, 7897433, 7982052, 8063726, 8142215, 8218209, 8293338, 8368376, 8442337, 8513909, 8583102, 8650988, 8718560, 8786499, 8855444, 8925662, 8996725, 9067944, 9138786, 9208549, 9276163, 9340754, 9401969, 9459500, 9512881, 9562033, 9607311, 9648513, 9684557, 9714657, 9739320, 9759820, 9777326, 9793023, 9808425, 9824935, 9843259, 9863238, 9883738, 9902717, 9918256, 9929535, 9935909, 9935148, 9923891, 9899979, 9863015, 9812539, 9747346, 9667036, 9572555, 9464415, 9341918, 9204807, 9053787, 8888222, 8704754, 8499225, 8268264, 8007676, 7710977, 7371241, 6983388, 6543306, 6046032, 5486308, 4859841, 4162435, 3388568]
57059C388568q56946r47448E36928f21252j280012j412163j557186j719147j898974
57050h488734k094846k307114k539075k792983l069611l372807l710457m089827
57042c2465454m515282m991226n523209o115007o768508p487903q280778r154151
57034h5301518j0111644j1151570j2259036j3397209j4513876j5563240j6516876
57027a78814969j7340192j7943453j8152162j7753914j6638397j4945341j3057806
57020b94646234j1366636r968260q584404o802913m408018j486363J739889N119511
57012c30403428Q605245J2136970J5540523J8539948K0852040K2285488K2793163
57005b09650051K2463718K1470395K0014269J8287936J6456757J4646035J2936158
$$ y = [3388568, 2531622, 1584174, 536928, -621252, -1901264, -3313427, -4870613, -6589760, -8488734, -10583580, -12890694, -15429769, -18222752, -21292363, -24665170, -28375627, -32465454, -36980736, -41971962, -47495171, -53610178, -60378686, -67866589, -76147367, -85301518, -95413162, -106564732, -118823768, -132220977, -146734853, -162298093, -178814969, -196155161, -214098614, -232250776, -250004690, -266643087, -281588428, -294646234, -306012870, -315981130, -324565534, -331368447, -335776465, -337262828, -335522939, -330403428, -321798183, -309661213, -294120690, -275580742, -254728702, -232443214, -209650051, -187186333, -165715938, -145701669, -127413733, -110956976, -96310941, -83374783]
56998h3374783J1370276R965965Q721597P622254O650700N795360N047342M394533
56990b3806756L823455L324587K891618K517471K194948J919527J687590J492930
56982c954630J327942J187062c73227E88339Q68571P85459P10981O43005N80228
56973D176583N23253M71608M21886L71521L22372K77841K38455K03042J72145
56964G178706J46757J25094J03926Q2103N9940L6513J0684j6029m0664o2336q2012
56953G542682r9529j13622j24491j34084j44352j57249j75352j99967k29092k59379
56943E905565k89116l16944l38792l49249l45980l30623l05859k73882k37012
56934C118108j97081j54134j07852n9983j3424L0197O9250R8385J08770R3232
$$ y = [-83374783, -72004507, -62038542, -53316945, -45694691, -39043991, -33248631, -28201289, -23806756, -19983301, -16658714, -13767096, -11249625, -9054677, -7135150, -5447560, -3954630, -2626688, -1439626, -373227, 588339, 1456910, 2242369, 2953350, 3596355, 4176583, 4699836, 5171444, 5593330, 5964851, 6287223, 6565064, 6803519, 7006561, 7178706, 7325463, 7450557, 7554483, 7636586, 7696526, 7733039, 7743723, 7727694, 7687030, 7624694, 7542682, 7443153, 7329531, 7205040, 7070956, 6926604, 6769355, 6594003, 6394036, 6164944, 5905565, 5616449, 5299505, 4960713, 4611464, 4265484, 3934861, 3629002, 3355120, 3118108, 2921027, 2766893, 2659041, 2599058, 2585634, 2615831, 2685081, 2783466, 2892236, 2985468]
56924B985468N0988j0924p8712j36148j72524j88215j91228j88425j81547j70341
56914A718392j55910j40120j24250j09129r5147q1704o8159n5270m4176l4444
56904H10083k5042j6659j0676o342j576L548O958Q256R129R727P834K607l797
56891G94050r543j5280k1504k6375k8090k7365k5736k3197j9354j5202j1877q855
56879E61672n140j064K670O501J0961J5218J8228K0417K2551K3975K3523K1399
56867G20911J8326J3642O156l306j1987j7817k0629k1034j9697j7871j7108j7793
56855F11793j8622j7988j5407j1682q303o574o563o817n837l855k482k559l200
56842E01904l227k678k367k460k300j527n86O5O38J444K061J806Q72J53j55q88
$$ y = [2985468, 3036456, 3025532, 2946820, 2810672, 2638148, 2449933, 2258705, 2070280, 1888733, 1718392, 1562482, 1422362, 1298112, 1188983, 1093836, 1012132, 943973, 888703, 844527, 810083, 785041, 768382, 757706, 751364, 749788, 753336, 760294, 768550, 777679, 787406, 795240, 797847, 794050, 784507, 769227, 747723, 721348, 693258, 665893, 640157, 616960, 597606, 582404, 570527, 561672, 556532, 555468, 558138, 564639, 575600, 590818, 609046, 629463, 652014, 675989, 699512, 720911, 739237, 752879, 759035, 755729, 743742, 725925, 705296, 684262, 664565, 646694, 629586, 611793, 593171, 575183, 559776, 548094, 539791, 533217, 526654, 519837, 514000, 510145, 507663, 505104, 501904, 498677, 495999, 493632, 491172, 488872, 487345, 486759, 486824, 487462, 488906, 490967, 492773, 493645, 493798, 493643, 492755]
56826D92755k402l694l720k820k014j637j711k858n414p977q451o473l554r22
56812D39108J390L447N074O881R931J3917J7331J9881K3031K7296L0955L2753
56800F30995L4145L6964L9999L9932L5100K6692J6660O315l070j0113j4329j6334
56788H22956j6695j5353j2255p745k378L032P409J0485J3653J8597K5099L1404
56776H78209L6955M3322N1705O0625O6775O7212O0064M4619K2569j262k1242l4759
56764A274792m3034m8220n0801n0240m6798m1589l5343k8251k0858j4106q264
56753H87288k646L328R427J5324K1393K8186L5236M0761M2529L8898K9468J5268
56741A164460j496j8017l1543m0214m3907m4266m3255m1529l8615l4388k9434
$$ y = [492755, 490353, 486659, 482939, 480119, 478105, 476468, 474757, 471899, 466485, 458508, 450057, 443584, 440030, 439108, 440498, 443945, 449019, 455900, 465831, 479748, 497079, 516960, 539991, 567287, 598242, 630995, 665140, 702104, 742103, 782035, 817135, 843827, 860487, 866802, 863732, 853619, 839290, 822956, 806261, 790908, 778653, 770908, 768530, 771562, 778971, 789456, 803109, 821706, 846805, 878209, 915164, 958486, 1010191, 1070816, 1137591, 1204803, 1264867, 1309486, 1332055, 1330793, 1309551, 1274792, 1231758, 1183538, 1132737, 1082497, 1035699, 994110, 958767, 930516, 909658, 895552, 887288, 884642, 887970, 897397, 912721, 934114, 962300, 997536, 1038297, 1080826, 1119724, 1149192, 1164460, 1162964, 1144947, 1113404, 1073190, 1029283, 985017, 941762, 900233, 861618, 827230, 797796]
56730G97796k4060j8181j2609q925p212n119n72N450J0311J3223J5531J7702J7875
56717H01210J4003O231l445j2954k0931k6607k9708l0448k9400k7359k5119k2947
56705E92526k0506j7735j5381j4057j3219j1977j0467r466q953q210p153o344
56693D49058n753m770l571l124l597l896l169j801o59k52o94j494j458q7J092
56678D15825J93k048k885j537l75j303l065l550k891k575k885l142l395l923l939
56663C78505k640r35k87l60L22J696K085R09m00n92j48o7m36q12j017r21k92O86
56645C75296J313J211O93J80j17J68J393L003L689K886J625J346K334L758M787
56630D03565N148M875M052K832J462K45m60m96k20k47o80p88R5J487K068J238
$$ y = [797796, 773736, 755555, 742946, 734021, 726809, 721690, 721118, 726568, 736879, 750102, 765633, 783335, 801210, 815213, 821444, 817999, 805045, 784114, 757507, 727799, 697351, 667951, 640592, 615473, 592526, 572020, 554285, 538904, 524847, 511628, 499651, 489184, 479718, 470765, 462555, 455402, 449058, 443305, 438535, 434964, 431840, 428243, 424347, 421178, 419377, 418718, 418466, 417772, 416278, 414820, 414733, 415825, 416018, 413970, 411085, 409548, 409173, 407870, 404805, 401255, 398364, 395789, 392904, 389762, 386367, 382444, 378505, 375865, 374930, 374643, 374283, 374605, 376301, 378386, 379295, 378895, 378303, 378155, 378088, 377652, 376840, 375823, 374902, 374610, 375296, 376609, 377820, 378513, 378693, 378576, 378744, 380137, 383140, 386829, 389715, 391340, 392686, 395020, 398778, 403565, 408713, 413588, 417640, 420472, 421934, 422179, 421719, 421223, 421003, 420756, 420076, 419288, 419383, 420870, 422938, 424176]
56614D24176o8m85J95J052J439J615J832J775J327J109J486J780J387R49J163
56599D40732J067q41l977o008o044n693o329p110o766n773n375n613n721n750
56585C70799o253o994p073o031l907q58K261L787L023J604J730L476N113N706
56571C66383N879O184O185N449M233K885J503K85n14r72j237j113o25n64j455
56556C92506k458k467j861j774j966j147O70J961K037J932K370K603J977J096
56542C95479N54J2m69K85K512M086K967K78r49L04K168K830K542K301K206K032
56526D19138K135K668K701J318p16j583o98O06Q59J00o26o46P7J453L135M251
56510D34172M195L579L522L996L858K845K327L453N361O290N811M989M635M520
$$ y = [424176, 424108, 423623, 423818, 424870, 426309, 427924, 429756, 431531, 432858, 433967, 435453, 437233, 438620, 439569, 440732, 441799, 440958, 436981, 430973, 424929, 419236, 412907, 405797, 399031, 393258, 387883, 382270, 376549, 370799, 364546, 357552, 350479, 344448, 340541, 339683, 341944, 345731, 348754, 350358, 352088, 355564, 360677, 366383, 372262, 378446, 384631, 390080, 394313, 397198, 398701, 398986, 398472, 397500, 396263, 395150, 394525, 393961, 392506, 390048, 387581, 385720, 383946, 381980, 380833, 381503, 383464, 385501, 387433, 389803, 392406, 394383, 395479, 396033, 396045, 395576, 395861, 398373, 402459, 405426, 405704, 404755, 405059, 407227, 410057, 412599, 414900, 417106, 419138, 421273, 423941, 426642, 427960, 427244, 425661, 424963, 425569, 426428, 426528, 425902, 425256, 425333, 426786, 429921, 434172, 438367, 441946, 445468, 449464, 453322, 456167, 458494, 461947, 467308, 473598, 479409, 484398, 489033, 493553]
56496D93553M317M253M611N179N551N565N262M756M304M216M492M715M350L188
56482E58312J618M93L90Q91Q54l98k454m378n433n237m003k869l179m839o121
56467E23647n734m347l469l517l960m584n487o199o098n582n764o933q137q336
56453D45500p293n447l491k048j240p99q32j792l231l629k416j147j371k310k311
56438D06143j700k127l446l683k247q89q40r88jJ543K283K074J632J200P07L77
56422D00038L16J21k96k70M73J137J095J025J887L446M737N359N389M648L122
56407D32227J710J515K510L820M940N843O113N241L873L623N117O936P173N579
56393D96220L531K163J296L90l18k44M91J293K188L663N224N370L621J598J105
$$ y = [493553, 497870, 502123, 506734, 511913, 517464, 523029, 528291, 533047, 537351, 541567, 546059, 550774, 555124, 558312, 559930, 560423, 560813, 561704, 562558, 562160, 559706, 555328, 549895, 544658, 540655, 537786, 534607, 529768, 523647, 517913, 513566, 510097, 506580, 502620, 498036, 492549, 486350, 480252, 474670, 468906, 461973, 453836, 445500, 438207, 432760, 429269, 427221, 425981, 425182, 424350, 422558, 419327, 415698, 413282, 412135, 410764, 408454, 406143, 404443, 402316, 398870, 395187, 392940, 392051, 391211, 390223, 390222, 391765, 394048, 396122, 397754, 398954, 399661, 400038, 400354, 400475, 400179, 399909, 400382, 401519, 402614, 403639, 405526, 408972, 413709, 419068, 424457, 429105, 432227, 433937, 435452, 437962, 441782, 446722, 452565, 458678, 463919, 467792, 471415, 476532, 483468, 490641, 496220, 499751, 501914, 503210, 503600, 503282, 503038, 503529, 504822, 507010, 510673, 515897, 521267, 524888, 526486, 527591]
56378E27591J918K534K401K149K004J507P01K42J41m66k000l804n040n316m545
56363E20017l107k115k385l177l116k399k649m334n899n966n038m300l985l805
56349D67742l764l670k842j339n66j631l705n096n464n867o830p353o053k767
56335D10795J138L889M691M061K944J936J469J918K765K462K78k193k722j278
56321D32153K59Q90J276J787J832J403J367J687J248J13M0J706L335L325K544
56306D54965K622L476M049M240M446M274L291K203J838J778J243O13P04J372K066
56291D93180K933M060M521L594K164J529J567J575K010L608N368N361L432J414
56277E36316P17J131J996L065M092M734N150N735O347O636O935P737Q558Q372
$$ y = [527591, 529509, 532043, 534444, 536593, 538597, 540104, 540805, 541047, 541188, 540722, 538722, 534918, 529878, 524562, 520017, 516910, 514795, 512410, 509233, 506117, 503718, 501069, 496735, 490836, 484870, 479832, 475532, 471547, 467742, 463978, 460308, 457466, 456127, 455561, 453930, 450225, 445129, 439665, 433798, 426968, 419615, 413562, 410795, 411933, 415822, 420513, 424574, 427518, 429454, 430923, 432841, 435606, 438068, 438346, 436153, 433431, 432153, 432412, 433302, 434578, 436365, 438197, 439600, 440967, 442654, 443902, 444015, 444055, 445761, 449096, 452421, 454965, 457587, 461063, 465112, 469352, 473798, 478072, 481363, 483566, 485404, 487182, 488425, 489038, 489742, 491114, 493180, 496113, 500173, 504694, 508288, 510452, 511981, 513548, 515123, 517133, 520741, 526109, 531470, 534902, 536316, 537033, 538164, 540160, 543225, 547317, 552051, 557201, 562936, 569283, 575919, 582854, 590591, 599149, 607521]
56263F07521P052N483M472M404N521P415Q766Q780Q464R195J0486J0796J0171
56250G08526J0185J1208J1683J0752R798J0301J1451J1231R177O893N995O401
56238H23601O777O147M729L335K332J500P84N56R57J584K194L134M678O524Q364
56223H77196J0257J1947J2663J2281J2049J3158J5255J7150J8364J9191J9916
56212A039427K1021K3397K7229L1111L3473L4522L5793L8270M1959M6636N1719
56201A424557N5965N8802O1593O6113P1975P7121Q0871Q4866R0745R8237J05888
56190B276733J12453J17103J19473J20080J19931J19195J16830J11737J03599
56181C317134R2521P8675O2715M5983K9799J4819J182j1087k1891l1067l8536
$$ y = [607521, 614573, 620056, 624528, 628932, 634453, 641868, 650634, 659414, 667878, 677073, 687559, 698355, 708526, 718711, 729919, 741602, 752354, 762152, 772453, 783904, 795135, 804312, 811205, 817200, 823601, 830378, 836525, 841254, 844589, 846921, 848421, 849205, 849761, 850718, 852302, 854496, 857630, 862308, 868832, 877196, 887453, 899400, 912063, 924344, 936393, 949551, 964806, 981956, 1000320, 1019511, 1039427, 1060448, 1083845, 1111074, 1142185, 1175658, 1210180, 1245973, 1284243, 1326202, 1372838, 1424557, 1480522, 1539324, 1600917, 1667030, 1739005, 1816126, 1896997, 1981863, 2072608, 2170845, 2276733, 2389186, 2506289, 2625762, 2745842, 2865773, 2984968, 3101798, 3213535, 3317134, 3409655, 3488330, 3551045, 3597028, 3626827, 3641646, 3642828, 3631741, 3609850, 3578783, 3540247]
56170C540247m4571m9626n3826n6919n8822n9737n9683n8817n8297n9687o2865
56159B917397o5818o7283o8353p0447p2896p4111p4028p3715p3127p1180o7915
56148B138524o4936o3415o2850o1997o0095n7261n4267n1917n0056m7602m4073
56137A520055m0288l6900l3265k8882k4864k2498k1194j9467j7262j5694j4831
56126A244910j3523j1232q629o451n038m667n096n146m007k499j722j056Q74L755
56112A180473N894O805P705R481J1759J3967J5902J7281J8099J9264K1504K3835
56100A351969K4642K4183K4292K5685K7180K7745K7784K8017K8458K8873K9328
56089A648156K9932L0760L1952L3417L4854L6731M0354M6050N2225N7492O2716
$$ y = [3540247, 3495676, 3446050, 3392224, 3335305, 3276483, 3216746, 3157063, 3098246, 3039949, 2980262, 2917397, 2851579, 2784296, 2715943, 2645496, 2572600, 2498489, 2424461, 2350746, 2277619, 2206439, 2138524, 2073588, 2010173, 1947323, 1885326, 1825231, 1767970, 1713703, 1661786, 1611730, 1564128, 1520055, 1479767, 1442867, 1409602, 1380720, 1355856, 1333358, 1312164, 1292697, 1275435, 1259741, 1244910, 1231387, 1220155, 1211526, 1205075, 1200037, 1195370, 1190274, 1185128, 1181121, 1178622, 1176900, 1175844, 1176718, 1180473, 1186367, 1193172, 1200877, 1210358, 1222117, 1236084, 1251986, 1269267, 1287366, 1306630, 1328134, 1351969, 1376611, 1400794, 1425086, 1450771, 1477951, 1505696, 1533480, 1561497, 1589955, 1618828, 1648156, 1678088, 1708848, 1740800, 1774217, 1809071, 1845802, 1886156, 1932206, 1984431, 2041923, 2104639]
56078B104639O9458P7427Q5308R3280J02683J13738J25595J38360J53102J69901
56068C233491J87265K03214K15509K21578K19949K11546J98434J82128J64400
56059E037514J48177J35240J23662J09459R0071O4832L3904n06l2930n7882p4338
56048E577203q5427r4716j04831j17971j34647j52496j68843j83214j94973k00678
56038D139407j97509j87875j76599j64767j50461j34253j18998j04867q9763p4625
56028B739690o3075n5374m7966l9947l4661l3347l2329k8733k4446k1922k0107
56017B337783j7172j3680j0451o434j259K895M423M886O433R030J1909J5324J9156
56004B362843K2002K3272K4072K4951K5069K4549K5050K7103K9422L1583L4540
$$ y = [2104639, 2174097, 2251524, 2336832, 2430112, 2532795, 2646533, 2772128, 2910488, 3063590, 3233491, 3420756, 3623970, 3839479, 4061057, 4281006, 4492552, 4690986, 4873114, 5037514, 5185691, 5320931, 5444593, 5554052, 5644123, 5708955, 5742859, 5742353, 5709423, 5651541, 5577203, 5491776, 5397060, 5292229, 5174258, 5039611, 4887115, 4718272, 4535058, 4340085, 4139407, 3941898, 3754023, 3577424, 3412657, 3262196, 3127943, 3008945, 2904078, 2814315, 2739690, 2676615, 2621241, 2573275, 2533328, 2498667, 2465320, 2432991, 2404258, 2379812, 2357890, 2337783, 2320611, 2306931, 2296480, 2290046, 2288787, 2291682, 2296105, 2300991, 2307424, 2316454, 2328363, 2343687, 2362843, 2384845, 2408117, 2432189, 2457140, 2482209, 2506758, 2531808, 2558911, 2588333, 2619916, 2654456]
55993B654456L7930L9943M0607M2024M4710M7044M8805N1527N4758N6066N5597
55982C173467N6430N9367O1744O2664O4704O8868P2592P4784P8156Q4237R0580
55971C947593R5352J00387J07086J13472J18028J22526J28353J33869J38019J42847
55961E147532J49911J57842J65639J74700J85325J95239K03812K13882K27163
55952F821045K41743K56048K71095K86993L01652L14914L29517L46269L62976
55943I532252L79673L99670M23787M49027M74684N03909N37633N72982O09390
55934A3883007O49695O93666P37344P80241Q25406Q71131R11653R48158R89576
55925B1289877J039731J093811J150598J217009J296105J381532J468597J560037
$$ y = [2654456, 2692386, 2732329, 2772936, 2814960, 2859670, 2906714, 2955519, 3007046, 3061804, 3117870, 3173467, 3229897, 3289264, 3351008, 3413672, 3478376, 3547244, 3619836, 3694620, 3772776, 3857013, 3947593, 4042945, 4143332, 4250418, 4363890, 4481918, 4604444, 4732797, 4866666, 5004685, 5147532, 5297443, 5455285, 5620924, 5795624, 5980949, 6176188, 6380000, 6593882, 6821045, 7062788, 7318836, 7589931, 7876924, 8178576, 8493490, 8823007, 9169276, 9532252, 9911925, 10311595, 10735382, 11184409, 11659093, 12163002, 12700635, 13273617, 13883007, 14532702, 15226368, 15963712, 16743953, 17569359, 18440490, 19352143, 20300301, 21289877, 22329608, 23423419, 24574017, 25791026, 27087131, 28468663, 29937260, 31497297]
55917C1497297J656157J751503J846936J952954K075268K209716K356875K527512
55909D7874218K727311K951656L202536L493838L832343M212205M637667N131485
55901G8063259N711015O378018P143283Q036993R083018J0291467J1688990J3320420
55893A49716463J5203953J7328375J9715158K2425841K5474351K8790690L2261622
55886C10916453L5576496L7786427L7134640L1817498K1366536P392122p136214
55879D74853958j9464169k8156884l3125888l5035311l4759939l3103857l0679197
55872B60528713k7889988k5001414k2202881j9604828j7231470j5069214j3119518
55865A20409400j1395037r892966q598895p501812o585276n817158n165931m617260
$$ y = [31497297, 33153454, 34904957, 36751893, 38704847, 40780115, 42989831, 45346706, 47874218, 50601529, 53553185, 56755721, 60249559, 64081902, 68294107, 72931774, 78063259, 83774274, 90152292, 97295575, 105332568, 114415586, 124707053, 136396043, 149716463, 164920416, 182248791, 201963949, 224389790, 249864141, 278654831, 310916453, 346492949, 384279376, 421414016, 453231514, 474598050, 481990172, 474853958, 455389789, 427232905, 394107017, 359071706, 324311767, 291207910, 260528713, 232638725, 207637311, 185434430, 165829602, 148598132, 133528918, 120409400, 109014363, 99121397, 90522502, 83020690, 76435414, 70618256, 65452325, 60835065]
55857F0835065m162416l782818l458267l178517k934855k711665k498000k297688
55849C5810839k117453j954135j802439j664925j544294j434765j330611j235099
55841B2727118j152356j078561j009492r48636q99155q55380q10732p67162p28528
55832A4477116o91383o50655o08667n70566n35930n02088m70745m44418m20986
55823I581678l98004l77642l61558l46045l28156l11301k98781k87127k72420
55814F600644k58068k49473k45021k39214k30983k22582k13549k02111j89803
55805D549840j79128j69084j57988j47910j41512j37254j32164j26413j20935
55796C237452j14011j04712r6314r1550q7627q0612p1666o4230n8176n1477m4839
$$ y = [60835065, 56672649, 52889831, 49431564, 46253047, 43318192, 40606527, 38108527, 35810839, 33693386, 31739251, 29936812, 28271887, 26727593, 25292828, 23962217, 22727118, 21574762, 20496201, 19486709, 18538073, 17638918, 16783538, 15972806, 15205644, 14477116, 13785733, 13135078, 12526411, 11955845, 11419915, 10917827, 10447082, 10002664, 9581678, 9183674, 8806032, 8444474, 8098429, 7770273, 7458972, 7160191, 6873064, 6600644, 6342576, 6093103, 5848082, 5608868, 5377885, 5155303, 4941754, 4739643, 4549840, 4370712, 4201628, 4043640, 3895730, 3754218, 3616964, 3484800, 3358387, 3237452, 3123441, 3018729, 2922415, 2830865, 2743238, 2662626, 2590960, 2526730, 2468554, 2417077, 2372238]
55785B372238l9947l5944l2164l1532l6420m3774m8964n1953n5032n7221n5909
55774A883378n1887m7839m3799l8659l4070l2041l0603k6707k1746j9391j9525
55763A517111j9225j8592k0450k4800k8356k9491k9600k9602k8800k7248k6081
55752A234866k5512k5026k4875k4982k3564j9663j5770j4844j5916j5749j3709
55741A015256j1803j0829r736q116o448m532k189o73r30j698j721k324m959p879
55727I41419q407p149o671p195o998o093n997o469n813m034k599j412R01L894
55713H77377N278L962Q15l190p389j0509j1787j2433j3837j5106j4623j3088j2465
55700G73005j2755j2536j2057j3009j5484j7644j8333j7949j7064j6125j5968
$$ y = [2372238, 2332291, 2296347, 2264183, 2232651, 2196231, 2152457, 2103493, 2051540, 1996508, 1939287, 1883378, 1831491, 1783652, 1739853, 1701194, 1667124, 1635083, 1604480, 1577773, 1556027, 1536636, 1517111, 1497886, 1479294, 1458844, 1434044, 1405688, 1376197, 1346597, 1316995, 1288195, 1260947, 1234866, 1209354, 1184328, 1159453, 1134471, 1110907, 1091244, 1075474, 1060630, 1044714, 1028965, 1015256, 1003453, 992624, 982888, 974772, 968324, 963792, 961603, 960930, 960000, 958302, 956581, 954257, 949298, 941419, 933012, 925863, 919192, 911997, 904999, 898906, 892909, 886440, 880627, 876593, 873994, 872582, 873483, 877377, 882655, 886617, 887432, 884242, 876853, 866344, 854557, 842124, 828287, 813181, 798558, 785470, 773005, 760250, 747714, 735657, 722648, 707164, 689520, 671187, 653238, 636174, 620049, 604081]
55689F04081j6768j7079j5830j4389j4566j5465j4521j1144p220m552l650m406
55677D64491o131p453p559o913n891m143k201j647k328j938j6N00k016m696m697
55662D07362l836n179p675q246o960n834m543j902J08j266m220m495k123j095
55648C50096k568l417j913k8O73J168J981J994J212J191J853J441J90L67J915
55633C56155J928m61k416j942n38J83J078K840L923L260K510L523N566O733O455
55618C88797N304M039L720M984O404N545K324p48k195l107m387n048m267k823
55604C98542j410M18K692M488N686P119Q287P503N204M375O377Q926R700R483
55590D77390R877J0220R086P137O189O383O121M318J348j674l686m316m359n033
$$ y = [604081, 587313, 570234, 554404, 540015, 525449, 509984, 495463, 484319, 477099, 472547, 468897, 464491, 458360, 450907, 443348, 436435, 430544, 426401, 424200, 422553, 420225, 418287, 418271, 418771, 416755, 412059, 407362, 403526, 398347, 390672, 382426, 375466, 369632, 365089, 363187, 363295, 362029, 357809, 353314, 351191, 350096, 347528, 344111, 342198, 342170, 342843, 344011, 345992, 347986, 349198, 350389, 352242, 353683, 353873, 354240, 356155, 358083, 357622, 355206, 353264, 352726, 352909, 353987, 356827, 360750, 364010, 366520, 370043, 375609, 382342, 388797, 394101, 398140, 401860, 406844, 413248, 418793, 421117, 420369, 418174, 415067, 410680, 405632, 401365, 398542, 397132, 397550, 400242, 404730, 410416, 417535, 425822, 433325, 438529, 442904, 449281, 458207, 467907, 477390, 487267, 497487, 506573, 513710, 519899, 526282, 532403, 536721, 538069, 536395, 532709, 528393, 524034, 519001]
55576E19001o541q099r321j0294j0516r386p592o430n852n057m667o079q713j0479
55562D09975j1026j1941j3428j3782j2671j1982j2393j2146j0435r116r460r862
55550B71733q657o752n644m884l426j691n95k06p06k710n323o011m105k235k535
55535B16253l546k851p92O76R63M52j131l577m921l768j745j181j544n42K066
55520A94812M268M880M560M035L312K663K659L227L913M889O560Q443R521R458
55506B67200Q826Q563R645J2297J5016J5616J3877J1752J0296Q221M435k3m015
55493C81706q166j2868j6303j6747j5421j4772j5115j5066j4137j2667j0369p341
55481B22734n354n674o540n353k614r25q24o25L0l10j653k055r53j06k46L37K569
$$ y = [519001, 512460, 504361, 495040, 484746, 474230, 464844, 457252, 450822, 444970, 439913, 435246, 429167, 420454, 409975, 398949, 387008, 373580, 359798, 347127, 335145, 322752, 310606, 300171, 291055, 281595, 271733, 263076, 256324, 250680, 245796, 242370, 240679, 240084, 239878, 239172, 236462, 231139, 225128, 221023, 218788, 216253, 212707, 209856, 209064, 209740, 210703, 211155, 210024, 206447, 201526, 197758, 196013, 194832, 193288, 192746, 194812, 199080, 203960, 208520, 212555, 215867, 218530, 221189, 224416, 228329, 233218, 239778, 248221, 257742, 267200, 276026, 284589, 294234, 306531, 321547, 337163, 351040, 362792, 373088, 381309, 385744, 385721, 381706, 373540, 360672, 344369, 327622, 312201, 297429, 282314, 267248, 253111, 240444, 230075, 222734, 217380, 211706, 205166, 199813, 197199, 196274, 195450, 194825, 194855, 194545, 192892, 190837, 189884, 189778, 189532, 189869, 192438]
55464A92438M475M111K625K477L990N573O332O635O620N969N085M988N719N923
55450B62960M515K153M81K13N75N99L69N26Q90N31q32k393l558m695o185p657
55434B48492q844j0186j1690j2124j0642q458p513p862p748o219m316l535m174
55421A45181n345n828m827k676q09l06n53j73Q60J063m35k561l572l013k021j961
55405A13024l001l959l637k253j210j228j415o78O31J294R27J74m66j014j341
55390I5848j104m43K9j0l54p70j115j089m66L49O59L81J13K81O41O61J15o50q67
55371I2209r4J018J180Q3j003q15K40P61K17o48r91n09P72K398L253K417M90p70
55353A00208n10K59J16q94j405n40J016J898J624R31O51P85R03R10Q63M60m82
$$ y = [192438, 196913, 201024, 203649, 206126, 210116, 215689, 222021, 228656, 235276, 241245, 246330, 251318, 257037, 262960, 267475, 269628, 270109, 270322, 270897, 271496, 271865, 272391, 273281, 273812, 272980, 270587, 267029, 262334, 256149, 248492, 239648, 229462, 217772, 205648, 195006, 186548, 179035, 171173, 163425, 157206, 152890, 149355, 145181, 139836, 134008, 129181, 126505, 125696, 125390, 124837, 124664, 125524, 126587, 126152, 123591, 120019, 117006, 114985, 113024, 110023, 106064, 102427, 100174, 98964, 97736, 96321, 95643, 96274, 97568, 98495, 98669, 98203, 97189, 95848, 94744, 94301, 94330, 94320, 93966, 93196, 92081, 90992, 90526, 90875, 91534, 91915, 92028, 92309, 92950, 93611, 93726, 93076, 92209, 92115, 93133, 94313, 94396, 93393, 92578, 92818, 93579, 93796, 93148, 92157, 91648, 92420, 94818, 98071, 100488, 100978, 100208, 99698, 99957, 100073, 99179, 97774, 97234, 98250, 100148, 101772, 102703, 103354, 104139, 105042, 105952, 106815, 107275, 106793]
55336A06793j301j124j98L75K12q1k84j025k475l738m136m111m152l805k482n65
55320G7903J037J826J724R04Q0O9O66P61J21k34J18J21r04j936j964j725k256
55303G6311k755j681O60K266J945L80j118j782j540j030j180j974k135q48P84
55288F6303J149K87l98j23P38J599K033J713R23N67P47K19j612l201k914j614
55272F6416j408k466l075k403j172R5J472K328J721L70K54J858L471L600K498
55257G3559R61o05j502r32M09N29j148k771k699j726j546k152k123q30Q30J574
55241E9828R03m88j030M19L061M581L561J015r02j136k36P45J150R12L42k71r77
55224G1477j877k534k244r92M21J277J505J312Q83N31N47O60J64j058k117j989
$$ y = [106793, 105492, 104368, 104170, 104545, 104757, 104676, 104392, 103367, 100892, 97154, 93018, 88907, 84755, 80950, 78468, 77903, 78940, 80766, 82490, 83394, 83474, 83543, 84209, 84970, 85091, 84857, 84975, 85096, 84192, 82256, 80292, 78567, 76311, 73556, 71875, 72535, 74801, 76746, 77126, 76008, 74226, 72686, 71656, 70476, 68502, 66367, 65519, 66303, 67452, 67739, 67341, 67218, 67956, 69555, 71588, 73301, 74224, 74791, 75538, 75757, 74145, 70944, 68030, 66416, 65008, 62542, 59467, 57064, 55892, 55987, 57459, 59787, 61508, 61878, 62132, 63990, 67461, 71061, 73559, 74520, 73915, 72413, 71481, 71890, 72419, 71271, 68500, 65801, 64075, 62529, 60377, 58254, 57424, 58254, 59828, 60731, 60243, 59213, 59632, 62693, 67274, 70835, 71850, 70948, 69812, 69576, 70321, 71471, 72383, 72725, 72454, 71477, 69600, 67066, 64822, 63830, 64251, 65528, 67033, 68345, 69228, 69759, 70306, 70966, 71130, 70072, 67955, 65966]
55208F5966o29Q44J087j33j469j369m1P28J43k65J074L189L799K586J437J456
55192G8403J569N74r69j709j370q23q68j477j916j399J08J697K468K396J906J154
55176G9744L49N8K32l09k129l595k727j57J600J580J102J010M68r37j962j668
55160G2659r54r72j354j117k75N40J065J178N29o43j114l7J901L263L193J630
55144G9492q34k735k521l97J449J329n2q98o43qM54Q64J294J466J070M5j219j845
55126G6311j246n2N10K70J93O44Q03J92m45m55k50j76K97J364J949J163k79j085
55108G9708j084q30l84L28P15L12k75l25l32j107k081j961p55K04J97j86m28r28
55090G0788k019l027k906j503J33O67k49j531j777q29L02J022J725K466K237N39
$$ y = [65966, 65337, 66181, 67268, 67135, 65666, 64297, 64256, 64984, 65127, 64862, 65936, 69125, 72924, 75510, 76947, 78403, 79972, 80546, 79577, 77868, 76498, 75675, 74807, 73330, 71414, 70015, 70123, 71820, 74288, 76684, 78590, 79744, 80093, 80151, 80383, 80074, 77945, 74350, 71623, 71466, 73066, 74646, 75748, 76758, 77226, 76289, 74327, 72659, 71705, 70733, 69379, 68262, 67987, 68527, 69592, 70770, 71299, 70656, 69542, 69505, 71406, 74669, 77862, 79492, 78658, 75923, 73402, 73005, 74454, 75783, 75731, 74833, 74190, 74182, 74636, 75500, 76794, 78260, 79330, 79375, 78156, 76311, 75065, 75013, 75523, 75793, 75986, 76630, 77433, 77625, 77180, 76725, 76475, 76299, 76596, 77960, 79909, 81072, 80793, 79708, 78624, 77794, 77410, 77738, 78453, 78765, 78490, 78165, 77833, 76726, 74645, 72684, 71929, 72133, 72330, 72144, 71716, 70788, 68769, 65742, 62836, 61333, 61466, 62133, 61884, 60353, 58576, 57747, 58049, 59071, 60796, 63262, 65499, 66038]
55074F6038j238j228N59K387L033K755K242J653R03J30l97m04K54J306K091K320
55058H2404K549L476M948O140O307N120K683j90k232k851k685k485k053r07M83
55043A00707R53Jj712k916k501l27K177K932J384q12j921k084k245k165j009P43
55027I1205J621J298R10J157J470J286Q98P44Q75J384K250K561J157j433k961
55012A04422k142k98N60L70N01J310J675R58O5L0M83L16n90j183p63O4K72k45
54994A05805p46p24l20L14J346K661L514L183J844L99m28o34p55j230j870j925
54978A10434r43N30J520J921K570L789M581L787J716j8j89Q88J833J591L69p10
54962A33669q66l96K6K95N93M98o80k648m091m071k745p09J449K876K933K180
$$ y = [66038, 64800, 63572, 64131, 66518, 69551, 72306, 74548, 76201, 77104, 77234, 76837, 76433, 76687, 77993, 80084, 82404, 84953, 88429, 93377, 99517, 105824, 110944, 113627, 113437, 111205, 108354, 105669, 103184, 101131, 100224, 100707, 101660, 101661, 99949, 97033, 94532, 94205, 96382, 99314, 100698, 99886, 97965, 95881, 93636, 91471, 90462, 91205, 92826, 94124, 95034, 96191, 97661, 98947, 99845, 100589, 101464, 102848, 105098, 107659, 108816, 107383, 104422, 102280, 101982, 102542, 102912, 103413, 104723, 106398, 107356, 107421, 107451, 107934, 108250, 107660, 106477, 105714, 105778, 106050, 105805, 105059, 104335, 104015, 104329, 105675, 108336, 111850, 115033, 116877, 117276, 116848, 116214, 115459, 114229, 112359, 110434, 109491, 110021, 111541, 113462, 116032, 119821, 124402, 128189, 129905, 129887, 129698, 130586, 132419, 134010, 134379, 133669, 132803, 132407, 132433, 132728, 133321, 133819, 133139, 130491, 126400, 122329, 119584, 118875, 120324, 123200, 126133, 128313]
54946A28313J813J906J408K06l99J87P17J50p28q54o61q74r22j72M20k48j234
54929A29028q40N45J078M54J23N25M45n08r11J96J672J970J210O14P04R30N09
54912A37744p63k156k426j119O17J360J264J501K205K459K225K566L650M237L770
54897A57134L342L670L767K782J760K079L150L400K950L607O180R186J0589R964
54883B23560Q541P746Q029Q856R597J0322J1475J2795J3127J1616Q701N525K672
54870C42562p2l040o234r467j2507j5044j6715j7201j6317j4190j1420q844p091
54857B04420o344o265n967m555k219l95q3l79K73J728K352J631J037J741K973
54842A89948L589M024N397P524R214J0063J0690J1361J1636J1396J1073J0685
$$ y = [128313, 130126, 132032, 133440, 133646, 133247, 133434, 134151, 134301, 133573, 132719, 132058, 131184, 130262, 130090, 130510, 130262, 129028, 128188, 128733, 129811, 130265, 130388, 130913, 131358, 130850, 129939, 130135, 131807, 133777, 134987, 135601, 136305, 137235, 137744, 136981, 134825, 132399, 131280, 131897, 133257, 134521, 136022, 138227, 140686, 142911, 145477, 149127, 153364, 157134, 160476, 164146, 167913, 170695, 172455, 174534, 177684, 181084, 184034, 187641, 193821, 203007, 213596, 223560, 232101, 239847, 247876, 256732, 266329, 276651, 288126, 300921, 314048, 325664, 334365, 339890, 342562, 342490, 339450, 333216, 323749, 311242, 296198, 279483, 262282, 245965, 231775, 220355, 211511, 204420, 198076, 191811, 185844, 181289, 179070, 178675, 178592, 178213, 178486, 180214, 182566, 184197, 185234, 186975, 189948, 193537, 197561, 202958, 210482, 219696, 229759, 240449, 251810, 263446, 274842, 285915, 296600]
54830B96600R574P400M585J444k387o968j1101j3100j2613j1132j0521j1233j2236
54817B28312j2455j1852j0908r549p380m803l058k802l307l549l483l535l323
54804A48308j933M80K356K448J336O32R26J152P5k050l675l696k603j723j679
54789A40354j876j416j03J429K333K172J180M9p48j367k244l369m230m472m307
54774A23385m079l759k984j550K51J651J954J259N23O09J362J904J674P42o87
54759A22255k362l552l352j759N5Q89N44l38r21n00J134L190M282L803K558J717
54743A27643J630K019K644L235L285K732K457L394N255O837P375P084O576O482
54729A88648P412R378J1373J2315J2570J3592J5832J7854J8018J6312J3879J1369
$$ y = [296600, 306174, 313574, 318159, 319603, 317216, 310248, 299147, 286047, 273434, 262302, 251781, 240548, 228312, 215857, 204005, 193097, 183548, 176168, 171365, 168307, 165505, 162198, 158649, 155166, 151631, 148308, 146375, 146855, 149211, 151659, 152995, 153627, 154553, 155705, 155780, 153730, 150055, 146359, 143756, 142033, 140354, 138478, 137062, 136959, 138388, 140721, 142893, 144073, 144122, 143374, 142007, 139763, 136394, 132164, 127692, 123385, 119306, 115547, 112563, 111013, 111264, 112915, 114869, 116128, 116651, 117260, 118622, 120526, 122200, 122942, 122255, 119893, 116341, 112989, 111230, 111285, 112174, 112718, 112380, 111459, 110959, 112093, 115283, 119565, 123368, 125926, 127643, 129273, 131292, 133936, 137171, 140456, 143188, 145645, 149039, 154294, 161131, 168506, 175590, 182166, 188648, 196060, 205438, 216811, 229126, 241696, 255288, 271120, 288974, 306992, 323304, 337183, 348552]
54717C48552Q540N177J573j893n082p729r284r385q418p415p316q220r201r040
54703B80859p325m754k274j44J874L662M678M820M803N339O334P277Q060Q951
54689C22160R886J0454J0587J0684J0759R997P860N255L833L999M344L524K032
54676D15374J328J489Q23j953o076r962j3238j6472j9273k0150j8661j6417j5224
54663B81588j5009j4494j3170j1521r768p715n785m983n421n955n624m695l843
54650A73605l153k509k111j924j264J86J418J188j21p60O6J022L83j509k320m97
54634A61700K550L755J923q33j683l56J123J426J130Q94K37j072j775o49J562
54619A69932K985K939K302J955K020K407L089L798M282M716N219N232M347L438
$$ y = [348552, 357092, 362269, 363842, 361949, 356867, 349138, 339854, 330469, 322051, 314636, 307320, 299100, 289899, 280859, 273534, 268780, 266506, 266362, 268236, 271898, 276576, 281396, 286199, 291538, 297872, 305149, 313209, 322160, 332046, 342500, 353087, 363771, 374530, 384527, 392387, 397642, 401475, 405474, 409818, 413342, 415374, 416702, 418191, 419014, 417061, 410985, 401023, 387785, 371313, 352040, 331890, 313229, 296812, 281588, 266579, 252085, 238915, 227394, 217626, 209911, 204126, 199143, 193722, 187767, 182143, 177448, 173605, 170452, 167943, 165832, 163908, 162644, 162830, 164248, 165436, 165315, 164555, 164621, 165643, 166026, 164517, 162197, 161700, 164250, 168005, 169928, 169095, 167412, 167056, 168179, 169605, 170735, 171629, 171866, 170794, 169019, 168370, 169932, 172917, 175856, 178158, 180113, 182133, 184540, 187629, 191427, 195709, 200425, 205644, 210876, 215223, 218661]
54605B18661L851N429O532O123M895L999L691L647L795M102M132L505K645K539
54591B77546L651N345O543P001P619R141J0861J1475J1304J2301J5212J7974J8127
54578D14100J5864J3227J1064Q547N302K032j134m976r391j2877j4589j5566j7048
54565C94555j8625j8843j6988j3699j0449q749r043j0014r780p955n625l519j571
54552B59695l65j060l166m255l097j500j615k845l087j990j095j348k333l503
54538B28436m518m583l143j283r03k336m091m963n016m443l049j386r26k254m129
54523A81413n106n129m771l881k185m80Lo84j260j022n70n32n60j63K33j57j117
54506A54032j495o58P09J513J451J089J072J540K030J779M79j094j652q38N09
$$ y = [218661, 222512, 227941, 234473, 240596, 245491, 249490, 253181, 256828, 260623, 264725, 268857, 272362, 275007, 277546, 281197, 286542, 293085, 300086, 307705, 316846, 327707, 339182, 350486, 362787, 377999, 395973, 414100, 429964, 443191, 454255, 462802, 468104, 470136, 469002, 464026, 454635, 441758, 427169, 411603, 394555, 375930, 357087, 340099, 326400, 315951, 307202, 298159, 288145, 278365, 270410, 264785, 261266, 259695, 259330, 258270, 255104, 250849, 247752, 246252, 244637, 241792, 238705, 236715, 235620, 234272, 231939, 228436, 223918, 219335, 216192, 214909, 214006, 211670, 207579, 202616, 197600, 193157, 190108, 188722, 187796, 185542, 181413, 176307, 171178, 166407, 162526, 160341, 159861, 159864, 159180, 157920, 156898, 156328, 155796, 155236, 155073, 155306, 155149, 154032, 152537, 151879, 152588, 154101, 155552, 156641, 157713, 159253, 161283, 163062, 163541, 162447, 160795, 159957, 160466]
54491A60466J791L477N687O913N536K383K32O47K480L880M427M694M776M358L698
54476B15445L612M482N760O511O375O050O619Q032Q754P592N338L502J951o24
54462B89399l956n884n291l622k631k315k195k947n126p441q074p072n958n533
54448B21354n485n606n881n631m048j554N29J492J502P52m67j250r42k66l70r98
54432A93131r57j71K52JOO66J121Q02M59R24J786J954R44p16j867j475K66J772
54414A98898J831J270J749L157L750K858J680J050L35n79j58K406N185N670L969
54399B33071K160J093j76j938k867j999k54Q70J086J001O92l41k058l571m162
54384B22607m047l819l466k506j003O7j30j243k197k488k424k183j461k61P09
$$ y = [160466, 162257, 165734, 171421, 178334, 183870, 186253, 186485, 187132, 189612, 193492, 197919, 202613, 207389, 211747, 215445, 219057, 223539, 229299, 235810, 242185, 248235, 254854, 262886, 271640, 279232, 284570, 288072, 290023, 289399, 285443, 279559, 274268, 270646, 268015, 265700, 263505, 260558, 255432, 247991, 239917, 232845, 226887, 221354, 215869, 210263, 204382, 198751, 194703, 193149, 193678, 195170, 196672, 197424, 196957, 195707, 194765, 194499, 194129, 193131, 192174, 192003, 192255, 192256, 192262, 192928, 194049, 194851, 195310, 196234, 198020, 199974, 200918, 200202, 198335, 196860, 197126, 198898, 200729, 201999, 203748, 206905, 210655, 213513, 215193, 216243, 216578, 215999, 215841, 218247, 223432, 229102, 233071, 235231, 236324, 236148, 234210, 231343, 229344, 229090, 229960, 231046, 232047, 232739, 232398, 230340, 226769, 222607, 218560, 214741, 211275, 208769, 207766, 207833, 207703, 206460, 204263, 201775, 199351, 197168, 195707, 195446, 196155]
54369A96155R63R77J382J819J369J6j185j498j375j495j504n04J396K739K380
54354B01635R79K80J069K460L213L091K632K211K013K510M090O142P220O512M778
54339B50835L484L246L445L280K797K606K815K718J815P04M21R45J128K68r40
54324B79567j495j453j585k075k346k140j958k371l406m653n571n638m688l229
54310B36959k196k212l127m128m197k844o59J073J618J370R69M57l11r64j099
54295B20709r93j000o48O52K232K648J568K26j96L22J263K389L423L830L519L210
54279B43154L623M664N661N990N195L142L75k078l734n014o296p131o918n949
54265B34684n224n374o094o593o319n364m318l668l284k768k202k135k705l271
$$ y = [196155, 197118, 198095, 199477, 201296, 202665, 202681, 201496, 199998, 198623, 197128, 195624, 195120, 196516, 199255, 201635, 202614, 202894, 203963, 206423, 209636, 212727, 215359, 217570, 219583, 222093, 226183, 232325, 239545, 246057, 250835, 254319, 257565, 261010, 264290, 267087, 269693, 272508, 275226, 277041, 277745, 278166, 279111, 280239, 280507, 279567, 278072, 276619, 275034, 272959, 270613, 268473, 266515, 264144, 260738, 256085, 250514, 244876, 240188, 236959, 234763, 232551, 229424, 225296, 221099, 218255, 217596, 218669, 220287, 221657, 222626, 223083, 222772, 221808, 220709, 219716, 218716, 218068, 218720, 220952, 223600, 225168, 225394, 225198, 225520, 226783, 229172, 232595, 236425, 239944, 243154, 246777, 251441, 257102, 263092, 268287, 271429, 271804, 269726, 265992, 260978, 254682, 247551, 240633, 234684, 229460, 224086, 217992, 211399, 205080, 199716, 195398, 191730, 188446, 185678, 183476, 181341, 178636, 175365]
54251A75365l209k737k610l143l860l926k917j342l83q09k112l053l094k797k742
54236A36631k683k126j171k54M71Q94M29j412l846n043m089k210j388j896k027
54221A10280m81J730K463J135o75j264n81L10P53R58J373K058K482J788j69j992
54205A20168j753P19L307L936K636P99p16j701j825j052l22n14j010o35L44N46
54189A22927k10n58K47J211J216M72j96n48p00m72K75J138J512J175L32o14j191
54172A26016j255j121r19j32J503L018L124J892N19m37j328k001j645l78M59J20
54156A27435n68o25l10m47j280k503l623l823k447l9J851K282J669Q11J81K28
54140A18792J110J889J290m33j705j895j834j805j036K20K95j137k005j014K08
$$ y = [175365, 172156, 169419, 166809, 163666, 159806, 155880, 152963, 151621, 151238, 150429, 148317, 145264, 142170, 139373, 136631, 133948, 131822, 130651, 130397, 130868, 131762, 132191, 130779, 126933, 121890, 117801, 115591, 114203, 112307, 110280, 109799, 111529, 113992, 115127, 114452, 113188, 112607, 112917, 113670, 114628, 116001, 118059, 120541, 122329, 122160, 120168, 118415, 119134, 122441, 126377, 129013, 129812, 129096, 127395, 125570, 124518, 124196, 123682, 122672, 122037, 122381, 122927, 122717, 122159, 122406, 123617, 124833, 125305, 125109, 124561, 123861, 123389, 123664, 124802, 126314, 127489, 127821, 127207, 126016, 124761, 123640, 122721, 122589, 124092, 127110, 130234, 132126, 132645, 132208, 130880, 128879, 127234, 126856, 127315, 127435, 126867, 126242, 125932, 125485, 124205, 121702, 118079, 114256, 111809, 111770, 113621, 115903, 117572, 118383, 118564, 118792, 119902, 121791, 123081, 122648, 120943, 119048, 117214, 115409, 114373, 114593, 114888, 113751, 111746, 110732, 110940]
54125A10940j16r54n42K80n24k452k962j351M79J068R32P65K68p18j594k061k466
54108I8992k684j920p4J823K842K966K532J804J139P19J56p98j489j332j043j601
54092A02032k354j813j55Q13L44k64J90J261J938J942J420O06K66J212K836L306
54076A13580J817m41k032k698k562j416L75J503J411J327K502M189M554K959L34
54061A25402k171l925m584m094k865j376J76J503J968J247j05j194j505q76M65
54046A08066J525J136m61j501r66o9m73j860k551j935q24L36J962L924M980M240
54030A15529K332O64P5N22J372J706R49m05j170q50j61K7k61m58l14Q1N96R42
54012A21176O58k06p54k65P11J059P20P82J827L049L388K757J749P17q9j82O53
$$ y = [110940, 110824, 109870, 109328, 109608, 109084, 106632, 103670, 102319, 102798, 103866, 104798, 105563, 105831, 105113, 103519, 101458, 98992, 96308, 94388, 94314, 96137, 98979, 101945, 104477, 106281, 107420, 108139, 108295, 107497, 106008, 104676, 103633, 102032, 99678, 97865, 97710, 98523, 98867, 98603, 98793, 100054, 101992, 103934, 105354, 105960, 106226, 107438, 110274, 113580, 115397, 114956, 112924, 110226, 107664, 106248, 106623, 108126, 109537, 110864, 113366, 117555, 122109, 125068, 125402, 123231, 119306, 114722, 110628, 107763, 106387, 106563, 108066, 110034, 111281, 111176, 109982, 108477, 107601, 108066, 109591, 110727, 110266, 108765, 107799, 107730, 107257, 105397, 102846, 100911, 100087, 100423, 102385, 106309, 111289, 115529, 117861, 118525, 118600, 119122, 120494, 122200, 123149, 122744, 121574, 120724, 120563, 120590, 120329, 119871, 119557, 119638, 120234, 121176, 121834, 121628, 120874, 120609, 121320, 122379, 123099, 123881, 125708, 128757, 132145, 134902, 136651, 137368, 137279, 137097, 137750]
53995A37750J771K317K290K201K077J668J350J631J896R75q36j725r24J65J78
53980A52784j14P79K632L908M027L739L623L593L779M537N528N985O010O484P581
53965B14875Q439Q514Q189P771O883N364L907L321L776M977O417P254O782N309
53951C01778L885K963K093J117N48M39n0j315k493k719k397k428k861l226l571
53936B91763m178m739m755m612n208o473p133o265m517l370l407l725l197k030
53922B28154j563k414l484l480k812k924l910m215k961j198k37J36Q12J676J885
53907B03465J160n4j286k064j771m36Q31J125J032J544K245J884N19l17J62J006
53891B09045J202J098J396J809J719J539K268L784M576L570J647Q29K199M955
$$ y = [137750, 139521, 141838, 144128, 146329, 148406, 150074, 151424, 153055, 154951, 155926, 155090, 153365, 152441, 152606, 152784, 152670, 153449, 156081, 159989, 164016, 167755, 171378, 174971, 178750, 183287, 188815, 194800, 200810, 207294, 214875, 223314, 231828, 240017, 247788, 254671, 260035, 263942, 267263, 271039, 276016, 282433, 289687, 296469, 301778, 305663, 308626, 310719, 311836, 312384, 312823, 312773, 311458, 308965, 306246, 303849, 301421, 298560, 295334, 291763, 287585, 282846, 278091, 273479, 268271, 261798, 254665, 248400, 243883, 240513, 237106, 233381, 230184, 228154, 226591, 224177, 220693, 217213, 214401, 211477, 207567, 203352, 200391, 199193, 198956, 199092, 199904, 201580, 203465, 204625, 204571, 203285, 201221, 199450, 199014, 199845, 200970, 202002, 203546, 205791, 207675, 208194, 207877, 208039, 209045, 210247, 211345, 212741, 214550, 216269, 217808, 220076, 223860, 228436, 232006, 233653, 234482, 236681, 241636]
53877B41636P460Q763Q983Q652Q197P844P452O478M700L028K728L534L510J560
53863C24525p47j000Q55K464K183R79P25J753K974L668M114M659N150N503O027
53848C63832O726O920O171N345N846P619Q894Q448P424P817R540J0185P998L950
53834D66715M35j160j024j36J98j214m191o730o992n582m812n776p350q198q459
53819D05724q833r067q344o746n449n487o832q600r761r775q851p659o705o063
53805B97552n691n688o000o240o100n830n909o264o110m738k450o36o55k449m374
53790B28418m761l652k606k651l051k542j256n89j216k130k120j428j228j749
53776A97439k034j546j030j222j561j076J9O91P91J159J909J921O54o46m99P93
$$ y = [241636, 249096, 257859, 266842, 275494, 283691, 291535, 298987, 305465, 310165, 313193, 315921, 319455, 322965, 324525, 323778, 322778, 323633, 326097, 328280, 329259, 329984, 331737, 334711, 338379, 342493, 347152, 352302, 357805, 363832, 370558, 377478, 383649, 388994, 394840, 402459, 411353, 419801, 427225, 435042, 444582, 454767, 462765, 466715, 467150, 465990, 464966, 464830, 465028, 463814, 459623, 452893, 445901, 440319, 435507, 429731, 422381, 414183, 405724, 396891, 387824, 379480, 372734, 367285, 361798, 354966, 346366, 336605, 326830, 317979, 310320, 303615, 297552, 291861, 286173, 280173, 273933, 267833, 262003, 256094, 249830, 243720, 238982, 236532, 235896, 235241, 232792, 228418, 223657, 220005, 217399, 214748, 211697, 209155, 207899, 207310, 206094, 203964, 201844, 200416, 199188, 197439, 195405, 193859, 192829, 191607, 190046, 188970, 188989, 189680, 190471, 191630, 193539, 195460, 196114, 195468, 194969, 195762]
53760A95762J717J574R25L11k51n43n2J059J765J411N78L35J082K374L477L931
53744B15455L965M404N643O826O769N745N361O336P487P571P190P696Q923R262
53730C08633P854N562L667K560J972J640J323P82J23j76J95J116K348L549L892
53715C45040K469l93k924l671l097k699k891k611j161M59O01r82k754l111k159
53700C20116j506k373m241n541n433m432l400k562j808j356j569k301k894k911
53686B77789k549k410k898l714l906k917j531j136j732j763o32j45j958m484m370
53671B41644j042K353L050J751O47J90o18j979l061l377k930j501P65K533K442
53656B40867P90j108k782m369n019l504m04K163L328M166N232N397M133L077L842
$$ y = [195762, 197479, 199053, 199978, 200289, 200038, 199495, 199443, 200502, 202267, 203678, 204256, 204591, 205673, 208047, 211524, 215455, 219420, 223824, 229467, 236293, 243062, 248807, 254168, 260504, 267991, 275562, 282752, 290448, 299371, 308633, 316487, 322049, 325716, 328276, 330248, 331888, 333211, 333993, 334116, 333940, 334135, 335251, 337599, 341148, 345040, 347509, 347116, 344192, 340521, 337424, 334725, 331834, 329223, 328062, 328521, 329122, 328140, 325386, 322275, 320116, 318610, 316237, 311996, 306455, 301022, 296590, 293190, 290628, 288820, 287464, 285895, 283594, 280700, 277789, 275240, 272830, 269932, 266218, 262312, 259395, 257864, 256728, 254996, 253233, 252601, 252456, 250498, 246014, 241644, 240602, 242955, 246005, 247756, 248403, 248593, 247975, 245996, 242935, 239558, 236628, 235127, 235892, 238425, 240867, 241657, 240549, 237767, 233398, 228379, 224875, 224471, 226634, 229962, 234128, 239360, 244757, 248890, 251967, 255809]
53641B55809N501N848M269J961k4j394j718n21J609L249L685L459L313L478L901
53626B92425M446M701M381L986M283N088N321M508L506L267L509L235K218J332
53612C46206J290J603J300M72M25J851L463L390J767P14J378K337J796L05j19
53597C68178J017K122J935J054O31O89M47m01j408k039k074j621r53k71M32J084
53581C68822J206M47p23j364j218p82k40Q68K510L615L321K302K045L083M638
53566C88530N763O064N323L387Q37q38n12J220K545K435J728J928L278M557M759
53551D31004M366M604N821P170P685P217O258N390N053N403O112O490O213N829
53537E14615O187P409Q669R141Q903Q633Q569Q258P461O762O803P243P207O668
$$ y = [255809, 261310, 267158, 271427, 273388, 273364, 271970, 270252, 269731, 271340, 274589, 278274, 281733, 285046, 288524, 292425, 296871, 301572, 305953, 309939, 314222, 319310, 324631, 329139, 332645, 335912, 339421, 342656, 344874, 346206, 347496, 349099, 350399, 350871, 351296, 353147, 356610, 360000, 361767, 362481, 363859, 366196, 367992, 368297, 368178, 369195, 371317, 373252, 374306, 374937, 375626, 376073, 375672, 374264, 372225, 370151, 368530, 367577, 367306, 367738, 368822, 370028, 370475, 369752, 368388, 367170, 366388, 366148, 367016, 369526, 373141, 376462, 378764, 380809, 383892, 388530, 394293, 400357, 405680, 409067, 409904, 409066, 408554, 409774, 412319, 414754, 416482, 418410, 421688, 426245, 431004, 435370, 439974, 445795, 452965, 460650, 467867, 474125, 479515, 484568, 489971, 496083, 502573, 508786, 514615, 520802, 528211, 536880, 546021, 554924, 563557, 572126, 580384, 587845, 594607, 601410, 608653, 615860, 622528]
53523F22528O506O959O926N432L174J734J534J585J148P26J099K122K956L097
53509F67526K686K039J332O75J98l9r8j5K46O55Q74M27o87j672j642o97J18O4
53491F71990m99p22j65J157K915M162L684J483n35m30J507L368M211M687N212
53476G02025N067L976L213M106O248Q207R368J0057J0454J0504J0651J1517J2862
53463H08255J3795J4136J4677J5924J7420J8590J9438K0029K0093J9751K0010
53452A002118K1752K4560K7257K9388L1343L3182L4176L3940L3281L3495L5046
53441A339538L7328L9412M0712M1224M1501M2292M3823M5443M6251M5985M5136
53430A808645M4310M3828M3774M3957M3893M3176M2007M1087M0971M1750M3227
$$ y = [622528, 629034, 635993, 642919, 648351, 651525, 653259, 654793, 656378, 657526, 658252, 659351, 661473, 664429, 667526, 670212, 672251, 673583, 674258, 674456, 674417, 674319, 674304, 674550, 675205, 676079, 676506, 675819, 674147, 672505, 671808, 671926, 671990, 671491, 670769, 670604, 671761, 674676, 678838, 682522, 684005, 683470, 683040, 684547, 687915, 692126, 696813, 702025, 707092, 711068, 714281, 718387, 724635, 732842, 742210, 752267, 762721, 773225, 783876, 795393, 808255, 822050, 836186, 850863, 866787, 884207, 902797, 922235, 942264, 962357, 982108, 1002118, 1023870, 1048430, 1075687, 1105075, 1136418, 1169600, 1203776, 1237716, 1270997, 1304492, 1339538, 1376866, 1416278, 1456990, 1498214, 1539715, 1582007, 1625830, 1671273, 1717524, 1763509, 1808645, 1852955, 1896783, 1940557, 1984514, 2028407, 2071583, 2113590, 2154677, 2195648, 2237398, 2280625]
53419B280625M4871M5788M5310M3780M2207M1027L9830L8408L7282L6731L5893
53408B731752L3619K9914K6048K3296K1854K0849J9151J6467J3679J1715J0126
53397B958470P674M498K437K336K173p05o056j1002j3688j5153j7367k0836k4718
53384B868063k8100l0360l1142l0927l1177l3033l5893l7960l8136l7143l6690
53373B497502l7758l9710m0999m0680l9042l6805l4317l1885l0210k9451k8354
53362B108291k5518k1548j8649j7660j6721j3645q561l372O45L639O129Q367J0640
53349B012037J3381J6733K0438K4117K7332K9694L1394L3434L6718M1121M5840
53338B332239N0296N4138N6815N8116N8987O0852O3949O7143O9580P1637P4032
$$ y = [2280625, 2325496, 2371284, 2416594, 2460374, 2502581, 2543608, 2583438, 2621846, 2659128, 2695859, 2731752, 2765371, 2795285, 2821333, 2844629, 2866483, 2887332, 2906483, 2922950, 2936629, 2948344, 2958470, 2966144, 2970642, 2973079, 2975415, 2977588, 2976883, 2970827, 2959825, 2946137, 2930984, 2913617, 2892781, 2868063, 2839963, 2809603, 2778461, 2747534, 2716357, 2683324, 2647431, 2609471, 2571335, 2534192, 2497502, 2459744, 2420034, 2379035, 2338355, 2299313, 2262508, 2228191, 2196306, 2166096, 2136645, 2108291, 2082773, 2061225, 2042576, 2024916, 2008195, 1994550, 1985989, 1982617, 1983262, 1986901, 1993030, 2001397, 2012037, 2025418, 2042151, 2062589, 2086706, 2114038, 2143732, 2175126, 2208560, 2245278, 2286399, 2332239, 2382535, 2436673, 2493488, 2551604, 2610591, 2671443, 2735392, 2802535, 2872115, 2943752, 3017784]
53327C017784P6803P9748Q3053Q6763R0209R2755R4729R6869R9165J01033J02295
53316D021206J03135J03295J02372J00815R9377R7601R4236Q9615Q5863Q3732
53306D981247Q0781P4496O6061N8910N4088M9443M3319L6595L0362K4052J7102
53295E516456J0459M710j642j0069j9320k6947l2764l8843m6578n5670o5526p5565
53283E158701q4275r0222r4244r8525j03083j05424j04450j02468j01948j02179
53273D171883j00997r8451r6549r5998r5243r2930q9736q7242q5917q4711q2319
53262C161790p8473p4110p0290o7128o4064o0836n7501n3664m8811m3549l9321
53251B504043l6505l3936l0838k7912k5756k3679k1088j8732j7098j4834j0601
$$ y = [3017784, 3094587, 3174335, 3257388, 3344151, 3434360, 3527115, 3621844, 3718713, 3817878, 3918911, 4021206, 4124341, 4227636, 4330008, 4430823, 4530200, 4627801, 4722037, 4811652, 4897515, 4981247, 5062028, 5136524, 5202585, 5261495, 5315583, 5365026, 5408345, 5444940, 5475302, 5499354, 5516456, 5526915, 5531625, 5529983, 5519914, 5500594, 5473647, 5440883, 5402040, 5355462, 5299792, 5234266, 5158701, 5074426, 4984204, 4889960, 4791435, 4688352, 4582928, 4478478, 4376010, 4274062, 4171883, 4070886, 3972435, 3875886, 3779888, 3684645, 3591715, 3501979, 3414737, 3328820, 3244109, 3161790, 3083317, 3009207, 2938917, 2871789, 2807725, 2746889, 2689388, 2635724, 2586913, 2543364, 2504043, 2467538, 2433602, 2402764, 2374852, 2349096, 2325417, 2304329, 2285597, 2268499, 2253665, 2243064]
53240B243064n663k609j871j399L44K947N668Q494J1149J2825J3583J4736J6998
53227B318266J9646K2051K4763K8201L1558L4129L6696M0181M3740M5605M5489
53216B690325M4874M4938M5284M4877M3335M1055L8713L6818L5265L3220K9925
53205C128629K5664K1609J8547J6415J4914J3964J3162J1515Q335M121o9l938
53193C272868q042j2644j7177k1101k4659k8281l1814l5142l9172m5083n2228
53182B957525n7850n9708n8580n7388n8024n9791o0870o0453n9079n7542n6084
53171B312156n4512n2675n0748m9134m8125m7619m7306m7139m7363m8010m8491
53160A771034m7939m6039m3411m1203m0156l9996l9642l8131l5431l2385k9906
$$ y = [2243064, 2237401, 2234792, 2232921, 2231522, 2231866, 2234813, 2240481, 2248975, 2260124, 2272949, 2286532, 2301268, 2318266, 2337912, 2359963, 2384726, 2412927, 2444485, 2478614, 2515310, 2555491, 2599231, 2644836, 2690325, 2735199, 2780137, 2825421, 2870298, 2913633, 2954688, 2993401, 3030219, 3065484, 3098704, 3128629, 3154293, 3175902, 3194449, 3210864, 3225778, 3239742, 3252904, 3264419, 3272754, 3276875, 3276806, 3272868, 3264826, 3252182, 3235005, 3213904, 3189245, 3160964, 3129150, 3094008, 3054836, 3009753, 2957525, 2899675, 2839967, 2781387, 2723999, 2665975, 2606184, 2545314, 2484861, 2425782, 2368240, 2312156, 2257644, 2204969, 2154221, 2105087, 2056962, 2009343, 1962037, 1914898, 1867535, 1819525, 1771034, 1723095, 1677056, 1633645, 1592442, 1552286, 1512290, 1472648, 1434517, 1399086, 1366701, 1336795]
53149A336795k8268k7153k6201k5342k4699k4306k4081k4012k4161k4432k4487
53138A059653k4023k3036k1747k0463j9662j9839k0819k1456k0652j8760j7338
53127H31858j7281j7834j7762j7036j6537j6553j6412j5778j5493j6436j7933
53116F46803j8070j5912j2810j0939j0810j1077j0748j0497j1112j1743j0946
53105E12139r013p743p910q401q211p861q044q221p581o571o253o653o958o937
53091D05782o970o874n877l973k277j733k104k564k731k865l310m033m516m215
53077C51740l195k184j743j720j720j742j859j692q56L18R97O35q21k994m832
53062C28332m901k834j18J439J638J466J277O21l89j021j240j691k151j413O92
$$ y = [1336795, 1308527, 1281374, 1255173, 1229831, 1205132, 1180826, 1156745, 1132733, 1108572, 1084140, 1059653, 1035630, 1012594, 990847, 970384, 950722, 930883, 910064, 888608, 867956, 849196, 831858, 814577, 796743, 778981, 761945, 745408, 728855, 712443, 696665, 681172, 664736, 646803, 628733, 612821, 600011, 589072, 578262, 567185, 556437, 545940, 534828, 523085, 512139, 503126, 495383, 487473, 479072, 470861, 463000, 454956, 446735, 439154, 432583, 426330, 419677, 412719, 405782, 398812, 391938, 386061, 382088, 379811, 378078, 375974, 373410, 370679, 367814, 364504, 360471, 355955, 351740, 348545, 346361, 344618, 342898, 341178, 339436, 337577, 335885, 335029, 335347, 336344, 336979, 336158, 333164, 328332, 323431, 320597, 320479, 321918, 323556, 325022, 326299, 326920, 326531, 325510, 324270, 322579, 320428, 319015, 319707]
53047C19707K613L096K746K654K557J539j55j212r47N8Q29P95o6j228j834j483
53031C29669n98K93J216K144K453J839J335K253M141M956L510P94j442k489k568
53016C47506j918j077j253l200n745o732n661m325m235m638m017k714k439l470
53002B96082m111l300k211k350l350l888l863m136m596m139k589j278j311k379
52988B52581l585m431m565l657k163j422k175l573m294m105l634l075k036n88
52974B09278M54M73j89o94p23p58j300k115k496k277k083k296k389j827j126j077
52958A88855j282o98M84Q20j72j147r91m48p14j353r70N32J638J205k62j345j163
52941A82989M5J231J443P15o5l45n20j029j373p68O17J781J968J106m21j763j776
$$ y = [319707, 322320, 325416, 328162, 330816, 333373, 334912, 334757, 333545, 332598, 332656, 333485, 334280, 334214, 332986, 331152, 329669, 329071, 329364, 330580, 332724, 335177, 337016, 338351, 340604, 344745, 349701, 353211, 354005, 352563, 350074, 347506, 345588, 344511, 343258, 340058, 334313, 327581, 321920, 317595, 313360, 308722, 304705, 301991, 299552, 296082, 291971, 288671, 286460, 284110, 280760, 276872, 273009, 268873, 264277, 260138, 257549, 256271, 254960, 252581, 248996, 244565, 240000, 236343, 234180, 232758, 230583, 227010, 222716, 218611, 214977, 211902, 209866, 209278, 209732, 210205, 210016, 209322, 208599, 207841, 206541, 204426, 201930, 199653, 197570, 195274, 192885, 191058, 189932, 188855, 187573, 186875, 187359, 188179, 188007, 186860, 185869, 185421, 184707, 183354, 182384, 182916, 184554, 185759, 185497, 184152, 182989, 183034, 184265, 185708, 186423, 186358, 186013, 185493, 184464, 183091, 182323, 182940, 184721, 186689, 187795, 187374, 185611, 183835]
52924A83835j53J848K734K623K735L301L177J833L72l0K53L8r79k010k281j635
52908A95661l16J195K284K604K382K016J602J107P59Q92J491K186K612K616K348
52893B21439K313L007M107M520L736K836L349N111O172N166L100K226L524N898
52879B76504P618P895P016N617M144K755J378l9j233j789j721j617j956k513k716
52864B99343k458k194k298k684l026l054k660k058j877k658m050m881m360l090
52850B57995k568l585n252n600l381N94L840M318K318K0q61n83m54r46j428j415
52834B43012j200j042n24O33J622J267k33j141k12J567J967J71k210k962j587
52819B39128N83K131K693K530J763N48m90o83k09K2l95o74J10J542K143J224k39
$$ y = [183835, 183682, 185530, 188264, 190887, 193622, 196923, 200100, 201933, 202305, 202275, 202528, 202566, 201587, 199577, 197296, 195661, 195345, 196540, 198824, 201428, 203810, 205826, 207428, 208535, 209294, 210186, 211677, 213863, 216475, 219091, 221439, 223752, 226759, 230866, 235386, 239122, 241958, 245307, 250418, 256590, 261756, 264856, 267082, 270606, 276504, 284122, 292017, 299033, 304650, 308794, 311549, 312927, 312888, 311655, 309866, 308145, 306528, 304572, 302059, 299343, 296885, 294691, 292393, 289709, 286683, 283629, 280969, 278911, 277034, 274376, 270326, 265445, 261085, 257995, 255427, 251842, 246590, 240990, 237609, 238203, 242043, 246361, 248679, 248699, 247838, 247255, 246801, 245855, 244427, 243012, 241812, 240770, 240246, 240879, 242501, 243768, 243535, 242394, 242182, 243749, 245716, 245887, 243677, 240715, 239128, 239711, 241842, 244535, 247065, 248828, 249376, 248886, 248203, 247994, 248016, 247621, 246947, 247057, 248599, 250742, 251966, 251727]
52802B51727q90o21l28m77o65l86M10J402J906J113q05k166j488L73J203N97N15
52785B51420K120L930M183L332K762K473J887J747K958M299L660J321k88j59K49
52770B85894j27m18J15N98K97N6O84J362J049L17M60J664L183M514N284M859L194
52753C12985J366K36o98k183l736m360l959l058j975j276k038m264n934n273l309
52738B72524k568l631m803m891m500m340m061l345k793k964l418l342k539j504
52724B23825j040j748l284m240l567k012j251j762k540k731k440j903j114m72
52710A93721o26j321j563j261j553k965m332m347l188j889q43J19P58N39m79j536
52694A69234j969j677r85l70k18o57j563k750l840m166l312j823p89p06j083j320
$$ y = [251727, 250837, 250216, 249888, 249411, 248746, 248360, 248770, 250172, 252078, 253191, 252386, 250220, 248732, 249105, 250308, 250905, 251420, 253540, 257470, 261653, 264985, 267747, 270220, 272107, 273854, 276812, 281111, 284771, 286092, 285804, 285645, 285894, 285767, 285349, 285464, 286062, 286359, 286415, 287099, 288461, 289510, 289827, 290287, 291951, 295134, 299648, 304932, 309791, 312985, 314351, 314587, 313889, 311706, 307970, 303610, 299651, 296593, 294618, 293342, 291304, 287040, 281106, 275833, 272524, 269956, 266325, 261522, 256631, 252131, 247791, 243730, 240385, 237592, 234628, 231210, 227868, 225329, 223825, 222785, 221037, 217753, 213513, 209946, 207934, 206683, 204921, 202381, 199650, 197210, 195307, 194193, 193721, 193095, 191774, 190211, 188950, 187397, 184432, 180100, 175753, 172565, 170676, 169833, 169952, 170710, 171249, 170770, 169234, 167265, 165588, 164603, 164233, 164015, 163358, 161795, 159045, 155205, 151039, 147727, 145904, 145115, 144409, 143326, 142006]
52678A42006j336j272j146r83q89q29p83j024j697k126j389K72J455J292M25q4
52662A31892p8j12m96j100j578j437l16J307K241J887J000O94R93R87R0j329k428
52645A32217k598j771m14P54J341J536J730J944J797J033L2l47L52J485J921J386
52629A42398O30J14n58j354j085P74K483J998J70n2K193M355M120K452J712K274
52613A62624K783K826L346M585N403N022M214M028M113L092L94k826m754m677
52599A90173l388k062j254j107j747k789l121k285j523k242l742m000k726j842
52585A56345k506l423k991j517j58R01J813J865M97j143j369j99R40J298J248
52570A51601J008L97j88K7Q57J141K71j181k367k827k288q14N94N48j129k925
$$ y = [142006, 140670, 139398, 138252, 137269, 136380, 135551, 134768, 133744, 132047, 129921, 128532, 128804, 130259, 131551, 131976, 131892, 131814, 131702, 131206, 130106, 128528, 127091, 126775, 128082, 130323, 132210, 133210, 133904, 134897, 135884, 135974, 134645, 132217, 129619, 127848, 127434, 128188, 129529, 131065, 132795, 134739, 136536, 137569, 137601, 137254, 137606, 139091, 141012, 142398, 143028, 143142, 142584, 141230, 140145, 140919, 143402, 145400, 145570, 145518, 147711, 152066, 156186, 158638, 160350, 162624, 165407, 168233, 171579, 176164, 181567, 186589, 190803, 194831, 198944, 202036, 202430, 199604, 194850, 190173, 186785, 184723, 183469, 182362, 180615, 177826, 174705, 172420, 170897, 168655, 164913, 160913, 158187, 156345, 153839, 150416, 147425, 145908, 145750, 146651, 148464, 150329, 150826, 149683, 148314, 148115, 149055, 150353, 151601, 152609, 153006, 152818, 152845, 153702, 154843, 155114, 153933, 151566, 148739, 146451, 145637, 146231, 146779, 145650, 142725]
52554A42725l064j215J338K924K861J819Q15J42l09k7J521L256L127J074l32O11
52538A57266K222K153R43O45J095M49j134j394J92J413Q89Q2O40J989K942L732
52522A74124M792N200M023K115R41N49J28k40N7P72J225J621K558L548L317J526
52506B06256q00k425k772j934o52Q9J07K59J011J426N64p93r95J74J291J239L34
52489B02379n25q92p88m48k18k10j45J22K82K58O30J613K224J565M75O65K343
52472B09330L812L508J458j125k847k761j076O39R34J38l31l7L28N95J360K364
52456B16289K341J070L2K11O06m2j228j614j053l82Q8O64J268J428J021K02r99
52439B19902k254k593j496J79J275J777K209K113O03j778l289l181k351j596n98
$$ y = [142725, 139661, 138446, 139784, 142708, 145569, 147388, 148203, 148345, 148036, 148009, 149530, 152786, 155913, 156987, 156655, 157266, 159488, 161641, 162584, 163229, 164324, 164773, 163639, 162245, 162437, 163850, 164739, 164821, 165461, 167450, 170392, 174124, 178916, 184116, 188139, 190254, 191195, 191744, 191872, 191632, 191689, 192461, 193686, 195307, 197865, 201413, 204730, 206256, 205456, 203031, 200259, 198325, 197673, 197762, 197869, 198128, 199139, 200565, 201129, 200336, 199341, 199515, 200806, 202045, 202379, 201854, 200962, 200174, 199726, 199508, 199298, 199153, 199275, 199557, 199815, 200445, 202058, 204282, 205847, 206322, 206987, 209330, 213142, 216650, 218108, 216983, 214136, 211375, 210299, 210938, 211872, 212010, 211679, 211642, 211970, 212565, 213925, 216289, 218630, 219700, 219732, 219943, 220549, 220507, 219279, 217665, 216612, 216230, 216318, 216982, 218250, 219678, 220699, 220901, 219902, 217648, 215055, 213559, 213738, 215013, 216790, 218999, 221112, 221715, 219937, 216648, 213467, 211116, 209520, 208922]
52424B08922Q71J925J644L81p45j055m88P89K244K970K580J749J322J111K55j405
52408B23070k863k908j275J140K922L169K193J133P26O31J89m24k46J169K848
52393B31474L078J162j666l408l442k978l157l492k904j567m40N88K352M172L977
52378B23749J471p07l70J120J006p68j818j122j34j1L0P97J569J509J225J606
52362B29152K201J927P50n71j673k454k335r21Q63J587J243J256K373L651L884
52347B40933L164K378J895J412Q75P46J183J495Q35n57j262k13J905L335L373
$$ y = [208922, 209793, 211718, 213362, 213743, 212998, 211943, 211455, 212244, 214488, 217458, 220038, 221787, 223109, 224220, 224475, 223070, 220207, 217299, 216024, 217164, 220086, 223255, 225448, 226581, 227307, 227938, 228127, 227703, 227457, 228626, 231474, 234552, 235714, 234048, 230640, 227198, 224220, 221063, 217571, 214667, 213100, 212660, 213248, 215600, 219772, 223749, 225220, 224513, 224143, 225263, 226269, 225501, 223683, 222561, 222427, 222416, 222446, 223243, 224812, 226321, 227546, 229152, 231353, 233280, 234030, 233459, 231786, 229332, 226997, 226076, 226939, 228526, 229769, 231025, 233398, 237049, 240933, 244097, 246475, 248370, 249782, 250657, 251403, 252586, 254081, 254916, 254359, 253097, 252884, 254789, 258124, 261497]
$$ [...]
##END NTUPLES=NMR SPECTRUM
##END=
