##TITLE=coffee_type CCPA01-ROVE100E_80-20%
COFFEE_meoh_noesyp64 COFFEE_meoh {C:\Bruker\TOPSPIN} Administrator 2
##JCAMPDX= 6.0         $$ Bruker NMR JCAMP-DX V2.0
##DATA TYPE= NMR SPECTRUM
##DATA CLASS= NTUPLES
##ORIGIN= Bruker BioSpin GmbH
##OWNER= Administrator
$$ 1.72 TOPSPIN		Version 2.1
$$ 2012-05-18 15:50:35.167 -0700  Administrator@X
$$ Compression mode = diff/dup
##.OBSERVE FREQUENCY= 400.13188235
##.OBSERVE NUCLEUS= ^1H
##.ACQUISITION MODE= SIMULTANEOUS (DQD)
##.ACQUISITION SCHEME= undefined
##.AVERAGES= 64
##.DIGITISER RES= 22
##SPECTROMETER/DATA SYSTEM= spect
##.PULSE SEQUENCE= noesygpps1d.comp
##.SOLVENT NAME= COFFEE_meoh
##.SHIFT REFERENCE= INTERNAL, COFFEE_meoh, 1, 14.98061
##AUDIT TRAIL= $$ (NUMBER, WHEN, WHO, WHERE, PROCESS, VERSION, WHAT)
$$ ##TITLE= Audit trail, TOPSPIN		Version 2.1
$$ ##JCAMPDX= 5.01
$$ ##ORIGIN= Bruker BioSpin GmbH
$$ ##OWNER= Administrator
$$ $$ C:\Bruker\TOPSPIN/data/Administrator/nmr/12-COFFEE-2502/122/pdata/1/auditp.txt
$$ ##AUDIT TRAIL=  $$ (NUMBER, WHEN, WHO, WHERE, PROCESS, VERSION, WHAT)
(   1,<2012-02-25 17:49:39.375 -0500>,<Administrator>,<TOPSPIN>,<go>,<TOPSPIN 2.1>,
      <created by zg
	started at 2012-02-25 17:38:09.031 -0500,
	POWCHK enabled, PULCHK disabled,
       configuration hash MD5:
       B0 76 FB 9C 50 81 44 7D 18 B3 26 32 4E 60 AD 96
       data hash MD5: 64K
       EE F5 E1 3F 74 DD 89 54 18 3D 34 2B 8E 52 D1 98>)
(   2,<2012-02-25 17:49:42.406 -0500>,<Administrator>,<TOPSPIN>,<proc1d>,<TOPSPIN 2.1>,
      <Start of raw data processing
       efp LB = 0.3 FT_mod = 6 PKNL = 1 PHC0 = 0 PHC1 = 0 SI = 128K 
       data hash MD5: 128K
       24 C3 66 E3 85 DD E2 CF 30 E4 6F A2 E9 68 60 7E>)
(   3,<2012-02-25 17:49:43.562 -0500>,<Administrator>,<TOPSPIN>,<proc1d>,<TOPSPIN 2.1>,
      <pk PHC0 = 25.50476 PHC1 = 0 
       data hash MD5: 128K
       B5 7B 6F 20 11 F0 4E 29 3A 71 71 95 17 69 0C C4>)
(   4,<2012-02-25 17:49:43.812 -0500>,<Administrator>,<TOPSPIN>,<proc1d>,<TOPSPIN 2.1>,
      <abs ABSG = 1 
       data hash MD5: 128K
       0B 2A 97 F1 D9 C7 C6 D9 1F 21 51 11 80 00 5F EF>)
(   5,<2012-02-25 17:49:43.937 -0500>,<Administrator>,<TOPSPIN>,<proc1d>,<TOPSPIN 2.1>,
      <abs ABSG = 2 
       data hash MD5: 128K
       4B BE 52 7A D7 0F 69 0A AE F0 78 CC 5E C6 9C 89>)
(   6,<2012-02-25 17:49:44.156 -0500>,<Administrator>,<TOPSPIN>,<proc1d>,<TOPSPIN 2.1>,
      <abs ABSG = 3 
       data hash MD5: 128K
       6F 5E 5F D8 F3 B5 29 AD 5D 43 99 69 25 82 B8 AF>)
(   7,<2012-02-25 17:49:44.219 -0500>,<Administrator>,<TOPSPIN>,<proc1d>,<TOPSPIN 2.1>,
      <abs ABSG = 4 
       data hash MD5: 128K
       77 2F 09 3C F6 99 1F 4E C9 6F 60 1A 09 26 22 CA>)
(   8,<2012-02-25 17:49:44.281 -0500>,<Administrator>,<TOPSPIN>,<proc1d>,<TOPSPIN 2.1>,
      <abs ABSG = 5 
       data hash MD5: 128K
       3E AE F6 3B DB 17 2E 5A 10 48 7C F7 A7 C2 FC AD>)
(   9,<2012-02-25 17:49:44.406 -0500>,<Administrator>,<TOPSPIN>,<audit>,<TOPSPIN 2.1>,
      <user comment:
       ICON-NMR User ID: Administrator
$$ [...]
150 150 150 150 150 150 150 150
##$TP07= 0
##$TPNAME0= <>
##$TPNAME1= <>
##$TPNAME2= <>
##$TPNAME3= <>
##$TPNAME4= <>
##$TPNAME5= <>
##$TPNAME6= <>
##$TPNAME7= <>
##$TPOAL= (0..7)
0.5 0.5 0.5 0.5 0.5 0.5 0.5 0.5
##$TPOFFS= (0..7)
0 0 0 0 0 0 0 0
##$TUNHIN= 0
##$TUNHOUT= 0
##$TUNXOUT= 0
##$USERA1= <user>
##$USERA2= <user>
##$USERA3= <user>
##$USERA4= <user>
##$USERA5= <user>
##$V9= 5
##$VALIST= <valist>
##$VCLIST= <CCCCCCCCCCCCCCC>
##$VD= 0
##$VDLIST= <DDDDDDDDDDDDDDD>
##$VPLIST= <PPPPPPPPPPPPPPP>
##$VTLIST= <TTTTTTTTTTTTTTT>
##$WBST= 1024
##$WBSW= 4
##$XGAIN= (0..3)
0 0 0 0
##$XL= 0
##$YL= 0
##$YMAX_a= 13560724
##$YMIN_a= -6108922
##$ZGOPTNS= <>
##$ZL1= 120
##$ZL2= 120
##$ZL3= 120
##$ZL4= 120
##$ABSF1= 14.98061
##$ABSF2= -5.57192
##$ABSG= 5
##$ABSL= 3
##$ALPHA= 0
##$AQORDER= 0
##$ASSFAC= 0
##$ASSFACI= 0
##$ASSFACX= 0
##$ASSWID= 0
##$AUNMP= <proc_prof1d_extract>
##$AXLEFT= 0
##$AXNAME= <>
##$AXNUC= <1H>
##$AXRIGHT= 0
##$AXTYPE= 0
##$AXUNIT= <>
##$AZFE= 0.1
##$AZFW= 0.1
##$BCFW= 0
##$BC_mod= 0
##$BYTORDP= 0
##$COROFFS= 0
##$CY= 15
##$DATMOD= 1
##$DC= 0
##$DFILT= <>
##$DTYPP= 0
##$F1P= 0
##$F2P= 0
##$FCOR= 0.5
##$FTSIZE= 131072
##$FT_mod= 6
##$GAMMA= 0
##$GB= 0
##$INTBC= 1
##$INTSCL= 1
##$ISEN= 128
##$LB= 0.3
##$LEV0= 0
##$LPBIN= 0
##$MAXI= 10000
##$MC2= 0
##$MEAN= 0
##$ME_mod= 0
##$MI= 0
##$NCOEF= 0
##$NC_proc= -3
##$NLEV= 6
##$NOISF1= 0
##$NOISF2= 0
##$NSP= 0
##$NTH_PI= 0
##$NZP= 0
##$OFFSET= 14.98061
##$PC= 1
##$PHC0= 25.50476
##$PHC1= 0
##$PH_mod= 1
##$PKNL= yes
##$PPARMOD= 0
##$PPDIAG= 0
##$PPIPTYP= 0
##$PPMPNUM= 2147483647
##$PPRESOL= 1
##$PSCAL= 4
##$PSIGN= 0
##$PYNMP= <proc.py>
##$REVERSE= no
##$SF= 400.13
##$SI= 131072
##$SIGF1= 0
##$SIGF2= 0
##$SINO= 400
##$SIOLD= 131072
##$SPECTYP= <>
##$SREGLST= <1H.CDCl3>
##$SSB= 0
##$STSI= 131072
##$STSR= 0
##$SW_p= 8223.68421052632
##$SYMM= 0
##$S_DEV= 0
##$TDeff= 65536
##$TDoff= 0
##$TI= <>
##$TILT= no
##$TM1= 0
##$TM2= 0
##$TOPLEV= 0
##$USERP1= <user>
##$USERP2= <user>
##$USERP3= <user>
##$USERP4= <user>
##$USERP5= <user>
##$WDW= 1
##$XDIM= 131072
##$YMAX_p= 508060170
##$YMIN_p= -273522091
##$CURPLOT= <Network HP LaserJet P1505>
##$CURPRIN= <$Network HP LaserJet P1505>
##$DFORMAT= <normdp>
##$LAYOUT= <+/1D_H.xwp>
##$LFORMAT= <normlp>
##$PFORMAT= <normpl>
##$SURQMSG= 1
$$ End of Bruker specific parameters
$$ ---------------------------------
##NTUPLES= NMR SPECTRUM
##VAR_NAME=  FREQUENCY,     SPECTRUM/REAL,   SPECTRUM/IMAG
##SYMBOL=    X,             R,               I
##VAR_TYPE=  INDEPENDENT,   DEPENDENT,       DEPENDENT
##VAR_FORM=  AFFN,          ASDF,            ASDF
##VAR_DIM=   131072,        131072,          131072
##UNITS=     HZ,            ARBITRARY UNITS, ARBITRARY UNITS
##FACTOR=    0.0627417313425165, 1,          1
##FIRST=     8223.62146879498, -3140,        -87288
##LAST=      0,             2382,            -88737
##MIN=       0,             -273522091,      0
##MAX=       8223.62146879498, 508060170,    0
$$ Real data points
##PAGE= N=1
##DATA TABLE= (X++(R..R)), XYDATA
$$ [...]
60739A077876n307n557m994k663L01K047K531L417N755Q798J1179J2360J2712
60726A118455J2801J2967J3351J3948J4626J5153J5356J5262J5023J4640J3950
60715A275532J2925J1786J0701R674Q849Q457Q252P521O147N079N171O027O677
60702A382798O884O978O868O080M573K661M23j868l087k290k76R99O96k13o20
60687A410606n28m74o83j223k148l217m081m937o291q071r657j0662j0963j0140
60673A337531q155o417o706q675r820q518n889m070l718m048m327m396m326m340
60659A254126m669n074m979m439m238m683n093m917m640m961n750o335o358n846
60645A182144m953m070l680l792l923l746l332k840k703l833o590r620j1005j0678
$$ y = [1077876, 1072569, 1067012, 1062018, 1059355, 1059656, 1061703, 1064234, 1067651, 1073406, 1082204, 1093383, 1105743, 1118455, 1131256, 1144223, 1157574, 1171522, 1186148, 1201301, 1216657, 1231919, 1246942, 1261582, 1275532, 1288457, 1300243, 1310944, 1320618, 1329467, 1337924, 1346176, 1353697, 1359844, 1364923, 1370094, 1376121, 1382798, 1389682, 1396660, 1403528, 1409608, 1414181, 1416842, 1417265, 1415397, 1412310, 1410020, 1409744, 1410743, 1411439, 1411226, 1410606, 1410078, 1409604, 1408921, 1407698, 1405550, 1402333, 1398252, 1393315, 1387024, 1378953, 1369296, 1358634, 1347671, 1337531, 1329376, 1322959, 1316253, 1307578, 1297758, 1289240, 1283351, 1279281, 1275563, 1271515, 1267188, 1262792, 1258466, 1254126, 1249457, 1244383, 1239404, 1234965, 1230727, 1226044, 1220951, 1216034, 1211394, 1206433, 1200683, 1194348, 1187990, 1182144, 1177191, 1173121, 1169441, 1165649, 1161726, 1157980, 1154648, 1151808, 1149105, 1145272, 1138682, 1129062, 1118057, 1107379]
60631A107379j0268j0460j0323r649r932j1909j3874j3908j2468j1351j1214j1599
60619I70424j2229j2801j2344j0389q022o463n491m658m708n910o120l178J366
60606H79477L703K985K291L817N907O208N340N493O934Q151Q606R243J0408J1071
60592I69634J0497R471R305J0409J2166J3653J4115J3280J1702J0446J0012R810
60580A104500R116Q326Q539R879J1048J1118J1021J2356J5053J7297J7844J7288
60568A253385J6752J6281J5281J3763J2309J1119R923Q611P386O225M710K489
60556A378234k72k898m750n839o842q183r421r996j0221j0539j0143p772l999
60543A287359j260r57j944k610k959l482l385j744L30N17j804m786o241n552l675
$$ y = [1107379, 1097111, 1086651, 1076328, 1066679, 1056747, 1044838, 1030964, 1017056, 1004588, 993237, 982023, 970424, 958195, 945394, 933050, 922661, 914639, 908176, 902685, 898027, 893319, 887409, 881289, 878111, 879477, 883180, 886165, 888456, 892273, 898180, 904388, 909728, 915221, 922155, 930306, 938912, 948155, 958563, 969634, 980131, 989602, 998907, 1009316, 1021482, 1035135, 1049250, 1062530, 1074232, 1084678, 1094690, 1104500, 1113616, 1121942, 1130481, 1140360, 1151408, 1162526, 1173547, 1185903, 1200956, 1218253, 1236097, 1253385, 1270137, 1286418, 1301699, 1315462, 1327771, 1338890, 1348813, 1357424, 1364810, 1371035, 1375745, 1378234, 1377962, 1375064, 1370314, 1364475, 1357633, 1349450, 1340029, 1330033, 1319812, 1309273, 1299130, 1291358, 1287359, 1286099, 1285142, 1283198, 1280588, 1277629, 1274147, 1270762, 1269018, 1269348, 1269865, 1268061, 1263275, 1257034, 1251482, 1247807]
60528A247807k202k267l454l995k642J6K764N401Q081R966J0087R051Q263P843
60514A294719O872N475M717M518L672K255K028L580M966M354K559J571J613J150
60500A344049o86l094m854n607n762n840o077o361o326n483l422k63K860M489
60486A297623M628N245P973J1900J4994J7318K0872K6135L0917L3582L5553L9186
60474A545926M4580N0274N5920O2170O8193P1342O9693O3612N4417M2843K9463
60463B158433J5659L083p486j6018k2141k4885k3697j9190j2507m307M918J3660
60451B065522J9585K1624K1233K0697K0543J9777J8278J7500J8502K0725K3522
60440B287508K7602L3863M1714M9813N7901O6826P7067Q8453J00921J14344J27881
$$ y = [1247807, 1245605, 1243338, 1239884, 1235889, 1233247, 1233263, 1236027, 1241428, 1249509, 1259475, 1269562, 1278613, 1286876, 1294719, 1301591, 1307066, 1311783, 1316301, 1319973, 1322228, 1324256, 1327836, 1332802, 1337156, 1339715, 1341286, 1342899, 1344049, 1343363, 1340269, 1335415, 1329808, 1324046, 1318206, 1312129, 1305768, 1299442, 1293959, 1290537, 1290274, 1293134, 1297623, 1302251, 1307496, 1315469, 1327369, 1342363, 1359681, 1380553, 1406688, 1437605, 1471187, 1506740, 1545926, 1590506, 1640780, 1696700, 1758870, 1827063, 1898405, 1968098, 2031710, 2086127, 2128970, 2158433, 2174092, 2177175, 2169689, 2153671, 2131530, 2106645, 2082948, 2063758, 2051251, 2046944, 2051862, 2065522, 2085107, 2106731, 2127964, 2148661, 2169204, 2188981, 2207259, 2224759, 2243261, 2263986, 2287508, 2315110, 2348973, 2390687, 2440500, 2498401, 2565227, 2642294, 2730747, 2831668, 2946012, 3073893]
60429C073893J40899J54376J69793J86333K01036K12767K24529K40454K61440
60420D865520K85319L10693L38721L70827M06025M40581M68608M82185M72562
60411H441041M33424L63545K66227J47211J4208j22332k50235l58614m40307m92502
60401H001666n16835n19091n06878m85875m58298m25174l88948l52957l19133
60392D028477k87638k58543k32522k09647j88777j68907j50570j35122j22752
60383B273999j11938j01035q9978p9910p1436o4088n7643n2934n0379m8421m4984
60372A501253m0328l6831l5491l4300l1130k6773k3645k2428k1709k0470j9175
60361A188973j8401j7843j6995j5760j4131j2269j0852j0329r762p681m386k016
$$ y = [3073893, 3214792, 3369168, 3538961, 3725294, 3926330, 4139097, 4363626, 4604080, 4865520, 5150839, 5461532, 5800253, 6171080, 6577105, 7017686, 7486294, 7968479, 8441041, 8874465, 9238010, 9504237, 9651448, 9665656, 9543324, 9293089, 8934475, 8494168, 8001666, 7484831, 6965740, 6458862, 5972987, 5514689, 5089515, 4700567, 4347610, 4028477, 3740839, 3482296, 3249774, 3040127, 2851350, 2682443, 2531873, 2396751, 2273999, 2162061, 2061026, 1971048, 1891138, 1819702, 1755614, 1697971, 1645037, 1594658, 1546237, 1501253, 1460925, 1424094, 1388603, 1354303, 1323173, 1296400, 1272755, 1250327, 1228618, 1208148, 1188973, 1170572, 1152729, 1135734, 1119974, 1105843, 1093574, 1082722, 1072393, 1062631, 1054950, 1050564, 1048548]
60349A048548j782k378k053j121j129k200k706j633L4P77N56N50J288K005K060
60334A040816K129L242M989N821N208M409M585N082M557L133K284K823L983M466
60320A097527L582J494r52k626l018k752k643k642k390k273k796l235k354m49
60306A074473P06K37p97j132q17m28J03J019J938K382K552K945L664M584N657
60291A097086O561O693O030N531O123P706R455J0631J0812R997Q890Q437Q580
60278A202532Q239P062O375P479R567J0469R290P336O328O488O728O344O108P551
60264A307896J1081J4909J6374J4560J1176Q465O674M168k21n731j0510j3382
60252A365459j4480j4562j4220j3741j3289j2825j1996j0540q813p462o534n421
$$ y = [1048548, 1046766, 1044388, 1042335, 1041214, 1040085, 1037885, 1035179, 1033546, 1033580, 1034357, 1034913, 1035463, 1036751, 1038756, 1040816, 1042945, 1046187, 1051176, 1056997, 1062205, 1066614, 1071199, 1076281, 1080838, 1083971, 1086255, 1089078, 1093061, 1097527, 1101109, 1102603, 1101651, 1099025, 1096007, 1093255, 1090612, 1087970, 1085580, 1083307, 1080511, 1077276, 1074922, 1074473, 1075179, 1075416, 1074619, 1073487, 1072670, 1072242, 1072345, 1073364, 1075302, 1077684, 1080236, 1083181, 1086845, 1091429, 1097086, 1103647, 1110340, 1116370, 1121901, 1128024, 1135730, 1145185, 1155816, 1166628, 1176625, 1185515, 1193952, 1202532, 1210771, 1217833, 1224208, 1231687, 1241254, 1251723, 1261013, 1268349, 1274677, 1281165, 1287893, 1294237, 1300345, 1307896, 1318977, 1333886, 1350260, 1364820, 1375996, 1384461, 1391135, 1395303, 1395082, 1389351, 1378841, 1365459, 1350979, 1336417, 1322197, 1308456, 1295167, 1282342, 1270346, 1259806, 1250993, 1243531, 1236997, 1231576]
60240A231576l991k972k728k429j260R6K69q21j878j966j306l56P37J696K120
60225A216787K198K466K824K731K514L264N104O750P252P141P300P809Q518R768
60211A292426J1674J3412J4096J3802J3243J2946J3237J4231J5329J5604J5308
60200A445308J6109J9036K3009K6314K8803L1509L4693L7512L9460M1129M3460
60189A786342M6917N1438N6573O1680O6449P1217P6581Q2862R0051R7863J05527
60178B593500J12128J17646J23154J29424J35665J40335J42877J43967J44045
60169C782741J42289J37437J29404J19621J09539R9042Q6955P3088N8777M4862
60159D783755L0443J4845j38j1808j9838k5989l0749l2638l1199k8208k4803j9604
$$ y = [1231576, 1227585, 1224613, 1221885, 1219456, 1218196, 1218292, 1218561, 1217740, 1215862, 1213896, 1212590, 1212234, 1212971, 1214667, 1216787, 1218985, 1221451, 1224275, 1227006, 1229520, 1232784, 1237888, 1244638, 1251890, 1259031, 1266331, 1274140, 1282658, 1292426, 1304100, 1317512, 1331608, 1345410, 1358653, 1371599, 1384836, 1399067, 1414396, 1430000, 1445308, 1461417, 1480453, 1503462, 1529776, 1558579, 1590088, 1624781, 1662293, 1701753, 1742882, 1786342, 1833259, 1884697, 1941270, 2002950, 2069399, 2140616, 2217197, 2300059, 2390110, 2487973, 2593500, 2705628, 2823274, 2946428, 3075852, 3211517, 3351852, 3494729, 3638696, 3782741, 3925030, 4062467, 4191871, 4311492, 4421031, 4520073, 4607028, 4680116, 4738893, 4783755, 4814198, 4829043, 4828905, 4817097, 4797259, 4771270, 4740521, 4707883, 4676684, 4648476, 4623673, 4604069]
60147D604069j1167n48J0226K0830L2118M4241N6947P0598Q5032R8334J08763
60136E119443J17150J25513J33758J39660J41749J40217J35157J25940J12721
60127F291308R6837P9255O0025L9681J9636N83j8257l7381n5356o9862q0008q6833
60115F239628r1563r3773r1649q4167p2649n9512m5536k9527j1022Q055K5360
60104E693645M0572N4574O7196P7436Q5210R1047R4319R3553Q8598Q0895P1484
60093F538529O0273M7606L4873K2947J1271n60j1282j8800k2037k1338j7576j1308
60081F612598k475R420K4614M2531O2302Q3601J06445J30338J54475J78746K03836
60070G606431K30177K57559K85731L14646L43778L71971L98125M21466M40889
$$ y = [4604069, 4592902, 4592354, 4602580, 4623410, 4655528, 4699769, 4756716, 4827314, 4912346, 5010680, 5119443, 5236593, 5362106, 5495864, 5635524, 5777273, 5917490, 6052647, 6178587, 6291308, 6388145, 6467400, 6527425, 6567106, 6586742, 6587325, 6569068, 6531687, 6476331, 6406469, 6326461, 6239628, 6148065, 6054292, 5962643, 5878476, 5805827, 5746315, 5700779, 5671252, 5660230, 5668285, 5693645, 5734217, 5788791, 5855987, 5933423, 6018633, 6109680, 6203999, 6297552, 6386150, 6467045, 6538529, 6598802, 6646408, 6681281, 6704228, 6715499, 6714939, 6703657, 6684857, 6662820, 6641482, 6623906, 6612598, 6610123, 6619543, 6644157, 6686688, 6748990, 6832591, 6939036, 7069374, 7223849, 7402595, 7606431, 7836608, 8094167, 8379898, 8694544, 9038322, 9410293, 9808418, 10229884, 10670773]
60061A0670773M54682M61375M60645M53113M39302M18845L90706L54360L10850
60052A4414651K62279K10030J53909R3276K8555l8511j05281j68525k25258k74106
60042A4351019l15241l48418l72006l84721l87263l81148l66931l44925l16926
60033A1133440k85501k51896k15966j77885j38716r9662o2061k7600K832L0022
60023I907007N4620P4789Q7441R1615Q8954Q0929O7446M8598K6040K045k1764
60012A0507720m4426o5507q5153j03324j19172j32292j44048j56069j67711j76862
60002I313156j83140j88169j92650j95297j95062j92200j86445j76454j62268
59993G641471j46287j30433j13866r4889p3706n1962l0748j0373Q962K7631M6755
$$ y = [10670773, 11125455, 11586830, 12047475, 12500588, 12939890, 13358735, 13749441, 14103801, 14414651, 14676930, 14886960, 15040869, 15134145, 15162700, 15124189, 15018908, 14850383, 14625125, 14351019, 14035778, 13687360, 13315354, 12930633, 12543370, 12162222, 11795291, 11450366, 11133440, 10847939, 10596043, 10380077, 10202192, 10063476, 9963814, 9901753, 9874153, 9876985, 9907007, 9961627, 10036416, 10123857, 10215472, 10304426, 10385355, 10452801, 10501399, 10527439, 10529484, 10507720, 10463294, 10397787, 10312634, 10209310, 10090138, 9957846, 9813798, 9657729, 9490018, 9313156, 9130016, 8941847, 8749197, 8553900, 8358838, 8166638, 7980193, 7803739, 7641471, 7495184, 7364751, 7250885, 7155996, 7082290, 7030328, 6999580, 6989207, 6998169, 7025800, 7072555]
59982G072555O6586Q5407J01164J13561J23381J30368J32933J29747J20895J07617
59972H184214R1372P2864N1826K8086K691k2838m8007p2942r6722j17668j35242
59961G937634j49786j60372j65080j63978j59424j52534j41777j26472j09220
59952F608991r2884p7065n9766m0855k1576k067J8083L7863N6094P3959R3619
59941F594396J14593J34079J50850J66343J81427J94268K02200K04073J99974
59932H142203J90018J74290J53352J28304J00740P2320M3645J3979j6940m7466
59922H954445p5578j01121j24628j44568j57963j63907j64272j60424j51614j37470
59912G572900j20069j01778q2528o0890l7042j3055R267K9550M8075O5200Q1569
$$ y = [7072555, 7139141, 7224548, 7325712, 7439273, 7562654, 7693022, 7825955, 7955702, 8076597, 8184214, 8275586, 8348450, 8400276, 8428362, 8431053, 8408215, 8360208, 8287266, 8190544, 8072876, 7937634, 7787848, 7627476, 7462396, 7298418, 7138994, 6986460, 6844683, 6718211, 6608991, 6516107, 6439042, 6379276, 6338421, 6316845, 6314778, 6332861, 6370724, 6426818, 6500777, 6594396, 6708989, 6843068, 6993918, 7160261, 7341688, 7535956, 7738156, 7942229, 8142203, 8332221, 8506511, 8659863, 8788167, 8888907, 8961227, 9004872, 9018851, 9001911, 8954445, 8878867, 8777746, 8653118, 8508550, 8350587, 8186680, 8022408, 7861984, 7710370, 7572900, 7452831, 7351053, 7268525, 7207635, 7170593, 7157538, 7166805, 7196355, 7244430, 7309630, 7391199]
59901G391199R7888J14033J28719J40175J47108J49373J48071J44653J39535J31968
59891H732722J21690J10220R9656R0505Q1690P2805O5440O1618O1609O4228O9033
59880I631216P7338R0768J09522J32605J59173J88894K21219K55096K89588L24118
59870A1479537L57804L89006M15724M36101M48273M50135M39682M15434L76438
59861A5208134L22148K52801J70216P8444j6516j08416j93021k68487l33202l84103
59851A4727998m18454m36987m43542m41126m29747m08892l80574l48513l15010
59842A1105153k80007k42864k03936j64472j25834q8818n3236j8406J5471M6784
59832I989835P4080R7600J18388J36036J48205J52496J48090J35402J14764Q5875
$$ y = [7391199, 7489087, 7603120, 7731839, 7872014, 8019122, 8168495, 8316566, 8461219, 8600754, 8732722, 8854412, 8964632, 9064288, 9154793, 9236483, 9309288, 9374728, 9436346, 9497955, 9562183, 9631216, 9708554, 9799322, 9908844, 10041449, 10200622, 10389516, 10610735, 10865831, 11155419, 11479537, 11837341, 12226347, 12642071, 13078172, 13526445, 13976580, 14416262, 14831696, 15208134, 15530282, 15783083, 15953299, 16031743, 16015227, 15906811, 15713790, 15445303, 15112101, 14727998, 14309544, 13872557, 13429015, 12987889, 12558142, 12149250, 11768676, 11420163, 11105153, 10825146, 10582282, 10378346, 10213874, 10088040, 9999222, 9945986, 9927580, 9943051, 9989835, 10063915, 10161515, 10279903, 10415939, 10564144, 10716640, 10864730, 11000132, 11114896, 11200771]
59822A1200771M8566L925m5475r6727j47732j96831k41630k79299l08263l28724
59812I608581l41320l46332l44690l38387l28881l16050k99737k81307k62433
59803F749444k43182k22807k01913j82111j63701j45385j26562j08535r2992q0278
59793E181978o9728o0880n3802m8754m5908m4984m4972m4533m2900m0085l6423
59782D649009l2346k8596k5955k4618k4216k4614k6313k9903l5291m1501m7156
59771D308500n1251n3598n4490n4053n2329m9677m6434m2100l5800k7799j9568
59760C821401j2020m669K943J0161J6279K1524K6035K9144L0980L3553L8602M5234
59748D059167N1541N7691O5158P3189P8506P8967P5524P0017O3153N5497M8564
$$ y = [11200771, 11249337, 11253262, 11207787, 11111060, 10963328, 10766497, 10524867, 10245568, 9937305, 9608581, 9267261, 8920929, 8576239, 8237852, 7908971, 7592921, 7293184, 7011877, 6749444, 6506262, 6283455, 6081542, 5899431, 5735730, 5590345, 5463783, 5355248, 5262256, 5181978, 5112250, 5051370, 4997568, 4948814, 4902906, 4857922, 4812950, 4768417, 4725517, 4685432, 4649009, 4616663, 4588067, 4562112, 4537494, 4513278, 4488664, 4462351, 4432448, 4397157, 4355656, 4308500, 4257249, 4203651, 4149161, 4095108, 4042779, 3993102, 3946668, 3904568, 3868768, 3840969, 3821401, 3809381, 3804712, 3807655, 3817816, 3834095, 3855619, 3881654, 3910798, 3941778, 3975331, 4013933, 4059167, 4110708, 4168399, 4233557, 4306746, 4385252, 4464219, 4539743, 4609760, 4672913, 4728410, 4776974]
59737D776974M3324L8840L3851K8898K5485K3821K2865K2522K4371K9720L7820
59726E108491M6681N5455O5434P8470R4726J12508J30333J48649J69003J91958
59716F201708K16512K41429K66594K92851L20905L50221L78616M02854M19539
59707I091229M24869M13441L78761L16756K29468J25324J6322q5139j68879k29500
59697A0512652k67459k86861k91831k85146k69247k46653k19156j88000j55185
59688H303114j23287r3479o4914l6550q697J7776M2693O6443Q9523J12788J37263
59677H442673J62927J88423K12708K36416K60982K87115L14952L45043L78101
59668A0829340M13887M51266M89436N28582N69270O11705O55666P00628P45584
$$ y = [4776974, 4820298, 4859138, 4892989, 4921887, 4947372, 4971193, 4994058, 5016580, 5040951, 5070671, 5108491, 5155172, 5210627, 5276061, 5354531, 5449257, 5561765, 5692098, 5840747, 6009750, 6201708, 6418220, 6659649, 6926243, 7219094, 7539999, 7890220, 8268836, 8671690, 9091229, 9516098, 9929539, 10308300, 10625056, 10854524, 10979848, 10996170, 10911031, 10742152, 10512652, 10245193, 9958332, 9666501, 9381355, 9112108, 8865455, 8646299, 8458299, 8303114, 8179827, 8086348, 8021434, 7984884, 7976187, 7993963, 8036656, 8103099, 8192622, 8305410, 8442673, 8605600, 8794023, 9006731, 9243147, 9504129, 9791244, 10106196, 10451239, 10829340, 11243227, 11694493, 12183929, 12712511, 13281781, 13893486, 14549152, 15249780, 15995364]
59659A5995364P88924Q28883Q64306Q94565R18281R32342R33240R20106Q95871
59650B3971882Q64956Q30439P94430P60265P32385P13469P02873O98318O97932
59641C0766949O99756P00145O94094O77216O46996O02345N42801M68817L82681
59632C6181800K88722J92093R7252P951p1459j35874j81567k08068k17074k09936
59622C5743840j87125j49664r9461l7966L4112J15230K02326K92530L84708M78568
59612C6777098N72730O64353P50011Q26170Q89012R34223R56634R49788R06682
59603D4226701Q22037O94123N24623L17830Q1200j73513m31092o75918q94887
59594D4491104j078394j220213j317845j373013j390850j377686j339314j281329
$$ y = [15995364, 16784288, 17613171, 18477477, 19372042, 20290323, 21222665, 22155905, 23076011, 23971882, 24836838, 25667277, 26461707, 27221972, 27954357, 28667826, 29370699, 30069017, 30766949, 31466705, 32166850, 32860944, 33538160, 34185156, 34787501, 35330302, 35799119, 36181800, 36470522, 36662615, 36759867, 36767818, 36696359, 36560485, 36378918, 36170850, 35953776, 35743840, 35556715, 35407051, 35307590, 35269624, 35303736, 35418966, 35621292, 35913822, 36298530, 36777098, 37349828, 38014181, 38764192, 39590362, 40479374, 41413597, 42370231, 43320019, 44226701, 45048738, 45742861, 46267484, 46585314, 46666514, 46493001, 46061909, 45385991, 44491104, 43412710, 42192497, 40874652, 39501639, 38110789, 36733103, 35393789, 34112460]
59586C4112460j210443j134504j061058r96528r46986r18609r15817r38037r77947
59577B5012531j022974j059601j078432j076955j058002j025635r82665r31420
59569A6776847q74913q16083p56703o98063o41811n89116n39618m92569m48507
59560A0919464m08653l73000l40271l09518k80709k54121k30193k09572j92090
59551H321337j76206j60832j47168j37188j30732j25994j22494j21417j22791
59542G076515j24762j26269j28333j31657j34807j35997j35193j33095j29368
59533E897034j23415j15940j08286j00721r2569q3666p4600o5696n6572m6740
59523E028829l6321k6304j7977j1562n563J667R735J6708K1799K6164L0727L4866
$$ y = [34112460, 32902017, 31767513, 30706455, 29709927, 28762941, 27844332, 26928515, 25990478, 25012531, 23989557, 22929956, 21851524, 20774569, 19716567, 18690932, 17708267, 16776847, 15901934, 15085851, 14329148, 13631085, 12989274, 12400158, 11860540, 11367971, 10919464, 10510811, 10137811, 9797540, 9488022, 9207313, 8953192, 8722999, 8513427, 8321337, 8145131, 7984299, 7837131, 7699943, 7569211, 7443217, 7320723, 7199306, 7076515, 6951753, 6825484, 6697151, 6565494, 6430687, 6294690, 6159497, 6026402, 5897034, 5773619, 5657679, 5549393, 5448672, 5356103, 5272437, 5197837, 5132141, 5075569, 5028829, 4992508, 4966204, 4948227, 4936665, 4931102, 4932769, 4942504, 4959212, 4981011, 5007175, 5037902, 5072768]
59511E072768L7992M0987M4999M9900N4907N9682O3920O7105O9874P4584Q3052
59500E719770R4274J05571J15555J25006J35441J47912J62612J78640J94524K09914
59490G189219K26036K43606K61177K76920K91314L06207L21480L34394L42536
59481I792889L45873L45348L40874L31696L17928L00670K80842K58592K33606
59472A2548318K05556J74310J40398J05656P3033M5086K2394L690j2143k4596
59462A3281702l2192l4074l0236k0465m152J8636M6386P6731J07466J37032J64176
59451A3711010J86922K01695K04410J93219J69377J34390Q7532K8170m0370j12060
59441A4764295j83208k53321l20330l78296m21998m51541m70098m78733m76154
$$ y = [5072768, 5110760, 5151747, 5196746, 5246646, 5301553, 5361235, 5425155, 5492260, 5562134, 5636718, 5719770, 5814044, 5919615, 6035170, 6160176, 6295617, 6443529, 6606141, 6784781, 6979305, 7189219, 7415255, 7658861, 7920038, 8196958, 8488272, 8794479, 9115959, 9450353, 9792889, 10138762, 10484110, 10824984, 11156680, 11474608, 11775278, 12056120, 12314712, 12548318, 12753874, 12928184, 13068582, 13174238, 13247271, 13292357, 13314751, 13318441, 13306298, 13281702, 13249510, 13215436, 13185200, 13164735, 13160583, 13179219, 13225605, 13302336, 13409802, 13546834, 13711010, 13897932, 14099627, 14304037, 14497256, 14666633, 14801023, 14888555, 14916725, 14876355, 14764295, 14581087, 14327766, 14007436, 13629140, 13207142, 12755601, 12285503, 11806770, 11330616]
59432A1330616m62567m41028m14868l85817l54784l22838k90835k59145k28032
59423H170702j97662j67907j38749j10765q4487n9712l5956j3082R286L2240N6474
59412G460382Q1213J05281J28651J51766J73803J93083K09100K22752K34356K42499
59402I202886K45165K41130K30012K11599J85694J52230J11391O3893J1344m3723
59392A0611621r8265j49462j95527k35834k69906k96565l14858l25506l30298
59383H395400l30118l24937l15813l05046k93661k80434k64471k47114k30020
59374E803786k12920j94929j76901j60597j46327j33203j21077j10411j00593
59365D446828r0152p8741o7547n7742m9389m1642l3320k3724j3684n034J718Q023
$$ y = [11330616, 10868049, 10427021, 10012153, 9626336, 9271552, 8948714, 8657879, 8398734, 8170702, 7973040, 7805133, 7666384, 7555619, 7471132, 7411420, 7375464, 7362382, 7371668, 7403908, 7460382, 7541595, 7646876, 7775527, 7927293, 8101096, 8294179, 8503279, 8726031, 8960387, 9202886, 9448051, 9689181, 9919193, 10130792, 10316486, 10468716, 10580107, 10644000, 10655344, 10611621, 10513356, 10363894, 10168367, 9932533, 9662627, 9366062, 9051204, 8725698, 8395400, 8065282, 7740345, 7424532, 7119486, 6825825, 6545391, 6280920, 6033806, 5803786, 5590866, 5395937, 5219036, 5058439, 4912112, 4778909, 4657832, 4547421, 4446828, 4356676, 4277935, 4210388, 4152646, 4103257, 4061615, 4028295, 4004571, 3990887, 3985853, 3987571, 3995594]
59353C995594J4677K0343K4368K9191L7110M5494M8513M3825L5077K7666K4439
59342D346297K5902L1678M0310M9582N8695O8987Q1346R3894J03149J06973J06141
59331E112954J04127J05610J13766J27984J44815J61541J78094J95737K15327
59322F459955K37312K61980K88884L17027L46241L77462M11267M47175M84721
59313I632024N23972N64326O03995O41390O75665P05112P26189P35574P32480
59304A5540727P17969O92768O57213O13003N63666N12851M62757M14154L67234
59295B0542342L22090K78621K36189J93468J48759J00531M7641j0723p4795j43883
59285B1640240k16518k90742l63935m32697m93855n45789n88387o21693o45321
$$ y = [3995594, 4010271, 4030614, 4054982, 4084173, 4121283, 4166777, 4215290, 4259115, 4294192, 4321858, 4346297, 4372199, 4403877, 4444187, 4493769, 4552464, 4621451, 4702797, 4796691, 4899840, 5006813, 5112954, 5217081, 5322691, 5436457, 5564441, 5709256, 5870797, 6048891, 6244628, 6459955, 6697267, 6959247, 7248131, 7565158, 7911399, 8288861, 8700128, 9147303, 9632024, 10155996, 10720322, 11324317, 11965707, 12641372, 13346484, 14072673, 14808247, 15540727, 16258696, 16951464, 17608677, 18221680, 18785346, 19298197, 19760954, 20175108, 20542342, 20864432, 21143053, 21379242, 21572710, 21721469, 21822000, 21869641, 21858918, 21784123, 21640240, 21423722, 21132980, 20769045, 20336348, 19842493, 19296704, 18708317, 18086624, 17441303]
59276A7441303o59178o63990o60706o49766o31256o05681n74641n40841n06880
59267A1948364m73493m39303m03057l65836l30288k97932k68105k39513k11750
59258H919087j85138j59895j36026j13631r3026p4583n8298m3426k9116j5691
59248H010257m605L458R581J4792J8155J8001J4459R279L513l159j0861j8801
59236H064069k6209l2864l8553m3051m6560m9112m9794m7690m3187l7016k8659
59225G621374j7393m387Q409K1249L6074N2943O9633Q5233J01396J18863J35324
59214H228718J48459J58796J67726J74712J78610J80045J79826J76283J66879
59205I760054J51903J33788J12719Q5616N0448R910l0070o4409r0933j09849j22520
$$ y = [17441303, 16782125, 16118135, 15457429, 14807663, 14176407, 13570726, 12996085, 12455244, 11948364, 11474871, 11035568, 10632511, 10266675, 9936387, 9638455, 9370350, 9130837, 8919087, 8733949, 8574054, 8438028, 8324397, 8231371, 8156788, 8098490, 8055064, 8025948, 8010257, 8005652, 8009110, 8018691, 8033483, 8051638, 8069639, 8084098, 8093377, 8096890, 8093731, 8082870, 8064069, 8037860, 8004996, 7966443, 7923392, 7876832, 7827720, 7777926, 7730236, 7687049, 7650033, 7621374, 7603981, 7599594, 7608003, 7629252, 7665326, 7718269, 7787902, 7873135, 7974531, 8093394, 8228718, 8377177, 8535973, 8703699, 8878411, 9057021, 9237066, 9416892, 9593175, 9760054, 9911957, 10045745, 10158464, 10244080, 10294528, 10304438, 10274368, 10209959, 10119026, 10009177, 9886657]
59194I886657j30681j35989j39759j42678j44502j44585j43249j42184j42762
59185H620268j44299j44886j43693j41468j38722j34624j28103j19313j09351
59176G415809r8999q8281p6795o3929m9027l1954j3566N095K4025M4256O6422
59165G133056R0129J15164J42481J72893K05219K37058K67440K97430L27748L57213
59155I345831L84054M07189M24872M33348M28671M09507L76819L31187K72183
59146A2813661K00401J18720L1107n8804j47869k32951l10604l76923m28381m63684
59136A1144673m84383m92737m89618m75662m53589m27483l99899l71261l41887
59127G208154l12847k84819k57934k32825k10208j89377j69022j49675j33221
$$ y = [9886657, 9755976, 9619987, 9480228, 9337550, 9193048, 9048463, 8905214, 8763030, 8620268, 8475969, 8331083, 8187390, 8045922, 7907200, 7772576, 7644473, 7525160, 7415809, 7316810, 7228529, 7151734, 7087805, 7038778, 7006824, 6993258, 6998353, 7022378, 7066634, 7133056, 7223185, 7338349, 7480830, 7653723, 7858942, 8096000, 8363440, 8660870, 8988618, 9345831, 9729885, 10137074, 10561946, 10995294, 11423965, 11833472, 12210291, 12541478, 12813661, 13014062, 13132782, 13163889, 13105085, 12957216, 12724265, 12413661, 12036738, 11608357, 11144673, 10660290, 10167553, 9677935, 9202273, 8748684, 8321201, 7921302, 7550041, 7208154, 6895307, 6610488, 6352554, 6119729, 5909521, 5720144, 5551122, 5401447, 5268226]
59118E268226j19552j05951r0778p5671o2868n2273m2539l3460k5479j7957r683
59107D632015n41Q469J6442K2936K7957L2414L7857M4832N2243N8815O4412O9306
59095E067157P3350P6643P9804Q2622Q3618Q2052P9227P6557P3309O7777N9865
59084E901981N0966M1695L1352J9664P795k758j1546j9245k6584l3244l7796l9090
59072E883190l7673l5206l2566k9282k4832j9223j2229l394O751J6834K6603L7383
59060E776356M9959O3327P6275Q8792J01051J12430J22742J33128J44483J56072
59050F824615J66899J77271J87792J97835K06366K13406K19559K24906K29458
59041H648107K33619K37103K38404K36390K31158K22071K06478J82153J49790
$$ y = [5268226, 5148674, 5042723, 4951945, 4876274, 4813406, 4761133, 4718594, 4685134, 4659655, 4641698, 4632015, 4631474, 4639943, 4656385, 4679321, 4707278, 4739692, 4777549, 4822381, 4874624, 4933439, 4997851, 5067157, 5140507, 5217150, 5296954, 5379576, 5463194, 5545246, 5624473, 5701030, 5774339, 5842116, 5901981, 5952947, 5994642, 6025994, 6045658, 6053453, 6050695, 6039149, 6019904, 5993320, 5960076, 5922280, 5883190, 5845517, 5810311, 5777745, 5748463, 5723631, 5704408, 5692179, 5688785, 5695536, 5712370, 5738973, 5776356, 5826315, 5889642, 5965917, 6054709, 6155760, 6268190, 6390932, 6524060, 6668543, 6824615, 6991514, 7168785, 7356577, 7554412, 7760778, 7974184, 8193743, 8418649, 8648107, 8881726, 9118829, 9357233, 9593623, 9824781, 10046852, 10253330, 10435483, 10585273]
59032A0585273J11244O6530J4805m2347j00917j57404k09890k56521k95230l25219
59022I390324l47074l61260l67835l67582l62045l52340l39201l23979l08206
59013F260802k92253k75705k58893k42791k27540k12559j97988j84670j72740
59004D195663j61457j50480j40075j30167j20508j11600j04142r7616r0792q3614
58994C005212p7172p1860o6975o2314n8565n5863n3298n0304m7333m4705m1889
58983B374934l8421l4623l1052k7967k5614k4207k3356k2076j9562j5615j0671
58972B101770o002l152k243j369J093M231O079O667P697R432J0173R082P377O110
58958B156945M697K557O07j14M5K50N09J140J912K633L643M861N405N075N110
$$ y = [10585273, 10696517, 10763047, 10777852, 10735505, 10634588, 10477184, 10267294, 10010773, 9715543, 9390324, 9043250, 8681990, 8314155, 7946573, 7584528, 7232188, 6892987, 6569008, 6260802, 5968549, 5692844, 5433951, 5191160, 4963620, 4751061, 4553073, 4368403, 4195663, 4034206, 3883726, 3743651, 3613484, 3492976, 3381376, 3277234, 3179618, 3088826, 3005212, 2928040, 2856180, 2789205, 2726891, 2668326, 2612463, 2559165, 2508861, 2461528, 2416823, 2374934, 2336513, 2301890, 2270838, 2242871, 2217257, 2193050, 2169694, 2147618, 2128056, 2112441, 2101770, 2095768, 2092616, 2090373, 2089004, 2090097, 2094328, 2100407, 2107074, 2114771, 2124203, 2134376, 2143458, 2150835, 2156945, 2161642, 2164199, 2164806, 2164692, 2164737, 2164987, 2165496, 2166636, 2168548, 2171181, 2174824, 2179685, 2185090, 2190165, 2195275]
58943B195275O267P083N623K294p12k546m502p439r959j0157q320o760p182q996
58929B149969j0364j0296r188p667n616k709O48L567N782P872J0198J2172J3130
58916B157498J3592J4940J7725K0875K3052K4345K5893K7943K9509L0354L2107
58905B417833L6073M0688M2758M1328L8744L7648L8284L9355M0105M0576M0889
58894B854281M1416M2924M5654M8829N1836N5142N9257O3556O7232P0644P4766
58883C475537P9779Q5272R1269R7996J05029J11766J18431J25684J33477J41254
58873D565494J49101J57826J67969J79292J91153K02995K14875K27789K42817
58864F299311K59564K76434K93050L11204L32630L56953L82908M10224M38997
$$ y = [2195275, 2201542, 2208625, 2214248, 2216542, 2215830, 2213284, 2208782, 2201343, 2191384, 2181227, 2172907, 2166147, 2158965, 2149969, 2139605, 2129309, 2120121, 2112454, 2106838, 2104129, 2104777, 2108344, 2114126, 2121998, 2132196, 2144368, 2157498, 2171090, 2186030, 2203755, 2224630, 2247682, 2272027, 2297920, 2325863, 2355372, 2385726, 2417833, 2453906, 2494594, 2537352, 2578680, 2617424, 2655072, 2693356, 2732711, 2772816, 2813392, 2854281, 2895697, 2938621, 2984275, 3033104, 3084940, 3140082, 3199339, 3262895, 3330127, 3400771, 3475537, 3555316, 3640588, 3731857, 3829853, 3934882, 4046648, 4165079, 4290763, 4424240, 4565494, 4714595, 4872421, 5040390, 5219682, 5410835, 5613830, 5828705, 6056494, 6299311, 6558875, 6835309, 7128359, 7439563, 7772193, 8129146, 8512054, 8922278, 9361275]
58855I361275M68415M97959N29002N63229N99907O36455O71396P04927P36800
58846A4769365P65434P89188Q06818Q16323Q14587P98466P65408P13280O40943
58837B1679812N49169M40154L16406J81067L8989j03811k41620l69331m82210
58828B2008625n77109o53492p11973p52362p74740p81725p77355p63805p41274
58819A5474790p11213o77419o43270o09706n76557n44155n12687m81565m50604
58810A0267614m21022l94270l70370l48019l25942l03959k83125k64726k48622
58801G307559k33033k16574j99955j84717j70999j57921j45440j34195j23784
58792E740941j12985j01513q9930p8054o5366n2940m2819l5049k7244j7622o850
$$ y = [9361275, 9829690, 10327649, 10856651, 11419880, 12019787, 12656242, 13327638, 14032565, 14769365, 15534799, 16323987, 17130805, 17947128, 18761715, 19560181, 20325589, 21038869, 21679812, 22228981, 22669135, 22985541, 23166608, 23205597, 23101786, 22860166, 22490835, 22008625, 21431516, 20778024, 20066051, 19313689, 18538949, 17757224, 16979869, 16216064, 15474790, 14763577, 14086158, 13442888, 12833182, 12256625, 11712470, 11199783, 10718218, 10267614, 9846592, 9452322, 9081952, 8733933, 8407991, 8104032, 7820907, 7556181, 7307559, 7074526, 6857952, 6657997, 6473280, 6302281, 6144360, 5998920, 5864725, 5740941, 5627956, 5526443, 5436513, 5358459, 5293093, 5240153, 5197334, 5162285, 5135041, 5117419, 5110569]
58781E110569L718J3886K3973L3860M3589N3699O4135P3961Q2858R1957J02463
58770E698668J14275J26544J38905J51682J65368J80057J95086K09543K23766
58761G203894K39670K58505K79026K99319L19761L42382L67783L94749M22703
58752A0127792M52422M84168N17222N51567N87860O25182O60911O93480P23304
58743A5423908P50059P70755P81457P79518P63368P31559O82853O16105N29724
58734B1829306M22892K98069J61053J8221j24988k63037l90199n02560n98473
58725B0850284o76472p34712p73295p95124q03223p98998p84103p61960p35645
58716A3986752p05720o71864o35520n99296n64674n31751n00575m71339m43740
$$ y = [5110569, 5114287, 5128173, 5152146, 5186006, 5229595, 5283294, 5347429, 5421390, 5504248, 5596205, 5698668, 5812943, 5939487, 6078392, 6230074, 6395442, 6575499, 6770585, 6980128, 7203894, 7443564, 7702069, 7981095, 8280414, 8600175, 8942557, 9310340, 9705089, 10127792, 10580214, 11064382, 11581604, 12133171, 12721031, 13346213, 14007124, 14700604, 15423908, 16173967, 16944722, 17726179, 18505697, 19269065, 20000624, 20683477, 21299582, 21829306, 22252198, 22550267, 22711320, 22729541, 22604553, 22341516, 21951317, 21448757, 20850284, 20173812, 19439100, 18665805, 17870681, 17067458, 16268460, 15484357, 14722397, 13986752, 13281032, 12609168, 11973648, 11374352, 10809678, 10277927, 9777352, 9306013, 8862273]
58707H862273m17244l91730l67305l43962l21877l01426k82612k65101k48850
58698E922166k33839k19281k04400j89893j77107j65750j54143j41876j30380
58689D305497j20484j11368j02355r3833q5802p7711p0326o5471o2893n9715n4344
58678C401195m8769m5511m4341m3736m3582m4368m5263m5087m4224m3676m3221
58667B909417m2206m1402m2241m4648m6973m7840m7272m6455m6885m8937n1065
58656B403493n1420n0446n0218n1077n1141m9705m8595m8811m8381m5471m1441
58645A866787l8555l6542l3821l0726k8820k7997k6840k5315k4771k5394k5744
58634A542262k4982k3908k3535k3774k3669k2417k0260j8573j8301j8118j5636
$$ y = [8862273, 8445029, 8053299, 7685994, 7342032, 7020155, 6718729, 6436117, 6171016, 5922166, 5688327, 5469046, 5264646, 5074753, 4897646, 4731896, 4577753, 4435877, 4305497, 4185013, 4073645, 3971290, 3877457, 3791655, 3713944, 3643618, 3578147, 3515254, 3455539, 3401195, 3352426, 3306915, 3262574, 3218838, 3175256, 3130888, 3085625, 3040538, 2996314, 2952638, 2909417, 2867211, 2825809, 2783568, 2738920, 2691947, 2644107, 2596835, 2550380, 2503495, 2454558, 2403493, 2352073, 2301627, 2251409, 2200332, 2149191, 2099486, 2050891, 2002080, 1953699, 1908228, 1866787, 1828232, 1791690, 1757869, 1727143, 1698323, 1670326, 1643486, 1618171, 1593400, 1568006, 1542262, 1517280, 1493372, 1469837, 1446063, 1422394, 1399977, 1379717, 1361144, 1342843, 1324725, 1309089]
58623A309089j0908o969n758n413l233K74K515K893L468N805R042J1226J1300
58610A323331R687P687O362N499M076J888j06j253j925k503k859l278m427n969
58596A336210o763o854p502q712q829p374o030n660m629j571K276N132P126R100
58582A295920J0869J2440J5045J9015K2455K3969K5059K7726L1347L4090L5943
58571A553878L8104M0656M3030M5650M9090N2645N5632N8955O3710O9392P5259
58560B146001Q1930Q9828R7667J04495J11811J21458J32804J44203J55792J68637
58550C354626J82272J95372K07706K19300K28765K34588K36808K35501K28999
58541E323937K15644J95772J69911J36762R5503M8634J89m7242r1470j28995j57619
$$ y = [1309089, 1298181, 1291212, 1285454, 1280041, 1276808, 1277082, 1279597, 1282490, 1285958, 1291763, 1300805, 1312031, 1323331, 1333018, 1340705, 1347067, 1352566, 1356642, 1358530, 1358424, 1357171, 1355246, 1352743, 1349884, 1346606, 1342179, 1336210, 1329447, 1322593, 1315091, 1306379, 1297550, 1290176, 1284146, 1278486, 1273857, 1272286, 1274562, 1279694, 1286820, 1295920, 1306789, 1319229, 1334274, 1353289, 1375744, 1399713, 1424772, 1452498, 1483845, 1517935, 1553878, 1591982, 1632638, 1675668, 1721318, 1770408, 1823053, 1878685, 1937640, 2001350, 2070742, 2146001, 2227931, 2317759, 2415426, 2519921, 2631732, 2753190, 2885994, 3030197, 3185989, 3354626, 3536898, 3732270, 3939976, 4159276, 4388041, 4622629, 4859437, 5094938, 5323937, 5539581, 5735353, 5905264, 6042026, 6137529, 6186163, 6186352, 6139110, 6047640, 5918645, 5761026]
58530E761026j79202j96618k09346k15230k15060k11784k06177j96981j84617
58521C946011j71262j57715j43493j29579j17702j07272r6322q5210p6162o9439
58511B791855o3205n7086n2566m9700m6615m2608l8936l6219l3523l0280k6834
58500B314283k3282k0022j8885k1248k5583k9590l3757l9674m5725m8373m7534
58489A960610m6749m7603m7770m5360m1705l8627l6013l3352l1187k9684k7773
58478A534787k4735k1155j7918j5729j5450j7040j8537j8213j7261j7969j9856
58467A330924k0304j8627j6690j5691j5153j4944j5435j5776j4829j3694j4452
58456A155329j6589j7533j6530j4993j3363j0970q730q342q631o479j882J447
$$ y = [5761026, 5581824, 5385206, 5175860, 4960630, 4745570, 4533786, 4327609, 4130628, 3946011, 3774749, 3617034, 3473541, 3343962, 3226260, 3118988, 3022666, 2937456, 2861294, 2791855, 2728650, 2671564, 2618998, 2569298, 2522683, 2480075, 2441139, 2404920, 2371397, 2341117, 2314283, 2291001, 2270979, 2252094, 2230846, 2205263, 2175673, 2141916, 2102242, 2056517, 2008144, 1960610, 1913861, 1866258, 1818488, 1773128, 1731423, 1692796, 1656783, 1623431, 1592244, 1562560, 1534787, 1510052, 1488897, 1470979, 1455250, 1439800, 1422760, 1404223, 1386010, 1368749, 1350780, 1330924, 1310620, 1291993, 1275303, 1259612, 1244459, 1229515, 1214080, 1198304, 1183475, 1169781, 1155329, 1138740, 1121207, 1104677, 1089684, 1076321, 1065351, 1056621, 1048279, 1039648, 1033169, 1031287, 1032734]
58444A032734J322l34j003n06M46J691K512J814L22L42K653N700Q043R435R704
58429A074875R016Q963J0652J2185J0934P708N484M771L834K734K956L424J466
58416A159002k261m335m367n554q944j1792j2496j2533j2588j1365r445r535j1543
58403A042244j2070j0340r809j1965j3416j1545q580p348p113o341n711n668m538
58390I27800j813J37R3M00K825N482O347O562P556Q224P605P283Q392R194Q305
58375A004392P415Q200R327R166Q701R193R584Q601O935N128K087k115m825m452
58361A077337k868k083j500m26o3o89q1K658M891M578L580M192N552O205P085
58346A108368R006J0184R401Q769J0182J1676J0524P512N043L228Q87j614l362
$$ y = [1032734, 1034056, 1033722, 1032719, 1032213, 1032659, 1034350, 1036862, 1038676, 1038998, 1039340, 1041993, 1047693, 1055736, 1065171, 1074875, 1083891, 1092854, 1103506, 1115691, 1126625, 1134333, 1139817, 1144588, 1148422, 1151156, 1154112, 1157536, 1159002, 1156741, 1152406, 1148039, 1142485, 1133541, 1121749, 1109253, 1096720, 1084132, 1072767, 1063322, 1053787, 1042244, 1030174, 1019834, 1010025, 998060, 984644, 973099, 964519, 957171, 950058, 943717, 938006, 932338, 927800, 925987, 926124, 926217, 926617, 929442, 934924, 941271, 947833, 955389, 963613, 971218, 978501, 986893, 996087, 1004392, 1011807, 1020007, 1029334, 1038500, 1047201, 1056394, 1065978, 1074579, 1081514, 1086642, 1088729, 1086614, 1081789, 1077337, 1074469, 1072386, 1070886, 1070460, 1070397, 1069708, 1069627, 1072285, 1077176, 1081754, 1085334, 1089526, 1095078, 1101283, 1108368, 1117374, 1127558, 1136959, 1145728, 1155910, 1167586, 1178110, 1185622, 1190665, 1193893, 1194780, 1193166, 1189804]
58333A189804m888o655p512o823o026o155o189n674o184q147r278q216o652n667
58319A095738l463P07L972M165L490M683O679P224O994P716Q885R393R974J1191
58305A177348J1498J0000Q558Q718R436J0032J2059J5612J7507J6092J4403J5399
58293A326662J7486J7996J7642J8070J8392J7560J7057J7900J8078J6186J4190
58282A517219J3515J2066Q497N529N439O074N159M591O407Q361P907P031Q643
58269A616438J1532J3200J4381J6503J8019J7545J7375J9725K2728K4154K5407
58258A817007K7916K9459K8383K7543K9645L2589L3752L4633L6772L7580L5088
58247B170367L2343L1982L1080K6776K2299K1693K3061K3000K3160K6132K9290
$$ y = [1189804, 1184916, 1178261, 1170749, 1163926, 1157900, 1151745, 1145556, 1139882, 1133698, 1125551, 1116273, 1108057, 1101405, 1095738, 1092275, 1092982, 1096954, 1101119, 1104609, 1109292, 1115971, 1123195, 1130189, 1137905, 1146790, 1156183, 1166157, 1177348, 1188846, 1198846, 1207404, 1216122, 1225558, 1235590, 1247649, 1263261, 1280768, 1296860, 1311263, 1326662, 1344148, 1362144, 1379786, 1397856, 1416248, 1433808, 1450865, 1468765, 1486843, 1503029, 1517219, 1530734, 1542800, 1551297, 1556826, 1562265, 1568339, 1573498, 1578089, 1584496, 1592857, 1600764, 1607795, 1616438, 1627970, 1641170, 1655551, 1672054, 1690073, 1707618, 1724993, 1744718, 1767446, 1791600, 1817007, 1844923, 1874382, 1902765, 1930308, 1959953, 1992542, 2026294, 2060927, 2097699, 2135279, 2170367, 2202710, 2234692, 2265772, 2292548, 2314847, 2336540, 2359601, 2382601, 2405761, 2431893, 2461183]
58236B461183K9155K7809K8596K9756K8779K8673L2997L8760M1280M2136M5369
58225B834493M9862N2454N4588N8638O1827O1053N9721O2488O7449P0802P4615
58214C507990Q2193R0442R4975R8276J04454J10569J11767J10450J11716J14317
58204D537149J14892J16089J21278J26519J27437J28670J36353J46720J52982
58195E708089J57864J67829J80366J89395J98281K14517K35745K54015K69859
58186G575960K89231L10405L27176L41362L58935L77603L91372M03371M20745
58177A0796160M41474M60106M81391N13604N53513N93188O35923O89267P48343
58168A5912969Q03502Q58628R23627R94951J062673J130120J205803J282524J347131
$$ y = [2461183, 2490338, 2518147, 2546743, 2576499, 2605278, 2633951, 2666948, 2705708, 2746988, 2789124, 2834493, 2884355, 2936809, 2991397, 3050035, 3111862, 3172915, 3232636, 3295124, 3362573, 3433375, 3507990, 3590183, 3680625, 3775600, 3873876, 3978330, 4088899, 4200666, 4311116, 4422832, 4537149, 4652041, 4768130, 4889408, 5015927, 5143364, 5272034, 5408387, 5555107, 5708089, 5865953, 6033782, 6214148, 6403543, 6601824, 6816341, 7052086, 7306101, 7575960, 7865191, 8175596, 8502772, 8844134, 9203069, 9580672, 9972044, 10375415, 10796160, 11237634, 11697740, 12179131, 12692735, 13246248, 13839436, 14475359, 15164626, 15912969, 16716471, 17575099, 18498726, 19493677, 20556350, 21686470, 22892273, 24174797, 25521928]
58159B5521928J405203J473101J552022J634402J728855J851418J998090K154276
58151C9319295K325102K526242K751791K984796L233746L524204L861804M241887
58143F4768867M687106N231713N876537O608227P455195Q469899R662406J1009605
58135A23769555J2515030J4183797J5956635J7781040J9767603K2175652K5216497
58128B51365809K8919912L3039569L6709732L8089268L4866305K5849536J2333753
58121D61173884k332247j4772698k3326055k8151450l0215856l0453909k9559029
58114C02362640k8013484k6084255k3890340k1550755j9225336j7027867j4993962
58107A51576641j3147441j1523487j0115866q871590p755583o767558n889451
$$ y = [25521928, 26927131, 28400232, 29952254, 31586656, 33315511, 35166929, 37165019, 39319295, 41644397, 44170639, 46922430, 49907226, 53140972, 56665176, 60526980, 64768867, 69455973, 74687686, 80564223, 87172450, 94627645, 103097544, 112759950, 123769555, 136284585, 150468382, 166425017, 184206057, 203973660, 226149312, 251365809, 280285721, 313325290, 350035022, 388124290, 422990595, 448840131, 461173884, 458841637, 444068939, 420742884, 392591434, 362375578, 331921669, 302362640, 274349156, 248264901, 224374561, 202823806, 183598470, 166570603, 151576641, 138429200, 126905713, 116789847, 107918257, 100162674, 93395116, 87505665]
58100H7505665n075955m310571l618127l007695k450736j924436j422054r05375
58092F4790716l06124L94792J135254J840287K454547K851100K771882J979846
58084G7912300N14326j248284k826129l926553m536220m791859m819766m685527
58076E1592288m430146m099636l735660l362587k995977k653368k347819k078894
58068B5888201j840035j630462j452147j300708j169135j057138r67598q96736
58060A5574242q36974p86928p49000p19051o88134o53513o18866n84572n47000
58051I390204n06997m69903m36598m02788l67697l35812l09598k87614k69884
58042F003313k57934k49339k39077k26341k13845k01349j86737j72246j62119
$$ y = [87505665, 82429710, 78119139, 74501012, 71493317, 69042581, 67118145, 65696091, 64790716, 64484592, 64879384, 66014638, 67854925, 70309472, 73160572, 75932454, 77912300, 78426626, 77178342, 74352213, 70425660, 65889440, 61097581, 56277815, 51592288, 47162142, 43062506, 39326846, 35964259, 32968282, 30314914, 27967095, 25888201, 24048166, 22417704, 20965557, 19664849, 18495714, 17438576, 16470978, 15574242, 14737268, 13950340, 13201340, 12482289, 11794155, 11140642, 10521776, 9937204, 9390204, 8883207, 8413304, 7976706, 7573918, 7206221, 6870409, 6560811, 6273197, 6003313, 5745379, 5496040, 5256963, 5030622, 4816777, 4615428, 4428691, 4256445, 4094326]
58033D094326j54829j45248j33787j25480j20550j14204j05911j00398r8597r5818
58023B899504r0456q6690q6586q6590q4083q1120p9474p7638p4583p1394o7853
58012B013037o2418n6302n2598n0975m8328m4674m2821m2291l9640l4947l1917
58001A506126l1081k9042k4952k1678k0068j8183j6540j7740k0357j9927j6803
57990A269755j6069j8588j9286j6027j3049j3219j3718j2219j1058j2008j2748
57979A111766j1702j1105j2137j2069r247o171m795l444j206n72k717m572l803
57966A028226k507l093m369m665m835n375m370j198J280J053P8M36R01j3r43m27
57950A000179L19n8n41j67m2q36j200p26j318l590n010l857j836o14R32L581N092
$$ y = [4094326, 3939497, 3794249, 3660462, 3534982, 3414432, 3300228, 3194317, 3093919, 2995322, 2899504, 2809048, 2722358, 2635772, 2549182, 2465099, 2383979, 2304505, 2226867, 2152284, 2080890, 2013037, 1950619, 1894317, 1841719, 1790744, 1742416, 1697742, 1654921, 1612630, 1572990, 1538043, 1506126, 1475045, 1446003, 1421051, 1399373, 1379305, 1361122, 1344582, 1326842, 1306485, 1286558, 1269755, 1253686, 1235098, 1215812, 1199785, 1186736, 1173517, 1159799, 1147580, 1136522, 1124514, 1111766, 1100064, 1088959, 1076822, 1064753, 1055506, 1049335, 1044540, 1041096, 1039890, 1039318, 1036601, 1032029, 1028226, 1025719, 1022626, 1018257, 1013592, 1008757, 1003382, 999012, 997814, 999094, 1000147, 1000225, 1000661, 1001562, 1001549, 1000606, 1000179, 1000498, 1000440, 999899, 999732, 999690, 998854, 997654, 996928, 995610, 992020, 987010, 983153, 981317, 980703, 981635, 985216, 990308]
57933I90308L399j22l007m822n945o023n677o930r830j1605j1166j1279j3734
57920I03567j5633j3661r299o566o475o839o082m489k858j992k470l465l177j446
57906H19115q3L28J380L475M411L070J658K182L244K594N90j129k333l518m331
57891H30653m609n227o402p055p097q000r765j0023p663m648k495J29M166P457
57877G69421P848O510N701N450M909M684N342N545M159K114O7l484r095j3695
57863G95476j4191j1981j1060j2806j5284j6459j5648j2996r765q087q467q800
57851F49932p482n802n393n348m060k009l65J253L228M003K549J098K429N639
57837F39672P541P221O454O352O427O443O801P239P142O643N862L913L48l303
$$ y = [990308, 993707, 993585, 990578, 985756, 979811, 973788, 968111, 961181, 951351, 939746, 928580, 917301, 903567, 887934, 874273, 864974, 858408, 851933, 845094, 839012, 834523, 831665, 829673, 827203, 823738, 820561, 819115, 819032, 819360, 820740, 824215, 828626, 831696, 833354, 835536, 838780, 841374, 841964, 840835, 838502, 834984, 830653, 826044, 820817, 814415, 807360, 800263, 792263, 782498, 772475, 764812, 760164, 757669, 757798, 761964, 769421, 777269, 783779, 789480, 794930, 799839, 804523, 809865, 815410, 819569, 821683, 821750, 818266, 809171, 795476, 781285, 769304, 758244, 745438, 730154, 713695, 698047, 685051, 675286, 667199, 658732, 649932, 642450, 636648, 631255, 625907, 621847, 619838, 619473, 620726, 623954, 627957, 630506, 631604, 634033, 639672, 647213, 654434, 660888, 667240, 673667, 680110, 686911, 694150, 701292, 707935, 713797, 717710, 718058, 714755]
57823G14755n099m959m064l231l254n114q174r833q902p465p529p837o471m441
57809F28382l845m131l367j835j133p55J198M533P230Q699R911J0787J0262Q712
57795F74648P670P303O579N629N471N698M861K970J310pj997m504o152o518o378
57780F96583o072n510n356o124o696n848m601m782n886n913m678l633k863j328
57766F27293J18r38m624q137r467r398r187q790q054p547p339o841o359o934q295
57751E25501q927q482q142q187p431n627m295m385m975n005m543l672j972J04
57737D49962J184J062J235K625M408N833P396R325J0534J0202R044Q041P212O468
57723E34531O305O724O782O117N663N836N451L688J856J653K421J843r23m174
$$ y = [714755, 709656, 704697, 700633, 697402, 694148, 689034, 680860, 671027, 662125, 654660, 647131, 639294, 632823, 628382, 624537, 620406, 617039, 615204, 614071, 613316, 614514, 619047, 626277, 634976, 644887, 655674, 665936, 674648, 682318, 689621, 696200, 701829, 707300, 712998, 717859, 720829, 722139, 722132, 720135, 715631, 709479, 702961, 696583, 690511, 685001, 679645, 673521, 666825, 660977, 656376, 651594, 645708, 639795, 635117, 631484, 628621, 627293, 627411, 626473, 621849, 613712, 604245, 594847, 585660, 576870, 568816, 561269, 553930, 547089, 540730, 533796, 525501, 516574, 508092, 499950, 491763, 484332, 478705, 474410, 470025, 465050, 460045, 455502, 451830, 449858, 449962, 451146, 452208, 453443, 456068, 460476, 466309, 473705, 483030, 493564, 503766, 512810, 520851, 528063, 534531, 540836, 547560, 554342, 560459, 566122, 571958, 577409, 581097, 582953, 584606, 587027, 588870, 587947, 583773]
57709E83773n852n831n674o617q202q878p880o206n450n938o547o140m568k376
57695D97614k35J275J918J937J680J291J017J258J869K045J611J568K531L498
57681E20877L398L016L824N501O372N897N064M495L993L996N463P918R323Q689
57667E97826P383P158Q063R044R634J0197J1075J2101J2795J2916J2952J3634
57655G24778J4631J4671J3788J4182J7298K1025K2049K0458J9555K1039K3018
57644I26492K3475K3232K4185K6475K9071L1783L5188L9245M3223M6560M8957
57633A297886N0206N0634N1214N2764N5408N9078O3938O9987P6993Q4876R3595
57622B006579J02701J11915J22011J34009J47474J60868J73663J86721K00384
$$ y = [583773, 577921, 572090, 566416, 559799, 551597, 542719, 534839, 528633, 523183, 517245, 510698, 504558, 499990, 497614, 497379, 498654, 500572, 502509, 504189, 505480, 506497, 507755, 509624, 511669, 513280, 514848, 517379, 520877, 524275, 527291, 531115, 536616, 542988, 548885, 553949, 558444, 562437, 566433, 571896, 579814, 589137, 597826, 605209, 612367, 620430, 629474, 639108, 649305, 660380, 672481, 685276, 698192, 711144, 724778, 739409, 754080, 767868, 782050, 799348, 820373, 842422, 862880, 882435, 903474, 926492, 949967, 973199, 997384, 1023859, 1052930, 1084713, 1119901, 1159146, 1202369, 1248929, 1297886, 1348092, 1398726, 1449940, 1502704, 1558112, 1617190, 1681128, 1751115, 1828108, 1912984, 2006579, 2109280, 2221195, 2343206, 2477215, 2624689, 2785557, 2959220, 3145941, 3346325]
57613C346325K13666K25722K36522K45437K50526K50016K43489K31029K12258
57604E454990J86310J51253J03373L9838l5886j12595j77440k23468k50973k63497
57594D871905k64602k57454k44737k28224k09410j90468j73338j57923j42627
57585C003122j26936j12289j00047q9752q0106p0813o2487n5146m7735l9291k9970
57574B188550k0688j2244n110M10M492Q178J2810J9021K6653L5495M5174N4409
57562B357150O1646O7026P2680Q0326Q9576R9284J09295J19594J28971J36294
57552C321842J42415J48787J54285J55264J48960J35479J16314R2421O4153L2072
57542D511992k510l7120o8671r5537j18635j39146j55783j66181j70482j71302
$$ y = [3346325, 3559991, 3785713, 4022235, 4267672, 4518198, 4768214, 5011703, 5242732, 5454990, 5641300, 5792553, 5895926, 5935764, 5899878, 5787283, 5609843, 5386375, 5135402, 4871905, 4607303, 4349849, 4105112, 3876888, 3667478, 3477010, 3303672, 3145749, 3003122, 2876186, 2763897, 2663850, 2574098, 2493992, 2423179, 2360692, 2305546, 2257811, 2218520, 2188550, 2167862, 2155618, 2150508, 2150918, 2155410, 2163588, 2176398, 2195419, 2222072, 2257567, 2302741, 2357150, 2418796, 2485822, 2558502, 2638828, 2728404, 2827688, 2936983, 3056577, 3185548, 3321842, 3464257, 3613044, 3767329, 3922593, 4071553, 4207032, 4323346, 4415767, 4479920, 4511992, 4509482, 4472362, 4403691, 4308154, 4189519, 4050373, 3894590, 3728409, 3557927, 3386625]
57532C386625j70053j65732j57993j49034j41134j34116j26562j18168j09701
57523B114132j01663r4148q7169q0382p3394o6786o1681n7809n3526m8424m4238
57512A344912m2104m0535l7543l3418k9821k7036k4011k0515j7594j5895j4761
57501A041679j3220j1059q832p230o434n921n162m328l701k631j49L268N892P034
57487I89206P840R319J1002J2302J3836J6282J8975K0827K1858K2921K4490K6538
57475A195396K9022L1771L4470L7216M0435M4071M7752N1937N7488O3855O9255
57464A702668P3301P7773Q3945R0737R6611J01641J06435J10501J13106J14234
57454B670952J13148J07465R5538P8720N9405L7950J3536j2679l7510n8584p5576
$$ y = [3386625, 3216572, 3050840, 2892847, 2743813, 2602679, 2468563, 2342001, 2223833, 2114132, 2012469, 1918321, 1831152, 1750770, 1677376, 1610590, 1548909, 1491100, 1437574, 1389150, 1344912, 1302808, 1262273, 1224730, 1191312, 1161491, 1134455, 1110444, 1089929, 1072335, 1056440, 1041679, 1028459, 1017400, 1008568, 1001338, 994904, 988983, 983821, 979493, 975792, 973161, 973012, 976280, 982172, 989206, 997046, 1006365, 1017367, 1029669, 1043505, 1059787, 1078762, 1099589, 1121447, 1144368, 1168858, 1195396, 1224418, 1256189, 1290659, 1327875, 1368310, 1412381, 1460133, 1512070, 1569558, 1633413, 1702668, 1775969, 1853742, 1937687, 2028424, 2125035, 2226676, 2333111, 2443612, 2556718, 2670952, 2784100, 2891565, 2987103, 3065823, 3125228, 3163178, 3176714, 3164035, 3126525, 3067941, 2992365]
57443B992365q8888r8830j05885j10315j11594j09548j05644j01735r7794r2277
57433A969855q4559p5745o7352o0365n5246n1507m7612m2442l6605l1305k6480
57422A390637k1399j6360j2135q197l194K967R015J4098J8322K1853K5028K8974
57410A449609L4363L9809M3319M5279M8139N3036N8640O3614O8324P3510P9072
57399B056714Q4818R0879R6617J00397J01277R9706R5952Q8997P7787O2473M3783
57388B999400K2123j843k6596n0533p2705r2261j07899j18577j24281j25801j24236
57377B176791j20938j17053j12674j07049j00045r2731q6272q0819p5873p1105
57367A212232o6392o1603n6821n2477m8982m6349m4133m1532l8009l4269l1987
$$ y = [2992365, 2903477, 2804647, 2698762, 2588447, 2476853, 2367305, 2261661, 2159926, 2062132, 1969855, 1885296, 1809551, 1742199, 1681834, 1626588, 1575081, 1527469, 1485027, 1448422, 1417117, 1390637, 1369238, 1352878, 1340743, 1332546, 1329352, 1332319, 1341334, 1355432, 1373754, 1395607, 1420635, 1449609, 1483972, 1523781, 1567100, 1612379, 1660518, 1713554, 1772194, 1835808, 1904132, 1977642, 2056714, 2141532, 2232411, 2329028, 2429425, 2530702, 2630408, 2726360, 2815357, 2893144, 2955617, 2999400, 3021523, 3019680, 2993084, 2942551, 2869846, 2777585, 2669686, 2551109, 2426828, 2301027, 2176791, 2055853, 1938800, 1826126, 1719077, 1619032, 1526301, 1440029, 1359210, 1283337, 1212232, 1145840, 1084237, 1027416, 974939, 925957, 879608, 835475, 793943, 755934, 721665, 689678]
57356F89678l1673l1355k8712k4257k0838j9906j9934j8985j7250j6045j5567
57345D45156j4904j3713j2679j2330j2146j1052q664n987m621m990n705n280m095
57332C28990l760m804o042o310n679m731l595k270j157p73j257k271l044k830
57318B80467j904j638k742l848l108q50P90Q55M93P77J258J227Q44L84m03j325
57302B71277j491p34j78n78j194j076m16J95P56J198R26n5o06p7N46K48k47K53
57284B68747J291J406N18Q6R78K425L169K746J600O13M82J094J729K189L114M683
57268B96870N979O423O755P468P244M804J634Q08L066N968P363P714Q179Q352
57254C78627P461O519P257R454J1159J1583J2073J3635J5046J4650J3054J2581
$$ y = [689678, 658005, 626650, 597938, 573681, 552843, 532937, 513003, 494018, 476768, 460723, 445156, 430252, 416539, 403860, 391530, 379384, 368332, 359668, 353681, 349060, 344070, 338365, 333085, 328990, 325230, 320426, 314384, 308074, 302395, 297664, 294069, 291799, 290642, 289869, 288612, 286341, 283297, 280467, 278563, 276925, 274183, 270335, 267227, 266377, 267167, 268022, 268515, 269292, 270550, 271777, 272621, 273005, 272602, 271277, 269786, 269052, 268874, 268296, 267102, 266026, 265610, 265805, 266561, 267759, 268685, 268630, 268024, 267947, 268493, 268741, 268494, 268747, 270038, 271444, 271962, 272048, 273026, 275451, 278620, 281366, 282966, 283579, 284061, 285155, 286884, 289073, 292187, 296870, 302849, 309272, 316027, 323495, 330739, 335543, 337177, 337985, 341051, 347019, 354382, 362096, 370275, 378627, 386088, 392607, 399864, 409318, 420477, 432060, 444133, 457768, 472814, 487464, 500518, 513099]
57242E13099J4249J6666J8170J8819J9737K1329K2967K3960K4196K4142K4673
57231G42007K6389K8744L0506L1631L3637L7296M1028M2960M3759M5681M9278
57220A152916N3004N5858N8312O0330O0490N7902N3380M7997M1989L5842L0737
57209A708757K6922K3210J9094J5921J4765J4654J4351J4388J5707J7526J8504
57198A903799J9029K0381K2231K2982K2160K0660J8904J6588J4122J2531J2045
57187B105432J2480J4858K0621K8974L7049M3341M9339N6911O5646P3803Q0552
57176B589006Q6086R0335R2732R2897R0872Q7036Q2179P7233P2529O7886O3682
57165C492473O1063O0729O2152O4518O7806P2371P7881Q3238Q7420R0242R2501
$$ y = [513099, 527348, 544014, 562184, 581003, 600740, 622069, 645036, 668996, 693192, 717334, 742007, 768396, 797140, 827646, 859277, 892914, 930210, 971238, 1014198, 1057957, 1103638, 1152916, 1205920, 1261778, 1320090, 1380420, 1440910, 1498812, 1552192, 1600189, 1642178, 1678020, 1708757, 1735679, 1758889, 1777983, 1793904, 1808669, 1823323, 1837674, 1852062, 1867769, 1885295, 1903799, 1922828, 1943209, 1965440, 1988422, 2010582, 2031242, 2050146, 2066734, 2080856, 2093387, 2105432, 2117912, 2132770, 2153391, 2182365, 2219414, 2262755, 2312094, 2369005, 2434651, 2508454, 2589006, 2675092, 2765427, 2858159, 2951056, 3041928, 3128964, 3211143, 3288376, 3360905, 3428791, 3492473, 3553536, 3614265, 3676417, 3740935, 3808741, 3881112, 3958993, 4042231, 4129651, 4219893, 4312394]
57154D312394R5333R9012J02513J04790J06115J07240J07552J05505J01042R5948
57144E337444R1367Q6616Q1349P7173P5534P5376P4813P4114P4807P6251P5907
57133F200751P3423P2029P4341P8515Q0313P7977P3282O8410O3864N9567N6135
57122F978607N4115N3086N2414N2067N1854N0682M7814M4414M2551M2814M4072
57111G514490M5562M7689N0349N1994N1317M8801M5529M1429L6084L0498K6333
57100G990075K3663K1037J7824J4775J2062Q451L190k717q094j3204j8695k3993
57088H024374k8107l1237l4244l6982l8671l9799m2396m8260n7963p1478q8704
57077G506533j09108j31941j57163j85376k16450k48893k80988l12165l43060
$$ y = [4312394, 4407727, 4506739, 4609252, 4714042, 4820157, 4927397, 5034949, 5140454, 5241496, 5337444, 5428811, 5515427, 5596776, 5673949, 5749483, 5824859, 5899672, 5973786, 6048593, 6124844, 6200751, 6274174, 6346203, 6420544, 6499059, 6579372, 6657349, 6730631, 6799041, 6862905, 6922472, 6978607, 7032722, 7085808, 7138222, 7190289, 7242143, 7292825, 7340639, 7385053, 7427604, 7470418, 7514490, 7560052, 7607741, 7658090, 7710084, 7761401, 7810202, 7855731, 7897160, 7933244, 7963742, 7990075, 8013738, 8034775, 8052599, 8067374, 8079436, 8087887, 8091077, 8088360, 8080266, 8067062, 8048367, 8024374, 7996267, 7965030, 7930786, 7893804, 7855133, 7815334, 7772938, 7724678, 7666715, 7595237, 7506533, 7397425, 7265484, 7108321, 6922945, 6706495, 6457602, 6176614, 5864449, 5521389]
57068E521389l74638m07230m39993m71634n02311n34547n71298o13425o60393
57059I45920B32774e41704q46084r26617j013610j106066j204949j312677j433014
57050h384721j570113j726817j904961k107466k338056k598025k885538l199572
57042b6715269l542611l918343m329342m779024n273298n817823o415910p071463
57034f7863083p791165q580264r436514j0346114j1278016j2182817j3012510
57027a40490483j3746962j4372692j4801292j4826503j4234367j3011556j1428128
57020b36911983r857189q481048p175222n671265l806819j618565P58245L227490
57012b69536356N766354Q357620J0912847J3260562J5203653J6596422J7385688
$$ y = [5521389, 5146751, 4739521, 4299528, 3827894, 3325583, 2791036, 2219738, 1606313, 945920, 232774, -541704, -1387788, -2314405, -3328015, -4434081, -5639030, -6951707, -8384721, -9954834, -11681651, -13586612, -15694078, -18032134, -20630159, -23515697, -26715269, -30257880, -34176223, -38505565, -43284589, -48557887, -54375710, -60791620, -67863083, -75654248, -84234512, -93671026, -104017140, -115295156, -127477973, -140490483, -154237445, -168610137, -183411429, -198237932, -212472299, -225483855, -236911983, -246769172, -255250220, -262425442, -268096707, -271903526, -273522091, -272763846, -269536356, -263770002, -255412382, -244499535, -231238973, -216035320, -199438898, -182053210]
57005a82053210J7598716J7306478J6598443J5575508J4345264J3011447J1663109
56998g5954245J0367545R166104Q075472P096876O226291N456881M777167M174201
56990b0613708L639997L171717K765726K415180K113522J856328J638526J452876
56982a559836b67333H85443J030090R20934Q23079P35570O57084N86068N22353
56973F160621M66404M16669L70019L25141K83301K45348K10436J78195J49764
56964H805898J25605J04341Q4584O6087M8441L0619J2582m907k2987m5060p2793
56953I132410j03413j32460j58095j81501k04367k27329k50022k71284k89528
56944G314411l03308l11174l11377l03168k88432k70138k48797k22303j89670
$$ y = [-182053210, -164454494, -147148016, -130549573, -114974065, -100628801, -87617354, -75954245, -65586700, -56420596, -48345124, -41248248, -35021957, -29565076, -24787909, -20613708, -16973711, -13801994, -11036268, -8621088, -6507566, -4651238, -3012712, -1559836, -267333, 885443, 1915533, 2836467, 3659546, 4395116, 5052200, 5638268, 6160621, 6627025, 7043694, 7413713, 7738854, 8022155, 8267503, 8477939, 8656134, 8805898, 8931503, 9035844, 9120428, 9186515, 9234956, 9265575, 9278157, 9273250, 9250263, 9205203, 9132410, 9028997, 8896537, 8738442, 8556941, 8352574, 8125245, 7875223, 7603939, 7314411, 7011103, 6699929, 6388552, 6085384, 5796952, 5526814, 5278017, 5055714, 4866044]
56935D866044j52559j12310o8938k6537J825q72m2803j14934j95179k61087l00787
56924C591863l15091l11676k98174k79650k59672k40631k22703k04620j86330
56915A273316j69569j55222j41758j27363j12255r7786q4397p1727n9892m9287
56905B04060l9666l0430k1471j3024n199J668O942J0724J4401J9179K4201K6783
56893A98168K4493J7120P087j969p812j1021j3348j4997j4757j2599j0395r443
56881A50527q857p220m589j847P73L533O367R185J2287J5740J8870K0827K0864
56868B36460J7978J1476K448o600j4061k0009k4347k6089k5335k4075k3479k2051
56856H2316j8188j3343j0547j0501j0988H790A231c940l792l488l659l600l174
$$ y = [4866044, 4713485, 4601175, 4532237, 4505700, 4507525, 4506653, 4463850, 4348916, 4153737, 3892650, 3591863, 3276772, 2965096, 2666922, 2387272, 2127600, 1886969, 1664266, 1459646, 1273316, 1103747, 948525, 806767, 679404, 567149, 469363, 384966, 313239, 253347, 204060, 164394, 133964, 112493, 99469, 94270, 95938, 102880, 113604, 128005, 147184, 171385, 198168, 222661, 239781, 246868, 244899, 237087, 226066, 212718, 197721, 182964, 170365, 159970, 150527, 141670, 134450, 129861, 128014, 128787, 132320, 138687, 147872, 160159, 175899, 194769, 215596, 236460, 254438, 265914, 268362, 261762, 247701, 227692, 203345, 177256, 151921, 127846, 104367, 82316, 64128, 50785, 40238, 29737, 18749, 8790, 1231, -3940, -7732, -11220, -14879, -18479, -21653]
56843b1653k726k311j728j341j700k157j319N19J199j04j350n65J421K921M327
56828b6567O955i410B807J2757J3106J3685J3681J2868J1822J0597R040Q153R202
56815A17718J1498J2935J2933J3061J4522J6647J8356J9648K1114K3004K5260
56804C06696K7679K9925L2108L5108L9391M3653M5644M4039L8598K9256J6642
56793F88739L246p700j4748j8586k0071j9335j6764j3291r340m726K88M913R017
56780E81642J3282J8174K3737L0213L7741M5703N3626O2031P0471P4896O9549
56769A081065N2454K7719J951k0137l6467m6525n1178n2298n1139m7607m1685
56758H16153l4510k7268k0127j3078o800j576L696J0280J7881K5223L1861L8372
$$ y = [-21653, -24379, -26690, -28418, -29759, -31459, -33616, -34935, -34416, -33217, -33321, -34671, -35236, -33815, -30894, -26567, -19612, -9410, 2807, 15564, 28670, 42355, 56036, 68904, 80726, 91323, 100363, 108516, 117718, 129216, 142151, 155084, 168145, 182667, 199314, 217670, 237318, 258432, 281436, 306696, 334375, 364300, 396408, 431516, 470907, 514560, 560204, 604243, 642841, 672097, 688739, 691985, 684285, 669537, 650951, 630880, 611545, 594781, 581490, 572150, 567424, 567712, 572625, 581642, 594924, 613098, 636835, 667048, 704789, 750492, 804118, 866149, 936620, 1011516, 1081065, 1133519, 1161238, 1163189, 1143052, 1106585, 1060060, 1008882, 956584, 905445, 857838, 816153, 781643, 754375, 734248, 721170, 714370, 712794, 716490, 726770, 744651, 769874, 801735, 840107]
56746H40107M4677M8850M7746L8855K2185J011j9581l5455m5198m9565m9986m7773
56734G95873m4008l9487l4702k9920k5146k0147j4998j0403o965m126n59M284
56722E69696R584J4204J7638J9656J9587J6253Q820k137j4059k3516k8655l0477
56710E76594l1200l1613l0835k8284k4867k2083k0646k0055j9071j6793j3754
56699C17393j1615j1174j1207j0125q138o650n980n123l579k045j189r97j459
56686B38112k699m178m852m363l251j996p51N7K1l98m08k05o20j523j902j548
56670B09496j278j373j200o25l55n70n38j0L09k0o00j105j424q80J054L024K693
56653B06598jk283k228j176j376k788l768l647k994k098p82O40J486J615J423
$$ y = [840107, 884784, 933634, 981380, 1020235, 1042420, 1043431, 1023850, 988395, 943197, 893632, 843646, 795873, 751865, 712378, 677676, 647756, 622610, 602463, 587465, 577062, 570097, 565971, 565412, 569696, 579280, 593484, 611122, 630778, 650365, 666618, 675438, 673301, 659242, 635726, 607071, 576594, 545394, 513781, 482946, 454662, 429795, 407712, 387066, 367011, 347940, 331147, 317393, 305778, 294604, 283397, 273272, 265134, 258484, 252504, 247381, 243802, 241757, 240568, 239571, 238112, 235413, 231235, 226383, 222020, 218769, 216773, 216022, 216079, 216100, 215702, 215294, 215089, 214469, 212946, 211044, 209496, 208218, 206845, 205645, 205020, 204665, 204095, 203557, 203547, 203856, 203836, 203236, 202131, 200707, 199827, 200881, 203905, 206598, 206597, 204314, 202086, 200910, 199534, 196746, 192978, 189331, 186337, 184239, 183457, 184097, 185583, 187198, 188621]
56638A88621J177R84R96J167J186J017R66R31M15m93j015j047j508k859m329n205
56622A81004n850o582o745n821m624m233m390l994k666r92M66J473J821J543J151
56607A41561J130J376J521J439J203R89J274K472L993M519L580K223J681J995
56593A70956K364K148J165k96j357j211k35K38l10r09m89Q71K513M122N520O312
56577A91402O286N675M740L655K843K644K630K170J541J394J324L94j001j610
56563B24087j605k381l621k999K02L249L381J342r1K87J591K701L047K276Q10
56548B32276MN64J369J078N7l52J66Q38J175J329J553K003K512K270O67j224j404
56531B44881J89J228L12j061j022kP68J675L513N235N159L597K187J359M71k49
$$ y = [188621, 189798, 190782, 191778, 192945, 194131, 195148, 196114, 197045, 197460, 196967, 195952, 194905, 193397, 190538, 186209, 181004, 175154, 168572, 161827, 156006, 151382, 147149, 142759, 138765, 136099, 135107, 135573, 137046, 138867, 140410, 141561, 142691, 144067, 145588, 147027, 148230, 149219, 150493, 152965, 156958, 161477, 165057, 167280, 168961, 170956, 173320, 175468, 176633, 176337, 174980, 173769, 173534, 173772, 173462, 172553, 172064, 172935, 175448, 179570, 185090, 191402, 197688, 203363, 208103, 211758, 214601, 217245, 219875, 222045, 223586, 224980, 226304, 226698, 225697, 224087, 222482, 220101, 216480, 213481, 213683, 216932, 220313, 221655, 221564, 221851, 223442, 226143, 229190, 231466, 232276, 232280, 232844, 234213, 235291, 235348, 234996, 235162, 236000, 237175, 238504, 240057, 242060, 244572, 246842, 247509, 246285, 244881, 245070, 246298, 246610, 245549, 244527, 244525, 245293, 246968, 250481, 255716, 260875, 264472, 266659, 268018, 268489, 268240]
56515B68240l0O34O13L05J118K946M181M311M484N211N431M541L711M215N566
56500C15477O249N731M952N060O127P169P350O906O561O227N193L615K677K939
56486C92233L629M070M492M791L964J749m42j458j977k887l393k437q44l58j233
56471C99899k466l764n533p294p779o546m407k487j748k691m530n299m008k029
56457C39318j335k147l323m101m123k940r53L6j173l363m510m337l829l256k387
56442B97577j766j998k435k123j272l49J176L390M510K971J8j985k789l567m003
56427B87355k807n60O99O73R77K194L174L404L621L865L155J589P11J289K427
56412C11766L252L770L928L394K568K359K885L696M977O940Q536Q552P584O993
$$ y = [268240, 268210, 268844, 269457, 269762, 270880, 273826, 278007, 282318, 286802, 292013, 297444, 301985, 305696, 309911, 315477, 321726, 327457, 332409, 337469, 343596, 350765, 358115, 365021, 371582, 377809, 383002, 386617, 389294, 392233, 395862, 399932, 404424, 409215, 413179, 414928, 414486, 413028, 411051, 408164, 404771, 402334, 401490, 401132, 399899, 397433, 393669, 388136, 380842, 373063, 366517, 362110, 359623, 357875, 355184, 350654, 345355, 341347, 339318, 337983, 335836, 332513, 328412, 324289, 321349, 320396, 320432, 319259, 315896, 311386, 307049, 303220, 299964, 297577, 295811, 293813, 291378, 289255, 287983, 287634, 288810, 292200, 296710, 299681, 299699, 297714, 294925, 291358, 287355, 284548, 283988, 284687, 285360, 286337, 288531, 291705, 295109, 298730, 302595, 305750, 307339, 308050, 309339, 311766, 315018, 318788, 322716, 326110, 328678, 331037, 333922, 337618, 342595, 349535, 358071, 366623, 374207, 381200]
56398C81200O350M231J267p0J113L106M235M443M073L255K780L631N070N080L024
56383D32788L69j412j977j353K05J520J520Q39P47Q32k55k220l615m468n920p382
56367D10218o946m778l348l828m838n252n623o164n812m195k419j228l41J4q75
56352C54585k352k836k409k560l245k878j467q61j445j619j162j807l607m162
56338C22175k705j601k104k029K82K751K795J233L62L39L5l31P6P70R31J138K098
56321C26215K930K520J436P53K50n76r10J20J597J913J071M23Q21K031L459M504
56305C48557M944N405O572P729P460N965M896M689M078K765K166K732L057K707
56291D13722L341N483O698M998K055Q31J635K550K567K314K496L151L923M258
$$ y = [381200, 387550, 391781, 393048, 392978, 394091, 397197, 401432, 405875, 409948, 413203, 415983, 419614, 424684, 429764, 432788, 433157, 431745, 429768, 428415, 428620, 430140, 431660, 432499, 433246, 434078, 433823, 431603, 427988, 423520, 417600, 410218, 403272, 398494, 395146, 391318, 386480, 381228, 375605, 369441, 363629, 359434, 357015, 355787, 355446, 355460, 354585, 352233, 349397, 346988, 344428, 341183, 338305, 336838, 335977, 334532, 332913, 331751, 329944, 326337, 322175, 319470, 317869, 315765, 313736, 314018, 316769, 319564, 320797, 321159, 321498, 321533, 321202, 321278, 322048, 322979, 324117, 326215, 329145, 331665, 333101, 333854, 334104, 333528, 332618, 332738, 334335, 336248, 337319, 337742, 338563, 340594, 344053, 348557, 353501, 358906, 365478, 373207, 380667, 386632, 391528, 396217, 400295, 403060, 405226, 407958, 411015, 413722, 417063, 422546, 429244, 434242, 436297, 437128, 438763, 441313, 443880, 446194, 448690, 451841, 455764, 460022]
56277D60022M047M341O023P722P106M564L103L928M904M438L910M633N368M929
56263E29038M706O127P864Q031P370P713Q905R571R611R733R644Q878Q241Q638
56249F44070R442R629R378R178Q732Q090Q269R393R894Q984Q020P877P079M456
56235G62491J663R60K126L643N171O854P726P082O115O310P462Q796J0448J2261
56221H49108J3026J2667J3211J5749J8478J9794K1052K3895K7085K8723K9706
56210A072494L2083L5542L8384M0645M3491M6761M9740N3219N8237O3905O8946
56199A603447P4242Q1194Q8686R4387R8484J03636J11542J21335J30844J37953
56189B645750J41643J43040J44319J45602J44555J39943J33105J24565J12266
$$ y = [460022, 464069, 468410, 474433, 482155, 489261, 493825, 496928, 500856, 505760, 510198, 514108, 518741, 524109, 529038, 533744, 539871, 547735, 555766, 563136, 570849, 579754, 589325, 598936, 608669, 618313, 627191, 635432, 644070, 653512, 663141, 672519, 681697, 690429, 698519, 706788, 716181, 726075, 735059, 743079, 750956, 758035, 762491, 764154, 765114, 767240, 770883, 776054, 782908, 790634, 797716, 803831, 810141, 817603, 826399, 836847, 849108, 862134, 874801, 888012, 903761, 922239, 942033, 963085, 986980, 1014065, 1042788, 1072494, 1104577, 1140119, 1178503, 1219148, 1262639, 1309400, 1359140, 1412359, 1470596, 1534501, 1603447, 1677689, 1758883, 1847569, 1941956, 2040440, 2144076, 2255618, 2376953, 2507797, 2645750, 2787393, 2930433, 3074752, 3220354, 3364909, 3504852, 3637957, 3762522, 3874788]
56180C874788R5398P6990N9863M2790K3752M418j2248k6475l9888n1211n7962
56169C990215o1158o4279o8285p1389p3074p4738p6782p8359p9808q2307q5480
56158C174556q7945q9850r2285r4790r5910r5559r4596r3010r0725q8950q8142
56147B162794q6072q0730p3920o9084o6561o3847n9572n4469m9336m4663m1284
56136A473256l9097l6201l1563k7038k4466k2830k0778j9524k0122k0307j7680
56125A193650j3985j2327j1955r919o295l601k372j328o87j249j414Q19L993N447
56111A138777O155R083J3693J6647J7299J8058J9680K0467K0078K0208K1489K3005
56099A344639K4616K6598K7813K7373K7015K8392K9565K7853K4707K3681K4975
$$ y = [3874788, 3970186, 4047176, 4107039, 4149829, 4173581, 4177999, 4165751, 4139276, 4099388, 4048177, 3990215, 3929057, 3864778, 3796493, 3725104, 3652030, 3577292, 3500510, 3422151, 3342343, 3260036, 3174556, 3086611, 2996761, 2904476, 2809686, 2713776, 2618217, 2523621, 2430611, 2339886, 2250936, 2162794, 2076722, 1995992, 1922072, 1852988, 1786427, 1722580, 1663008, 1608539, 1559203, 1514540, 1473256, 1434159, 1397958, 1366395, 1339357, 1314891, 1292061, 1271283, 1251759, 1231637, 1211330, 1193650, 1179665, 1167338, 1155383, 1145464, 1139169, 1135568, 1133196, 1131868, 1131181, 1129932, 1128518, 1129337, 1133330, 1138777, 1144932, 1154015, 1167708, 1184355, 1201654, 1219712, 1239392, 1259859, 1279937, 1300145, 1321634, 1344639, 1369255, 1395853, 1423666, 1451039, 1478054, 1506446, 1536011, 1563864, 1588571, 1612252, 1637227]
56088A637227K6161K6890K8462L0106L0311L0675L3878L9122M4257N0910O2187
56077B040186P6441Q8864R8723J09748J23968J40291J58542J79289J99927K16222
56067C432201K27607K35865K39087K32698K16601J96082J75501J56179J40010
56058E251831J29004J20375J07324Q5842N7079K3774j0691m0487o0510p2033q0810
56047E510698r0112j00377j14006j34020j58053j79626j95290k05306k08474k02841
56037C922593j90988j77907j63967j46502j27594j12762j02108r0432p6561o4861
56027B668911n6898m9376m1470l6519l4893l2625k8647k6238k5791k3437j8405
56016B294612j4509j2629r036k902J674K934L851N715O468O712R907J5093J7041
$$ y = [1637227, 1663388, 1690278, 1718740, 1748846, 1779157, 1809832, 1843710, 1882832, 1927089, 1977999, 2040186, 2116627, 2205491, 2304214, 2413962, 2537930, 2678221, 2836763, 3016052, 3215979, 3432201, 3659808, 3895673, 4134760, 4367458, 4584059, 4780141, 4955642, 5111821, 5251831, 5380835, 5501210, 5608534, 5694376, 5751455, 5775229, 5764538, 5724051, 5663541, 5591508, 5510698, 5420586, 5320209, 5206203, 5072183, 4914130, 4734504, 4539214, 4333908, 4125434, 3922593, 3731605, 3553698, 3389731, 3243229, 3115635, 3002873, 2900765, 2810333, 2733772, 2668911, 2612013, 2562637, 2521167, 2484648, 2449755, 2417130, 2388483, 2362245, 2336454, 2313017, 2294612, 2280103, 2267474, 2258438, 2255536, 2257210, 2260144, 2263995, 2269710, 2276178, 2282890, 2292797, 2307890, 2324931]
56003B324931J5197J4849J7830K0186K0580K2698K7266L0085L0276L2012L5897
55992B591807L7155L4874L4333L7461L9627L8756L8909M2002M4558M5543M8557
55981C033582N3587N5595N4157N5246O0651O5094O6682P0144P6626Q0699Q1049
55970C753112Q3700R0776R6619R9066J03742J12877J20744J24634J29503J37440
55960D852213J43690J47436J54761J66377J74651J77715J83932J97097K10270
55951F408142K19900K32547K51335K69255K82694K98039L18094L35874L48730
55942H964610L64256L85061M02804M14677M30098M53222M75521M94316N21109
55933A2905674N61685O05729O46856O94701P55476Q18887Q77014R38095J008777
$$ y = [2324931, 2340128, 2354977, 2372807, 2392993, 2413573, 2436271, 2463537, 2493622, 2523898, 2555910, 2591807, 2628962, 2663836, 2698169, 2735630, 2775257, 2814013, 2852922, 2894924, 2939482, 2985025, 3033582, 3087169, 3142764, 3196921, 3252167, 3312818, 3377912, 3444594, 3514738, 3591364, 3672063, 3753112, 3836812, 3927588, 4024207, 4123273, 4227015, 4339892, 4460636, 4585270, 4714773, 4852213, 4995903, 5143339, 5298100, 5464477, 5639128, 5816843, 6000775, 6197872, 6408142, 6628042, 6860589, 7111924, 7381179, 7663873, 7961912, 8280006, 8615880, 8964610, 9328866, 9713927, 10116731, 10531408, 10961506, 11414728, 11890249, 12384565, 12905674, 13467359, 14073088, 14719944, 15414645, 16170121, 16989008, 17866022, 18804117, 19812894]
55924A9812894J081067J149776J223578J305291J381437J445882J513365J595527
55916C0508817J685756J782358J901920K052831K221111K400270K607608K851827
55908D8012498L114713L387283L693377M054784M467257M936200N498006O176951
55900H3341069O961957P857723Q912504J0158710J1577796J3165116J4967032
55893A56941907J7002326J9220776K1609027K4259266K7253302L0564490L4110565
55886C30961659L7604925L9990795L9181125L3052907K1253493O015266r058096
55879D99002074k1111343k9137691l3540264l5190238l4926880l3458497l1300383
55872B80336778k8745932k5977123k3177262k0503458j8028056j5778951j3796430
$$ y = [19812894, 20893961, 22043737, 23267315, 24572606, 25954043, 27399925, 28913290, 30508817, 32194573, 33976931, 35878851, 37931682, 40152793, 42553063, 45160671, 48012498, 51127211, 54514494, 58207871, 62262655, 66729912, 71666112, 77164118, 83341069, 90303026, 98160749, 107073253, 117231963, 128809759, 141974875, 156941907, 173944233, 193165009, 214774036, 239033302, 266286604, 296851094, 330961659, 368566584, 408557379, 447738504, 480791411, 502044904, 508060170, 499002074, 477890731, 448753040, 415212776, 380022538, 345095658, 311637161, 280336778, 251590846, 225613723, 202436461, 181933003, 163904947, 148125996, 134329566]
55865A34329566j2103125j0663727r425280q367001p475578o709013o026055n424555
55857F8135232m916284m487373m112149l781388l488849l212831k938803k681050
55849C8516505k457450k260463k074006j899740j745091j603420j467404j345797
55841B3663134j246702j159466j071810r90058r24344q68575q12867p61807p22533
55832A5104972o87944o49038o11531n83401n57913n25652m92200m67265m46892
55823A0083136m22612l98607l83511l73763l60457l44923l33114l22173l06579
55814F837397k90365k79655k70068k54549k36840k24209k13632j98244j81280
55805D688555j70673j65195j58298j50587j46525j43533j36040j26188j19547
$$ y = [134329566, 122226441, 111562714, 102137434, 93770433, 86294855, 79585842, 73559787, 68135232, 63218948, 58731575, 54619426, 50838038, 47349189, 44136358, 41197555, 38516505, 36059055, 33798592, 31724586, 29824846, 28079755, 26476335, 25008931, 23663134, 22416432, 21256966, 20185156, 19195098, 18270754, 17402179, 16589312, 15827505, 15104972, 14417028, 13767990, 13156459, 12573058, 12015145, 11489493, 10997293, 10530028, 10083136, 9660524, 9261917, 8878406, 8504643, 8144186, 7799263, 7466149, 7143976, 6837397, 6547032, 6267377, 5997309, 5742760, 5505920, 5281711, 5068079, 4869835, 4688555, 4517882, 4352687, 4194389, 4043802, 3897277, 3753744, 3617704, 3491516, 3371969]
55796C371969j14448j05934r5974q9469q4362p5823o6023n9965n6055n0694m7744
55785B525478n2949o2694o8534o9690p1075p2277o8660o1135n5137n1543m7274
55774A844510m2894m1145l9897l4848k7536k2923k1037j8439j5837j6578j9512
55763A543864k0815k1052k3380k6761k7965k8224l0794l4005l3804l1278l0518
55752A235268l0883k8558k4260k2314k3097k3026k1115j9335j7483j3748r434
55741A002015p584p818p532o644o226m660m26L515L579J535J179J595m21l773
55727I68334n087n054o499q329p790o703q690j1988j1874q857p554q470p972n819
55713H57648n817q821j1497j2470j3848j6240j7627j7560j7614j7511j5492j2351
$$ y = [3371969, 3257521, 3151587, 3055613, 2966144, 2881782, 2805959, 2739936, 2679971, 2623916, 2573222, 2525478, 2472529, 2409835, 2341301, 2271611, 2200536, 2128259, 2059599, 1998464, 1943327, 1891784, 1844510, 1801616, 1760471, 1720574, 1685726, 1658190, 1635267, 1614230, 1595791, 1579954, 1563376, 1543864, 1523049, 1501997, 1478617, 1451856, 1423891, 1395667, 1364873, 1330868, 1297064, 1265786, 1235268, 1204385, 1175827, 1151567, 1129253, 1106156, 1083130, 1062015, 1042680, 1025197, 1011449, 1002015, 994431, 986613, 979081, 972437, 966211, 961551, 961125, 964640, 968219, 969754, 970933, 972528, 972107, 968334, 963247, 958193, 951694, 943365, 935575, 928872, 920182, 908194, 896320, 887463, 879909, 871439, 863467, 857648, 851831, 843010, 831513, 819043, 805195, 788955, 771328, 753768, 736154, 718643, 703151, 690800]
55701F90800j0584r990q678p608r257j2366j3096j1023r219q792q171p251p473
55688E67292q169p596p055r293j3340j5617j5614j5691j5960j4463j1856j0794
55676D21844j0879r283o241m847n444n217l513k539k660j906o12j591n031p685
55662C54396p872p089o247m478k201j237j407q94j64j470m279n378l964k544k386
55647C02786j929k45J648L278N088O220N371L626K956K521K35k788l706l072l776
55632C18213n389m612j250J362K117L155M822M844L381L589O029P452O610O317
55618C56640Q140R552Q300N525K758l04l418m940m884n332o645o768n288m214
55604C49122l891k380%J61k158k870K39M063N235M580M086L345J880J441L009
$$ y = [690800, 680216, 670226, 661548, 653940, 644683, 632317, 619221, 608198, 598979, 590187, 582016, 574765, 567292, 559123, 551527, 544472, 535179, 521839, 506222, 490608, 474917, 458957, 444494, 432638, 421844, 410965, 401682, 395441, 390594, 385150, 379933, 376420, 373881, 371221, 369315, 368703, 367112, 362081, 354396, 346524, 339435, 333188, 328710, 326509, 325272, 323865, 322971, 322807, 321337, 317058, 311680, 307716, 305172, 302786, 300857, 300612, 302260, 305538, 310626, 316846, 322217, 325843, 328799, 331320, 331555, 328767, 325061, 321989, 318213, 312824, 308212, 306962, 308324, 310441, 313596, 318418, 323262, 326643, 330232, 336261, 343713, 350323, 356640, 364780, 374332, 382632, 388157, 390915, 390611, 387193, 382253, 377369, 372037, 365392, 358624, 353336, 349122, 345231, 342851, 342851, 343012, 340854, 337984, 338223, 342286, 347521, 352101, 356187, 359532, 361412, 362853, 365862]
55589C65862M335L310J221K51J62k56q15j162k111l818m856m818n428p432q916
55574C35529q540p921q790j0223j0708j0686j1012j0946r662p995o922o040n005
55561B21079m626n195n581n267n269n834n520l866k738l467m846n358n324n272
55547A52916m421k411o36k57n25m74l88m15L18J871K642J702K05n63p72q18m81
55530A47493k17j077k442k191j20J338Q82J91O49J111O51P35K502M300M262L375
55514A61442L645M849N364M993N036O475R357J2880J5164J4573J2169J1014J2067
55501B79028J2815J1131Q069N419K803p38m374o705p901q743r024q506q159q917
55487B56198j0355j1681j2577j2335j0173p272o234p244p384n125k802k669l283
$$ y = [365862, 370197, 373507, 374728, 374979, 375141, 374885, 374070, 372908, 370797, 366979, 362123, 357305, 351877, 344445, 335529, 326989, 319068, 310278, 300055, 289347, 278661, 267649, 256703, 247041, 239046, 232124, 226084, 221079, 216453, 211258, 205677, 200410, 195141, 189307, 183787, 179921, 177183, 173716, 168870, 163512, 158188, 152916, 148495, 146084, 145448, 145191, 144666, 144192, 143804, 143389, 143707, 145578, 148220, 149922, 150127, 149564, 148792, 147974, 147493, 147276, 146199, 143757, 141566, 141446, 142784, 143666, 143857, 144506, 145617, 146268, 147003, 149505, 153805, 158067, 161442, 165087, 169936, 175300, 180293, 185329, 191804, 201161, 214041, 229205, 243778, 255947, 266961, 279028, 291843, 302974, 311043, 316462, 319265, 318527, 314153, 307448, 299547, 290804, 281780, 273274, 265115, 256198, 245843, 234162, 221585, 209250, 199077, 191805, 185571, 178327, 170943, 165818, 163016, 160347, 157064]
55474A57064k280l51M89O58J886L637L691J734j88m99O16K294L724M266M186M604
55458A85531N594N547L617J377N09J63j536m491o902p662o927n230l545l403n361
55443A57281p970r460r640r234q388p019n589m397l131j912j543j948j928j277
55429H3845j294k184k112k75J215L37j874l259l581l660l180j727o03j186k541
55414E7921k825k133j897k328k442j921j208n26k80j363l500m523l059o81L72
55399B9607K71M00N40l01j334r41M38Q15k03j040q09l37n07j135j571j239J22
55382B2776J728J948M26r16l27J276J846J184O33P04Q77J059J373J050n27k119
55366C2991j755N95K943L693K801J109k48k43R04J602R35PN3L83k10j056o12R71
$$ y = [157064, 154784, 154433, 154922, 155580, 157466, 161103, 164794, 166528, 166340, 165841, 166457, 168751, 172475, 176741, 180927, 185531, 191125, 196672, 200289, 201666, 202175, 202338, 200802, 196311, 189409, 181747, 174820, 169590, 166045, 162642, 157281, 149311, 139851, 130211, 120977, 112589, 105570, 99981, 95584, 92453, 90541, 88998, 87050, 85122, 83845, 82551, 80367, 78255, 77980, 79195, 79532, 77658, 74399, 70818, 67158, 63978, 62251, 61648, 60462, 57921, 55096, 52963, 51066, 48738, 46296, 44375, 43167, 42641, 42361, 40998, 37498, 32975, 29916, 29235, 29607, 29878, 30278, 30818, 30517, 29183, 28242, 28680, 29495, 29292, 28252, 27443, 27106, 26599, 25464, 23893, 22654, 22776, 24504, 26452, 26878, 25962, 25635, 26911, 28757, 29941, 30574, 31278, 32155, 33214, 34587, 35637, 35110, 32991, 31236, 31831, 34774, 38467, 41268, 42377, 42129, 41886, 42790, 44392, 45327, 45334, 45387, 45770, 45560, 44504, 43892, 44863]
55348D4863K133K214J809J302P25N30R86J311Q45L76Q47J566J269K03o08j237
55332E9134k247k978k488j540j654k625k824j725k71Q16J418J177j4j004n84O55
55316D3246J191P75J82n04j666k713k711j923j067J96K275L893L468J594J42m89
55300D5889j177j788j463o97o57q83l5J305J194m39j709j903k111k500j805K1
55284C1242J085L54j096k191l011l237j813P84K245J541L98N09J129Q51m5m76
55268B8269n18q94j412j290m61M69J162J659J977K082J878J067m42j919k389j849
55252B7389j126o45k34M9n6k64j40p3o34j269r33J41Q66J228K125L326L514K493
55234C5757J445P22n29k087k202l52J536J777J138R76Q56l85k333l375k759r69
$$ y = [44863, 46996, 49210, 51019, 52321, 53046, 53576, 54562, 55873, 56718, 57094, 57941, 59507, 60776, 60979, 60371, 59134, 56887, 53909, 51421, 49881, 48227, 45602, 42778, 41053, 40782, 41598, 43016, 44193, 44179, 43175, 42591, 43246, 44437, 45212, 45394, 44890, 43224, 40511, 37800, 35877, 34810, 35006, 37281, 41174, 44642, 46236, 46378, 45889, 44712, 42924, 41461, 40764, 40107, 39224, 39189, 40494, 41688, 41249, 39540, 37637, 35526, 33026, 31221, 31242, 32327, 32681, 31585, 29394, 26383, 23146, 21333, 22117, 24362, 25903, 26301, 26810, 27939, 28790, 28745, 28269, 27751, 26857, 25445, 24155, 23694, 24163, 25325, 26984, 28961, 31043, 32921, 33988, 33546, 31627, 29238, 27389, 26263, 25618, 25384, 25433, 25377, 25113, 24973, 24900, 24266, 22997, 22064, 22205, 23071, 24299, 26424, 29750, 33264, 35757, 37202, 37924, 37395, 35308, 33106, 32754, 34290, 36067, 37205, 38181, 39037, 38652, 36319, 32944, 30185, 29216]
55218B9216J235K997L314K014L95j74J56M01L96N47M19r52l251m648l913j915
55202B6237m23l0RK85M83K99K20P97J687K134K107K031J738P23o26j340j474j972
55184C2885k641j984J24J416K46j922k639j781q63j89J064K549K837J773P42M53
55168C2070K00m20p28k92L28N96O55P06P33R83J772K709K922K135P87n82j414
55151D3160j151j7P73O18M36R34J018l54j808j195R86K143J357K04k01n43j196
55134D5164j088L22J705J601L27q16j217j163j089j120r80k87N51K99j389k955
55118C7865k794j514p99p88l03P75J423J442J496J371L11j000j065j92k59j509
55102C4460k021q81L47J97p02j110r26m74L57J409J918J644J163O92m5o84l93
$$ y = [29216, 30451, 33448, 36762, 38776, 39171, 38997, 39153, 39554, 39950, 40497, 40916, 39964, 36713, 32065, 28152, 26237, 25814, 25784, 25793, 26078, 26561, 26860, 27080, 27877, 29564, 31698, 33805, 35836, 37574, 38297, 37671, 36331, 34857, 32885, 30244, 28260, 28384, 29800, 30046, 28124, 25485, 23704, 22841, 22652, 23716, 26265, 29102, 30875, 31617, 32070, 32270, 31850, 31122, 30830, 31158, 31754, 32409, 33115, 33848, 34831, 36603, 39312, 42234, 44369, 45156, 44574, 43160, 42009, 41992, 42765, 43383, 43819, 44753, 45771, 45417, 43609, 42414, 43400, 45543, 46900, 47104, 46903, 46360, 45164, 44076, 44398, 46103, 47704, 48031, 47215, 45998, 44835, 43746, 42626, 41646, 41359, 41910, 42209, 40820, 37865, 35071, 33557, 32758, 31970, 31667, 32442, 33865, 35307, 36803, 38174, 38485, 37485, 36420, 36228, 35969, 34460, 32439, 31558, 31905, 32102, 31400, 30290, 29364, 28890, 29247, 30656, 32574, 34218, 35381, 36073, 36028, 35344, 34951]
55085C4951O08J288J524J904J868L17j847k183l15J246P59n87j041o45j09O63
55069C8401J588J713P55p2K01J106J869K271J906M80o80M67L517N537N002L522
55053F7583K732K012O81q6O20J477R86j95o82n16k67K53Q96M66j255k427j729
55036G0549k98L84O72J125P33j113k687k251q08k92m11L41J744K383K130J888
55020G4089J644Q82J48J87K83n30j487j197QP65J001J555K143J677K15j156j872
55003G8355j955j260j16K58m77p68M50J692J195j08l06K09k02j047m13J471K387
54986G9365J754J216J542J613R29N97J141J467P23m91j324j560j112j62K97l69
54970H5626p47J112M478O348N319L070J475L96q78j955k246k196k495k961k994
$$ y = [34951, 35559, 36847, 38371, 40275, 42143, 42460, 40613, 38430, 38115, 39361, 40120, 39533, 38492, 37847, 37738, 38401, 39989, 41702, 42457, 42385, 42586, 43692, 45561, 47832, 49738, 50218, 49538, 50005, 53522, 59059, 64061, 67583, 70315, 72327, 73008, 72922, 73542, 75019, 76005, 75810, 75128, 74612, 74345, 74598, 75494, 75960, 74705, 72278, 70549, 70251, 70635, 71307, 72432, 73165, 72052, 69365, 67114, 66306, 66014, 65603, 65944, 67688, 70071, 72201, 74089, 75733, 76615, 76763, 76950, 77233, 76703, 75216, 74019, 74027, 74792, 75793, 77348, 79491, 81168, 81383, 80227, 78355, 76400, 75140, 75024, 75282, 74805, 74037, 74487, 76179, 77374, 77266, 76960, 77169, 76967, 75920, 75507, 76978, 79365, 81119, 82335, 83877, 85490, 86419, 87016, 88157, 89624, 90347, 89856, 88532, 86972, 85860, 85698, 85995, 85626, 84879, 85991, 90469, 96817, 102136, 105206, 106681, 107077, 106199, 104244, 101998, 99802, 97307, 94346, 91352]
54955I1352k414j384k07O32R89J527K771L910L707K443J640J874K211J882J254
54940A12187R35J028J353J436N64j143k181j441P5P16O34Q84R03o78l017l602
54924A08653k069q02j158j764j462j319k326l251k639j175l82l07r8K48L02M63
54908I0914J277K225K491K345K685L648M619N082M750L470J822J159K153L849
54894A32489M782M576L948L809M831P005R079R342P685O036O165P915J0185J2386
54880B30233J4145J4804J4486J4584J5681J5919J3139Q094L718J354m87l438p126
54867C35106j0362j2962j5346j7223j7841j7196j6019j4719j3097j1059q963p112
54855A73207n488m176l476l190k374n15J430K006J235O57J318K675L865M948O168
$$ y = [91352, 88938, 87554, 87347, 87979, 88968, 90495, 93266, 97176, 100883, 103326, 104966, 106840, 109051, 110933, 112187, 113122, 114150, 115503, 116939, 117503, 116360, 114179, 112738, 112813, 113529, 114163, 115047, 115950, 115272, 112255, 108653, 106584, 105782, 104624, 102860, 101398, 100079, 97753, 94502, 91863, 90688, 90306, 89999, 89901, 90149, 90451, 90914, 92191, 94416, 96907, 99252, 101937, 105585, 110204, 115286, 120036, 123506, 125328, 126487, 128640, 132489, 137271, 141847, 145795, 149604, 154435, 161440, 170519, 179861, 187546, 193582, 199747, 207662, 217847, 230233, 244378, 259182, 273668, 288252, 303933, 319852, 332991, 341085, 344803, 346157, 345670, 342232, 335106, 324744, 311782, 296436, 279213, 261372, 244176, 228157, 213438, 200341, 189282, 180319, 173207, 167719, 163543, 160067, 156877, 154503, 153988, 155418, 157424, 158659, 159316, 160634, 163309, 167174, 172122, 178290]
54840A78290P086P542Q592J1125J3981J4983J3691J1799J0673R886Q436O128L271
54827C05483K1l294o084q329j0750j3577j5710j5849j4120j2080j1176j1472j1688
54814A71375j0475p919n657n115n835o196n558m710m165l257j456L30O71n62k007
54799A09464k290j197M24J511J528O25o45j613j641n54Q64J261K09j138j486j060
54783A04262j019j688k268k158j518p10j09l75j792l258l161j434L32R96R50P53
54767H7803J03j159k152k031j217n99j41P72K017K719K464J725J085O06J53j37
54751I2011OM36N82J74j13O37K231L349L323L136L906N105N366M616M045M217
54735A33027M542M763N490O865P945Q037P760Q197R677J1783J3820J4989J4881
$$ y = [178290, 185376, 192918, 201510, 212635, 226616, 241599, 255290, 267089, 277762, 287648, 296084, 302212, 305483, 305504, 302210, 296126, 287797, 277047, 263470, 247760, 231911, 217791, 205711, 194535, 183063, 171375, 160900, 152981, 147324, 142209, 136374, 130178, 124620, 119910, 115745, 112488, 111032, 111362, 112033, 111471, 109464, 107174, 105977, 106401, 107912, 109440, 110065, 109420, 107807, 106166, 105612, 106476, 107737, 107946, 106808, 105322, 104262, 103243, 101555, 99287, 97129, 95611, 94901, 94792, 94417, 92625, 89367, 86206, 84772, 85104, 86100, 87050, 87803, 87906, 86747, 84595, 82564, 81347, 80748, 80607, 81379, 83396, 86115, 88579, 90304, 91389, 91995, 92148, 92011, 92017, 92453, 93035, 93209, 93096, 93733, 95964, 99313, 102636, 105772, 109678, 114783, 120149, 124765, 128810, 133027, 137569, 142332, 147822, 154687, 162632, 170669, 178429, 186626, 196303, 208086, 221906, 236895, 251776]
54722B51776J4152J4061J4968J5945J5821J3862R582L254l217p394q824r222r802
54709C14962r937r204q872r961j1208j0671q418n985m028k220q51m78k49J434
54695B34314M314O189O020N402O141P726Q532Q461Q902J0526J2509J3981J5027
54682C48044J5953J6455J6115J5060J3557J1344Q016L753r20n834j0868j5058
54670D15617j7101j7041j6584j7145j8360j9014j8666j7632j6099j4192j2433
54659B31350j1154r873q187o714o154n885m862l503l179l970m598m577m732n250
54645A48712n024l560j909j000o32q69k480m647m320m5N000O326L736J047M99
54630A40834M51q70k141j353O29J232mj062o08M95J258K136L576M411L390J567
$$ y = [251776, 265928, 279989, 294957, 310902, 326723, 340585, 350167, 353421, 350204, 342810, 333986, 324764, 314962, 305025, 295821, 286949, 276988, 265780, 255109, 246691, 240706, 236678, 234458, 233607, 233129, 232880, 234314, 238628, 244817, 250837, 256239, 262380, 270106, 278638, 287099, 296001, 306527, 319036, 333017, 348044, 363997, 380452, 396567, 411627, 425184, 436528, 444544, 448297, 447377, 441543, 430675, 415617, 398516, 381475, 364891, 347746, 329386, 310372, 291706, 274074, 257975, 243783, 231350, 220196, 210323, 202136, 195422, 189268, 183383, 178521, 175018, 171839, 167869, 163271, 158694, 153962, 148712, 143688, 140128, 138219, 137219, 136587, 135718, 133238, 128591, 124271, 124226, 129226, 135552, 139288, 140335, 140834, 141285, 140415, 138274, 136921, 137550, 138782, 138778, 137716, 137108, 137603, 138861, 140997, 144573, 148984, 152374, 153941]
54614A53941J385L263M729L633R99l43P83K928M245M428M320M474M639M276L202
54599B00902J852R92J076J922L015L948M461M361L716K849K094J793K522M591
54585B40094P081Q310P847P211P846R260J0211J0947J2736J5536J7596J7505J5578
54572C87758J3061J0835Q982O835L423j319n984r080j0780j2352j4196j5519j5775
54559C45889j5293j4487j3457j2318j1005r071o686n310n970p273o891m754k963
54546B30411k589k670k583l132m382m645l000j256j746m196o177o072m447k966
54532A80550k786l749m694m768m395m419m570l891k525j677j763k063k300k857
54518A34093l261k329l56P10N2r45j115j125j618j751q66P7J75J06N97R29M39
$$ y = [153941, 155326, 158589, 163318, 166951, 167950, 167607, 168390, 171318, 175563, 179991, 184311, 188785, 193424, 197700, 200902, 202754, 203746, 204822, 206744, 209759, 213707, 218168, 222529, 226245, 229094, 231188, 232981, 235503, 240094, 247175, 255485, 263332, 270543, 278389, 287649, 297860, 308807, 321543, 337079, 354675, 372180, 387758, 400819, 411654, 420636, 427471, 430894, 429575, 423591, 414511, 403731, 391379, 377183, 361664, 345889, 330596, 316109, 302652, 290334, 279329, 270258, 263572, 258262, 252292, 245019, 238128, 233374, 230411, 227822, 225152, 222569, 219437, 215055, 210410, 207410, 206154, 204408, 200212, 194035, 187963, 183516, 180550, 177764, 174015, 169321, 164553, 160158, 155739, 151169, 147278, 144753, 143076, 141313, 139250, 136950, 134093, 130832, 128503, 128147, 128857, 128909, 127964, 126849, 125724, 124106, 122355, 121489, 121566, 121741, 121847, 122444, 123373, 123812]
54501A23812NL55N02l75r39L98K658L522K557J312Q83J149J794K407K107O86m80
54484A42353j46R53J506J885L122M480M252K602J538K065L189L838M164M773N872
54469A86446P221Q076P657O474O289P624Q520P271N112M078L523J305k335m952
54455B52309n679o049o947p523p395p429p629o713m570l020l198m167m823n304
54441A71863n616m865k900j116n42o47p85j285k192k571k042j455j160j98J707
54426A46196L044K748J963K079K480J840M81k53p4M24J245K577L555L096J693
54411A73094Q61J133J751K157K469K703K694K636K618J925j2k228l055k302j262
54396A85182n71N13K311L565K893N08k134l766l834k437n05M94m8j178j690j743
$$ y = [123812, 123817, 124172, 124674, 124299, 123360, 123758, 126416, 129938, 132495, 133807, 134690, 135839, 137633, 140040, 142147, 142833, 142353, 142207, 143160, 144666, 146551, 149673, 154153, 158405, 161007, 162545, 164610, 167799, 171637, 175801, 180574, 186446, 193667, 201743, 209400, 215874, 222163, 229787, 238307, 245578, 250690, 254768, 258291, 259596, 257261, 252309, 246630, 240581, 233634, 226111, 218716, 211287, 203658, 196945, 192375, 189355, 186157, 181990, 177167, 171863, 166247, 161382, 158482, 157366, 156824, 156177, 155392, 154107, 151915, 149344, 147302, 145847, 144687, 144489, 146196, 149240, 151988, 153951, 156030, 158510, 160350, 160831, 160578, 160504, 160928, 162173, 164750, 168305, 171401, 173094, 173955, 175088, 176839, 178996, 181465, 184168, 186862, 189498, 192116, 194041, 194029, 191801, 188746, 186444, 185182, 184611, 185124, 187435, 191000, 193893, 194401, 192267, 188501, 184667, 182230, 181725, 182219, 182171, 180993, 179303, 177560]
54380A77560k266l059k837j343j88p56k319l184l000k604k062n35J782L202K803
54365A61194J701J113M35j403l477l648j533Q44J703J417J370J960K489K350J633
54350A68148Q60O25J255K464L507L882L759L658L789L901L735L605M224N645O743
54335B19800O452N409N222N885N366K634l58j154j82J46q34j425o63M4q93l090
54319B42359n169o616p590p831o867m993l161k074j815k129k493k264j201J07
54305A88263O32j29j566k312j534M9P61p2j300j405k73J057J792J763J064K28
54289A87018K13J172J722Q12l15N19L160N059M527K494P18r4R4J269K691K925
54273B13984J537k84j466k304l187l420k566j854k676m312m693l291j817j928
$$ y = [177560, 175294, 172235, 169398, 168055, 167867, 167111, 164792, 161608, 158608, 156004, 153942, 153407, 155189, 158391, 161194, 162895, 164008, 164443, 163040, 159563, 155915, 154382, 155226, 156929, 158346, 159716, 161676, 164165, 166515, 168148, 169008, 169633, 170888, 173352, 176859, 180741, 184500, 188158, 191947, 195848, 199583, 203188, 207412, 213057, 219800, 226252, 231661, 236883, 242768, 248134, 250768, 250410, 249256, 249074, 249220, 248386, 246961, 246298, 246342, 245449, 242359, 237190, 230574, 222984, 215153, 208286, 203293, 200132, 198058, 196243, 194114, 191621, 189357, 188156, 188263, 188895, 188766, 187200, 184888, 183354, 183403, 184164, 184092, 182792, 181387, 181114, 182171, 183963, 185726, 186790, 187018, 187231, 188403, 190125, 190937, 190622, 191141, 194301, 199360, 203887, 206381, 207099, 207005, 207099, 208368, 211059, 213984, 215521, 215237, 213771, 211467, 208280, 204860, 202294, 200440, 197764, 193452, 188759, 185468, 183651, 181723]
54259A81723l387m882n650n738n246m224l110k560k536k135q82K15l06k225l616
54244A35441l306k332k228k914l283l030k545j747n34J13q44k611l379k832k142
54229A01827j620m31J129J390R4p59L1Q31k22k214k762j305N72J413R87k96j639
54212I7026j832l39J754K764K279J312Q77J062J214M93j379l384l870k454o52
54197I4871j5l29l79L23J394K411K919K276N92p57o36K58M04l29p44l37J06%k04
54178A01824rK87K63J46L30N78K50p18j429q35J065K912L203J811M9q15o56q7
54160A08169L78M47%o95j063q83n70m63l56o4J05r0k88p8K70J58m47r34p59L8
54140A02875R34J382J348J259J232O98n87j563j024L86O66q06k372k507j758j458
$$ y = [181723, 178336, 173454, 167804, 162066, 156820, 152596, 149486, 146926, 144390, 142255, 141373, 141588, 141282, 139057, 135441, 132135, 129803, 127575, 124661, 121378, 118348, 115803, 114056, 113522, 113635, 112791, 110180, 106801, 103969, 101827, 100207, 99776, 100905, 102295, 102389, 101630, 101661, 102492, 102270, 100056, 97294, 95989, 96561, 97974, 98961, 98665, 97026, 95194, 94855, 96609, 99373, 101652, 102964, 103841, 104903, 106117, 106610, 105231, 101847, 97977, 95523, 94871, 94856, 94527, 94148, 94471, 95865, 98276, 101195, 103471, 104063, 103306, 102670, 102928, 103332, 103003, 102259, 101922, 102028, 102028, 101824, 101815, 102102, 102365, 102511, 102841, 103419, 103669, 102951, 101522, 100687, 101752, 104664, 107867, 109678, 109727, 108912, 108256, 108169, 108547, 108994, 108994, 108299, 107236, 106353, 105783, 105320, 104964, 104900, 105005, 104915, 104627, 104549, 104819, 104977, 104530, 103596, 102837, 102875, 103809, 105191, 106539, 107798, 109030, 109728, 109141, 107578, 106554, 106940, 107606, 106800, 104428, 101921, 100163, 98705]
54124I8705j699j721j437j284j070k87O35M80j126k975l352j615J082K686K108
54109H9130L22q67r69q70r27l48J105K324K493K212K101J572K39o68K6J222P91
54092I8888j335l048k967j892j168j034r96q82q19q42q94q95n54M14J777K755
54076H6508K775K063J405J249J083%j897l071k297m52M57r9p93p83q41j613k224
54059H1470j649k92P80J279J364Q70k6k49Q98K406K635J116j347l743n159m944
54043G5409l525k263j697q30R15K332K321J810K192K877K348Q53O1M29Q46P74
54027H4852Q48J307J505J138O31J64m12p33j99Q73J625J970K368K504J634J19
54011A00194p91o83j34O77J979L022K553Q82q4N51J517J397M68k07l15n3O59J939
$$ y = [98705, 97006, 95285, 93848, 92564, 91494, 91207, 91842, 92322, 91196, 88221, 84869, 83254, 84336, 87022, 89130, 89452, 88585, 87616, 86746, 85819, 85471, 86576, 88900, 91393, 93605, 95706, 97278, 97517, 96849, 96875, 98097, 98888, 97553, 94505, 91538, 89646, 88478, 87444, 86448, 85566, 84747, 83905, 83011, 82116, 81562, 81976, 83753, 86508, 89283, 91346, 92751, 94000, 95083, 95083, 93186, 90115, 87818, 87366, 87823, 87724, 86931, 86148, 85307, 83694, 81470, 79821, 79529, 80309, 81588, 82952, 83822, 83796, 83547, 84445, 86851, 89486, 90602, 89255, 85512, 80353, 75409, 71884, 69621, 67924, 67094, 68009, 70341, 72662, 74472, 76664, 79541, 81889, 82742, 82803, 83232, 84078, 84852, 85700, 87007, 88512, 89650, 90281, 90445, 90033, 89300, 89101, 89974, 91599, 93569, 95937, 98441, 100075, 100194, 99403, 98720, 98586, 99263, 101242, 104264, 106817, 107699, 107615, 108166, 109683, 111080, 111548, 111341, 111026, 110973, 111632, 113571]
53993A13571L333M139M018L133K040J443J452J198j21j832k168j45L466O916Q595
53978A49038P720M865J760l2k35O31K088L476L813L093K961M759P533R273R512
53963B10255R197Q693P722O865P146Q104Q066O454M280K503J420J469K689L500
53949B88363K144n03j604k63J349J227j22j289j959k406k613k878l812n004n109
53934B65521l924k900k916l090k551j834j655j715j644j790k346k972l826n466
53920B26892p152p011m703k311j578j947k243k489k915k887k120j459j187j65
53906A86725J933L279K361L90n84m80m50n24J1Q55J183J237J724K298K142J471
53890B03571R94O64K49L89J578K905L271L182L777M918N617N673N399M641L580
$$ y = [113571, 116904, 121043, 125061, 128194, 130234, 131677, 133129, 134327, 134206, 132374, 130206, 130061, 133527, 140443, 149038, 156758, 161623, 163383, 163351, 163116, 163747, 165835, 169311, 173124, 176217, 179178, 183937, 191470, 200743, 210255, 219452, 228145, 235867, 242732, 249878, 257982, 266048, 272502, 276782, 279285, 280705, 282174, 284863, 288363, 290507, 290004, 288400, 288137, 289486, 290713, 290591, 289302, 287343, 284937, 282324, 279446, 275634, 270630, 265521, 261597, 258697, 255781, 252691, 250140, 248306, 246651, 244936, 243292, 241502, 239156, 236184, 232358, 226892, 219740, 212729, 208026, 205715, 204137, 202190, 199947, 197458, 194543, 191656, 189536, 188077, 186890, 186725, 188658, 191937, 194298, 194688, 194104, 193624, 193174, 192650, 192661, 193516, 194699, 195936, 197660, 199958, 202100, 203571, 204565, 205229, 205478, 205867, 207445, 210350, 213621, 216803, 220580, 225498, 231115, 236788, 242187, 246828, 250408]
53875B50408L569N348P359P774P257P604Q403P611N121L140K770K743J917Q84
53861C21908L03k39p83j59K179M809N939N551M981N128N823O468O671O546O580
53846C81705P028P455P435P310P576P762P018N609M795N037N371M762L242J523
53832D63628Q0j137k566m510o442p221o552n624n611o233o715p276q382r310r045
53817C77084q037p512p564p609q189j0032j1632j0317o215k833k824n116p151
53804B82053q015q160p777p023o655p045p339o595m979l073j040O36Q03q86l027
53789B11878m124m343m550m551l535j631J47J116J143K27j159k020j993j975k542
53774A82088k647j149R64J456k91k669l924l660k358p20M03N30K64N54J305J574
$$ y = [250408, 253977, 259325, 266684, 274458, 281715, 289319, 297722, 305333, 310454, 313594, 316364, 319107, 321024, 321908, 322211, 321972, 321189, 321030, 323209, 328018, 333957, 339508, 344489, 349617, 355440, 361908, 368579, 375125, 381705, 388733, 396188, 403623, 410933, 418509, 426271, 433289, 438898, 443693, 448730, 454101, 458863, 462105, 463628, 463708, 462571, 460005, 455495, 449053, 441832, 435280, 429656, 424045, 417812, 411097, 403821, 395439, 386129, 377084, 369047, 361535, 353971, 346362, 338173, 328141, 316509, 306192, 299977, 297144, 294320, 289204, 282053, 274038, 265878, 258101, 251078, 244423, 237378, 230039, 223444, 218465, 215392, 214352, 214988, 215791, 214905, 211878, 207754, 203411, 198861, 194310, 190775, 189144, 189291, 190407, 191550, 191777, 190618, 188598, 186605, 184630, 182088, 179441, 178292, 179256, 180712, 180421, 177752, 173828, 170168, 167810, 167090, 167493, 168023, 168287, 168841, 170146, 171720]
53758A71720J092N30L22L03N59J442K511K704J921J334J681K324K523K546K925
53743A96437L566M267N173O044O132N520N392O103O180M664L134L648N537O422
53729B68219N882N716O559O854N919N522O971Q637Q235O152M584M322M342L954
53715C51868L380K472O18j911m066n470o471o761n569l506k561l678n552o512
53701C06281o383n911n422m888m430l970l139k123j812k549l486l807l739l766
53687B50856l727l389l125l156k894j965j144j339k183k586k207j498q27m02o14
53672B19800j447k049j763j148j081j313j023l52j49m43l01P93K434M057N181
53657B21196N078L377J095o6L50J175J347J083J087J574K415L464M308M309L396
$$ y = [171720, 172812, 173342, 173664, 173967, 174526, 175968, 178479, 181183, 183104, 184438, 186119, 188443, 190966, 193512, 196437, 200003, 204270, 209443, 215487, 221619, 227139, 232531, 238634, 244814, 249478, 252612, 256260, 261797, 268219, 274101, 279817, 286376, 293230, 299149, 304671, 311642, 320279, 328514, 334666, 339250, 343572, 347914, 351868, 355248, 357720, 358338, 356427, 352361, 346891, 340420, 333659, 328090, 324584, 322023, 318345, 312793, 306281, 299898, 293987, 288565, 283677, 279247, 275277, 272138, 270015, 268203, 265654, 262168, 258361, 254622, 250856, 247129, 243740, 240615, 237459, 234565, 232600, 231456, 230117, 227934, 225348, 223141, 221643, 220816, 220414, 219800, 218353, 216304, 214541, 213393, 212312, 210999, 209976, 209624, 209475, 209032, 208731, 209524, 211958, 216015, 221196, 226274, 229651, 230746, 230680, 231030, 232205, 233552, 234635, 235722, 237296, 239711, 243175, 247483, 251792, 255188]
53642B55188K380K124K588K973K550J419N10O77J561J838J086P78K566N907Q388
53627B92533Q424O661M758L714L562L853L987L553K770K274K392K849L163L002
53613C47495K430J972K032K033R18r64j614j03J492N51k270l747k435l00L92j07
53597C47775k52L19Q17Q29O19L84J01j29r1L13R91J471R70o00j937j664l03K79
53579C49892m73j085m14P58J172Q90O75O39N21N74J114J789K080K023J800J274
53563C63229O04O00J635K906L532L782M382N267N812N894N869N920O061O347O509
53548D28349O023N177N252O818Q648R192Q426P272O120N152N194O559P678O774
53534E22634M702M188O082Q188Q416P316O585O625O814P091P746Q146P159M845
$$ y = [255188, 257568, 259692, 262280, 265253, 267803, 269222, 269732, 270409, 271970, 273808, 274894, 275672, 278238, 284145, 292533, 300957, 307618, 312376, 316090, 319652, 323505, 327492, 331045, 333815, 336089, 338481, 341330, 344493, 347495, 349925, 351897, 353929, 355962, 356880, 355916, 354302, 354199, 355691, 356242, 353972, 350225, 347790, 347490, 347882, 347775, 347523, 347842, 348659, 349488, 350107, 350491, 350592, 350463, 350372, 350685, 351676, 353147, 354117, 353517, 351580, 349916, 349613, 349892, 349419, 348334, 347920, 348678, 349850, 350740, 351415, 352054, 352575, 353149, 354263, 356052, 358132, 360155, 361955, 363229, 363833, 364433, 366068, 368974, 372506, 376288, 380670, 385937, 391749, 397643, 403512, 409432, 415493, 421840, 428349, 434372, 439549, 444801, 451619, 460267, 469459, 477885, 485157, 491277, 496429, 501623, 508182, 515860, 522634, 527336, 531524, 537606, 545794, 554210, 561526, 568111, 574736, 581550, 588641, 596387, 604533, 611692, 616537]
53520F16537K746K173K981M118M872N138M846L734J813j45r86j16J912L794M365
53505F57782L312J378l5r5M05k98k715n099n299l256p92P34J526K098K211J644
53489F53501J001R77J351J479J397J571J850J605R20P56J595K567K502J512R87
53474F75571K154M909P961R829R869Q831Q352R460J1552J3217J4038J4906J6375
53461H07024J7565J7444J6533J6362J7378J8463J8729J8870K0276K3384K7373
53450A019401L0952L3033L3181L2107L1382L2093L3768L5224L6174L7358L9205
53439A393878M1182M2803M4432M6478M8325M8940M8408M7956M8241M8477M7826
53428A906946M6900M6857M7412M7055M5433M4191M4748M6247M6814M6159M5772
$$ y = [616537, 619283, 621456, 624437, 628555, 633427, 638565, 643411, 647145, 648958, 648813, 647827, 647711, 649623, 653417, 657782, 661094, 662472, 662437, 662342, 662747, 662449, 659734, 654635, 649336, 646080, 645288, 646022, 647548, 649646, 651857, 653501, 654502, 655479, 656830, 658309, 659706, 661277, 663127, 664732, 665652, 666408, 668003, 670570, 673072, 674584, 675571, 677725, 682634, 690595, 700424, 710293, 719124, 727476, 736936, 748488, 761705, 775743, 790649, 807024, 824589, 842033, 858566, 874928, 892306, 910769, 929498, 948368, 968644, 992028, 1019401, 1050353, 1083386, 1116567, 1148674, 1180056, 1212149, 1245917, 1281141, 1317315, 1354673, 1393878, 1435060, 1477863, 1522295, 1568773, 1617098, 1666038, 1714446, 1762402, 1810643, 1859120, 1906946, 1953846, 2000703, 2048115, 2095170, 2140603, 2184794, 2229542, 2275789, 2322603, 2368762, 2414534]
53417B414534M6630M7895M8035M6325M3079L9199L5858L3967L3385L2986L1831
53406B853724L0069K8506K7455K6261K3899K0172J6251J3610J2214J0398O963
53395C069522K647j224m699q538j2338j4994j6828j9366k2750k5317k6395k7609
53383B892111l0266l3154l4500l4833l6092l8588m0751m1612m1840m2255m2657
53372B475563m2478m1547l9936l7882l5942l4533l3318l1663k9631k7674k5549
53361B095410k2542j8884j5836j4000j2403r814o203k328J560N768J0257J4323
53349B025308J7337J9377K1063K2970K5372K8355L1963L6071M0245M4023M7315
53338B359399N0264N2754N4610N6363N9206O3572O8309P1931P4388P6927Q0309
$$ y = [2414534, 2461164, 2509059, 2557094, 2603419, 2646498, 2685697, 2721555, 2755522, 2788907, 2821893, 2853724, 2883793, 2912299, 2939754, 2966015, 2989914, 3010086, 3026337, 3039947, 3052161, 3062559, 3069522, 3072169, 3070945, 3066246, 3057708, 3045370, 3030376, 3013548, 2994182, 2971432, 2946115, 2919720, 2892111, 2861845, 2828691, 2794191, 2759358, 2723266, 2684678, 2643927, 2602315, 2560475, 2518220, 2475563, 2433085, 2391538, 2351602, 2313720, 2277778, 2243245, 2209927, 2178264, 2148633, 2120959, 2095410, 2072868, 2053984, 2038148, 2024148, 2011745, 2001931, 1995728, 1993400, 1994960, 2000728, 2010985, 2025308, 2042645, 2062022, 2083085, 2106055, 2131427, 2159782, 2191745, 2227816, 2268061, 2312084, 2359399, 2409663, 2462417, 2517027, 2573390, 2632596, 2696168, 2764477, 2836408, 2910796, 2987723, 3068032]
53327C068032Q3976Q7048Q9395R1401R3346R5372R7642J00038J01961J02866J02934
53316D114011J02851J02896J02602J01466R9681R7865R6128R3804R0236Q5459
53306E086999P9825P3312O5674N7248M9084M2123L6434L1218K5330J8083R933
53295E575263K246m170j0108j6994k5053l3231m0826m8154n5484o2429o8979p5999
53283E136082q3932r1706r7703j01312j02869j02771j01623j00589j00474j00621
53273D152482r9759r7858r6223r5640r5243r3580r0319q6527q3512q1628q0155
53262C152038p8210p5545p2298o8345o3573n8629n4454n0966m7200m2964l9280
53251B500574l6638l4145l1216k8819k7677k6334k2753j7334j2569r920q554p228
$$ y = [3068032, 3152008, 3239056, 3328451, 3419852, 3513198, 3608570, 3706212, 3806250, 3908211, 4011077, 4114011, 4216862, 4319758, 4422360, 4523826, 4623507, 4721372, 4817500, 4911304, 5001540, 5086999, 5166824, 5240136, 5305810, 5363058, 5412142, 5454265, 5490699, 5521917, 5547247, 5565330, 5575263, 5577509, 5573339, 5563231, 5546237, 5521184, 5487953, 5447127, 5398973, 5343489, 5281060, 5212081, 5136082, 5052150, 4960444, 4862741, 4761429, 4658560, 4555789, 4454166, 4353577, 4253103, 4152482, 4052723, 3954865, 3858642, 3763002, 3667759, 3574179, 3483860, 3397333, 3313821, 3232193, 3152038, 3073828, 2998283, 2925985, 2857640, 2794067, 2735438, 2680984, 2630018, 2582818, 2539854, 2500574, 2463936, 2429791, 2398575, 2369756, 2342079, 2315745, 2292992, 2275658, 2263089, 2253169, 2244615, 2237387]
53239B237387n647l693q18K936O406Q632J0062J1816J4226J6664J8442J9584K0844
53226B356841K3124K6526L0033L2543L4210L6215L9221M2574M5100M6205M6066
53215B758658M5241M4297M3444M2429M0839L8561L5875L3304L1420L0264K8853
53204C173185K5899K1370J6551J2329Q471N048L001K176L22m104r367j2795j4870
53191C227216j8370k3875k9017l2571l6267m1419m6371m9034n0019n1221n2820
53180B796232n3711n3923n4461n5285n5452n5127n5635n7145n7876n6299n3181
53169B188137n0704m9846m9270m6945m2771l9315l9411m2919m6387m6388m2828
53158A691353l8694l6735l6830l6562l4099l0364k7967k7952k8393k6991k4249
$$ y = [2237387, 2231740, 2228047, 2227229, 2230165, 2236571, 2245203, 2255265, 2267081, 2281307, 2297971, 2316413, 2335997, 2356841, 2379965, 2406491, 2436524, 2469067, 2503277, 2539492, 2578713, 2621287, 2666387, 2712592, 2758658, 2803899, 2848196, 2891640, 2934069, 2974908, 3013469, 3049344, 3082648, 3114068, 3144332, 3173185, 3199084, 3220454, 3237005, 3249334, 3257805, 3262853, 3265854, 3268030, 3268352, 3264248, 3254881, 3242086, 3227216, 3208846, 3184971, 3155954, 3123383, 3087116, 3045697, 2999326, 2950292, 2900273, 2849052, 2796232, 2742521, 2688598, 2634137, 2578852, 2523400, 2468273, 2412638, 2355493, 2297617, 2241318, 2188137, 2137433, 2087587, 2038317, 1991372, 1948601, 1909286, 1869875, 1826956, 1780569, 1734181, 1691353, 1652659, 1615924, 1579094, 1542532, 1508433, 1478069, 1450102, 1422150, 1393757, 1366766, 1342517]
53147A342517k2646k2974k3468k2782k1941k2347k3490k3936k3520k3098k2982
53136A089333k2891k2910k3170k3004k1647j9570j8111j7857j8285j8712j8828
53125H64348j8511j7887j7375j7101j6622j5858j5566j6175j6810j6530j5841
53114F80072j5770j6075j5710j4685j3885j3288j2054j0348r419r483r211p958
53102E32186o933p286q283q470p754p229p612q719r999j0592r494o690l829k853
53088D26443m002n988p745r024r345p838m707j881j196k372l545l582k915k248
53074C60055j514o25k58r79k005k026j139q86j963l072k712j323o06j096j654
53059C38197j325o77q16j832k865l335l428l404l055k152j190j074j886k436j586
$$ y = [1342517, 1319871, 1296897, 1273429, 1250647, 1228706, 1206359, 1182869, 1158933, 1135413, 1112315, 1089333, 1066442, 1043532, 1020362, 997358, 975711, 956141, 938030, 920173, 901888, 883176, 864348, 845837, 827950, 810575, 793474, 776852, 760994, 745428, 729253, 712443, 695913, 680072, 664302, 648227, 632517, 617832, 603947, 590659, 578605, 568257, 558838, 549355, 540144, 532186, 525253, 517967, 509684, 501214, 493460, 486231, 478619, 469900, 459901, 449309, 439815, 433125, 429296, 426443, 422441, 416453, 408708, 399684, 390339, 382501, 377794, 375913, 374717, 372345, 368800, 365218, 362303, 360055, 358541, 357916, 357658, 356679, 354674, 352648, 351509, 350623, 348660, 345588, 342876, 341553, 340947, 339851, 338197, 336872, 336195, 335379, 333547, 330682, 327347, 323919, 320515, 317460, 315308, 314118, 313044, 311158, 308722, 307136]
53044C07136K57J592J730J351J043M29o26j033P6J526J334l83j250J95K547L508
53028C19432K777J939K099K856L338L354L216L205L380L497K961J381p32k261
53014C50442k724k745l025l421l543l749m630n616n386l894l003m191o411p285
53000B90819o131m527l975m191m132l566k907k283j676j504k244l597m685n016
52986B40385m732m055l026j823r36r43k077l908n243m915l023j118p11j798l117
52971A98960l530k745j143N23J450J405Q21N2j030k296k820j996o89k34o39q39
52955A85250n81p13j437j642p03K77j05j512k306j675m40J74j39p88j044n20P45
52938A72841K272L231K896J343k27m14Q39J918J311n64j928j905j331j279j630
$$ y = [307136, 307393, 308985, 310715, 312066, 313109, 313538, 312912, 311879, 311955, 313481, 314815, 314432, 313182, 313377, 315924, 319432, 322209, 324148, 326247, 329103, 332441, 335795, 339011, 342216, 345596, 349093, 352054, 353435, 352703, 350442, 347718, 344973, 341948, 338527, 334984, 331235, 326605, 320989, 315603, 311709, 308706, 304515, 298104, 290819, 284688, 280161, 276186, 271995, 267863, 264297, 261390, 259107, 257431, 255927, 253683, 250086, 245401, 240385, 235653, 231598, 228572, 226749, 225813, 224870, 222793, 218885, 213642, 208727, 205704, 204586, 203875, 202077, 198960, 195430, 192685, 191542, 192065, 193515, 194920, 195741, 195793, 194763, 192467, 189647, 187651, 186962, 186728, 186089, 185250, 184669, 183956, 182519, 180877, 180174, 180451, 180346, 178834, 176528, 174853, 174413, 174587, 174448, 173660, 172616, 172096, 172841, 175113, 178344, 181240, 182583, 182356, 181942, 182781, 184699, 186010, 185446, 183518, 181613, 180282, 179003, 177373]
52923A77373j603q70L72J814K854K582Q06j153j573l13R69P83o06j720j524k42
52907A77949J175J935J809J016q0j101j634j299o6J540K725L060K806K557K660
52892A95052K988L272L440L518L373K839K120J754K016K646L394M459N915P037
52878B43823O910N791N014N284N666M925L324K287K416K774K409J736J702K084
52864B96145J616j36k014k738k430j880j039N54K083J706r79l886m820l989l137
52849B75056k956k699k015j568j699j845j706j806k359k608k045j352j310j637
52835B47451j786k079k860l166j766O34J776P19q99j073K55J684K285K150J661
52820B44986J197J219J765J992J050o26j630j289l89n8n46j323j782j541n73N49
$$ y = [177373, 175770, 174900, 175272, 177086, 179940, 182522, 183328, 182175, 180602, 180289, 181258, 182041, 181435, 179715, 178191, 177949, 179124, 181059, 182868, 183884, 183804, 182703, 181069, 179770, 179704, 181244, 183969, 187029, 189835, 192392, 195052, 198040, 201312, 204752, 208270, 211643, 214482, 216602, 218356, 220372, 223018, 226412, 230871, 236786, 243823, 250733, 256524, 261538, 266822, 272488, 277413, 280737, 283024, 285440, 288214, 290623, 292359, 294061, 296145, 297761, 297625, 295611, 292873, 290443, 288563, 287524, 288078, 290161, 291867, 290888, 287002, 282182, 278193, 275056, 272100, 269401, 267386, 265818, 264119, 262274, 260568, 258762, 256403, 253795, 251750, 250398, 249088, 247451, 245665, 243586, 240726, 237560, 235794, 236428, 238204, 238923, 238024, 236951, 237206, 238890, 241175, 243325, 244986, 246183, 247402, 249167, 251159, 252209, 251583, 249953, 248664, 248275, 248217, 247671, 246348, 244566, 243025, 242452, 243001]
52804B43001R85O60M87J102J814J488J70q94q12J76J400K413K828K310J175L41
52788B58644K14J52m55j122r96k31K24J40M17J786L616M503L725J850P4p26m92
52771B71323K24P76R12Q37R09J194J361J122Q00J140K307L276K787R21q20j170
52755B87899l69N09R01J062J360J812K160K062J374M23k54p00j531k846l781l739
52739B86342l486m156n546o360o092n607n677n868n326m065k992k887l629m199
52725B20452l493j510L49N55q60k461l181l286l510l931m173m148m102m128m003
52710A78570l478k569j701j403j616j521n74L84j01k141m102m487l506k290j286
52695A48179k63N92N34o18j923k220j353k85k9o69j442j688j494j365j607k221
$$ y = [243001, 243986, 244646, 245133, 246235, 248049, 249537, 249707, 248813, 248001, 248177, 249577, 251990, 254818, 257128, 258303, 258644, 258858, 259010, 258555, 257433, 256437, 256206, 256430, 256570, 256987, 258773, 262389, 266892, 270617, 272467, 272541, 271815, 271323, 271547, 272323, 273235, 274072, 274981, 276175, 277536, 278658, 279458, 280598, 282905, 286181, 288968, 289889, 289069, 287899, 287530, 288039, 288940, 290002, 291362, 293174, 295334, 297396, 298770, 299193, 298939, 298239, 296708, 293862, 290081, 286342, 282856, 278700, 273154, 266794, 260702, 255095, 249418, 243550, 238224, 234159, 231167, 228280, 224651, 220452, 216959, 215449, 215798, 216353, 215493, 213032, 209851, 206565, 203055, 199124, 194951, 190803, 186701, 182573, 178570, 175092, 172523, 170822, 169419, 167803, 166282, 165708, 166092, 165991, 163850, 159748, 155261, 151755, 149465, 148179, 147916, 148508, 149042, 148424, 146501, 144281, 142928, 142643, 142614, 141945, 140503, 138815, 137321, 135956, 134349, 132128]
52679A32128l060l733l661k705j521q42o82p83j286k165k477j369L78J180R52
52664A10354J138K253L053K671J888J469Q20m05r22L24K052K165O62q30j742k822
52648A22128m024m296l585l151l301k683n62J741K668K340J719R60j52j021q36
52633A07945P2O24N81P94J834L129L582K718J098o5O8J140J869J342q9j229r85
52616A24428R35L706N559N204L372K206K651L306K607J310J470L478N472N748
52602A71452M553L118J983R23j97j166j741j798j365q04o92j225k048k798l444
52587A64751l940l956l400k810k662k618k077j333j354k240k705j667J76J127
52573A35292O48m6K38J108J322N48l14m94k73l85j024j719j949j570r68p80j217
$$ y = [132128, 129068, 125335, 121674, 118969, 117448, 116606, 115924, 115141, 113855, 111690, 109213, 107844, 108222, 109402, 110354, 111492, 113745, 116798, 119469, 121357, 122826, 123646, 123241, 122319, 122643, 124695, 126860, 127522, 126692, 124950, 122128, 118104, 113808, 110223, 107072, 103771, 101088, 100526, 102267, 104935, 107275, 108994, 109954, 109802, 108781, 107945, 108017, 108641, 109222, 110016, 111850, 114979, 118561, 121279, 122377, 122312, 122380, 123520, 125389, 126731, 126642, 125413, 124428, 125363, 129069, 134628, 139832, 143204, 145410, 148061, 151367, 153974, 155284, 156754, 160232, 165704, 171452, 176005, 179123, 181106, 182029, 181832, 180666, 178925, 177127, 175762, 174958, 174266, 173041, 170993, 168195, 164751, 160811, 156855, 153455, 150645, 147983, 145365, 143288, 141955, 140601, 138361, 135656, 133989, 134165, 135292, 135940, 135894, 136132, 137240, 138562, 139110, 138796, 138302, 138029, 137644, 136620, 134901, 132952, 131382, 130414, 129634, 128417]
52556A28417j530p36Q69J679Q39l26L4J582K084N27j366j525k96K57o31j508q49
52539A27521Q68J746P42j199k156j222O20J645J359Q81J342K521L500M037M383
52524A46588M241L036J198k9k45l50q32q29L55J774K087J709K321M381O274O322
52508A78001M722L033K262K054J599Q65O23J228J797J169l60j133l31Q76J031
52493A97436M26K78N89K92o81j027j05R81Q95k83j531k124j918j002L08J583K705
52476A96822L705M184L644K440J415N98o05j745j466J47J142N07k33L43J109M33
52460B12440p30k79J449K118J083p9p65k245m563n245k634J409L719L446J974
52445B11098N43m68q38o01m31o79o25K60J052O10n51r01J4J341K315K685K193
$$ y = [128417, 126887, 126151, 127020, 128699, 129538, 129212, 129246, 130828, 132912, 133439, 132073, 130548, 130252, 130509, 129878, 128370, 127521, 128389, 130135, 130877, 129678, 127522, 126300, 126920, 128565, 129924, 130805, 132147, 134668, 138168, 142205, 146588, 150829, 153865, 155063, 155034, 154789, 154439, 153607, 152778, 153133, 154907, 156994, 158703, 161024, 165405, 171679, 178001, 182723, 185756, 188018, 190072, 191671, 192536, 193159, 194387, 196184, 197353, 196993, 195860, 195529, 196405, 197436, 197862, 198140, 198729, 199021, 198340, 197313, 197208, 198189, 199084, 198801, 197270, 195146, 193228, 192226, 192534, 194117, 196822, 200527, 204711, 208355, 210795, 212210, 212808, 212203, 210458, 208992, 209139, 210281, 210788, 210555, 210898, 212007, 212440, 211710, 211431, 212880, 214998, 216081, 216002, 215237, 212992, 208429, 203184, 200550, 201959, 205678, 209124, 211098, 211641, 211173, 210335, 209734, 209303, 208624, 207999, 208259, 209311, 209921, 209370, 208469, 208483, 209824, 212139, 214824, 217017]
52428B17017J002K37O99J345O16r04j030O71J991J223m83r72O4J347K025K100
52412B26948J496J16j402k062j711j091p80o50l51K72J153J934J991J038l91j421
52396B25089j664j338p78k83r8j35P5O47R59M76k72l01M62J276J823K438L062
52379B31438K944J736J14j072j613j573r38r1J47m00p29m7P98L37j349k551k090
52362B25061n29J015K243L190L299J993j53j762k244k197k211k011j249l77j8
52347B24050J05P33J795K451K549L044M321N040L615O11j486j090O73J467M58
52332B48336j025j231J67J977K820K377J531J252J542J630J214J008J750K997
52318B66345L489K710J552J275K098L113L413L007K582K626L021L409L630L678
$$ y = [217017, 218019, 218256, 218955, 220300, 220916, 220012, 218982, 219653, 221644, 222867, 222384, 221412, 221476, 222823, 224848, 226948, 228444, 228560, 227158, 225096, 223385, 222294, 221514, 220864, 220513, 220785, 221938, 223872, 225863, 226901, 226510, 225089, 223425, 222087, 221309, 221026, 220928, 220793, 220868, 221515, 222474, 222950, 222678, 222377, 222839, 224115, 225938, 228376, 231438, 234382, 236118, 236232, 235160, 233547, 231974, 231036, 230945, 231092, 230692, 229963, 229916, 230714, 231051, 229702, 227151, 225061, 224532, 225547, 227790, 230980, 234279, 236272, 236119, 234357, 232113, 229916, 227705, 225694, 224445, 224068, 224050, 224155, 224888, 226683, 229134, 231683, 234727, 239048, 244088, 247703, 248314, 246828, 245738, 246411, 247878, 248336, 247311, 246080, 246247, 248224, 251044, 253421, 254952, 256204, 257746, 259376, 260590, 261598, 263348, 266345, 269834, 272544, 274096, 275371, 277469, 280582, 283995, 287002, 289584, 292210, 295231, 298640, 302270, 305948]
52304C05948L416K717J772R30L00r4J05J275K939L962L904L474L199K530J170
52289C37547L81J505L508L808J831l2K81J858K742L050M277O323P408O903O111
52274C87501N693M377J460j100q27J840M035M066K892K076J830J645J545J899
52260D18932K687L592M362M678M287L647L840N264P024Q036Q224Q164Q205Q571
52246D99513R573J0887J1367J0550R798J0666J2651J3877J3825J3803J4631J5523
52234F46664J5700J5649J6013J6459J6601J6927J7841J8669J8758J8753J9655
52223H37689K1067K1654K1038K0119J9636J9417J9081J8577J7839J6671J5116
52212A047904J3573J2485J2193J2845J4004J4686J4291J3121J1612R726P690O502
$$ y = [305948, 309364, 312081, 313853, 314783, 315083, 314989, 315094, 316369, 319308, 323270, 327174, 330648, 333847, 336377, 337547, 337928, 339433, 342941, 346749, 348580, 348548, 348829, 350687, 353429, 356479, 360756, 367079, 374487, 381390, 387501, 393194, 397571, 399031, 397931, 397104, 398944, 402979, 407045, 409937, 412013, 413843, 415488, 417033, 418932, 421619, 425211, 429573, 434251, 438538, 442185, 446025, 451289, 458313, 466349, 474573, 482737, 490942, 499513, 509086, 519973, 531340, 541890, 551688, 562354, 575005, 588882, 602707, 616510, 631141, 646664, 662364, 678013, 694026, 710485, 727086, 744013, 761854, 780523, 799281, 818034, 837689, 858756, 880410, 901448, 921567, 941203, 960620, 979701, 998278, 1016117, 1032788, 1047904, 1061477, 1073962, 1086155, 1099000, 1113004, 1127690, 1141981, 1155102, 1166714, 1176440, 1184130, 1190632]
52200A190632O524O306M294J343j19N31J340O37q85j756j887k122k511k205o58
52185A199464J732L901M718L805K124J210J689L109N176P989J0879J2429J2352
52172A270577J2094J2690J3224J2614J1825J2672J5055J7003J7191J6063J4534
52161A425542J2990J1772J1335J1524J1495J0715R336P596N676M196L809L988
52149A529974L156O50k196l613l425k920l159m181n585p113q524r431r535q958
52135A465140q226p910q115q260p579o016m434l728l811l858l452l095l366l965
52121A389325m063l485l052l470m387m923m806m446m002l082j582k56n5j158k823
52106A343735m111m534m270l892l791l843l704l349l042k953l131l662m427m824
$$ y = [1190632, 1197156, 1203462, 1207756, 1209099, 1208980, 1209511, 1210851, 1211488, 1210603, 1208847, 1206960, 1204838, 1202327, 1200122, 1199464, 1201196, 1205097, 1209815, 1213620, 1215744, 1216954, 1218643, 1221752, 1226928, 1234917, 1245796, 1258225, 1270577, 1282671, 1295361, 1308585, 1321199, 1333024, 1345696, 1360751, 1377754, 1394945, 1411008, 1425542, 1438532, 1450304, 1461639, 1473163, 1484658, 1495373, 1504709, 1512305, 1517981, 1522177, 1525986, 1529974, 1533130, 1533780, 1531584, 1527971, 1524546, 1521626, 1518467, 1514286, 1508701, 1501588, 1493064, 1483633, 1474098, 1465140, 1456914, 1449004, 1440889, 1432629, 1425050, 1419034, 1414600, 1410872, 1407061, 1403203, 1399751, 1396656, 1393290, 1389325, 1385262, 1381777, 1378725, 1375255, 1370868, 1365945, 1361139, 1356693, 1352691, 1349609, 1348027, 1347771, 1347716, 1346558, 1343735, 1339624, 1335090, 1330820, 1326928, 1323137, 1319294, 1315590, 1312241, 1309199, 1306246, 1303115, 1299453, 1295026, 1290202]
52092A290202m378l509l095l267l459l587m193n220n729n336m964n500o480o911
52078A224574o703o470o388o179n831n631n672n937o530p329p742p296o206m990
52064A135670l994l590m071m922n012m132l528m033m651m010k410j143m76K99
52050A089997J243J627J235O62M74J043K837N641Q004Q829R072J0344J2186J2579
52036A165773J1148R946J0713J3029J5740J8547K1429K3895K5592K6617K6710
52025A369139K5339K3143K1969K2666K3941K4185K3376K2481K2010K1981K2233
52014A622463K1992K0092J6513J2944J0985J0522J0416R819Q197N209J636n81
52002A750207l89R25J273P6j829l673n107n793n784n786o157o294n848n732o808
$$ y = [1290202, 1285824, 1282315, 1279220, 1275953, 1272494, 1268907, 1264714, 1259494, 1253765, 1248429, 1243465, 1237965, 1231485, 1224574, 1217871, 1211401, 1205013, 1198834, 1193003, 1187372, 1181700, 1175763, 1169233, 1161904, 1154162, 1146866, 1140660, 1135670, 1131676, 1128086, 1124015, 1119093, 1114081, 1109949, 1106421, 1102388, 1097737, 1093727, 1091317, 1090174, 1089698, 1089997, 1091240, 1092867, 1094102, 1094764, 1095238, 1096281, 1099118, 1104759, 1112763, 1121592, 1130664, 1141008, 1153194, 1165773, 1176921, 1186867, 1197580, 1210609, 1226349, 1244896, 1266325, 1290220, 1315812, 1342429, 1369139, 1394478, 1417621, 1439590, 1462256, 1486197, 1510382, 1533758, 1556239, 1578249, 1600230, 1622463, 1644455, 1664547, 1681060, 1694004, 1704989, 1715511, 1725927, 1735746, 1743943, 1749152, 1750788, 1750207, 1749818, 1750743, 1752016, 1752092, 1750263, 1746590, 1741483, 1735690, 1729906, 1724120, 1717963, 1711669, 1705821, 1700089, 1693281]
51987A693281q324q820q013o669n332m313m184m883m888k870K68K464L164L381
51973A644262L569L261K740K984L744L479J840N49J058K647L638L237J488j364
51959A677132m380n815m775k579j496k402m368o218p705r191j0777j1934j2054
51946A593438j1399j1363j3164j6360j9199k0495k0597k0482k0791k1909k4023
51935A393656k6562k8301k8705k8682k9418l0832l1720l1282k9960k8825k8464
51924A070905k8484k8179k7618k7727k8882k9876k9170k6978k5095k4509k4263
51913G70124k3118k1339k0066j9693j9645j9383j8880j8305j7749j7093j5910
51902E58943j3928j1749j0463j0293j0307r852r381r260q813p471o071n819o387
$$ y = [1693281, 1684957, 1676137, 1668124, 1661455, 1656123, 1651810, 1647626, 1642743, 1637855, 1634985, 1635253, 1637717, 1640881, 1644262, 1647831, 1651092, 1653832, 1656816, 1660560, 1664039, 1665879, 1666428, 1667486, 1670133, 1673771, 1677008, 1678496, 1677132, 1672752, 1666937, 1662162, 1659583, 1658087, 1655685, 1651317, 1645099, 1637394, 1628203, 1617426, 1605492, 1593438, 1582039, 1570676, 1557512, 1541152, 1521953, 1501458, 1480861, 1460379, 1439588, 1417679, 1393656, 1367094, 1338793, 1310088, 1281406, 1251988, 1221156, 1189436, 1158154, 1128194, 1099369, 1070905, 1042421, 1014242, 986624, 958897, 930015, 900139, 870969, 843991, 818896, 794387, 770124, 747006, 725667, 705601, 685908, 666263, 646880, 628000, 609695, 591946, 574853, 558943, 545015, 533266, 522803, 512510, 502203, 492351, 482970, 473710, 464897, 457426, 451355, 445536, 439149]
51889D39149o368n424m714n149o151o432n314l204j422j394l181m992m997l644
51875C76763l039l992n093m970m223m192m941n525n481m973m015k614j465j353
51861C20887j994k358k178k142k511k569j801p92m65r26j562j901j926j871k039
51846B93852k456k512j416N15J593M47k133l797l063o62J449J905O43j316k559
51831B80490k195o72M93K17r53j411k83J457J856O2k542l584k302l59K95j48J0
51814B70431J142J561J9k282l254k577j626j225q77q3Q99J885L151M533N149M575
51798B81421L488K569J573K26q70j193j407k302l177k653r13L35L28K25J176K663
51782B81489L554L575K913J361q69k378k003m06J040K406M523O523O222L439Q46
$$ y = [439149, 432781, 427357, 422643, 417494, 411343, 404911, 399597, 396393, 394971, 393577, 390396, 385404, 380407, 376763, 373724, 369732, 364639, 359669, 355446, 351254, 346313, 340788, 335307, 330334, 326319, 323705, 322240, 320887, 318893, 316535, 314357, 312215, 309704, 307135, 305334, 304542, 304077, 303151, 301589, 299688, 297762, 295891, 293852, 291396, 288884, 287468, 287983, 289576, 290023, 287890, 284093, 281030, 280368, 281817, 283722, 284365, 283049, 280490, 278295, 277623, 278116, 278333, 277380, 275969, 275686, 277143, 278999, 279061, 276519, 272935, 270633, 270274, 270569, 270421, 270431, 271573, 273134, 273153, 270871, 267617, 265040, 263414, 262189, 261312, 261229, 262128, 264013, 267164, 271697, 276846, 281421, 284909, 287478, 289051, 289277, 288407, 287214, 285807, 283505, 280328, 277675, 276762, 277097, 277425, 277650, 278826, 281489, 285043, 288618, 291531, 292892, 292023, 289645, 287642, 287236, 288276, 290682, 295205, 301728, 307950, 311389, 312235]
51767C12235N50J501J636J078J383K611L233K620J724J262R00M92O25J352J734
51752C34936J184L28j44m50q83r14M8J569K622K651J709J40j347j851j137P5J091
51735C39627J920K604K704K138J819K476L419L433K519J813J974K551K851K706
51721C74554K428K559L515M938N732N295M291L606L164K580K395L349M933N943
51707D29282O316O950P742P369N416L269K294K192J795N46j336l237m180l459
51693D60959j841j089j679k188j667j305k447m120m213k535r65p20j113j175r48
51678D32954p34l30K33K37o81j687j745j038o59j081j605j368m93M0m84j598k092
51661D17869j474o64q53j917k624k363j797j526j089lQ80J74k042l977m127k726
$$ y = [312235, 312785, 314286, 315922, 317000, 318383, 320994, 324227, 326847, 328571, 329833, 330733, 331225, 331850, 333202, 334936, 336120, 336448, 336304, 335854, 334971, 334057, 334105, 335674, 338296, 340947, 342656, 342796, 341449, 339598, 338461, 338536, 339627, 341547, 344151, 346855, 348993, 350812, 353288, 356707, 360140, 362659, 364472, 366446, 368997, 371848, 374554, 376982, 379541, 383056, 387994, 393726, 399021, 403312, 406918, 410082, 412662, 415057, 418406, 423339, 429282, 435598, 442548, 450290, 457659, 463075, 466344, 468638, 470830, 472625, 473171, 471835, 468598, 464418, 460959, 459118, 458029, 456350, 454162, 452495, 451190, 448743, 444623, 440410, 437875, 436910, 436190, 435077, 433902, 432954, 432220, 431890, 432123, 432360, 431679, 429992, 428247, 427209, 426550, 425469, 423864, 422496, 422003, 422043, 421559, 419961, 417869, 416395, 415731, 414878, 412961, 410337, 407974, 406177, 404651, 403562, 403559, 404439, 404613, 402571, 398594, 394467, 391741]
51645C91741r46N30J622K131J764P74j63p11j043j141o05N65J468J143k26j358
51629C95545j175K26J895L002L339L148K805K744L372M583N459M861K675P4j897
51614D30656l546n663p753q271o936n490n438n954n283l619l047m572o682p366
51600C51036o515n479n018m623l667k328j240p50p43j002j472k086k391j742j56
51585C11824J241J241J5r96q78k88l30r63j193n74K16K98m06j191j304n91K82
51568C06403L99l73j008m86P21J054k5j102o40Q58J465M76p00o16K64N07j10n21
51550C06566j75K92M46Q55J993L141L317K726K509L240M448N463N964N733M675
51535C51193L307K635L097L912L857K580J019M45J062J580M94k075m171l995j804
$$ y = [391741, 390795, 391325, 392947, 395078, 396842, 397616, 397453, 396742, 395699, 394558, 393953, 394518, 395986, 397129, 396903, 395545, 394370, 394596, 396491, 399493, 402832, 405980, 408785, 411529, 414901, 419484, 424943, 429804, 432479, 432553, 430656, 427110, 421447, 413694, 405423, 398487, 392997, 387559, 381605, 376322, 372703, 369656, 365084, 358402, 351036, 344521, 339042, 334024, 329401, 325734, 323406, 322166, 321416, 320673, 319671, 318199, 316113, 313722, 311980, 311824, 313065, 314306, 314321, 313325, 312447, 312159, 311829, 310866, 309673, 309099, 309315, 309613, 309207, 308016, 306712, 306121, 306403, 306802, 306429, 305421, 304935, 305656, 306710, 306685, 305583, 304943, 305801, 307266, 307742, 307042, 306426, 306690, 307197, 307087, 306566, 306391, 306683, 307129, 307984, 309977, 313118, 316435, 319161, 321670, 324910, 329358, 334821, 340785, 346518, 351193, 354500, 357135, 360232, 364144, 368001, 370581, 371600, 372045, 373107, 374687, 375181, 373106, 368935, 364940, 363136]
51520C63136N28J627J651J489J516J329L43j392k760k256M69L942O201O731O531
51505C89085O613P028P219O623N048L071J935K131K314O72k395m233l093l41J287
51490D22964Q97j29l47J47M58L15K87P47J227J054M63N21J653K800K513N75k095
51473D34050m635o448o731n095k733j654k373l391l331k488j761j133k7J515K904
51458C96669L718L831L323K600K101J561M10q44p75Q31K169J542n22k262k773
51443D11579k232r72M32R25J55o46j56J136J698J159M27O1k6N01K159M255N139
51426D25594M221K661J838K086L021M097M657M350L699L379L107K185J043R56
51412D66894K100L281L759L975M143L586K118P10%o00j483j740p09N02L98p51
$$ y = [363136, 363664, 365291, 366942, 368431, 369947, 371276, 371619, 370227, 367467, 365211, 365680, 369622, 375823, 382554, 389085, 395698, 402726, 409945, 416568, 421616, 424687, 426622, 428753, 431067, 431739, 429344, 425111, 422018, 421677, 422964, 423861, 423732, 423385, 423532, 423990, 424305, 424592, 425339, 426566, 427620, 428083, 428604, 430257, 433057, 435570, 436145, 434050, 429415, 422967, 416236, 411141, 408408, 406754, 404381, 400990, 397659, 395171, 393410, 392277, 392250, 393765, 396669, 400387, 404218, 407541, 410141, 412242, 413803, 414213, 413369, 412594, 413425, 415594, 417136, 416614, 414352, 411579, 409347, 408375, 408807, 409732, 409887, 409241, 409085, 410221, 411919, 413078, 413505, 413566, 413540, 414041, 416200, 420455, 425594, 429815, 432476, 434314, 436400, 439421, 443518, 448175, 452525, 456224, 459603, 462710, 464895, 465938, 466894, 468994, 472275, 476034, 480009, 484152, 487738, 489856, 490566, 490566, 489966, 488483, 486743, 486034, 486536, 486934, 486183]
51396D86183j480j338j169j529k260l445n317p071p213n611m074m174n380o075
51382D30047n702m961m278l287j924j012j184j909k196j986k000k379k360j467
51368C93402k07Q18J732K616K676J206r77k177j842j008o51p86j306k528m267
51353C86701n415n267m533m288m553m680m559m460m209l491k686k461k713k860
51339C30526k997l621m323m043k947k695m148n972o406n516m585l989l161k263
51325B73860k285l263l810l014j653p12K13J876L480L197O41k462m200m233l420
51310B54215k596k176k185k200j708r38q61j869l000k862j071J525L583L955K350
51295B44162m9j238m34R33R24n39j853j890j021q8O12J166J716K490L536M234
$$ y = [486183, 484703, 483365, 482196, 480667, 478407, 474962, 469645, 462574, 455361, 449750, 445676, 441502, 436122, 430047, 424345, 419384, 415106, 411819, 409895, 408883, 407699, 405790, 403594, 401608, 399608, 397229, 394869, 393402, 393195, 394013, 395745, 398361, 401037, 402243, 401266, 399089, 397247, 396239, 395588, 394802, 393496, 390968, 386701, 381286, 376019, 371486, 367198, 362645, 357965, 353406, 348946, 344737, 341246, 338560, 336099, 333386, 330526, 327529, 323908, 319585, 315542, 312595, 309900, 305752, 299780, 293374, 287858, 283273, 279284, 276123, 273860, 271575, 268312, 264502, 261488, 259835, 259123, 259336, 261212, 264692, 267889, 268530, 266068, 261868, 257635, 254215, 251619, 249443, 247258, 245058, 243350, 242412, 241551, 239682, 236682, 233820, 232749, 234274, 237857, 241812, 244162, 244113, 242875, 242441, 243374, 244298, 243759, 241906, 240016, 238995, 238907, 239519, 240685, 242401, 244891, 248427, 252661]
51279B52661L799K448J440J670K746L617L524K270K98j299j626j190j523l106
51265B65729m516m265k790j745j868k508k997l357l637l550l097k856l180l672
51251B21691l841l816l944m050l722l105k725k480j538M10K389L112K445J315
51237B02141L81m85j493k397k912l033k626j437J32Q16o1j387j339L47K059K372
51221A91078J582Q40M97R1l48m1J152J845N66j995l246j718R52K016J022j11j77
51204A94005k32j498l289m070l472k114l72J258J462n90l397m306k615k06R71
51189A71535P24k39j381j957r61J586M001M506K976P70p14q65L1J069J452J259
51173A83792J108J057O54R2L07J517K597K590J880J221M31r57k352k553j353J65
$$ y = [252661, 256460, 258908, 260348, 262018, 264764, 268381, 271905, 274175, 274473, 273174, 271548, 270358, 268835, 265729, 261213, 256948, 254158, 252413, 250545, 248037, 245040, 241683, 238046, 234496, 231399, 228543, 225363, 221691, 217850, 214034, 210090, 206040, 202318, 199213, 196488, 194008, 192470, 192880, 195269, 198381, 200826, 202141, 202522, 202037, 200544, 198147, 195235, 192202, 189576, 188139, 188271, 189087, 189026, 187639, 186300, 186647, 188706, 191078, 192660, 193500, 193997, 194088, 193740, 193699, 194851, 196696, 197262, 195267, 192021, 190303, 191255, 193271, 194293, 194182, 194005, 193773, 192275, 188986, 184916, 181444, 179330, 178958, 180216, 181678, 181088, 177691, 173385, 170770, 170564, 171535, 172259, 172020, 170639, 168682, 167721, 169307, 173308, 177814, 180790, 181560, 180846, 179981, 180012, 181081, 182533, 183792, 184900, 185957, 186611, 186703, 187010, 188527, 191124, 193714, 195594, 196815, 197246, 196289, 193937, 191384, 190031, 190196]
51157A90196R05P10J58o5M17J301J771J369O93P73J729K525K190J075N70J502
51141B07819L072L689K864J776J706K434K737K097J131N34L64M10N57O23L48l38
51125B31823j352k521l221k582p82M71j18j506j623k52R22R38N19L01m0n97q80
51108B19500j248k796n075n800l881j136K05J84K3j24p58j525j742j598j446q58
51092A91925L83J315J127M44j0q11k273k792q37K200L344J838l55j489j599j310
51076A91100r41r30j525k029j643q70p24r66p04j66k54o96n45j41n82j498j506
51059A75380p25n24p54J55K092K809J393l32q09q20j310j450l93R78J649K092
51043A79431K743K565R31n76k34J140J530P32J86N98J631L304N687P436O747L827
$$ y = [190196, 191101, 191811, 191969, 191904, 192321, 193622, 195393, 196762, 197455, 198228, 199957, 202482, 204672, 205747, 206317, 207819, 210891, 214580, 217444, 219220, 220926, 223360, 226097, 228194, 229325, 229859, 230223, 230633, 231190, 231813, 232161, 231823, 230471, 227950, 224729, 222147, 221365, 221836, 221718, 220212, 218589, 218337, 219259, 220197, 220716, 221017, 220977, 220380, 219500, 218252, 215456, 210381, 204581, 200700, 199564, 199769, 199953, 199976, 199852, 199094, 197569, 195827, 194229, 192783, 191925, 192308, 193623, 194750, 195194, 195184, 194373, 192100, 189308, 188471, 190671, 194015, 195853, 195498, 194009, 192410, 191100, 190159, 189229, 187704, 185675, 184032, 183162, 182438, 181472, 180768, 180602, 180348, 179652, 179107, 178966, 178384, 176886, 175380, 174655, 174131, 173377, 173532, 175624, 178433, 179826, 179494, 178685, 177865, 176555, 175105, 174712, 175690, 177339, 179431, 182174, 184739, 185670, 185094, 184860, 186000, 187530, 188262, 188448, 189046, 190677, 193981, 199668, 207104, 213851, 217678]
51027B17678R70j58P0N31P94Q98Q36P34Q81J316J767K025J957J346L04m07j00
51010B31442R06J573J378P65N78J324K841M360N110M925L943J957j083l930m727
50995B51362l344j797j657k281k435k268k372k174r64M02O40J88M51J302J280
50980B36333J81n87l62k09q69j496j162k63M07J034K223L783M819M661L290J307
50964B53090j72j47J374L235M004K859J06k490k563N78M632O556N978N044M952
50949B87036M510K652N32j23O48J694K696L923M856M700M008M239N624O810O828
50934C40633O317O340O982P741Q584R898J1692J3466J4617J4655J3378J1358J0078
50921D75739J0740J2832J4576J5201J6100J8967K3211K6305K6879K6301K6679
$$ y = [217678, 218648, 218490, 218560, 219091, 219885, 220783, 221619, 222353, 223234, 224550, 226317, 228342, 230299, 231645, 231949, 231542, 231442, 232348, 233921, 235299, 236064, 236642, 237966, 240807, 245167, 250277, 255202, 259145, 261102, 260019, 256089, 251362, 248018, 246221, 244564, 242283, 239848, 237580, 235208, 233034, 232070, 232472, 233112, 233300, 233751, 235053, 236333, 236514, 235927, 235565, 235356, 234487, 232991, 231829, 231566, 231973, 233007, 235230, 239013, 243832, 248493, 251783, 253090, 252918, 252771, 254145, 257380, 261384, 264243, 264349, 261859, 259296, 259874, 264506, 271062, 277040, 282084, 287036, 291546, 294198, 294730, 294607, 295255, 296949, 299645, 303568, 308424, 313124, 317132, 321371, 326995, 333805, 340633, 346950, 353290, 360272, 368013, 376597, 386495, 398187, 411653, 426270, 440925, 454303, 465661, 475739, 486479, 499311, 513887, 529088, 545188, 564155, 587366, 613671, 640550, 666851, 693530]
50910F93530K8377L0463L2770L6064M0369M4563M7973N1267N5218N9401O2718
50899A182713O4721O5926O7181O8954P0832P1568P0161O7098O3835O0854N7027
50888A910870N1370M4635L8384L3225K8786K4811K1252J7575J3188Q593N154L442
50876B201285K519J260k52j123j087j065k366n529r956j4594j8993k3620k9057
50863B097422l5151m1159m6570n1399n5826n9863o3302o5628o6177o4889o2789
50852A484669o1129n9871n7669n3648m8726m4647m1965l9581l6193l1711k7126
50841I82403k3319k0396j8074j6305j5171j4291j2788j0174o996m285k499j337
50829H36768m78j5J5K8N28J544K649L376L549L478L999N952R165J2233J3618J3034
$$ y = [693530, 721907, 752370, 785140, 821204, 861573, 906136, 954109, 1005376, 1060594, 1119995, 1182713, 1247434, 1313360, 1380541, 1449495, 1520327, 1591895, 1662056, 1729154, 1792989, 1853843, 1910870, 1962240, 2006875, 2045259, 2078484, 2107270, 2132081, 2153333, 2170908, 2184096, 2192689, 2197843, 2201285, 2203804, 2205064, 2204812, 2203689, 2202602, 2201537, 2199171, 2193642, 2183686, 2169092, 2150099, 2126479, 2097422, 2062271, 2021112, 1974542, 1923143, 1867317, 1807454, 1744152, 1678524, 1612347, 1547458, 1484669, 1423540, 1363669, 1306000, 1252352, 1203626, 1158979, 1117014, 1077433, 1041240, 1009529, 982403, 959084, 938688, 920614, 904309, 889138, 874847, 862059, 851885, 844889, 840604, 838105, 836768, 836290, 836275, 836290, 836318, 836846, 838390, 841039, 844415, 847964, 851442, 855441, 861393, 870558, 882791, 896409, 909443]
50813I09443J1555J0679J1360J3531J6038J7347J7051J6467J7145J8955K0623
50802A080194K2027K4705K9479L4755L8282L9964M1708M4965M9588N5072O1511
50791A522250O8906P6590Q3974R1327R9193J07467J15557J23061J29801J35494
50781B553620J39924J43358J46332J48992J50811J50885J48478J43351J35574
50772C861325J24950J11123R4744P8045O3154M9868L6374K2437J0545L072l60
50761D455277j672j688j60K481N185P663R907J0520P343kr750k0472l2242m5153
50747D387237n8432p1886q6445j02038j16393j27249j34754j40146j43185j42528
50737C264181j38143j31678j24529j16937j08745r9887r0161p9552o8781n8550
$$ y = [909443, 920998, 931677, 943037, 956568, 972606, 989953, 1007004, 1023471, 1040616, 1059571, 1080194, 1102221, 1126926, 1156405, 1191160, 1229442, 1269406, 1311114, 1356079, 1405667, 1460739, 1522250, 1591156, 1667746, 1751720, 1843047, 1942240, 2049707, 2165264, 2288325, 2418126, 2553620, 2693544, 2836902, 2983234, 3132226, 3283037, 3433922, 3582400, 3725751, 3861325, 3986275, 4097398, 4192142, 4270187, 4333341, 4383209, 4419583, 4442020, 4452565, 4455637, 4455277, 4453605, 4451917, 4451757, 4454238, 4459423, 4467086, 4476993, 4487513, 4494856, 4494854, 4485104, 4464632, 4432390, 4387237, 4328805, 4256919, 4170474, 4068436, 3952043, 3824794, 3690040, 3549894, 3406709, 3264181, 3126038, 2994360, 2869831, 2752894, 2644149, 2544262, 2454101, 2374549, 2305768, 2247218]
50727B247218m8596l8480k8843k0569j3005m766L634R733J2231J2600J2918J3480
50715B157555J3480J2711J1449R532O649L186j62l147n831q174j0418j3210j6752
50702B156868k0378k3648k7109l1298l5625l9076m1312m2271m1512l9017l6036
50691A779586l3846l2084k9484k5861k2159j8779j5172j0923o026k29O553J3247
50679A604823J8438K2279K6276L1120L6183M1274M7194N4102O0930O7037P2915
50668B082571P8577Q2951Q5787Q8509R1883R4432R4648R3239R1342Q7830Q0797
50657C052566P0903O0890N1974M2885L2467K1029R049l276j4669k2964k7476k9488
50645C243890k9781k7542k2719j7425j3550j0396o446k234L67Q51J28j729n825
$$ y = [2247218, 2198622, 2160142, 2131299, 2110730, 2097725, 2092959, 2096593, 2106326, 2118557, 2131157, 2144075, 2157555, 2171035, 2183746, 2195195, 2204727, 2211376, 2214562, 2214400, 2211253, 2205422, 2197248, 2186830, 2173620, 2156868, 2136490, 2112842, 2085733, 2054435, 2018810, 1979734, 1938422, 1896151, 1854639, 1815622, 1779586, 1745740, 1713656, 1684172, 1658311, 1636152, 1617373, 1602201, 1591278, 1585252, 1585023, 1591576, 1604823, 1623261, 1645540, 1671816, 1702936, 1739119, 1780393, 1827587, 1881689, 1942619, 2009656, 2082571, 2161148, 2244099, 2329886, 2418395, 2510278, 2604710, 2699358, 2792597, 2883939, 2971769, 3052566, 3123469, 3184359, 3236333, 3279218, 3311685, 3332714, 3341763, 3338487, 3323818, 3300854, 3273378, 3243890, 3214109, 3186567, 3163848, 3146423, 3132873, 3122477, 3116031, 3113797, 3114164, 3115015, 3115143, 3113414, 3107589]
50632C107589j2578k1043l0337m0267n0196n8558o4157o7089o7989o7059o4295
50621B564021o0007n4733m8997m3305l7673l1222k2964j3311l887M480J2742K2099
50609B287243L2285M2192N1528O0785O9865P7699Q3343Q6721Q8047Q7255Q4292
50598C051255P9642P4076O8064O1650N4863M7988M1425L5379K9908K5187K1514
50587C590951J8788J6091J2363P669L509J516J999M034O649R530J2693J6116J9793
50574C721701K3825K8163L2468L6182L8604L9092L7593L4888L1825K8306K3535
50563D076182J7315J0439L624l233j0255j6702k1589k4712k6427k6822k5767k3458
50551C928595k0029j4934p862k78N112O961O594O180O242N464K401l148j0227
$$ y = [3107589, 3095011, 3073968, 3043631, 3003364, 2953168, 2894610, 2830453, 2763364, 2695375, 2628316, 2564021, 2504014, 2449281, 2400284, 2356979, 2319306, 2288084, 2265120, 2251809, 2247922, 2252402, 2265144, 2287243, 2319528, 2361720, 2413248, 2474033, 2543898, 2621597, 2704940, 2791661, 2879708, 2966963, 3051255, 3130897, 3204973, 3273037, 3334687, 3389550, 3437538, 3478963, 3514342, 3544250, 3569437, 3590951, 3609739, 3625830, 3638193, 3645862, 3649371, 3650887, 3652886, 3656920, 3663569, 3673099, 3685792, 3701908, 3721701, 3745526, 3773689, 3806157, 3842339, 3880943, 3920035, 3957628, 3992516, 4024341, 4052647, 4076182, 4093497, 4103936, 4107560, 4104327, 4094072, 4077370, 4055781, 4031069, 4004642, 3977820, 3952053, 3928595, 3908566, 3893632, 3885770, 3885492, 3890604, 3897565, 3904159, 3910339, 3916581, 3922045, 3924446, 3921298, 3911071]
50538C911071j7813k6027l6154m8821o2304p3719q2233q9721r7568j04255j07445
50527C165011j07367j06197j04775j01912r7056r1536q6486q1302p5142o8676
50517B244562o3075n8221n3094m7321m1188l4647k7683k1465j7577j5709j3243
50506A851339p999q15N482R310J1782J4985J9663K5075L0398L5412L9902M3503
50494B078037M6402M9540N3554N8066O2502O7023P2020P7168Q1853Q6140R0354
50483B822659R3960R5865R5765R4254R1685Q8108Q4324Q1705Q0580Q0054P9876
50472C788835Q1260Q5126R0622R6229J01386J06216J10620J14719J19468J25654
50462D820135J32739J39651J46044J51796J55953J57558J57002J55120J51270
$$ y = [3911071, 3893258, 3867231, 3831077, 3782256, 3719952, 3646233, 3564000, 3474279, 3376711, 3272456, 3165011, 3057644, 2951447, 2846672, 2744760, 2647704, 2556168, 2469682, 2388380, 2313238, 2244562, 2181487, 2123266, 2070172, 2022851, 1981663, 1947016, 1919333, 1897868, 1880291, 1864582, 1851339, 1843340, 1842525, 1848007, 1857317, 1869099, 1884084, 1903747, 1928822, 1959220, 1994632, 2034534, 2078037, 2124439, 2173979, 2227533, 2285599, 2348101, 2415124, 2487144, 2564312, 2646165, 2732305, 2822659, 2916619, 3012484, 3108249, 3202503, 3294188, 3382296, 3466620, 3548325, 3628905, 3708959, 3788835, 3870095, 3955221, 4045843, 4142072, 4243458, 4349674, 4460294, 4575013, 4694481, 4820135, 4952874, 5092525, 5238569, 5390365, 5546318, 5703876, 5860878, 6015998, 6167268]
50453F167268J43889J32976J20271J06499Q9952O8798M3757J7447q214l3007n7179
50442F792457q0218j01037j18722j32838j43165j49343j50861j47411j39191j26839
50432E502832j11272r3606p4919n5843l6764j8715l528P426J4196J7259J5895
50421E162961Q572n057k3448m4606o7426r1182j14456j35169j51563j62917j69605
50410D206104j72738j73395j72035j68623j63300j56622j49102j40821j31605
50401B777863j21449j10785j00410r0972q2395p4125o6192n9372n3843m8337m1664
50390A928319l4594k9144k5959k3562k0253j5678j0253m286J641O396R348J1234
50378A793209J3295J5872J8402K0412K1992K3605K5858K9114L2851L5872L7669
$$ y = [6167268, 6311157, 6444133, 6564404, 6670903, 6760855, 6829653, 6873410, 6890857, 6882643, 6849636, 6792457, 6712239, 6611202, 6492480, 6359642, 6216477, 6067134, 5916273, 5768862, 5629671, 5502832, 5391560, 5297954, 5223035, 5167192, 5130428, 5111713, 5108185, 5115611, 5129807, 5147066, 5162961, 5171533, 5166476, 5143028, 5098422, 5030996, 4939814, 4825358, 4690189, 4538626, 4375709, 4206104, 4033366, 3859971, 3687936, 3519313, 3356013, 3199391, 3050289, 2909468, 2777863, 2656414, 2545629, 2445219, 2354247, 2271852, 2197727, 2131535, 2072163, 2018320, 1969983, 1928319, 1893725, 1864581, 1838622, 1815060, 1794807, 1779129, 1768876, 1764590, 1766231, 1772627, 1781975, 1793209, 1806504, 1822376, 1840778, 1861190, 1883182, 1906787, 1932645, 1961759, 1994610, 2030482, 2068151]
50367B068151L9283M2104M5981M9188N0379N0128N0364N2498N6148N9484O0931
50356B624639O0646O0249O1092O3065O5327O7745P0911P4878P8576Q1015Q2611
50345C390754Q4705Q7723R0407R1172Q9757Q7003Q3295P8138P1304O3404N4892
50334D272554M5182L3593K0442O428q539k4771m1387n6774p0475q3491r6226j07281
50322C889255j14808j18377j18703j16218j10694j02192r1620q0191o8614n6876
50312B910962m4845l2953k2125j2883m962J830O637Q094N677j5q093j7901k8780
50299B760643l9946n0553n9490o5667o9213p1807p4669p6706p6177p3738p1884
50288B030793p1254o9637o5451o0205n6103n2946m9101m4379l9960l6180l2291
$$ y = [2068151, 2107434, 2149538, 2195519, 2244707, 2295086, 2345214, 2395578, 2448076, 2504224, 2563708, 2624639, 2685285, 2745534, 2806626, 2869691, 2935018, 3002763, 3073674, 3148552, 3227128, 3308143, 3390754, 3475459, 3563182, 3653589, 3744761, 3834518, 3921521, 4004816, 4082954, 4154258, 4217662, 4272554, 4317736, 4351329, 4371771, 4378199, 4369660, 4344889, 4303502, 4246728, 4176253, 4092762, 3996536, 3889255, 3774447, 3656070, 3537367, 3421149, 3310455, 3208263, 3116643, 3036452, 2967838, 2910962, 2866117, 2833164, 2811039, 2798156, 2793194, 2795024, 2801661, 2809755, 2815432, 2815417, 2807324, 2789423, 2760643, 2720697, 2670144, 2610654, 2544987, 2475774, 2403967, 2329298, 2252592, 2176415, 2102677, 2030793, 1959539, 1889902, 1824451, 1764246, 1708143, 1655197, 1606096, 1561717, 1521757, 1485577, 1453286]
50277A453286k8253k5125k3324k1814j9382j6021j2737j0469r236q068n866k664
50265A270327M01K707N020Q266J1986J4834J6045J5771J4570J3427J3634J5569
50253A402557J8091K0017K1633K3634K5294K5229K3759K2817K3291K3985K3585
50242A653892K2392K1438K0960K0526J9911J9074J7714J5476J2309Q398L968n47
50230A835511m474p311r108j0391j1874j3957j6315j8194j9478k1026k3427k5934
50218A654022k7292k7308k6742k6011k5047k4216k4135k4429k3848k2036k0250
50207A382708j9759k0238k0365j9492j8195j7375j7302j7322j6378j3962j0652
50196A191668p604n611m713m413l937k784j388p39q80m72J354L444M093L389K758
$$ y = [1453286, 1425033, 1399908, 1376584, 1354770, 1335388, 1319367, 1306630, 1296161, 1286925, 1278857, 1272991, 1270327, 1270728, 1273435, 1278455, 1286721, 1298707, 1313541, 1329586, 1345357, 1359927, 1373354, 1386988, 1402557, 1420648, 1440665, 1462298, 1485932, 1511226, 1536455, 1560214, 1583031, 1606322, 1630307, 1653892, 1676284, 1697722, 1718682, 1739208, 1759119, 1778193, 1795907, 1811383, 1823692, 1832090, 1836058, 1835511, 1831037, 1823726, 1814618, 1804227, 1792353, 1778396, 1762081, 1743887, 1724409, 1703383, 1679956, 1654022, 1626730, 1599422, 1572680, 1546669, 1521622, 1497406, 1473271, 1448842, 1424994, 1402958, 1382708, 1362949, 1342711, 1322346, 1302854, 1284659, 1267284, 1249982, 1232660, 1216282, 1202320, 1191668, 1184064, 1178453, 1173740, 1169327, 1165390, 1162606, 1161218, 1160479, 1159599, 1159127, 1160481, 1163925, 1168018, 1171407, 1174165]
50181A174165K604K137J284Q97Q49j46k186l417k666j298j318k709l961m354m457
50166A155424m916n928p451r015r654q822p181n835n224n199n524n697m910k955
50152A067113p18Q60J722K037J561N50M04K059M281M947L682K013J158J033J310
50137A094012J866J928K20l179o200o842n374l840l841n353p299q601q925q906
50123A029666r545j1045j2294j1924r908p717o759o952p160o826o587p058p614
50110I18277p086n428l804k919k139p44P37J223O00j96m26j84Q9L0o87k125l691
50093H91527m520m435m134m160m175l524k282j331j308j767j655n75P44J403J422
50078H61230J493J887K170K085K028K450L234L970M438M621M610M695N162N855
$$ y = [1174165, 1176769, 1178906, 1180190, 1181087, 1181936, 1181790, 1179604, 1176187, 1173521, 1172223, 1170905, 1168196, 1164235, 1159881, 1155424, 1150508, 1144580, 1137129, 1128114, 1118460, 1109638, 1102457, 1096622, 1091398, 1086199, 1080675, 1074978, 1070068, 1067113, 1066395, 1067255, 1068977, 1071014, 1072575, 1073125, 1073529, 1075588, 1079869, 1084816, 1088498, 1090511, 1091669, 1092702, 1094012, 1095878, 1097806, 1098026, 1094847, 1088647, 1081805, 1076431, 1072591, 1068750, 1063397, 1056098, 1047497, 1038572, 1029666, 1020121, 1009076, 996782, 984858, 974950, 967233, 960474, 953522, 946362, 939536, 932949, 925891, 918277, 911191, 905763, 901959, 899040, 896901, 896157, 896894, 898117, 898717, 898521, 898095, 897911, 898000, 898030, 897343, 895218, 891527, 887007, 882572, 878438, 874278, 870103, 866579, 864297, 862966, 861658, 859891, 858236, 857661, 858405, 859808, 861230, 862723, 864610, 866780, 868865, 870893, 873343, 876577, 880547, 884985, 889606, 894216, 898911, 904073, 909928]
50064I09928O348O659P277Q309R202R501R341R003Q591Q284Q090P275N148K682
50050A015638K041L873O273P263O978O374N329L655K817M467P824J0472J1459
50037A094463J1767J1988J1754J1522J2610J4859J6300J6051J5829J7449K0385
50026A254977K3010K5019K7170K9635L2023L4503L7609M1176M4565M7683N1016
50015A648386N4814N8850O2859O6702P0479P4807Q0490Q7408R4233R9555J02762
50004B501345J03484J01253R6363R0130Q3306P5100O4884N4259M5920M0722L7059
49993C293825L3159K8877K4986K1606J7551J0834kj4465l0130m4763n8103p0839
49981C212536q2377r0857r5240r6135r4581r1284q7251q3773q1024p7712p2878
$$ y = [909928, 916276, 922935, 930212, 938521, 947723, 957224, 966565, 975568, 984159, 992443, 1000533, 1007808, 1012956, 1015638, 1017679, 1021552, 1027825, 1035088, 1042066, 1048440, 1053769, 1057424, 1060241, 1064708, 1072532, 1083004, 1094463, 1106230, 1118218, 1129972, 1141494, 1154104, 1168963, 1185263, 1201314, 1217143, 1234592, 1254977, 1277987, 1303006, 1330176, 1359811, 1391834, 1426337, 1463946, 1505122, 1549687, 1597370, 1648386, 1703200, 1762050, 1824909, 1891611, 1962090, 2036897, 2117387, 2204795, 2299028, 2398583, 2501345, 2604829, 2706082, 2802445, 2892575, 2975881, 3050981, 3115865, 3170124, 3216044, 3256766, 3293825, 3326984, 3355861, 3380847, 3402453, 3420004, 3430838, 3430836, 3416371, 3386241, 3341478, 3283375, 3212536, 3130159, 3039302, 2944062, 2847927, 2753346, 2662062, 2574811, 2491038, 2410014, 2332302, 2259424]
49970B259424o7202o1867n7029n2285m7943m4705m2460m0324l7771l4937l1899
49959A741002k8600k5488k3347k2208k1019j8852j6024j3539j1744j0067p966
49948A542148n621l506j759l41M89L96l31q54p64m65l42j33L01J33j602m370o250
49931A517129n910l897j883j149j876l162l527k109K06J478R72Q6M63J936L117
49916A501874L526M126N972R144J3040J6904J9976K1860K3010K4485K7045L0700
49904A701662L4956L9094M2555M5652M9684N5490O2187O8234P3734Q0557Q9803
49893B343608J00255J09893J17958J24840J30812J35752J39464J41180J39230
49884C482992J32353J21458J09243R8092Q8814Q1240P5100P0128O5886O1628N6078
$$ y = [2259424, 2192222, 2130355, 2073326, 2021041, 1973098, 1928393, 1885933, 1845609, 1807838, 1772901, 1741002, 1712402, 1686914, 1663567, 1641359, 1620340, 1601488, 1585464, 1571925, 1560181, 1550114, 1542148, 1536527, 1533021, 1531262, 1530921, 1531410, 1531806, 1531475, 1530621, 1529857, 1529392, 1529050, 1528917, 1529218, 1529351, 1527749, 1523379, 1517129, 1511219, 1507322, 1505439, 1504290, 1502414, 1499252, 1495725, 1493616, 1493822, 1495300, 1496272, 1496358, 1496821, 1498757, 1501874, 1505400, 1509526, 1515498, 1524642, 1537682, 1554586, 1574562, 1596422, 1619432, 1643917, 1670962, 1701662, 1736618, 1775712, 1818267, 1863919, 1913603, 1969093, 2031280, 2099514, 2173248, 2253805, 2343608, 2443863, 2553756, 2671714, 2796554, 2927366, 3063118, 3202582, 3343762, 3482992, 3615345, 3736803, 3846046, 3944138, 4032952, 4114192, 4189292, 4259420, 4325306, 4386934, 4443012]
49873D443012M7523L4866J8469m70k1210m3342o5652q6181j03687j18176j29784
49862C975368j38122j43137j45701j46696j46213j44281j41680j39030j35621
49853B694887j30066j22072j12806j03595r4937q6887p9705p3802o9254o5501
49843A756262o1523n6598n1155m6518m3462m1233l8419l4531l0431k7485k6621
49832A298286k7713k9220k9033k6511k3413k1876k1749k1083j9066j7016j6145
$$ y = [4443012, 4490535, 4525401, 4543870, 4543400, 4522190, 4478848, 4413196, 4327015, 4223328, 4105152, 3975368, 3837246, 3694109, 3548408, 3401712, 3255499, 3111218, 2969538, 2830508, 2694887, 2564821, 2442749, 2329943, 2226348, 2131411, 2044524, 1964819, 1891017, 1821763, 1756262, 1694739, 1638141, 1586986, 1540468, 1497006, 1455773, 1417354, 1382823, 1352392, 1324907, 1298286, 1270573, 1241353, 1212320, 1185809, 1162396, 1140520, 1118771, 1097688, 1078622, 1061606, 1045461]
$$ [...]
##END NTUPLES=NMR SPECTRUM
##END=
