##TITLE=coffee_type CCPA01-ROVE100E_85-15%
COFFEE_meoh_noesyp64 COFFEE_meoh {C:\Bruker\TOPSPIN} Administrator 6
##JCAMPDX= 6.0         $$ Bruker NMR JCAMP-DX V2.0
##DATA TYPE= NMR SPECTRUM
##DATA CLASS= NTUPLES
##ORIGIN= Bruker BioSpin GmbH
##OWNER= Administrator
$$ 1.72 TOPSPIN		Version 2.1
$$ 2012-05-18 15:51:18.651 -0700  Administrator@X
$$ Compression mode = diff/dup
##.OBSERVE FREQUENCY= 400.13188235
##.OBSERVE NUCLEUS= ^1H
##.ACQUISITION MODE= SIMULTANEOUS (DQD)
##.ACQUISITION SCHEME= undefined
##.AVERAGES= 64
##.DIGITISER RES= 22
##SPECTROMETER/DATA SYSTEM= spect
##.PULSE SEQUENCE= noesygpps1d.comp
##.SOLVENT NAME= COFFEE_meoh
##.SHIFT REFERENCE= INTERNAL, COFFEE_meoh, 1, 14.98061
##AUDIT TRAIL= $$ (NUMBER, WHEN, WHO, WHERE, PROCESS, VERSION, WHAT)
$$ ##TITLE= Audit trail, TOPSPIN		Version 2.1
$$ ##JCAMPDX= 5.01
$$ ##ORIGIN= Bruker BioSpin GmbH
$$ ##OWNER= Administrator
$$ $$ C:\Bruker\TOPSPIN/data/Administrator/nmr/12-COFFEE-2502/162/pdata/1/auditp.txt
$$ ##AUDIT TRAIL=  $$ (NUMBER, WHEN, WHO, WHERE, PROCESS, VERSION, WHAT)
(   1,<2012-02-25 19:22:52.047 -0500>,<Administrator>,<TOPSPIN>,<go>,<TOPSPIN 2.1>,
      <created by zg
	started at 2012-02-25 19:11:21.234 -0500,
	POWCHK enabled, PULCHK disabled,
       configuration hash MD5:
       B0 76 FB 9C 50 81 44 7D 18 B3 26 32 4E 60 AD 96
       data hash MD5: 64K
       6A 94 A3 0D CA 18 A9 9D 78 63 76 75 AE 6B 05 FF>)
(   2,<2012-02-25 19:22:54.781 -0500>,<Administrator>,<TOPSPIN>,<proc1d>,<TOPSPIN 2.1>,
      <Start of raw data processing
       efp LB = 0.3 FT_mod = 6 PKNL = 1 PHC0 = 0 PHC1 = 0 SI = 128K 
       data hash MD5: 128K
       39 4A 89 75 FB C4 12 FB 12 5A 5D 81 BC DB 5A 4B>)
(   3,<2012-02-25 19:22:56.375 -0500>,<Administrator>,<TOPSPIN>,<proc1d>,<TOPSPIN 2.1>,
      <pk PHC0 = 27.49329 PHC1 = 0 
       data hash MD5: 128K
       84 7C 68 0F F6 33 69 2C 84 A8 D8 D0 2D A1 F5 A3>)
(   4,<2012-02-25 19:22:56.609 -0500>,<Administrator>,<TOPSPIN>,<proc1d>,<TOPSPIN 2.1>,
      <abs ABSG = 1 
       data hash MD5: 128K
       FA 49 19 5A CF 7E 21 9C 6A 0E 23 07 25 3B 5D 91>)
(   5,<2012-02-25 19:22:56.687 -0500>,<Administrator>,<TOPSPIN>,<proc1d>,<TOPSPIN 2.1>,
      <abs ABSG = 2 
       data hash MD5: 128K
       76 B8 20 47 7C DD 32 B2 60 9D D2 BA 86 A8 F6 57>)
(   6,<2012-02-25 19:22:56.734 -0500>,<Administrator>,<TOPSPIN>,<proc1d>,<TOPSPIN 2.1>,
      <abs ABSG = 3 
       data hash MD5: 128K
       BD 81 30 8F 74 FC 09 5B 21 BF 0A A3 92 1E 63 55>)
(   7,<2012-02-25 19:22:56.859 -0500>,<Administrator>,<TOPSPIN>,<proc1d>,<TOPSPIN 2.1>,
      <abs ABSG = 4 
       data hash MD5: 128K
       0C D6 76 A1 96 FB 19 25 C4 37 98 FE 25 23 B3 90>)
(   8,<2012-02-25 19:22:57.016 -0500>,<Administrator>,<TOPSPIN>,<proc1d>,<TOPSPIN 2.1>,
      <abs ABSG = 5 
       data hash MD5: 128K
       01 6C 87 49 6C 77 01 2E 9F E5 98 70 B1 B5 98 D4>)
(   9,<2012-02-25 19:22:57.141 -0500>,<Administrator>,<TOPSPIN>,<audit>,<TOPSPIN 2.1>,
      <user comment:
       ICON-NMR User ID: Administrator
$$ [...]
150 150 150 150 150 150 150 150
##$TP07= 0
##$TPNAME0= <>
##$TPNAME1= <>
##$TPNAME2= <>
##$TPNAME3= <>
##$TPNAME4= <>
##$TPNAME5= <>
##$TPNAME6= <>
##$TPNAME7= <>
##$TPOAL= (0..7)
0.5 0.5 0.5 0.5 0.5 0.5 0.5 0.5
##$TPOFFS= (0..7)
0 0 0 0 0 0 0 0
##$TUNHIN= 0
##$TUNHOUT= 0
##$TUNXOUT= 0
##$USERA1= <user>
##$USERA2= <user>
##$USERA3= <user>
##$USERA4= <user>
##$USERA5= <user>
##$V9= 5
##$VALIST= <valist>
##$VCLIST= <CCCCCCCCCCCCCCC>
##$VD= 0
##$VDLIST= <DDDDDDDDDDDDDDD>
##$VPLIST= <PPPPPPPPPPPPPPP>
##$VTLIST= <TTTTTTTTTTTTTTT>
##$WBST= 1024
##$WBSW= 4
##$XGAIN= (0..3)
0 0 0 0
##$XL= 0
##$YL= 0
##$YMAX_a= 9587808
##$YMIN_a= -8223777
##$ZGOPTNS= <>
##$ZL1= 120
##$ZL2= 120
##$ZL3= 120
##$ZL4= 120
##$ABSF1= 14.98061
##$ABSF2= -5.57192
##$ABSG= 5
##$ABSL= 3
##$ALPHA= 0
##$AQORDER= 0
##$ASSFAC= 0
##$ASSFACI= 0
##$ASSFACX= 0
##$ASSWID= 0
##$AUNMP= <proc_prof1d_extract>
##$AXLEFT= 0
##$AXNAME= <>
##$AXNUC= <1H>
##$AXRIGHT= 0
##$AXTYPE= 0
##$AXUNIT= <>
##$AZFE= 0.1
##$AZFW= 0.1
##$BCFW= 0
##$BC_mod= 0
##$BYTORDP= 0
##$COROFFS= 0
##$CY= 15
##$DATMOD= 1
##$DC= 0
##$DFILT= <>
##$DTYPP= 0
##$F1P= 0
##$F2P= 0
##$FCOR= 0.5
##$FTSIZE= 131072
##$FT_mod= 6
##$GAMMA= 0
##$GB= 0
##$INTBC= 1
##$INTSCL= 1
##$ISEN= 128
##$LB= 0.3
##$LEV0= 0
##$LPBIN= 0
##$MAXI= 10000
##$MC2= 0
##$MEAN= 0
##$ME_mod= 0
##$MI= 0
##$NCOEF= 0
##$NC_proc= -1
##$NLEV= 6
##$NOISF1= 0
##$NOISF2= 0
##$NSP= 0
##$NTH_PI= 0
##$NZP= 0
##$OFFSET= 14.98061
##$PC= 1
##$PHC0= 27.49329
##$PHC1= 0
##$PH_mod= 1
##$PKNL= yes
##$PPARMOD= 0
##$PPDIAG= 0
##$PPIPTYP= 0
##$PPMPNUM= 2147483647
##$PPRESOL= 1
##$PSCAL= 4
##$PSIGN= 0
##$PYNMP= <proc.py>
##$REVERSE= no
##$SF= 400.13
##$SI= 131072
##$SIGF1= 0
##$SIGF2= 0
##$SINO= 400
##$SIOLD= 131072
##$SPECTYP= <>
##$SREGLST= <1H.CDCl3>
##$SSB= 0
##$STSI= 131072
##$STSR= 0
##$SW_p= 8223.68421052632
##$SYMM= 0
##$S_DEV= 0
##$TDeff= 65536
##$TDoff= 0
##$TI= <>
##$TILT= no
##$TM1= 0
##$TM2= 0
##$TOPLEV= 0
##$USERP1= <user>
##$USERP2= <user>
##$USERP3= <user>
##$USERP4= <user>
##$USERP5= <user>
##$WDW= 1
##$XDIM= 131072
##$YMAX_p= 115255484
##$YMIN_p= -307304250
##$CURPLOT= <Network HP LaserJet P1505>
##$CURPRIN= <$Network HP LaserJet P1505>
##$DFORMAT= <normdp>
##$LAYOUT= <+/1D_H.xwp>
##$LFORMAT= <normlp>
##$PFORMAT= <normpl>
##$SURQMSG= 1
$$ End of Bruker specific parameters
$$ ---------------------------------
##NTUPLES= NMR SPECTRUM
##VAR_NAME=  FREQUENCY,     SPECTRUM/REAL,   SPECTRUM/IMAG
##SYMBOL=    X,             R,               I
##VAR_TYPE=  INDEPENDENT,   DEPENDENT,       DEPENDENT
##VAR_FORM=  AFFN,          ASDF,            ASDF
##VAR_DIM=   131072,        131072,          131072
##UNITS=     HZ,            ARBITRARY UNITS, ARBITRARY UNITS
##FACTOR=    0.0627417313425165, 1,          1
##FIRST=     8223.62146879498, 1940,         -18213
##LAST=      0,             2695,            -17763
##MIN=       0,             -307304250,      0
##MAX=       8223.62146879498, 115255484,    0
$$ Real data points
##PAGE= N=1
##DATA TABLE= (X++(R..R)), XYDATA
$$ [...]
66530 84366 84295 83720 82785 81829 81190 81056 81331 81610 81506 81078 80785 80921 81286 81469 81275 80743 79921 78890 77897
66511 77897 77201 76789 76451 76094 75802 75570 75206 74585 73832 73133 72553 72097 71824 71733 71654 71395 70979 70616 70468 70545
66491 70545 70735 70823 70507 69610 68307 67059 66240 65860 65652 65341 64834 64243 63784 63547 63361 62981 62440 62046 61965
66472 61965 61970 61765 61408 61195 61171 61020 60459 59578 58727 58215 58159 58457 58826 59013 59041 59167 59484 59720 59534 58916 58165
66451 58165 57548 57135 56915 56886 56972 56950 56587 55885 55168 54857 55059 55439 55582 55441 55253 55060 54577 53684 52776 52362
66431 52362 52465 52685 52800 53000 53461 53995 54225 53983 53388 52635 51848 51104 50481 50043 49753 49447 48959 48338 47882
66412 47882 47859 48228 48707 49070 49289 49429 49500 49424 49105 48552 47976 47651 47598 47551 47378 47367 47848 48646 49186 49128 48620
66391 48620 47975 47394 47029 46979 47084 47021 46735 46492 46380 46103 45512 44995 44998 45384 45644 45583 45384 45107 44595 43937 43527
66370 43527 43517 43542 43218 42656 42244 42137 42202 42316 42475 42671 42891 43202 43650 44065 44162 43840 43227 42472 41647 40883
66350 40883 40389 40261 40384 40599 40854 41113 41288 41351 41388 41374 41033 40132 38879 37793 37184 36979 37064 37488 38175 38706
66330 38706 38664 38109 37481 37093 36947 36966 37130 37331 37380 37272 37271 37528 37777 37579 36831 35864 35092 34699 34681 34984 35500
66309 35500 35975 36077 35620 34708 33661 32778 32182 31851 31705 31628 31507 31390 31554 32254 33299 34042 33944 33168 32480
66290 32480 32523 33263 34173 34846 35270 35536 35532 35110 34430 33872 33555 33223 32720 32318 32307 32449 32190 31422 30664 30427
66270 30427 30673 31063 31424 31730 31832 31560 31047 30689 30694 30850 30838 30684 30764 31380 32363 33168 33405 33217 33072 33180
66250 33180 33280 33060 32607 32288 32258 32281 32043 31492 30843 30356 30134 30080 30004 29838 29726 29840 30108 30236 30040 29687
66230 29687 29556 29881 30510 31024 31096 30776 30432 30348 30402 30215 29593 28728 27976 27534 27406 27543 27858 28177 28338 28378
66210 28378 28491 28738 28938 28956 28952 29160 29491 29616 29438 29223 29159 29083 28838 28630 28717 28888 28674 28049 27537 27514 27751
66189 27751 27850 27800 27861 28076 28250 28274 28198 28023 27682 27254 26955 26894 26979 27120 27332 27583 27698 27549 27217 26881 26610
66168 26610 26327 25967 25584 25325 25327 25617 26065 26450 26598 26471 26137 25686 25204 24794 24561 24540 24641 24766 24933 25215
66148 25215 25508 25494 25004 24352 24086 24366 24796 24990 25090 25582 26658 27975 29001 29463 29491 29466 29733 30334 31012
66129 31012 31515 31851 32174 32439 32337 31619 30390 29078 28141 27823 28092 28754 29586 30373 30882 30943 30605 30097 29581
66110 29581 29033 28452 28024 27909 27963 27868 27537 27209 27136 27330 27639 27906 28033 27999 27914 27933 28062 28132 27988 27648 27204
66089 27204 26684 26032 25222 24348 23621 23249 23211 23209 22957 22550 22406 22790 23515 24161 24509 24669 24873 25239 25682 25990
66069 25990 25983 25659 25189 24763 24468 24319 24326 24472 24692 24906 25088 25256 25409 25503 25490 25384 25335 25554 26102 26787 27314
66048 27314 27574 27722 27978 28409 28897 29248 29339 29255 29248 29468 29728 29670 29196 28578 28120 27794 27369 26770 26196 25898 25975
66027 25975 26367 26960 27672 28455 29252 29950 30422 30665 30833 31066 31296 31284 30898 30275 29689 29284 29025 28863 28850 29001
66007 29001 29119 28897 28240 27371 26572 25909 25311 24834 24673 24904 25340 25677 25723 25479 25102 24807 24717 24758 24772 24745 24848
65986 24848 25204 25717 26158 26401 26497 26580 26753 27017 27286 27469 27587 27713 27816 27751 27488 27249 27297 27656 28144 28653
65966 28653 29217 29789 30127 30037 29678 29516 29940 30945 32120 32904 32899 32145 31171 30705 31128 32185 33228 33784 33861
65947 33861 33764 33794 34147 34921 36006 36984 37350 36973 36275 35864 36037 36679 37563 38553 39486 40074 40097 39677 39147 38688
65927 38688 38217 37685 37258 37078 36990 36730 36270 35800 35472 35355 35587 36246 37075 37647 37863 38020 38272 38379 38157
65908 38157 37873 37906 38203 38376 38207 37804 37388 37184 37371 37855 38161 37885 37206 36683 36593 36770 37001 37185 37106 36519
65888 36519 35593 34892 34689 34635 34311 33795 33405 33139 32775 32352 32174 32332 32519 32425 32086 31781 31726 31935 32297 32674
65868 32674 32994 33286 33618 33989 34322 34550 34682 34756 34730 34492 33983 33358 32932 32920 33249 33659 33941 34045 34054 34137 34424
65847 34424 34794 34872 34422 33687 33152 33008 33047 33046 33038 33168 33534 34171 35025 35855 36385 36609 36761 36963 37117 37166 37153 36983
65825 36983 36461 35747 35417 35797 36480 36813 36681 36512 36647 37036 37470 37794 37808 37273 36163 34800 33671 33105
65807 33105 33106 33385 33584 33497 33091 32397 31536 30847 30703 31095 31615 31975 32309 32772 33135 33064 32661 32367 32408 32640 32869
65786 32869 33041 33121 33089 33067 33197 33376 33323 32948 32454 32034 31645 31177 30638 30143 29816 29747 29926 30226 30570 31028 31615
65765 31615 32072 32126 31928 31977 32536 33351 33988 34239 34125 33748 33305 33050 33085 33255 33344 33273 33046 32625 31988 31245 30604
65744 30604 30224 30129 30223 30370 30500 30630 30754 30813 30840 31037 31515 32052 32300 32209 32050 32030 32097 32133 32105 32005 31861 31872
65722 31872 32304 33152 34095 34880 35526 36083 36403 36343 36061 35898 36067 36509 36966 37100 36716 35987 35350 35069 35012 34927
65702 34927 34759 34564 34284 33796 33088 32237 31342 30594 30246 30291 30330 29986 29369 28864 28495 27864 26746 25493 24660
65683 24660 24435 24595 24890 25263 25699 26017 25932 25324 24416 23630 23268 23318 23576 23871 24125 24275 24230 23919 23335 22566
65663 22566 21812 21316 21206 21373 21613 21856 22180 22621 23073 23393 23529 23505 23367 23180 23010 22866 22719 22639 22789 23158
65643 23158 23385 23058 22253 21595 21616 22179 22711 22902 22936 23073 23311 23591 23983 24475 24780 24668 24386 24420 24883 25429
65623 25429 25818 26217 26786 27240 27099 26250 25070 24040 23412 23217 23400 23854 24412 24879 25129 25204 25289 25520 25779
65604 25779 25745 25229 24396 23642 23253 23221 23332 23385 23321 23192 23033 22809 22513 22253 22148 22179 22239 22301 22434 22664 22933
65583 22933 23182 23348 23355 23247 23317 23832 24598 25047 24877 24317 23668 22861 21831 21029 21084 21941 22776 22918 22547 22276
65563 22276 22318 22410 22368 22325 22378 22368 22193 22090 22366 22965 23545 23933 24200 24329 24123 23594 23135 23100 23368 23584 23618 23552
65541 23552 23357 22959 22582 22630 23162 23810 24311 24794 25391 25859 25855 25385 24744 24152 23675 23412 23487 23881 24402 24837
65521 24837 25022 24807 24142 23165 22106 21124 20296 19739 19605 19918 20480 20934 20968 20510 19777 19081 18601 18395 18541
65502 18541 19083 19827 20395 20564 20423 20149 19816 19513 19419 19616 19944 20184 20235 20067 19719 19482 19812 20809 21968
65483 21968 22696 22925 22957 22880 22521 21894 21315 20972 20702 20311 19916 19796 20028 20381 20561 20481 20320 20282 20331 20254 19974
65462 19974 19635 19329 18965 18531 18254 18309 18551 18799 19158 19767 20400 20693 20669 20668 20772 20707 20345 19935 19737 19750 19891
65441 19891 20143 20401 20472 20399 20523 21057 21802 22416 22769 22861 22629 22065 21388 20901 20740 20874 21209 21598 21846 21869
65421 21869 21802 21841 22030 22248 22374 22387 22430 22717 23272 23728 23617 22879 21981 21447 21481 21991 22738 23375 23618 23539 23508
65400 23508 23692 23836 23670 23340 23257 23683 24592 25708 26538 26606 25914 25012 24419 24113 23747 23182 22566 22111 22025 22480
65380 22480 23306 23868 23631 22782 22001 21663 21599 21557 21513 21485 21444 21521 22007 22968 24077 24932 25359 25336 24883 24159 23456
65359 23456 22940 22544 22214 22060 22138 22296 22417 22633 23055 23420 23292 22614 21842 21487 21658 22137 22723 23390 24107
65340 24107 24685 24912 24834 24800 25140 25838 26571 27057 27256 27264 27173 27059 27021 27156 27511 28061 28696 29261 29690 30100 30669
65319 30669 31423 32245 33078 33976 34927 35781 36445 37067 37928 39174 40676 42137 43350 44426 45710 47411 49388
65302 49388 51435 53675 56377 59346 61812 63071 63101 62398 61413 60327 59170 57884 56333 54497 52627
65287 52627 51056 49856 48838 47802 46666 45370 43904 42398 41018 39743 38420 37043 35807 34868 34179
65272 34179 33648 33250 32905 32396 31543 30407 29241 28267 27545 26996 26529 26178 26095 26332 26630 26597 26109 25441 24932
65253 24932 24629 24327 23861 23280 22797 22596 22662 22762 22673 22428 22229 22126 21940 21541 21023 20528 20053 19550 19058 18649
65233 18649 18365 18318 18643 19228 19670 19747 19743 20090 20756 21296 21407 21174 20807 20443 20200 20133 20070 19759 19272 18987 19085
65212 19085 19299 19310 19150 19090 19257 19539 19731 19686 19410 19128 19104 19358 19677 19929 20165 20400 20566 20773 21280 22014
65192 22014 22460 22297 21864 21643 21570 21275 20824 20675 20923 21132 21010 20815 20886 21165 21396 21523 21626 21688 21715 21898
65172 21898 22367 22871 22987 22633 22158 21925 21942 21962 21795 21468 21124 20861 20683 20598 20702 21045 21446 21556 21225 20694
65152 20694 20329 20203 20051 19614 18939 18308 17955 17898 17987 18037 17901 17510 16982 16645 16790 17334 17846 18051 18207 18798
65132 18798 19908 21085 21810 21941 21686 21360 21230 21430 21866 22255 22323 21912 20974 19620 18257 17438 17416 17913
65114 17913 18404 18564 18402 18093 17855 17867 18162 18598 19004 19344 19649 19835 19733 19323 18850 18634 18774 19066 19249
65095 19249 19308 19466 19877 20415 20838 21055 21113 21067 20997 21087 21464 21985 22386 22618 22795 22903 22839 22786 23125 23872 24510
65074 24510 24597 24269 23956 23844 23823 23749 23495 22983 22446 22411 23076 23884 24065 23528 22851 22481 22304 22030 21661 21466
65054 21466 21687 22340 23119 23563 23507 23338 23571 24250 25016 25680 26390 27208 27927 28369 28591 28687 28680 28687 28931 29477 30207
65033 30207 31131 32427 34031 35538 36708 37796 39132 40625 41938 42993 43994 45078 46187 47257 48273
65018 48273 49170 49832 50177 50169 49813 49248 48726 48379 48091 47685 47083 46216 45010 43618 42433 41602 40737 39379
65000 39379 37648 36108 35066 34309 33513 32587 31567 30460 29310 28223 27271 26506 26046 25971 26094 26066 25755
64983 25755 25309 24837 24272 23624 23085 22720 22269 21485 20522 19797 19563 19773 20269 20889 21428 21707 21713 21592 21468 21377
64963 21377 21330 21364 21513 21800 22232 22743 23141 23202 22882 22426 22227 22498 23040 23383 23241 22827 22600 22718 22910 22910 22821
64942 22821 22900 23144 23286 23121 22679 22078 21396 20706 20125 19785 19821 20310 21131 21931 22386 22484 22457 22448 22431 22428 22612 23095
64920 23095 23768 24393 24755 24683 24114 23266 22599 22422 22619 22840 22864 22638 22120 21342 20562 20097 19939 19761 19360 18928
64900 18928 18764 18872 19032 19152 19359 19728 20123 20376 20521 20730 21062 21410 21677 21880 21990 21791 21077 20007 19088
64881 19088 18695 18709 18726 18549 18369 18483 18951 19525 19896 19992 20073 20446 21073 21532 21512 21193 20942 20772 20365 19641 18974
64860 18974 18724 18798 18840 18682 18421 18200 18090 18112 18210 18300 18424 18743 19223 19516 19367 18997 18804 18781 18593 18200 18018
64839 18018 18338 18883 19184 19147 19040 19032 19020 18845 18487 18027 17592 17359 17492 18032 18880 19863 20746 21236 21172 20732 20350
64818 20350 20328 20590 20877 21088 21308 21549 21617 21308 20666 19963 19496 19445 19837 20459 20861 20645 19868 19078 18799 19086
64798 19086 19605 20029 20233 20210 20041 19874 19796 19721 19557 19477 19765 20412 21049 21376 21439 21392 21169 20625 19888 19330 19180
64777 19180 19300 19410 19413 19452 19670 19981 20146 20103 20091 20341 20722 20874 20719 20572 20692 20915 20916 20669 20427 20357 20373 20285
64755 20285 19986 19532 19184 19258 19764 20286 20389 20121 19894 19920 20021 20001 19949 20048 20283 20445 20344 19952 19438 19105 19143
64734 19143 19404 19560 19488 19332 19177 18932 18655 18706 19336 20279 21048 21520 21959 22497 22896 22896 22610 22426 22616 23087
64714 23087 23484 23538 23341 23211 23247 23153 22696 22184 22169 22698 23215 23300 23182 23294 23605 23719 23491 23193 23092 23187 23401
64693 23401 23752 24193 24539 24706 24887 25295 25810 26048 25791 25234 24769 24608 24641 24631 24497 24418 24634 25164 25774 26210
64673 26210 26434 26566 26635 26456 25820 24803 23846 23420 23576 23863 23799 23362 22908 22668 22502 22225 21918 21794 21889 22077
64653 22077 22320 22664 23011 23130 22951 22679 22536 22515 22515 22590 22874 23308 23593 23485 23061 22649 22511 22643 22825 22845 22674
64632 22674 22497 22566 23005 23699 24363 24739 24780 24644 24522 24454 24312 23946 23397 22949 22920 23330 23840 24090 24058 23961 23891
64611 23891 23732 23481 23369 23546 23823 23968 24072 24384 24848 25127 25050 24792 24553 24349 24185 24172 24392 24790 25320 25934
64591 25934 26351 26156 25335 24454 24007 23810 23405 22893 22859 23492 24259 24633 24711 24896 25268 25630 25961 26451 27114 27634
64571 27634 27654 27041 25904 24529 23324 22622 22463 22648 23010 23514 24063 24428 24470 24304 24119 23921 23574 23057 22581
64552 22581 22463 22931 23956 25204 26221 26800 27119 27403 27569 27394 26985 26779 26956 27117 26720 25750 24752 24261
64534 24261 24334 24616 24699 24449 24132 24199 24834 25689 26225 26293 26218 26289 26396 26317 26165 26288 26752 27183 27219 26952 26761 26799
64512 26799 26807 26481 25902 25470 25454 25747 26063 26241 26277 26155 25861 25546 25446 25548 25456 24781 23688 22860 22832 23460 24177
64491 24177 24693 25252 26162 27285 28185 28679 28969 29224 29301 29036 28599 28312 28201 27960 27383 26654 26181 26228 26722
64472 26722 27287 27497 27249 26885 26793 26899 26708 25917 24805 23933 23638 23888 24487 25197 25728 25849 25610 25355 25391
64453 25391 25638 25686 25276 24703 24576 25128 25928 26390 26427 26383 26453 26505 26444 26397 26412 26267 25806 25224 24828 24684 24707 24883
64431 24883 25167 25291 24975 24294 23597 23085 22672 22254 21906 21780 21944 22355 22867 23280 23491 23609 23812 24158 24625
64412 24625 25213 25845 26254 26218 25907 25747 25881 26035 25988 25929 26177 26721 27257 27619 27898 28154 28186 27758 26961 26223
64392 26223 25913 26003 26170 26162 25929 25515 24986 24551 24557 25179 26209 27216 27852 27965 27608 27105 26916 27197 27587 27620
64372 27620 27282 26930 26803 26901 27250 27890 28566 28856 28740 28752 29323 30255 31050 31534 31883 32222 32537 32905 33468 34136
64352 34136 34587 34676 34677 34948 35484 35965 36221 36494 37142 38145 39059 39466 39382 39129 38896 38567 37953 37018 35879 34706
64332 34706 33692 33021 32763 32847 33123 33411 33557 33509 33375 33267 33108 32724 32122 31511 31006 30522 30038 29768 29931
64313 29931 30448 31033 31497 31843 32134 32417 32720 33009 33185 33231 33318 33624 34008 34004 33263 31988 30860 30431 30603 30763
64293 30763 30496 30041 29964 30507 31443 32454 33366 33992 34100 33725 33321 33410 34138 35249 36343 37084 37353 37406 37712
64274 37712 38448 39230 39520 39181 38529 37980 37843 38261 39084 39881 40384 40843 41672 42782 43631 43996 44332 45191 46536
64255 46536 47858 48831 49629 50633 52017 53627 55136 56318 57133 57578 57503 56728 55345 53773 52392 51250
64239 51250 50216 49327 48798 48715 48863 48910 48673 48184 47572 46960 46460 46156 46042 46020 46022 46122 46436 46919 47347 47560
64219 47560 47666 47939 48526 49343 50197 50942 51509 51902 52160 52265 52066 51402 50361 49349 48815 48873 49220 49441 49369
64200 49369 49161 49042 49084 49195 49269 49198 48843 48146 47333 46832 46853 47133 47215 46964 46696 46813 47394 48172 48791 49101 49220
64179 49220 49403 49812 50425 51094 51663 52055 52324 52655 53229 54068 55063 56158 57375 58615 59607 60211 60651 61260
64161 61260 62049 62686 62904 62761 62508 62353 62405 62681 63086 63439 63626 63726 63983 64649 65814 67286 68685 69729
64143 69729 70467 71156 71939 72704 73285 73707 74189 74938 75974 77129 78237 79313 80499 81810 83004 83760 83969
64126 83969 83785 83472 83259 83284 83523 83727 83542 82747 81409 79798 78169 76608 75094 73662 72450 71487 70585
64109 70585 69618 68855 68725 69196 69677 69708 69461 69373 69538 69791 70178 70924 72022 73222 74414 75704 77086 78392
64091 78392 79654 81171 83110 85269 87357 89301 91186 93137 95369 98148 101555 105426 109567 113822
64077 113822 117915 121504 124539 127300 129940 132222 133894 135028 135765 135910 135092 133228 130589 127527 124310
64062 124310 121110 117944 114710 111473 108616 106460 104845 103304 101595 99840 98205 96702 95353 94285
64048 94285 93583 93184 92968 92823 92619 92277 91920 91848 92303 93304 94687 96215 97699 99107 100599 102341 104307
64031 104307 106321 108269 110178 112125 114162 116284 118398 120306 121838 122927 123474 123272 122228 120608 118845
64016 118845 117145 115441 113722 112162 110887 109817 108822 107866 106899 105806 104586 103439 102547 101854 101214 100676
64000 100676 100431 100523 100788 101124 101645 102464 103455 104421 105420 106719 108392 110176 111885 113778 116279 119378 122608
63983 122608 125616 128490 131456 134561 137829 141454 145530 149733 153506 156567 159038 161201 163302 165491
63969 165491 167698 169616 171038 172188 173484 175053 176754 178618 180914 183670 186535 189257 192101 195522
63955 195522 199635 204220 209128 214456 220314 226555 232760 238467 243474 247952 252175 256218 260016 263696
63941 263696 267571 271730 275872 279687 283263 286971 291102 295776 301044 306919 313384 320532 328598 337709
63927 337709 347731 358515 370203 383131 397529 413491 431090 450292 470864 492637 515821
63916 515821 540780 567527 595737 625301 656546 689808 725090 762329 801739 843693 888465
63905 888465 936397 988201 1044739 1106482 1173486 1246019 1325027 1411896 1507992 1614620 1733267
63894 1733267 1865545 2012837 2176159 2356383 2554324 2770312 3003638 3252552 3514830
63885 3514830 3788287 4070731 4359449 4650754 4939822 5220870 5487550 5733440 5952497
63876 5952497 6139470 6290262 6402103 6473350 6502970 6490130 6434278 6335672 6195947 6018372
63866 6018372 5807659 5569451 5309732 5034421 4749146 4459070 4168710 3881927 3602108
63857 3602108 3332390 3075635 2834206 2609749 2403077 2214156 2042235 1886155 1744732
63848 1744732 1616960 1501904 1398487 1305452 1221557 1145758 1077159 1014840 957901 905671 857742
63837 857742 813673 772804 734513 698589 665111 633946 604603 576627 549949 524723 500971
63826 500971 478518 457151 436711 417126 398491 381039 364867 349764 335410 321679 308618
63815 308618 296239 284533 273599 263528 254189 245321 236900 229183 222364 216334 210827 205618 200522
63802 200522 195451 190585 186255 182495 178833 174766 170368 166206 162721 159877 157426 155211 153124 150954
63788 150954 148573 146236 144460 143486 142958 142236 140963 139243 137289 135111 132633 129919 127118 124234 121142
63773 121142 117820 114432 111111 107808 104423 100984 97599 94353 91333 88662 86394 84412 82550 80774
63759 80774 79186 77853 76732 75706 74615 73282 71652 69937 68489 67438 66525 65374 63907 62415 61253
63744 61253 60522 60067 59666 59189 58623 58047 57598 57366 57253 56978 56290 55226 54149 53459 53237 53189 52957 52493 52064
63725 52064 51846 51592 50856 49570 48244 47500 47469 47777 48036 48178 48294 48354 48233 47923 47593 47417 47432 47579 47792
63706 47792 47983 47970 47590 46950 46468 46492 46880 47129 46964 46621 46450 46482 46573 46809 47404 48281 49069 49566 49937 50365
63686 50365 50778 51060 51327 51810 52635 53801 55188 56488 57352 57822 58416 59567 61168 62869 64627 66636
63670 66636 68882 71143 73355 75662 78060 80380 82612 84943 87329 89355 90689 91468 92060 92604 92969
63655 92969 93040 92872 92624 92442 92340 92127 91532 90478 89132 87654 86041 84290 82554 80990 79569 78165
63639 78165 76775 75517 74474 73655 73039 72560 72088 71526 70922 70416 70110 70012 70050 70085 69994 69791 69665 69885 70677
63620 70677 72143 74109 76102 77728 79141 80941 83455 86350 89095 91591 94133 96893 99716 102301
63606 102301 104339 105569 105936 105675 105045 104018 102460 100480 98334 96077 93620 91142 89024 87302 85549
63591 85549 83492 81481 80120 79611 79640 79753 79679 79466 79491 80202 81682 83550 85424 87287 89230 91054 92469
63574 92469 93613 95018 97054 99642 102580 105848 109493 113391 117382 121506 125979 130973 136520 142576
63560 142576 149072 155931 163141 170825 179117 187989 197268 206868 216858 227211 237513 247060 255253 261857
63546 261857 266890 270402 272448 273186 272900 271950 270727 269531 268354 266853 264720 262060 259250 256402 253172
63531 253172 249144 244246 238714 232824 226787 220769 214870 209125 203621 198545 194025 190042 186599 183828
63517 183828 181764 180132 178587 177126 176028 175405 175047 174766 174638 174814 175320 176185 177633 179909 182997 186676
63501 186676 190855 195650 201126 207107 213338 219745 226467 233747 241859 251049 261301 272118 282659
63488 282659 292246 300701 308123 314405 319146 322055 323297 323398 322906 322191 321481 320924 320590 320472 320446 320199 319239
63471 319239 317068 313372 308098 301396 293526 284714 275038 264521 253391 242190 231541 221813 213019
63458 213019 204926 197199 189565 182039 174926 168492 162678 157251 152116 147339 142905 138736 134916 131650
63444 131650 128950 126566 124347 122444 121046 120078 119297 118544 117764 116940 116193 115833 116088 116772 117466 118007 118688
63427 118688 119910 121788 124125 126678 129341 132140 135099 138124 141002 143549 145735 147598 149040 149785
63413 149785 149592 148496 146817 144934 143031 141023 138707 136047 133302 130869 128976 127560 126424 125444 124584
63398 124584 123783 122947 122103 121503 121453 122027 122977 123973 124852 125622 126328 127058 128026 129512 131631 134274 137300 140709
63380 140709 144551 148760 153192 157786 162648 167981 173972 180685 188052 196009 204659 214207 224692 235911
63366 235911 247676 260028 273030 286472 299983 313413 326885 340370 353387 365181 375100 382741
63354 382741 387930 390717 391404 390473 388474 385939 383291 380701 378075 375194 371808 367569 362036 354954 346550
63339 346550 337410 327989 318324 308272 297901 287589 277759 268656 260407 253120 246827 241377 236530
63326 236530 232165 228306 224934 221973 219563 218144 218041 219020 220521 222342 224808 228195 232276 236627 241163
63311 241163 246086 251444 257115 263217 270182 278244 287099 296277 305720 315796 326772 338447 350250
63298 350250 361529 371716 380395 387355 392531 395876 397311 396879 394941 392094 388816 385246 381344 377202
63284 377202 373031 368796 364040 358230 351253 343422 335063 326289 317187 307974 298811 289619 280279 270919
63270 270919 261834 253183 244986 237413 230806 225305 220590 216114 211574 207058 202829 199079 195854 193072
63256 193072 190593 188275 186052 183969 182167 180779 179767 178880 177887 176812 175893 175254 174763 174244 173699 173192
63240 173192 172637 171901 171068 170417 170072 169831 169415 168806 168170 167534 166686 165458 164017 162781 162047 161804 161872 162103
63222 162103 162366 162465 162242 161784 161366 161168 161135 161153 161214 161316 161358 161285 161245 161449 161900 162398 162829 163269 163825 164503 165291
63201 165291 166241 167370 168541 169518 170132 170437 170722 171382 172625 174322 176190 178098 180115 182325 184765 187519
63185 187519 190603 193747 196546 199002 201673 205033 208907 212845 216903 221626 227233 233204 238903 244306
63171 244306 249850 255757 261857 267981 274203 280658 287358 294291 301457 308622 315223 320803 325531 330072
63157 330072 334885 339826 344539 349007 353502 358015 362001 364781 366084 366075 364975 362833 359641 355514 350629
63142 350629 345080 338924 332364 325775 319488 313576 307920 302482 297456 293153 289777 287318 285649 284702
63128 284702 284550 285305 286912 289117 291723 294841 298786 303690 309314 315259 321289 327384 333595 339970 346533
63113 346533 353228 359883 366300 372350 377924 382886 387214 391103 394712 397798 399783 400250 399263 397143 394104
63098 394104 390164 385270 379341 372281 364100 355059 345599 336146 326992 318324 310238 302736 295734 289112
63084 289112 282771 276715 271069 265965 261404 257337 253847 251113 249138 247655 246397 245308 244396 243515 242529
63069 242529 241598 241111 241277 241913 242656 243265 243718 244114 244561 245101 245710 246357 247011 247590 247983 248184 248357 248699 249287
63050 249287 250103 251119 252289 253539 254848 256214 257439 258134 258149 257894 257974 258544 259266 259869 260477 261286 262210
63033 262210 263030 263723 264512 265636 267181 269031 270945 272747 274487 276321 278238 280096 281931 284033 286621
63018 286621 289561 292528 295280 297741 300036 302551 305747 309744 314228 318906 323848 329208 334842 340469
63004 340469 346034 351670 357439 363423 369940 377272 385233 393367 401596 410328 419836 429903 440193 450654
62990 450654 461360 472289 483482 495214 507679 520612 533465 545887 557852 569475 580924
62979 580924 592460 604268 616238 628104 639772 651329 662763 673931 684840 695668 706351
62968 706351 716329 724877 731592 736380 739048 739155 736362 730767 722801 712892 701388 688761 675637 662462
62954 662462 649273 636016 623057 611144 600808 591984 584347 577834 572696 569171 567345 567226 568729
62941 568729 571609 575591 580571 586515 593217 600373 607948 616143 624934 633869 642523 650958 659534 668364
62927 668364 677130 685340 692599 698698 703632 707501 710210 711283 710158 706660 701029 693458 683757 671581
62913 671581 656852 639870 621139 601187 580510 559559 538736 518395 498799 480055 462118
62902 462118 444882 428305 412493 397762 384550 373092 363126 353985 345091 336322 327916 320111 312939
62889 312939 306288 300036 294167 288815 284166 280226 276713 273235 269613 265920 262238 258492 254586 250631
62875 250631 246900 243537 240381 237172 233888 230812 228218 226054 224006 221841 219574 217287 214915 212301
62861 212301 209458 206640 204166 202194 200709 199649 198948 198476 198013 197381 196608 195884 195382 195106 194949 194801 194526
62844 194526 193923 192842 191387 189931 188865 188338 188231 188347 188581 188957 189509 190153 190694 190999 191127 191207 191230 191056
62826 191056 190658 190237 190014 189989 189973 189791 189389 188814 188244 187983 188250 188914 189503 189602 189210 188670 188285 188032 187645 186937
62806 186937 186000 185134 184593 184381 184282 184036 183502 182684 181671 180571 179500 178564 177806 177191 176663 176176 175625 174815
62788 174815 173652 172422 171663 171654 172136 172677 173167 173713 174186 174243 173887 173666 174053 174837 175397 175486 175459 175713 176182 176515
62768 176515 176560 176511 176589 176761 176824 176677 176441 176314 176424 176837 177602 178657 179759 180635 181226 181666 182090 182567 183171
62749 183171 183921 184659 185198 185647 186382 187600 189154 190870 192796 194919 196951 198696 200503 203002 206442
62734 206442 210521 214838 219231 223717 228413 233626 239747 246915 254895 263345 272120 281319 291178 301977
62720 301977 313904 326942 340985 356011 372040 388975 406686 425223 444686 464854 485195
62709 485195 505340 525305 545082 564165 581637 596628 608597 617341 622896 625360 624633 620405 612507
62696 612507 601272 587435 571733 554611 536275 516899 496795 476391 456071 436067 416577
62685 416577 397919 380374 363911 348272 333398 319550 306912 295284 284318 273915 264216 255345
62673 255345 247330 240189 233893 228336 223477 219449 216289 213649 211029 208355 206106 204751 204193 203880 203429
62658 203429 202992 203016 203740 205008 206546 208295 210391 212942 215958 219465 223522 228108 233200 238961 245689
62643 245689 253462 262057 271295 281268 292106 303771 316306 330069 345403 362165 379891 398350
62631 398350 417612 437579 457805 477893 497753 517238 535734 552347 566390 577532 585583 590391
62619 590391 591918 590206 585192 576738 564968 550457 533989 516157 497309 477762 457862 437787
62607 437787 417528 397214 377321 358416 340773 324407 309338 295569 282884 270978 259837
62596 259837 249707 240614 232201 224154 216524 209463 202865 196520 190455 184876 179899 175508 171615 168029
62582 168029 164477 160899 157550 154660 152146 149854 147855 146187 144544 142586 140468 138654 137298 136187
62568 136187 135252 134703 134579 134579 134422 134130 133848 133706 133881 134443 135085 135406 135551 136179 137608 139410 141081 142726
62550 142726 144746 147187 149792 152442 155171 157907 160612 163547 167003 170818 174612 178465 183013 188704
62536 188704 195256 202013 208650 215411 222744 230851 239587 248725 258271 268398 279070 289893 300440
62523 300440 310511 319922 328270 335150 340513 344469 346825 347128 345184 341278 335791 328879 320627 311307
62509 311307 301358 291233 281328 271874 262822 253963 245254 236885 228986 221450 214149 207157 200679 194848
62495 194848 189709 185244 181288 177535 173800 170202 166978 164182 161689 159390 157195 154958 152637 150491
62481 150491 148893 147849 146903 145661 144261 143155 142537 142216 141991 141940 142247 142947 143998 145448 147345 149552
62465 149552 151851 154219 156806 159634 162564 165617 169108 173277 177972 182884 187952 193343 199184 205566
62451 205566 212748 221045 230478 240779 251762 263380 275344 287033 297985 308262 318021 326901
62439 326901 334175 339484 343109 345442 346405 345537 342492 337342 330509 322564 314028 305225 296226 286987 277569
62424 277569 268221 259203 250625 242472 234790 227774 221602 216256 211526 207164 202969 198756 194420 190069
62410 190069 186024 182595 179875 177770 176139 174830 173686 172622 171694 170988 170483 170084 169825 169911 170496 171480
62394 171480 172602 173701 174828 176083 177413 178645 179751 180966 182513 184259 185786 186886 187817 188904
62380 188904 190034 190754 190826 190406 189632 188318 186263 183678 181053 178642 176285 173752 171038 168308 165698
62365 165698 163291 161165 159351 157818 156556 155610 155004 154684 154620 154870 155468 156283 157146 158060 159220 160793 162780
62348 162780 165064 167497 169920 172207 174364 176558 178997 181772 184792 187873 190906 193993 197365 201091
62334 201091 204897 208363 211278 213679 215593 216952 217839 218573 219383 220131 220522 220530 220443 220531 220883 221538 222589 224128
62316 224128 226253 229207 233281 238498 244517 250999 257974 265764 274607 284512 295408 307292 320246
62303 320246 334411 349977 367105 385837 406071 427546 449802 472230 494322 515816 536449
62292 536449 555579 572191 585395 594860 600809 603702 603920 601584 596564 588731 578279 565714 551481
62279 551481 535722 518534 500355 481908 463741 445965 428490 411462 395371 380773 367898
62268 367898 356490 345999 335955 326174 316698 307696 299434 292180 285955 280448 275320 270556 266368
62255 266368 262843 259866 257390 255516 254224 253276 252523 252113 252177 252443 252434 252024 251591 251561 251928 252279 252176 251473
62237 251473 250353 249168 248216 247607 247268 247014 246648 246090 245500 245177 245293 245806 246681 248043 249957 252191 254420
62220 254420 256599 258928 261491 264191 267069 270389 274304 278663 283347 288597 294808 302115 310343 319267
62206 319267 328731 338611 348932 360041 372479 386602 402397 419625 438006 457263 477139 497454
62194 497454 518011 538342 557619 574866 589293 600472 608384 613314 615583 615233 612014 605771 596785
62181 596785 585669 572936 558777 543242 526560 509216 491805 474854 458773 443827 430094
62170 430094 417472 405783 394921 384909 375823 367714 360603 354503 349392 345161 341630 338630 336120
62157 336120 334218 333097 332758 332884 332992 332814 332498 332385 332608 332954 333189 333399 334011 335428 337685 340439 343298
62140 343298 346115 348996 352096 355554 359579 364403 370055 376259 382729 389496 396802 404729 413147 421995
62126 421995 431351 441073 450673 459766 468528 477378 486248 494438 501346 507129 512593 518528 525263 532679
62112 532679 540495 548647 557486 567542 578979 591435 604556 618477 633453 649110 664424 678489
62100 678489 690969 701661 710055 715701 718805 720081 720042 718703 715966 711967 706961 701132 694622 687633
62086 687633 680356 672916 665467 658278 651667 645890 641100 637325 634489 632500 631294 630743 630610 630753 631291
62071 631291 632418 634121 636310 639109 642682 646758 650778 654684 659169 664861 671535 678483 685421 692643
62057 692643 700421 708708 717451 726750 736585 746710 756975 767512 778472 789779 801299 813098
62045 813098 825323 837957 850875 864087 877736 891925 906658 921941 937827 954381 971685
62034 971685 989868 1008954 1028647 1048311 1067282 1085270 1102477 1119370 1136365 1153730 1171699
62023 1171699 1190527 1210301 1230706 1251109 1270938 1289987 1308397 1326429 1344294 1362102 1379854
62012 1379854 1397484 1414988 1432577 1450672 1469667 1489651 1510268 1530883 1550918 1570107 1588452
62001 1588452 1605956 1622371 1637167 1649791 1659997 1667974 1674125 1678724 1681793 1683241 1683013 1681105 1677570
61988 1677570 1672562 1666301 1658940 1650594 1641499 1632027 1622398 1612551 1602459 1592461 1583073 1574520 1566654 1559305
61974 1559305 1552471 1546123 1540068 1534155 1528486 1523312 1518751 1514679 1510828 1506942 1502955 1499051 1495448 1492039
61960 1492039 1488398 1484273 1479989 1476206 1473288 1471019 1468938 1466877 1465076 1463857 1463224 1462851 1462442 1462046 1461935
61945 1461935 1462233 1462770 1463294 1463721 1464082 1464360 1464462 1464275 1463599 1462057 1459185 1454690 1448565 1440904 1431657 1420645
61929 1420645 1407840 1393600 1378575 1363341 1348145 1333007 1317942 1303013 1288245 1273684 1259529
61918 1259529 1246025 1233127 1220399 1207425 1194284 1181472 1169333 1157724 1146296 1134978 1124055
61907 1124055 1113773 1104031 1094550 1085274 1076477 1068428 1061076 1054118 1047332 1040735 1034413 1028361 1022533 1017008
61893 1017008 1011992 1007644 1003967 1000902 998488 996862 996069 995983 996499 997730 999921 1003172 1007362 1012361 1018182
61878 1018182 1024908 1032589 1041187 1050443 1059800 1068742 1077392 1086509 1096755 1108090 1120127 1132786 1146263
61865 1146263 1160575 1175581 1191432 1208588 1227336 1247710 1269970 1294797 1322793 1354127 1388858
61854 1388858 1427397 1470412 1518491 1572125 1631840 1698144 1771440 1852148 1940785 2037840 2143690
61843 2143690 2258735 2383331 2517398 2660294 2811175 2969006 3131709 3295316 3454236
61834 3454236 3602127 3732142 3836731 3908393 3941561 3934146 3887491 3805344 3692987 3556717
61824 3556717 3403221 3238822 3069000 2898318 2730489 2568422 2414229 2269239 2134031
61815 2134031 2008558 1892392 1785018 1686057 1595308 1512565 1437332 1368816 1306281 1249368 1197967
61804 1197967 1151825 1110415 1073113 1039396 1008924 981625 957719 937422 920546 906510 894765
61793 894765 885081 877372 871401 866803 863287 860671 858739 857184 855674 853937 851783 849113 845923 842262
61779 842262 838155 833566 828442 822889 817298 812268 808315 805678 804378 804303 805220 806808 808858 811336 814144
61764 814144 816898 819155 820769 821827 822257 821759 820200 817899 815455 813423 812166 811812 812295 813572 815923
61749 815923 819872 825764 833580 843208 854698 868118 883364 900316 919108 940098 963576 989634
61737 989634 1018241 1049348 1083007 1119460 1159041 1201877 1247816 1296794 1349170 1405517 1466198
61726 1466198 1531362 1601344 1676859 1758746 1847761 1944734 2050759 2167034 2294534 2433980
61716 2433980 2586185 2752313 2933761 3131829 3347512 3581515 3834104 4104647 4391138
61707 4391138 4690041 4996197 5302415 5598930 5873548 6112779 6303436 6434125 6496648 6487312
61697 6487312 6407621 6263803 6065493 5824297 5552495 5261750 4962088 4661610 4366804 4082724
61687 4082724 3812782 3558691 3321000 3099868 2895411 2707485 2535352 2377695 2233043
61678 2233043 2100242 1978512 1867080 1764933 1671088 1584971 1506302 1434560 1368834 1308267
61668 1308267 1252449 1201248 1154406 1111454 1071910 1035324 1001206 969095 938701 909858 882342
61657 882342 855884 830395 806003 782809 760703 739500 719136 699642 680978 663045 645875
61646 645875 629725 614908 601549 589494 578423 567977 557869 547954 538278 529004 520214 511790
61634 511790 503572 495591 488051 481008 474205 467373 460602 454215 448283 442462 436472 430563 425305 420939
61620 420939 417105 413246 409138 405012 401306 398376 396307 394822 393426 391821 390161 388761 387524 385820
61606 385820 383033 379147 374718 370332 366204 362249 358380 354667 351270 348307 345777 343585 341625 339871
61592 339871 338392 337325 336803 336883 337486 338426 339506 340577 341540 342356 343091 343881 344770 345633 346311 346785 347096 347191
61574 347191 347007 346705 346644 347047 347792 348676 349758 351286 353265 355312 356976 358134 358969 359609 359907 359590 358519
61557 358519 356710 354175 350901 347041 342964 338989 335123 331200 327224 323383 319748 316185 312675 309487
61543 309487 306835 304527 302174 299683 297334 295385 293877 292832 292373 292483 292804 292925 292825 292896 293544 294828
61527 294828 296505 298299 300131 302148 304592 307612 311180 315104 319128 323078 327067 331567 337144 344015
61513 344015 351879 360203 368639 377184 386074 395613 406040 417406 429501 441850 453742 464375 473222
61500 473222 480468 486937 493424 500072 506486 512358 517800 523078 528252 533192 537835 542267 546565 550639
61486 550639 554285 557364 559894 561894 563187 563481 562728 561318 559777 558303 556680 554610 552026 549111 546190
61471 546190 543680 541978 541277 541489 542444 544146 546838 550797 556105 562646 570322 579251 589654 601603
61457 601603 615033 630023 646926 666050 687370 710733 736267 764377 795406 829500 866814
61446 866814 907598 952053 1000302 1052522 1108832 1168942 1232108 1297510 1364378 1431545 1497062
61435 1497062 1558522 1613690 1660716 1697932 1723922 1737956 1740271 1731903 1714251 1688743 1656700 1619394
61423 1619394 1578199 1534635 1490190 1446107 1403340 1362591 1324341 1288910 1256560 1227506 1201803
61412 1201803 1179392 1160309 1144705 1132574 1123589 1117358 1113712 1112609 1113903 1117403 1123074 1130974 1141047
61399 1141047 1153132 1167068 1182622 1199392 1217005 1235310 1254178 1273192 1291813 1309870 1327587
61388 1327587 1345145 1362439 1379303 1395687 1411532 1426714 1441229 1455151 1468318 1480287 1490750
61377 1490750 1499828 1507752 1514509 1519986 1524289 1527622 1529961 1531111 1531050 1530049 1528431 1526384 1523971 1521150
61363 1521150 1517767 1513697 1508981 1503692 1497708 1490806 1483081 1475077 1467413 1460336 1453727 1447446 1441554 1436218
61349 1436218 1431510 1427289 1423223 1418888 1413954 1408365 1402355 1396219 1390042 1383708 1377212 1370921 1365434 1361254
61335 1361254 1358680 1358029 1359770 1364369 1372081 1382990 1397208 1415018 1436908 1463473 1495195 1532174
61323 1532174 1574154 1620851 1672181 1728093 1788309 1852365 1919741 1989661 2060709 2130859 2197930
61312 2197930 2259875 2314644 2360130 2394600 2417157 2427695 2426503 2414106 2391379 2359491 2319593
61301 2319593 2272658 2219659 2161727 2100067 2035832 1970165 1904227 1839005 1775174 1713252 1653789
61290 1653789 1597257 1543788 1493216 1445387 1400306 1358013 1318550 1282127 1249097 1219609 1193415
61279 1193415 1170140 1149689 1132262 1118036 1107026 1099213 1094579 1092878 1093541 1095969 1099944 1105700 1113508
61266 1113508 1123246 1134396 1146431 1159068 1172121 1185208 1197813 1209618 1220637 1230987 1240620 1249346
61254 1249346 1256966 1263349 1268474 1272552 1275993 1279125 1281900 1283900 1284638 1283815 1281398 1277472 1272011 1264831
61240 1264831 1255867 1245444 1234096 1222088 1209325 1195794 1181827 1167826 1153946 1140243 1126914
61229 1126914 1114131 1101850 1090023 1078873 1068653 1059297 1050616 1042740 1035940 1030091 1024713 1019581 1014877
61216 1014877 1010624 1006402 1001850 997128 992611 988358 984153 979930 975896 972343 969547 967793 967313 968197
61202 968197 970405 973797 978106 983067 988681 995226 1002927 1011809 1022042 1034202 1048933 1066410 1086378
61189 1086378 1108597 1132986 1159325 1187055 1215415 1243570 1270497 1294882 1315236 1330123 1338306
61178 1338306 1338860 1331304 1315700 1292700 1263532 1229799 1193060 1154464 1114760 1074617 1034823 996171
61166 996171 959270 924496 892031 861863 833786 807524 782922 760011 738905 719672 702297
61155 702297 686731 672935 660847 650327 641137 633003 625750 619410 614186 610212 607382 605521 604717
61142 604717 605309 607454 610835 614918 619403 624298 629625 635204 640700 645692 649731 652481 653855 653952 652892
61127 652892 650837 648102 645024 641655 637734 633036 627674 621969 616066 609736 602576 594449 585699 576847
61113 576847 568016 558828 548958 538589 528158 517804 507318 496542 485536 474464 463585 453303
61101 453303 443950 435498 427720 420543 413969 407764 401628 395677 390368 385858 381812 377885 373973 369896
61087 369896 365277 359998 354390 348735 342915 336761 330444 324271 318392 312988 308383 304684 301545 298648
61073 298648 296174 294494 293605 293215 293203 293614 294399 295516 297192 299694 302918 306491 310186 313936 317545 320786
61057 320786 323739 326733 329985 333495 337210 340987 344481 347425 349965 352463 354968 357206 358963 360183
61043 360183 360741 360495 359558 358160 356241 353574 350316 347017 343950 340823 337353 333793 330587 327737 324834
61028 324834 321617 318247 315030 312104 309414 306879 304497 302282 300192 298189 296364 294885 293759 292786
61014 292786 291812 290904 290163 289510 288818 288139 287580 287055 286380 285634 285215 285518 286622 288205 289683 290591 291053 291753
60996 291753 293209 295167 296954 298277 299371 300471 301524 302509 303657 305236 307348 310080 313587 317837
60982 317837 322439 326925 331168 335401 339873 344622 349604 354944 360918 367678 375096 383001 391480 400739
60968 400739 410711 421094 431834 443307 455897 469650 484458 500279 517007 534441 552599 571775
60956 571775 592083 613272 635261 658496 683422 709922 737741 767169 798845 833074 869818
60945 869818 909174 951398 996531 1044451 1095175 1148790 1205330 1265119 1329068 1398142 1472774
60934 1472774 1553212 1640130 1734346 1836250 1946210 2065364 2195456 2338297 2496199 2672704
60924 2672704 2872091 3098503 3356407 3651414 3989608 4376921 4820987 5332967 5925166
60915 5925166 6607237 7387353 8273920 9263231 10312339 11324530 12176550 12777929 13115091
60906 13115091 13245042 13253692 13221784 13215986 13283205 13427334 13586075 13644542 13490660 13072058
60896 13072058 12411410 11578602 10652875 9701708 8775871 7908813 7117096 6404811 5770169
60887 5770169 5209131 4715707 4282529 3902553 3569655 3277895 3021452 2795288 2595012
60878 2595012 2416178 2254729 2108054 1974712 1853180 1741742 1639490 1546313 1461697 1384382
60868 1384382 1313355 1248289 1188681 1133314 1080969 1031112 983573 938132 894784 853948 816044
60857 816044 781069 748715 718565 690062 662712 636510 611839 588854 567311 547056 528233
60846 528233 510890 494821 479966 466577 454723 443990 433860 424160 414913 406061 397511 389322
60834 389322 381667 374753 368746 363601 358972 354511 350238 346361 342830 339377 335935 332645 329477 326283
60820 326283 323177 320403 317729 314464 310228 305337 300277 295199 290114 285220 280770 276850 273389 270159
60806 270159 266750 262887 258877 255388 252725 250684 249150 248318 248131 248060 247777 247649 248224 249555 251376 253604
60790 253604 256266 259151 261983 264817 267928 271425 275265 279540 284394 289711 295115 300253 304866 308671
60776 308671 311496 313541 315304 317156 319131 321102 322990 324698 325971 326475 326103 325164 324111 323084 321829
60761 321829 320184 318435 317014 315980 315038 313941 312566 310666 307997 304758 301525 298623 295827 292836
60747 292836 289716 286708 283870 281136 278555 276249 274295 272754 271670 270921 270247 269576 269138 269144 269516 270038
60731 270038 270652 271472 272648 274310 276511 279099 281786 284396 286994 289766 292913 296625 300884 305278 309245
60716 309245 312612 315639 318556 321321 323893 326424 329003 331473 333710 335848 338069 340324 342402 344144
60702 344144 345524 346696 347979 349552 351112 352138 352539 352759 353148 353590 353866 354010 354114 354137 354108 354185 354275 353927
60684 353927 352874 351411 349986 348737 347619 346581 345327 343280 340244 336819 333730 331028 328393 325917
60670 325917 323983 322492 320852 318794 316670 314885 313439 312175 311111 310342 309867 309648 309643 309686 309496 308871 307824
60653 307824 306531 305253 304210 303383 302503 301397 300196 299053 297839 296371 294798 293430 292309 291279 290378
60638 290378 289721 289075 287980 286391 284765 283362 281834 279720 277018 274021 270816 267311 263618 260111 257024
60623 257024 254166 251075 247445 243439 239593 236405 233939 231887 229976 228224 226756 225527 224359 223219
60609 223219 222334 221976 222211 222908 223973 225456 227364 229464 231416 233133 234828 236697 238668 240553 242310
60594 242310 244036 245797 247631 249645 251962 254537 257137 259550 261794 264061 266447 268763 270718 272312
60580 272312 273902 275764 277748 279565 281299 283330 285835 288684 291825 295366 299257 303290 307547 312388
60566 312388 317774 322998 327448 331313 335162 339112 342767 345735 347783 348651 348253 347028 345684 344513 343262
60551 343262 341666 339795 337826 335780 333633 331503 329639 328290 327561 327293 327119 326746 326103 325130 323626 321484
60535 321484 318895 316110 313201 310245 307564 305447 303793 302422 301559 301605 302471 303570 304501 305390 306499 307875
60519 307875 309445 311121 312674 313837 314669 315589 316945 318718 320686 322631 324309 325511 326276 326860 327429
60504 327429 327974 328586 329461 330546 331403 331678 331509 331324 331331 331390 331271 330862 330180 329336 328534 328082 328322 329474 331449
60485 331449 333967 336940 340691 345648 351939 359432 368066 377898 388930 401171 414800 429934 446163
60472 446163 462538 478059 491956 503539 512138 517372 519292 518208 514590 509206 503131 497386 492636
60459 492636 489194 487194 486693 487766 490492 494709 499829 505181 510548 516168 522212 528490 534722 540820
60445 540820 546879 553182 560324 569044 579769 592494 607193 624143 643754 666312 691987 720895
60433 720895 753065 788509 827367 869780 915624 964691 1017204 1073898 1135579 1202992 1277190
60422 1277190 1359504 1450798 1550996 1659348 1774374 1892710 2008217 2112869 2198803 2259595
60412 2259595 2290411 2288282 2253025 2187723 2097961 1990455 1871974 1748674 1625556 1506186
60402 1506186 1392865 1286980 1189233 1099739 1018236 944309 877488 817248 763071 714532 671263
60391 671263 632769 598319 567112 538594 512566 489005 467856 449003 432281 417385 403861
60380 403861 391335 379711 369020 359206 350244 342334 335608 329628 323561 317026 310477 304563 299340
60367 299340 294381 289451 284753 280568 276918 273652 270639 267789 265020 262308 259729 257421 255497 254002
60353 254002 252911 252154 251628 251216 250848 250573 250487 250583 250770 251071 251682 252646 253642 254295 254643 255057 255781 256767 257927
60334 257927 259255 260666 262007 263283 264622 265960 267013 267651 268061 268449 268849 269305 269929 270643 271165 271412
60318 271412 271647 271997 272151 271803 271143 270574 270108 269448 268551 267742 267249 266942 266627 266343 266265 266454 266817 267206 267547
60299 267547 267900 268416 269212 270295 271639 273220 274945 276653 278265 279861 281527 283263 285090 287105 289313
60284 289313 291540 293646 295688 297721 299604 301197 302666 304332 306230 307981 309132 309521 309391 309273 309687
60269 309687 310795 312348 314083 316076 318549 321396 324141 326350 327907 328809 328896 327980 326179 323974 321828
60254 321828 319798 317598 315053 312363 309850 307599 305508 303616 302099 300915 299747 298410 297128 296200
60240 296200 295585 294977 294220 293441 292831 292437 292191 292032 291975 292077 292265 292225 291618 290507 289422 288900 289014 289458 289998
60221 289998 290736 291967 293867 296265 298776 301200 303754 306753 310123 313423 316376 319146 322046 325224
60207 325224 328722 332566 336691 340995 345570 350623 356110 361727 367397 373430 380031 387034 394396 402599
60193 402599 412138 422854 434177 445859 458094 471104 485084 500454 517643 536545 556598 577501
60181 577501 599576 623359 649145 677022 707001 738915 772398 807098 842828 879387 916351
60170 916351 953080 988827 1022853 1054589 1083748 1110197 1133699 1153863 1170311 1182816 1191351 1196111
60158 1196111 1197474 1195861 1191688 1185515 1178077 1170034 1161839 1154000 1147281 1142391 1139582 1138842 1140403 1144784
60144 1144784 1152352 1163136 1177061 1194124 1214304 1237520 1263752 1292960 1324884 1359002 1394675
60133 1394675 1431145 1467408 1502321 1534882 1564287 1589796 1610771 1626849 1637912 1643887 1644806 1640950
60121 1640950 1632730 1620371 1603995 1584068 1561612 1537925 1514213 1491492 1470578 1452125 1436719
60110 1436719 1424886 1416842 1412392 1411335 1413914 1420531 1431037 1444633 1460554 1478549 1498541 1520103
60098 1520103 1542415 1564538 1585570 1604710 1621374 1635202 1645950 1653509 1658063 1660069 1659966 1658050
60086 1658050 1654719 1650691 1646952 1644560 1644504 1647556 1654169 1664683 1679687 1700017 1726293 1758555 1796490
60073 1796490 1840002 1889571 1946101 2010371 2082484 2161868 2247863 2340202 2438754 2542963 2651808
60062 2651808 2764240 2879277 2995550 3111045 3223470 3330705 3430858 3522092 3602622 3670808
60052 3670808 3725184 3764506 3787784 3794251 3783375 3755164 3710478 3650911 3578381 3495021 3403384
60041 3403384 3306364 3206782 3107152 3009777 2916767 2829827 2750279 2679297 2617840 2566320 2524591
60030 2524591 2492425 2469663 2455833 2449948 2450905 2457839 2469805 2485335 2502596 2519921 2536013 2549795
60018 2549795 2560264 2566500 2567740 2563594 2554261 2540372 2522526 2501035 2476127 2448108 2417202 2383405
60006 2383405 2346671 2307078 2264795 2220171 2173967 2127200 2080549 2034198 1988461 1944248 1902587
59995 1902587 1863957 1828476 1796590 1769072 1746401 1728524 1715316 1706959 1703716 1705612 1712449 1724069
59983 1724069 1740465 1761700 1787665 1817792 1850964 1885797 1921008 1955511 1988272 2018250 2044415
59972 2044415 2065761 2081363 2090613 2093375 2089809 2080046 2064120 2042178 2014628 1982132 1945615 1906266
59960 1906266 1865407 1824274 1783909 1745192 1708849 1675512 1645791 1620251 1599231 1582777 1570855
59949 1570855 1563576 1561132 1563618 1571054 1583503 1601021 1623544 1650958 1683267 1720507 1762420 1808291
59937 1808291 1857118 1907838 1959360 2010429 2059565 2105237 2146122 2181213 2209699 2230876 2244295
59926 2244295 2249881 2247729 2237803 2220066 2194977 2163677 2127635 2088245 2046851 2004889 1963813 1924934
59914 1924934 1889392 1858119 1831725 1810525 1794788 1784834 1780807 1782521 1789618 1801784 1818727 1840147
59902 1840147 1865827 1895542 1928699 1964288 2001367 2039408 2077972 2116272 2153358 2188622 2221823
59891 2221823 2252729 2281031 2306560 2329318 2349400 2367207 2383745 2400340 2417954 2437025 2458020
59880 2458020 2481885 2509830 2542962 2582323 2629063 2684274 2748590 2822076 2904522 2995682 3095084
59869 3095084 3201576 3313107 3426963 3540113 3649227 3750470 3839636 3912717 3966399 3998203
59859 3998203 4006647 3991561 3954125 3896364 3820776 3730549 3629668 3522216 3411492 3300046 3190336
59848 3190336 3084839 2985488 2893481 2809745 2735127 2669954 2613931 2566830 2529018 2500952 2482452
59837 2482452 2472886 2471865 2479295 2494753 2517245 2545690 2579258 2616983 2657244 2697825 2736381 2770667
59825 2770667 2798449 2817517 2825969 2822485 2806327 2777160 2735047 2680682 2615617 2542145 2462759 2379621
59813 2379621 2294423 2208619 2123618 2040652 1960551 1883793 1810792 1742055 1678048 1619038 1565145
59802 1565145 1516454 1472965 1434470 1400591 1370950 1345245 1323229 1304683 1289372 1276855 1266344
59791 1266344 1256917 1247942 1239206 1230668 1222270 1214095 1206468 1199711 1193802 1188397 1183166 1177950 1172636 1167014
59777 1167014 1160770 1153556 1145039 1134992 1123439 1110651 1096992 1082782 1068378 1054350 1041471 1030378
59765 1030378 1021218 1013721 1007624 1002907 999520 997043 994876 992796 991198 990765 992034 995273 1000543 1007746
59751 1007746 1016666 1027061 1038691 1051290 1064634 1078632 1093220 1108208 1123342 1138530 1153772
59740 1153772 1168816 1183124 1196256 1208077 1218500 1227331 1234578 1240763 1246641 1252707 1259168 1266310 1274672
59727 1274672 1284869 1297425 1312794 1331393 1353582 1379691 1410056 1445019 1484994 1530535 1582235
59716 1582235 1640466 1705359 1777153 1856355 1943361 2037941 2139115 2245171 2353372 2459507
59706 2459507 2557925 2642189 2706049 2744664 2755915 2741081 2704148 2650285 2584756 2512685 2438899
59695 2438899 2367291 2300296 2239210 2184932 2138257 2099567 2068650 2045062 2028558 2019022 2016143 2019460
59683 2019460 2028777 2044268 2066071 2093965 2127693 2167340 2213116 2264903 2322467 2386134 2456828
59672 2456828 2535336 2621818 2716219 2818806 2930111 3050621 3180839 3321386 3472808 3635434
59662 3635434 3809617 3995795 4193932 4403006 4621348 4847326 5079314 5315080 5551597
59653 5551597 5785592 6014147 6235020 6446928 6649779 6844480 7032413 7215161 7394466
59644 7394466 7571935 7748487 7924080 8097879 8268353 8433081 8588709 8731311 8856961
59635 8856961 8962226 9044612 9102893 9137100 9148288 9138383 9110178 9067260 9013840 8954600 8894388
59624 8894388 8837673 8788162 8748988 8723119 8713331 8721829 8750237 8799995 8872577 8969142 9090147
59613 9090147 9235308 9403705 9593740 9802943 10027754 10263260 10503016 10739101 10962320
59604 10962320 11162385 11328289 11449226 11515830 11521288 11462127 11338757 11155494 10919790 10641065
59594 10641065 10329801 9996906 9652866 9306836 8966252 8637034 8323678 8028993 7753947
59585 7753947 7497861 7258592 7032410 6814027 6597188 6375789 6145199 5903422 5651553
59576 5651553 5393155 5132921 4875512 4625050 4384906 4157516 3944266 3745636 3561460
59567 3561460 3391308 3234826 3091712 2961248 2842038 2732573 2632037 2540266 2456950 2381243
59557 2381243 2312241 2249442 2192550 2141115 2094576 2052402 2013889 1978038 1943901 1911030 1879326
59546 1879326 1848510 1817904 1786733 1754508 1721160 1686985 1652473 1618054 1583947 1550250 1517201
59535 1517201 1485318 1455208 1427195 1401150 1376813 1354272 1333994 1316306 1301073 1288025 1277201
59524 1277201 1268807 1262723 1258476 1255726 1254502 1254970 1257207 1261250 1267110 1274607 1283322 1292848 1303008 1313841
59510 1313841 1325502 1338148 1351797 1366332 1381777 1398502 1416982 1437385 1459607 1483650 1509728
59499 1509728 1538102 1569097 1603215 1640920 1682290 1727177 1775726 1828382 1885373 1946585 2011968
59488 2011968 2081615 2155298 2232296 2311890 2393681 2477206 2561547 2645557 2728177 2808313 2884725
59477 2884725 2956344 3022459 3082279 3134585 3178213 3212798 3238723 3256467 3266344 3268835 3264859 3255667
59465 3255667 3242704 3227593 3211992 3197361 3184918 3175839 3171421 3173044 3181968 3199086 3224761 3258876
59453 3258876 3300932 3349896 3403883 3460132 3515425 3566446 3609850 3642305 3660779 3662862 3646934
59442 3646934 3612321 3559438 3489621 3404735 3307079 3199610 3085882 2969443 2853274 2739741
59432 2739741 2630781 2527912 2432212 2344379 2264648 2192731 2128197 2071062 2021730 1980278 1946148
59421 1946148 1918727 1897828 1883368 1874978 1872348 1875608 1885015 1900483 1921874 1949440 1983445 2023413
59409 2023413 2068269 2117216 2170035 2226473 2285729 2346544 2407398 2466403 2521328 2569920 2610154
59398 2610154 2640259 2658772 2664693 2657464 2636855 2603135 2557358 2501176 2436274 2364156 2286454 2205144
59386 2205144 2122229 2039303 1957478 1877567 1800243 1726085 1655566 1588934 1526222 1467498 1413086
59375 1413086 1363289 1317930 1276358 1238046 1202959 1171263 1142859 1117381 1094548 1074317 1056675
59364 1056675 1041381 1028029 1016391 1006658 999215 994144 991096 989750 990172 992521 996608 1002135 1009300
59351 1009300 1018600 1029791 1041421 1051773 1060170 1067089 1073296 1079364 1086008 1094223 1104766 1117827 1133514
59338 1133514 1152291 1174382 1198822 1223709 1247646 1270722 1294059 1318865 1346103 1376588 1410846
59327 1410846 1448979 1491045 1537485 1588901 1645570 1707547 1775193 1849230 1930343 2019053 2115954
59316 2115954 2221666 2336515 2460647 2594460 2738479 2892651 3056076 3227452 3405240
59307 3405240 3587192 3770152 3950724 4125948 4293306 4450641 4596494 4730271 4851811
59298 4851811 4961084 5058561 5145366 5222445 5289715 5346375 5391778 5425441 5446292 5452449 5441846
59287 5441846 5412800 5364081 5295007 5205732 5097281 4971258 4829739 4675421 4511522 4341298
59277 4341298 4167650 3993144 3820155 3650865 3487164 3330577 3182235 3042935 2913214
59268 2913214 2793280 2682886 2581509 2488780 2404627 2328938 2261330 2201349 2148608 2102542 2062343
59257 2062343 2027462 1997938 1973888 1954840 1939956 1928768 1921275 1917377 1916632 1918618 1923136 1929904 1938309
59244 1938309 1947648 1957466 1967557 1977674 1987298 1995687 2002193 2006583 2008967 2009447 2008028 2004871 2000349 1994678
59230 1994678 1987874 1980319 1973103 1967431 1963842 1962321 1962978 1966260 1972661 1982595 1996508 2014749 2037336
59217 2037336 2064074 2094743 2128930 2165854 2204769 2245386 2287478 2330090 2371428 2409415 2442023
59206 2442023 2467263 2483623 2490782 2489638 2481505 2467536 2448808 2426496 2401716 2375395 2348330 2321119
59194 2321119 2294028 2267239 2241228 2216524 2193071 2170165 2147175 2124018 2100854 2077671 2054327
59183 2054327 2030777 2007090 1983384 1959829 1936560 1913613 1891200 1870045 1851146 1835160 1822228
59172 1822228 1812380 1805810 1802777 1803611 1808926 1819480 1835755 1857942 1886413 1921844 1964764 2015321
59160 2015321 2073640 2140086 2214950 2298087 2388954 2486666 2589757 2696033 2802779 2906945
59150 2906945 3005010 3093070 3167375 3224855 3263138 3280383 3275353 3247604 3197650 3127181 3039208
59139 3039208 2937621 2826271 2708466 2587287 2465958 2347459 2233800 2125872 2024022
59130 2024022 1928666 1840368 1759442 1685613 1618201 1556661 1500810 1450372 1404589 1362635 1324343
59119 1324343 1290130 1260184 1234054 1211104 1191008 1173662 1158921 1146657 1136859 1129479 1124330 1121258
59107 1121258 1120273 1121364 1124322 1128824 1134581 1141426 1149433 1158973 1170383 1183537 1197982 1213486 1230220
59094 1230220 1248319 1267597 1287841 1309071 1331276 1354082 1376875 1399181 1420747 1441336 1460559
59083 1460559 1477897 1492893 1505395 1515550 1523425 1528733 1531145 1530762 1528051 1523419 1517202 1510024 1502727
59070 1502727 1495845 1489433 1483521 1478441 1474683 1472761 1473223 1476464 1482403 1490709 1501404 1514916 1531471
59057 1531471 1550869 1572964 1597918 1625779 1656239 1689078 1724486 1762687 1803548 1846826 1892456
59046 1892456 1940347 1990202 2041842 2095464 2151237 2208897 2267969 2328051 2388486 2447934 2504584
59035 2504584 2556617 2602158 2639029 2665068 2678705 2679034 2665451 2637634 2595896 2541404 2476030 2402115
59023 2402115 2322133 2238207 2151878 2064441 1977338 1891957 1809112 1729004 1651734 1577648 1507155
59012 1507155 1440436 1377488 1318344 1263108 1211762 1164013 1119432 1077716 1038693 1002134 967738
59001 967738 935426 905402 877764 852212 828350 806028 785143 765361 746464 728699 712320
58990 712320 696956 682036 667720 654716 643164 632411 622029 612356 603723 595817 588223 581069
58978 581069 574723 569271 564695 561144 558622 556782 555393 554619 554479 554460 554164 553957 554453 555640 557043 558512
58962 558512 560306 562495 564755 566739 568265 569263 569841 570312 570889 571489 572080 572954 574336 575959 577398 578607
58946 578607 579764 580790 581458 581795 581943 581724 580734 578832 576189 572955 569243 565379 561807 558745 556135
58931 556135 553848 551752 549728 547875 546501 545725 545264 544908 544962 545900 547833 550596 554065 557969 561719 564965
58915 564965 568174 572159 577145 582756 588771 595340 602502 610081 618099 626774 635972 645125 653868 662459
58901 662459 671381 680781 690423 700008 709462 719045 729201 740168 751832 764067 777068 791176 806566
58888 806566 823381 841892 862171 883753 906042 928996 953045 978433 1005059 1032923 1062295
58877 1062295 1093397 1126282 1161082 1198126 1237730 1280093 1325359 1373573 1424610 1478415 1535283
58866 1535283 1595709 1660032 1728431 1801152 1878476 1960571 2047687 2140427 2239548 2345539 2458651
58855 2458651 2579213 2707694 2844507 2989990 3144439 3307889 3480012 3660380 3848529
58846 3848529 4043416 4243013 4444729 4645903 4843433 5033157 5210191 5369740 5507200
58837 5507200 5617812 5697096 5741974 5751238 5725102 5664827 5572849 5452727 5308788 5145896 4969249
58826 4969249 4783712 4593154 4400680 4209302 4021848 3840261 3665544 3498453 3339790
58817 3339790 3189959 3048773 2915866 2790940 2673596 2563370 2460024 2363416 2273050 2188181
58807 2188181 2108432 2033853 1964323 1899352 1838605 1782135 1729920 1681545 1636517 1594568 1555528
58796 1555528 1519268 1485909 1455790 1429037 1405397 1384528 1366188 1350157 1336342 1324959 1316240
58785 1316240 1309968 1305738 1303701 1304535 1308546 1315254 1324071 1334969 1348260 1364072 1382336 1403066 1426463
58772 1426463 1452866 1482635 1515850 1552148 1591133 1632940 1678056 1726617 1778339 1833183 1891676
58761 1891676 1954443 2021810 2094029 2171540 2254834 2344272 2440150 2542736 2652261 2769167 2894331
58750 2894331 3028654 3172396 3325226 3486853 3657134 3835516 4020755 4211165 4404630
58741 4404630 4598223 4788218 4970520 5140664 5293462 5423342 5525474 5596389 5633663 5635738
58731 5635738 5602402 5535050 5436270 5309535 5159298 4990690 4808634 4617359 4420771 4222660
58721 4222660 4026207 3833623 3646525 3466286 3293871 3129717 2974076 2827141 2688680
58712 2688680 2557989 2434513 2318219 2209197 2107204 2011779 1922467 1838750 1760118 1686369
58702 1686369 1617494 1553164 1492729 1435866 1382770 1333516 1287686 1244821 1204795 1167543 1132853
58691 1132853 1100660 1071113 1044071 1018960 995405 973609 953831 935865 919294 903825 889170
58680 889170 874979 861233 848319 836426 825215 814280 803535 792928 782241 771458 760875
58669 760875 750560 740131 729371 718594 708031 697333 686084 674395 662574 650587 638267
58658 638267 625718 613081 600237 587146 574158 561579 549271 537045 525159 514021 503671
58647 503671 493903 484651 475938 467717 460073 453211 446984 440822 434472 428344 422721 417116 410908 404244
58633 404244 397711 391468 385257 379031 372999 367221 361706 356734 352575 349019 345672 342615 340314 338954
58619 338954 338273 337945 337786 337692 337740 338297 339665 341726 344162 346826 349615 352222 354356 356056 357472 358490
58603 358490 358845 358437 357280 355397 353030 350660 348467 346065 343125 339998 337331 335365 334019 333383 333587
58588 333587 334405 335490 336879 338862 341467 344500 347981 352127 356976 362404 368424 375109 382284 389665
58574 389665 397284 405506 414683 424944 436173 448005 460062 472417 485632 500124 515794 532465
58562 532465 550369 569880 591096 614020 638904 666058 695563 727517 762301 800269 841371
58551 841371 885396 932317 982119 1034530 1089208 1145838 1203721 1261557 1317867 1371214 1419705
58540 1419705 1460873 1492608 1513931 1524451 1523653 1511353 1488533 1457020 1418530 1374477 1326405 1275875
58528 1275875 1224063 1171972 1120829 1071742 1025130 980973 939454 900890 865289 832555 802933
58517 802933 776677 753486 732784 714359 698145 683605 669986 657106 645307 634675 624837 615508
58505 615508 606718 598536 590966 584039 577646 571358 564784 557920 550787 542985 534079 524203 513815 503092
58491 503092 492019 480865 470041 459670 449753 440489 431951 423709 415346 407129 399660 393065 387074
58478 387074 381624 376789 372333 367928 363665 359807 356254 352760 349417 346353 343294 340007 336838 334084
58464 334084 331191 327346 322677 318056 313907 309953 305986 302089 298203 294246 290586 287683 285372 283196
58450 283196 281236 279846 278743 277260 275457 274076 273383 272886 272291 271916 272015 272412 272970 273757 274643 275325 275815
58433 275815 276374 277009 277597 278378 279696 281360 282915 284388 286022 287532 288482 289237 290518 292095 292935 292692
58417 292692 292031 291351 290276 288638 286965 285598 284218 282586 280983 279543 277876 275734 273378 270995 268404
58402 268404 265610 262972 260553 257943 255034 252334 250224 248499 246942 245767 245215 245177 245459 245967 246440 246531
58386 246531 246303 246230 246634 247533 248968 250909 252914 254512 255883 257572 259631 261705 263825 266272 268730
58371 268730 270513 271617 272696 273917 274740 274914 274756 274359 273481 272410 271992 272532 273498 274501 275748 277343
58355 277343 279016 280750 282811 284997 286753 288200 290123 292739 295399 297746 300158 302810 305317 307613
58341 307613 310195 313073 315399 316601 316985 316907 316252 315080 313929 313038 312114 311140 310561 310416 310202 309882 310059
58324 310059 310846 311557 311763 311638 311017 309296 306691 304407 303070 302129 301266 301114 301988 303135 303966 304938 306420
58307 306420 307835 308734 309750 311592 314003 316501 319296 322650 326139 329329 332461 335816 339170 342483
58293 342483 346286 350762 355332 359737 364533 369876 374811 378558 381581 384589 387399 389568 391264 392736
58279 392736 393753 394336 395196 396697 398260 399485 400940 403113 405543 407785 410294 413528 417099 420662 424739
58264 424739 429819 435501 441338 447622 454524 461429 467969 474787 482435 490458 498385 506610 515350 523774
58250 523774 531180 538122 545376 552628 559195 565178 570972 576442 581469 586464 591618 596531 601355 607209
58236 607209 614679 622962 631348 640369 650597 661490 672411 683621 695335 707018 718568 730983
58224 730983 744844 759378 774012 789506 806495 824327 842454 861544 882096 903368 924880
58213 924880 947437 971476 995913 1019933 1044293 1069576 1094857 1119509 1144584 1170921 1197674
58202 1197674 1224315 1252236 1282619 1314594 1347298 1381875 1419510 1459446 1500974 1545465 1594236
58191 1594236 1646338 1700762 1758882 1822359 1890597 1962827 2040798 2126769 2220726 2322296 2433438
58180 2433438 2556361 2690552 2834709 2989640 3156221 3332481 3515920 3706909 3906767
58171 3906767 4114655 4329784 4554539 4791841 5041603 5303504 5580920 5877995 6194962
58162 6194962 6530499 6886410 7265635 7668158 8093701 8546114 9030169 9546438 10094334
58153 10094334 10677438 11300436 11964154 12670109 13427239 14248059 15142045 16120335 17203207
58144 17203207 18414671 19773843 21301256 23030225 25002820 27260468 29850452 32834905
58136 32834905 36277471 40225911 44724185 49836488 55647720 62264933 69843704 78535693
58128 78535693 88223211 98164071 106945347 112981240 115255484 113726243 109140046 102536484
58120 102536484 94864197 86846089 78977072 71549970 64704356 58492431 52920988 47960974
58112 47960974 43558690 39659269 36217045 33186825 30521580 28184032 26149567 24393581
58104 24393581 22886045 21602585 20530715 19659655 18973290 18459375 18116710 17947304 17955320
58095 17955320 18167323 18634393 19368753 20250193 21010851 21352328 21109780 20321348 19159254
58086 19159254 17810602 16411140 15045851 13766268 12595842 11535690 10579189 9721497
58078 9721497 8956378 8272891 7660432 7112936 6625139 6189058 5797390 5446571 5133086
58069 5133086 4849889 4589685 4349202 4127324 3921438 3728422 3547108 3376983 3216190
58060 3216190 3063275 2919118 2784740 2658870 2539903 2428518 2325954 2231190 2142162 2058407
58050 2058407 1980188 1906201 1834404 1764226 1695994 1629289 1563789 1500682 1441289 1385164 1331230
58039 1331230 1279783 1231559 1185899 1141663 1099077 1058925 1020815 983961 948788 915983 884766
58028 884766 853913 823753 795433 768882 743198 718437 695374 674007 653808 634894 617486
58017 617486 600792 583939 567437 552277 538178 524150 510204 497029 484575 472452 461176
58006 461176 451501 442940 434383 425804 418001 411110 404694 398846 393825 389010 383571 377761 372282 366937
57992 366937 361241 355814 351613 348255 344630 340806 337746 335436 332936 330113 327741 325875 323704 321092
57978 321092 318826 317163 315444 313376 311467 309962 308463 306837 305490 304523 303566 302572 301919 301613 301265 300890
57962 300890 300882 301136 301008 300247 299201 298114 296938 295786 294824 293806 292373 290707 289184 287632 285712 283739
57946 283739 282244 280910 278895 276103 273251 270774 268509 266404 264663 263214 261777 260365 259040 257359
57932 257359 254831 251719 248624 245543 242229 239168 237229 236464 236164 235972 236032 236200 236112 235953 236215 236758 236990
57915 236990 236926 237123 237664 238154 238634 239523 240668 241438 241804 242392 243418 244492 245492 246698 248005 248896 249275
57898 249275 249418 249137 247942 246059 244269 242660 240593 238013 235705 234003 232363 230526 229086 228476 228302
57883 228302 228152 228218 228699 229337 230015 231073 232647 234346 235972 237805 239817 241315 241815 241623 241107 240014
57867 240014 237994 235242 232152 228793 225157 221448 217787 214031 210205 206676 203575 200538 197319 194258
57853 194258 191831 190113 188952 188268 187912 187642 187451 187552 187881 188048 187953 187997 188498 189307 190228 191331 192649 193985
57835 193985 195267 196687 198309 199883 201197 202256 203011 203343 203425 203569 203647 203136 201909 200446 199050 197429
57819 197429 195282 192828 190495 188490 186936 185980 185483 184970 184136 183151 182324 181853 181993 183012 184717 186417
57803 186417 187585 188325 189069 190170 191839 194077 196516 198687 200513 202234 203863 205167 206115 206824 207063
57788 207063 206454 205226 204082 203214 202088 200433 198719 197363 196117 194666 193220 192056 190941 189501 187767
57773 187767 185971 184166 182397 180941 180000 179416 178914 178351 177527 176133 174159 172025 170079 168269 166506
57758 166506 164917 163523 162063 160406 158787 157393 156028 154421 152515 150330 147882 145471 143616 142510
57744 142510 141856 141431 141374 141742 142273 142839 143668 144889 146297 147810 149693 152064 154597 157015 159372 161606
57728 161606 163365 164611 165899 167625 169480 171081 172646 174550 176584 178218 179262 179836 179930 179497 178720
57713 178720 177769 176493 174728 172646 170449 168020 165252 162451 160010 157906 155917 154062 152417 150799
57699 150799 149081 147605 146805 146595 146563 146591 146845 147250 147476 147412 147346 147628 148415 149639 151027 152249 153252 154296
57681 154296 155511 156639 157443 158134 159062 160230 161393 162466 163520 164532 165437 166323 167320 168411 169554 170831
57665 170831 172358 174232 176657 179808 183397 186779 189711 192609 195867 199348 202906 206855 211420 216115
57651 216115 220324 224199 228410 233188 238246 243513 249324 255863 262971 270554 278698 287302 296031 304792
57637 304792 313961 323977 334917 346543 358580 370857 383354 396195 409612 423952 439645 456975
57625 456975 475865 496226 518505 543522 571623 602482 635976 672721 713319 757625 805240
57614 805240 856357 911377 969976 1031158 1094027 1157773 1220967 1281451 1336874 1384579 1420974
57603 1420974 1441922 1444454 1428179 1395204 1349164 1294292 1234587 1173134 1112077 1053094 997509
57592 997509 945928 898241 854292 814263 778272 745932 716629 690015 666037 644651 625771
57581 625771 609374 595410 583616 573604 565158 558366 553419 550313 548739 548330 548986 550856 553974 558116
57567 558116 563152 569403 577448 587627 599918 614205 630467 648722 668995 691404 716137 743301
57555 743301 772861 804708 838625 874166 910616 947047 982380 1015421 1044855 1069219 1086999
57544 1086999 1097014 1098804 1092558 1078666 1057596 1030219 997919 962161 924113 884726 844902 805373
57532 805373 766667 729321 693872 660462 628759 598538 570084 543788 519636 497367 476858
57521 476858 457977 440358 423740 408371 394618 382309 370875 360019 349891 340642 332261 324776
57509 324776 318226 312387 306886 301668 297031 293186 289978 287092 284314 281603 279115 277136 275749 274657
57495 274657 273549 272594 272246 272637 273450 274389 275459 276766 278368 280397 283065 286441 290365 294661 299316
57480 299316 304432 310125 316450 323334 330614 338257 346433 355294 364803 374966 386022 398186 411378
57467 411378 425459 440598 457133 475185 494680 515676 538349 562664 588311 614887 641942
57456 641942 668927 695299 720539 743821 763881 779485 789956 795014 794384 787995 776395 760468
57444 760468 740810 717805 692248 665373 638188 611219 584960 560094 537041 515671 495711
57433 495711 477177 460217 444809 430840 418343 407473 398278 390575 383979 378096 372819 368406 365148
57420 365148 363011 361730 361139 361231 362048 363714 366508 370635 375960 382179 389155 396907 405429 414796 425306
57405 425306 437249 450617 465326 481527 499400 518835 539665 562018 585939 610820 635680
57394 635680 659864 682893 703720 720798 733001 739956 741466 737216 727271 712297 693046 670070
57382 670070 644115 616256 587382 557963 528594 500244 473602 448592 424882 402527 381721
57371 381721 362318 344048 327000 311410 297134 283798 271334 259987 249779 240318 231237 222563
57359 222563 214586 207487 201125 195140 189255 183499 178100 173205 168803 164890 161466 158350 155255 152112
57345 152112 149092 146260 143496 140832 138538 136710 135074 133418 131905 130706 129578 128157 126518 125068
57331 125068 123998 123106 122156 121137 120195 119534 119351 119611 119860 119513 118409 116955 115659 114684 113920 113351 113111
57314 113111 113211 113379 113336 113132 113052 113188 113305 113236 113196 113546 114337 115308 116247 117131 117957 118671 119311 120029 120921 121968
57294 121968 123138 124449 125929 127641 129675 131986 134324 136499 138648 141003 143476 145777 147919 150271
57280 150271 153073 156166 159292 162425 165694 169248 173277 177927 183008 187958 192279 195900 199022 201748
57266 201748 204031 205935 207819 210188 213368 217275 221564 225996 230584 235345 240075 244524 248643 252485
57252 252485 256020 259263 262447 265796 269225 272528 275816 279423 283443 287635 291809 296016 300310 304593
57238 304593 308769 312860 316914 320950 325012 329118 333193 337171 341097 344972 348684 352312 356280 360917
57224 360917 366016 371135 376222 381581 387449 394023 401763 411113 421945 433725 446167 459238 472510
57211 472510 485089 496298 505974 514011 520121 524253 526790 528093 528179 527060 525083 522766 520514 518599
57197 518599 517155 516080 515209 514642 514649 515285 516414 518090 520507 523559 526852 530206 533766 537639 541806 546379
57181 546379 551439 556599 561255 565372 569461 573668 577472 580466 582921 585321 587829 590455 593302 596299
57167 596299 599107 601524 603653 605498 606786 607387 607514 607303 606610 605416 604027 602702 601483 600615 600654 601912
57151 601912 604140 606994 610436 614515 619241 624841 631678 639611 647834 655567 662505 668502 673428 677645
57137 677645 682064 687294 693083 698792 703998 708361 711476 713240 713987 713958 713026 711204 708980 706870 705076
57122 705076 703822 703456 703861 704237 703739 701922 698347 692377 683797 673092 660768 646904 631632 615406
57108 615406 598351 579936 559778 538227 515694 491949 466653 440033 412410 383491 352704
57097 352704 319899 285122 248016 207904 164276 116839 65363 9815 -49602 -112799 -179833 -250538
57085 -250538 -324592 -402126 -483816 -570203 -661483 -757991 -860186 -967994 -1080979 -1199405 -1324444
57074 -1324444 -1457380 -1599675 -1754100 -1924595 -2114452 -2325489 -2559258 -2817800 -3102733
57065 -3102733 -3414897 -3755756 -4128185 -4535366 -4980130 -5466234 -5999170 -6584984 -7229374
57056 -7229374 -7938724 -8721051 -9585443 -10542001 -11603194 -12784052 -14100121 -15566454 -17199263
57047 -17199263 -19017404 -21042252 -23298836 -25819087 -28643333 -31818746 -35398893 -39445800
57039 -39445800 -44030299 -49229936 -55129751 -61826167 -69426013 -78038214 -87765698 -98699974
57031 -98699974 -110910732 -124430001 -139241642 -155275054 -172387029 -190337122 -208790898
57024 -208790898 -227354371 -245577480 -262881095 -278479930 -291437944 -300882941 -306237312
57017 -306237312 -307304250 -304199132 -297240237 -286883706 -273690461 -258283893 -241296816
57010 -241296816 -223329897 -204927478 -186562915 -168631300 -151450231 -135262879 -120239150
57003 -120239150 -106479331 -94023965 -82865389 -72956698 -64221109 -56563948 -49882866
56996 -49882866 -44072891 -39029873 -34655507 -30861049 -27567075 -24702346 -22204621 -20021088
56988 -20021088 -18106336 -16420411 -14929229 -13604987 -12424423 -11367074 -10415584 -9556189
56980 -9556189 -8777532 -8069532 -7423816 -6834012 -6294561 -5799876 -5345164 -4927026 -4542499
56971 -4542499 -4188291 -3861560 -3560476 -3283281 -3027495 -2790717 -2571516 -2368915 -2181679
56962 -2181679 -2008667 -1849225 -1702599 -1567510 -1442748 -1327661 -1221679 -1123925 -1033668 -950592
56952 -950592 -874305 -804105 -739414 -679893 -624995 -574111 -527308 -485234 -448216 -416030 -388526
56941 -388526 -365609 -346893 -332569 -324440 -324311 -330706 -338640 -343668 -345427 -346827 -351205 -361143 -378628
56928 -378628 -404498 -437754 -476298 -518102 -561205 -603297 -642381 -677691 -709394 -737721 -762866
56917 -762866 -785195 -804861 -821539 -835098 -846133 -855350 -862810 -868329 -872117 -874449 -875068 -873561 -870016
56904 -870016 -864764 -857831 -849179 -839166 -828264 -816553 -804049 -791244 -778887 -767440 -757144 -748245
56892 -748245 -740700 -733941 -727342 -720727 -714137 -707479 -700787 -694389 -688366 -682232 -675580 -668613 -661582 -654120
56878 -654120 -645743 -636661 -627480 -618330 -608808 -598608 -587745 -576395 -565057 -554674 -546097 -539464 -534405
56865 -534405 -530579 -527668 -525177 -522753 -520493 -518518 -516469 -513895 -510862 -507749 -504696 -501680 -498872 -496298
56851 -496298 -493412 -489607 -485059 -480537 -476390 -472270 -467793 -462962 -457811 -452116 -445665 -438570 -431188 -423791
56837 -423791 -416301 -408266 -399270 -389448 -379363 -369240 -358649 -347134 -334740 -321609 -307553 -292549
56825 -292549 -277391 -263360 -251371 -241744 -234470 -229195 -225223 -222094 -220012 -219233 -219239 -219116 -218603 -218154 -217982
56810 -217982 -217665 -216741 -215116 -212745 -209388 -204916 -199470 -193130 -185734 -177238 -168106 -159243 -151704 -146428 -143945
56795 -143945 -144166 -146511 -150243 -154625 -158936 -162609 -165412 -167350 -168401 -168452 -167392 -165164 -161808 -157502 -152417
56780 -152417 -146409 -139077 -130149 -119571 -107194 -92892 -77276 -61962 -48814 -39190 -34006 -33818 -38270
56767 -38270 -45818 -54656 -63754 -72625 -80567 -86835 -91402 -94833 -97442 -99085 -99663 -99204 -97480 -94116 -89113
56752 -89113 -82743 -74989 -65636 -55008 -44070 -33810 -25007 -18588 -15475 -15813 -18798 -23513 -29541 -36627
56738 -36627 -44242 -51769 -58795 -64995 -70071 -74015 -77144 -79654 -81341 -81901 -81269 -79527 -76758 -73124 -68892
56723 -68892 -64251 -59311 -54400 -50107 -46953 -45188 -44947 -46350 -49306 -53434 -58247 -63315 -68245 -72769 -76901
56708 -76901 -80818 -84570 -88090 -91430 -94727 -97931 -100817 -103293 -105426 -107229 -108670 -109890 -111062 -112035 -112466
56693 -112466 -112325 -111947 -111529 -110929 -110051 -109069 -108139 -107183 -106139 -105127 -104260 -103520 -102920 -102553 -102358 -102114 -101767 -101538
56675 -101538 -101589 -101783 -101862 -101668 -101143 -100419 -99913 -100047 -100705 -101291 -101441 -101416 -101624 -102074 -102506 -102817 -103132 -103565 -104117 -104698
56655 -104698 -105126 -105217 -104990 -104675 -104469 -104372 -104285 -104140 -103885 -103499 -103048 -102607 -102167 -101774 -101640 -101867 -102168 -102197 -102094 -102342
56635 -102342 -103032 -103736 -104185 -104624 -105302 -105990 -106284 -106070 -105412 -104244 -102481 -100307 -98087 -96051 -94217 -92489
56619 -92489 -90696 -88704 -86627 -84815 -83459 -82328 -81024 -79406 -77696 -76251 -75354 -75038 -75016 -74850 -74275 -73363
56603 -73363 -72391 -71671 -71448 -71753 -72348 -72975 -73653 -74549 -75634 -76691 -77606 -78406 -79005 -79244 -79172 -79000 -78691 -77921 -76531
56584 -76531 -74773 -73017 -71470 -70177 -69008 -67631 -65779 -63640 -61697 -60150 -58835 -57700 -56908 -56397 -55779
56569 -55779 -54889 -53999 -53331 -52737 -52113 -51727 -51828 -52248 -52711 -53278 -54140 -55167 -55978 -56337 -56261 -55907 -55500 -55215 -54990
56550 -54990 -54638 -54225 -54078 -54323 -54684 -54838 -54690 -54178 -53253 -52217 -51637 -51667 -51834 -51778 -51743 -51987 -52116 -51531 -50256
56531 -50256 -48863 -47729 -46800 -45915 -44990 -43965 -42920 -42113 -41640 -41236 -40686 -40174 -39879 -39506 -38637 -37399 -36295
56514 -36295 -35541 -34973 -34524 -34291 -34185 -33925 -33407 -32688 -31645 -30061 -28085 -26226 -24749 -23372 -21695 -19677
56498 -19677 -17566 -15588 -13819 -12262 -10920 -9815 -8931 -8127 -7193 -6069 -4875 -3679 -2422 -1195 -347
56482 -85 -157 -162 10 225 360 282 -183 -950 -1498 -1432 -1031 -918 -1276 -1771 -2166 -2631 -3440 -4693 -6315 -8006 -9267
56461 -9267 -9799 -9944 -10364 -11293 -12376 -13244 -13873 -14358 -14647 -14680 -14539 -14375 -14342 -14614 -15231 -15904 -16205 -16072 -15891 -16029
56441 -16029 -16488 -17058 -17632 -18236 -18871 -19482 -19976 -20231 -20110 -19542 -18607 -17566 -16763 -16345 -16067 -15545 -14754 -14087 -13830
56422 -13830 -13821 -13784 -13690 -13592 -13318 -12698 -11882 -11122 -10334 -9181 -7524 -5524 -3385 -1248 740 2557 4393 6397
56404 6397 8381 10018 11273 12378 13532 14810 16227 17638 18731 19434 20190 21472 23133 24544 25347
56389 25347 25733 26069 26572 27300 28144 28830 29203 29442 29742 29923 29687 29145 28692 28418 28009 27234 26167 24922
56371 24922 23551 22194 21038 20083 19261 18684 18502 18542 18441 18090 17616 17024 16234 15409 14801 14319 13688 13020
56353 13020 12712 12741 12574 11985 11433 11381 11614 11552 10964 10112 9368 8954 8908 9131 9460 9730 9789 9584 9339 9450 9967
56332 9967 10385 10286 9980 10093 10656 11104 11130 11027 11138 11429 11729 11997 12222 12401 12633 12918 12903 12251 11272 10718
56312 10718 10869 11285 11515 11615 11842 12299 13045 14115 15301 16251 16929 17589 18266 18745 19111 19796 20899 21996
56294 21996 22821 23638 24698 25816 26794 27789 28903 29854 30419 30816 31276 31635 31750 32009 32921 34422 35992
56277 35992 37345 38635 40089 41764 43603 45483 47248 48824 50278 51681 53085 54636 56488 58525
56263 58525 60430 62070 63612 65191 66840 68719 71054 73739 76383 78830 81265 83711 85921 87925
56249 87925 90170 92857 95627 98189 100795 103701 106587 108959 110813 112504 114165 115642 116811 117649 118172
56234 118172 118565 119229 120426 122027 123782 125619 127516 129341 131029 132738 134647 136807 139301 142302 145859
56219 145859 149918 154601 160113 166261 172484 178545 184798 191613 198993 206968 215863 225864 236753 248388
56205 248388 261076 275114 290364 306596 323912 342501 362368 383624 406696 431898 459115
56194 459115 488197 519245 552190 586514 621743 657824 694604 731308 766969 800981 832819
56183 832819 861605 886510 907270 923873 935978 943166 945613 944065 939271 931728 921754 909513 895154
56170 895154 879151 862255 844904 827018 808597 790008 771409 752351 732386 711653 690475
56159 690475 668817 646543 623814 600804 577494 554134 531439 509812 488831 467996 447509
56148 447509 427823 408924 390681 373445 357618 343001 329219 316413 304863 294318 284343 275002
56136 275002 266562 258880 251738 245379 239994 235079 230062 225241 221264 217994 214782 211619 209130 207534
56122 207534 206439 205622 205190 205035 204890 204947 205684 207067 208604 210151 212055 214510 217399 220713 224529 228617
56106 228617 232686 236935 241806 247306 253155 259395 266218 273353 280383 287498 295229 303510 311739 319681
56092 319681 327597 335584 343500 351514 359986 368884 377993 387661 398553 410734 423695 437325 452167
56079 452167 468716 487242 508281 532655 560914 593320 630290 672187 718702 768920 821728
56068 821728 875452 927472 975259 1017848 1055660 1089173 1118701 1145106 1169346 1191012 1208279
56057 1208279 1219575 1224551 1223482 1216807 1205581 1191401 1175364 1157463 1137010 1112983 1084072 1049342
56045 1049342 1009186 965022 918177 869798 821637 775764 733331 694444 659297 628444 601828
56034 601828 578553 557966 540167 525283 513032 503119 495273 488807 482971 477742 473432 469558 465140
56021 465140 460098 455316 451247 447562 444255 441915 440690 440069 439880 440403 441382 442127 442861 444691 447912 451548
56005 451548 454917 458427 462424 466483 470399 474734 479812 485218 490811 497198 504763 513142 522122 531971
55991 531971 542506 552921 562998 573415 584471 595620 606686 618338 630883 643756 656753
55980 656753 670605 685736 701542 717487 733863 750995 768753 787275 807029 827742 848460
55969 848460 869081 890590 913424 936963 961036 986481 1013730 1042290 1072178 1104335 1139028
55958 1139028 1175338 1212863 1252391 1294276 1337813 1382954 1430994 1482718 1537445 1594800 1655829
55947 1655829 1721557 1791995 1867414 1949062 2037868 2134030 2238549 2353405 2479504 2616193
55937 2616193 2763328 2921639 3090414 3267192 3450733 3642086 3841948 4049515 4265057
55928 4265057 4491000 4729273 4980181 5245132 5527606 5829875 6151448 6492198 6854297
55919 6854297 7239781 7649382 8085264 8551584 9050672 9582093 10147173 10750730 11396879
55910 11396879 12087801 12829150 13632495 14510428 15474413 16539911 17728123 19060148 20556336
55901 20556336 22245545 24168815 26370400 28892776 31784176 35101624 38902191 43243513
55893 43243513 48198617 53852941 60273451 67489717 75489036 84137612 92989890 101153900
55885 101153900 107455094 110892424 111062363 108237739 103116967 96505353 89121531 81526394
55877 81526394 74105611 67086175 60584290 54652710 49302164 44510630 40238598 36442008
55869 36442008 33073448 30082879 27426172 25069440 22981314 21126270 19469709 17984834
55861 17984834 16650732 15448266 14361654 13379754 12491495 11682884 10941476 10260524 9635764
55852 9635764 9061262 8531259 8042916 7593913 7179661 6795655 6440371 6113190 5811414
55843 5811414 5531453 5270839 5026910 4795674 4574325 4363229 4163531 3974522 3795108
55834 3795108 3625848 3467347 3318286 3176951 3043245 2917366 2798027 2683802 2574923
55825 2574923 2472050 2374537 2281470 2193083 2109597 2029931 1953128 1879842 1810936 1745803 1683513
55814 1683513 1624465 1569412 1517925 1469193 1423299 1380285 1339018 1298302 1258202 1219063 1180238
55803 1180238 1141114 1102383 1065015 1028874 993587 959788 928246 898634 870400 843886 819233
55792 819233 795024 769425 742072 713718 684828 655748 627476 600919 575867 551886 529561
55781 529561 509742 492179 476121 461668 449307 438635 428707 419300 410708 402747 395070 388045 382270
55768 382270 377468 372879 368371 364197 359988 354991 349096 342736 336055 328960 321682 314429 306805 298398
55754 298398 289683 281565 274321 267715 261800 256769 252304 247894 243620 239909 236739 233777 231115 229176
55740 229176 228051 227448 227082 226681 225934 224914 224159 223875 223533 222751 221942 221449 220641 218710 215912 213219 211065
55723 211065 209227 207580 206212 205029 203922 203056 202380 201194 198909 195855 192682 189304 185201 180431 175609
55708 175609 171081 166809 162828 159131 155333 151110 146755 142736 138962 135086 131179 127487 123810 119794
55694 119794 115513 111110 106224 100514 94477 89037 84512 80684 77610 75569 74393 73554 72819 72262 71818
55679 71818 71469 71557 72281 73143 73550 73707 74154 74730 74797 74320 73871 73649 73304 72656 71856 70869 69539 68153 67226
55660 67226 66721 66133 65330 64640 64138 63494 62620 61855 61448 61317 61309 61287 61093 60850 61091 62035 63018 63264 62964 62837
55640 62837 62872 62374 61156 59782 58586 57295 55797 54531 53867 53729 53977 54590 55352 55928 56381 57096 58122
55623 58122 59155 60186 61583 63470 65571 67729 69997 72127 73588 74203 74250 73885 73031 71876 70853 70020
55607 70020 69056 67993 67308 67143 67065 66832 66849 67558 68858 70380 71884 73185 74118 74774 75414 76035 76413 76609
55589 76609 76927 77283 77191 76552 75918 75745 75853 75847 75582 74979 73824 72097 70127 68209 66344 64559 63085 62031
55571 62031 61157 60179 58998 57542 55696 53580 51540 49703 47848 45793 43627 41439 39219 37111 35432
55556 35432 34265 33355 32487 31648 30768 29695 28526 27575 26874 26061 24895 23562 22369 21510 21197 21571 22352
55539 22352 22958 23132 23133 23196 23191 22963 22618 22308 22055 21923 22015 22202 22187 21985 21978 22396 23081 23802 24429 24780 24742 24647 25000
55516 25000 25768 26421 26817 27455 28659 30089 31347 32559 34006 35668 37486 39631 42108 44488 46431
55501 46431 48129 49833 51247 51845 51524 50551 49112 47260 45149 42935 40599 38145 35800 33780 32010
55486 32010 30354 28923 27895 27188 26548 25807 24882 23717 22453 21500 21194 21464 21959 22343 22407 22137 21808 21767
55468 21767 21969 22014 21773 21709 22364 23744 25414 26915 27937 28349 28347 28363 28598 28815 28712 28283 27717 27155 26726
55449 26726 26492 26236 25583 24484 23280 22139 20836 19271 17781 16637 15596 14313 12921 11833 11147
55434 11147 10584 9861 8849 7564 6225 5160 4470 3947 3452 3089 2856 2475 1797 1036 355 -441 -1500
55417 -1500 -2546 -3241 -3599 -3750 -3654 -3376 -3332 -3831 -4669 -5511 -6360 -7255 -7873 -7961 -7843 -7940 -8037 -7673 -7013 -6696 -6863
55396 -6863 -6990 -6721 -6303 -6084 -6089 -6189 -6343 -6531 -6757 -7176 -7874 -8588 -8923 -8865 -8692 -8482 -8129 -7778 -7749 -7959 -7957
55375 -7957 -7651 -7513 -7855 -8350 -8534 -8418 -8313 -8359 -8494 -8649 -8691 -8392 -7727 -7019 -6593 -6429 -6396 -6598 -7168 -7858
55355 -7858 -8164 -7876 -7210 -6432 -5581 -4672 -3884 -3377 -3058 -2708 -2278 -1931 -1840 -2049 -2536 -3221 -3900 -4313 -4399 -4368
55335 -4368 -4437 -4594 -4715 -4807 -4957 -5145 -5332 -5635 -6184 -6812 -7167 -7141 -6979 -6879 -6782 -6604 -6398 -6176 -5855 -5510 -5447
55314 -5447 -5824 -6397 -6828 -7067 -7262 -7489 -7768 -8175 -8687 -9051 -8995 -8507 -7799 -7107 -6654 -6620 -6984 -7497 -7920 -8183
55294 -8183 -8313 -8424 -8845 -9879 -11246 -12115 -11959 -11162 -10445 -10036 -9726 -9503 -9602 -10003 -10361 -10502 -10643 -11032 -11623
55275 -11623 -12190 -12574 -12761 -12876 -13093 -13445 -13774 -14000 -14282 -14726 -15065 -14901 -14169 -13174 -12224 -11500 -11153 -11231 -11486
55256 -11486 -11512 -11134 -10514 -9892 -9383 -9038 -8897 -8979 -9329 -9985 -10817 -11517 -11891 -12021 -11980 -11603 -10833 -10092 -9913 -10270
55236 -10270 -10599 -10507 -10176 -10042 -10318 -10873 -11347 -11375 -10923 -10354 -10006 -9767 -9314 -8690 -8303 -8328 -8486 -8492 -8442 -8586 -8943
55215 -8943 -9319 -9588 -9800 -10084 -10504 -10970 -11270 -11261 -11016 -10767 -10718 -10917 -11191 -11182 -10656 -9910 -9618 -10074 -10788 -11094 -10965
55194 -10965 -10919 -11252 -11740 -12038 -12044 -11843 -11611 -11559 -11729 -11837 -11605 -11213 -11116 -11435 -11860 -12175 -12495 -12889 -13139 -13087 -12915
55173 -12915 -12848 -12792 -12493 -11970 -11554 -11531 -11851 -12164 -12134 -11720 -11199 -10854 -10696 -10550 -10359 -10231 -10231 -10251 -10095 -9615 -8850
55152 -8850 -8085 -7672 -7655 -7696 -7488 -7100 -6751 -6459 -6170 -6028 -6207 -6566 -6822 -6967 -7161 -7319 -7186 -6829 -6652 -6872
55132 -6872 -7285 -7644 -7931 -8177 -8301 -8264 -8167 -8075 -7944 -7755 -7547 -7321 -7122 -7172 -7651 -8301 -8563 -8191 -7515 -7030 -6949
55111 -6949 -7147 -7312 -7164 -6790 -6752 -7531 -8867 -9967 -10390 -10362 -10218 -10018 -9821 -9839 -10064 -10124 -9807 -9410 -9236 -9070
55091 -9070 -8539 -7783 -7348 -7440 -7647 -7460 -6855 -6280 -6141 -6418 -6739 -6851 -6867 -7020 -7304 -7565 -7826 -8192 -8511 -8481
55071 -8481 -8131 -7834 -7765 -7687 -7407 -7048 -6713 -6214 -5443 -4703 -4359 -4351 -4291 -3929 -3292 -2489 -1663 -1017 -677 -559 -416
55050 -416 -18 737 1731 2597 2994 2990 2984 3211 3528 3732 3764 3521 2835 1859 1144 1067 1370 1521 1342 1020 734 560
55028 560 557 670 652 389 161 304 705 935 822 620 619 834 1115 1359 1554 1718 1835 1807 1581 1348 1427 1845
55006 1845 2161 1954 1346 853 810 1140 1626 2161 2716 3251 3723 4086 4244 4094 3637 3022 2489 2227 2230 2294 2261
54985 2261 2219 2348 2599 2735 2720 2797 3126 3552 3839 3910 3762 3355 2774 2304 2202 2470 2962 3551 4120 4578 4963
54964 4963 5335 5511 5209 4567 4185 4452 5062 5426 5286 4765 4082 3552 3544 4107 4783 5119 5196 5396 5827 6329
54944 6329 6850 7449 8024 8406 8659 8942 9174 9141 8920 8823 8959 9136 9211 9211 9100 8724 8087 7422 6955 6749 6807
54923 6807 7089 7431 7646 7742 7896 8199 8572 8910 9133 9146 8951 8740 8705 8796 8866 9000 9418 10088 10706 11104 11466
54902 11466 12107 13182 14609 16066 17068 17267 16767 16040 15557 15587 16235 17426 18893 20389 21971 23891
54886 23891 26265 29012 32060 35356 38748 42048 45266 48540 51869 55119 58261 61310 64006 65810
54872 65810 66307 65480 63579 60926 57834 54530 51068 47509 44112 41158 38571 35958 33081 30080 27244
54857 27244 24795 22917 21706 20965 20328 19655 19145 18949 18943 19031 19416 20312 21556 22735 23683 24672 26124 28225
54839 28225 30833 33660 36543 39534 42746 46131 49477 52577 55314 57605 59320 60225 59966 58226 55096
54824 55096 51210 47336 43826 40558 37312 34006 30637 27279 24186 21671 19808 18408 17265 16305 15461
54809 15461 14669 13967 13403 12799 11865 10621 9472 8746 8375 8142 8052 8257 8753 9317 9685 9679 9258 8589 8022
54790 8022 7863 8134 8578 8904 8976 8816 8498 8057 7553 7117 6832 6530 5907 4939 4043 3612 3569 3562 3493 3554 3826
54769 3826 4134 4303 4294 4012 3288 2170 1050 390 432 1160 2372 3714 4824 5526 5819 5759 5486 5293 5425
54750 5425 5825 6340 7078 8230 9568 10575 11153 11811 12897 14047 14699 14896 15226 16101 17405 18777 20019
54733 20019 21220 22652 24514 26717 29026 31439 34223 37455 40774 43830 46805 50183 54076 58015
54719 58015 61371 63788 65202 65697 65418 64539 63215 61586 59778 57867 55856 53738 51543 49332 47197
54704 47197 45280 43702 42456 41479 40840 40687 40977 41421 41824 42313 43092 44109 45128 46070 47130 48596 50664
54687 50664 53401 56762 60608 64745 68966 73048 76838 80332 83626 86751 89578 91832 93121 93029 91378
54672 91378 88406 84524 79938 74680 68983 63347 58190 53639 49736 46515 43825 41324 38843 36513
54658 36513 34414 32374 30301 28448 27097 26201 25551 25085 24700 24017 22743 21175 19941 19258 18787 18254
54642 18254 17836 17792 17997 18101 18011 18004 18404 19221 20135 20777 21037 21096 21160 21257 21275 21141 20843 20426 20012 19757 19665 19548
54620 19548 19258 18880 18604 18484 18473 18619 19035 19753 20693 21777 22930 24022 24972 25895 26989 28265 29486
54603 29486 30401 31004 31558 32385 33600 34988 36163 36920 37348 37640 37904 38253 38867 39847 41059 42266 43353
54586 43353 44346 45327 46468 48020 50094 52551 55211 58079 61219 64537 67921 71507 75540 79938 84165
54571 84165 87593 89849 90844 90642 89343 87075 84011 80456 76772 73161 69602 66092 62843 60038 57510
54556 57510 54908 52159 49562 47391 45596 43980 42551 41567 41223 41331 41366 40903 39999 39006 38052 36929 35537
54539 35537 34141 32976 31868 30551 29124 27881 26795 25632 24455 23647 23356 23276 23066 22660 22096 21366
54523 21366 20578 19973 19592 19141 18369 17387 16468 15742 15253 15110 15335 15656 15716 15428 14981 14586 14342 14332 14615 15133
54503 15133 15694 16103 16249 16120 15810 15483 15286 15237 15228 15139 14981 14927 15171 15663 16081 16188 16133 16274 16713 17232 17693
54482 17693 18223 18876 19389 19496 19384 19624 20641 22387 24457 26435 28110 29499 30730 31922 33230 34889
54466 34889 37026 39411 41573 43284 44734 46094 47091 47259 46514 45250 43881 42528 41173 39838 38521
54451 38521 37124 35588 33991 32446 30989 29650 28505 27520 26455 25103 23586 22271 21352 20679 20064
54436 20064 19584 19443 19596 19690 19420 18867 18447 18579 19368 20502 21426 21740 21549 21378 21652 22285 22827 23002 23002 23256
54416 23256 23979 24975 25871 26480 26895 27224 27337 27044 26496 26199 26456 26996 27325 27343 27348 27505 27616 27490 27265 27180
54396 27180 27184 27019 26610 26222 26182 26579 27238 27897 28343 28444 28171 27649 27118 26749 26426 25859 24966 24080 23588 23489
54376 23489 23471 23420 23566 24091 24836 25550 26180 26714 26920 26539 25699 24879 24465 24505 24886 25484 26077 26371 26277 26021
54356 26021 25871 25834 25776 25699 25726 25864 25963 25960 25973 26142 26491 26994 27669 28531 29559 30783 32280 33985 35604 36849
54336 36849 37733 38510 39327 40071 40561 40772 40830 40881 41020 41265 41535 41683 41564 41058 40079 38678 37152 35929 35216
54317 35216 34796 34258 33386 32310 31320 30605 30112 29637 29045 28436 28051 27990 28080 28038 27733 27279 26915 26821 26992 27252
54297 27252 27443 27557 27659 27715 27684 27724 28122 28946 29914 30708 31259 31666 32011 32384 32932 33722 34660 35634 36600 37410
54277 37410 37774 37633 37354 37290 37238 36656 35406 33958 32830 32095 31494 30795 29920 28941 28037 27326 26676 25824 24714
54258 24714 23545 22478 21531 20774 20364 20222 19950 19297 18494 17909 17505 16949 16165 15476 15185 15244 15367 15294 14897
54239 14897 14254 13707 13612 13893 13990 13467 12579 11979 11908 11958 11689 11200 10878 10785 10595 10064 9266 8386 7565 7016 6947
54218 6947 7233 7410 7234 7005 7114 7460 7682 7769 8058 8625 9124 9317 9426 9763 10297 10785 11098 11238 11175 10902
54198 10902 10576 10407 10453 10641 10904 11162 11269 11151 10967 10924 10959 10788 10317 9816 9618 9752 9992 10145 10154 9996 9692
54177 9692 9436 9495 9866 10162 10028 9553 9115 8889 8758 8676 8774 9000 8991 8554 8074 8167 9006 10221 11338 12064 12232
54156 12232 11812 11050 10339 9916 9800 9986 10485 11148 11727 12110 12325 12330 12074 11801 11908 12388 12701 12416 11739 11207
54136 11207 11044 11071 11078 11071 11147 11351 11611 11740 11538 11003 10364 9807 9289 8687 8025 7464 7154 7184 7508 7827 7707
54115 7707 7030 6184 5632 5400 5185 4874 4666 4768 5177 5808 6587 7356 7884 8078 8086 8082 8044 7812 7332 6751 6281
54094 6281 6027 5964 6060 6351 6811 7212 7223 6723 5951 5316 5105 5361 5905 6434 6738 6923 7288 7868 8248 8015
54074 8015 7303 6678 6516 6659 6739 6604 6368 6167 6018 5903 5842 5879 6004 6170 6374 6690 7151 7581 7628 7082 6185
54053 6185 5541 5616 6249 6722 6415 5395 4309 3688 3517 3486 3458 3480 3537 3555 3580 3689 3785 3754 3807 4292 5110 5659
54031 5659 5533 5002 4624 4636 4920 5311 5683 5934 6137 6555 7308 8173 8895 9511 10090 10402 10225 9823 9718 10028
54011 10028 10398 10615 10851 11232 11515 11447 11146 10965 11103 11509 12039 12569 13049 13533 14102 14678 15021 14999 14775 14692
53991 14692 14991 15653 16397 16878 16962 16895 17060 17630 18504 19551 20700 21827 22745 23447 24155 25044 26035 26979 27935
53972 27935 29106 30564 32145 33590 34767 35757 36830 38259 40105 42185 44238 46096 47720 49168 50522
53957 50522 51770 52757 53377 53826 54485 55460 56371 56735 56496 56025 55666 55455 55249 54945 54482 53747 52670 51377
53939 51377 50132 49119 48297 47520 46694 45808 44850 43774 42530 41103 39582 38219 37332 36979 36785 36267 35356
53922 35356 34429 33797 33387 33022 32755 32717 32776 32617 32178 31753 31642 31837 32100 32225 32161 31961 31699 31411 31127 30955
53902 30955 31073 31548 32217 32839 33333 33748 34076 34224 34169 34012 33847 33709 33681 33916 34480 35220 35866 36251 36448 36699
53882 36699 37208 37960 38800 39703 40886 42519 44442 46321 48078 49973 52221 54661 56915 58702 59959
53867 59959 60725 61087 61215 61341 61616 62031 62497 63007 63648 64445 65297 66144 67151 68549 70297 72063 73621
53850 73621 75089 76679 78370 80007 81629 83450 85566 87822 89961 91784 93154 94022 94473 94667 94697 94582
53834 94582 94332 93949 93386 92631 91790 90972 90104 88952 87364 85401 83257 81108 79000 76805 74313 71463
53818 71463 68457 65624 63222 61361 59963 58717 57237 55433 53623 52155 51022 50005 48985 47922
53804 47922 46657 45041 43219 41494 39975 38581 37347 36430 35814 35257 34552 33663 32627 31603 30931 30840
53788 30840 31050 30971 30373 29583 28970 28540 28149 27798 27552 27400 27356 27534 27964 28537 29165 29825 30348 30446 30055 29433
53768 29433 28789 28074 27282 26677 26492 26615 26799 27008 27362 27884 28522 29262 30006 30516 30661 30640 30768 31147 31688
53749 31688 32296 32894 33394 33845 34433 35179 35811 36181 36595 37495 38936 40684 42648 44897 47347 49780 52131
53732 52131 54418 56455 57991 59190 60576 62386 64256 65690 66581 67112 67428 67650 68026 68792 69904 71034
53716 71034 71805 71956 71423 70416 69342 68464 67634 66512 65014 63409 61988 60771 59650 58677 58007 57562
53700 57562 56915 55648 53809 51912 50482 49658 49224 48893 48496 47947 47176 46122 44793 43307 41842 40519
53684 40519 39349 38345 37691 37682 38382 39393 40030 39825 38883 37767 36979 36575 36273 35915 35671 35745 36024 36241 36339
53665 36339 36484 36743 36974 37088 37208 37484 37929 38470 39044 39580 40056 40622 41482 42568 43500 44017 44244 44478 44834
53646 44834 45275 45780 46328 46805 47093 47208 47257 47374 47754 48609 49932 51433 52809 54021 55206 56433 57694
53629 57694 58973 60227 61394 62475 63463 64142 64294 64208 64622 65843 67225 67937 68008 68170 68781 69462 69789 69848
53611 69848 69912 70012 70067 70163 70401 70667 70796 70852 71029 71341 71608 71689 71637 71592 71615 71668 71698 71704 71689 71540 71076 70283 69425
53588 69425 68809 68495 68341 68295 68442 68816 69322 69877 70463 70995 71303 71321 71201 71139 71189 71290 71429 71710 72288 73229
53568 73229 74396 75437 76006 76074 76034 76417 77404 78637 79581 80118 80669 81618 82799 83862 84958 86639 88979
53551 88979 91316 93073 94423 95794 97136 98210 99314 101064 103471 105845 107717 109369 111271 113457
53537 113457 115675 117783 119712 121367 122793 124231 125737 126991 127781 128491 129784 131856 134258 136406 138039
53522 138039 139196 140021 140658 141215 141690 141956 141879 141499 141135 141216 141926 142973 143837 144228 144215 144007 143784 143730 143964
53503 143964 144368 144641 144679 144684 144822 144921 144732 144313 144003 144035 144313 144563 144556 144256 143857 143687 143986 144728 145656 146458 146941
53482 146941 147160 147378 147847 148611 149608 150895 152600 154640 156719 158636 160458 162331 164338 166605 169297
53467 169297 172369 175516 178573 181803 185585 189946 194625 199470 204549 209891 215377 220916 226565 232436
53453 232436 238609 245150 252073 259281 266673 274352 282628 291728 301547 311721 321962 332293 342985
53440 342985 354236 365930 377725 389357 400838 412376 424181 436323 448633 460779 472514
53429 472514 483883 495077 506169 517142 528149 539450 551019 562500 573690 584813 596142
53418 596142 607552 618690 629406 639771 649771 659310 668446 677331 685890 693820 700939 707355 713239
53405 713239 718627 723507 727881 731637 734541 736513 737823 738862 739710 740012 739286 737300 734162 730089 725142
53390 725142 719240 712420 704999 697366 689636 681589 672972 663784 654274 644695 635085 625247 615015 604515
53376 604515 594135 584171 574594 565212 555991 547076 538529 530250 522193 514581 507802 502108 497444 493524
53362 493524 490051 486907 484178 482035 480579 479798 479619 479992 480973 482728 485435 489179 493991 499927 506988
53347 506988 514951 523481 532481 542192 552812 564164 575883 587858 600321 613563 627747 642940
53335 642940 659110 676073 693638 711812 730744 750409 770573 791141 812380 834644 857984
53324 857984 882136 906818 931897 957279 982769 1008121 1033183 1057985 1082628 1107060 1130986
53313 1130986 1154076 1176280 1197843 1218937 1239292 1258253 1275177 1289821 1302412 1313378 1322951
53302 1322951 1330958 1337074 1341310 1344118 1345867 1346272 1344616 1340540 1334379 1326618 1317242 1305899 1292539 1277487
53288 1277487 1260876 1242400 1221848 1199631 1176523 1152999 1129080 1104738 1080136 1055463 1030801
53277 1030801 1006264 982087 958440 935249 912319 889594 867214 845368 824142 803526 783543
53266 783543 764368 746241 729168 712831 696934 681595 667221 653992 641690 630042 619045
53255 619045 608849 599493 590880 582886 575434 568583 562592 557693 553753 550364 547363 545044 543664 542998
53241 542998 542589 542315 542397 542963 543912 545183 546898 549207 552184 555960 560723 566471 572892 579624 586623 594192
53225 594192 602628 611897 621687 631764 642170 652974 663948 674719 685219 695711 706289 716606
53213 716606 726275 735288 743802 751720 758768 764833 769983 774276 777825 780913 783681 785777 786712 786547 785821
53198 785821 784736 782843 779685 775368 770270 764471 757818 750320 742146 733287 723534 712805 701309 689335
53184 689335 677002 664235 650927 637158 623259 609619 596370 583358 570448 557749 545446
53173 545446 533538 521896 510494 499425 488739 478384 468281 458319 448311 438109 427781 417567
53161 417567 407647 398068 388937 380498 372922 366073 359607 353275 347028 340850 334645 328371 322182 316274
53147 316274 310622 304982 299184 293301 287486 281747 276022 270370 264993 260016 255380 250927 246562 242252
53133 242252 237945 233532 228897 224024 219026 214056 209166 204293 199399 194506 189630 184759 179984 175549
53119 175549 171640 168161 164776 161160 157217 153155 149376 146179 143471 140880 138202 135578 133164 130864
53105 130864 128551 126327 124262 122100 119605 117089 115148 113829 112472 110505 108038 105501 103060 100676
53091 100676 98451 96589 95118 93899 92857 91970 91124 90164 89038 87729 86176 84428 82817 81710 81126
53076 81126 80774 80444 80154 79909 79557 78956 78137 77205 76272 75510 75120 75106 75183 75053 74691 74301 74017 73776 73435 72888
53056 72888 72099 71175 70409 70082 70110 70049 69565 68839 68313 68109 67881 67305 66485 65760 65280 64939 64619 64278 63838 63237
53036 63237 62653 62485 62951 63817 64606 65039 65209 65350 65547 65691 65683 65630 65759 66143 66610 66976 67264 67580 67915 68211
53016 68211 68570 69116 69721 70078 70093 69950 69718 69167 68126 66828 65661 64731 63878 63003 62166 61368 60476 59389
52998 59389 58087 56532 54724 52924 51607 51027 50858 50438 49378 47887 46492 45517 44891 44360 43785 43185
52982 43185 42614 42097 41672 41345 40989 40386 39436 38308 37340 36790 36701 36940 37303 37631 37840 37909 37875 37821 37803 37726 37364
52961 37364 36631 35743 35019 34560 34252 34040 33956 33912 33700 33333 33151 33403 33880 34133 33967 33577 33258 33132 33145 33184
52941 33184 33199 33282 33592 34109 34563 34720 34669 34673 34808 34905 34846 34673 34386 33843 33012 32200 31846 32117 32780 33467 33974
52920 33974 34316 34583 34795 34878 34777 34577 34468 34526 34529 34157 33421 32799 32766 33242 33723 33953 34227 34925 35922 36748 37183
52899 37183 37465 37898 38474 38930 39022 38734 38346 38287 38754 39454 39940 40170 40535 41297 42277 43209 44146 45303 46703
52880 46703 48184 49660 51142 52568 53784 54709 55392 55973 56649 57608 58851 60163 61329 62321 63174 63796
52864 63796 64025 63856 63480 63145 63022 63123 63251 63142 62717 62121 61442 60568 59432 58269 57401 56876 56457 55919
52846 55919 55213 54397 53591 52935 52503 52283 52272 52443 52588 52411 51929 51528 51439 51422 51230 51131 51544 52347 52990 53206
52826 53206 53199 53146 53001 52806 52762 52824 52673 52234 51848 51759 51804 51821 51986 52441 52888 52936 52653 52412 52344 52248 51962 51499 50889
52803 50889 50182 49620 49502 49858 50451 51117 51907 52858 53824 54602 55066 55096 54560 53493 52226 51258 50948 51273 51869
52784 51869 52336 52588 52899 53545 54487 55457 56299 57049 57738 58285 58607 58687 58507 58040 57415 56957 56898 57077 57087 56739
52764 56739 56262 55994 55958 55852 55461 54924 54513 54317 54291 54555 55385 56804 58361 59474 59922 59944 59919 60099 60552
52745 60552 61162 61638 61693 61277 60600 59880 59124 58203 57081 55899 54824 53871 52879 51694 50312 48849 47374
52728 47374 45850 44244 42667 41331 40401 39856 39493 39067 38464 37768 37101 36451 35731 34961 34270 33675 33010 32179
52710 32179 31343 30752 30446 30226 29876 29291 28504 27717 27217 27077 26980 26506 25639 24769 24202 23847 23489 23120 22864
52691 22864 22700 22477 22119 21675 21195 20703 20282 20014 19843 19637 19413 19339 19441 19454 19066 18281 17399 16715 16320 16166
52671 16166 16204 16381 16596 16732 16736 16629 16433 16117 15682 15285 15172 15403 15730 15865 15806 15755 15711 15441 14925 14597 14856
52650 14856 15490 15878 15683 15074 14323 13553 12953 12856 13347 14022 14377 14320 14082 13820 13527 13252 13095 13026 12907 12736
52630 12736 12695 12949 13529 14390 15395 16242 16626 16518 16192 15964 16029 16483 17285 18196 18964 19589 20253 20983 21596
52611 21596 22036 22489 23085 23700 24225 24795 25568 26437 27203 27930 28902 30228 31632 32641 32914 32467 31700 31126
52593 31126 30968 31039 31067 31039 31083 31148 31011 30555 29859 29037 28138 27231 26420 25701 24948 24110 23306 22651 22089 21465 20733
52572 20733 19998 19391 18983 18830 19001 19488 20117 20627 20865 20837 20542 19882 18854 17764 17068 16950 17198 17517 17805
52553 17805 18055 18187 18100 17809 17384 16859 16354 16166 16541 17352 18151 18568 18606 18534 18615 18900 19224 19405 19512 19825
52533 19825 20482 21249 21814 22211 22749 23578 24536 25436 26256 27003 27575 27875 27941 27856 27669 27423 27229 27207 27455 28027
52513 28027 28827 29538 29854 29877 30111 30934 32240 33658 34928 35889 36321 36114 35536 35084 35032 35278 35597 35918 36311
52494 36311 36875 37642 38491 39167 39529 39747 40085 40486 40609 40351 40080 40198 40616 40902 40865 40756 40863 41119 41231
52475 41231 41100 40989 41204 41687 42023 41864 41274 40598 40046 39597 39295 39382 39960 40684 41047 40932 40690 40655 40789 40856
52455 40856 40745 40497 40178 39855 39641 39609 39686 39737 39738 39785 39932 40092 40115 39969 39831 39980 40502 41103 41357 41184 40952
52434 40952 40989 41184 41216 41053 40930 40937 40914 40835 40999 41639 42522 43145 43274 43126 43043 43144 43305 43403 43501 43801 44387 45010
52412 45010 45217 44760 43871 43091 42855 43211 43828 44231 44105 43532 42918 42624 42665 42813 42921 43033 43192 43299 43238 43058
52392 43058 42944 43018 43246 43535 43876 44330 44909 45493 45845 45732 45053 43983 42960 42428 42471 42767 42956 43016 43166
52373 43166 43470 43710 43652 43317 42900 42542 42272 42091 42026 42108 42379 42881 43638 44614 45692 46653 47259 47477 47577 47843
52353 47843 48195 48273 47926 47431 47127 47018 46854 46474 45941 45465 45286 45520 45969 46250 46259 46341 46836 47577 48115 48312
52333 48312 48422 48622 48796 48810 48725 48665 48695 48926 49500 50357 51198 51830 52372 53042 53895 54895 56053 57336 58561
52314 58561 59567 60359 60935 61126 60804 60253 60044 60521 61509 62544 63264 63604 63772 64062 64618 65349 66150 67137
52296 67137 68501 70133 71622 72696 73515 74369 75266 75995 76547 77223 78239 79388 80238 80617 80759 80994 81413
52279 81413 81923 82489 83173 83962 84674 85168 85517 85930 86536 87329 88293 89404 90520 91375 91839 92107 92576 93490
52261 93490 94784 96215 97603 98900 100148 101419 102824 104523 106673 109235 111853 114082 115889 117838
52247 117838 120518 123795 126891 129337 131597 134497 138254 142379 146451 150584 155072 159934 164967 170011
52233 170011 174966 179732 184350 189033 193928 198940 203952 209023 214135 218984 223313 227381 231787 236822
52219 236822 242270 247769 253121 258195 262852 267058 270832 274064 276597 278588 280477 282511 284536 286346
52205 286346 287970 289417 290463 290984 291268 291710 292329 292877 293306 293772 294274 294644 294940 295465 296283 296997 297174 296850
52187 296850 296452 296374 296735 297465 298447 299623 301042 302783 304872 307312 310136 313271 316390 319157 321693 324549
52171 324549 328053 331887 335509 338828 342174 345733 349314 352678 355801 358720 361363 363658 365627 367255
52157 367255 368401 369024 369321 369498 369472 369004 368085 366965 365794 364422 362625 360400 357949 355489 353148 350987
52141 350987 348994 347070 345116 343161 341328 339690 338212 336826 335530 334385 333473 332835 332437 332156 331834
52126 331834 331391 330871 330384 329980 329605 329191 328765 328417 328145 327825 327360 326816 326272 325620 324644 323344 322015 320963
52108 320963 320269 319867 319686 319550 319083 317965 316290 314518 313034 311870 310834 309727 308415 306876 305257
52093 305257 303768 302450 301167 299874 298741 297929 297341 296738 295983 295060 293922 292525 290954 289372 287818
52078 287818 286221 284616 283198 282067 281040 279828 278319 276631 274968 273514 272406 271637 270973 270107 269005
52063 269005 268000 267457 267335 267186 266584 265515 264309 263292 262593 262241 262293 262799 263661 264674 265706 266821 268186
52046 268186 269852 271702 273605 275602 277851 280403 283174 286187 289741 294176 299486 305289 311203 317101
52032 317101 322965 328646 333978 339092 344461 350554 357454 364774 371879 378233 383703 388651 393659 398987
52018 398987 404274 408866 412458 415331 417945 420407 422463 423942 424979 425802 426467 426907 427077 426907 426239 425036
52002 425036 423587 422293 421186 419880 418087 416012 414085 412419 410756 408898 407001 405393 404199 403273
51988 403273 402415 401592 400942 400644 400757 401195 401763 402246 402516 402607 402734 403163 404056 405393 407021 408700 410154 411203
51970 411203 411886 412395 412830 413062 412933 412520 412106 411834 411512 410819 409686 408366 407104 405805 404091 401705 398756
51953 398756 395549 392284 388944 385398 381494 377070 372026 366445 360564 354593 348607 342605 336599 330608
51939 330608 324650 318758 312928 307021 300826 294259 287439 280505 273471 266320 259172 252198 245407 238628
51925 238628 231690 224563 217364 210317 203657 197473 191611 185828 180057 174488 169330 164549 159858 154979
51911 154979 149911 144920 140276 136016 132024 128276 124884 121905 119266 116926 114906 113055 110988 108524
51897 108524 106051 104149 102853 101612 100023 98280 96738 95320 93659 91685 89749 88155 86844 85609
51883 85609 84412 83383 82592 81958 81375 80881 80641 80724 80837 80410 79139 77422 76043 75360 74972 74267 73078
51866 73078 71658 70250 68953 67880 67109 66460 65650 64736 64165 64237 64738 65229 65511 65620 65604 65521 65525 65668 65710 65371
51846 65371 64749 64190 63793 63343 62734 62183 61909 61860 61867 61814 61562 60945 60043 59265 58934 58900 58789 58487 58143 57801 57313
51825 57313 56645 55995 55541 55253 55049 54984 55156 55477 55686 55613 55391 55321 55520 55770 55843 55873 56185 56721 56959 56557 55863
51804 55863 55501 55613 55864 56075 56449 57112 57799 58216 58405 58576 58709 58636 58353 58067 57925 57916 57996 58199 58596 59268
51784 59268 60261 61476 62611 63345 63635 63753 64019 64536 65216 65953 66757 67692 68740 69711 70331 70497 70407 70391 70565
51765 70565 70759 70779 70677 70664 70802 70916 70818 70530 70234 70082 70131 70365 70682 70927 71082 71378 72043 72922 73529 73590 73344
51744 73344 73196 73250 73365 73529 73936 74667 75563 76425 77199 77908 78543 79112 79678 80269 80853 81419 82035 82781 83685
51725 83685 84713 85719 86430 86661 86572 86603 87047 87790 88516 89094 89682 90536 91783 93302 94788 96009 97042
51708 97042 98146 99370 100505 101489 102687 104469 106656 108600 109862 110567 111009 111166 110783 109839 108703 107769
51692 107769 107103 106515 105848 105069 104146 103077 102054 101386 101106 100833 100206 99330 98578 98073 97695 97509 97773 98422
51674 98422 98940 98959 98631 98177 97408 96119 94710 93900 93838 93929 93626 93000 92405 91951 91545 91193 91014 90998 90995 90861
51654 90861 90573 90235 90018 89975 89909 89589 89101 88769 88667 88471 87954 87392 87182 87254 87154 86659 86019 85610 85616 86051 86829
51633 86829 87726 88486 89066 89630 90253 90828 91330 91928 92720 93531 94197 94902 95961 97302 98413 98842 98567 97786
51615 97786 96549 94769 92538 90242 88281 86740 85403 84055 82673 81332 80033 78719 77415 76212
51601 76212 75127 74054 72930 71868 71013 70358 69770 69203 68777 68623 68678 68739 68673 68517 68336 68051 67497 66681 65855
51582 65855 65266 64904 64584 64222 63881 63565 63180 62752 62529 62729 63291 63956 64504 64820 64832 64547 64085 63587 63127
51563 63127 62815 62849 63247 63653 63624 63160 62719 62711 63156 63841 64562 65154 65501 65700 66026 66628 67367 68039 68611 69131
51543 69131 69592 70064 70781 71888 73213 74477 75606 76621 77383 77761 77990 78526 79435 80268 80647 80744 80990 81497
51525 81497 81999 82217 82076 81653 81117 80755 80829 81313 81870 82184 82232 82193 82160 82091 82029 82217 82872 83902 84980 85948
51505 85948 86979 88294 89812 91228 92411 93507 94625 95563 95998 95879 95557 95471 95803 96391 96948 97297 97438
51488 97438 97446 97343 97106 96778 96531 96552 96846 97174 97268 97073 96766 96503 96254 95937 95588 95248 94779 93994 93010 92254
51468 92254 92034 92246 92589 92923 93263 93568 93733 93751 93715 93664 93572 93440 93295 93118 92891 92677 92542 92450 92343 92270 92283
51447 92283 92312 92285 92285 92410 92558 92611 92767 93324 94085 94401 93954 93229 92920 93133 93456 93646 93888 94393 95071 95730 96341
51426 96341 96990 97676 98299 98834 99413 100210 101249 102344 103262 103964 104641 105508 106616 107877 109159 110320 111221
51409 111221 111799 112110 112229 112171 111950 111674 111496 111514 111738 112108 112445 112497 112111 111390 110581 109830 109097 108304 107465 106651
51389 106651 105902 105194 104479 103731 102959 102153 101253 100171 98908 97576 96294 95071 93822 92496 91157 89955
51373 89955 89056 88543 88386 88509 88865 89421 90062 90602 90925 91061 91099 91037 90772 90226 89499 88857 88554 88582 88654 88456
51353 88456 87896 87092 86186 85278 84437 83616 82577 81078 79179 77179 75267 73391 71543 69924 68685 67669
51337 67669 66617 65528 64641 64080 63684 63206 62581 61971 61563 61325 60962 60220 59191 58206 57444 56811 56254 55955
51319 55955 56031 56243 56243 56010 55797 55665 55322 54530 53504 52796 52759 53166 53353 52839 51779 50749 50055 49431 48491
51300 48491 47311 46359 45951 45953 46004 45887 45688 45677 46027 46577 46964 47088 47288 47918 48851 49628 50005 50146 50299 50582
51280 50582 51082 51897 52963 54004 54781 55287 55654 55967 56233 56425 56541 56655 56897 57242 57369 56919 55906 54727
51262 54727 53726 52899 52080 51223 50386 49575 48730 47782 46642 45230 43577 41882 40374 39203 38453 38184 38381
51245 38381 38866 39293 39267 38560 37351 36196 35607 35611 35835 36003 36178 36485 36793 36802 36373 35647 34883 34240 33729 33355
51225 33355 33286 33769 34769 35812 36396 36517 36572 36764 36890 36782 36648 36756 37000 37071 36927 36843 36995 37227 37262 36975
51205 36975 36429 35748 35022 34311 33673 33189 32870 32575 32119 31523 31056 30946 31134 31374 31545 31742 32108 32664 33247
51186 33247 33556 33382 32889 32606 32959 33838 34716 35182 35241 35110 34918 34671 34383 34128 33973 33905 33822 33601 33257 32997
51166 32997 33041 33346 33638 33773 33959 34485 35278 35886 35955 35590 35194 35036 35079 35177 35273 35387 35540 35746 36033 36403 36813
51145 36813 37273 37878 38707 39675 40599 41359 41944 42364 42590 42612 42505 42438 42599 43064 43668 44089 44123 43832 43393 42897
51125 42897 42411 42118 42183 42467 42550 42141 41366 40596 40082 39819 39687 39598 39517 39389 39126 38686 38185 37839 37742 37756 37672
51104 37672 37424 37083 36722 36406 36243 36314 36560 36860 37185 37569 37968 38229 38216 37855 37216 36617 36504 36980 37560 37678
51084 37678 37358 37083 37032 36835 36142 35089 34045 33233 32771 32822 33356 33931 34020 33570 33014 32783 32909 33098 33067 32778
51064 32778 32412 32124 31887 31687 31728 32196 32868 33243 33181 33058 33190 33422 33484 33427 33413 33348 33115 32950 33169 33643 33915
51043 33915 33838 33713 33755 33846 33895 34109 34671 35375 35852 36062 36356 37019 37927 38698 39133 39412 39854 40585 41492 42426
51023 42426 43268 43855 44067 44053 44139 44439 44733 44822 44779 44749 44747 44837 45213 45872 46452 46709 46923 47538 48548 49593 50471
51002 50471 51150 51464 51248 50722 50282 49873 49068 47825 46709 46200 46177 46297 46482 46792 47115 47299 47392 47531 47720
50983 47720 47851 47790 47387 46624 45894 45817 46533 47427 47806 47691 47661 48075 48674 48921 48536 47742 47138 47240 48007 48890
50963 48890 49434 49725 50132 50814 51626 52343 52794 52942 53023 53482 54536 55891 57087 57995 58793 59588 60358 61137
50945 61137 62002 62870 63627 64418 65577 67174 68905 70456 71796 73099 74590 76512 79035 82071 85316
50930 85316 88489 91448 94118 96522 98943 101757 105060 108598 112174 115889 119908 124238 128878 133997
50916 133997 139721 145910 152344 159063 166343 174445 183510 193598 204580 216099 227911 240297 253827
50903 253827 268691 284460 300633 317157 334249 351848 369522 386870 403823 420468 436727
50892 436727 452281 466754 479923 491751 502237 511250 518517 523865 527509 530032 532037 533757 535038
50879 535038 535692 535870 536029 536529 537304 537932 538011 537351 535895 533570 530305 526039 520600 513667 505023 494800
50863 494800 483357 470912 457416 442804 427231 411053 394660 378352 362229 346224 330398
50852 330398 315212 301293 288832 277404 266542 256324 247188 239299 232326 225832 219687 214051 209124
50839 209124 204973 201526 198696 196487 194943 193956 193240 192593 192063 191739 191548 191421 191525 192043 192817 193524 194190
50822 194190 195246 196963 199118 201317 203437 205610 207923 210301 212589 214741 217016 219973 224012 228892
50808 228892 233979 239028 244426 250507 257067 263786 270814 278568 287141 296407 306578 318218 331627
50795 331627 346595 362836 380371 399400 420081 442563 466965 493228 521205 551038 583152
50784 583152 617646 653910 691093 728808 767124 805949 844690 882523 918715 952660 983822
50773 983822 1011778 1036237 1056934 1073585 1086084 1094679 1099909 1102401 1102795 1101784 1100091 1098356 1097058
50760 1097058 1096549 1097043 1098517 1100644 1102868 1104576 1105140 1103868 1100042 1093108 1082762 1068811 1050988 1029062
50746 1029062 1003161 973903 942129 908540 873632 837914 802048 766715 732432 699633 668853
50735 668853 640685 615445 592961 572799 554726 538888 525552 514781 506388 500116 495781 493293
50723 493293 492584 493464 495478 497934 500204 502032 503527 504875 506088 506999 507429 507318 506747 505814 504492 502595
50707 502595 499933 496447 492160 487047 481111 474539 467644 460592 453280 445584 437573 429423 421252 413196
50693 413196 405556 398666 392614 387275 382656 378989 376438 374893 374209 374486 375960 378705 382626 387691 393985
50678 393985 401584 410544 420960 432860 446077 460432 476096 493526 512955 534110 556499 579735
50666 579735 603458 627226 650751 674031 696960 718899 738983 756842 772696 786673 798340
50655 798340 807032 812380 814356 813059 808796 802341 794812 787135 779698 772586 766071 760753 757145 755193
50641 755193 754323 754029 754290 755281 756679 757484 756596 753442 747973 740190 729899 717012 701938 685529 668575
50626 668575 651439 634237 617305 601257 586560 573248 561260 550856 542492 536298 532000 529365
50614 529365 528534 529830 533461 539518 548067 559055 572231 587280 604001 622246 641706 661849 682047
50601 682047 701754 720673 738763 756033 772289 787172 800414 811962 821886 830360 837746 844433
50589 844433 850472 855540 859403 862266 864565 866625 868719 871260 874648 878943 883961 889691 896417 904422
50575 904422 913710 924037 935044 946321 957446 968026 977730 986308 993630 999645 1004198 1006964 1007655
50562 1007655 1006298 1003188 998642 992900 986273 979229 972281 965834 960140 955379 951801 949726 949310 950271
50548 950271 951996 954008 956183 958415 960235 960988 960275 958013 954050 947938 939118 927209 912130 894107
50534 894107 873596 851103 826993 801511 774974 747858 720774 694339 669024 644975 622067
50523 622067 600209 579561 560380 542767 526705 512234 499343 487807 477362 468075 460279 454141
50511 454141 449492 446163 444195 443616 444166 445467 447377 450040 453638 458193 463613 469822 476830 484736 493680
50496 493680 503826 515319 528218 542421 557769 574264 592109 611472 632260 654220 677114
50485 677114 700682 724493 748039 770951 793038 814174 834345 853770 872836 891904 911285
50474 911285 931367 952562 975122 999140 1024659 1051660 1080007 1109617 1140658 1173365 1207705
50463 1207705 1243502 1280861 1320128 1361304 1403739 1446539 1488990 1530449 1570047 1606769 1639733
50452 1639733 1668256 1691745 1709673 1721554 1726866 1725145 1716305 1700802 1679366 1652685 1621456 1586564
50440 1586564 1549074 1510117 1470948 1432980 1397514 1365410 1337143 1313153 1293991 1280085 1271415
50429 1271415 1267438 1267311 1270207 1275386 1281914 1288375 1293005 1294143 1290437 1280733 1264180 1240690 1211114
50416 1211114 1176716 1138488 1097107 1053329 1008191 962807 918139 874876 833384 793786 756250
50405 756250 721097 688527 658355 630252 604215 580555 559483 540899 524566 510216 497444
50394 497444 485799 475105 465578 457512 450993 445984 442448 440213 438879 438118 438025 438954 440986 443775 446924
50379 446924 450404 454476 459324 464917 471141 477888 485020 492391 500022 508156 517051 526761 537143 548031
50365 548031 559287 570799 582572 594831 607836 621532 635549 649615 663902 678810 694485
50354 694485 710695 727220 744246 762300 781798 802704 824614 847124 870049 893313 916704
50343 916704 939803 962108 983237 1003044 1021530 1038539 1053534 1065772 1074760 1080377 1082504 1080776
50331 1080776 1074885 1064931 1051167 1033567 1012028 986960 959333 930095 899897 869451 839718 811537
50319 811537 785377 761652 740930 723535 709213 697544 688555 682615 679845 679902 682161 685776 689559
50306 689559 692216 692826 690977 686470 679142 668993 656292 641454 624954 607348 589204 570940 552754
50293 552754 534703 516755 498898 481339 464502 448640 433548 418915 404856 391842 380073
50282 380073 369277 359215 350116 342383 336071 330826 326212 321929 317821 313913 310455 307784 306061 305162
50268 305162 304822 304870 305301 306191 307552 309341 311604 314491 318039 321998 325989 329895 333983 338630 343916
50253 343916 349527 354989 360060 364911 369918 375291 380943 386739 392702 398928 405379 411835 417960 423393
50239 423393 427986 432029 435982 439753 442500 443463 442876 441704 440542 439161 437162 434606 431828 428913 425612
50224 425612 421614 416720 410914 404420 397594 390649 383549 376238 368856 361643 354833 348666 343289 338503
50210 338503 333772 328682 323298 317953 312843 307988 303430 299235 295383 291879 288957 286925 285790 285160
50196 285160 284582 283862 283074 282375 281880 281613 281535 281598 281800 282156 282655 283303 284154 285192 286202 286851 286941 286559 285924
50177 285924 285132 284090 282691 281025 279343 277765 276100 274083 271782 269644 268016 266731 265293 263438
50163 263438 261401 259656 258457 257667 256927 255979 254875 253938 253440 253315 253232 253020 252965 253569 254977 256710 258055
50146 258055 258676 258790 258802 258891 258946 258758 258192 257273 256160 254998 253737 252155 250118 247750 245282 242844 240473
50129 240473 238185 235920 233545 231048 228670 226629 224810 222930 220934 218998 217195 215438 213793 212495
50115 212495 211525 210425 208788 206760 204888 203555 202717 202096 201454 200718 200027 199644 199706 200019 200154 199786 198942
50098 198942 197965 197229 196789 196326 195512 194424 193420 192615 191765 190767 190018 189941 190323 190476 190098 189646 189709 190268 190803
50079 190803 190965 190894 190902 191102 191430 191836 192284 192700 193095 193694 194727 196117 197602 199191 201210 203742 206320
50062 206320 208427 210142 211972 214186 216615 219066 221512 223874 225941 227634 229101 230474 231770 233107
50048 233107 234693 236473 238054 239186 240089 241122 242346 243667 245241 247404 250258 253526 256824 259979
50034 259979 263095 266379 269870 273375 276802 280505 285017 290388 296118 301868 307844 314254 320791 327046
50020 327046 333201 339847 347251 355250 363788 373126 383469 394734 406838 419926 434248 449981 467230
50007 467230 485988 506099 527412 549963 573742 598282 622703 646186 668227 688450 706510
49996 706510 722264 735898 747789 758389 768169 777428 786118 793996 800935 806814 811143 813107 812057
49983 812057 807682 799714 787870 772271 753574 732482 709403 684821 659702 635150 611679 589162
49971 589162 567434 546711 527362 509496 492925 477517 463495 451284 440981 432045 423685 415541
49959 415541 407853 400972 394969 389752 385280 381467 378092 375033 372454 370546 369154 367901 366642 365573
49945 365573 364863 364288 363316 361537 359037 356355 354031 352148 350363 348382 346260 344218 342329 340497 338582
49930 338582 336440 333975 331310 328818 326819 325297 323979 322629 321164 319664 318406 317833 318234 319438 320966
49915 320966 322502 324117 326056 328446 331307 334730 338928 344021 349783 355743 361673 367875 374827 382550
49901 382550 390639 398960 407973 418149 429386 441344 454162 468498 484885 503430 524123 547058
49889 547058 572230 599427 628445 659147 691091 723270 754504 784091 811913 837962 861989
49878 861989 883713 903304 921496 939105 956421 973068 988415 1001932 1013113 1021243 1025502 1025266
49866 1025266 1020167 1009956 994574 974427 950384 923390 894154 863227 831144 798357 765169
49855 765169 731865 698853 666571 635353 605511 577372 551076 526354 502768 480220 459097
49844 459097 439863 422596 406964 392538 379054 366451 354785 344074 334187 324889 316041 307739
49832 307739 300184 293445 287410 281879 276608 271304 265751 260017 254418 249226 244456 239998 235818 231976
49818 231976 228544 225601 223190 221190 219341 217528 215886 214458 212960 211167 209382 208157 207584 207269 207040
49803 207040 207214 208028 209173 210211 211122 212136 213308 214582 216069 217905 219931 221873 223738 225754 227963
49788 227963 230235 232613 235304 238324 241479 244706 248172 252014 256310 261312 267327 274240 281472 288653
49774 288653 296142 304735 315056 327307 341352 356846 373471 391260 410592 431703 454279 477575
49762 477575 500790 523217 544239 563407 580477 595278 607698 617924 626572 634404 641917 649211
49750 649211 656090 662152 666918 669996 670995 669203 663548 653184 638130 619254 597682 574322 549790
49737 549790 524584 499255 474448 450730 428356 407326 387717 369809 353784 339470 326549
49726 326549 314885 304459 295131 286629 278714 271196 263916 256895 250417 244764 239921 235650 231767 228185
49712 228185 224842 221784 219192 217095 215134 212886 210367 207960 205897 204103 202537 201362 200669 200312 200090
49697 200090 199955 199915 199953 200048 200171 200199 200037 199808 199743 199847 199927 199999 200388 201334 202649 203932 204932 205599 205971 206169
49677 206169 206424 206886 207494 208104 208668 209242 209890 210649 211530 212512 213584 214738 215828 216521 216635 216490 216639 217226
49659 217226 217864 218205 218317 218400 218440 218356 218211 218058 217801 217449 217317 217691 218449 219257 220008 220822 221763 222798 223926
49640 223926 225081 225990 226443 226647 227060 227842 228720 229393 229879 230418 231167 232021 232621 232633 232133 231649 231659 232151 232769
49621 232769 233251 233483 233349 232868 232353 232090 231948 231618 231231 231292 231956 232779 233333 233657 233978 234265 234360 234234 233919
49602 233919 233386 232721 232232 232163 232454 232928 233540 234229 234740 234853 234676 234452 234178 233657 232907 232217 231801 231580 231400
49583 231400 231273 231296 231422 231438 231240 231041 231209 231803 232395 232540 232333 232288 232637 233080 233338 233602 234220 235127 235913 236360
49563 236360 236668 237183 238119 239504 241222 243120 245183 247495 249945 252120 253742 255034 256421 258011 259676
49548 259676 261564 264027 267051 270176 273152 276312 280020 284080 288018 291750 295633 299936 304630 309681
49534 309681 315217 321229 327400 333419 339429 345888 353022 360571 368160 375762 383630 391901 400442 409123
49520 409123 418037 427373 437223 447617 458609 470135 481915 493704 505621 518082 531402 545564
49508 545564 560308 575277 590083 604505 618734 633294 648629 664775 681401 698066 714460
49497 714460 730586 746711 762984 779095 794481 808955 822852 836479 849648 861937 873192
49486 873192 883506 892796 900717 907009 911716 915034 917120 918120 918222 917563 916194 914190 911729 908976
49472 908976 905970 902746 899504 896559 894077 891955 890062 888567 887896 888280 889403 890673 891861 893356 895709
49457 895709 899062 903153 907810 913186 919452 926446 933755 941073 948355 955647 962875 969813 976205 981838
49443 981838 986579 990349 993078 994665 995007 994069 991867 988362 983391 976741 968283 957999 945959 932372
49429 932372 917638 902222 886332 869783 852275 833822 814853 795868 777065 758366 739726
49418 739726 721325 703411 686030 669006 652217 635797 620011 604957 590531 576692 563606
49407 563606 551429 540039 529126 518536 508385 498834 489897 481489 473567 466149 459222 452723 446599
49394 446599 440885 435673 431031 426940 423322 420148 417432 415075 412789 410273 407461 404541 401754 399298
49380 399298 397355 396056 395327 394896 394538 394295 394397 395012 396084 397386 398680 399903 401177 402639 404273 406037
49364 406037 408088 410727 414077 418009 422474 427663 433622 439837 445515 450297 454437 458282 461832 465012
49350 465012 468117 471675 475887 480460 485072 489792 494940 500677 506914 513522 520401 527397 534356 541344
49336 541344 548604 556169 563715 570928 577889 584894 591975 598866 605428 611862 618423 625131 631837 638440
49322 638440 644882 651058 656895 662481 668011 673609 679272 684964 690707 696574 702644 708929 715341 721749
49308 721749 728093 734416 740818 747435 754417 761803 769430 777129 785040 793555 802889 812835 823089 833591
49294 833591 844465 855749 867412 879511 892107 905070 918209 931645 945828 961123 977476
49283 977476 994506 1011826 1029281 1047040 1065503 1085001 1105481 1126591 1148110 1170182 1193089
49272 1193089 1216889 1241361 1266218 1291260 1316384 1341540 1366677 1391714 1416602 1441415 1466253
49261 1466253 1490978 1515158 1538394 1560618 1581918 1602154 1620932 1637940 1653120 1666460 1677838
49250 1677838 1687220 1694796 1700739 1704925 1707127 1707463 1706391 1704190 1700692 1695665 1689345 1682388 1675397 1668620
49236 1668620 1662049 1655612 1649256 1643039 1637191 1632002 1627590 1623855 1620698 1618219 1616694 1616434 1617624 1620181
49222 1620181 1623747 1627958 1632793 1638484 1645031 1651959 1658707 1665149 1671549 1678056 1684436 1690328 1695555 1700056
49208 1700056 1703640 1705967 1706755 1705928 1703518 1699526 1693869 1686429 1677062 1665663 1652322 1637394 1621277
49195 1621277 1604059 1585533 1565584 1544441 1522459 1499853 1476835 1453842 1431328 1409400 1387913
49184 1387913 1366900 1346587 1327003 1307901 1289168 1271017 1253607 1236785 1220366 1204424 1189016
49173 1189016 1173927 1158972 1144400 1130612 1117578 1104890 1092320 1080022 1068163 1056733 1045776
49162 1045776 1035518 1026097 1017384 1009218 1001680 994978 989181 984185 979898 976326 973495 971327 969630 968238
49148 968238 967152 966449 966033 965627 965119 964771 964906 965526 966476 967871 970017 972904 976073 979129 982168 985607
49132 985607 989751 994619 999985 1005498 1010929 1016400 1022307 1028918 1036152 1043735 1051414 1058987 1066323 1073483
49118 1073483 1080665 1087940 1095192 1102349 1109491 1116599 1123466 1130026 1136562 1143380 1150410 1157328 1163962 1170348
49104 1170348 1176495 1182370 1188112 1194027 1200306 1206894 1213662 1220581 1227701 1235053 1242627 1250346 1258077 1265716
49090 1265716 1273329 1281176 1289573 1298693 1308423 1318416 1328416 1338499 1348852 1359298 1369279 1378459 1387082
49077 1387082 1395570 1403957 1412023 1419814 1427650 1435646 1443585 1451317 1458941 1466466 1473596 1480092 1486131 1492097
49063 1492097 1498115 1503983 1509425 1514229 1518246 1521513 1524372 1527218 1530103 1532733 1534947 1536962 1539071 1541217
49049 1541217 1543066 1544441 1545529 1546668 1548085 1549893 1552129 1554679 1557214 1559403 1561241 1563078 1565268 1567823
49035 1567823 1570448 1572856 1575016 1577097 1579222 1581328 1583301 1585220 1587374 1589946 1592728 1595256 1597229 1598726
49021 1598726 1600054 1601448 1602955 1604480 1605909 1607246 1608628 1610107 1611490 1612527 1613271 1614005 1614744 1615031 1614456
49006 1614456 1613206 1611824 1610529 1609031 1607028 1604561 1601764 1598525 1594631 1590136 1585328 1580367 1575130 1569470
48992 1569470 1563433 1557113 1550429 1543221 1535526 1527558 1519444 1511181 1502915 1494994 1487599 1480496 1473379 1466349
48978 1466349 1459736 1453599 1447743 1442169 1437112 1432537 1428050 1423511 1419353 1415962 1413089 1410258 1407540 1405458
48964 1405458 1404181 1403275 1402288 1401199 1400230 1399557 1399337 1399686 1400461 1401276 1401896 1402492 1403352 1404541 1405946 1407442 1408823
48947 1408823 1409770 1410135 1410186 1410363 1410803 1411280 1411561 1411621 1411495 1411060 1410085 1408472 1406368 1404041 1401648 1399175 1396597
48930 1396597 1394016 1391537 1389084 1386500 1383825 1381257 1378809 1376188 1373145 1369717 1365982 1361745 1356737 1351039
48916 1351039 1345070 1339138 1333217 1327153 1320903 1314529 1308131 1301851 1295814 1290005 1284315 1278758 1273546 1268854
48902 1268854 1264650 1260813 1257286 1254021 1250881 1247750 1244709 1242020 1239953 1238724 1238490 1239225 1240651 1242496
48888 1242496 1244864 1248182 1252680 1258050 1263757 1269584 1275734 1282475 1289867 1297854 1306450 1315745 1325762 1336373
48874 1336373 1347355 1358540 1369975 1381943 1394739 1408398 1422681 1437307 1452131 1467137 1482387
48863 1482387 1498032 1514235 1531021 1548261 1565858 1583839 1602198 1620818 1639673 1658988 1679034
48852 1679034 1699798 1721059 1742711 1764827 1787418 1810375 1833674 1857475 1881923 1906964 1932474
48841 1932474 1958423 1984807 2011536 2038475 2065504 2092438 2119017 2145100 2170799 2196261 2221384
48830 2221384 2245876 2269551 2292377 2314264 2334986 2354379 2372477 2389338 2404872 2418907 2431327
48819 2431327 2442020 2450796 2457530 2462341 2465470 2466932 2466434 2463721 2458875 2452188 2443868 2433960 2422493 2409514
48805 2409514 2395057 2379227 2362329 2344715 2326426 2307153 2286659 2265107 2242844 2220008 2196537
48794 2196537 2172541 2148407 2124465 2100700 2076897 2052988 2029163 2005710 1982848 1960710 1939341
48783 1939341 1918693 1898668 1879275 1860729 1843273 1826837 1811004 1795495 1780649 1767201 1755460
48772 1755460 1744924 1734853 1725157 1716500 1709583 1704519 1700927 1698406 1696811 1696172 1696496 1697673 1699580 1702315
48758 1702315 1706263 1711810 1718959 1727298 1736342 1745823 1755655 1765820 1776381 1787500 1799311 1811762 1824616
48745 1824616 1837614 1850625 1863744 1877196 1891100 1905357 1919833 1934595 1949758 1965135 1980254
48734 1980254 1994860 2009210 2023768 2038770 2054190 2069937 2085857 2101676 2117201 2132552 2147994
48723 2147994 2163544 2178961 2194121 2209184 2224304 2239389 2254260 2268889 2283269 2297118 2309909
48712 2309909 2321240 2331054 2339463 2346464 2351934 2355823 2358176 2358908 2357679 2354158 2348398 2340784 2331646 2321028
48698 2321028 2308921 2295494 2280963 2265280 2248193 2229621 2209844 2189243 2167997 2146139 2123798
48687 2123798 2101224 2078506 2055448 2031844 2007920 1984317 1961604 1939875 1918916 1898654 1879275
48676 1879275 1860970 1843807 1827860 1813302 1800208 1788455 1777902 1768572 1760550 1753790 1748190 1743745
48664 1743745 1740479 1738280 1736967 1736456 1736729 1737675 1739148 1741181 1743970 1747596 1751949 1756917 1762488 1768607 1775069
48649 1775069 1781691 1788483 1795569 1802981 1810654 1818574 1826829 1835507 1844570 1853841 1863165 1872624 1882627 1893706
48635 1893706 1906157 1919837 1934290 1949085 1964143 1979850 1996795 2015303 2035199 2056074 2077699
48624 2077699 2100072 2123134 2146732 2170864 2195718 2221299 2247218 2273013 2298573 2324021 2349239
48613 2349239 2373715 2396853 2418330 2438114 2456269 2472709 2487048 2498716 2507360 2513143 2516517 2517638
48601 2517638 2516158 2511595 2503819 2493070 2479672 2463831 2445673 2425318 2402915 2378689 2352950 2325958
48589 2325958 2297798 2268431 2237902 2206431 2174321 2141808 2109006 2075945 2042644 2009193 1975779
48578 1975779 1942617 1909858 1877611 1846013 1815217 1785296 1756255 1728134 1701006 1674818 1649314
48567 1649314 1624226 1599494 1575239 1551583 1528580 1506291 1484767 1463966 1443766 1424087 1404936
48556 1404936 1386320 1368279 1350972 1334567 1318967 1303793 1288782 1274092 1260081 1246883 1234376
48545 1234376 1222496 1211322 1200800 1190607 1180473 1170571 1161355 1153010 1145150 1137215 1129147 1121574 1115216
48532 1115216 1110094 1105459 1100563 1095433 1090770 1087168 1084567 1082497 1080622 1078958 1077716 1077118 1077379 1078646
48518 1078646 1080850 1083650 1086629 1089590 1092662 1096164 1100377 1105403 1111118 1117204 1123323 1129372 1135579 1142240
48504 1142240 1149310 1156338 1162887 1168933 1174749 1180447 1185756 1190263 1193783 1196495 1198812 1201182 1203875 1206883
48490 1206883 1210000 1213040 1215937 1218696 1221354 1224041 1226949 1230165 1233565 1236920 1240048 1242821 1245160 1247141
48476 1247141 1249039 1251075 1253146 1254962 1256466 1257961 1259787 1262010 1264491 1267110 1269786 1272382 1274787 1277056
48462 1277056 1279388 1281987 1285051 1288811 1293378 1298568 1304071 1309874 1316320 1323692 1331888 1340671 1350073 1360353
48448 1360353 1371599 1383628 1396253 1409485 1423435 1438220 1454015 1470998 1489049 1507599 1525973
48437 1525973 1543931 1561792 1579992 1598530 1616867 1634315 1650543 1665702 1680097 1693773 1706436
48426 1706436 1717684 1727254 1735071 1741237 1745967 1749471 1751856 1753196 1753624 1753215 1751827 1749234 1745469 1740788
48412 1740788 1735272 1728700 1721003 1712604 1704066 1695502 1686576 1676965 1666627 1655638 1644046 1631888 1619171
48399 1619171 1605822 1591751 1576956 1561442 1545124 1527995 1510309 1492372 1474212 1455771 1437384
48388 1437384 1419690 1402937 1386699 1370489 1354420 1339034 1324684 1311349 1298926 1287412 1276759
48377 1276759 1266764 1257175 1247861 1238908 1230619 1223291 1216959 1211411 1206522 1202389 1199073 1196384 1194133 1192461
48363 1192461 1191652 1191687 1192179 1192734 1193251 1193867 1194825 1196302 1198250 1200373 1202434 1204488 1206683 1208975 1211304 1213919
48347 1213919 1217157 1220852 1224389 1227478 1230505 1233909 1237541 1240960 1244124 1247359 1250723 1253809 1256263 1258211
48333 1258211 1260069 1262110 1264325 1266551 1268583 1270287 1271687 1272908 1274001 1274931 1275776 1276743 1277833 1278631 1278670
48318 1278670 1278008 1277197 1276615 1276015 1274879 1273123 1271236 1269726 1268639 1267693 1266736 1265929 1265548 1265779 1266695 1268242
48302 1268242 1270190 1272203 1274110 1276063 1278294 1280803 1283412 1286126 1289230 1292935 1297051 1301148 1304972 1308556
48288 1308556 1311980 1315251 1318458 1321856 1325655 1329779 1333931 1337791 1341083 1343581 1345287 1346538 1347734 1348931
48274 1348931 1349881 1350458 1350810 1351034 1350963 1350430 1349526 1348390 1346884 1344776 1342156 1339411 1336764 1334061 1331023 1327552
48258 1327552 1323740 1319798 1316011 1312615 1309589 1306705 1303807 1300926 1298069 1295142 1292198 1289571 1287564 1286108
48244 1286108 1284964 1284203 1284212 1285186 1286781 1288436 1289969 1291756 1294337 1297894 1302130 1306582 1310984 1315288 1319453
48229 1319453 1323355 1326892 1330038 1332742 1334877 1336323 1336985 1336641 1334893 1331409 1326187 1319471 1311524 1302522
48215 1302522 1292529 1281394 1268793 1254606 1239248 1223421 1207502 1191350 1174748 1157807 1140853
48204 1140853 1124095 1107549 1091186 1075003 1058999 1043166 1027523 1012108 996991 982318 968273
48193 968273 954932 942194 929882 917887 906218 894977 884276 874082 864125 854102 844034 834339
48181 834339 825420 817274 809533 801870 794237 786815 779793 773198 766873 760675 754699 749226 744391 739989
48167 739989 735725 731574 727763 724405 721280 717991 714272 710198 706151 702543 699448 696498 693234 689566
48153 689566 685786 682190 678778 675384 671954 668581 665337 662161 658972 655798 652690 649515 645969 641923
48139 641923 637641 633555 629818 626267 622771 619391 616105 612678 608983 605279 601969 599178 596772 594651
48125 594651 592826 591291 590082 589340 589100 589040 588770 588342 588212 588688 589640 590781 591945 593075 594218 595630
48109 595630 597558 599837 601978 603819 605776 608263 611127 613903 616439 618990 621821 624950 628172 631133
48095 631133 633532 635477 637474 639843 642288 644292 645817 647314 649158 651380 653887 656555 659113 661256
48081 661256 663016 664761 666746 668890 671038 673168 675214 676978 678403 679812 681622 683928 686527 689254
48067 689254 692146 695309 698735 702290 705842 709415 713239 717538 722284 727195 732011 736649 741159 745718
48053 745718 750764 756932 764669 773932 784354 795683 807976 821466 836410 853140 872076 893367
48041 893367 916115 937808 954858 964257 965148 958898 947817 933873 918417 902486 886974 872558
48029 872558 859699 848647 839370 831592 825117 820065 816611 814548 813304 812399 811768 811601 812024 812982 814335
48014 814335 815954 817762 819731 821835 824022 826212 828340 830416 832571 834986 837698 840432 842778 844573
48000 844573 846033 847465 848936 850263 851184 851439 850853 849493 847667 845619 843279 840456 837187 833724 830199
47985 830199 826477 822348 817724 812637 807189 801530 795750 789723 783243 776359 769397 762583 755750 748597
47971 748597 741113 733583 726195 718832 711284 703525 695685 687839 679893 671675 663061 654069 644908 635880
47957 635880 627126 618450 609496 600147 590658 581362 572348 563533 554930 546656 538708 530893 523007 514951
47943 514951 506725 498473 490568 483403 476985 470908 464853 458959 453528 448547 443711 438849 434070 429499
47929 429499 425173 421183 417719 414802 412145 409406 406546 403816 401487 399633 398097 396565 394754 392692
47915 392692 390772 389419 388655 388132 387550 386885 386173 385266 384085 382995 382567 382842 383101 382603 381389 380079 379001
47898 379001 377897 376531 375166 374201 373579 372865 371757 370268 368456 366309 363920 361512 359177 356756 354079
47883 354079 351230 348427 345724 342950 339981 336965 334229 331942 329943 327948 325942 324214 322995 322162
47869 322162 321439 320766 320357 320401 320835 321413 321899 322210 322488 322980 323775 324666 325395 325987 326691 327644 328765 329975
47851 329975 331290 332623 333717 334417 334896 335446 336106 336608 336645 336107 335123 333984 332955 332023 330831 329023 326639
47834 326639 324103 321738 319463 316999 314278 311524 308953 306537 304103 301584 299097 296844 294939 293305
47820 293305 291700 289927 288121 286765 286298 286667 287340 287797 287974 288238 289017 290414 292122 293689 294916 295976
47804 295976 297074 298095 298817 299447 300638 302813 305659 308448 310749 312660 314496 316433 318406 320191 321597
47789 321597 322659 323551 324252 324480 324104 323400 322685 321892 320829 319672 318800 318172 317326 316021 314514 313074 311626
47772 311626 310049 308497 307122 305761 304228 302769 301856 301525 301243 300519 299475 298643 298300 298137 297652 296806
47756 296806 296121 296038 296293 296142 295169 293655 292106 290706 289379 288178 287352 287077 287261 287631 287892 287872 287550 286993
47738 286993 286268 285476 284855 284632 284771 285014 285255 285666 286364 287160 287817 288398 289189 290383 292013 294074 296509
47721 296509 299179 302033 305202 308754 312463 316055 319612 323448 327602 331761 335706 339572 343521 347451
47707 347451 351219 354959 358925 363078 367061 370610 373798 376801 379605 382130 384499 386920 389201 390660
47693 390660 390777 389816 388540 387326 385877 383864 381516 379326 377399 375407 373088 370501 367794 364986 362073
47678 362073 359185 356523 354209 352207 350343 348416 346402 344536 343110 342165 341463 340737 339894 339049 338470 338430
47662 338430 338944 339672 340244 340694 341432 342781 344688 346927 349393 352119 355150 358533 362358 366636 371151
47647 371151 375502 379359 382650 385473 387864 389701 390892 391562 391941 392030 391562 390353 388545 386388 383956
47632 383956 381277 378596 376183 373892 371208 367822 363950 359983 356085 352289 348792 345858 343490 341430
47618 341430 339517 337848 336526 335400 334252 333158 332471 332377 332655 333036 333678 335038 337269 340000 342798 345637
47602 345637 348758 352247 355960 359709 363324 366672 369860 373309 377342 381732 385943 389752 393288 396496
47588 396496 398997 400626 401744 402766 403636 403987 403656 402781 401566 400218 398985 397973 396978 395737 394289
47573 394289 392901 391627 390200 388407 386380 384425 382714 381244 379980 378922 378033 377166 376115 374738 373022
47558 373022 371041 368877 366640 364490 362540 360680 358616 356137 353251 350047 346558 342867 339212 335792
47544 335792 332524 329128 325439 321535 317531 313405 309081 304616 300183 295873 291525 286863 281821 276649
47530 276649 271617 266684 261659 256592 251760 247204 242639 237975 233627 229990 226831 223600 220258 217373
47516 217373 215352 213923 212533 210972 209429 208141 207180 206474 205893 205366 204977 204903 205184 205668 206183 206645 206961
47499 206961 207051 207077 207419 208256 209303 210190 210973 212013 213401 214775 215745 216309 216778 217419 218233 218953 219212 218841
47481 218841 218041 217170 216338 215358 214149 212946 211937 210844 209172 206847 204358 202187 200330 198480 196504
47466 196504 194509 192547 190528 188434 186381 184404 182356 180154 177933 175817 173715 171556 169608 168266
47452 168266 167496 166797 165827 164776 163984 163446 162951 162521 162383 162556 162817 163056 163376 163768 164006 164027 164189 164911 166183
47433 166183 167608 168786 169506 169698 169494 169273 169347 169568 169458 168775 167754 166735 165825 165006 164384 164027 163716 163106
47415 163106 162158 161184 160426 159775 159024 158265 157849 157944 158285 158420 158210 157980 158206 159062 160324 161660 162933 164209
47397 164209 165537 166827 167966 169000 170118 171442 172876 174231 175449 176661 178013 179539 181204 182933
47383 182933 184513 185640 186222 186625 187401 188737 190288 191587 192494 193247 194216 195654 197554 199615 201422 202728
47367 202728 203619 204422 205534 207292 209785 212765 215903 219213 223055 227608 232512 237203 241484 245594 249803
47352 249803 254138 258422 262439 266088 269539 273186 277244 281408 285117 288162 290869 293612 296342 298631
47338 298631 300093 300674 300654 300412 300132 299646 298582 296699 294080 291044 287961 285084 282454 279880 277104 274021
47322 274021 270768 267608 264765 262262 259900 257440 254882 252461 250318 248326 246345 244501 243049 242045
47308 242045 241392 241050 241003 241119 241359 242009 243340 245056 246490 247428 248370 249815 251676 253636 255715 258075
47292 258075 260502 262505 263902 264949 265855 266446 266416 265721 264596 263259 261655 259521 256681 253323 249892
47277 249892 246713 243753 240792 237687 234412 231001 227545 224155 220804 217346 213816 210554 207830 205463
47263 205463 203027 200408 197898 195773 193980 192261 190428 188433 186342 184342 182675 181481 180720 180289 180132
47248 180132 180198 180317 180259 179949 179595 179530 179852 180274 180417 180196 179836 179550 179389 179411 179739 180321 180839 181036 180990 180902 180799
47227 180799 180643 180608 180907 181377 181502 180948 179885 178791 178091 177994 178436 179054 179426 179448 179415 179659 180199 180892 181774
47208 181774 183064 184785 186560 187895 188708 189486 190835 192890 195245 197458 199496 201624 203983 206441 208788
47193 208788 210974 213118 215352 217676 219926 221916 223590 224968 225987 226568 226901 227428 228386 229493 230284
47178 230284 230607 230641 230555 230403 230227 230008 229584 228876 228155 227767 227602 227122 226008 224490 222982 221688 220704 220207
47160 220207 220268 220614 220847 220832 220775 220939 221433 222154 222918 223656 224592 226100 228322 230968 233554 235779 237696 239648
47142 239648 242090 245265 248913 252399 255302 257787 260298 262971 265521 267656 269408 271017 272598 273994
47128 273994 274930 275259 275075 274573 273860 272931 271764 270369 268758 266975 265204 263715 262640 261857 261106 260232
47112 260232 259314 258633 258490 258951 259787 260731 261753 263006 264563 266413 268674 271554 275051 278884 282819 286942
47096 286942 291441 296323 301448 306726 312112 317483 322674 327603 332257 336585 340472 343819 346598 348870
47082 348870 350761 352344 353539 354201 354363 354253 354061 353753 353179 352237 350926 349322 347577 345834 344112 342365
47066 342365 340607 338840 336892 334575 332067 329874 328306 327215 326332 325594 324964 324199 323084 321799 320816
47051 320816 320501 320930 321926 323050 323742 323725 323265 322878 322907 323488 324687 326403 328230 329693 330574 330826 330329 329017
47033 329017 327134 325035 322807 320349 317753 315262 312867 310297 307425 304351 301057 297389 293421 289532
47019 289532 285971 282639 279431 276476 273865 271428 268998 266666 264570 262622 260688 258835 257170 255613
47005 255613 254097 252827 252066 251705 251361 250888 250548 250667 251310 252364 253717 255261 256870 258437 259887 261116
46989 261116 262020 262665 263338 264336 265687 267141 268434 269544 270670 271964 273363 274694 275947 277292 278832
46974 278832 280422 281819 282956 283982 285056 286220 287505 289068 291084 293517 296069 298467 300767 303285
46960 303285 306247 309566 312973 316226 319168 321711 323949 326178 328643 331278 333835 336218 338567 340990
46946 340990 343403 345676 347832 350048 352545 355512 359035 363005 367118 370945 374075 376333 377961 379456
46932 379456 381040 382401 383145 383384 383594 383979 384357 384663 385114 385694 385915 385370 384298 383281 382580 382068 381625
46915 381625 381257 380938 380651 380544 380754 381119 381348 381486 381889 382776 384067 385734 387910 390524 393115 395263 397060
46898 397060 398916 401034 403249 405326 407218 409055 411039 413313 415796 418154 420053 421444 422547 423551
46884 423551 424484 425356 426242 427139 427816 427974 427529 426669 425650 424643 423781 423167 422782 422481 422196 422046 422134 422354
46866 422354 422569 422905 423610 424597 425427 425851 426160 426814 427909 429227 430677 432392 434401 436488 438456 440359
46850 440359 442360 444489 446663 448880 451294 454077 457229 460538 463739 466710 469475 472017 474197 475912
46836 475912 477239 478315 479116 479464 479216 478369 477053 475518 474026 472606 470982 468930 466667 464683 463198
46821 463198 462008 460919 460092 459828 460206 461100 462471 464469 467277 470887 475024 479240 483211 486948 490681
46806 490681 494504 498269 501845 505312 508802 512255 515486 518390 520961 523216 525206 527066 528944 530934
46792 530934 533147 535726 538667 541716 544598 547292 549938 552565 555120 557738 560698 564048 567467 570618
46778 570618 573517 576418 579473 582663 585960 589337 592562 595223 597111 598525 600048 601956 603963 605540
46764 605540 606401 606596 606308 605746 605206 604983 605096 605263 605234 605086 605089 605432 606171 607354 608984 610936 613087 615519
46746 615519 618450 621938 625796 629814 633952 638308 643017 648169 653705 659402 665106 670938 677078 683347
46732 683347 689225 694380 698909 702959 706334 708727 710172 711015 711469 711447 710804 709571 707893 705919 703772
46717 703772 701501 699023 696246 693280 690451 688038 686052 684252 682313 679997 677328 674621 672237 670270
46703 670270 668509 666754 665010 663358 661788 660237 658721 657294 655935 654579 653237 652042 651248 651180 652036
46688 652036 653605 655284 656559 657477 658539 660150 662321 664873 667749 671067 674974 679522 684593 689884
46674 689884 695048 699926 704608 709236 713837 718374 722858 727318 731693 735869 739784 743392 746577 749227
$$ [...]
##END NTUPLES=NMR SPECTRUM
##END=
