##TITLE=coffee_type CCPA01-ROVE100E_90-10%
COFFEE_meoh_noesyp64 COFFEE_meoh {C:\Bruker\TOPSPIN} Administrator 15
##JCAMPDX= 6.0         $$ Bruker NMR JCAMP-DX V2.0
##DATA TYPE= NMR SPECTRUM
##DATA CLASS= NTUPLES
##ORIGIN= Bruker BioSpin GmbH
##OWNER= Administrator
$$ 1.72 TOPSPIN		Version 2.1
$$ 2012-05-18 15:53:01.792 -0700  Administrator@X
$$ Compression mode = diff/dup
##.OBSERVE FREQUENCY= 400.13188235
##.OBSERVE NUCLEUS= ^1H
##.ACQUISITION MODE= SIMULTANEOUS (DQD)
##.ACQUISITION SCHEME= undefined
##.AVERAGES= 64
##.DIGITISER RES= 22
##SPECTROMETER/DATA SYSTEM= spect
##.PULSE SEQUENCE= noesygpps1d.comp
##.SOLVENT NAME= COFFEE_meoh
##.SHIFT REFERENCE= INTERNAL, COFFEE_meoh, 1, 14.98061
##AUDIT TRAIL= $$ (NUMBER, WHEN, WHO, WHERE, PROCESS, VERSION, WHAT)
$$ ##TITLE= Audit trail, TOPSPIN		Version 2.1
$$ ##JCAMPDX= 5.01
$$ ##ORIGIN= Bruker BioSpin GmbH
$$ ##OWNER= Administrator
$$ $$ C:\Bruker\TOPSPIN/data/Administrator/nmr/12-COFFEE-2502/252/pdata/1/auditp.txt
$$ ##AUDIT TRAIL=  $$ (NUMBER, WHEN, WHO, WHERE, PROCESS, VERSION, WHAT)
(   1,<2012-02-25 22:52:23.047 -0500>,<Administrator>,<TOPSPIN>,<go>,<TOPSPIN 2.1>,
      <created by zg
	started at 2012-02-25 22:40:52.906 -0500,
	POWCHK enabled, PULCHK disabled,
       configuration hash MD5:
       B0 76 FB 9C 50 81 44 7D 18 B3 26 32 4E 60 AD 96
       data hash MD5: 64K
       8F 14 71 B4 FE 36 08 AC B6 E8 C2 B6 71 75 01 46>)
(   2,<2012-02-25 22:52:26.312 -0500>,<Administrator>,<TOPSPIN>,<proc1d>,<TOPSPIN 2.1>,
      <Start of raw data processing
       efp LB = 0.3 FT_mod = 6 PKNL = 1 PHC0 = 0 PHC1 = 0 SI = 128K 
       data hash MD5: 128K
       CC 92 86 C0 7F D8 FE 6D 61 44 46 35 04 26 AA E4>)
(   3,<2012-02-25 22:52:27.578 -0500>,<Administrator>,<TOPSPIN>,<proc1d>,<TOPSPIN 2.1>,
      <pk PHC0 = 24.57642 PHC1 = 0 
       data hash MD5: 128K
       1F 65 62 54 62 DF 77 2B 76 3B 0B C6 8A 3A 0B C5>)
(   4,<2012-02-25 22:52:28.000 -0500>,<Administrator>,<TOPSPIN>,<proc1d>,<TOPSPIN 2.1>,
      <abs ABSG = 1 
       data hash MD5: 128K
       D7 EE C2 AD 89 BB C3 AC 2E DF D1 4D 84 6C 92 A1>)
(   5,<2012-02-25 22:52:28.094 -0500>,<Administrator>,<TOPSPIN>,<proc1d>,<TOPSPIN 2.1>,
      <abs ABSG = 2 
       data hash MD5: 128K
       84 89 07 00 1C C1 06 65 C0 DB 01 C2 A9 12 2F 7B>)
(   6,<2012-02-25 22:52:28.156 -0500>,<Administrator>,<TOPSPIN>,<proc1d>,<TOPSPIN 2.1>,
      <abs ABSG = 3 
       data hash MD5: 128K
       1C 83 13 63 DF 7F A8 25 3D D0 58 8E 1E 72 9E 76>)
(   7,<2012-02-25 22:52:28.219 -0500>,<Administrator>,<TOPSPIN>,<proc1d>,<TOPSPIN 2.1>,
      <abs ABSG = 4 
       data hash MD5: 128K
       92 F0 8D 98 14 00 81 57 71 83 8B 95 4E CD 49 67>)
(   8,<2012-02-25 22:52:28.266 -0500>,<Administrator>,<TOPSPIN>,<proc1d>,<TOPSPIN 2.1>,
      <abs ABSG = 5 
       data hash MD5: 128K
       4F 61 C8 85 DF C4 56 BA ED EB B8 A0 25 FD C3 58>)
(   9,<2012-02-25 22:52:28.391 -0500>,<Administrator>,<TOPSPIN>,<audit>,<TOPSPIN 2.1>,
      <user comment:
       ICON-NMR User ID: Administrator
$$ [...]
150 150 150 150 150 150 150 150
##$TP07= 0
##$TPNAME0= <>
##$TPNAME1= <>
##$TPNAME2= <>
##$TPNAME3= <>
##$TPNAME4= <>
##$TPNAME5= <>
##$TPNAME6= <>
##$TPNAME7= <>
##$TPOAL= (0..7)
0.5 0.5 0.5 0.5 0.5 0.5 0.5 0.5
##$TPOFFS= (0..7)
0 0 0 0 0 0 0 0
##$TUNHIN= 0
##$TUNHOUT= 0
##$TUNXOUT= 0
##$USERA1= <user>
##$USERA2= <user>
##$USERA3= <user>
##$USERA4= <user>
##$USERA5= <user>
##$V9= 5
##$VALIST= <valist>
##$VCLIST= <CCCCCCCCCCCCCCC>
##$VD= 0
##$VDLIST= <DDDDDDDDDDDDDDD>
##$VPLIST= <PPPPPPPPPPPPPPP>
##$VTLIST= <TTTTTTTTTTTTTTT>
##$WBST= 1024
##$WBSW= 4
##$XGAIN= (0..3)
0 0 0 0
##$XL= 0
##$YL= 0
##$YMAX_a= 13205771
##$YMIN_a= -6119318
##$ZGOPTNS= <>
##$ZL1= 120
##$ZL2= 120
##$ZL3= 120
##$ZL4= 120
##$ABSF1= 14.98061
##$ABSF2= -5.57192
##$ABSG= 5
##$ABSL= 3
##$ALPHA= 0
##$AQORDER= 0
##$ASSFAC= 0
##$ASSFACI= 0
##$ASSFACX= 0
##$ASSWID= 0
##$AUNMP= <proc_prof1d_extract>
##$AXLEFT= 0
##$AXNAME= <>
##$AXNUC= <1H>
##$AXRIGHT= 0
##$AXTYPE= 0
##$AXUNIT= <>
##$AZFE= 0.1
##$AZFW= 0.1
##$BCFW= 0
##$BC_mod= 0
##$BYTORDP= 0
##$COROFFS= 0
##$CY= 15
##$DATMOD= 1
##$DC= 0
##$DFILT= <>
##$DTYPP= 0
##$F1P= 0
##$F2P= 0
##$FCOR= 0.5
##$FTSIZE= 131072
##$FT_mod= 6
##$GAMMA= 0
##$GB= 0
##$INTBC= 1
##$INTSCL= 1
##$ISEN= 128
##$LB= 0.3
##$LEV0= 0
##$LPBIN= 0
##$MAXI= 10000
##$MC2= 0
##$MEAN= 0
##$ME_mod= 0
##$MI= 0
##$NCOEF= 0
##$NC_proc= -3
##$NLEV= 6
##$NOISF1= 0
##$NOISF2= 0
##$NSP= 0
##$NTH_PI= 0
##$NZP= 0
##$OFFSET= 14.98061
##$PC= 1
##$PHC0= 24.57642
##$PHC1= 0
##$PH_mod= 1
##$PKNL= yes
##$PPARMOD= 0
##$PPDIAG= 0
##$PPIPTYP= 0
##$PPMPNUM= 2147483647
##$PPRESOL= 1
##$PSCAL= 4
##$PSIGN= 0
##$PYNMP= <proc.py>
##$REVERSE= no
##$SF= 400.13
##$SI= 131072
##$SIGF1= 0
##$SIGF2= 0
##$SINO= 400
##$SIOLD= 131072
##$SPECTYP= <>
##$SREGLST= <1H.CDCl3>
##$SSB= 0
##$STSI= 131072
##$STSR= 0
##$SW_p= 8223.68421052632
##$SYMM= 0
##$S_DEV= 0
##$TDeff= 65536
##$TDoff= 0
##$TI= <>
##$TILT= no
##$TM1= 0
##$TM2= 0
##$TOPLEV= 0
##$USERP1= <user>
##$USERP2= <user>
##$USERP3= <user>
##$USERP4= <user>
##$USERP5= <user>
##$WDW= 1
##$XDIM= 131072
##$YMAX_p= 500793795
##$YMIN_p= -358308947
##$CURPLOT= <Network HP LaserJet P1505>
##$CURPRIN= <$Network HP LaserJet P1505>
##$DFORMAT= <normdp>
##$LAYOUT= <+/1D_H.xwp>
##$LFORMAT= <normlp>
##$PFORMAT= <normpl>
##$SURQMSG= 1
$$ End of Bruker specific parameters
$$ ---------------------------------
##NTUPLES= NMR SPECTRUM
##VAR_NAME=  FREQUENCY,     SPECTRUM/REAL,   SPECTRUM/IMAG
##SYMBOL=    X,             R,               I
##VAR_TYPE=  INDEPENDENT,   DEPENDENT,       DEPENDENT
##VAR_FORM=  AFFN,          ASDF,            ASDF
##VAR_DIM=   131072,        131072,          131072
##UNITS=     HZ,            ARBITRARY UNITS, ARBITRARY UNITS
##FACTOR=    0.0627417313425165, 1,          1
##FIRST=     8223.62146879498, 534,          -90486
##LAST=      0,             4354,            -91387
##MIN=       0,             -358308947,      0
##MAX=       8223.62146879498, 500793795,    0
$$ Real data points
##PAGE= N=1
##DATA TABLE= (X++(R..R)), XYDATA
$$ [...]
$$ plain form
62984 2157920 2214095 2270330 2325622 2379179 2431326 2482873 2533908 2583957 2633064 2681850 2730631
62973 2730631 2779359 2828358 2878015 2927347 2973802 3015152 3051046 3082137 3108172 3127671 3139175
62962 3139175 3141941 3135435 3118877 3091771 3054667 3009180 2957376 2901189 2842212 2781857 2721577 2662851
62950 2662851 2606922 2554786 2507673 2467320 2435292 2411847 2395704 2385237 2379808 2379962 2386576 2400103
62938 2400103 2420420 2446788 2477723 2511242 2545802 2581168 2618175 2657506 2698718 2740327 2780613
62927 2780613 2818412 2853481 2886283 2917106 2945110 2968382 2985161 2994786 2997297 2992506 2979910 2959156
62915 2959156 2929765 2890490 2839897 2778173 2707819 2631972 2552296 2468894 2381967 2292994 2204304
62904 2204304 2117879 2034645 1954744 1878431 1806623 1740292 1679392 1622933 1570309 1521912 1478023
$$ packed form
62984B157920N6175N6235N5292N3557N2147N1547N1035N0049M9107M8786M8781
62973B730631M8728M8999M9657M9332M6455M1350L5894L1091K6035J9499J1504
62962C139175K766o506j6558k7106l7104m5487n1804n6187n8977o0355o0280n8726
62950B662851n5929n2136m7113m0353l2028k3445j6143j0467n429J54O614J3527
62938B400103K0317K6368L0935L3519L4560L5366L7007L9331M1212M1609M0286
62927B780613L7799L5069L2802L0823K8004K3272J6779R625K511m791j2596k0754
62915B959156k9391l9275n0593o1724p0354p5847p9676q3402q6927q8973q8690
62904B204304q6425q3234p9901p6313p1808o6331o0900n6459n2624m8397m3889
$$ plain form
62893 1478023 1437851 1400410 1365855 1334984 1307704 1282954 1259996 1238783 1219037 1200007 1181317
62882 1181317 1163149 1145408 1127710 1110445 1094762 1080965 1067943 1054731 1041630 1029050 1016378
62871 1016378 1003013 989582 976981 964964 952965 941671 932272 924477 916761 908487 900349 892699
62859 892699 884908 876636 868385 860406 852307 844249 837302 832002 827546 823056 818664 814767 811160 807666
62845 807666 804691 802413 800288 798182 797058 797527 798540 798672 798133 798226 799245 800173 800321 800072 799939 799855 799560
62828 799560 798952 797994 796847 796047 795906 795893 795188 793630 791453 788543 784937 781760 780475 781216 782873 784814
62812 784814 787293 790104 792146 792764 792392 791403 789474 786735 784322 782825 781065 777578 772736 768293 765107
62797 765107 762304 758557 753479 747849 743164 740742 740590 741247 741339 741081 741586 742962 744042 743985 743172 742249 741251
$$ packed form
62893A478023m0172l7441l4555l0871k7280k4750k2958k1213j9746j9030j8690
62882A181317j8168j7741j7698j7265j5683j3797j3022j3212j3101j2580j2672
62871A016378j3365j3431j2601j2017j1999j1294r399p795p716q274q138p650
62859H92699p791q272q251p979q099q058o947n300m456m490m392l897l607l494
62845H07666k975k278k125k106j124M69J013J32n39R3J019R28J48k49j33q4k95
62828G99560o08r58j147q00j41j3p05j558k177k910l606l177j285P41J657J941
62812G84814K479K811K042O18l72r89j929k739k413j497j760l487m842m443l186
62797G65107k803l747n078n630m685k422j52O57R2k58N05J376J080n7q13r23r98
$$ plain form
62780 741251 740214 739927 741264 744117 747618 751261 755134 759075 762216 763711 763663 763107 763182 764300 765904 766927
62764 766927 766762 765903 765473 765977 766842 767395 767919 769354 772180 776084 780435 784386 786754 786874 785873 786103
62748 786103 788703 792439 795616 798368 802107 807307 813083 818816 824969 832085 839982 848380 857644 868515
62734 868515 881464 896550 913605 932565 953955 978736 1006986 1037055 1067075 1097395 1130503
62723 1130503 1168245 1210105 1254672 1301760 1352355 1407229 1466548 1530443 1599204 1672906 1751224
62712 1751224 1833544 1919115 2007317 2097635 2188873 2278535 2363836 2443277 2516191 2580704 2633553
62701 2633553 2672529 2697764 2709791 2707641 2690065 2657648 2612322 2555483 2487965 2411395 2328286
62690 2328286 2241011 2151676 2062352 1974131 1886381 1798449 1711901 1629678 1553146 1481466 1413866
$$ packed form
62780G41251j037k87J337K853L501L643L873L941L141J495m8n56P5J118J604J023
62764G66927j65q59m30N04Q65N53N24J435K826L904M351L951K368J20j001K30
62748G86103K600L736L177K752L739N200N776N733O153P116P897Q398R264J0871
62734H68515J2949J5086J7055J8960K1390K4781K8250L0069L0020L0320L3108
62723A130503L7742M1860M4567M7088N0595N4874N9319O3895O8761P3702P8318
62712A751224Q2320Q5571Q8202R0318R1238Q9662Q5301P9441P2914O4513N2849
62701B633553L8976K5235J2027k150j7576l2417m5326n6839o7518p6570q3109
62690B328286q7275q9335q9324q8221q7750q7932q6548q2223p6532p1680o7600
$$ plain form
62679 1413866 1350941 1293327 1240610 1192230 1148328 1108939 1073174 1039912 1008810 980282 954998
62668 954998 933564 916044 901637 889372 879055 870837 864167 858252 853387 850495 849371 848857 849016
62655 849016 851471 857062 864727 873441 883708 896122 910017 924924 942151 963386 988524 1016211
62643 1016211 1045722 1076976 1109658 1144075 1182338 1226789 1277387 1332246 1390713 1454253 1524026
62632 1524026 1599126 1677800 1759174 1843087 1928966 2015358 2099991 2180156 2253769 2320216 2379343
62621 2379343 2429497 2467510 2490934 2499569 2494486 2476428 2445512 2401726 2345206 2276710 2198374 2113534
62609 2113534 2025427 1936302 1847682 1760536 1674942 1590549 1508008 1429285 1356033 1288427 1226120
62598 1226120 1169391 1118354 1071779 1028016 986868 949455 916241 886222 858182 831808 807210
$$ packed form
62679A413866o2925n7614n2717m8380m3902l9389l5765l3262l1102k8528k5284
62668I54998k1434j7520j4407j2265j0317q218o670n915m865k892j124n14J59
62655H49016K455N591P665Q714J0267J2414J3895J4907J7227K1235K5138K7687
62643A016211K9511L1254L2682L4417L8263M4451N0598N4859N8467O3540O9773
62632A524026P5100P8674Q1374Q3913Q5879Q6392Q4633Q0165P3613O6447N9127
62621B379343N0154L8013K3424Q635n083j8058l0916m3786n6520o8496p8336q4840
62609B113534q8107q9125q8620q7146q5594q4393q2541p8723p3252o7606o2307
62598A226120n6729n1037m6575m3763m1148l7413l3214l0019k8040k6374k4598
$$ plain form
62587 807210 784234 762844 743710 727718 714874 703890 692838 680285 666230 652175 639974
62576 639974 630307 622390 615226 608644 602741 596837 589884 581987 574620 568891 564306 559920 556143 554255
62562 554255 554243 554402 553546 552590 553150 555356 558054 560647 563675 567756 573033 579662 587809 597002 606420 616090
62546 616090 626984 639640 653532 668072 683300 699164 715082 730951 747808 766745 787874
62535 787874 811106 837165 866792 899571 934740 972702 1014404 1059311 1105381 1151254 1197301
62524 1197301 1244099 1290884 1336011 1378073 1415903 1448141 1473559 1491534 1501730 1503595 1496675 1481273
62512 1481273 1458465 1429531 1395475 1357001 1314957 1270972 1227332 1185539 1145009 1104000 1062074
62501 1062074 1020930 982509 947192 914447 884348 857416 833458 811629 791502 773105 756021
$$ packed form
62587H07210k2976k1390j9134j5992j2844j0984j1052j2553j4055j4055j2201
62576F39974r667p917p164o582n903n904o953p897p367n729m585m386l777j888
62562E54255j2J59q56r56N60K206K698K593L028M081N277O629Q147R193R418R670
62546F16090J0894J2656J3892J4540J5228J5864J5918J5869J6857J8937K1129
62535G87874K3232K6059K9627L2779L5169L7962M1702M4907M6070M5873M6047
62524A197301M6798M6785M5127M2062L7830L2238K5418J7975J0196J865o920j5402
62512A481273k2808k8934l4056l8474m2044m3985m3640m1793m0530m1009m1926
62501A062074m1144l8421l5317l2745l0099k6932k3958k1829k0127j8397j7084
$$ plain form
62490 756021 739452 723402 708869 696450 685515 675209 665595 657130 649478 641697 633487 625483 618188
62477 618188 611305 604601 598929 595638 594874 595152 595034 594931 596655 601325 608300 616321 624959 634463 644754
62462 644754 655463 666893 680087 695623 712926 731196 750586 771961 795761 821707 849714
62451 849714 880465 914716 952253 991987 1033079 1075652 1120163 1166297 1212801 1258398 1302495
62440 1302495 1344690 1383811 1417853 1445041 1464739 1477141 1482206 1479239 1467602 1447605 1420428 1387290
62428 1387290 1349036 1306671 1262009 1217371 1174455 1133607 1094275 1056250 1020430 988158 959690
62417 959690 933655 908550 884661 863697 846280 830774 815313 800162 786863 775569 764720
62406 764720 753443 742736 733809 726551 720410 715626 712618 710999 710287 710926 713564 717788 722576 727516
$$ packed form
62490G56021j6569j6050j4533j2419j0935j0306r614q465p652p781q210q004p295
62477F18188o883o704n672l291p64K78j18j03J724M670O975Q021Q638R504J0291
62462F44754J0709J1430J3194J5536J7303J8270J9390K1375K3800K5946K8007
62451H49714L0751L4251L7537L9734M1092M2573M4511M6134M6504M5597M4097
62440A302495M2195L9121L4042K7188J9698J2402N065k967j1637j9997k7177l3138
62428A387290l8254m2365m4662m4638m2916m0848l9332l8025l5820l2272k8468
62417I59690k6035k5105k3889k0964j7417j5506j5461j5151j3299j1294j0849
62406G64720j1277j0707q927p258o141m784l008j619p12O39K638M224M788M940
$$ plain form
62392 727516 732627 737532 742036 747136 754092 762579 770958 778358 785269 792015 797898 802167 804795 805997
62378 805997 805811 804274 801182 795844 788090 779243 770615 761291 749370 735565 723282 714305 706556 697386
62364 697386 687052 677369 668863 661368 655904 653393 652411 650695 648450 647819 649446 651958 654790 658991
62350 658991 664719 670320 674909 680038 687754 698350 710880 724480 738273 751235 763173 774912
62338 774912 786829 798301 809302 821211 834905 849086 861596 871664 879980 887383 894418 901352
62326 901352 907657 912168 914638 916339 918278 919880 920579 921642 924892 930389 937060 945098 956068 970813
62312 970813 988877 1009822 1033542 1059386 1086811 1117215 1153495 1197069 1246706 1300830 1359610
62301 1359610 1423977 1493774 1567894 1645482 1726081 1809262 1894727 1982005 2069115 2152076 2226669
$$ packed form
62392G27516N111M905M504N100O956Q487Q379P400O911O746N883M269K628J202
62378H05997j86j537l092n338p754q847q628r324j1921j3805j2283q977p749r170
62364F97386j0334r683q506p495n464k511r82j716k245o31J627K512K832M201
62350F58991N728N601M589N129P716J0596J2530J3600J3793J2962J1938J1739
62338G74912J1917J1472J1001J1909J3694J4181J2510J0068Q316P403P035O934
62326I01352O305M511K470J701J939J602O99J063L250N497O671Q038J0970J4745
62312I70813J8064K0945K3720K5844K7425L0404L6280M3574M9637N4124N8780
62301A359610O4367O9797P4120P7588Q0599Q3181Q5465Q7278Q7110Q2961P4593
$$ plain form
62290 2226669 2290493 2342871 2383451 2411765 2427766 2431842 2424325 2405470 2375716 2335493 2285249 2226337
62278 2226337 2161451 2093233 2022626 1949544 1875093 1802024 1732615 1666929 1603768 1542759 1484900
62267 1484900 1431472 1383055 1339433 1299665 1262234 1225961 1191358 1160587 1135264 1114300 1094616
62256 1094616 1074359 1054826 1038788 1027412 1019569 1013759 1009547 1006994 1005768 1005521 1006456 1008745 1011728
62243 1011728 1014395 1016398 1017949 1018832 1018254 1015780 1011916 1007665 1003810 1000580 997554 993889 989185 984362
62229 984362 981256 981149 983945 988885 995549 1003714 1012620 1021111 1028719 1036308 1045286 1056166 1068078 1079852
62215 1079852 1091482 1104263 1119428 1136968 1156047 1176300 1198248 1222669 1250154 1281329 1316767
62204 1316767 1356394 1399608 1446482 1498289 1556124 1619371 1686335 1756180 1829263 1905497 1983505
$$ packed form
62290B226669O3824N2378M0580K8314J6001M076p517j8855k9754m0223n0244n8912
62278B226337o4886o8218p0607p3082p4451p3069o9409o5686o3161o1009n7859
62267A484900n3428m8417m3622l9768l7431l6273l4603l0771k5323k0964j9684
62256A094616k0257j9533j6038j1376p843n810m212k553j226k47R35K289K983
62243A011728K667K003J551Q83n78k474l864m251l855l230l026l665m704m823
62229I84362l106j07K796M940O664Q165Q906Q491P608P589Q978J0880J1912J1774
62215A079852J1630J2781J5165J7540J9079K0253K1948K4421K7485L1175L5438
62204A316767L9627M3214M6874N1807N7835O3247O6964O9845P3083P6234P8008
$$ plain form
62193 1983505 2061899 2140190 2217195 2289077 2350459 2397869 2431308 2452330 2461648 2459173 2445291 2420918
62181 2420918 2386621 2342855 2291047 2233376 2171097 2104040 2032529 1959263 1888338 1822348 1761090
62170 1761090 1703259 1648828 1599290 1555795 1517721 1483308 1451452 1422502 1397407 1376517 1359382
62159 1359382 1345276 1333490 1323380 1314793 1308491 1305532 1305913 1308210 1310844 1313368 1316225 1319682 1323551
62146 1323551 1327652 1331945 1336229 1340359 1344850 1350750 1358764 1368854 1380794 1394583 1410029 1426536 1443892
62133 1443892 1462977 1485110 1510722 1539059 1569132 1600460 1632932 1666499 1701306 1737639 1775343
62122 1775343 1813431 1850643 1886262 1920109 1951912 1981181 2007899 2033045 2058110 2084149 2111496
62111 2111496 2140415 2171851 2207366 2248269 2294733 2345696 2399561 2454952 2510966 2566918 2621887
$$ packed form
62193A983505P8394P8291P7005P1882O1382M7410L3439K1022R318k475j3882k4373
62181B420918l4297m3766n1808n7671o2279o7057p1511p3266p0925o5990o1258
62170A761090n7831n4431m9538m3495l8074l4413l1856k8950k5095k0890j7135
62159A359382j4106j1786j0110q587o302k959L81K297K634K524K857L457L869
62146A323551M101M293M284M130M491N900Q014J0090J1940J3789J5446J6507J7356
62133A443892J9085K2133K5612K8337L0073L1328L2472L3567L4807L6333L7704
62122A775343L8088L7212L5619L3847L1803K9269K6718K5146K5065K6039K7347
62111B111496K8919L1436L5515M0903M6464N0963N3865N5391N6014N5952N4969
$$ plain form
62100 2621887 2674277 2721696 2761540 2792138 2813475 2826723 2833103 2833255 2827407 2815630 2797923 2774553
62088 2774553 2746610 2715918 2684176 2652305 2620674 2589525 2558998 2529313 2501459 2477380 2458820
62077 2458820 2445977 2437633 2432375 2429255 2427619 2427187 2428397 2431973 2437933 2445606 2454730 2465766 2478805
62064 2478805 2492986 2507632 2523451 2541853 2563408 2587612 2613911 2642245 2672644 2705016 2739391
62053 2739391 2775879 2814287 2854227 2895591 2938488 2982661 3027448 3072481 3118066 3164800 3213232
62042 3213232 3263997 3317741 3374571 3433883 3495028 3557916 3622835 3690046 3759906 3833071 3909916
62031 3909916 3989582 4069821 4148047 4222686 4293670 4361912 4428575 4495037 4563248 4635308 4712016
62020 4712016 4791971 4872551 4951669 5028251 5101597 5171530 5239333 5307286 5376525 5446140 5515209
$$ packed form
62100B621887N2390M7419L9844L0598K1337J3248O380J52n848j1777j7707k3370
62088B774553k7943l0692l1742l1871l1631l1149l0527k9685k7854k4079j8560
62077B458820j2843q344n258l120j636m32J210L576N960P673R124J1036J3039
62064B478805J4181J4646J5819J8402K1555K4204K6299K8334L0399L2372L4375
62053B739391L6488L8408L9940M1364M2897M4173M4787M5033M5585M6734M8432
62042C213232N0765N3744N6830N9312O1145O2888O4919O7211O9860P3165P6845
62031C909916P9666Q0239P8226P4639P0984O8242O6663O6462O8211P2060P6708
62020D712016P9955Q0580P9118P6582P3346O9933O7803O7953O9239O9615O9069
$$ plain form
62009 5515209 5585045 5658281 5736005 5816829 5898623 5980081 6060511 6139314 6216257 6291317 6363421
61998 6363421 6429889 6487975 6536816 6577405 6610956 6637982 6658754 6673750 6683275 6687033 6684357 6674777
61986 6674777 6658505 6636721 6611468 6584780 6557614 6529783 6501123 6472412 6444888 6418996 6393964
61975 6393964 6368712 6342992 6317661 6293996 6272792 6253897 6236376 6219060 6201108 6182285 6162891
61964 6162891 6143484 6124548 6106325 6088866 6072251 6056652 6042141 6028442 6015108 6002127 5990334
61953 5990334 5980966 5974579 5970569 5968006 5966883 5968148 5972358 5978716 5985794 5992951 6000494 6008585 6016647 6024091
61939 6024091 6030959 6037327 6042461 6045137 6044582 6040407 6031722 6017097 5995657 5967491 5932687 5890732 5841738
61926 5841738 5787855 5732452 5677685 5623402 5568444 5512301 5455220 5397419 5338953 5280204 5222038
$$ packed form
62009E515209O9836P3236P7724Q0824Q1794Q1458Q0430P8803P6943P5060P2104
61998F363421O6468N8086M8841M0589L3551K7026K0772J4996R525L758k676r580
61986F674777j6272k1784k5253k6688k7166k7831k8660k8711k7524k5892k5032
61975F393964k5252k5720k5331k3665k1204j8895j7521j7316j7952j8823j9394
61964F162891j9407j8936j8223j7459j6615j5599j4511j3699j3334j2981j1793
61953E990334r368o387m010k563j123J265M210O358P078P157P543Q091Q062P444
61939F024091O868O368N134K676n55m175q685j4625k1440k8166l4804m1955m8994
61926E841738n3883n5403n4767n4283n4958n6143n7081n7801n8466n8749n8166
$$ plain form
61915 5222038 5165440 5111081 5058974 5008316 4957981 4907614 4858069 4810426 4764810 4720615 4677666
61904 4677666 4636446 4597237 4559673 4523350 4488254 4454367 4421455 4389674 4359745 4332013 4305811
61893 4305811 4280593 4257403 4238293 4224104 4213555 4204782 4197265 4191999 4190351 4193196 4200659 4212071
61881 4212071 4226283 4242530 4261011 4282363 4306711 4333558 4362359 4392672 4423948 4456041 4490164
61870 4490164 4528491 4572104 4619747 4669334 4720414 4774255 4831637 4891733 4953867 5019557 5091842
61859 5091842 5172854 5263063 5362976 5474584 5600565 5742686 5901798 6079226 6277442 6499163
61849 6499163 6746230 7019647 7320429 7650123 8010642 8403927 8831864 9296263 9798509
61840 9798509 10338865 10915914 11526447 12165541 12826119 13497687 14164741 14805634 15392693
$$ packed form
61915E222038n6598n4359n2107n0658n0335n0367m9545m7643m5616m4195m2949
61904D677666m1220l9209l7564l6323l5096l3887l2912l1781k9929k7732k6202
61893D305811k5218k3190j9110j4189j0549q773p517n266j648K845P463J1412
61881D212071J4212J6247J8481K1352K4348K6847K8801L0313L1276L2093L4123
61870D490164L8327M3613M7643M9587N1080N3841N7382O0096O2134O5690P2285
61859E091842Q1012R0209R9913J11608J25981J42121J59112J77428J98216K21721
61849F499163K47067K73417L00782L29694L60519L93285M27937M64399N02246
61840I798509N40356N77049O10533O39094O60578O71568O67054O40893N87059
$$ plain form
61831 15392693 15894195 16278380 16518531 16597303 16508823 16258609 15862121 15342350 14726557 14042874
61821 14042874 13317828 12575070 11834597 11111994 10418145 9759890 9141237 8564278 8029606
61812 8029606 7536763 7084938 6673242 6300019 5962013 5654903 5375239 5121660 4893785
61803 4893785 4690079 4507468 4343083 4195648 4064829 3949853 3849324 3761870 3686327 3621540
61793 3621540 3566610 3521120 3484520 3455484 3432553 3415149 3403086 3395100 3388870 3382727 3376456 3370003
61781 3370003 3362209 3351497 3337264 3320123 3301256 3282117 3264311 3248987 3236273 3225591 3216429 3208840
61769 3208840 3203724 3202783 3207374 3216973 3229362 3242740 3256783 3271077 3283804 3293277 3299854 3304677 3307078
61756 3307078 3305298 3299820 3293958 3290529 3289719 3291178 3296484 3307990 3326380 3351096 3382524 3422066 3470225
$$ packed form
61831A5392693N01502L84185K40151P8772q8480k50214l96488n19771o15793o83683
61821A4042874p25046p42758p40473p22603o93849o58255o18653n76959n34672
61812H029606m92843m51825m11696l73223l38006l07110k79664k53579k27875
61803D893785k03706j82611j64385j47435j30819j14976j00529q7454p5543o4787
61793C621540n4930m5490l6600k9036k2931j7404j2063p986o230o143o271o453
61781C370003p794j0712j4233j7141j8867j9139j7806j5324j2714j0682r162p589
61769C208840n116r41M591R599J2389J3378J4043J4294J2727R473O577M823K401
61756C307078j780n478n862l429q10J459N306J1506J8390K4716L1428L9542M8159
$$ plain form
61743 3470225 3526243 3589779 3661634 3742478 3832048 3930103 4037153 4153693 4279756 4416096
61733 4416096 4565001 4728655 4906933 5097949 5300938 5517669 5750775 6001762 6271576
61724 6271576 6562562 6878729 7224018 7601128 8012220 8459967 8947477 9478015 10055673
61715 10055673 10685862 11374106 12124304 12938938 13820770 14772980 15796795 16889476 18044729
61706 18044729 19253494 20502094 21768537 23020481 24216173 25306628 26237981 26955583
61698 26955583 27411285 27572213 27427054 26987086 26282417 25356127 24258653 23042710 21758026
61689 21758026 20446558 19140546 17864320 16637314 15474714 14385711 13372880 12434807
61681 12434807 11569771 10776754 10053536 9395149 8795090 8247794 7749348 7296098 6883627
$$ packed form
61743C470225N6018O3536P1855Q0844Q9570R8055J07050J16540J26063J36340
61733D416096J48905J63654J78278J91016K02989K16731K33106K50987K69814
61724F271576K90986L16167L45289L77110M11092M47747M87510N30538N77658
61715A0055673O30189O88244P50198Q14634Q81832R52210J023815J092681J155253
61706A8044729J208765J248600J266443J251944J195692J090455R31353P17602
61698B6955583M55702J60928j45159m39968p04669r26290j097474j215943j284684
61689B1758026j311468j306012j276226j227006j162600j089003j012831r38073
61681A2434807q65036p93017p23218o58387o00059n47296m98446m53250m12471
$$ plain form
61672 6883627 6507662 6165254 5854140 5571133 5312207 5074536 4857636 4661781 4485558
61663 4485558 4325498 4177894 4040336 3911594 3790668 3676334 3567338 3462770 3362233
61654 3362233 3265794 3173680 3085955 3002428 2922770 2846735 2774373 2706061 2642106 2582259 2525766
61643 2525766 2471946 2420519 2371360 2324354 2279628 2237529 2198049 2160566 2124490 2089911 2057211
61632 2057211 2026240 1996247 1966510 1936772 1907295 1878829 1852265 1827817 1804626 1781584 1758469
61621 1758469 1736042 1715277 1696785 1680570 1665865 1651650 1637991 1626374 1617886 1611463 1605118 1598693
61609 1598693 1593996 1591923 1590771 1587962 1582238 1573474 1561515 1546508 1529700 1512668 1495968 1479491
61597 1479491 1463864 1450344 1439268 1429591 1420293 1411596 1404482 1399528 1396511 1394858 1394302 1395276 1398568 1404219
$$ packed form
61672F883627l75965l42408l11114k83007k58926k37671k16900j95855j76223
61663D485558j60060j47604j37558j28742j20926j14334j08996j04568j00537
61654C362233r6439r2114q7725q3527p9658p6035p2362o8312o3955n9847n6493
61643B525766n3820n1427m9159m7006m4726m2099l9480l7483l6076l4579l2700
61632B057211l0971k9993k9737k9738k9477k8466k6564k4448k3191k3042k3115
61621A758469k2427k0765j8492j6215j4705j4215j3659j1617q488o423o345o425
61609A598693m697k073j152k809n724q764j1959j5007j6808j7032j6700j6477
61597A479491j5627j3520j1076r677r298q697p114m954l017j653n56R74L292N651
$$ plain form
61583 1404219 1410838 1416533 1420720 1424526 1429149 1434172 1437939 1439488 1439716 1440531 1443033 1446736 1450475 1453731
61569 1453731 1456877 1460462 1464745 1469799 1475427 1480936 1485626 1489709 1494011 1498353 1500911 1499853 1495053 1487508
61555 1487508 1477728 1465831 1452803 1440253 1428499 1415822 1400215 1381443 1361237 1341922 1325005
61544 1325005 1310577 1297815 1286216 1276091 1267458 1259121 1249999 1241131 1234824 1231561 1229279 1226345 1223775
61531 1223775 1223356 1224870 1226734 1228621 1231739 1236739 1242937 1249756 1257689 1267549 1279687 1294195 1310926
61518 1310926 1329138 1347974 1367524 1388654 1411712 1436398 1463073 1492963 1526520 1562616 1600129
61507 1600129 1639432 1681535 1726589 1774181 1824156 1875710 1926057 1971627 2010958 2045438 2077009
61496 2077009 2106245 2133042 2157968 2181808 2204305 2224565 2242843 2260892 2279903 2298627 2314382
$$ packed form
61583A404219O619N695M187L806M623N023L767J549K28Q15K502L703L739L256
61569A453731L146L585M283N054N628N509M690M083M302M342K558j058m800p545
61555A487508r780j1897j3028j2550j1754j2677j5607j8772k0206j9315j6917
61544A325005j4428j2762j1599j0125q633q337r122q868o307l263k282k934k570
61531A223775m19J514J864J887L118N000O198O819P933R860J2138J4508J6731
61518A310926J8212J8836J9550K1130K3058K4686K6675K9890L3557L6096L7513
61507A600129L9303M2103M5054M7592M9975N1554N0347M5570L9331L4480L1571
61496B077009K9236K6797K4926K3840K2497K0260J8278J8049J9011J8724J5755
$$ plain form
61485 2314382 2325991 2334924 2343101 2350307 2354773 2355924 2355177 2353618 2350266 2343629 2334060 2323290 2312229
61472 2312229 2300734 2289441 2280076 2273451 2268490 2264186 2261642 2263258 2270536 2283610 2302432 2327294 2358214
61459 2358214 2394704 2436415 2483597 2536970 2597593 2666708 2745100 2832522 2928302 3032677 3147068
61448 3147068 3272990 3411270 3562506 3727688 3907902 4103705 4315255 4542685 4785678
61439 4785678 5042554 5310142 5584591 5861788 6136652 6402174 6649518 6869220 7052577
61430 7052577 7192674 7285201 7328905 7325231 7277301 7189285 7066625 6916210 6745528 6561355
61420 6561355 6369362 6174708 5982341 5796434 5619897 5454808 5303125 5166577 5045832
61411 5045832 4940120 4848079 4769168 4704185 4654193 4619020 4597238 4587670 4590235 4604815 4629987
$$ packed form
61485B314382J1609Q933Q177P206M466J151p47j559l352o637r569j0770j1061
61472B312229j1495j1293r365o625m961m304k544J616P278J3074J8822K4862L0920
61459B358214L6490M1711M7182N3373O0623O9115P8392Q7422R5780J04375J14391
61448C147068J25922J38280J51236J65182J80214J95803K11550K27430K42993
61439D785678K56876K67588K74449K77197K74864K65522K47344K19702J83357
61430G052577J40097R2527M3704l674m7930q8016j22660j50415j70682j84173
61420F561355j91993j94654j92367j85907j76537j65089j51683j36548j20745
61411E045832j05712r2041p8911o4983m9992l5173k1782r568K565J4580K5172
$$ plain form
61400 4629987 4663890 4706027 4756970 4816221 4881619 4951241 5024596 5101211 5179179 5256348 5332246
61389 5332246 5407600 5482400 5555674 5626962 5696775 5765523 5832959 5898779 5962774 6024214 6082025
61378 6082025 6135807 6185843 6231790 6272233 6305968 6333061 6354280 6370174 6381223 6388225 6391887 6392340
61366 6392340 6389447 6383190 6373334 6359204 6340369 6317395 6291489 6263505 6233565 6201555 6167829 6133576
61354 6133576 6100585 6070425 6043706 6020192 5999294 5980121 5961437 5942508 5923992 5907074 5891529
61343 5891529 5875448 5857164 5836637 5814686 5791858 5768662 5746141 5725654 5708729 5697574 5694751
61332 5694751 5701617 5717957 5743939 5781614 5833656 5901586 5986363 6089720 6213354 6357333 6520874
61321 6520874 6704315 6908723 7133676 7377001 7636606 7910816 8196522 8488603 8781535
$$ packed form
61400D629987L3903M2137N0943N9251O5398O9622P3355P6615P7968P7169P5898
61389E332246P5354P4800P3274P1288O9813O8748O7436O5820O3995O1440N7811
61378F082025N3782N0036M5947M0443L3735K7093K1219J5894J1049P002L662M53
61366F392340k893o257r856j4130j8835k2974k5906k7984k9940l2010l3726l4253
61354F133576l2991l0160k6719k3514k0898j9173j8684j8929j8516j6918j5545
61343E891529j6081j8284k0527k1951k2828k3196k2521k0487j6925j1155k823
61332E694751O866J6340K5982L7675N2042O7930Q4777J03357J23634J43979J63541
61321F520874J83441K04408K24953K43325K59605K74210K85706K92081K92932
$$ plain form
61312 8781535 9069859 9346145 9600095 9821065 10001033 10134701 10218204 10249264 10228215 10157837
61302 10157837 10042476 9887807 9700480 9486516 9250041 8994236 8723268 8442523 8157302
61293 8157302 7871987 7590079 7314094 7045682 6786746 6540188 6308542 6091915 5888404
61284 5888404 5696824 5518160 5354119 5205208 5070830 4950639 4845060 4754676 4679520 4618882
61274 4618882 4571545 4536330 4512506 4499570 4496818 4503613 4520062 4546672 4582840 4626091 4673373 4722957
61262 4722957 4774682 4828559 4883711 4938797 4992961 5045970 5097392 5145930 5189859 5228280 5261806
61251 5261806 5291688 5318185 5340123 5356287 5366855 5373000 5375235 5372784 5364686 5350848 5331559 5306457
61239 5306457 5274693 5236074 5191364 5141329 5086161 5026299 4963360 4899541 4836086 4772837 4709524
$$ packed form
61312H781535K88324K76286K53950K20970J79968J33668Q3503L1060k1049p0378
61302A0157837j15361j54669j87327k13964k36475k55805k70968k80745k85221
61293H157302k85315k81908k75985k68412k58936k46558k31646k16627k03511
61284E888404j91580j78664j64041j48911j34378j20191j05579r0384p5156o0638
61274D618882m7337l5215k3824j2936k752O795J6449K6610L6168M3251M7282M9584
61262D722957N1725N3877N5152N5086N4164N3009N1422M8538M3929L8421L3526
61251E261806K9882K6497K1938J6164J0568O145K235k451q098j3838j9289k5102
61239E306457l1764l8619m4710n0035n5168n9862o2939o3819o3455o3249o3313
$$ plain form
61228 4709524 4647205 4588222 4534749 4487333 4444703 4405052 4367665 4333278 4302828 4276165 4252362
61217 4252362 4230993 4212420 4196713 4182883 4169445 4155312 4139861 4122699 4103964 4084594 4065828
61206 4065828 4048528 4033372 4021476 4014231 4012539 4016553 4026054 4040441 4058461 4078853 4101725 4128792
61194 4128792 4161765 4201042 4246703 4300314 4364597 4440962 4528223 4624258 4728224 4840204 4958866
61183 4958866 5080221 5198716 5308841 5405551 5483891 5538872 5565668 5560152 5520101 5446502 5343237
61172 5343237 5215023 5066155 4901597 4728196 4553152 4381142 4213844 4052118 3897344
61163 3897344 3750417 3610986 3478835 3355249 3242045 3139761 3047658 2964948 2890924 2824170
61153 2824170 2762957 2706742 2656475 2613127 2576596 2546282 2522011 2503830 2491252 2483219 2478744 2477417
$$ packed form
61228D709524o2319n8983n3473m7416m2630l9651l7387l4387l0450k6663k3803
61217D252362k1369j8573j5707j3830j3438j4133j5451j7162j8735j9370j8766
61206D065828j7300j5156j1896p245j692M014R501J4387J8020K0392K2872K7067
61194D128792L2973L9277M5661N3611O4283P6365Q7261R6035J03966J11980J18662
61183D958866J21355J18495J10125R6710P8340N4981K6796n516m0051p3599j03265
61172E343237j28214j48868j64558j73401j75044j72010j67298j61726j54774
61163C897344j46927j39431j32151j23586j13204j02284r2103q2710p4024o6754
61153B824170o1213n6215n0267m3348l6531l0314k4271j8181j2578q033m475j327
$$ plain form
61141 2477417 2479460 2485515 2496200 2511598 2530972 2552837 2575278 2596552 2615843 2633286 2648828 2661225
61129 2661225 2668810 2671365 2670487 2667690 2662693 2654160 2641711 2626389 2609169 2589725 2566939 2540226 2510035
61116 2510035 2477296 2442803 2407136 2370836 2334316 2297521 2259837 2220587 2179679 2137670 2095164
61105 2095164 2052339 2009165 1965868 1922897 1880527 1838881 1798460 1760316 1725364 1693589 1664180
61094 1664180 1636461 1610508 1586897 1566061 1547995 1532209 1517703 1503002 1486585 1467476 1445495
61083 1445495 1421118 1395287 1369281 1344402 1321442 1300364 1280502 1261184 1242383 1224950 1210127
61072 1210127 1198610 1190151 1184196 1180760 1180362 1183173 1188605 1195807 1204244 1213710 1224175 1235804 1248841
61059 1248841 1263211 1278409 1293937 1309634 1325487 1341409 1357355 1373275 1388704 1402826 1415421
$$ packed form
61141B477417K043O055J0685J5398J9374K1865K2441K1274J9291J7443J5542J2397
61129B661225P585K555q78k797m997q533j2449j5322j7220j9444k2786k6713l0191
61116B510035l2739l4493l5667l6300l6520l6795l7684l9250m0908m2009m2506
61105B095164m2825m3174m3297m2971m2370m1646m0421l8144l4952l1775k9409
61094A664180k7719k5953k3611k0836j8066j5786j4506j4701j6417j9109k1981
61083A445495k4377k5831k6006k4879k2960k1078j9862j9318j8801j7433j4823
61072A210127j1517q459n955l436l98K811N432P202Q437R466J0465J1629J3037
61059A248841J4370J5198J5528J5697J5853J5922J5946J5920J5429J4122J2595
$$ plain form
61048 1415421 1427403 1439889 1452846 1465119 1475674 1484164 1490214 1492707 1490268 1482377 1469903 1454662
61036 1454662 1438505 1422645 1407614 1393666 1381005 1369520 1358546 1347191 1334962 1322048 1309121
61025 1309121 1296930 1285824 1275469 1265264 1255269 1246428 1239503 1234036 1228840 1223364 1218089 1213539 1209406
61012 1209406 1204857 1199398 1193246 1186976 1180975 1175349 1170526 1167795 1168623 1173021 1179071 1184589 1188963 1192838
60998 1192838 1196545 1199827 1202839 1206180 1209714 1212517 1214563 1217515 1223077 1231161 1240423 1249994 1259857 1270011
60984 1270011 1280425 1291771 1305205 1321148 1339006 1358326 1379468 1402694 1427337 1452619 1478891
60973 1478891 1507218 1537843 1569942 1603054 1637945 1675612 1716148 1759314 1805670 1856187 1910866
60962 1910866 1968645 2028790 2091644 2157897 2227956 2302220 2381099 2464323 2551085 2641428 2736790
$$ packed form
61048A415421J1982J2486J2957J2273J0555Q490O050K493k439p891j2474j5241
61036A454662j6157j5860j5031j3948j2661j1485j0974j1355j2229j2914j2927
61025A309121j2191j1106j0355j0205r995q841o925n467n196n476n275m550m133
61012A209406m549n459o152o270o001n626m823k731Q28M398O050N518M374L875
60998A192838L707L282L012L341L534K803K046K952N562Q084R262R571R863J0154
60984A270011J0414J1346J3434J5943J7858J9320K1142K3226K4643K5282K6272
60973A478891K8327L0625L2099L3112L4891L7667M0536M3166M6356N0517N4679
60962A910866N7779O0145O2854O6253P0059P4264P8879Q3224Q6762R0343R5362
$$ plain form
60951 2736790 2838666 2947479 3063295 3186688 3318042 3457050 3604176 3761875 3932873
60942 3932873 4117530 4314143 4521576 4740485 4972525 5220069 5486521 5775290 6088318
60933 6088318 6426951 6794121 7194181 7630832 8107217 8628397 9202309 9838853 10550510
60924 10550510 11353807 12266930 13304866 14479551 15805744 17304238 18999609 20920259
60916 20920259 23102866 25590826 28422676 31621865 35187882 39061826 43057978 46823744
60908 46823744 49917819 52004418 53028988 53231170 52995417 52677457 52520356 52638660 52987731
60899 52987731 53319000 53216695 52267345 50268937 47321593 43741560 39890863 36054570
60891 36054570 32411985 29059152 26033758 23333804 20937544 18819416 16954046 15314430
$$ packed form
60951B736790J01876J08813J15816J23393J31354J39008J47126J57699J70998
60942C932873J84657J96613K07433K18909K32040K47544K66452K88769L13028
60933F088318L38633L67170M00060M36651M76385N21180N73912O36544P11657
60924A0550510Q03297R13123J037936J174685J326193J498494J695371J920650
60916B0920259K182607K487960K831850L199189L566017L873944L996152L765766
60908D6823744L094075K086599J024570K02182k35753l17960j57101J18304L49071
60899E2987731L31269j02305r49350j998408k947344l580033l850697l836293
60891C6054570l642585l352833l025394k699954k396260k118128j865370j639616
$$ plain form
60883 15314430 13874238 12612219 11511356 10554356 9722390 8997136 8361359 7798239 7293144
60874 7293144 6836296 6421761 6043939 5696995 5377525 5085298 4820522 4581567 4365326
60865 4365326 4167992 3985084 3812325 3647339 3489570 3338519 3193421 3054722 2923943
60856 2923943 2801276 2684871 2573441 2468204 2371107 2282304 2200517 2124695 2053821 1986078
60846 1986078 1920130 1857043 1799328 1747981 1701709 1658908 1618904 1581114 1544746 1510065 1478590
60835 1478590 1450993 1425829 1401414 1378027 1357034 1338600 1321748 1306166 1292280 1279667 1267276
60824 1267276 1255564 1246500 1240606 1235602 1229212 1221828 1214830 1207691 1198955 1189293 1180874 1173514 1164004 1150230
60810 1150230 1134068 1118913 1105875 1093791 1081656 1069270 1056330 1042764 1029841 1019386 1011670
$$ packed form
60883A5314430j440192j262019j100863r57000q31966p25254o35777n63120n05095
60874G293144m56848m14535l77822l46944l19470k92227k64776k38955k16241
60865D365326j97334j82908j72759j64986j57769j51051j45098j38699j30779
60856B923943j22667j16405j11430j05237r7097q8803q1787p5822p0874o7743
60846A986078o5948o3087n7715n1347m6272m2801m0004l7790l6368l4681l1475
60835A478590k7597k5164k4415k3387k0993j8434j6852j5582j3886j2613j2391
60824A267276j1712r064n894n004o390p384o998p139q736r662q419p360r510j3774
60810A150230j6162j5155j3038j2084j2135j2386j2940j3566j2923j0455p716
$$ plain form
60799 1011670 1005255 999180 994328 992321 993753 997756 1002781 1007623 1012236 1017726 1025290 1035192 1047032 1060631
60785 1060631 1076039 1092966 1111122 1131053 1153662 1178501 1203227 1225199 1243313 1258078 1270403
60774 1270403 1280763 1289381 1296767 1303805 1311214 1318955 1326372 1332784 1337508 1339402 1337405 1332090 1325835 1320590
60760 1320590 1316044 1310854 1304948 1299337 1294199 1288806 1283242 1278443 1274207 1268789 1261155 1252179 1242776 1232267
60746 1232267 1219830 1206485 1194155 1183369 1173215 1163108 1153262 1143591 1133499 1123003 1113168 1105210
60734 1105210 1099769 1096935 1096234 1096668 1097692 1100224 1105775 1114350 1124047 1133089 1141530 1150618 1161302 1173921
60720 1173921 1188606 1204961 1221581 1236737 1249721 1261217 1272500 1284662 1298333 1313278 1328097
60709 1328097 1341083 1351836 1361586 1371464 1380949 1388774 1395102 1401825 1410372 1419969 1428570 1435003 1439646
$$ packed form
60799A011670o415o075m852k007J432M003N025M842M613N490P564R902J1840J3599
60785A060631J5408J6927J8156J9931K2609K4839K4726K1972J8114J4765J2325
60774A270403J0360Q618P386P038P409P741P417O412M724J894j997n315o255n245
60760A320590m546n190n906n611n138n393n564m799m236n418p634q976r403j0509
60746A232267j2437j3345j2330j0786j0154j0107r846r671j0092j0496r835p958
60734A105210n441k834p01M34J024K532N551Q575R697R042Q441R088J0684J2619
60720A173921J4685J6355J6620J5156J2984J1496J1283J2162J3671J4945J4819
60709A328097J2986J0753R750R878R485P825O328O723Q547R597Q601O433M643
$$ plain form
60696 1439646 1443442 1447076 1451000 1455397 1459814 1463359 1465497 1466339 1466014 1464414 1461918 1459854 1459540 1460830 1461954
60681 1461954 1460880 1456703 1449893 1441547 1432561 1423329 1414001 1404758 1395759 1387048 1378832 1371681 1365933 1360754
60667 1360754 1354385 1345764 1335723 1326150 1318034 1310649 1302773 1294491 1287564 1283831 1283242 1283638 1282630 1279444
60653 1279444 1274762 1269204 1262701 1255235 1247276 1239222 1231129 1223465 1217444 1213930 1212375 1211468 1210522 1209585 1208426
60638 1208426 1206254 1202573 1197706 1192264 1186583 1180959 1175985 1172111 1168823 1164590 1157847 1148097 1136063 1122847
60624 1122847 1109128 1095170 1081220 1067428 1053521 1039219 1025106 1012490 1001965 992508 982491
60613 982491 971403 960217 950267 942175 935739 930475 926315 923996 924533 927914 932495 936297 938933 941864
60599 941864 946616 953137 960139 966764 973477 981230 990135 999393 1008544 1018242 1029334 1041493 1053461
$$ packed form
60696A439646L796L634L924M397M417L545K138Q42l25j600k496k064l14J290J124
60681A461954j074m177o810q346q986r232r328r243q999q711q216p151n748n179
60667A360754o369q621j0041r573q116p385p876q282o927l733n89L96j008l186
60653A279444m682n558o503p466p959q054q093p664o021l514j555r07r46r37j159
60638A208426k172l681m867n442n681n624m974l874l288m233o743r750j2034j3216
60624A122847j3719j3958j3950j3792j3907j4302j4113j2616j0525r457j0017
60613I82491j1088j1186r950q092o436n264m160k319N37L381M581L802K636K931
60599I41864M752O521P002O625O713P753Q905R258R151R698J1092J2159J1968
$$ plain form
60586 1053461 1064627 1075624 1087103 1098573 1108946 1117835 1125881 1134006 1142580 1151028 1158134 1163284 1167675
60573 1167675 1173715 1182795 1194228 1206774 1220406 1235743 1252411 1269127 1285307 1301637 1318980 1337321
60561 1337321 1355741 1372867 1387538 1399678 1410368 1420386 1428915 1434479 1436958 1437690 1437523 1435800 1431584
60548 1431584 1425087 1417505 1410040 1403502 1398277 1394176 1390453 1386180 1380518 1372856 1363239 1352653 1342311
60535 1342311 1332546 1322740 1312297 1301198 1289800 1278781 1269184 1261731 1256012 1251008 1246450 1243035 1241379
60522 1241379 1241668 1244289 1249713 1257409 1265775 1273572 1280709 1287398 1293482 1298903 1303913 1308344 1311642 1314177
60508 1314177 1317531 1322744 1329062 1335153 1340775 1346387 1351879 1356662 1360463 1363123 1363958 1362310 1358487 1353516
60494 1353516 1348311 1343732 1340876 1340354 1341591 1343672 1346655 1351220 1357437 1364924 1374129 1386445 1402972 1423897
$$ packed form
60586A053461J1166J0997J1479J1470J0373Q889Q046Q125Q574Q448P106N150M391
60573A167675O040R080J1433J2546J3632J5337J6668J6716J6180J6330J7343J8341
60561A337321J8420J7126J4671J2140J0690J0018Q529N564K479P32j67j723m216
60548A431584o497p582p465o538n225m101l723m273n662p662r617j0586j0342
60535A342311r765r806j0443j1099j1398j1019r597p453n719n004m558l415j656
60522A241379K89K621N424P696Q366P797P137O689O084N421N010M431L298K535
60508A314177L354N213O318O091N622N612N492M783L801K660Q35j648l823m971
60494A353516n205m579k856n22J237K081K983M565O217P487R205J2316J6527K0925
$$ plain form
60480 1423897 1449038 1478202 1511038 1547491 1588634 1636165 1690559 1750062 1811641 1872443 1930156
60469 1930156 1982571 2027336 2062150 2085151 2095293 2092662 2078639 2056045 2028868 2001157 1975835
60458 1975835 1954860 1940271 1933848 1935346 1942442 1953521 1969448 1991197 2016730 2042255 2066307 2090604
60446 2090604 2116739 2144185 2172450 2203385 2239909 2283395 2333592 2390443 2454771 2527628 2610182
60435 2610182 2704199 2811671 2933779 3070826 3223299 3392446 3579446 3784237 4005448 4241767
60425 4241767 4493587 4763447 5054852 5370844 5713669 6084877 6484229 6907356 7343742
60416 7343742 7775936 8179923 8527333 8790122 8945879 8980707 8889497 8676297 8355374 7950152
60406 7950152 7488557 6997569 6500121 6013919 5550717 5116657 4714415 4345265 4009224
$$ packed form
60480A423897K5141K9164L2836L6453M1143M7531N4394N9503O1579O0802N7713
60469A930156N2415M4765L4814K3001J0142k631j4023k2594k7177k7711k5322
60458A975835k0975j4589o423J498P096J1079J5927K1749K5533K5525K4052K4297
60446B090604K6135K7446K8265L0935L6524M3486N0197N6851O4328P2857Q2554
60435B610182R4017J07472J22108J37047J52473J69147J87000K04791K21211K36319
60425D241767K51820K69860K91405L15992L42825L71208L99352M23127M36386
60416G343742M32194M03987L47410K62789J55757L4828r1210k13200l20923m05222
60406G950152m61595m90988m97448m86202m63202m34060m02242l69150l36041
$$ plain form
60397 4009224 3704581 3428897 3180491 2958146 2759746 2582271 2423110 2280577 2153362
60388 2153362 2040353 1940818 1853634 1776362 1706272 1642526 1586198 1537671 1495060 1455869 1419269
60377 1419269 1385788 1355462 1327450 1301254 1277165 1255231 1234591 1214299 1194337 1175327 1157436
60366 1157436 1140009 1122424 1105091 1089401 1076595 1066677 1058441 1050501 1042293 1034186 1026867 1020722 1015767
60353 1015767 1012032 1009827 1009463 1010645 1012316 1013267 1012997 1012035 1011583 1012802 1016033 1020373 1024275 1027024 1029603
60338 1029603 1033620 1039405 1045600 1050734 1054684 1058332 1062432 1067326 1073335 1080575 1088392 1095676 1101941 1107513
60324 1107513 1112502 1116270 1118449 1119957 1122115 1124859 1126597 1126109 1123947 1121563 1119454 1116739 1112510 1107116
60310 1107116 1101987 1098403 1096492 1095303 1093756 1091666 1089916 1089624 1091106 1093583 1095940 1097855 1100312 1104784
$$ packed form
60397D009224l04643k75684k48406k22345j98400j77475j59161j42533j27215
60388B153362j13009r9535q7184p7272p0090o3746n6328m8527m2611l9191l6600
60377A419269l3481l0326k8012k6196k4089k1934k0640k0292j9962j9010j7891
60366A157436j7427j7585j7333j5690j2806r918q236p940q208q107p319o145m955
60353A015767l735k205l64J182J671R51k70r62m52J219L231M340L902K749K579
60338A029603M017N785O195N134L950L648M100M894O009P240P817P284O265N572
60324A107513M989L768K179J508K158K744J738m88k162k384k109k715m229n394
60310A107116n129l584j911j189j547k090j750k92J482K477K357J915K457M472
$$ plain form
60296 1104784 1111594 1119192 1125456 1129761 1133311 1137492 1142644 1148774 1156479 1166156 1176799 1186789 1195860 1205228
60282 1205228 1215625 1226295 1236327 1245887 1255282 1263680 1269824 1273643 1276080 1277477 1277207 1275025 1271885
60269 1271885 1269119 1267678 1268539 1272852 1280683 1290046 1298259 1304284 1308974 1313013 1315633 1315850 1314064 1311553
60255 1311553 1308713 1304767 1299193 1292674 1286318 1280503 1274817 1268771 1262250 1255539 1249171 1243622 1238993 1235180
60241 1235180 1232284 1230524 1229760 1229521 1229462 1229255 1228209 1226019 1224008 1224289 1226917 1229083 1228327 1225670 1224118 1224698
60225 1224698 1225674 1225534 1224926 1225259 1226938 1229744 1233834 1239561 1246971 1256049 1266809 1278765 1291074 1303635
60211 1303635 1317277 1332381 1347999 1362797 1376293 1388918 1401664 1415968 1432908 1451980 1471603
60200 1471603 1491381 1512752 1536785 1562687 1589651 1618992 1652920 1691869 1734550 1780095 1828594
$$ packed form
60296A104784O810P598O264M305L550M181N152O130P705R677J0643R990R071R368
60282A205228J0397J0670J0032R560R395Q398O144L819K437J397k70k182l140
60269A271885k766j441Q61M313P831R363Q213O025M690M039K620K17j786k511
60255A311553k840l946n574o519o356n815n686o046o521o711o368n549m629l813
60241A235180k896j760p64k39n9k07j046k190k011K81K628K166p56k657j552N80
60225A224698R76j40o08L33J679K806M090N727P410R078J0760J1956J2309J2561
60211A303635J3642J5104J5618J4798J3496J2625J2746J4304J6940J9072J9623
60200A471603J9778K1371K4033K5902K6964K9341L3928L8949M2681M5545M8499
$$ plain form
60189 1828594 1879849 1933299 1989392 2049725 2115461 2186556 2262737 2344444 2432765 2529143 2634864
60178 2634864 2749768 2871617 2997932 3128548 3265286 3409055 3558418 3711037 3865058
60169 3865058 4018546 4168783 4312972 4448866 4574225 4686568 4784134 4866490 4933680 4985443
60159 4985443 5021633 5042708 5049305 5042107 5022674 4993804 4958596 4919763 4880175 4843127 4811369 4786519
60147 4786519 4770052 4764067 4770309 4789149 4820375 4864396 4921797 4992234 5074814 5169281 5275886
60136 5275886 5394339 5523688 5662802 5809830 5961107 6111563 6256494 6392399 6516248
60127 6516248 6625004 6716230 6788491 6840619 6871032 6878316 6862484 6825513 6770503 6700252 6616676
60116 6616676 6521880 6419774 6316043 6216189 6123944 6041678 5971468 5914953 5872852 5845684 5834672
$$ packed form
60189A828594N1255N3450N6093O0333O5736P1095P6181Q1707Q8321R6378J05721
60178B634864J14904J21849J26315J30616J36738J43769J49363J52619J54021
60169C865058J53488J50237J44189J35894J25359J12343R7566Q2356O7190N1763
60159D985443L6190K1075O597p198j9433k8870l5208l8833l9588l7048l1758k4850
60147D786519j6467n985O242J8840L1226M4021N7401P0437Q2580R4467J06605
60136E275886J18453J29349J39114J47028J51277J50456J44931J35905J23849
60127F516248J08756R1226P2261N2128L0413P284j5832l6971n5010p0251q3576
60116F616676r4796j02106j03731r9854r2245q2266p0210n6515m2101k7168j1012
$$ plain form
60105 5834672 5840903 5863769 5901340 5952399 6016998 6094738 6183325 6279123 6378259 6476866 6571208
60094 6571208 6658341 6736152 6802417 6854608 6891462 6914156 6925241 6926840 6920716 6909577 6897029 6886040
60082 6886040 6878546 6877034 6885720 6909308 6950853 7011549 7092571 7196369 7325704 7481807 7664144
60071 7664144 7872086 8106420 8368966 8661020 8982426 9332034 9708596 10111012 10537685
60062 10537685 10985572 11449769 11924144 12402496 12878835 13346419 13796981 14221541 14611899
60053 14611899 14960935 15261801 15507829 15693539 15815065 15869342 15853737 15767305 15612147 15393139
60043 15393139 15116714 14790493 14423604 14026395 13609647 13184391 12762031 12353417 11967205
60034 11967205 11609484 11285055 10998307 10752420 10548423 10385762 10263467 10180054 10132574 10116776
$$ packed form
60105E834672O231K2866L7571N1059O4599P7740Q8587R5798R9136R8607R4342
60094F571208Q7133P7811O6265N2191L6854K2694J1085J599o124j1139j2548j0989
60082F886040p494j512Q686K3588M1545O0696Q1022J03798J29335J56103J82337
60071G664144K07942K34334K62546K92054L21406L49608L76562M02416M26673
60062A0537685M47887M64197M74375M78352M76339M67584M50562M24560L90358
60053A4611899L49036L00866K46028J85710J21526N4277j5605q6432j55158k19008
60043A5393139k76425l26221l66889l97209m16748m25256m22360m08614l86212
60034A1967205l57721l24429k86748k45887k03997j62661j22295q3413m7480j5798
$$ plain form
60024 10116776 10128496 10164235 10219967 10289919 10367170 10445319 10519177 10584068 10635251 10668415 10680546
60013 10680546 10670253 10637551 10583531 10509890 10418288 10310000 10186092 10047635 9895547 9730448
60003 9730448 9553072 9364898 9168271 8966125 8761884 8559427 8362458 8173534 7993950
59994 7993950 7824867 7668551 7528341 7407443 7307725 7229515 7172389 7136167 7121141 7127400 7154264
59983 7154264 7200795 7266753 7352433 7457182 7578363 7711906 7853530 7999068 8143944 8282950
59973 8282950 8410758 8522586 8614591 8683961 8728657 8746986 8737677 8700563 8636781 8547838 8434884
59962 8434884 8299665 8146088 7979952 7806903 7631347 7457588 7290895 7136277 6996355
59953 6996355 6871325 6761267 6667979 6594417 6542821 6513714 6506405 6520035 6554018 6607935 6681572
$$ packed form
60024A0116776J1720L5739N5732O9952P7251P8149P3858O4891N1183L3164J2131
60013A0680546j0293l2702n4020p3641r1602j08288j23908j38457j52088j65099
60003I730448j77376j88174j96627k02146k04241k02457j96969j88924j79584
59994G993950j69083j56316j40210j20898r9718p8210n7126l6222j5026O259K6864
59983G154264M6531O5958Q5680J04749J21181J33543J41624J45538J44876J39006
59973H282950J27808J11828R2005O9370M4696J8329r309l7114o3782q8943j12954
59962H434884j35219j53577j66136j73049j75556j73759j66693j54618j39922
59953F996355j25030j10058r3288p3562n1596k9107p309J3630L3983N3917P3637
$$ plain form
59942 6681572 6775378 6890524 7027829 7186305 7363060 7554783 7758876 7972737 8192160 8410903
59932 8410903 8621763 8817913 8993669 9144795 9268324 9361838 9422956 9449864 9442266 9401285
59922 9401285 9328463 9225441 9094936 8941633 8771803 8592150 8409108 8228797 8057138 7899740
59912 7899740 7761327 7644829 7551078 7479924 7431901 7408408 7410110 7435765 7483063 7550303 7636776
59901 7636776 7741794 7863830 8000452 8148606 8304955 8466205 8629086 8789993 8945202
59892 8945202 9092006 9229425 9357277 9474810 9580997 9676095 9761948 9840466 9912626 9979708
59882 9979708 10045086 10114034 10191769 10282213 10388622 10514886 10665783 10846140 11059875 11309689
59872 11309689 11597196 11922924 12285886 12683063 13109364 13558167 14021850 14491505 14955918
$$ packed form
59942F681572R3806J15146J37305J58476J76755J91723K04093K13861K19423K18743
59932H410903K10860J96150J75756J51126J23529R3514O1118K6908p598m0981
59922I401285p2822j03022j30505j53303j69830j79653j83042j80311j71659j57398
59912G899740j38413j16498r3751p1154m8023k3493J702K5655M7298O7240Q6473
59901G636776J05018J22036J36622J48154J56349J61250J62881J60907J55209
59892H945202J46804J37419J27852J17533J06187R5098Q5853P8518P2160O7082
59882I979708O5378O8948P7735R0444J06409J26264J50897J80357K13735K49814
59872A1309689K87507L25728L62962L97177M26301M48803M63683M69655M64413
$$ plain form
59863 14955918 15400854 15809725 16165595 16453259 16660156 16776372 16795023 16713742 16536239 16272279
59853 16272279 15935636 15541424 15104554 14639705 14161505 13683595 13217059 12769915 12348314
59844 12348314 11957894 11603708 11289307 11016575 10786350 10598561 10451976 10344852 10276280
59835 10276280 10246220 10253900 10296869 10371874 10475612 10603726 10750024 10908015 11072684 11239120
59825 11239120 11399232 11541305 11653521 11727139 11756008 11734609 11658320 11525553 11338641 11102562
59815 11102562 10823570 10509129 10168093 9809728 9442149 9071746 8704155 8345382 8001425
59806 8001425 7676526 7372083 7087742 6823588 6580955 6361200 6164389 5989660 5836390
59797 5836390 5704163 5591403 5494799 5410795 5337591 5275027 5222341 5176739 5134674 5094092 5054682
$$ packed form
59863A4955918M44936M08871L55870K87664K06897J16216J8651q1281j77503k63960
59853A6272279l36643l94212m36870m64849m78200m77910m66536m47144m21601
59844A2348314l90420l54186l14401k72732k30225j87789j46585j07124o8572
59835A0276280l0060P680M2969P5005J03738J28114J46298J57991J64669J66436
59825A1239120J60112J42073J12216P3618K8869k1399p6289j32767j86912k36079
59815A1102562k78992l14441l41036l58365l67579l70403l67591l58773l43957
59806H001425l24899l04443k84341k64154k42633k19755j96811j74729j53270
59797E836390j32227j12760r6604q4004p3204o2564n2686m5602m2065m0582l9410
$$ plain form
59786 5054682 5016377 4978835 4942411 4908286 4876959 4847656 4819959 4794836 4772758 4751534 4727486
59775 4727486 4698420 4664113 4624337 4578326 4526618 4471782 4416563 4362356 4310085 4261317 4217524
59764 4217524 4179110 4146178 4119668 4100744 4089207 4083129 4079907 4077576 4075886 4076815 4083607 4098705 4122741
59751 4122741 4155397 4196140 4243595 4295393 4349782 4406812 4467116 4530351 4595973 4664617 4736817
59740 4736817 4810421 4880981 4945231 5002976 5055132 5101380 5140864 5174382 5204440 5233108 5260915
59729 5260915 5288439 5318437 5355445 5403029 5461940 5531481 5612326 5707295 5819681 5951869 6105600
59718 6105600 6282259 6482274 6705480 6953034 7228049 7533137 7868120 8231264 8621661
59709 8621661 9038161 9475462 9922049 10361085 10771181 11126518 11399922 11569779 11626176 11572135
$$ packed form
59786E054682l8305l7542l6424l4125l1327k9303k7697k5123k2078k1224k4048
59775D727486k9066l4307l9776m6011n1708n4836n5219n4207n2271m8768m3793
59764D217524l8414l2932k6510j8924j1537o078l222k331j690R29O792J5098K4036
59751D122741L2656M0743M7455N1798N4389N7030O0304O3235O5622O8644P2200
59740D736817P3604P0560O4250N7745N2156M6248L9484L3518L0058K8668K7807
59729E260915K7524K9998L7008M7584N8911O9541Q0845R4969J12386J32188J53731
59718F105600J76659K00015K23206K47554K75015L05088L34983L63144L90397
59709H621661M16500M37301M46587M39036M10096L55337K73404J69857N6397n4041
$$ plain form
59699 11572135 11421071 11193386 10912876 10602826 10283230 9970029 9674961 9405214 9164186
59690 9164186 8953788 8775987 8632127 8521987 8444579 8399220 8385032 8400134 8442521 8511478
59680 8511478 8607225 8729500 8877428 9050503 9248771 9472308 9721559 9998084 10304022 10640764
59670 10640764 11009099 11410606 11847819 12322815 12836711 13390974 13988199 14630899 15320112
59661 15320112 16055719 16837393 17664368 18534440 19443687 20386597 21355565 22340217 23327897
59652 23327897 24305389 25260790 26184923 27072183 27920592 28731270 29508293 30258919 30992534
59643 30992534 31717556 32438701 33157095 33871885 34579787 35272559 35936145 36553424 37107902
59634 37107902 37585320 37973895 38265322 38456321 38548978 38549911 38469517 38321425 38121550 37887289
$$ packed form
59699A1572135j51064k27685k80510l10050l19596l13201k95068k69747k41028
59690I164186k10398j77801j43860j10140p7408m5359j4188J5102M2387O8957
59680H511478R5747J22275J47928J73075J98268K23537K49251K76525L05938L36742
59670A0640764L68335M01507M37213M74996N13896N54263N97225O42700O89213
59661A5320112P35607P81674Q26975Q70072R09247R42910R68968R84652R87680
59652B3327897R77492R55401R24133Q87260Q48409Q10678P77023P50626P33615
59643C0992534P25022P21145P18394P14790P07902O92772O63586O17279N54478
59634C7107902M77418L88575K91427J90999R2657R33q0394j48092j99875k34261
$$ plain form
59624 37887289 37637587 37392559 37171303 36989460 36859413 36792640 36800631 36893220 37077097 37356617
59614 37356617 37735224 38215155 38796078 39474480 40243848 41094530 42013206 42982252 43978594
59605 43978594 44972223 45926008 46797734 47543044 48117913 48481445 48600033 48451750 48029217
59596 48029217 47340929 46411353 45278456 43987969 42586853 41119311 39625377 38139923
59588 38139923 36691531 35302257 33987768 32756418 31607954 30533929 29519551 28544871
59580 28544871 27585676 26616759 25617946 24579363 23502937 22400544 21290381 20192394
59572 20192394 19124039 18098465 17125269 16211439 15360922 14574213 13849363 13183585 12574017
59563 12574017 12017750 11511797 11052806 10636631 10258761 9915553 9604618 9323615 9069232
$$ packed form
59624C7887289k49702k45028k21256j81843j30047o6773P991R2589J83877K79520
59614C7356617L78607M79931N80923O78402P69368Q50682R18676R69046R96342
59605D3978594R93629R53785Q71726P45310N74869L63532J18588j48283m22533
59596D8029217o88288r29576j132897j290487j401116j467542j493934j485454
59588C8139923j448392j389274j314489j231350j148464j074025j014378r74680
59580B8544871r59195r68917r98813j038583j076426j102393j110163j097987
59572B0192394j068355j025574r73196r13830q50517p86709p24850o65778o09568
59563A2574017n56267n05953m58991m16175l77870l43208l10935k81003k54383
$$ plain form
59554 9069232 8837958 8627490 8436796 8264799 8109444 7967864 7836978 7713820 7595533
59545 7595533 7479298 7362668 7244230 7123694 7000763 6874064 6742028 6605010 6465878
59536 6465878 6328117 6193839 6063873 5939038 5820681 5710219 5608535 5515663 5431026 5354427
59526 5354427 5286876 5229803 5183327 5146144 5117382 5097629 5087550 5086435 5092904 5106238 5126059 5151389
59514 5151389 5181248 5215890 5256274 5302373 5353009 5407325 5465374 5527160 5592150 5660330 5732995
59503 5732995 5811861 5897610 5989836 6088415 6194782 6311805 6442338 6587759 6747798 6921644
59493 6921644 7109134 7311169 7529516 7766107 8021670 8294885 8583664 8887554 9207774
59484 9207774 9544151 9893049 10249373 10609590 10971163 11329572 11678031 12010650 12324374
$$ packed form
59554I069232k31274k10468j90694j71997j55355j41580j30886j23158j18287
59545G595533j16235j16630j18438j20536j22931j26699j32036j37018j39132
59536F465878j37761j34278j29966j24835j18357j10462j01684r2872q4637p6599
59526E354427o7551n7073m6476l7183k8762j9753j0079j115O469J3334J9821K5330
59514E151389K9859L4642M0384M6099N0636N4316N8049O1786O4990O8180P2665
59503E732995P8866Q5749R2226R8579J06367J17023J30533J45421J60039J73846
59493F921644J87490K02035K18347K36591K55563K73215K88779L03890L20220
59484I207774L36377L48898L56324L60217L61573L58409L48459L32619L13724
$$ plain form
59475 12324374 12617153 12885471 13124606 13330579 13501095 13635339 13733996 13799340 13834666 13843585
59465 13843585 13830089 13798929 13755386 13704770 13652465 13604319 13566638 13545778 13547768 13577878 13640003
59454 13640003 13736175 13866496 14029079 14219629 14430985 14653077 14873237 15076806 15248387
59445 15248387 15373690 15440982 15441284 15367845 15216428 14986742 14683626 14316297 13896122 13435113
59435 13435113 12946164 12443225 11939479 11444891 10966289 10509870 10082464 9689714 9333992
59426 9333992 9014953 8731432 8482116 8265525 8080945 7929009 7809943 7721545 7660433 7625137
59416 7625137 7616288 7633684 7675222 7739523 7827675 7940962 8078194 8236925 8416293 8616684
59406 8616684 8836765 9072487 9319183 9573091 9830083 10083779 10325664 10546802 10739102
$$ packed form
59475A2324374K92779K68318K39135K05973J70516J34244R8657O5344L5326Q919
59465A3843585j3496l1160m3543n0616n2305m8146l7681k0860J990L0110O2125
59454A3640003R6172J30321J62583J90550K11356K22092K20160K03569J71581
59445A5248387J25303O7292L02p3439j51417k29686l03116l67329m20175m61009
59435A3435113m88949n02939n03746m94588m78602m56419m27406l92750l55722
59426I333992l19039k83521k49316k16591j84580j51936j19066q8398o1112l5296
59416G625137q849J7396M1538O4301Q8152J13287J37232J58731J79368K00391
59406H616684K20081K35722K46696K53908K56992K53696K41885K21138J92300
$$ plain form
59397 10739102 10895335 11008494 11071644 11079032 11027944 10919507 10757486 10546573 10292152 10001039
59387 10001039 9681372 9341625 8990157 8635141 8283434 7938983 7603247 7277825 6966033
59378 6966033 6671393 6395401 6137756 5898305 5677629 5475736 5291296 5122567 4968422
59369 4968422 4828109 4700720 4585609 4483053 4393825 4318044 4254756 4202565 4160324 4127279
59359 4127279 4102959 4086971 4078657 4077026 4081376 4091913 4109342 4133831 4164941 4202501 4246492 4295276
59347 4295276 4344630 4389723 4428308 4461603 4492462 4523786 4558772 4601232 4654408 4719694 4797105
59336 4797105 4886425 4986736 5094764 5205163 5313736 5420652 5530340 5648558 5779882 5927304
59326 5927304 6092806 6277472 6481622 6705793 6951724 7221951 7518488 7842486 8195350
$$ packed form
59397A0739102J56233J13159O3150P388n1088j08437j62021k10913k54421k91113
59387A0001039l19667l39747l51468l55016l51707l44451l35736l25422l11792
59378F966033k94640k75992k57645k39451k20676k01893j84440j68729j54145
59369D968422j40313j27389j15111j02556q9228p5781o3288n2191m2241l3045
59359D127279k4320j5988q314j631M350J0537J7429K4489L1110L7560M3991M8784
59347D295276M9354M5093L8585L3295L0859L1324L4986M2460N3176O5286P7411
59336D797105Q9320J00311J08028J10399J08573J06916J09688J18218J31324J47422
59326E927304J65502J84666K04150K24171K45931K70227K96537L23998L52864
$$ plain form
59317 8195350 8579550 8997917 9452490 9944524 10475338 11046525 11659110 12312556 13004255
59308 13004255 13729299 14480396 15248108 16021280 16787401 17533178 18245776 18914566 19532400
59299 19532400 20095717 20603663 21056965 21457261 21806997 22109166 22366227 22578697 22744672
59290 22744672 22860441 22921083 22920602 22852523 22711245 22492762 22194230 21814101 21354069 20820772
59280 20820772 20224639 19576935 18888378 18170041 17433946 16691801 15953529 15227284 14520299
59271 14520299 13839238 13189963 12577182 12004004 11471691 10980226 10529183 10117782 9744303
59262 9744303 9406390 9102346 8831575 8593472 8386411 8208020 8055638 7926122 7816203
59253 7816203 7724102 7650457 7596727 7562650 7545731 7542876 7551866 7571467 7601019 7640023 7687470 7741357
$$ packed form
59317H195350L84200M18367M54573M92034N30814N71187O12585O53446O91699
59308A3004255P25044P51097P67712P73172P66121P45777P12598O68790O17834
59299A9532400N63317N07946M53302M00296L49736L02169K57061K12470J65975
59290B2744672J15769O0642m81o8079j41278k18483k98532l80129m60032n33297
59280B0820772n96133o47704o88557p18337p36095p42145p38272p26245p06985
59271A4520299o81061o49275o12781n73178n32313m91465m51043m11401l73479
59262I744303l37913l04044k70771k38103k07061j78391j52382j29516j09919
59253G816203r2101p3645n3730l4077j6919k855Q990J9601K9552L9004M7447N3887
$$ plain form
59241 7741357 7799312 7859648 7921176 7981898 8038701 8088912 8131703 8167391 8195586 8214782 8223964
59230 8223964 8224196 8218270 8208986 8198072 8186764 8176961 8171485 8173332 8184904 8207818 8243001 8290893 8351946
59217 8351946 8427153 8517826 8624620 8746955 8883425 9032445 9192169 9359850 9531270 9700378
59207 9700378 9859150 9998360 10109509 10186902 10228594 10236069 10213232 10164965 10095640 10008665 9907518
59196 9907518 9796721 9681134 9564318 9448243 9334616 9225827 9124195 9030666 8944518 8864031
59186 8864031 8787194 8712218 8637926 8563763 8489406 8414592 8339419 8264420 8190020 8116290 8043623
59175 8043623 7973454 7907800 7848356 7796714 7755446 7728107 7717689 7725531 7752282 7799642 7870572
59164 7870572 7967835 8092832 8245987 8427982 8640410 8885376 9164549 9478348 9825652 10203846
$$ packed form
59241G741357N7955O0336O1528O0722N6803N0211M2791L5688K8195J9196R182
59230H223964K32n926r284j0914j1308r803n476J847J1572K2914L5183M7892O1053
59217H351946P5207R0673J06794J22335J36470J49020J59724J67681J71420J69108
59207I700378J58772J39210J11149P7393M1692P475k2837m8267o9325q6975j01147
59196I907518j10797j15587j16816j16075j13627j08789j01632r3529q6148q0487
59186H864031p6837p4976p4292p4163p4357p4814p5173p4999p4400p3730p2667
59175H043623p0169o5654n9444n1642m1268k7339j0418P842K6751M7360P0930
59164G870572R7263J24997J53155J81995K12428K44966K79173L13799L47304L78194
$$ plain form
59154 10203846 10608717 11034090 11471515 11910260 12337485 12738709 13098918 13403818 13640239
59145 13640239 13795971 13860807 13829028 13700756 13480517 13175282 12794887 12353265 11866797 11350637
59135 11350637 10817671 10280831 9753766 9247372 8766808 8313593 7889789 7498445 7140661
59126 7140661 6814504 6517164 6246662 6001178 5778437 5576751 5395643 5234612 5092003
59117 5092003 4965753 4854519 4757365 4672935 4599761 4537171 4485316 4444492 4414659 4395106 4384133
59106 4384133 4379558 4380214 4386728 4400303 4420969 4447530 4479039 4515592 4557677 4605375 4658641 4717959
59094 4717959 4784192 4857601 4937261 5021745 5110302 5203040 5299878 5399765 5501206 5603022 5703970
59083 5703970 5801942 5894332 5979297 6056080 6124180 6182903 6231836 6271046 6300477 6319576 6327774
$$ packed form
59154A0203846M04871M25373M37425M38745M27225M01224L60209L04900K36421
59145A3640239J55732O4836l1779j28272k20239l05235l80395m41622m86468n16160
59135A1350637n32966n36840n27065n06394m80564m53215m23804l91344l57784
59126G140661l26157k97340k70502k45484k22741k01686j81108j61031j42609
59117E092003j26250j11234r7154q4430p3174o2590n1855m0824k9833j9553j0973
59106D384133m575O56O514J3575K0666K6561L1509L6553M2085M7698N3266N9318
59094D717959O6233P3409P9660Q4484Q8557R2738R6838R9887J01441J01816J00948
59083E703970R7972R2390Q4965P6783O8100N8723M8933L9210K9431J9099Q198
$$ plain form
59072 6327774 6325153 6312818 6293207 6269800 6245599 6221706 6198081 6175814 6157776 6146968 6145241 6153895
59060 6153895 6174242 6206816 6251045 6306641 6374573 6455839 6550005 6655937 6773375 6902777 7044062
59049 7044062 7196583 7360011 7534293 7719048 7913986 8119671 8336720 8564201 8799769
59040 8799769 9041394 9287945 9537891 9788330 10035463 10274880 10500614 10704470 10877052
59031 10877052 11009530 11094548 11126287 11100691 11016212 10874429 10679902 10439051 10158842 9846461
59021 9846461 9509920 9157943 8798317 8436473 8076183 7721242 7375648 7042293 6722412
59012 6722412 6416507 6125046 5848225 5586038 5339171 5109050 4896197 4698797 4513629
59003 4513629 4338536 4173645 4020034 3877568 3744498 3619319 3502558 3395933 3299578 3210881
$$ packed form
59072F327774k621j2335j9611k3407k4201k3893k3625k2267j8038j0808j727Q654
59060F153895K0347L2574M4229N5596O7932Q1266R4166J05932J17438J29402J41285
59049G044062J52521J63428J74282J84755J94938K05685K17049K27481K35568
59040H799769K41625K46551K49946K50439K47133K39417K25734K03856J72582
59031A0877052J32478Q5018L1739k5596q4479j41783j94527k40851k80209l12381
59021I846461l36541l51977l59626l61844l60290l54941l45594l33355l19881
59012F722412l05905k91461k76821k62187k46867k30121k12853j97400j85168
59003D513629j75093j64891j53611j42466j33070j25179j16761j06625r6355q8697
$$ plain form
58993 3210881 3126748 3046538 2971938 2904233 2842597 2784986 2729674 2675777 2623381 2573863 2529278
58982 2529278 2490523 2456248 2424105 2392967 2363540 2337102 2314219 2294578 2277510 2262447 2249271
58971 2249271 2238586 2231625 2229518 2232202 2237900 2243977 2248751 2252546 2256809 2262333 2268653 2274993 2281086 2286798
58957 2286798 2291544 2294757 2296844 2299132 2302676 2307348 2312262 2316843 2321178 2325383 2329085 2331963 2334580 2338151
58943 2338151 2343284 2349272 2354776 2358804 2360684 2359540 2354502 2345542 2333761 2320799 2308062 2296229 2285037
58930 2285037 2273757 2262391 2252310 2245076 2240690 2237845 2236183 2237419 2243471 2254040 2266963 2280738
58918 2280738 2295666 2312289 2329796 2346859 2363530 2381318 2401450 2423964 2448755 2476529 2508016
58907 2508016 2542708 2579156 2616314 2654034 2692499 2731942 2772759 2815083 2858186 2901026 2943520
$$ packed form
58993C210881q4133q0210p4600o7705o1636n7611n5312n3897n2396m9518m4585
58982B529278l8755l4275l2143l1138k9427k6438k2883j9641j7068j5063j3176
58971B249271j0685o961k107K684N698O077M774L795M263N524O320O340O093N712
58957B286798M746L213K087K288L544M672M914M581M335M205L702K878K617L571
58943B338151N133N988N504M028J880j144n038q960j1781j2962j2737j1833j1192
58930B285037j1280j1366j0081p234m386k845j662J236O052J0569J2923J3775
58918B280738J4928J6623J7507J7063J6671J7788K0132K2514K4791K7774L1487
58907B508016L4692L6448L7158L7720L8465L9443M0817M2324M3103M2840M2494
$$ plain form
58896 2943520 2986625 3031141 3077269 3125410 3176295 3229953 3285697 3343836 3406393 3475153 3549794
58885 3549794 3629032 3712990 3803079 3899834 4002261 4109485 4222017 4341086 4467556 4601858
58875 4601858 4744308 4895134 5054575 5223210 5401914 5591482 5792657 6006544 6234497
58866 6234497 6477441 6735564 7008768 7297438 7603109 7928692 8277575 8651983 9052496
58857 9052496 9479572 9935072 10421635 10941073 11494323 12082538 12706969 13367674 14063436
58848 14063436 14793074 15555703 16349156 17168729 18007484 18856413 19703455 20533014 21327403
58839 21327403 22068611 22738388 23317472 23786225 24126962 24326251 24376033 24273826 24022903
58830 24022903 23632560 23117828 22497941 21793869 21026347 20215158 19378724 18533104 17691232
$$ packed form
58896B943520M3105M4516M6128M8141N0885N3658N5744N8139O2557O8760P4641
58885C549794P9238Q3958R0089R6755J02427J07224J12532J19069J26470J34302
58875D601858J42450J50826J59441J68635J78704J89568K01175K13887K27953
58866F234497K42944K58123K73204K88670L05671L25583L48883L74408M00513
58857I052496M27076M55500M86563N19438N53250N88215O24431O60705O95762
58848A4063436P29638P62629P93453Q19573Q38755Q48929Q47042Q29559P94389
58839B1327403P41208O69777N79084M68753L40737J99289M9782j02207k50923
58830B4022903l90343n14732o19887p04072p67522q11189q36434q45620q41872
$$ plain form
58821 17691232 16863564 16059214 15285879 14548911 13851196 13193929 12576944 11998677 11456959
58812 11456959 10950274 10477709 10037693 9627579 9244660 8886985 8553120 8241941 7952828
58803 7952828 7685218 7437635 7207861 6994348 6796788 6615020 6448187 6295314 6155865
58794 6155865 6029153 5913875 5808855 5713794 5628837 5554058 5489870 5437255 5396768 5367716 5348958
58783 5348958 5340116 5341341 5352424 5373122 5404080 5446270 5499328 5561501 5631760 5711255 5801909 5904033
58771 5904033 6016298 6138188 6271570 6419085 6581400 6756946 6944463 7144956 7360824
58762 7360824 7593885 7844935 8114633 8403917 8713819 9045762 9401936 9784594 10195010
58753 10195010 10633887 11102685 11603636 12138398 12707560 13311676 13951772 14628341 15340290
$$ packed form
58821A7691232q27668q04350p73335p36968o97715o57267o16985n78267n41718
58812A1456959n06685m72565m40016m10114l82919l57675l33865l11179k89113
58803G952828k67610k47583k29774k13513j97560j81768j66833j52873j39449
58794F155865j26712j15278j05020r5061q4957p4779o4188n2615m0487k9052j8758
58783E348958q842J225J1083K0698L0958M2190N3058O2173P0259P9495R0654J02124
58771E904033J12265J21890J33382J47515J62315J75546J87517K00493K15868
58762G360824K33061K51050K69698K89284L09902L31943L56174L82658M10416
58753A0195010M38877M68798N00951N34762N69162O04116O40096O76569P11949
$$ plain form
58744 15340290 16085007 16858461 17654410 18463622 19274032 20071193 20838358 21556804 22206753
58735 22206753 22768319 23222245 23551110 23741084 23783309 23674676 23418403 23024053 22506122
58726 22506122 21881975 21170636 20392229 19566718 18712400 17845744 16981772 16133074 15308294
58717 15308294 14512865 13751404 13028108 12344809 11700580 11094135 10525156 9992466 9492684
58708 9492684 9022336 8580439 8167608 7783411 7425917 7093233 6784092 6497213 6231036
58699 6231036 5983646 5752090 5532755 5324014 5128056 4948380 4785385 4635676 4495576
58690 4495576 4363946 4241499 4128951 4026327 3932818 3846635 3765983 3690755 3622263 3560709
58680 3560709 3503939 3449621 3397684 3349301 3304021 3259429 3213767 3167576 3122277 3078225 3034940
$$ packed form
58744A5340290P44717P73454P95949Q09212Q10410P97161P67165P18446O49949
58735B2206753N61566M53926L28865J89974M2225j08633k56273l94350n17931
58726B2506122o24147p11339p78407q25511q54318q66656q63972q48698q24780
58717A5308294p95429p61461p23296o83299o44229o06445n68979n32690m99782
58708I492684m70348m41897m12831l84197l57494l32684l09141k86879k66177
58699F231036k47390k31556k19335k08741j95958j79676j62995j49709j40100
58690D495576j31630j22447j12548j02624r3509q6183q0652p5228o8492o1554
58680C560709n6770n4318n1937m8383m5280m4592m5662m6191m5299m4052m3285
$$ plain form
58669 3034940 2992371 2950705 2909197 2866425 2821966 2776933 2732536 2688875 2645451 2601935 2557803
58658 2557803 2512082 2464297 2415133 2365324 2314615 2262811 2211250 2161855 2114982 2069541 2025049
58647 2025049 1982158 1941213 1901886 1864536 1830331 1799414 1770246 1741541 1713653 1687316 1662162
58636 1662162 1637399 1613004 1589302 1566084 1542995 1520131 1497532 1474870 1452388 1431354 1412637
58625 1412637 1395553 1379098 1363778 1351154 1341921 1335405 1330768 1327867 1326980 1328365 1332167 1338342 1346627
58612 1346627 1356609 1367667 1378984 1390171 1401717 1414002 1425832 1434883 1439804 1441030 1439647 1436707
58600 1436707 1433668 1431725 1429946 1425614 1417395 1406948 1396614 1387031 1378067 1370614 1365832 1363626 1363279 1364851
58586 1364851 1368781 1374992 1383556 1395225 1410104 1426915 1444994 1465824 1490947 1519451 1549366 1580526
$$ packed form
58669C034940m2569m1666m1508m2772m4459m5033m4397m3661m3424m3516m4132
58658B557803m5721m7785m9164m9809n0709n1804n1561m9395m6873m5441m4492
58647B025049m2891m0945l9327l7350l4205l0917k9168k8705k7888k6337k5154
58636A662162k4763k4395k3702k3218k3089k2864k2599k2662k2482k1034j8717
58625A412637j7084j6455j5320j2624r233o516m637k901q87J385L802O175Q285
58612A346627R982J1058J1317J1187J1546J2285J1830R051M921J226j383k940
58600A436707l039j943j779m332q219j0447j0334r583q964p453m782k206l47J572
58586A364851L930O211Q564J1669J4879J6811J8079K0830K5123K8504K9915L1160
$$ plain form
58574 1580526 1613850 1648596 1682978 1717558 1755625 1799557 1848539 1900434 1954455 2011465 2072921
58563 2072921 2140270 2214536 2295966 2384366 2479601 2581459 2689796 2805796 2932308 3071577
58553 3071577 3223108 3385080 3557343 3741474 3938248 4146749 4365715 4593988 4829453
58544 4829453 5069040 5309662 5547306 5774855 5982546 6161284 6304440 6406463 6461937 6467533
58534 6467533 6424181 6336410 6210115 6051353 5866484 5662374 5445982 5223429 4999206 4776659
58524 4776659 4559394 4351313 4154612 3968950 3793871 3631134 3483061 3349436 3227992
58515 3227992 3117511 3018366 2930140 2850934 2779399 2715494 2658694 2607200 2559633 2516041 2476536
58504 2476536 2440157 2405764 2373010 2342055 2313241 2287119 2263466 2240121 2214159 2184543 2152381
$$ packed form
58574A580526L3324L4746L4382L4580L8067M3932M8982N1895N4021N7010O1456
58563B072921O7349P4266Q1430Q8400R5235J01858J08337J16000J26512J39269
58553C071577J51531J61972J72263J84131J96774K08501K18966K28273K35465
58544D829453K39587K40622K37644K27549K07691J78738J43156J02023N5474N596
58534F467533m3352q7771j26295j58762j84869k04110k16392k22553k24223k22547
58524D776659k17265k08081j96701j85662j75079j62737j48073j33625j21444
58515C227992j10481r9145q8226p9206p1535o3905n6800n1494m7567m3592l9505
58504B476536l6379l4393l2754l0955k8814k6122k3653k3345k5962k9616l2162
$$ plain form
58493 2152381 2118495 2082314 2043438 2002609 1960589 1917650 1874750 1833647 1795076 1758177 1722395
58482 1722395 1688618 1657706 1629436 1603733 1581422 1562507 1545040 1527131 1509283 1493452 1480303
58471 1480303 1468639 1457214 1446076 1435941 1426685 1416615 1403473 1386627 1368048 1350356 1334077
58460 1334077 1317758 1300590 1283619 1268083 1253794 1239609 1224697 1209108 1193890 1180672 1170173
58449 1170173 1161244 1152326 1143634 1136638 1131731 1128049 1125291 1123746 1122484 1119821 1116170 1114227 1115437 1118178
58435 1118178 1120378 1122002 1123811 1125597 1127261 1130058 1135028 1141285 1147349 1153200 1159496 1165655 1170324 1173282
58421 1173282 1175545 1177947 1180700 1183928 1187445 1190125 1190451 1187925 1183615 1179483 1177145 1176609 1175987 1173082 1167590
58406 1167590 1161190 1155388 1150064 1144154 1136772 1127509 1116638 1105221 1094080 1082690 1070243 1057816
$$ packed form
58493B152381l3886l6181l8876m0829m2020m2939m2900m1103l8571l6899l5782
58482A722395l3777l0912k8270k5703k2311j8915j7467j7909j7848j5831j3149
58471A480303j1664j1425j1138j0135r256j0070j3142j6846j8579j7692j6279
58460A334077j6319j7168j6971j5536j4289j4185j4912j5589j5218j3218j0499
58449A170173q929q918q692o996m907l682k758j545j262k663l651j943J210K741
58435A118178K200J624J809J786J664K797M970O257O064N851O296O159M669K958
58421A173282K263K402K753L228L517K680L26k526m310m132k338n36o22k905n492
58406A167590o400n802n324n910p382r263j0871j1417j1141j1390j2447j2427
$$ plain form
58394 1057816 1048009 1042184 1039387 1038116 1037549 1036807 1034952 1032557 1031766 1033832 1037789 1042186 1046812 1052039 1057751
58379 1057751 1063696 1069840 1075882 1081585 1087872 1096275 1106958 1118676 1130824 1143709 1156506 1166919
58367 1166919 1173612 1177247 1178675 1178122 1176739 1176634 1178259 1179730 1179756 1179300 1179388 1179522 1179556 1181063 1185331 1191814
58351 1191814 1199849 1209933 1221889 1233844 1244756 1256211 1270029 1285749 1301966 1318278 1334193
58340 1334193 1347960 1358466 1366772 1373967 1378968 1380263 1378315 1374460 1368950 1361970 1355219 1350481 1347681
58327 1347681 1345839 1344651 1343800 1342350 1340327 1339194 1339175 1337991 1333993 1328573 1323599 1318682 1313249 1309136 1308325
58312 1308325 1309824 1311600 1314078 1318808 1325051 1330908 1336987 1345903 1358415 1372566 1386316 1398941 1410403
58299 1410403 1421506 1434162 1449561 1466554 1483403 1500134 1517514 1534998 1551773 1568612 1586455
$$ packed form
58394A057816r807n825k797j271n67p42j855k395p91K066L957M397M626N227N712
58379A057751N945O144O042N703O287Q403J0683J1718J2148J2885J2797J0413
58367A166919O693L635J428n53j383j05J625J471K6m56Q8J34L4J507M268O483
58351A191814Q035J0084J1956J1955J0912J1455J3818J5720J6217J6312J5915
58340A334193J3767J0506Q306P195N001J295j948l855n510o980o751m738k800
58327A347681j842j188q51j450k023j133j9j184l998n420m974m917n433m113q11
58312A308325J499J776K478M730O243N857O079Q916J2512J4151J3750J2625J1462
58299A410403J1103J2656J5399J6993J6849J6731J7380J7484J6775J6839J7843
$$ plain form
58288 1586455 1604143 1619790 1633523 1646872 1660360 1673592 1686594 1699125 1709846 1718052 1724962 1731538
58276 1731538 1736728 1739996 1743681 1750309 1759218 1768535 1778847 1792001 1807702 1824307 1841880 1861617
58264 1861617 1883241 1905599 1928635 1952351 1975399 1997383 2020664 2046834 2073313 2097079 2120044
58253 2120044 2146724 2177800 2210108 2242087 2274930 2308736 2341603 2372750 2403030 2432285 2459360
58242 2459360 2484710 2510062 2535792 2561470 2588354 2618209 2650338 2683102 2717791 2757421 2801970
58231 2801970 2848213 2894153 2940432 2987533 3034909 3083090 3133924 3188532 3247023 3309477 3375035
58220 3375035 3441273 3507108 3575002 3647760 3724951 3805297 3890341 3982117 4079325 4179753 4284498
58209 4284498 4395439 4510524 4626249 4743149 4863911 4987522 5110428 5232495 5356834
$$ packed form
58288A586455J7688J5647J3733J3349J3488J3232J3002J2531J0721Q206O910O576
58276A731538N190L268L685O628Q909R317J0312J3154J5701J6605J7573J9737
58264A861617K1624K2358K3036K3716K3048K1984K3281K6170K6479K3766K2965
58253B120044K6680L1076L2308L1979L2843L3806L2867L1147L0280K9255K7075
58242B459360K5350K5352K5730K5678K6884K9855L2129L2764L4689L9630M4549
58231B801970M6243M5940M6279M7101M7376M8181N0834N4608N8491O2454O5558
58220C375035O6238O5835O7894P2758P7191Q0346Q5044R1776R7208J00428J04745
58209D284498J10941J15085J15725J16900J20762J23611J22906J22067J24339
$$ plain form
58200 5356834 5484615 5615045 5749757 5892312 6043860 6203696 6373142 6554530 6747781
58191 6747781 6952757 7173552 7415635 7680325 7966905 8277904 8616707 8982285 9372473
58182 9372473 9790301 10240459 10721380 11227871 11760011 12322479 12916834 13542042 14201522
58173 14201522 14902240 15647572 16437536 17274154 18159435 19090725 20066610 21095701 22191457
58164 22191457 23360176 24601766 25918488 27313039 28781447 30319449 31934433 33641215
58156 33641215 35449429 37366666 39410712 41605765 43969188 46514729 49265100 52247209
58148 52247209 55479152 58978566 62781950 66941708 71511384 76555159 82169956 88479565
58140 88479565 95611572 103699909 112900891 123377783 135270750 148703423 163808868
$$ packed form
58200E356834J27781J30430J34712J42555J51548J59836J69446J81388J93251
58191F747781K04976K20795K42083K64690K86580L10999L38803L65578L90188
58182I372473M17828M50158M80921N06491N32140N62468N94355O25208O59480
58173A4201522P00718P45332P89964Q36618Q85281R31290R75885J029091J095756
58164B2191457J168719J241590J316722J394551J468408J538002J614984J706782
58156C3641215J808214J917237K044046K195053K363423K545541K750371K982109
58148E2247209L231943L499414L803384M159758M569676N043775N614797O309609
58140H8479565P132007Q088337R200982J0476892J1892967J3432673J5105445
$$ plain form
58133 163808868 180729898 199636910 220822101 244777241 272095987 303212459 338090228
58126 338090228 375807015 413968647 448383462 473792446 485778330 482704398 466220460
58119 466220460 440079586 408386261 374471545 340628985 308266811 278131131 250537044
58112 250537044 225566225 203163529 183173861 165406762 149705792 135949989 124013771
58105 124013771 113759733 105054145 97755706 91700189 86723907 82693511 79500179 77057453
58097 77057453 75340476 74409315 74362197 75268967 77123415 79738464 82571378 84698624 85148606
58088 85148606 83413318 79687678 74641906 68999441 63285125 57809883 52734590 48115643
58080 48115643 43948012 40208810 36869965 33888702 31214355 28809077 26650581 24718648
$$ packed form
58133A63808868J6921030J8907012K1185191K3955140K7318746L1116472L4877769
58126C38090228L7716787L8161632L4414815K5408984J1985884l073932j6483938
58119D66220460k6140874l1693325l3914716l3842560l2362174l0135680k7594087
58112B50537044k4970819k2402696j9989668j7767099j5700970j3755803j1936218
58105A24013771j0254038q705588p298439o055517m976282m030396l193332k442726
58097G7057453j716977r31161m7118R06770J854448K615049K832914K127246M49982
58088H5148606j735288l725640n045772n642465n714316n475242n075293m618947
58080D8115643m167631l739202l338845k981263k674347k405278k158496j931933
$$ plain form
58072 24718648 22991925 21454176 20090140 18875883 17782499 16787697 15876527 15034545
58064 15034545 14248611 13512069 12822056 12173829 11563116 10990670 10458498 9963952 9501982
58055 9501982 9069999 8666070 8285803 7925530 7585559 7266283 6964173 6675089 6398071
58046 6398071 6132486 5875178 5624174 5381854 5151018 4931023 4720781 4521855 4335296
58037 4335296 4158836 3990374 3830934 3681291 3539279 3403479 3275943 3158033 3046962
58028 3046962 2939662 2836809 2739865 2647341 2557315 2470597 2388184 2308412 2229964 2155016 2086119
58017 2086119 2022236 1960855 1901780 1846013 1793047 1742110 1694151 1650032 1608636 1569017 1532424
58006 1532424 1499955 1470220 1441520 1414408 1390013 1367690 1346277 1325777 1306033 1285608 1263640
$$ packed form
58072B4718648j726723j537749j364036j214257j093384r94802r11170q41982
58064A5034545p85934p36542o90013o48227o10713n72446n32172m94546m61970
58055I501982m31983m03929l80267l60273l39971l19276l02110k89084k77018
58046F398071k65585k57308k51004k42320k30836k19995k10242j98926j86559
58037D335296j76460j68462j59440j49643j42012j35800j27536j17910j11071
58028C046962j07300j02853r6944r2524r0026q6718q2413p9772p8448p4948o8897
58017B086119o3883o1381n9075n5767n2966n0937m7959m4119m1396l9619l6593
58006A532424l2469k9735k8700k7112k4395k2323k1413k0500j9744k0425k1968
$$ plain form
57995 1263640 1240879 1217600 1192850 1167284 1144100 1125266 1109007 1092819 1076697 1061850 1048628
57984 1048628 1037373 1028828 1021927 1013800 1003868 995320 990548 987721 984122 980277 978172 977594 977002 976285
57970 976285 976096 975785 974261 971763 969072 966226 963496 962075 962384 963276 964047 965367 967151 967848 967009 966066
57954 966066 965184 962234 956632 951239 948236 945912 942035 937668 934735 932271 928216 922961 917979 912633
57940 912633 905581 897977 892119 887879 883302 877861 872335 866339 858691 849704 840553 830767 818682 804196
57926 804196 789202 775571 764261 755737 749599 744400 739304 735212 732993 731850 730930 731180 733673 737244
57912 737244 739820 741186 742588 744552 746957 750317 754966 759766 763488 766675 770280 773373 774378 773916
57898 773916 774259 776169 778125 778475 776745 773049 767747 761670 755599 749708 744118 739214 734682 729352 723110
$$ packed form
57995A263640k2761k3279k4750k5566k3184j8834j6259j6188j6122j4847j3222
57984A048628j1255q545o901q127r932q548m772k827l599l845k105n78n92p17
57970I76285j89l11j524k498k691k846k730j421L09Q92P71J320J784O97q39r43
57954I66066q82k950n602n393l003k324l877m367k933k464m055n255m982n346
57940I12633p052p604n858m240m577n441n526n996p648q987r151r786j2085j4486
57926H04196j4994j3631j1310q524o138n199n096m092k219j143r20K50K493L571
57912G37244K576J366J402J964K405L360M649M800L722L187L605L093J005m62
57898G73916L43J910J956L50j730l696n302o077o071n891n590m904m532n330o242
$$ plain form
57883 723110 717842 715438 716041 719195 725020 732853 740443 746278 751296 756612 761261 764105 766203 768824
57869 768824 770550 768976 764101 757361 748324 735388 719318 703149 688461 674088 658674 642478
57857 642478 626652 612590 601854 594906 590054 585338 581108 579031 579129 579854 580662 582352 585073 588112
57843 588112 591528 595998 601188 606270 611889 619469 628559 636955 643569 649246 654706 659731 664531 669788
57829 669788 674878 678024 678742 678424 678024 676731 673450 668197 661715 655005 649307 645049 640736 634430 626401
57814 626401 618674 612050 605493 598682 593079 589909 588853 589405 591818 595990 600951 606240 612472 619914
57800 619914 627845 635890 644542 653710 662051 668487 673263 676980 679835 682368 685641 689894 693979 696647
57786 696647 697345 695504 690458 682659 673666 664360 654450 644274 635523 629212 624337 619583 615084 611354
$$ packed form
57883G23110n268k404O03L154N825P833P590N835N018N316M649K844K098K621
57869G68824J726j574m875o740r037j2936j6070j6169j4688j4373j5414j6196
57857F42478j5826j4062j0736o948m852m716m230k077R8P25Q08J690K721L039
57843E88112L416M470N190N082N619P580R090Q396O614N677N460N025M800N257
57829F69788N090L146P18l18m00j293l281n253o482o710n698m258m313o306q029
57814F26401p727o624o557o811n603l170j056N52K413M172M961N289O232P442
57800F19914P931Q045Q652R168Q341O436M776L717K855K533L273M253M085K668
57786F96647O98j841n046p799q993r306r910j0176q751o311m875m754m499l730
$$ plain form
57772 611354 607697 603132 598016 593331 588989 584212 579144 574633 570458 565030 557200 547552 537566 527960
57758 527960 518162 507162 494620 481213 468041 456028 445951 438430 433203 428716 423383 417332 412199
57745 412199 409162 407948 407764 408174 408799 409182 409526 410845 413818 418103 423229 429615 438163 449165 461815
57730 461815 474313 484274 489951 491845 492724 495470 500976 508318 516340 524442 532156 538696 543228 545380
57716 545380 545548 544729 543874 543097 541559 538216 532721 525595 517524 508616 498586 487877 478223 471345 466979
57701 466979 462979 457748 451822 446554 442120 437785 433645 430992 431030 433918 438896 444739 450372 455715 461612
57686 461612 468330 474736 479915 484860 491198 498510 504500 507991 510272 513127 516780 520448 523865 527391
57672 527391 531271 535549 540452 546341 553443 561790 571181 581151 591265 601406 611606 621876 632657
$$ packed form
57772F11354l657m565n116m685m342m777n068m511m175n428p830r648r986r606
57758E27960r798j1000j2542j3407j3172j2013j0077p521n227m487n333o051n133
57745D12199l037j214j84M10O25L83L44J319K973M285N126O386Q548J1002J2650
57730D61815J2498R961N677J894Q79K746N506P342Q022Q102P714O540M532K152
57716E45380J68q19q55p77j538l343n495p126q071q908j0030j0709r654o878m366
57701D66979m000n231n926n268m434m335m140k653L8K888M978N843N633N343N897
57686D61612O718O406N179M945O338P312N990L491K281K855L653L668L417L526
57672E27391L880M278M903N889P102Q347R391R970J0114J0141J0200J0270J0781
$$ plain form
57659 632657 645008 659603 675907 693117 711524 731841 753370 774275 793878 813518 834641
57648 834641 857093 879893 902805 926443 951449 978306 1007606 1039880 1075272 1113635 1154739
57637 1154739 1198204 1243508 1290304 1338599 1388666 1441015 1496380 1555251 1617342 1681935 1749011
57626 1749011 1819969 1897236 1983208 2079288 2185742 2302654 2431037 2572619 2728526 2898862
57616 2898862 3083709 3283532 3498035 3725579 3964559 4214472 4474484 4741338 5009382
57607 5009382 5271787 5520697 5746817 5939748 6087879 6177298 6193334 6127248 5982824 5775488
57597 5775488 5524968 5249278 4963565 4680255 4408013 4151570 3913385 3694646 3494905
57588 3494905 3312794 3148013 3001324 2872089 2757414 2654572 2562994 2483122 2414579 2356386
$$ packed form
57659F32657J2351J4595J6304J7210J8407K0317K1529K0905J9603J9640K1123
57648H34641K2452K2800K2912K3638K5006K6857K9300L2274L5392L8363M1104
57637A154739M3465M5304M6796M8295N0067N2349N5365N8871O2091O4593O7076
57626A749011P0958P7267Q5972R6080J06454J16912J28383J41582J55907J70336
57616B898862J84847J99823K14503K27544K38980K49913K60012K66854K68044
57607E009382K62405K48910K26120J92931J48131Q9419J6036o6086j44424k07336
57597E775488k50520k75690k85713k83310k72242k56443k38185k18739j99741
57588C494905j82111j64781j46689j29235j14675j02842r1578p9872o8543n8193
$$ plain form
57578 2356386 2307817 2267987 2235497 2209538 2190690 2179829 2176675 2179958 2188468 2201555 2219272 2242545
57566 2242545 2272681 2310452 2356173 2410533 2474350 2547445 2628859 2718342 2816556 2923788 3039813
57555 3039813 3165110 3300513 3445185 3596529 3752562 3912364 4073053 4228012 4369603
57546 4369603 4492348 4592198 4664149 4702679 4704243 4668175 4595987 4491244 4359579 4207245 4039549
57535 4039549 3861305 3677899 3494406 3313852 3137602 2967230 2804851 2651661 2507449
57526 2507449 2371976 2246124 2131264 2027780 1934312 1848374 1767920 1692488 1622589 1558143
57516 1558143 1498290 1442858 1392967 1349542 1311921 1278393 1247321 1217361 1187690 1158919 1132819
57505 1132819 1110238 1090108 1071431 1055141 1042586 1032996 1024210 1015605 1008561 1003989 1001092 999076 998644
$$ packed form
57578B356386m8569l9830l2490k5959j8848j0861l154L283Q510J3087J7717K3273
57566B242545L0136L7771M5721N4360O3817P3095Q1414Q9483R8214J07232J16025
57555C039813J25297J35403J44672J51344J56033J59802J60689J54959J41591
57546D369603J22745R9850P1951L8530J564l6068p2188j04743j31665j52334j67696
57535D039549j78244j83406j83493j80554j76250j70372j62379j53190j44212
57526B507449j35473j25852j14860j03484r3468q5938q0454p5432o9899o4446
57516A558143n9853n5432m9891m3425l7621l3528l1072k9960k9671k8771k6100
57505A132819k2581k0130j8677j6290j2555r590q786q605p044m572k897k016m32
$$ plain form
57492 998644 1000882 1005660 1012055 1019783 1029196 1040181 1051988 1064345 1077972 1093654 1111266 1130335
57480 1130335 1151195 1174784 1201304 1230002 1260508 1293422 1329004 1366501 1405801 1448748 1497350
57469 1497350 1551401 1609558 1672262 1741453 1817414 1898151 1982534 2072054 2168588 2272124 2381728
57458 2381728 2496999 2617100 2739537 2861223 2979751 3092478 3195357 3283887 3354310 3402871
57448 3402871 3425260 3418641 3383868 3324531 3244423 3146971 3036237 2916818 2792951 2668540 2547301
57437 2547301 2431537 2321308 2216073 2116709 2024799 1940625 1863334 1792734 1729569 1674165 1625928
57426 1625928 1583921 1546993 1513887 1484388 1459908 1441711 1429144 1420843 1416954 1418489 1425008 1434918
57414 1434918 1447991 1465696 1488931 1517271 1550712 1590232 1635853 1685806 1738741 1795753 1859266
$$ packed form
57492I98644K238M778O395P728R413J0985J1807J2357J3627J5682J7612J9069
57480A130335K0860K3589K6520K8698L0506L2914L5582L7497L9300M2947M8602
57469A497350N4051N8157O2704O9191P5961Q0737Q4383Q9520R6534J03536J09604
57458B381728J15271J20101J22437J21686J18528J12727J02879Q8530P0423M8561
57448C402871K2389o619l4773n9337q0108r7452j10734j19419j23867j24411j21239
57437B547301j15764j10229j05235r9364r1910q4174p7291p0600o3165n5404m8237
57426A625928m2007l6928l3106k9499k4480j8197j2567q301l889J535O519R910
57414A434918J3073J7705K3235K8340L3441L9520M5621M9953N2935N7012O3513
$$ plain form
57403 1859266 1930595 2009206 2093666 2182757 2276156 2374389 2477569 2584128 2691474 2797733
57393 2797733 2901684 3000699 3089919 3163935 3218315 3249207 3253050 3228102 3175755 3099496 3002977
57382 3002977 2889801 2764463 2632105 2497020 2361862 2228307 2098039 1973094 1855576
57373 1855576 1746965 1647426 1555798 1470546 1390780 1316361 1247338 1183563 1124812 1070947 1021845
57362 1021845 977211 936568 899470 865729 835367 808308 784142 762171 741540 721518 701994
57351 701994 683678 667286 652364 637519 622244 608085 597245 590077 584491 578005 570052 562159
57339 562159 556069 551930 548448 544605 540779 537885 535894 533931 531631 529505 527880 526339 524512 522677
57325 522677 521180 519920 518833 518263 518394 518851 519205 519356 519111 518136 516742 515998 516598 518271 520726 524311
$$ packed form
57403A859266P1329P8611Q4460Q9091R3399R8233J03180J06559J07346J06259
57393B797733J03951R9015Q9220P4016N4380L0892L843k4948n2347p6259r6519
57382C002977j13176j25338j32358j35085j35158j33555j30268j24945j17518
57373A855576j08611r9539r1628q5252p9766p4419o9023o3775n8751n3865m9102
57362A021845m4634m0643l7098l3741l0362k7059k4166k1971k0631k0022j9524
57351G01994j8316j6392j4922j4845j5275j4159j0840p168n586o486p953p893
57339E62159o090m139l482l843l826k894j991j963k300k126j625j541j827j835
57325E22677j497j260j087n70J31M57L54J51k45r75j394p44O00J673K455L585
$$ plain form
57309 524311 529105 534105 538004 540143 540168 537754 533625 530074 529249 531147 533975 536093 537027 537306 538094 540536
57293 540536 544673 549439 554203 559572 566066 573057 579946 587406 596179 605407 613482 620051 626022 632194
57279 632194 639115 647635 658079 669209 679484 689133 699700 711782 724582 737464 750484 763461
57267 763461 775981 788496 802107 817062 832563 848212 864508 881779 899768 918521 938601
57256 938601 960074 982204 1004501 1027312 1051064 1075543 1100096 1124087 1147169 1169606 1192253
57245 1192253 1215750 1239960 1264573 1289611 1314829 1339522 1363953 1390128 1419742 1451942 1484497
57234 1484497 1516665 1549388 1583238 1618170 1655212 1696324 1742026 1790826 1841578 1895000 1952174
57223 1952174 2012806 2075744 2140264 2206147 2273192 2341078 2409135 2476082 2540766 2603260 2664308
$$ packed form
57309E24311M794N000L899K139K5k414m129l551q25J898K828K118R34K79P88K442
57293E40536M137M766M764N369O494O991O889P460Q773R228Q075O569N971O172
57279F32194O921Q520J0444J1130J0275R649J0567J2082J2800J2882J3020J2977
57267G63461J2520J2515J3611J4955J5501J5649J6296J7271J7989J8753K0080
57256I38601K1473K2130K2297K2811K3752K4479K4553K3991K3082K2437K2647
57245A192253K3497K4210K4613K5038K5218K4693K4431K6175K9614L2200L2555
57234A484497L2168L2723L3850L4932L7042M1112M5702M8800N0752N3422N7174
57223A952174O0632O2938O4520O5883O7045O7886O8057O6947O4684O2494O1048
$$ plain form
57212 2664308 2723508 2778931 2828803 2872684 2910676 2942281 2966538 2982943 2992145 2995999 2996561 2994504
57200 2994504 2988991 2979793 2968854 2958889 2951222 2946240 2945021 2948650 2956388 2966533 2979130 2995899 3017386
57187 3017386 3041997 3068076 3094977 3121564 3145641 3165981 3183548 3199895 3215643 3231328 3248395
57176 3248395 3268313 3291613 3318501 3349345 3383698 3419882 3456696 3495140 3537703 3586191 3640511
57165 3640511 3698968 3759421 3820624 3882709 3945989 4009428 4070966 4129085 4183208 4232866 4277772
57154 4277772 4318750 4357432 4394965 4432026 4469899 4510062 4552557 4596264 4641142 4688957 4741594
57143 4741594 4800114 4865785 4940263 5023743 5114051 5208597 5306544 5408498 5514715 5624118 5734567
57132 5734567 5843756 5950267 6053837 6154321 6250925 6343055 6430976 6514269 6590341 6656306
$$ packed form
57212B664308N9200N5423M9872M3881L7992L1605K4257J6405R202L854N62k057
57200B994504n513r198j0939r965p667m982j219L629P738J0145J2597J6769K1487
57187C017386K4611K6079K6901K6587K4077K0340J7567J6347J5748J5685J7067
57176C248395J9918K3300K6888L0844L4353L6184L6814L8444M2563M8488N4320
57165C640511N8457O0453O1203O2085O3280O3439O1538N8119N4123M9658M4906
57154D277772M0978L8682L7533L7061L7873M0163M2495M3707M4878M7815N2637
57143D741594N8520O5671P4478Q3480R0308R4546R7947J01954J06217J09403J10449
57132E734567J09189J06511J03570J00484R6604R2130Q7921Q3293P6072O5965
$$ plain form
57122 6656306 6712293 6761613 6807964 6853881 6901087 6950064 6999197 7046328 7091146 7134139 7173383
57111 7173383 7204923 7226797 7240461 7247796 7249062 7244773 7237525 7230697 7226449 7225217 7225354 7222726 7212562
57098 7212562 7192543 7162896 7123720 7074530 7016630 6953217 6886178 6814978 6739437 6661032 6580211
57087 6580211 6494804 6402784 6304973 6203945 6102178 6002485 5908176 5820910 5739444 5661278 5583764
57076 5583764 5502346 5409415 5296750 5158714 4992712 4797719 4572629 4314346 4016595 3671407
57066 3671407 3271724 2811529 2284665 1686281 1015150 271621 -547093 -1447413 -2435733
57057 -2435733 -3517576 -4700026 -5991306 -7397704 -8925088 -10584717 -12394576 -14374726
57049 -14374726 -16545319 -18930108 -21558332 -24462527 -27678289 -31246720 -35213223 -39623868
$$ packed form
57122F656306N5987M9320M6351M5917M7206M8977M9133M7131M4818M2993L9244
57111G173383L1540K1874J3664P335J266m289p248o828m248j232J37k628j0164
57098G212562k0019k9647l9176m9190n7900o3413o7039p1200p5541p8405q0821
57087F580211q5407r2020r7811j01028j01767r9693r4309q7266q1466p8166p7514
57076E583764q1418r2931j12665j38036j66002j94993k25090k58283k97751l45188
57066C671407l99683m60195n26864n98384o71131B71621e47093r00320r88320
57057b435733j081843j182450j291280j406398j527384j659629j809859j980150
57049a4374726k170593k384789k628224k904195l215762l568431l966503m410645
$$ plain form
57041 -39623868 -44527745 -49983613 -56060475 -62833252 -70384351 -78808025 -88203548 -98660570
57033 -98660570 -110253696 -123043136 -137061652 -152293604 -168674760 -186109177 -204462051
57026 -204462051 -223519223 -242957739 -262351787 -281182988 -298848648 -314731026 -328349583
57019 -328349583 -339479227 -348097381 -354199628 -357670564 -358308947 -355917217 -350337086 -341443883
57011 -341443883 -329180918 -313641093 -295130211 -274174868 -251489600 -227913011 -204306761
57004 -204306761 -181438414 -159896279 -140061079 -122120224 -106104839 -91940645 -79498629
56997 -79498629 -68627094 -59164516 -50948813 -43828481 -37666902 -32338480 -27726700 -23727499
56989 -23727499 -20250713 -17217606 -14560418 -12224108 -10164067 -8340624 -6717714 -5265834
$$ packed form
57041c9623868m903877n455868o076862o772777p551099q423674r395523j0457022
57033i8660570j1593126j2789440j4018516j5231952j6381156j7434417j8352874
57026b04462051j9057172j9438516j9394048j8831201j7665660j5882378j3618557
57019c28349583j1129644q618154o102247l470936o38383K391730N580131Q893203
57011c41443883J2262965J5539825J8510882K0955343K2685268K3576589K3606250
57004b04306761K2868347K1542135J9835200J7940855J6015385J4164194J2442016
56997g9498629J0871535R462578Q215703P120332O161579N328422M611780L999201
56989b3727499L476786L033107K657188K336310K060041J823443J622910J451880
$$ plain form
56981 -5265834 -3962444 -2789235 -1731784 -780971 69669 829221 1509945 2123205 2677594
56972 2677594 3180497 3637968 4052823 4425712 4758380 5053550 5312044 5533165 5718419
56963 5718419 5872603 6001148 6108389 6197749 6270669 6325266 6358723 6371538 6367673 6351033 6324031
56952 6324031 6289038 6248170 6201313 6146677 6083551 6012587 5933958 5848103 5758468 5670843 5589569
56941 5589569 5516722 5455147 5409367 5382053 5370265 5363778 5343735 5283600 5157429 4952566 4675432
56930 4675432 4345242 3983603 3609177 3236927 2877413 2536351 2216716 1921373 1652798
56921 1652798 1410905 1192598 993724 811148 643496 490763 353274 230585 121202
56912 121202 23281 -64486 -142407 -209833 -266021 -311175 -346315 -371918 -387459 -392900 -389721 -379702
$$ packed form
56981e265834J303390J173209J057451g80971F9669P59552O80724O13260N54389
56972B677594N02903M57471M14855L72889L32668K95170K58494K21121J85254
56963E718419J54184J28545J07241Q9360P2920N4597L3457J2815l865j6640k7002
56952F324031l4993m0868m6857n4636o3126p0964p8629q5855q9635q7625q1274
56941E589569p2847o1575m5780k7314j1788o487k0043o0135j26171k04863k77134
56930D675432l30190l61639l74426l72250l59514l41062l19635k95343k68575
56921A652798k41893k18307j98874j82576j67652j52733j37489j22689j09383
56912A21202B3281f4486p7921o7426n6188m5154l5140k5603j5541n441L179J0019
$$ plain form
56900 -379702 -363484 -341355 -314511 -284216 -250633 -214292 -178486 -148446 -127917 -117615 -116711 -124111
56888 -124111 -137910 -154987 -172030 -186643 -197639 -205082 -209970 -213017 -213625 -210657 -204031 -194859 -184204
56875 -184204 -172280 -158519 -141812 -121220 -97291 -72263 -48335 -26583 -8369 3283 5411 -2176
56862 -17040 -36445 -58295 -80446 -100891 -118638 -133407 -144846 -153259 -160436 -168107 -175751 -181408 -184370
56849 -184370 -185642 -186042 -185574 -184570 -183778 -183167 -182058 -180514 -179194 -177835 -175300 -171135 -165555 -158057 -147787
56834 -147787 -135467 -123047 -110991 -97602 -81617 -63694 -44427 -22490 3794 33939 65350 95407
56822 95407 122601 146218 165800 180959 191583 198405 203225 207789 212369 216088 218750 221652 226445
56809 226445 233826 243434 254526 266759 280802 298033 319263 344199 372737 405885 444115 485193
$$ packed form
56900c79702J6218K2129K6844L0295L3583L6341L5806L0040K0529J0302R04p400
56888a24111j3799j7077j7043j4613j0996p443m888l047o08K968O626R172J0655
56875a84204J1924J3761J6707K0592K3929K5028K3928K1752h369C283K128b176
56862a7040j9405k1850k2151k0445j7747j4769j1439q413p177p671p644n657k962
56849a84370j272m00M68J004P92O11J109J544J320J359K535M165N580P498J0270
56834a47787J2320J2420J2056J3389J5985J7923J9267K1937C794L0145L1411L0057
56822I5407K7194K3617J9582J5159J0624O822M820M564M580L719K662K902M793
56809B26445P381R608J1092J2233J4043J7231K1230K4936K8538L3148L8230M1078
$$ plain form
56797 485193 524893 559490 586361 602829 606650 598320 581562 560988 539997 520740 504460 491331
56785 491331 481085 474337 472508 476318 485423 499719 519925 546666 580150 621018 670371 728496
56773 728496 794353 866038 939943 1008871 1062762 1093085 1096797 1076345 1037199 985976 929332 872726
56761 872726 819698 772350 731906 698411 670710 647707 629777 618636 615828 621441 634226 653082
56749 653082 678372 711295 751761 797414 844730 889599 925983 945990 944096 921584 885330 842220
56737 842220 796042 748982 703304 660620 621335 585962 555812 531687 513049 499256 490547 487159
56725 487159 488554 494273 504632 519802 538944 560750 583878 606118 623932 633729 633482 623089
56713 623089 604003 578786 550100 519476 487515 455335 424908 397644 373598 352446 334359
$$ packed form
56797D85193L9700L4597K6871J6468L821q330j6758k0574k0991j9257j6280j3129
56785D91331j0246o748j829L810R105J4296K0206K6741L3484M0868M9353N8125
56773G28496O5857P1685P3905O8928N3891L0323L712k0452l9146n1223n6644n6606
56761H72726n3028m7348m0444l3495k7701k3003j7930j1141k808N613J2785J8856
56749F53082K5290L2923M0466M5653M7316M4869L6384K0007j894k2512l6254m3110
56737H42220m6178m7060m5678m2684l9285l5373l0150k4125j8638j3793q709l388
56725D87159J395N719J0359J5170J9142K1806K3128K2240J7814R797k47j0393
56713F23089j9086k5217k8686l0624l1961l2180l0427k7264k4046k1152j8087
$$ plain form
56702 334359 319361 306613 294918 283578 272535 262213 253245 245639 238240 229906 221284 214462 210726
56689 210726 209567 209805 210485 210565 209251 207147 205893 206065 206444 205830 204465 203112 201890 200747 200138 200455
56673 200455 201485 203036 205360 208435 211478 213606 214379 213546 211118 207946 205326 203762 202966 203019 204280
56658 204280 205994 206484 205309 203942 203684 204101 204159 203593 202430 200349 197410 194419 191861 189425 187123 185632
56642 185632 184846 183521 181301 179654 179515 179295 176817 172336 168020 164962 162260 158805 154497 149552 143744
56627 143744 136836 129330 122632 118443 117593 119237 121600 123639 125425 127069 128360 129700 132128 135761
56613 135761 139316 141911 144504 148825 155643 164606 174741 184379 191602 195774 198066 199895 201685 203571
56599 203571 206084 209204 211894 213630 215405 218038 220432 220836 219151 216702 214280 211717 209014 206494
$$ packed form
56702C34359j4998j2748j1695j1340j1043j0322q968p606p399q334q622o822l736
56689B10726j159K38O80Q0j314k104j254J72L79o14j365j353j222j143o09L17
56673B00455J030J551K324L075L043K128P73q33k428l172k620j564p96N3J261
56658B04280J714M90j175j367k58M17N8n66j163k081k939k991k558k436k302j491
56642A85632p86j325k220j647j39k20k478m481m316l058k702l455m308m945n808
56627A43744o908p506o698m189q50J644K363K039J786J644J291J340K428L633
56613A35761L555K595K593M321O818Q963J0135R638P223M172K292J829J790J886
56599B03571K513L120K690J736J775K633K394M04j685k449k422k563k703k520
$$ plain form
56585 206494 203875 200236 195024 188550 181693 175673 171682 170001 169609 169138 167974 166208 164161 162463 162001
56570 162001 163170 165530 168507 171814 174913 176872 177202 176217 174378 172145 170489 170176 170149 168157 163801
56555 163801 159582 158021 159113 161482 164407 167334 168827 167912 165634 163746 162503 161135 159681 158836 158636
56540 158636 158889 160382 164058 169236 174098 177845 181189 184884 188823 192446 195167 196696 197707 199686
56526 199686 203246 207167 209865 211100 211456 211198 210791 211446 213594 215596 215612 214203 213548 214667 216988 219995
56510 219995 223432 226213 227220 227350 229004 233161 238384 243019 246911 250579 254067 257310 260757 265010
56496 265010 270389 277095 285196 294218 303133 310883 316794 320843 323799 326565 328991 330110 330049 330603 332985
56481 332985 335990 337575 337423 336608 335550 333812 331416 328830 326054 323023 320447 318865 317383 314890 312014
$$ packed form
56585B06494k619l639n212o474o857o020l991j681l92m71j164j766k047j698m62
56570A62001J169K360K977L307L099J959L30r85j839k233j656l13k7j992m356
56555A63801m219j561J092K369K925K927J493r15k278j888j243j368j454q45k00
56540A58636K53J493L676N178M862L747L344L695L939L623K721J529J011J979
56526A99686L560L921K698J235L56k58m07O55K148K002J6j409o55J119K321L007
56510B19995L437K781J007J30J654M157N223M635L892L668L488L243L447M253
56496B65010N379O706Q101R022Q915P750N911M049K956K766K426J119o1N54K382
56481C32985L005J585j52q15j058j738k396k586k776l031k576j582j482k493k876
$$ plain form
56466 312014 310129 308770 305960 301147 295987 291960 288735 285249 280927 275597 269576 264226 261145 260284
56452 260284 259945 258922 257650 256937 256628 256004 254679 252745 250590 248752 247479 246507 245724 245637 246511 247544
56436 247544 247787 247407 247164 247239 247593 248772 251068 253494 255077 256549 259193 262453 264480 264799 264707 265104 265715
56419 265715 266461 267852 269812 271760 274016 277613 282404 286982 290757 294722 299735 305332 310538 314751
56405 314751 317782 320316 324194 330729 338695 345465 350182 354283 359054 364620 371303 379629 388277 394233
56391 394233 396082 395668 395588 396536 397907 399428 401041 402355 403191 403756 403705 402290 400008 398774 399596 401235
56375 401235 401888 401043 399017 395958 392134 388088 383795 378751 373418 369132 365826 361405 354560 346848 340716
56360 340716 336642 333601 331273 330081 329655 328933 327751 327083 327604 328922 330223 331023 331135 330464 329065 327337
$$ packed form
56466C12014j885j359k810m813n160m027l225l486m322n330o021n350l081q61
56452B60284l39j023j272p13l09o24j325j934k155j838j273r72p83q7Q74J033
56436B47544K43l80k43P5L54J179K296K426J583J472K644L260K027L19r2L97O11
56419B65715P46J391J960J948K256L597M791M578L775L965N013N597N206M213
56405C14751L031K534L878O535P966O770M717M101M771N566O683Q326Q648N956
56391C94233J849m14q0R48J371J521J613J314Q36N65n1j415k282j234Q22J639
56375D01235O53q45k026l059l824m046m293n044n333m286l306m421o845p712o132
56360C40716m074l041k328j192m26p22j182o68N21J318J301Q00J12o71j399j728
$$ plain form
56344 327337 326084 326052 327039 327784 327319 326101 325043 323862 321591 318562 316477 316329 317498 319198 321405 323850
56328 323850 325363 325111 323724 322560 322381 323069 323958 324213 323564 322792 322929 324123 326077 329146 333737 338922
56312 338922 343186 346511 350168 354405 358008 360315 361970 363399 364315 365213 367534 371628 376108 379937 383672
56297 383672 387987 392405 396123 398707 399639 398943 398630 401485 407557 413819 418141 421462 425075 428254 430316
56282 430316 432792 437262 442560 446360 448442 450398 453069 456269 460231 465272 470504 474652 477854 481202
56268 481202 484907 488358 491639 495587 500562 506314 512848 520395 528772 537587 546702 555850 564510 572831
56254 572831 581849 591922 601899 610834 619549 629341 640117 651208 663117 676792 691582 705441
56242 705441 716997 726237 733529 739279 744463 750240 756838 763530 769619 774832 779056 782503 786006 790465
$$ packed form
56344C27337j253l2R87P45m65j218j058j181k271l029k085j48J169J700K207K445
56328C23850J513k52j387j164j79O88Q89K55o49p72J37J194J954L069M591N185
56312C38922M264L325L657M237L603K307J655J429R16Q98K321M094M480L829L735
56297C83672M315M418L718K584R32o96l13K855O072O262M322L321L613L179K062
56282D30316K476M470N298L800K082J956K671L200L962N041N232M148L202L348
56268D81202L705L451L281L948M975N752O534P547Q377Q815R115R148Q660Q321
56254E72831R018J0073R977Q935Q715R792J0776J1091J1909J3675J4790J3859
56242G05441J1556R240P292N750N184N777O598O692O089N213M224L447L503M459
$$ plain form
56228 790465 796133 802802 810387 818961 828643 839802 852871 867684 883657 900887 920259 942164
56216 942164 966078 991785 1019949 1051019 1084645 1120828 1160435 1203793 1249826 1297457 1347013
56205 1347013 1399569 1455873 1516584 1582554 1654215 1731767 1816503 1910548 2014478 2126619 2245605
56194 2245605 2372099 2506761 2648121 2794034 2944049 3098662 3257046 3417009 3576411
56185 3576411 3733124 3884037 4025264 4153011 4263686 4354366 4424164 4474104 4504576 4514183
56175 4514183 4502413 4472307 4428845 4375477 4313590 4244409 4169620 4090429 4007331 3920638 3830548
56164 3830548 3737340 3642241 3546990 3451606 3353731 3251404 3145528 3038488 2931472 2824477
56154 2824477 2717815 2612054 2507293 2403965 2303680 2207998 2117065 2030457 1948409 1871112
$$ packed form
56228G90465N668O669P585Q574R682J1159J3069J4813J5973J7230J9372K1905
56216I42164K3914K5707K8164L1070L3626L6183L9607M3358M6033M7631M9556
56205A347013N2556N6304O0711O5970P1661P7552Q4736R4045J03930J12141J18986
56194B245605J26494J34662J41360J45913J50015J54613J58384J59963J59402
56185C576411J56713J50913J41227J27747J10675R0680O9798M9940L0472R607
56175D514183j1770l0106m3462n3368o1887o9181p4789p9191q3098q6693r0090
56164C830548r3208r5099r5251r5384r7875j02327j05876j07040j07016j06995
56154B824477j06662j05761j04761j03328j00285r5682r0933q6608q2048p7297
$$ plain form
56144 1871112 1797943 1728741 1664764 1607021 1554696 1506620 1463099 1424673 1390141 1357641 1326948
56133 1326948 1298995 1273795 1250476 1228848 1209510 1192845 1179003 1168167 1159683 1151847 1143773 1136645
56121 1136645 1131998 1129729 1128913 1129452 1131646 1135218 1140037 1146698 1155356 1165267 1176403 1189750 1204945 1219860
56107 1219860 1234205 1251162 1273057 1297455 1320330 1341488 1363902 1388962 1415574 1443324 1473444
56096 1473444 1506518 1541511 1577161 1612695 1647524 1681787 1716713 1753136 1790543 1828922 1870195
56085 1870195 1916227 1966686 2020575 2078350 2140705 2206968 2276971 2353171 2438884 2536011 2646549
56074 2646549 2774318 2922517 3090968 3277785 3481252 3696976 3915432 4126143 4323097
56065 4323097 4503441 4663721 4802234 4923534 5035301 5140438 5235541 5315964 5377894 5416170
$$ packed form
56144A871112p3169o9202o3977n7743n2325m8076m3521l8426l4532l2500l0693
56133A326948k7953k5200k3319k1628j9338j6665j3842j0836q484p836q074p128
56121A136645m647k269q16N39K194L572M819O661Q658R911J1136J3347J5195J4915
56107A219860J4345J6957K1895K4398K2875K1158K2414K5060K6612K7750L0120
56096A473444L3074L4993L5650L5534L4829L4263L4926L6423L7407L8379M1273
56085A870195M6032N0459N3889N7775O2355O6263P0003P6200Q5713R7127J10538
56074B646549J27769J48199J68451J86817K03467K15724K18456K10711J96954
56065D323097J80344J60280J38513J21300J11767J05137R5103Q0423O1930L8276
$$ plain form
56055 5416170 5425615 5406221 5363826 5304974 5233709 5152635 5062555 4959964 4838452 4694142 4528032
56044 4528032 4343654 4145783 3941570 3739259 3544569 3360471 3190281 3037849 2904423
56035 2904423 2788231 2687638 2602182 2530583 2470498 2420438 2379477 2345443 2316135 2291758 2273109
56024 2273109 2257901 2242313 2225735 2210409 2196574 2181828 2165489 2149909 2136911 2126217 2117793
56013 2117793 2112540 2110181 2109395 2110371 2114483 2121565 2130267 2140813 2154467 2170812 2188568 2208353 2231409
56000 2231409 2256626 2282351 2309981 2341810 2376501 2410987 2445604 2482658 2521102 2558022 2594603
55989 2594603 2634945 2679237 2723852 2768200 2815533 2866562 2918239 2969770 3024039 3081940 3140819
55978 3140819 3199832 3261521 3326960 3394660 3465375 3542511 3626359 3713283 3801998 3895388 3994764
$$ packed form
56055E416170R445j9394m2395n8852p1265q1074r0080j02591j21512j44310j66110
56044D528032j84378j97871k04213k02311j94690j84098j70190j52432j33426
56035B904423j16192j00593q5456p1599o0085n0060m0961l4034k9308k4377j8649
56024B273109j5208j5588j6578j5326j3835j4746j6339j5580j2998j0694q424
56013B117793n253k359p86R76M112P082Q702J0546J3654J6345J7756J9785K3056
56000B231409K5217K5725K7630L1829L4691L4486L4617L7054L8444L6920L6581
55989B594603M0342M4292M4615M4348M7333N1029N1677N1531N4269N7901N8879
55978C140819N9013O1689O5439O7700P0715P7136Q3848Q6924Q8715R3390R9376
$$ plain form
55967 3994764 4097721 4203211 4313562 4429977 4551068 4677035 4810136 4949982 5093633
55958 5093633 5241254 5396247 5559213 5727658 5902412 6088137 6286827 6497180 6721047
55949 6721047 6963616 7226406 7507122 7807222 8132160 8483365 8857886 9256915 9686007
55940 9686007 10145552 10629965 11138093 11675303 12243549 12839393 13464632 14128847 14837901
55931 14837901 15589204 16381304 17218268 18101657 19029236 20005897 21045469 22157342 23341165
55922 23341165 24597679 25932938 27347712 28835471 30396697 32044235 33790486 35642210
55914 35642210 37612726 39725621 42001016 44451719 47097437 49967594 53085805 56469508
55906 56469508 60151578 64185527 68626422 73531135 78987404 85120913 92064763 99944763
$$ packed form
55967C994764J02957J05490J10351J16415J21091J25967J33101J39846J43651
55958E093633J47621J54993J62966J68445J74754J85725J98690K10353K23867
55949F721047K42569K62790K80716L00100L24938L51205L74521L99029M29092
55940I686007M59545M84413N08128N37210N68246N95844O25239O64215P09054
55931A4837901P51303P92100Q36964Q83389R27579R76661J039572J111873J183823
55922B3341165J256514J335259J414774J487759J561226J647538J746251J851724
55914C5642210J970516K112895K275395K450703K645718K870157L118211L383703
55906E6469508L682070M033949M440895M904713N456269O133509O943850P880000
$$ plain form
55898 99944763 108900181 119086637 130646345 143709827 158443743 175065646 193805690
55891 193805690 214906922 238680460 265487841 295608206 329109003 365678914 404131871
55884 404131871 441638846 473525591 494484561 500793795 491940172 470453187 440356116
55877 440356116 405589789 369243655 333452824 299526432 268139361 239563703 213848514
55870 213848514 190894733 170502937 152452656 136554874 122632470 110488566 99917878
55863 99917878 90725737 82717959 75695421 69481576 63945590 58990113 54534074 50517694
55855 50517694 46904481 43661053 40743733 38111658 35737701 33596089 31652355 29875345
55847 29875345 28247130 26751891 25366510 24071200 22858786 21724865 20658840 19652685
$$ packed form
55898I9944763Q955418J0186456J1559708J3063482J4733916J6621903J8740044
55891A93805690K1101232K3773538K6807381L0120365L3500797L6569911L8452957
55884D04131871L7506975L1886745K0958970O309234q853623k1486985l0097071
55877D40356116l4766327l6346134l5790831l3926392l1387071k8575658k5715189
55870B13848514k2953781k0391796j8050281j5897782j3922404j2143904j0570688
55863I9917878r192141q007778p022538o213845n535986m955477m456039m016380
55855E0517694l613213l243428k917320k632075k373957k141612j943734j777010
55847B9875345j628215j495239j385381j295310j212414j133921j066025j006155
$$ plain form
55839 19652685 18708317 17827437 17002566 16225476 15495310 14810437 14160952 13537746 12941795
55830 12941795 12377019 11841096 11330545 10847561 10393839 9963730 9550993 9156784 8784037
55821 8784037 8429416 8088039 7761343 7453282 7162632 6885277 6620367 6368507 6127484
55812 6127484 5895218 5673636 5464735 5266215 5075453 4894117 4724303 4563551 4407979
55803 4407979 4256851 4110097 3965230 3821132 3681467 3550109 3426400 3308712 3199001
55794 3199001 3099557 3008356 2921456 2836793 2752098 2662914 2567155 2468639 2372244 2278615 2187340
55783 2187340 2101571 2024831 1956082 1892479 1834471 1783767 1738706 1696247 1656758 1622617 1593610
55772 1593610 1567549 1543991 1523803 1506490 1491159 1478550 1468937 1459697 1448082 1434724 1421307 1406536
$$ packed form
55839A9652685r44368q80880q24871p77090p30166o84873o49485o23206n95951
55830A2941795n64776n35923n10551m82984m53722m30109m12737l94209l72747
55821H784037l54621l41377l26696l08061k90650k77355k64910k51860k41023
55812F127484k32266k21582k08901j98520j90762j81336j69814j60752j55572
55803D407979j51128j46754j44867j44098j39665j31358j23709j17688j09711
55794C199001r9444r1201q6900q4663q4695q9184r5759r8516r6395r3629r1275
55783B187340q5769p6740o8749o3603n8008n0704m5061m2459l9489l4141k9007
55772A593610k6061k3558k0188j7313j5331j2609r613r240j1615j3358j3417j4771
$$ plain form
55760 1406536 1387665 1364536 1338889 1311072 1280602 1248780 1217694 1187528 1157418 1127959 1100455
55749 1100455 1074770 1050189 1027267 1006815 988340 971415 957052 945881 936744 928933 923702 921390
55737 921390 919310 915168 910607 908557 908824 909096 908766 908828 909237 909181 908898 908761 907499 903591 897367 889757 880481
55720 880481 869683 859779 853044 848572 843979 838797 833623 827184 817042 802643 785467 766948 748194
55707 748194 730631 714762 699217 683106 668191 656589 647410 637889 626817 614602 600992 585205
55695 585205 567856 550668 534667 519986 506453 492739 476302 456098 434274 413550 394391
55684 394391 376620 361935 352041 345545 339497 333242 328213 324706 321485 318089 315094 312416 309608 307532
55670 307532 307665 309889 312629 314785 316000 315808 314218 312350 310612 307153 300118 290696 281999 275615 271113
$$ packed form
55760A406536j8871k3129k5647k7817l0470l1822l1086l0166l0110k9459k7504
55749A100455k5685k4581k2922k0452j8475j6925j4363j1171r137p811n231k312
55737I21390k080m142m561k050K67K72l30O2M09n6k83j37j262l908o224p610r276
55720H80481j0798r904o735m472m593n182n174o439j0142j4399j7176j8519j8754
55707G48194j7563j5869j5545j6111j4915j1602r179r521j1072j2215j3610j5787
55695E85205j7349j7188j6001j4681j3533j3714j6437k0204k1824k0724j9159
55684C94391j7771j4685r894o496o048o255n029l507l221l396k995k678k808k076
55670C07532J33K224K740K156J215j92j590j868j738l459p035r422q697o384m502
$$ plain form
55655 271113 268039 266169 264444 261932 259499 258683 259385 260488 262100 265165 269381 273504 277327 281453 285493
55640 285493 288228 289232 288831 287068 284166 281209 278725 275555 270834 266081 263478 263212 264460 267655 273402
55625 273402 280341 286710 293168 301385 310644 318654 325021 331014 336426 339861 341937 344945 348957 351298
55611 351298 350486 348062 345851 343866 341597 339017 335484 329860 322673 316405 312910 312095 313466 317003 321993
55596 321993 326860 330963 335182 340298 346177 352596 359197 364467 366657 366052 364713 363808 362872 361730 360980
55581 360980 360266 358192 354570 350829 347627 343877 338646 332076 323962 313590 301856 291429 283621 276790
55567 276790 268911 259993 250830 241112 230335 219370 209633 201511 194648 188896 183962 178976 173387 167677
55553 167677 162476 157715 153285 149651 147073 145005 142904 140897 139038 136735 133691 130818 129529 130356
$$ packed form
55655B71113l074j870j725k512k433q16P02J103J612L065M216M123L823M126M040
55640B85493K735J004m01j763k902k957k484l170m721m753k603k66J248L195N747
55625B73402O939O369O458Q217R259Q010O367N993N412L435K076L008M012K341
55611C51298q12k424k211j985k269k580l533n624p187o268l495q15J371L537M990
55596C21993M867M103M219N116N879O419O601N270K190o05j339r05r36j142p50
55581C60980p14k074l622l741l202l750n231o570q114j0372j1734j0427p808o831
55567B76790p879q918r163r718j0777j0965r737q122o863n752m934m986n589n710
55553A67677n201m761m430l634k578k068k101k007j859k303l044k873j289Q27
$$ plain form
55539 130356 132542 134495 134591 132238 128495 125076 122704 120959 119470 118365 117664 117304 117652 118893 120080
55524 120080 120114 119653 120553 123201 125879 127253 128125 130185 134242 140163 147387 154822 161366 167105 173153
55509 173153 179917 186468 192033 197074 202594 209466 218704 230959 244993 257729 266662 271454 272917
55496 272917 271551 267685 261851 254151 244099 231848 218733 205980 193735 182034 171788 163814
55484 163814 157436 151007 143630 135845 128914 123796 120566 118419 116347 113860 110937 107698 104666 102865
55470 102865 102767 103470 103884 104370 106009 108600 110876 112711 115418 119512 123662 126507 128208 129623 131046
55455 131046 132446 133926 135352 136383 137247 138559 140068 140669 140052 139203 138833 138448 137462 136023 134069 130694
55439 130694 125282 118481 111355 104294 97249 90324 83718 77753 73082 70025 67685 64840 61788 59928
$$ packed form
55539A30356K186J953R6k353l743l419k372j745j489j105p01l60L48J241J187
55524A20080L4m61R00K648K678J374Q72K060M057N921P224P435O544N739O048
55509A73153O764O551N565N041N520O872R238J2255J4034J2736Q933M792J463
55496B72917j366l866n834p700j0052j2251j3115j2753j2245j1701j0246p974
55484A63814o378o429p377p785o931n118l230k147k072k487k923l239l032j801
55470A02865r8P03M14M86J639K591K276J835K707M094M150K845J701J415J423
55455A31046J400J480J426J031Q64J312J509O01o17q49l70l85r86j439j954l375
55439A30694n412o801p126p061p045o925o606n965m671l057k340k845l052j860
$$ plain form
55425 59928 59369 58546 56581 54332 52494 50469 48103 46763 47277 48168 47530 45688 44441 44371 44366 43414 41643
55408 41643 39677 37903 36375 34874 33179 31353 29370 26682 23178 20363 20086 21740 22479 20923 18972
55393 18972 18877 20183 21078 21408 22520 24862 27432 29295 30359 30910 31388 32262 33278 33403 32279 31081
55377 31081 31009 31639 31689 30719 29097 27053 24829 23122 22349 22063 22094 23434 26828 31142 34361 35637 35287
55360 35287 33518 30526 27242 24516 22004 19277 17537 18572 22156 26060 28709 30379 31659 32308 32144
55345 32144 31869 32286 33368 34492 35078 34826 33970 33449 34230 36267 38484 39776 39682 38355 36573 35607 36369
55328 36369 38583 41159 43200 44234 43932 42411 40697 40092 40952 42420 43174 42102 38732 33761 28949
55313 28949 25794 24270 23296 22167 21006 20036 19048 17571 15265 12380 10043 9589 11162 13427 15116
$$ packed form
55425E9928n59q23j965k249j838k025k366j340N14Q91o38j842j247p0nr52j771
55408D1643j966j774j528j501j695j826j983k688l504k815k77J654P39j556j951
55393A8972r5J306Q95L30J112K342K570J863J064N51M78Q74J016J25j124j198
55377C1081p2O30N0r70j622k044k224j707p73k86L1J340L394M314L219J276l50
55360C5287j769k992l284k726k512k727j740J035L584L904K649J670J280O49j64
55345C2144k75M17J082J124N86k52q56n21P81K037K217J292r4j327j782r66P62
55328C6369K214K576K041J034l02j521j714o05Q60J468P54j072l370m971m812
55313B8949l155j524r74j129j161r70r88j477k306k885k337m54J573K265J689
$$ plain form
55298 15116 16252 17389 18375 18674 18325 17724 16894 15738 14553 13488 12010 9737 7363 5844 5040 4078
55282 4078 2745 1605 1056 1103 1683 2389 2319 1235 406 1144 2832 3630 2944 1912 1518 1592 1900 2911
55264 2911 4906 7231 8995 10036 10815 11774 12890 13487 12593 10034 7043 5236 5146 6259 8132 10584
55248 10584 13045 14745 15619 16139 16181 14920 12096 8667 5895 4273 3524 3237 3415 4602 7237 10551
55232 10551 12570 11902 9368 7229 6987 8454 10620 12615 14004 14832 15386 15631 15279 14786 15315 16953
55216 16953 17902 16720 14616 13960 14988 15702 14921 13716 13564 14611 16234 17981 19402 20024 20050 20209 20558
55199 20558 20279 18920 16954 14936 13078 11828 11759 12488 12807 12273 11776 12178 13355 14900 16631 17946
55183 17946 17869 16428 15044 14823 15400 16143 17402 19549 21599 22005 20556 18579 17413 17330 17732 17827 17206
$$ packed form
55298A5116J136J137R86K99l49o01q30j156j185j065j478k273k374j519q04r62
55282D078j333j140n49M7N80P06p0j084D06P38J688P98o86j032l94P4L08J011
55264B911J995K325J764J041P79R59J116N97q94k559k991j807r0J113J873K452
55248A0584K461J700Q74N20M2j261k824l429k772j622p49k87J78J187K635L314
55232A0551K019o68k534k139k42J467K166J995J389Q28N54K45l52m93N29J638
55216A6953R49j182k104o56J028P14p81j205j52J047J623J747J421O22K6J59L49
55199B0558k79j359j966k018j858j250o9P29L19n34m97M02J177J545J731J315
55183A7946p7j441j384k21N77P43J259K147K050M06j449j977j166q3M02R5o21
$$ plain form
55166 17206 16109 14984 13777 12184 10720 10681 12551 15196 17247 18614 19941 21197 21772 21626 21386 21309
55150 21309 20940 19984 18926 18469 18665 18870 18536 17900 17786 18727 20426 22122 23215 23431 22841 22190 22613 24209
55132 24209 25292 24157 21620 20581 22669 26367 29016 29756 29638 29462 28656 26374 22980 20004 18756
55117 18756 19150 20016 20453 20529 20645 20887 21402 22626 24362 25334 24757 23757 23849 24482 23764 21530 19706 19330
55099 19330 19186 18257 17599 18508 20333 21690 22749 24612 27172 29166 29940 29763 28685 26474 23625 21210
55083 21210 19655 18551 17624 17075 16974 17060 17097 16852 16071 15170 15464 17666 20458 21750 21287 20831 21636 23017
55065 23017 23875 24520 26093 28756 31312 32534 32439 32212 33080 35278 38115 40954 43772 46584 48850 50070
55049 50070 50658 51432 52409 52878 52683 52557 52903 53018 52022 50031 47966 46578 46128 46772 48616 51312 53832
$$ packed form
55166A7206j097j125j207j593j464l9J870K645K051J367J327J256N75j46k40p7
55150B1309l69r56j058m57J96K05l34o36j14R41J699J696J093K16n90o51M23J596
55132B4209J083j135k537j039K088L698K649P40j18j76q06k282l394k976j248
55117A8756L94Q66M37P6J16K42N15J224J736R72n77j000R2O33p18k234j824l76
55099A9330j44r29o58R09J825J357J059J863K560J994P74j77j078k211k849k415
55083B1210j555j104r27n49j01Q6L7k45p81r01K94K202K792J292m63m56Q05J381
55065B3017Q58O45J573K663K556J222r5k27Q68K198K837K839K818K812K266J220
55049E0070N88P74R77M69j95j26L46J15r96j991k065j388m50O44J844K696K520
$$ plain form
55032 53832 54863 53636 50687 47774 46618 47436 48932 49871 50350 51236 52742 54144 54867 55282 56162 57712
55016 57712 59459 60845 61582 61603 61123 60689 60691 60794 60407 59856 60404 62667 65647 67939 69324 70330 70695 69470
54998 69470 66617 63334 60561 58249 56496 56238 57980 60632 62532 63156 63099 62968 63177 64392 67009 70100
54982 70100 71831 71264 69301 67742 67744 69107 70573 70795 69507 67859 67330 68329 70087 71607 72229 71625 70108
54965 70108 68871 68953 69712 69266 66984 64586 63912 64252 63256 60371 58015 58758 62317 66221 68780 70256
54949 70256 71405 72169 72238 71889 71629 71658 72298 74302 77839 81604 83865 84287 83923 83625 83428 83482 84400 86292
54931 86292 88286 89434 89423 88073 85035 80598 76146 73069 71599 71201 71572 72640 73941 74720 74600 73736
54915 73736 72535 71537 71240 71707 72647 74079 76388 79380 82022 83810 85727 88962 93077 96485 98585
$$ packed form
55032E3832J031j227k949k913j156Q18J496R39M79Q86J506J402P23M15Q80J550
55016E7712J747J386P37K1m80m34KJ03l87n51N48K263K980K292J385J006L65j225
54998F9470k853l283k773k312j753k58J742K652J900O24n7j31K09J215K617L091
54982G0100J731n67j963j559KJ363J466K22j288j648n29R99J758J520O22o04j517
54965G0108j237Q2P59m46k282k398o74L40r96k885k356P43L559L904K559J476
54949G0256J149P64O9l49k60K9O40K004L537L765K261M22l64k98j97N4R18J892
54931H6292J994J148j1j350l038m437m452l077j470l98L71J068J301P79j20q64
54915G3736j201r98k97M67R40J432K309K992K642J788J917L235M115L408K100
$$ plain form
54900 98585 100478 103492 107760 112422 116572 119831 122581 125870 130714 137306 145052 153213 161211 168659
54886 168659 175726 183288 191957 201072 209534 217721 227616 240472 255054 268900 280882 291756 302255
54873 302255 311430 317206 318225 314784 308058 298852 287329 273697 258623 242896 227056 211491 196577
54860 196577 182483 169221 157118 146913 139039 133210 129115 127093 127388 128973 129989 129651 129280 131119
54846 131119 136162 143031 148905 151936 153115 155499 161209 169659 179197 189691 202316 217179 232806
54833 232806 248229 263929 279779 293311 301470 303531 301119 295723 287519 276609 264054 251111
54821 251111 238279 225578 213083 200659 187799 174418 161419 149855 139926 131400 124600 119971
54809 119971 116731 113060 108021 102468 97698 94053 91399 90020 89960 90143 89375 88022 87445 87828 87926 87273
$$ packed form
54900I8585J893L014M268M662M150L259K750L289M844O592P746Q161P998P448
54886A68659P067P562Q669R115Q462Q187R895J2856J4582J3846J1982J0874J0499
54873C02255R175N776J019l441o726r206j1523j3632j5074j5727j5840j5565j4914
54860A96577j4094j3262j2103j0205p874n829m095k022K95J585J016l38l71J839
54846A31119N043O869N874L031J179K384N710Q450R538J0494J2625J4863J5627
54833B32806J5423J5700J5850J3532Q159K061k412n396q204j0910j2555j2943
54821B51111j2832j2701j2495j2424j2860j3381j2999j1564r929q526o800m629
54809A19971l240l671n039n553m770l645k654j379o0J83p68j353n77L83R8o53
$$ plain form
54793 87273 87208 88916 91542 93349 94009 94551 95412 95770 94855 92909 90566 87969 84910 81476 78273 76090
54777 76090 75192 74670 72770 68489 62860 58118 55555 54758 54907 55972 58104 60544 62046 62362 62584 63763
54761 63763 65532 66521 65925 64393 63402 63987 66131 69070 71973 74478 76831 79496 82593 85819 88927
54746 88927 91935 94682 96611 97504 98183 99964 103480 108421 114034 119287 122968 124751 126195 129595 135559
54731 135559 142677 149855 157819 167715 179373 191994 205781 221641 239583 258383 276626 293187
54719 293187 306956 317089 323659 327354 328400 326348 320975 312963 303688 294632 286706 279622 272149 263582
54705 263582 254856 247651 242496 238330 233841 228700 223517 219199 216522 215940 217611 221584 227644 234942
54691 234942 242399 249981 258982 270324 283037 295324 306823 318847 332568 347976 364629 382259
$$ packed form
54793H7273o5J708K626J807O60N42Q61L58r15j946k343k597l059l434l203k183
54777G6090q98n22j900m281n629m742k563p97J49J065K132K440J502L16K22J179
54761F3763J769R89n96j532r91N85K144K939K903K505K353K665L097L226L108
54746H8927L008K747J929Q93O79J781L516M941N613N253L681J783J444L400N964
54731A35559P118P178P964R896J1658J2621J3787J5860J7942J8800J8243J6561
54719B93187J3769J0133O570L695J046k052n373q012r275r056p926p084p473q567
54705B63582q726p205n155m166m489n141n183m318k677n82J671L973O060P298
54691B34942P457P582R001J1342J2713J2287J1499J2024J3721J5408J6653J7630
$$ plain form
54679 382259 400188 416900 430728 440629 446126 446944 443009 434519 421849 405604 386653 365794 343497
54666 343497 320356 297584 276452 257397 240254 225238 212863 202789 193630 184416 175795 169308
54654 169308 165553 163398 160964 157299 152933 148760 144734 140253 135668 132374 131026 130584 129777 128586 127512
54639 127512 126366 124873 123726 123689 124207 124319 124490 126064 129114 132295 134628 135940 135816 133992 131865 131650
54623 131650 133448 134858 134221 132658 132149 133074 134630 136309 137882 139066 140234 142534 146407 150917 155258
54608 155258 159761 164638 169082 172784 176986 182566 188163 191813 193654 195403 197808 200323 202776 205519
54594 205519 208079 209448 209917 211034 213439 216103 218169 220347 223864 229044 235499 242963 251389 260790
54580 260790 271425 283614 296999 310550 323681 336877 350754 364857 377963 389423 399592
$$ packed form
54679C82259J7929J6712J3828R901N497Q18l935q490j2670j6245j8951k0859k2297
54666C43497k3141k2772k1132j9055j7143j5016j2375j0074r159r214q621o487
54654A69308l755k155k434l665m366m173m026m481m585l294j348m42q07j191j074
54639A27512j146j493j147l7N18J12J71J574L050L181K333J312j24j824k127k15
54623A31650J798J410o37j563n09R25J556J679J573J184J168K300L873M510M341
54608A55258M503M877M444L702M202N580N597L650J841J749K405K515K453K743
54594B05519K560J369M69J117K405K664K066K178L517N180O455P464Q426R401
54580B60790J0635J2189J3385J3551J3131J3196J3877J4103J3106J1460J0169
$$ plain form
54569 399592 408638 415200 416875 412425 403258 392186 380749 368383 354195 338676 323206 308713
54557 308713 295506 283787 273503 264107 255253 247395 240995 235474 229756 223612 217724 212546 207870
54544 207870 203426 199255 195529 192450 190054 187661 184080 179085 174177 170956 169108 166987 163758 159795
54530 159795 155408 150694 146595 144335 143367 141405 137218 132183 128229 125437 122742 120016 118122 117301 116774
54515 116774 115899 114870 114273 114581 115921 117714 118651 117778 115577 113398 111774 110103 108147 107006 107837 110006
54499 110006 111421 110863 109378 108923 110043 111479 111878 111228 110484 110456 111417 113204 115224 116735 117651 118797
54483 118797 120894 123629 126222 128525 130905 133522 136526 140626 146335 152747 158233 162493 166839 172160
54469 172160 177852 183293 189174 196319 204000 210633 215792 220483 225521 230505 234426 236514 236338 233682
$$ packed form
54569C99592R046O562J675m450r167j1072j1437j2366j4188j5519j5470j4493
54557C08713j3207j1719j0284r396q854p858o400n521n718o144n888n178m676
54544B07870m444m171l726l079k396k393l581m995m908l221j848k121l229l963
54530A59795m387m714m099k260r68j962m187n035l954k792k695k726j894q21n27
54515A16774q75j029n97L08J340J793R37q73k201k179j624j671j956j141Q31K169
54499A10006J415n58j485m55J120J436L99o50p44k8R61J787K020J511R16J146
54483A18797K097K735K593K303K380K617L004M100N709O412N486M260M346N321
54469A72160N692N441N881P145P681O633N159M691N038M984L921K088j76k656
$$ plain form
54455 233682 228718 222082 214597 206989 199767 193164 187209 181927 177389 173506 169960 166447 162741 158645
54441 158645 154227 150107 146945 144554 142199 139916 138597 138299 137549 135307 132804 132183 133727 135744 136947
54426 136947 137605 138333 139254 140759 143697 148006 152095 154398 154849 154314 153445 152802 153163 154686 156324 157030
54410 157030 157023 157005 156832 156083 155347 155473 155856 155147 153711 153781 156647 160971 164457 165956 165312 162492 158101 153886
54392 153886 151529 151206 152023 153328 154861 156275 157422 158626 159844 160049 158376 155449 152644 150480 148673
54377 148673 147255 146394 145425 143313 140087 136808 134269 132746 132582 133569 134051 132380 129463 128087 129309
54362 129309 131203 131783 131491 131869 133312 135316 137645 139939 141270 141380 141525 142919 145209 147554 150079
54347 150079 152835 154479 153967 152905 154156 158279 163244 167684 172467 178609 185409 191446 196215 200079
$$ packed form
54455B33682m964o636p485p608p222o603n955n282m538l883l546l513l706m096
54441A58645m418m120l162k391k355k283j319k98p50k242k503o21J544K017J203
54426A36947O58P28R21J505K938M309M089K303M51n35q69o43L61J523J638P06
54410A57030pj8j73p49p36J26L83p09j436P0K866M324L486J499o44k820m391m215
54392A53886k357l23Q17J305J533J414J147J204J218K05j673k927k805k164j807
54377A48673j418q61r69k112l226l279k539j523j64R87M82j671k917j376J222
54362A29309J894N80k92L78J443K004K329K294J331J10J45J394K290K345K525
54347A50079K756J644n12j062J251M123M965M440M783O142O800O037M769L864
$$ plain form
54333 200079 203596 207484 212259 217336 221276 223367 224095 223747 221734 218056 214305 212038 210695 208191 203391
54318 203391 197168 191192 186476 183163 181036 179832 179227 178711 177620 175539 172688 169757 167298 165505 164505
54303 164505 164445 165121 165862 165964 165173 163797 162652 162674 164070 165793 166431 165775 165106 165745 167649 169542 170077
54286 170077 168900 167045 166343 168030 171817 176671 182273 188981 196382 202820 206820 208339 208279 207346 205739
54271 205739 203367 199899 195088 189506 184380 180215 176179 171519 167051 164343 163570 163034 160892 156728 151259
54256 151259 145122 138434 131372 124843 120293 118669 119472 120977 121512 120536 118523 116085 113309 109751 104917
54241 104917 98993 93225 89325 88213 89324 91262 92979 94297 95433 96283 96295 95146 93402 92088 91362
54226 91362 90070 87164 83254 80069 78478 77782 77018 76129 75593 75690 76559 78395 80989 83437 84764 84635
$$ packed form
54333B00079L517L888M775N077L940K091P28l48k013l678l751k267j343k504m800
54318B03391o223n976m716l313k127j204o05n16j091k081k851k931k459j793j000
54303A64505o0O76P41J02p91j376j145K2J396J723O38o56o69O39J904J893N35
54286A70077j177j855p02J687L787M854N602O708P401O438M000J519o0r33j607
54271B05739k372l468m811n582n126m165m036m660m468k708p73n36k142m164n469
54256A51259o137o688p062o529m550j624Q03J505N35r76k013k438k776l558m834
54241A04917n924n768l900j112J111J938J717J318J136Q50J2j149j744j314p26
54226I1362j292k906l910l185j591o96p64q89n36R7Q69J836K594K448J327j29
$$ plain form
54210 84635 83321 81412 79762 79192 79779 80816 81745 82689 83775 84619 85023 85632 87105 89018 90392 91199
54194 91199 92460 94675 96830 97487 96601 95832 96846 99447 101665 101835 100259 98511 97487 96849 96175 95657
54178 95657 95393 94938 94114 93551 93787 94350 94345 93528 92293 91116 90542 91146 92780 94302 94725 94180 93103 91201
54160 91201 88341 85933 85879 88023 89919 89638 87921 87051 88316 91093 93926 95921 97262 98656 100320
54145 100320 101677 102317 102864 104153 105759 106312 105434 104421 104543 105498 106107 105815 104767 102929 100092 96592
54129 96592 93190 90172 87158 83985 81219 79579 79116 79170 78944 78093 77050 76809 78056 80285 82071 82480
54113 82480 82065 82140 83174 84203 83869 81801 78943 76755 76059 76409 76576 75896 75101 75379 76693 77739 77781
54096 77781 77638 78293 79293 79541 79101 78975 79339 79290 78489 77697 77245 76216 73849 70788 68130 66179 65062
$$ packed form
54210H4635j314j909j650n70N87J037R29R44J086Q44M04O09J473J913J374Q07
54194I1199J261K215K155O57q86p69J014K601K218J70j576j748j024o38o74n18
54178I5657k64m55q24n63K36N63nq17j235j177n74O04J634J522M23n45j077j902
54160I1201k860k408n4K144J896k81j717q70J265K777K833J995J341J394J664
54145A00320J357O40N47J289J606N53q78j013J22R55O09k92j048j838k837l500
54129I6592l402l018l014l173k766j640m63N4k26q51j043k41J247K229J786M09
54113H2480m15P5J034J029l34k068k858k188o96L50J67o80p95K78J314J046M2
54096G7781j43O55J000K48m40j26L64m9q01p92m52j029k367l061k658j951j117
$$ plain form
54079 65062 65757 69113 74077 78130 79666 79293 78694 78850 79506 79895 79678 79217 78865 78161 76299 73451 70786
54062 70786 68903 67201 65469 64963 66811 70089 72853 74573 76156 77930 79216 79912 80885 82345 83140
54047 83140 82278 80092 77374 74343 71108 68289 66433 65424 65046 65466 66620 67731 68113 67966 67835 67769
54031 67769 67636 67839 68971 71037 73566 76274 78991 81080 81631 80516 78991 78923 81199 84783 87503 88009
54015 88009 86847 85507 84848 84954 85914 87680 89414 90251 90792 92568 95698 98491 100024 101597 104508 107660
53999 107660 108987 108504 108245 109466 111540 113696 116196 119218 121782 122684 121966 120856 120614 121794 124260
53984 124260 127527 131076 134494 137384 139439 140927 142755 145537 148881 152194 155846 160659 166383 171755
53970 171755 176264 180824 186246 192010 197282 202421 208573 216181 224659 233286 241668 249407 256094 261797
$$ packed form
54079F5062O95L356M964M053J536l73n99J56O56L89k17m61l52p04j862k848k665
54062G0786j883j702j732n06J848L278K764J720J583J774J286O96R73J460P95
54047H3140q62k186k718l031l235k819j856j009l78M20J154J111L82j47j31o6
54031F7769j33K03J132K066K529K708K717K089N51j115j525o8K276L584K720N06
54015H8009j162j340o59J06R60J766J734Q37N41J776L130K793J533J573K911L152
53999A07660J327m83k59J221K074K156K500L022K564R02p18j110k42J180K466
53984A24260L267L549L418K890K055J488J828K782L344L313L652M813N724N372
53970A71755M509M560N422N764N272N139O152P608Q478Q627Q382P739O687N703
$$ plain form
53956 261797 267034 272106 276728 280284 282206 282349 281553 281613 283845 287443 289934 289588 286722 282344 276481
53941 276481 268894 260832 254637 251352 249749 248058 245668 242658 238718 233596 228041 223200 219199 215287
53927 215287 211317 208142 206423 205803 205422 204481 202202 198119 192880 188138 185156 183924 183725 183812 183340 181618
53911 181618 179022 176824 175515 174178 172266 170999 171846 174346 176881 179073 181864 185331 187955 188348 186474
53896 186474 183060 179171 176656 177401 181248 185750 188797 190522 192013 193420 194489 195775 197861 200059
53882 200059 201478 203048 206891 213661 221769 229402 236141 242531 249320 257350 266964 276964 285301 291386
53868 291386 296640 301997 306040 306876 305187 303992 305417 308757 311789 313181 313420 314162 316914 321802 327350
53853 327350 331888 335314 339104 344469 351055 357707 364005 370557 378085 386795 396611 407417 418755 429527
$$ packed form
53956B61797N237N072M622L556J922J43p96O0K232L598K491l46k866m378n863
53941B76481p587q062o195l285j603j691k390l010l940n122n555m841m001l912
53927B15287l970l175j719o20l81r41k279m083n239m742k982j232j99Q7m72j722
53911A81618k596k198j309j337j912j267Q47K500K535K192K791L467K624L93j874
53896A86474l414l889k515P45L847M502L047J725J491J407J069J286K086K198
53882B00059J419J570L843O770Q108P633O739O390O789Q030R614J0000Q337O085
53868B91386N254N357M043Q36j689j195J425L340L032J392K39P42K752M888N548
53853C27350M538L426L790N365O586O652O298O552P528Q710R816J0806J1338J0772
$$ plain form
53839 429527 438472 444995 449293 451539 451342 448348 443202 437294 431559 426014 420591 415644 411186 406316
53825 406316 400148 392930 385501 377925 369652 360905 352792 345657 338205 328923 317906 306747 296905 288665
53811 288665 281397 274440 267704 261527 255878 249908 242822 235242 229016 225241 222999 220362 216252 210988
53797 210988 205528 200616 196282 191778 186365 180449 175401 171865 169046 166187 163892 162965 162703 161655 159810
53782 159810 158626 158889 159768 160219 160151 159895 159562 159427 159987 161097 161798 161553 160980 160895 161347 162138 163490 165474
53764 165474 167283 167877 167057 165342 163164 160735 158395 156554 155581 156060 158577 162820 167430 171424 175178
53749 175178 179377 183625 187046 189688 192231 194654 196363 197492 198892 200873 203193 206407 211825 219647
53735 219647 228298 236247 243501 250645 257489 263660 269835 277210 286015 295336 304039 311091 315457 316857
$$ packed form
53839D29527Q945O523M298K246j97k994n146n908n735n545n423m947m458m870
53825D06316o168p218p429p576q273q747q113p135p452r282j1017j1159r842q240
53811B88665p268o957o736o177n649n970p086p580o226l775k242k637m110n264
53797B10988n460m912m334m504n413n916n048l536k819k859k295r27k62j048j845
53782A59810j184K63Q79M51o8k56l33j35N60J110P01k45n73q5M52P91J352J984
53764A65474J809N94q20j715k178k429k340j841r73M79K517M243M610L994L754
53749A75178M199M248L421K642K543K423J709J129J400J981K320L214N418P822
53735B19647Q651P949P254P144O844O171O175P375Q805R321Q703P052M366J400
$$ plain form
53721 316857 316603 316683 317852 319426 320959 323031 326033 329174 331369 332427 332595 331565 328919 325154 321124
53706 321124 316463 309842 301318 293331 288302 285741 282833 277745 271248 264945 259156 253266 247265 241854
53692 241854 237403 233791 231051 229121 226996 223252 217832 212432 208561 206002 203723 201542 199999 199088
53678 199088 198173 196982 195845 194967 194229 193711 193646 193777 193487 192807 192557 193253 194514 195911 197756 200543 204072
53661 204072 207659 210875 213579 215554 216641 217157 217859 219500 222498 226612 230729 233413 234191 234066 234482
53646 234482 236053 238535 241471 244348 246680 248601 250936 253962 256621 257867 258417 260061 263399 267420
53632 267420 271157 274439 276951 278199 279069 281945 288157 296176 303280 308240 311430 313269 313974 314492 316206
53617 316206 319524 323678 327942 332268 336576 340108 341764 340868 337813 334276 332332 332688 334093 335042 335482
$$ packed form
53721C16857k54Q0J169J574J533K072L002L141K195J058J68j030k646l765m030
53706C21124m661o621q524p987n029k561k908n088o497o303n789n890o001n411
53692B41854m451l612k740j930k125l744n420n400l871k559k279k181j543r11
53678A99088r15j191j137q78p38n18o5J31k90o80k50O96J261J397J845K787L529
53661B04072L587L216K704J975J087N16P02J641K998M114M117K684P78j25M16
53646B34482J571K482K936K877K332J921K335L026K659J246N50J644L338M021
53632B67420L737L282K512J248Q70K876O212Q019P104M960L190J839P05N18J714
53617C16206L318M154M264M326M308L532J656q96l055l537j944L56J405R49M40
$$ plain form
53602 335482 336123 336829 337070 337438 339057 341396 342398 341251 339524 338778 338447 337098 334724 332536 331170 330303
53586 330303 329662 329322 329171 329023 329206 330319 332423 335003 337550 339695 341031 341444 341465 341763 342465 343489 345188
53569 345188 347949 351337 354416 356879 359175 361650 364361 367677 372050 376984 381123 383866 386156 389187
53555 389187 392994 396996 401313 406527 412280 417101 420045 421969 424713 429268 435225 441939 449630 458842
53541 458842 469108 478850 486940 493923 501259 509622 518502 527285 535988 544798 553605 562373 571366 580436
53527 580436 588571 594881 599756 604189 608123 610571 611693 613540 617783 623350 627525 629222 629957 631456
53513 631456 633667 635806 638272 642160 647218 651538 653625 653975 654226 655209 656264 656277 655055 653580 652848 652573
53497 652573 651493 649175 646908 646131 646419 646036 644488 643483 644969 648987 653857 657856 660229 661185 661510
$$ packed form
53602C35482O41P06K41L68J619K339J002j147j727p46l31j349k374k188j366q67
53586C30303o41l40j51j48J83J113K104K580K547K145J336M13K1K98P02J024J699
53569C45188K761L388L079K463K296K475K711L316M373M934M139K743K290L031
53555C89187L807M002M317N214N753M821K944J924K744M555N957O714P691R212
53541D58842J0266R742Q090O983P336Q363Q880Q783Q703Q810Q807Q768Q993R070
53527E80436Q135O310M875M433L934K448J122J847M243N567M175J697P35J499
53513F31456K211K139K466L888N058M320K087L50K51R83J055J3j222j475p32k75
53497F52573j080k318k267p77K88l83j548j005J486M018M870L999K373R56L25
$$ plain form
53482 661510 661980 662722 663396 664245 666441 670970 677481 684598 691052 696282 700529 704876 710815 719073 728994
53467 728994 739391 749818 760827 773402 788438 806184 825588 844739 862683 880573 900381
53456 900381 922825 947087 972140 997452 1022682 1047744 1073341 1100738 1130763 1163391 1198129
53445 1198129 1234256 1270867 1307369 1344000 1381473 1420392 1461487 1505794 1553563 1603251 1652767
53434 1652767 1701598 1750619 1800054 1849182 1898283 1948923 2001219 2052257 2098867 2141343 2183021
53423 2183021 2226467 2271407 2316367 2360969 2405977 2451844 2497985 2543383 2587513 2630586 2672918
53412 2672918 2714182 2753465 2790114 2824281 2856398 2886363 2913580 2937731 2959200 2978584 2995937
53401 2995937 3010714 3022627 3032436 3041396 3049685 3055782 3057841 3055269 3048327 3036714 3019764 2998134 2974021
$$ packed form
53482F61510M70P42O74Q49K196M529O511P117O454N230M247M347N939Q258R921
53467G28994J0397J0427J1009J2575J5036J7746J9404J9151J7944J7890J9808
53456I00381K2444K4262K5053K5312K5230K5062K5597K7397L0025L2628L4738
53445A198129L6127L6611L6502L6631L7473L8919M1095M4307M7769M9688M9516
53434A652767M8831M9021M9435M9128M9101N0640N2296N1038M6610M2476M1678
53423B183021M3446M4940M4960M4602M5008M5867M6141M5398M4130M3073M2332
53412B672918M1264L9283L6649L4167L2117K9965K7217K4151K1469J9384J7353
53401B995937J4777J1913R809Q960Q289O097K059k572o942j1613j6950k1630k4113
$$ plain form
53388 2974021 2949136 2923281 2895477 2865547 2833760 2799760 2763035 2724192 2684783 2645937 2607847
53377 2607847 2570340 2533026 2494943 2455054 2413459 2371567 2330895 2292139 2255435 2220842 2188289
53366 2188289 2157614 2129020 2103128 2080260 2060040 2041947 2026047 2012918 2003110 1996926 1994404 1995139
53354 1995139 1998301 2003272 2010374 2020688 2035036 2053287 2074721 2098897 2125995 2156405 2190172 2226939
53342 2226939 2266290 2308056 2352385 2399616 2449984 2503341 2559319 2617950 2679916 2745765 2814944
53331 2814944 2886173 2958973 3034348 3113534 3196405 3281668 3368671 3458533 3553099 3652729 3755261
53320 3755261 3857445 3957659 4057079 4157894 4260492 4362840 4462549 4558885 4652585 4744466
53310 4744466 4834722 4922986 5008285 5089122 5164130 5232552 5293745 5346641 5390424 5425561 5453496
$$ packed form
53388B974021k4885k5855k7804k9930l1787l4000l6725l8843l9409l8846l8090
53377B607847l7507l7314l8083l9889m1595m1892m0672l8756l6704l4593l2553
53366B188289l0675k8594k5892k2868k0220j8093j5900j3129r808o184k522P35
53354A995139L162M971P102J0314J4348J8251K1434K4176K7098L0410L3767L6767
53342B226939L9351M1766M4329M7231N0368N3357N5978N8631O1966O5849O9179
53331B814944P1229P2800P5375P9186Q2871Q5263Q7003Q9862R4566R9630J02532
53320C755261J02184J00214R9420J00815J02598J02348R9709R6336R3700R1881
53310D744466R0256Q8264Q5299Q0837P5008O8422O1193N2896M3783L5137K7935
$$ plain form
53299 5453496 5475323 5491243 5501043 5504283 5499965 5486858 5464667 5434427 5397535 5354699 5305835 5250421
53287 5250421 5187709 5117135 5038921 4954080 4863757 4768913 4670676 4570423 4469279 4367977 4267333
53276 4267333 4168259 4070984 3974917 3879705 3785902 3694135 3604212 3515680 3428719 3343743 3260536
53265 3260536 3178849 3099760 3025397 2956917 2893374 2832858 2774288 2717888 2664442 2614579 2568559
53254 2568559 2526397 2488014 2453159 2421173 2391254 2363335 2338336 2316914 2298303 2281275 2266146
53243 2266146 2254628 2247419 2243085 2240022 2238493 2239699 2243581 2248848 2254949 2262744 2273109 2285898 2300589
53230 2300589 2317093 2335467 2355447 2376812 2399973 2425884 2455495 2489260 2526755 2566699 2607794
53219 2607794 2649750 2693153 2738289 2784592 2831271 2877832 2923652 2967635 3008735 3046519 3080967
$$ packed form
53299E453496K1827J5920R800L240m318j3107k2191l0240l6892m2836m8864n5414
53287E250421o2712p0574p8214q4841r0323r4844r8237j00253j01144j01302j00644
53276D267333r9074r7275r6067r5212r3803r1767q9923q8532q6961q4976q3207
53265C260536q1687p9089p4363o8480o3543o0516n8570n6400n3446m9863m6020
53254B568559m2162l8383l4855l1986k9919k7919k4999k1422j8611j7028j5129
53243B266146j1518p209m334l063j529J206L882N267O101P795J0365J2789J4691
53230B300589J6504J8374J9980K1365K3161K5911K9611L3765L7495L9944M1095
53219B607794M1956M3403M5136M6303M6679M6561M5820M3983M1100L7784L4448
$$ plain form
53208 3080967 3112217 3140803 3167493 3192182 3213233 3228627 3237768 3241847 3242640 3241323 3238179 3232929 3225237
53195 3225237 3215076 3202475 3186900 3167423 3143800 3116728 3086501 3052036 3012093 2967125 2919120
53184 2919120 2869891 2820345 2770960 2721623 2670986 2617411 2561112 2504317 2448704 2393760 2338525
53173 2338525 2283989 2232350 2184240 2138008 2091963 2046214 2001762 1958701 1916252 1874238 1833532
53162 1833532 1794716 1757055 1719381 1681678 1645138 1610799 1578775 1548780 1520633 1494010 1468469
53151 1468469 1444087 1421293 1399627 1377600 1354506 1331439 1309419 1287347 1263360 1237706 1212568
53140 1212568 1189051 1166117 1142779 1119630 1097477 1075977 1054628 1033986 1014805 996815 979183
53129 979183 961417 943019 923203 902051 881129 861788 843379 824304 804293 784495 765674
$$ packed form
53208C080967L1250K8586K6690K4689K1051J5394R141M079P93j317l144n250p692
53195C225237j0161j2601j5575j9477k3623k7072l0227l4465l9943m4968m8005
53184B919120m9229m9546m9385m9337n0637n3575n6299n6795n5613n4944n5235
53173B338525n4536n1639m8110m6232m6045m5749m4452m3061m2449m2014m0706
53162A833532l8816l7661l7674l7703l6540l4339l2024k9995k8147k6623k5541
53151A468469k4382k2794k1666k2027k3094k3067k2020k2072k3987k5654k5138
53140A212568k3517k2934k3338k3149k2153k1500k1349k0642j9181j7990j7632
53129I79183j7766j8398j9816k1152k0922j9341j8409j9075k0011j9798j8821
$$ plain form
53118 765674 747579 729969 713165 697484 683037 669993 658284 647127 635658 623982 612788
53107 612788 602013 590654 577916 563893 549289 535167 522674 512156 502684 493319 484596 477668
53095 477668 472225 466513 459529 451965 444800 438217 432263 427255 422721 417053 409147 399912 391486 385424
53081 385424 381992 380411 379160 376779 373252 370198 368953 368815 367875 365341 362293 360179 359150 358037 355713
53066 355713 352345 349299 347758 347619 347912 347893 347118 344931 341078 336877 334433 334174 334181 332573 329560 326487
53050 326487 323952 321839 320183 318832 317016 314555 312781 312837 313543 312554 309435 306028 303750 302135 300347
53035 300347 298519 297001 295579 294216 293476 293511 293657 293757 294805 297367 300420 302860 305255 308751 313028
53020 313028 316946 320815 326152 332906 338648 341332 341652 341695 342081 341530 338938 334835 330668 327221 324014
$$ packed form
53118G65674j8095j7610j6804j5681j4447j3044j1709j1157j1469j1676j1194
53107F12788j0775j1359j2738j4023j4604j4122j2493j0518r472r365q723o928
53095D77668n443n712o984p564p165o583n954n008m534n668p906r235q426o062
53081C85424l432j581j251k381l527l054j245j38r40k534l048k114j029j113k324
53066C55713l368l046j541j39K93j9p75k187l853m201k444k59Pj608l013l073
53050C26487k535k113j656j351j816k461j774N6P06r89l119l407k278j615j788
53035C00347j828j518j422j363p40L5J46J00J048K562L053K440K395L496M277
53020C13028L918L869N337O754N742K684L20M3L86n51k592m103m167l447l207
$$ plain form
53005 324014 320076 315226 310464 306846 304059 300569 295322 288857 282484 276898 271951 267276 262601 257857
52991 257857 253550 250646 249311 247989 244638 239027 233082 228812 226445 224774 222613 219511 215675 211749
52977 211749 208433 205924 203905 202285 201512 201727 201935 200647 197452 193608 190879 189866 189548 188569 186945
52962 186945 186183 187384 189562 190482 189072 186284 183613 181709 180722 180890 181991 182954 182940 182333 181842 181130 179359
52945 179359 176812 174912 174674 175961 178210 180903 183184 183983 182946 180787 178623 177474 178236 181153 185019
52930 185019 187689 187963 186645 185642 186383 188975 192055 193412 191705 188054 185256 185034 186658 188417 189504
52915 189504 189998 190019 189801 189967 190914 192296 193759 195553 197698 199188 199104 198168 198036 199100 200057 199938 199606
52898 199606 200612 202997 204823 204053 200825 197723 197529 200631 204942 208457 211240 214577 218925 223551 227850
$$ packed form
53005C24014l938m850m762l618k787l490n247o465o373n586m947m675m675m744
52991B57857m307k904j335j322l351n611n945m270k367j671k161l102l836l926
52977B11749l316k509k019j620p73K15K08j288l195l844k729j013l18r79j624
52962A86945p62J201K178R20j410k788k671j904r87J68J101R63j4o07m91p12j771
52945A79359k547j900k38J287K249K693K281P99j037k159k164j149P62K917L866
52930A85019K670K74j318j003P41K592L080J357j707l651k798k22J624J759J087
52915A89504M94K1k18J66R47J382J463J794K145J490q4r36j32J064R57j19l32
52898A99606J006K385J826p70l228l102j94L102M311L515K783L337M348M626M299
$$ plain form
52883 227850 232041 236541 241331 246030 250147 253388 256236 259969 265333 271362 276360 280118 284232 290084
52869 290084 297353 304767 311311 316182 318597 318673 317949 317921 318036 316097 310904 303910 297898 294359 292505 290657
52853 290657 288108 285423 283179 280934 277816 273872 270309 268197 267308 266501 265049 263245 261787 260913 260180
52838 260180 258923 256861 254409 252499 251985 253087 255315 257810 259703 260351 259546 257681 255545 253718 252236
52823 252236 251051 250662 251734 253922 255680 255893 255422 256289 259308 263116 265649 265855 263802 260062 255783
52808 255783 252693 252078 253779 256759 260364 264325 267848 269755 269752 268776 267817 266994 266039 265055 264407 264305 264811
52791 264811 265844 266811 266784 265577 264288 264205 265295 266326 266491 266410 267404 270134 274160 278530 282493 285641
52775 285641 287685 288380 287738 286053 283575 280322 276521 273120 271398 271916 274051 276634 278808 280230 280924
$$ packed form
52883B27850M191M500M790M699M117L241K848L733N364O029M998L758M114N852
52869B90084P269P414O544M871K415P6p24k8J15j939n193o994o012l539j854j848
52853B90657k549k685k244k245l118l944l563k112q89q07j452j804j458q74p33
52838B60180j257k062k452j910n14J102K228K495J893O48q05j865k136j827j482
52823B52236j185l89J072K188J758K13m71Q67L019L808K533K06k053l740m279
52808B55783l090o15J701K980L605L961L523J907lr76r59q23r55r84o48j02N06
52791B64811J033R67k7j207j289q3J090J031J65q1R94K730M026M370L963L148
52775B85641K044O95o42j685k478l253l801l401j722N18K135K583K174J422O94
$$ plain form
52760 280924 281255 281756 282621 283396 283379 282357 280930 280313 281780 285797 291302 296043 298175 297598 295723 294163
52744 294163 293880 295123 297300 298784 297587 292940 286132 279436 274185 270022 265840 261067 256040 251424
52730 251424 247473 243695 239142 233127 225942 218802 213025 209151 206833 205284 203683 201358 198086 194430
52716 194430 191555 190432 191034 192173 192037 189244 183962 178128 174052 172478 172191 171592 170193 168323 166082
52701 166082 163280 160071 156842 153535 149797 145835 142376 139616 136892 133760 130881 129387 129725 131419
52687 131419 133552 135122 135290 133865 131448 128762 125923 122673 119171 116151 114263 113467 113017 111833 109083
52672 109083 104765 99903 96036 94313 94843 96612 98101 98462 98385 99467 102400 106033 108500 109048 108392 107624
52656 107624 107328 107643 108456 109343 109795 109801 109912 110502 111149 111029 109841 108154 106781 105952 105217 104249 103509 103719
$$ packed form
52760B80924L31N01Q65P75j7j022j427o17J467M017N505M741K132n77j875j560
52744B94163k83J243K177J484j197m647o808o696n251m163m182m773n027m616
52730B51424l951l778m553o015p185p140n777l874k318j549j601k325l272l656
52716A94430k875j123O02J139j36k793n282n834m076j574k87n99j399j870k241
52701A66082k802l209l229l307l738l962l459k760k724l132k879j494L38J694
52687A31419K133J570J68j425k417k686k839l250l502l020j888p96m50j184k750
52672A09083m318m862l867j723N30J769J489L61p7J082K933L633K467N48o56p68
52656A07624k96L15Q13Q87M52OJ11N90O47j20j188j687j373q29p35r68p40K10
$$ plain form
52638 103719 104683 105164 104305 102699 101613 101520 102080 103222 105257 107881 109989 110851 110690 109832 108165 106091
52622 106091 105171 106764 110282 113670 115573 116322 116961 118199 120490 124187 128946 133323 135599 135215 133355
52607 133355 132193 133376 136922 141509 145881 149734 153088 155465 156478 156868 157834 159249 159683 158570 157226
52592 157226 157021 157505 157349 156475 156023 156525 157272 157452 156937 155880 154369 152697 151259 149965 148338 146229
52576 146229 143924 141601 139370 137684 136892 136421 135409 134115 133516 133450 132665 131110 130525 131735 132851 131534
52560 131534 127895 123734 120008 116914 115569 117140 120323 121959 120802 118823 118105 118167 117451 115986 115096
52545 115096 115346 116104 116665 116770 116372 115812 115880 116870 117970 118372 118535 119522 121404 123237 124335 124713 124527 124076
52527 124076 124121 125210 126744 127769 128643 130619 133598 135752 136105 136275 138528 142886 147377 150716 153526
$$ packed form
52638A03719R64M81q59j606j086r3N60J142K035K624K108Q62j61q58j667k074
52622A06091r20J593L518L388J903P49O39J238K291L697M759M377K276l84j860
52607A33355j162J183L546M587M372L853L354K377J013L90R66J415M34j113j344
52592A57226k05M84j56q74m52N02P47J80n15j057j511j672j438j294j627k109
52576A46229k305k323k231j686p92m71j012j294n99o6p85j555n85J210J116j317
52560A31534l639m161l726l094j345J571L183J636j157j979p18O2p16j465q90
52545A15096K50P58N61J05l98n60O8R90J100M02J63R87J882J833J098L78j86m51
52527A24076M5J089J534J025Q74J976K979K154L53J70K253M358M491L339K810
$$ plain form
52512 153526 156896 160820 164420 166911 167958 167632 166573 165966 166886 169570 173413 177558 181438 184940 188264
52497 188264 191565 194623 196915 198161 198781 199649 201251 203093 204114 203829 202967 202718 203325 203816 203309 202108
52481 202108 201026 200051 198618 197228 197646 200830 205387 209006 211016 212560 214455 216075 216681 216753 217239 218118
52465 218118 218550 218160 217416 216772 216063 214905 213434 212456 212835 214499 216045 215873 213900 211598 210001 208512
52449 208512 206387 204493 204268 205356 205861 205031 204129 204256 204797 204902 205152 206480 208349 209383 209403 209481 210195
52432 210195 211033 211485 211619 211440 210779 210105 210458 211985 213375 213374 212311 211485 211431 211547 211291 211082 211844 214021
52414 214021 217188 220377 222623 223429 223071 222581 223126 225019 227336 228836 229242 229200 229023 228259 226904 226167 227098
52397 227098 228952 229934 229406 228222 226977 225288 223198 221962 222520 223989 224686 224094 223002 222106 221442 220928
$$ packed form
52512A53526L370L924L600K491J047l26j059o07R20K684L843M145L880L502L324
52497A88264L301L058K292J246O20Q68J602J842J021k85q62k49O07M91n07j201
52481B02108j082r75j433j390M18L184M557L619K010J544J895J620O06P2M86Q79
52465B18118M32l90p44o44p09j158j471r78L79J664J546j72j973k302j597j489
52449B08512k125j894k25J088N05q30r02J27N41J05K50J328J869J034K0P8P14
52432B10195Q38M52J34j79o61o74L53J527J390jj063q26n4J16k56k09P62K177
52414B14021L167L189K246Q06l58m90N45J893K317J500M06m2j77p64j355p37R31
52397B27098J854R82n28j184j245j689k090j236N58J469O97n92j092q96o64n14
$$ plain form
52381 220928 220577 220199 219683 219525 220275 221500 222140 222053 222276 223364 224391 224321 223750 224252 226084 227446 226481 223550
52363 223550 221028 220909 222952 225297 226605 227131 227785 228658 228982 228310 227189 226550 226792 227566 228157 227927 226753
52346 226753 225293 224640 225475 227590 230271 232809 234496 234629 233122 231045 229960 230502 231944 233409 235079
52331 235079 237792 241527 244960 246760 247005 246918 247403 248418 249789 251837 254686 257449 258978 259426 260314 262790
52315 262790 266340 269497 271317 271789 271325 270557 270524 272373 276595 282669 289428 295599 300230 303102 304880
52300 304880 306606 308875 311540 314129 316447 318906 322383 327452 333504 338923 342612 345158 347961 351380
$$ packed form
52381B20928l51l78n16j58P50J225O40q7K23J088J027p0n71N02J832J362r65k931
52363B23550k522j19K043K345J308N26O54Q73L24o72j121o39K42P74N91k30j174
52346B26753j460o53Q35K115K681K538J687J33j507k077j085N42J442J465J670
52331B35079K713L735L433J800K45q7M85J015J371K048K849K763J529M48Q88K476
52315B62790L550L157J820M72m64p68l3J849M222O074O759O171M631K872J778
52300C04880J726K269K665K589K318K459L477N069O052N419L689K546K803L419
$$ [...]
##END NTUPLES=NMR SPECTRUM
##END=
