##TITLE=coffee_type CCPA01-ROVE100E_95-5%
COFFEE_meoh_noesyp64 COFFEE_meoh {C:\Bruker\TOPSPIN} Administrator 12
##JCAMPDX= 6.0         $$ Bruker NMR JCAMP-DX V2.0
##DATA TYPE= NMR SPECTRUM
##DATA CLASS= NTUPLES
##ORIGIN= Bruker BioSpin GmbH
##OWNER= Administrator
$$ 1.72 TOPSPIN		Version 2.1
$$ 2012-05-18 15:52:20.323 -0700  Administrator@X
$$ Compression mode = diff/dup
##.OBSERVE FREQUENCY= 400.13188235
##.OBSERVE NUCLEUS= ^1H
##.ACQUISITION MODE= SIMULTANEOUS (DQD)
##.ACQUISITION SCHEME= undefined
##.AVERAGES= 64
##.DIGITISER RES= 22
##SPECTROMETER/DATA SYSTEM= spect
##.PULSE SEQUENCE= noesygpps1d.comp
##.SOLVENT NAME= COFFEE_meoh
##.SHIFT REFERENCE= INTERNAL, COFFEE_meoh, 1, 14.98061
##AUDIT TRAIL= $$ (NUMBER, WHEN, WHO, WHERE, PROCESS, VERSION, WHAT)
$$ ##TITLE= Audit trail, TOPSPIN		Version 2.1
$$ ##JCAMPDX= 5.01
$$ ##ORIGIN= Bruker BioSpin GmbH
$$ ##OWNER= Administrator
$$ $$ C:\Bruker\TOPSPIN/data/Administrator/nmr/12-COFFEE-2502/222/pdata/1/auditp.txt
$$ ##AUDIT TRAIL=  $$ (NUMBER, WHEN, WHO, WHERE, PROCESS, VERSION, WHAT)
(   1,<2012-02-25 21:42:30.797 -0500>,<Administrator>,<TOPSPIN>,<go>,<TOPSPIN 2.1>,
      <created by zg
	started at 2012-02-25 21:31:00.594 -0500,
	POWCHK enabled, PULCHK disabled,
       configuration hash MD5:
       B0 76 FB 9C 50 81 44 7D 18 B3 26 32 4E 60 AD 96
       data hash MD5: 64K
       D0 D5 54 AA B2 29 4F CE 11 84 F5 CD B1 12 7D 5E>)
(   2,<2012-02-25 21:42:33.484 -0500>,<Administrator>,<TOPSPIN>,<proc1d>,<TOPSPIN 2.1>,
      <Start of raw data processing
       efp LB = 0.3 FT_mod = 6 PKNL = 1 PHC0 = 0 PHC1 = 0 SI = 128K 
       data hash MD5: 128K
       B4 33 40 77 F1 52 21 44 0E 1E F0 51 7B 0F 98 EE>)
(   3,<2012-02-25 21:42:34.781 -0500>,<Administrator>,<TOPSPIN>,<proc1d>,<TOPSPIN 2.1>,
      <pk PHC0 = 24.98291 PHC1 = 0 
       data hash MD5: 128K
       EF FA F6 C8 09 4A BD 45 52 8C A3 7D D4 CC 4F 74>)
(   4,<2012-02-25 21:42:35.016 -0500>,<Administrator>,<TOPSPIN>,<proc1d>,<TOPSPIN 2.1>,
      <abs ABSG = 1 
       data hash MD5: 128K
       EA D6 E5 DA 12 D3 0A E7 F9 C1 08 05 82 0D 38 89>)
(   5,<2012-02-25 21:42:35.094 -0500>,<Administrator>,<TOPSPIN>,<proc1d>,<TOPSPIN 2.1>,
      <abs ABSG = 2 
       data hash MD5: 128K
       29 31 82 3D E2 FB 02 17 5E 3B 4C C7 AD 59 E9 D4>)
(   6,<2012-02-25 21:42:35.250 -0500>,<Administrator>,<TOPSPIN>,<proc1d>,<TOPSPIN 2.1>,
      <abs ABSG = 3 
       data hash MD5: 128K
       BE 27 A5 78 7E 40 83 AB 0A F4 4A EC C1 38 AF 4A>)
(   7,<2012-02-25 21:42:35.422 -0500>,<Administrator>,<TOPSPIN>,<proc1d>,<TOPSPIN 2.1>,
      <abs ABSG = 4 
       data hash MD5: 128K
       80 B9 FA FE 36 D1 59 E5 10 D1 89 F4 AA C2 33 01>)
(   8,<2012-02-25 21:42:35.469 -0500>,<Administrator>,<TOPSPIN>,<proc1d>,<TOPSPIN 2.1>,
      <abs ABSG = 5 
       data hash MD5: 128K
       14 0E DB 5F 9D 9B 10 B6 26 31 5E A8 66 EB 70 E3>)
(   9,<2012-02-25 21:42:35.594 -0500>,<Administrator>,<TOPSPIN>,<audit>,<TOPSPIN 2.1>,
      <user comment:
       ICON-NMR User ID: Administrator
$$ [...]
150 150 150 150 150 150 150 150
##$TP07= 0
##$TPNAME0= <>
##$TPNAME1= <>
##$TPNAME2= <>
##$TPNAME3= <>
##$TPNAME4= <>
##$TPNAME5= <>
##$TPNAME6= <>
##$TPNAME7= <>
##$TPOAL= (0..7)
0.5 0.5 0.5 0.5 0.5 0.5 0.5 0.5
##$TPOFFS= (0..7)
0 0 0 0 0 0 0 0
##$TUNHIN= 0
##$TUNHOUT= 0
##$TUNXOUT= 0
##$USERA1= <user>
##$USERA2= <user>
##$USERA3= <user>
##$USERA4= <user>
##$USERA5= <user>
##$V9= 5
##$VALIST= <valist>
##$VCLIST= <CCCCCCCCCCCCCCC>
##$VD= 0
##$VDLIST= <DDDDDDDDDDDDDDD>
##$VPLIST= <PPPPPPPPPPPPPPP>
##$VTLIST= <TTTTTTTTTTTTTTT>
##$WBST= 1024
##$WBSW= 4
##$XGAIN= (0..3)
0 0 0 0
##$XL= 0
##$YL= 0
##$YMAX_a= 13367944
##$YMIN_a= -6196672
##$ZGOPTNS= <>
##$ZL1= 120
##$ZL2= 120
##$ZL3= 120
##$ZL4= 120
##$ABSF1= 14.98061
##$ABSF2= -5.57192
##$ABSG= 5
##$ABSL= 3
##$ALPHA= 0
##$AQORDER= 0
##$ASSFAC= 0
##$ASSFACI= 0
##$ASSFACX= 0
##$ASSWID= 0
##$AUNMP= <proc_prof1d_extract>
##$AXLEFT= 0
##$AXNAME= <>
##$AXNUC= <1H>
##$AXRIGHT= 0
##$AXTYPE= 0
##$AXUNIT= <>
##$AZFE= 0.1
##$AZFW= 0.1
##$BCFW= 0
##$BC_mod= 0
##$BYTORDP= 0
##$COROFFS= 0
##$CY= 15
##$DATMOD= 1
##$DC= 0
##$DFILT= <>
##$DTYPP= 0
##$F1P= 0
##$F2P= 0
##$FCOR= 0.5
##$FTSIZE= 131072
##$FT_mod= 6
##$GAMMA= 0
##$GB= 0
##$INTBC= 1
##$INTSCL= 1
##$ISEN= 128
##$LB= 0.3
##$LEV0= 0
##$LPBIN= 0
##$MAXI= 10000
##$MC2= 0
##$MEAN= 0
##$ME_mod= 0
##$MI= 0
##$NCOEF= 0
##$NC_proc= -3
##$NLEV= 6
##$NOISF1= 0
##$NOISF2= 0
##$NSP= 0
##$NTH_PI= 0
##$NZP= 0
##$OFFSET= 14.98061
##$PC= 1
##$PHC0= 24.98291
##$PHC1= 0
##$PH_mod= 1
##$PKNL= yes
##$PPARMOD= 0
##$PPDIAG= 0
##$PPIPTYP= 0
##$PPMPNUM= 2147483647
##$PPRESOL= 1
##$PSCAL= 4
##$PSIGN= 0
##$PYNMP= <proc.py>
##$REVERSE= no
##$SF= 400.13
##$SI= 131072
##$SIGF1= 0
##$SIGF2= 0
##$SINO= 400
##$SIOLD= 131072
##$SPECTYP= <>
##$SREGLST= <1H.CDCl3>
##$SSB= 0
##$STSI= 131072
##$STSR= 0
##$SW_p= 8223.68421052632
##$SYMM= 0
##$S_DEV= 0
##$TDeff= 65536
##$TDoff= 0
##$TI= <>
##$TILT= no
##$TM1= 0
##$TM2= 0
##$TOPLEV= 0
##$USERP1= <user>
##$USERP2= <user>
##$USERP3= <user>
##$USERP4= <user>
##$USERP5= <user>
##$WDW= 1
##$XDIM= 131072
##$YMAX_p= 475888352
##$YMIN_p= -309296074
##$CURPLOT= <Network HP LaserJet P1505>
##$CURPRIN= <$Network HP LaserJet P1505>
##$DFORMAT= <normdp>
##$LAYOUT= <+/1D_H.xwp>
##$LFORMAT= <normlp>
##$PFORMAT= <normpl>
##$SURQMSG= 1
$$ End of Bruker specific parameters
$$ ---------------------------------
##NTUPLES= NMR SPECTRUM
##VAR_NAME=  FREQUENCY,     SPECTRUM/REAL,   SPECTRUM/IMAG
##SYMBOL=    X,             R,               I
##VAR_TYPE=  INDEPENDENT,   DEPENDENT,       DEPENDENT
##VAR_FORM=  AFFN,          ASDF,            ASDF
##VAR_DIM=   131072,        131072,          131072
##UNITS=     HZ,            ARBITRARY UNITS, ARBITRARY UNITS
##FACTOR=    0.0627417313425165, 1,          1
##FIRST=     8223.62146879498, 62,           -81098
##LAST=      0,             2096,            -82046
##MIN=       0,             -309296074,      0
##MAX=       8223.62146879498, 475888352,    0
$$ Real data points
##PAGE= N=1
##DATA TABLE= (X++(R..R)), XYDATA
$$ [...]
60719A169445J1135J2117J4045J6150J7195J6518J4604J2639J1392J0840J0896
$$ 1169445 1180580 1192697 1206742 1222892 1240087 1256605 1271209 1283848 1295240 1306080 1316976
60708A316976J1703J2817J2984J1577R726R034R520R846R400R090R817J1020J1178
$$ 1316976 1328679 1341496 1354480 1366057 1375783 1384817 1394337 1404183 1413583 1422673 1432490 1443510 1454688
60695A454688R461O522L841K434K232K600L163L838M332M215L571K976K633K047
$$ 1454688 1464149 1470671 1474512 1476946 1479178 1481778 1484941 1488779 1493111 1497326 1500897 1503873 1506506 1508553
60681A508553O19j769m714p268q293p684p050p999r823j0298q923p741q363r872
$$ 1508553 1509172 1507403 1502689 1495421 1487128 1479444 1472394 1464395 1454572 1444274 1435351 1427610 1419247 1409375
60667A409375j0525j0075r308q581q007p937q063p155m923k971k666l291l590
$$ 1409375 1398850 1388775 1379467 1370886 1362879 1354942 1346879 1339724 1334801 1331830 1329164 1325873 1322283
60654A322283l845m706n228m217k603k294l264l949m052m687n981o776o742o694
$$ 1322283 1318438 1313732 1308504 1304287 1301684 1299390 1296126 1292177 1288125 1283438 1277457 1270681 1263939 1257245
60640A257245o752o129m973m434m656m609m077l828l571k111l0J98k258n096o246
$$ 1257245 1250493 1244364 1239391 1234957 1230301 1225692 1221615 1217787 1214216 1212105 1212075 1212273 1210015 1204919 1198673
60625A198673o636q160j0609j2419j3208j3770j4371j4602j4408j3990j3256j2309
$$ 1198673 1192037 1183877 1173268 1160849 1147641 1133871 1119500 1104898 1090490 1076500 1063244 1050935
60613A050935j1835j2071j2105j1174r866q974p933n643k423J14R03L53k96J47
$$ 1050935 1039100 1027029 1014924 1003750 993884 984910 976977 971334 968911 969025 969928 970281 969985 970132
60599I70132K140M847O671O871O308O117O432O874P383P778P484O732P007R050
$$ 970132 972272 977119 983790 990661 996969 1003086 1009518 1016392 1023775 1031553 1039037 1045769 1052776 1061826
60585A061826J1196J1166Q994O776N759N279M505L838M146N548P326Q474Q413
$$ 1061826 1073022 1084188 1093182 1099958 1105717 1110996 1115501 1119339 1123485 1129033 1136359 1144833 1153246
60572A153246P665P617Q953J0763J1854J2434J3457J4808J5596J5892J6777J8491
$$ 1153246 1160911 1168528 1177481 1188244 1200098 1212532 1225989 1240797 1256393 1272285 1289062 1307553
60560A307553J9892K0009J8998J7446J5877J5003J5109J4862J2325P722L695J995
$$ 1307553 1327445 1347454 1366452 1383898 1399775 1414778 1429887 1444749 1457074 1464796 1468491 1470486
60548A470486J316m26k925m269l998l602m189n306o275p307q867j0897j3181j5699
$$ 1470486 1471802 1471376 1468451 1464182 1460184 1456582 1452393 1447087 1440812 1433505 1424638 1413741 1400560 1384861
60534A384861j8019j9047j8041j5606j3163j1531j0404r034p031m490j783N95
$$ 1384861 1366842 1347795 1329754 1314148 1300985 1289454 1279050 1270016 1262985 1258495 1256712 1257307
60522A257307K092K360J692J100J630L292M900N317M760M435M975N782O141O239
$$ 1257307 1259399 1261759 1263451 1264551 1266181 1269473 1274373 1279690 1284450 1288885 1293860 1299642 1305783 1312022
60508A312022O607O963O578N597N148N820O728O628N472M281L826M026M500M980
$$ 1312022 1318629 1325592 1332170 1337767 1342915 1348735 1355463 1362091 1367563 1371844 1375670 1379696 1384196 1389176
60494A389176N165M785M075L699L927M365M763N584P204Q979R896J0179J1495
$$ 1389176 1394341 1399126 1403201 1406900 1410827 1415192 1419955 1425539 1432743 1441722 1451618 1461797 1473292
60481A473292J5188K0701K6106L0063L2930L6046M0139M4521M7760M8967M8389
$$ 1473292 1488480 1509181 1535287 1565350 1598280 1634326 1674465 1718986 1766746 1815713 1864102
60470A864102M6555M3046L6538K6390J3904J538q976j7214k2894k5090k3276j8623
$$ 1864102 1910657 1953703 1990241 2016631 2030535 2032073 2023097 2005883 1982989 1957899 1934623 1916000
60458A916000j3207p947k219M395J0815J5554J8394K0345K2280K4349K6455K8556
$$ 1916000 1902793 1894846 1892627 1897022 1907837 1923391 1941785 1962130 1984410 2008759 2035214 2063770
60446B063770L0470L2022L3526L5683L9007M3692M9948N7903O7156P7089Q7613
$$ 2063770 2094240 2126262 2159788 2195471 2234478 2278170 2328118 2386021 2453177 2530266 2617879
60435B617879R9022J11184J23654J36717J51296J67420J83680J98897K13594K29177
$$ 2617879 2716901 2828085 2951739 3088456 3239752 3407172 3590852 3789749 4003343 4232520
60425D232520K46316K64978K85370L07651L30904L53103L71412L81236L75499
$$ 4232520 4478836 4743814 5029184 5336835 5667739 6020842 6392254 6773490 7148989
60416G148989L47112K93104K15736J19867J1145j02497k10044l00712l68313m11770
$$ 7148989 7496101 7789205 8004941 8124808 8135953 8033456 7823412 7522700 7154387 6742617
60406F742617m32538m33439m19391l96646l70043l41746l12820k84653k58256
$$ 6742617 6310079 5876640 5457249 5060603 4690560 4348814 4035994 3751341 3493085
60397C493085k33514k10231j89108j70813j54848j40283j26925j14874j03520
$$ 3493085 3259571 3049340 2860232 2689419 2534571 2394288 2267363 2152489 2048969
60388B048969r2281q1846p3334o6435n9736n2983m7588m4449m2463l9856l6156
$$ 2048969 1956688 1874842 1801508 1735073 1675337 1622354 1574766 1530317 1487854 1447998 1411842
60377A411842l2202k8904k6699k5582k5049k4357k3310k2360k1550k0061j7468
$$ 1411842 1379640 1350736 1324037 1298455 1273406 1249049 1225739 1203379 1181829 1161768 1144300
60366A144300j4818j3577j3802j4175j3652j2311j0753r406q446p703o678n147
$$ 1144300 1129482 1115905 1102103 1087928 1074276 1061965 1051212 1041806 1033360 1025657 1018979 1013832
60354A013832l689l005k753j811K13K375L579L719L387K982K604K426K648L126
$$ 1013832 1010143 1007138 1004385 1002574 1002787 1005162 1008741 1012460 1015847 1018829 1021433 1023859 1026507 1029633
60340A029633L422L259K812K606L105M221N205N377N019N206O427P702P660O308
$$ 1029633 1033055 1036314 1039126 1041732 1044837 1049058 1054263 1059640 1064659 1069865 1076292 1083994 1091654 1097962
60326A097962N185N493O640P085O196M689L319J956J52j964l710m355l398r68
$$ 1097962 1103147 1108640 1115280 1122365 1128561 1133250 1136569 1138525 1138677 1136713 1133003 1128648 1125250 1124282
60312A124282J595K354P37j557k412j635o27l09m90q89j277p71J392M197N515
$$ 1124282 1125877 1128231 1128968 1127411 1124999 1123364 1122737 1122428 1121938 1121049 1119772 1119001 1120393 1124590 1130105
60297A130105M856L945M163N047N910P057Q384Q610P451O858Q347J0456J0815
$$ 1130105 1134961 1138906 1143069 1148116 1154026 1161083 1169467 1178077 1185528 1192386 1200733 1211189 1222004
60284A222004R562Q571Q251P544O509O368P002O788N250L819L501L568K993J683
$$ 1222004 1231566 1240137 1248388 1255932 1262441 1268809 1275811 1282599 1287849 1291668 1295169 1298737 1301730 1303413
60270A303413Lj307p87K285N971P288O108N265O224P099N959L651J781P6k316
$$ 1303413 1303416 1302109 1301322 1303607 1309578 1316866 1322974 1328239 1334463 1341562 1347521 1351172 1352953 1353029 1350713
60255A350713m638n756o235p214q210q082p256p002p109o299m651l640l763l876
$$ 1350713 1346075 1340319 1334084 1326870 1318660 1310578 1303322 1296320 1289211 1282912 1278261 1274621 1270858 1266982
60241A266982l048j666n17J15L73P60J986L988N376M911L178J703Q25k33j500
$$ 1266982 1263934 1262268 1261751 1261866 1262239 1262999 1264985 1268973 1274349 1279260 1282438 1284141 1284966 1284733 1283233
60226A283233k073j681r59m4J591L654M882M924N065O456Q713J0828J2469J3593
$$ 1283233 1281160 1279479 1278520 1278476 1280067 1283721 1288603 1293527 1298592 1305048 1313761 1324589 1337058 1350651
60212A350651J3836J3205J2743J3521J5227J6441J6243J5118J4400J5056J7011
$$ 1350651 1364487 1377692 1390435 1403956 1419183 1435624 1451867 1466985 1481385 1496441 1513452
60201A513452J9502K2072K4814K7454K8973K8961K8967L1141L5579M0142M3189
$$ 1513452 1532954 1555026 1579840 1607294 1636267 1665228 1694195 1725336 1760915 1801057 1844246
60190A844246M5317M7981N1592N5657N9892O4290O8794P3703P9705Q6727R3340
$$ 1844246 1889563 1937544 1989136 2044793 2104685 2168975 2237769 2311472 2391177 2477904 2571244
60179B571244R8375J02713J08382J16053J24412J31991J38491J43964J47796J49329
$$ 2571244 2669619 2772332 2880714 2996767 3121179 3253170 3391661 3535625 3683421 3832750
60169C832750J48861J47074J43686J37627J28782J18624J08438R7480Q3924O7504
$$ 3832750 3981611 4128685 4272371 4409998 4538780 4657404 4765842 4863322 4947246 5014750
60159E014750N0193L3917J8821M514p977j7000k2593k6542k9811l1295k9600k4943
$$ 5014750 5064943 5098860 5117681 5122195 5114218 5097218 5074625 5048083 5018272 4986977 4957377 4932434
60147D932434j8478j0704j526Q712J9393L0599M2912N6314P0082Q3826R7612J10902
$$ 4932434 4913956 4903252 4901726 4910438 4929831 4960430 5003342 5059656 5129738 5213564 5311176 5422078
60135E422078J22245J30687J36782J41455J44151J43006J36960J26983J14889
$$ 5422078 5544323 5675010 5811792 5953247 6097398 6240404 6377364 6504347 6619236
60126F619236J01405Q5945O7979M7965K6859N429j5583l5081n2069o6439p8660
$$ 6619236 6720641 6806586 6874565 6922530 6949389 6954818 6939235 6904154 6852085 6785646 6706986
60115F706986q8558r4794r5977r2012q4160p3883o2040m9161l5947k2991j0072
$$ 6706986 6618428 6523634 6427657 6335645 6251485 6177602 6115562 6066401 6030454 6007463 5997391
60104E997391L822J9355L5831N1572O5285P6813Q6519R4216R9001R9921R6590
$$ 5997391 6001213 6020568 6056399 6107971 6173256 6250069 6336588 6430804 6529805 6629726 6726316
60093F726316Q9335P9118O7301N5164M3390L2019K1027J1001L148j472k752j318
$$ 6726316 6815651 6894769 6962070 7017234 7060624 7092643 7113670 7124671 7127819 7126347 7123595 7122277
60081G122277K637R968K1559L6928N4440P2997R2863J14604J37873J61809J86060
$$ 7122277 7124914 7134882 7156441 7193369 7247809 7320806 7413669 7528273 7666146 7827955 8014015
60070H014015K10910K36580K63021K90102L17500L44530L70510L94986M17207
$$ 8014015 8224925 8461505 8724526 9014628 9332128 9676658 10047168 10442154 10859361
60061A0859361M35758M49403M57989M61639M59199M48542M28665M00647L66133
$$ 10859361 11295119 11744522 12202511 12664150 13123349 13571891 14000556 14401203 14767336
60052A4767336L25573K78542K25224J66867J04922M0290k6428r4105j60485k22438
$$ 14767336 15092909 15371451 15596675 15763542 15868464 15908754 15882326 15788221 15627736 15405298
60042A5405298k77203l23424l60714l88226m04295m07925m00152l83434l59952
$$ 15405298 15128095 14804671 14443957 14055731 13651436 13243511 12843359 12459925 12099973
60033A2099973l31044k98006k62575k26234j89515j52433j15522q0135m7659j8676
$$ 12099973 11768929 11470923 11208348 10982114 10792599 10640166 10524644 10444509 10396850 10378174
60023A0378174O902K8849M6131N7623O3232O3866O0183N1839L8369K0613P47j9177
$$ 10378174 10385076 10413925 10460056 10517679 10580911 10644777 10704960 10756799 10795168 10815781 10816528 10797351
60011A0797351l8402n7174p5700r3715j10860j27054j42330j56348j68311j77545
$$ 10797351 10758949 10701775 10626075 10532360 10421500 10294446 10152116 9995768 9827457 9649912
60001I649912j84241j89275j93040j94683j93052j88245j81370j72717j61232
$$ 9649912 9465671 9276396 9083356 8888673 8695621 8507376 8326006 8153289 7992057
59992G992057j46529j30129j13458r5556p4738n2164l1261j2985N848K7935N1251
$$ 7992057 7845528 7715399 7601941 7506385 7431647 7379483 7348222 7335237 7341085 7369020 7420271
59981G420271P1576Q7891J02478J16373J27677J34621J37508J36565J30301J17596
$$ 7420271 7491847 7579738 7682216 7798589 7926266 8060887 8198395 8334960 8465261 8582857
59971H582857R9947Q0010N8834L5855J0786j5677m2315o7591r0113j09800j27787
$$ 8582857 8682804 8762814 8821648 8857503 8868289 8852612 8810297 8742706 8652593 8542793 8415006
59960H415006j44213j56960j63766j64661j61190j54138j43552j30260j15610
$$ 8415006 8270793 8113833 7950067 7785406 7624216 7470078 7326526 7196266 7080656
59951G080656r9984q3091o5327m7282k8212o871J6077L8259N8425P7495R6519
$$ 7080656 6980672 6897581 6832254 6784972 6756760 6749889 6765966 6804225 6862650 6940145 7036664
59940G036664J15366J33896J52614J71071J87031J98345K04748K06918K04773
$$ 7036664 7152030 7285926 7438540 7609611 7796642 7994987 8199735 8406653 8611426
59931H611426J97711J85546J68230J45351J17096Q5215N2039J8970j3430m4513
$$ 8611426 8809137 8994683 9162913 9308264 9425360 9510575 9562614 9581584 9568154 9523641
59921I523641p3744j01188j26414j47230j60899j66804j66850j62936j55049j42302
$$ 9523641 9449897 9348709 9222295 9075065 8914166 8747362 8580512 8417576 8262527 8120225
59911H120225j24959j04696q3231o1342l8979j5859P932L1499N3284P2197Q8674
$$ 8120225 7995266 7890570 7807339 7745997 7707018 7691159 7699091 7730590 7783874 7856071 7944745
59900G944745J04253J19726J33940J44788J51320J54432J55468J54731J51630
$$ 7944745 8048998 8168724 8302664 8447452 8598772 8753204 8908672 9063403 9215033
59891I215033J45858J37858J28327J17738J06480R5261Q5327P8130P4362P3268
$$ 9215033 9360891 9498749 9627076 9744814 9851294 9946555 10031882 10110012 10184374 10257642
59881A0257642P3578P5578Q1585R3653J11396J32906J57324J85297K17020K51166
$$ 10257642 10331220 10406798 10488383 10582036 10693432 10826338 10983662 11168959 11385979 11637145
59871A1637145K86061L20825L54682L86079M13128M34387M48370M52663M44191
$$ 11637145 11923206 12244031 12598713 12984792 13397920 13832307 14280677 14733340 15177531
59862A5177531M20487L80617L25276K56316J76025Q6763q379j04557j95462k75314
$$ 15177531 15598018 15978635 16303911 16560227 16736252 16823015 16814636 16710079 16514617 16239303
59852A6239303l40783l91046m26558m48028m56292m52663m39222m18497l92561
$$ 16239303 15898520 15507474 15080916 14632888 14176596 13723933 13284711 12866214 12473653
59843A2473653l62457l28713k92224k54235k15600j76691j37976j00066o3157
$$ 12473653 12111196 11782483 11490259 11236024 11020424 10843733 10705757 10605691 10542534
59834A0542534k7127P614L9946O8998R4663J16802J34453J46154J50730J47415
$$ 10542534 10515407 10523021 10562967 10631965 10726628 10843430 10977883 11124037 11274767 11422182
59824A1422182J35634J15028Q5689M8197L684m6062r8780j51967k02791k48234
$$ 11422182 11557816 11672844 11758533 11806730 11810414 11764352 11665572 11513605 11310814 11062580
59814A1062580k86109l15978l38460l53639l60796l59850l52215l39979l24727
$$ 11062580 10776471 10460493 10122033 9768394 9407598 9047748 8695533 8355554 8030827
59805H030827l07354k88427k68414k47861k27357k07044j86447j65503j45324
$$ 8030827 7723473 7435046 7166632 6918771 6691414 6484370 6297923 6132420 5987096
59796E987096j27006j10120r3733p8762o7506o0490n5503n0641m6607m4844m4751
$$ 5987096 5860090 5749970 5656237 5577475 5509969 5449479 5393976 5343335 5296728 5251884 5207133
59785E207133m4350m2810m0826l8988l7124l5019l2721l0455k8972k9471l2210
$$ 5207133 5162783 5119973 5079147 5040159 5003035 4968016 4935295 4904840 4875868 4846397 4814187
59774D814187l5873l9259m2869m7446n1788n3662n2634n0187m7045m2246l5329
$$ 4814187 4778314 4739055 4696186 4648740 4596952 4543290 4490656 4440469 4393424 4351178 4315849
59763D315849k7693k1021j5691j1586r078p967o428k593L241R300J5016K1562
$$ 4315849 4288156 4267135 4251444 4239858 4230780 4222813 4216385 4213792 4217033 4226333 4241349 4262911
59751D262911K9337L6461M0819M3018M5970N1572N8786O5396P0538P4644P7526
$$ 4262911 4292248 4328709 4369528 4412546 4458516 4510088 4568874 4634270 4704808 4779452 4856978
59740D856978P8004P5556P1277O6558O1623N6029N0062M4722M0628L7758L6303
$$ 4856978 4934982 5010538 5081815 5148373 5209996 5266025 5316087 5360809 5401437 5439195 5475498
59729E475498L7031M0385M5694N1821N8578O7101P8486R2323J07076J22007J38062
$$ 5475498 5512529 5552914 5598608 5650429 5709007 5776108 5854594 5946917 6053993 6176000 6314062
59718F314062J56542J77529K00361K25020K51889K80369L08957L36749L63729
$$ 6314062 6470604 6648133 6848494 7073514 7325403 7605772 7914729 8251478 8615207
59709H615207L89263M11249M26775M32149M21802L89004L29573K45182J43152
$$ 8615207 9004470 9415719 9842494 10274643 10696445 11085449 11415022 11660204 11803356
59700A1803356L4112p0090j58665k24979k68047k90509k95430k85536k64262k35816
$$ 11803356 11837468 11767378 11608713 11383734 11115687 10825178 10529748 10244212 9979950 9744134
59690I744134k03988j71402j39492j08482p7892m7748j8825Q821L6406O4491R1590
$$ 9744134 9540146 9368744 9229252 9120770 9042878 8995130 8976305 8985126 9021532 9086023 9177613
59679I177613J16179J39344J63696J90135K17371K44414K71678K99523L27488
$$ 9177613 9293792 9433136 9596832 9786967 10004338 10248752 10520430 10819953 11147441
59670A1147441L55593L85107M17342M52560M90307N29950N70651O11782O53771
$$ 11147441 11503034 11888141 12305483 12758043 13248350 13778300 14348951 14960733 15614504
59661A5614504O97622P43368P89544Q34145Q75266R10923R39352R59558R70647
$$ 15614504 16312126 17055494 17845038 18679183 19554449 20465372 21404724 22364282 23334929
59652B3334929R70824R58395R34096R01281Q63702Q24424P86989P55716P33556
$$ 23334929 24305753 25264148 26198244 27099525 27963227 28787651 29574640 30330356 31063912
59643C1063912P20452P14352P12741P12439P09116O98468O77546O44410N97247
$$ 31063912 31784364 32498716 33211457 33923896 34633012 35331480 36009026 36653436 37250683
59634C7250683N34894M58015L69204K72450J73030P7118r751q4043j43837j87546
$$ 37250683 37785577 38243592 38612796 38885246 39058276 39135394 39125643 39041600 38897763 38710217
59624C8710217k13658k21487k11632j85603j45239r2335k8621M3990J23472K08382
$$ 38710217 38496559 38275072 38063440 37877837 37732598 37640263 37611642 37655632 37779104 37987486
59614C7987486K98095L91671M86635N79770O68857P52318Q26926Q87072R26799
$$ 37987486 38285581 38677252 39163887 39743657 40412514 41164832 41991758 42878830 43805629
59605D3805629R41253R25579Q73792P80472O43511M64890K49861O723k52796n14147
$$ 43805629 44746882 45672461 46546253 47326725 47970236 48435126 48684987 48691710 48438914 47924767
59595D7924767p61828r81597j162607j299086j390415j439567j451433j432048
$$ 47924767 47162939 46181342 45018735 43719649 42329234 40889667 39438234 38006186
59587C8006186j387869j324996j249633j169372j092735j026907r76962r47507
$$ 38006186 36618317 35293321 34043688 32874316 31781581 30754674 29777712 28830205
59579B8830205r42688r62268r98626j039585j074306j095783j099552j083328
$$ 28830205 27887517 26925249 25926623 24887038 23812732 22716949 21617397 20534069
59571B0534069j048650j000744r45363q86214q25392p64655p05451o48741n95486
$$ 20534069 19485419 18484675 17539312 16653098 15827706 15063051 14357600 13708859 13113373
59562A3113373n46704n02451m61540m22829l86300l52486l21482k92966k66679
$$ 13113373 12566669 12064218 11602678 11179849 10793549 10441063 10119581 9826615 9559936
59553I559936k42406k19905j99231j80853j65257j52745j43623j37922j34817
$$ 9559936 9317530 9097625 8898394 8717541 8552284 8399539 8255916 8117994 7983177
59544G983177j33019j32057j32526j34723j37707j40125j41316j41231j39849
$$ 7983177 7850158 7718101 7585575 7450852 7313145 7173020 7031704 6890473 6750624
59535F750624j37358j34221j30407j25047j17696j09498j01991r4889q6132p4638
$$ 6750624 6613266 6479045 6348638 6223591 6105895 5996397 5894406 5799517 5713385 5638747
59525E638747o2137n1507m3544l6053k6396j4496l021N457J0983J5811K1831K8951
$$ 5638747 5576610 5525103 5481559 5445506 5419110 5404614 5401593 5407050 5418033 5433844 5455675 5484626
59513E484626L5779M1116M4598M6725M8791N2328N7815O4089O9454P3375P6842
$$ 5484626 5520405 5561521 5606119 5652844 5701635 5753963 5811778 5875867 5945321 6018696 6095538
59502F095538Q1397Q8175R7379J08049J18564J28187J38083J50065J64287J78954
$$ 6095538 6176935 6265110 6362489 6470538 6589102 6717289 6855372 7005437 7169724 7348678
59492G348678J92524K05554K19902K36644K55185K74036K91891L07978L21899
$$ 7348678 7541202 7746756 7966658 8203302 8458487 8732523 9024414 9332392 9654291
59483I654291L33405L42342L48516L51263L49282L41629L29147L14058K97321
$$ 9654291 9987696 10330038 10678554 11029817 11379099 11720728 12049875 12363933 12661254
59474A2661254K77133K51326K20687J88244J55595J22056Q7997N6574L0602R369
$$ 12661254 12938387 13189713 13410400 13598644 13754239 13876295 13964292 14020866 14051468 14060837
59464A4060837r519k6199l8391m4438m4490l8857k7163r328J4040M2272P4217
$$ 14060837 14051318 14025119 13986728 13942290 13897800 13858943 13831780 13822452 13836492 13878764 13952981
59453A3952981J07277J38408J66054J89423K05767K10474K00641J76862J40872
$$ 13952981 14060258 14198666 14364720 14554143 14759910 14970384 15171025 15347887 15488759
59444A5488759R3313L4968l1478j02533j75611k48235l16498l76040m24130m59706
$$ 15488759 15582072 15617040 15585562 15483029 15307418 15059183 14742685 14366645 13942515 13482809
59434A3482809m82058m90802m86917m72701m50783m23695l93686l62048l29076
$$ 13482809 13000751 12509949 12023032 11550331 11099548 10675853 10282167 9920119 9591043
59425I591043k95347k62284k30676j99707j68533j37915j08997q1373n3933k6957
$$ 9591043 9295696 9033412 8802736 8603029 8434496 8296581 8187584 8106211 8052278 8025321
59415H025321j716K1662M4383O7264R0260J13402J36604J58727J78416J95791
$$ 8025321 8023605 8045267 8089650 8156914 8247174 8360576 8497180 8655907 8834323 9030114
59405I030114K11801K25766K35275K38636K36016K27848K13676J92853J64944
$$ 9030114 9241915 9467681 9702956 9941592 10177608 10405456 10619132 10811985 10976929
59396A0976929J29037Q4248L1803k4448q0168j32627j80608k23614k61482k93622
$$ 10976929 11105966 11190214 11222017 11197569 11117401 10984774 10804166 10580552 10319070 10025448
59386A0025448l18376l34289l42151l44307l41775l33762l20571l05020k89812
$$ 10025448 9707072 9372783 9030632 8686325 8344550 8010788 7690217 7385197 7095385
59377G095385k75007k59300k42489k25365k08282j91308j75111j60309j46446
$$ 7095385 6820378 6561078 6318589 6093224 5884942 5693634 5518523 5358214 5211768
59368E211768j32684j19096j06399r4822q4018p3532o2826n1575m0525l1144k3707
$$ 5211768 5079084 4959988 4853589 4758767 4674749 4601217 4538391 4486816 4446291 4415147 4391440
59357D391440j6699q884q00O719J4192K2307L0232L6799M2213M6682M8222M4438
$$ 4391440 4374741 4365857 4365057 4371776 4385968 4408275 4438507 4475306 4517519 4564201 4612423 4656861
59345D656861L6636K9842K8117L1389L7403M4885N3749O3678P4083Q4734R5148
$$ 4656861 4693497 4723339 4751456 4782845 4820248 4865133 4918882 4982560 5056643 5141377 5236525
59334E236525J03657J08379J09373J09251J11338J17626J28393J43043J60594
$$ 5236525 5340182 5448561 5557934 5667185 5778523 5896149 6024542 6167585 6328179
59325F328179J79607J98624K17255K36487K57468K80414L05233L32629L63328
$$ 6328179 6507786 6706410 6923665 7160152 7417620 7698034 8003267 8335896 8699224
59316H699224L96431M29902M63075M97347N33985N72371O11009O48796O84170
$$ 8699224 9095655 9525557 9988632 10485979 11019964 11592335 12203344 12852140 13536310
59307A3536310P14193P35794P47290P47601P35095P08916O71017O25450N75675
$$ 13536310 14250503 14986297 15733587 16481188 17216283 17925199 18596216 19221666 19797341
59298A9797341N23566M70512M17977L67065L18500K72701K28701J83677J35096
$$ 19797341 20320907 20791419 21209396 21576461 21894961 22167662 22396363 22580040 22715136
59289B2715136Q2949K8126l0867r7122j70952k48695l26622m03686m78921n48277
$$ 22715136 22798085 22826211 22795344 22698222 22527270 22278575 21951953 21548267 21069346 20521069
59279B0521069o06519o51559o84946p08442p21940p24732p17275p01186o78465
$$ 20521069 19914550 19262991 18578045 17869603 17147663 16422931 15705656 15004470 14326005
59270A4326005o51014o20186n86367n49630n10942m72234m35022l99394l64584
$$ 14326005 13674991 13054805 12468438 11918808 11407866 10935632 10500610 10101216 9736632
59261I736632l30261k97029k66041k38164k13306j90331j67859j45311j23139
$$ 9736632 9406371 9109342 8843301 8605137 8391831 8201500 8033641 7888330 7765191
59252G765191j02133q2767o5161m9194l4388k0160o590N437J5391K4264L3771
$$ 7765191 7663058 7580291 7515130 7465936 7431548 7411388 7404798 7410235 7425626 7449890 7483661
59241G483661M4266N4182O1882O7389P1740P5191P7024P6722P4385P0040O3622
$$ 7483661 7527927 7582109 7643991 7711380 7783120 7858311 7935335 8012057 8086442 8156482 8220104
59230H220104N5909M8425M1915L5716K9280K3619K0508K0647K3327K7592L3062
$$ 8220104 8276013 8324438 8366353 8402069 8431349 8454968 8475476 8496123 8519450 8547042 8580104
59219H580104L9814M8155N8394P0357Q3100R5566J07357J18469J28320J35419
$$ 8580104 8619918 8668073 8726467 8796824 8879924 8975490 9082847 9201316 9329636 9465055
59209I465055J37826J33750J22106J03234P9181N2841K6546J452k2092m3931o3767
$$ 9465055 9602881 9736631 9858737 9961971 10041152 10093993 10120539 10121991 10099899 10055968 9992201
59198I992201q1097r5346j06168j13446j16993j16576j12352j04998r5391q4544
$$ 9992201 9911104 9815758 9709590 9596144 9479151 9362575 9250223 9145225 9049834 8965290
59188H965290p3805o4295n5949m7851l9937l3556k9717k7669k6019k4624k4324
$$ 8965290 8891485 8827190 8771241 8723390 8683453 8649897 8620180 8592511 8566492 8541868 8517544
59177H517544k5239k6448k7215k7493k7061k5088k0812j4198n690M440J6492L1221
$$ 8517544 8492305 8465857 8438642 8411149 8384088 8359000 8338188 8323990 8318300 8322740 8339232 8370453
59165H370453M9071O9429R1206J14464J40654J70509K02443K33994K64315K94043
$$ 8370453 8419524 8488953 8580159 8694623 8835277 9005786 9208229 9442223 9706538 10000581
59155A0000581L23163L50272L73745L92089M02778M01998L86516L55353L09536
$$ 10000581 10323744 10674016 11047761 11439850 11842628 12244626 12631142 12986495 13296031
59146A3296031K50883J81322J02653J6569p4549j66649k54367l32891l99259m51938
$$ 13296031 13546914 13728236 13830889 13847458 13772909 13606260 13351893 13019002 12619743 12167805
59136A2167805m89908n12778n21448n18164n05721m86564m62378m34460m04353
$$ 12167805 11677897 11165119 10643671 10125507 9619786 9133222 8670844 8236384 7832031
59127G832031l73798l43968l15209k87829k62553k39637k18203j97288j77250
$$ 7832031 7458233 7114265 6799056 6511227 6248674 6009037 5790834 5593546 5416296
59118E416296j59204j43310j28655j14721j01944r0560p9955o9503n9379n0119
$$ 5416296 5257092 5113782 4985127 4870406 4768462 4677902 4597947 4528444 4469065 4418946
59108D418946m1895l4402k7125j9566j1737m398J800P343J3357K0066K6584L2354
$$ 4418946 4377051 4342649 4315524 4295958 4284221 4279823 4281623 4288966 4302323 4322389 4348973 4381327
59096D381327L7930M3827M9488N4127N8052O2425O7831P3754P9469Q4889R0234
$$ 4381327 4419257 4463084 4512572 4566699 4624751 4687176 4755007 4828761 4908230 4993119 5083353
59085E083353R5250R9308J02248J04472J05818J05073J01455R6211R1340Q6805
$$ 5083353 5178603 5277911 5380159 5484631 5590449 5695522 5796977 5893188 5984528 6071333
59075F071333Q0464P1141O0107M8850L7326K5771J6322J0466O216N53n783q827
$$ 6071333 6151797 6222938 6283045 6331895 6369221 6394992 6411314 6421780 6427996 6428549 6422766 6413939
59063F413939o817k292K017O729J3773K2984L2630M2177N2560O4217P6381Q8228
$$ 6413939 6407122 6404830 6406847 6413576 6427349 6450333 6482963 6525140 6577700 6641917 6718298 6806526
59051F806526R9599J10667J21521J32227J42858J53576J64580J75590J85550J93734
$$ 6806526 6906125 7016792 7138313 7270540 7413398 7566974 7731554 7907144 8092694 8286428
59041H286428K01070K09253K18307K26154K31088K33347K33271K28959K17081
$$ 8286428 8487498 8696751 8915058 9141212 9372300 9605647 9838918 10067877 10284958
59032A0284958J95716J65468J28088Q4968L7019j4499o7243j17954j63670k02968
$$ 10284958 10480674 10646142 10774230 10859198 10896217 10881718 10814475 10696521 10532851 10329883
59022A0329883k35855k62639k83499k98938l09747l16364l18935l17994l14314
$$ 10329883 10094028 9831389 9547890 9248952 8939205 8622841 8303906 7985912 7671598
59013G671598l08159k99664k89709k79242k67790k54330k39802k26855k16434
$$ 7671598 7363439 7063775 6774066 6494824 6227034 5972704 5732902 5506047 5289613
59004E289613k06448j94912j82768j72136j63178j54324j44708j34732j24977
$$ 5289613 5083165 4888253 4705485 4533349 4370171 4215847 4071139 3936407 3811430
58995C811430j15965j08435j02501r7002r0890q4571p8858p3509o8239o4110o1988
$$ 3811430 3695465 3587030 3484529 3387527 3296637 3212066 3133208 3059699 2991460 2927350 2865362
58984B865362o0288n6554n1051m6515m4135m2028l8424l4199l1080k8908k6288
$$ 2865362 2805074 2748520 2697469 2650954 2606819 2564791 2526367 2492168 2461088 2432180 2405892
58973B405892k2853j9404j6396j3620j1098r115p373n024j735J892N033P249Q288
$$ 2405892 2383039 2363635 2347239 2333619 2322521 2313406 2306033 2301009 2299274 2301166 2306199 2313448 2321736
58960B321736P782N638K667M38J37J422K656K476J010n57j313j191n43K51P90
$$ 2321736 2329518 2335156 2337823 2338261 2338398 2339820 2342476 2344952 2345962 2345405 2344092 2342901 2342358 2342609 2343399
58945B343399R11J089K125M184O486P999Q098O506L250r23m644o988q161q777
$$ 2343399 2344310 2345399 2347524 2351708 2358194 2366193 2374291 2380797 2384047 2383124 2378480 2371492 2363331 2354554
58931B354554q790p836o324n221m613l372o89K665N276O740P727Q967J0863J3652
$$ 2354554 2345764 2337928 2331604 2326383 2321770 2318398 2317709 2320374 2325650 2332390 2340117 2349084 2359947 2373599
58917B373599J6873J9011J8993J8031J8558K1113K3787K5321K6950L0099L3864
$$ 2373599 2390472 2409483 2428476 2446507 2465065 2486178 2509965 2535286 2562236 2592335 2626199
58906B626199L6533L8325M0533M2753M3373M2596M2641M4545M6817M7912M8227
$$ 2626199 2662732 2701057 2741590 2784343 2827716 2870312 2912953 2957498 3004315 3052227 3100454
58895C100454M8801M9740N0979N3189N6676O0446O3644O7116P2288P8976Q5366
$$ 3100454 3149255 3198995 3249974 3303163 3359839 3420285 3483929 3551045 3623333 3702309 3787675
58884C787675Q9983R2954R5620R9373J04647J10727J16864J23517J31658J40947
$$ 3787675 3877658 3970612 4066232 4165605 4270252 4380979 4497843 4621360 4753018 4893965
58874D893965J49882J58040J66865J77511J89206K00594K11561K22823K34893
$$ 4893965 5043847 5201887 5368752 5546263 5735469 5936063 6147624 6370447 6605340
58865F605340K48437K64533K83273L02984L22145L41267L61809L84179M08260
$$ 6605340 6853777 7118310 7401583 7704567 8026712 8367979 8729788 9113967 9522227
58856I522227M34796M64393M95693N26466N56411N87137O19506O52645O85667
$$ 9522227 9957023 10421416 10917109 11443575 11999986 12587123 13206629 13859274 14544941
58847A4544941P18483P50292P78717Q01111Q15657Q20552Q13122P90466P50436
$$ 14544941 15263424 16013716 16792433 17593544 18409201 19229753 20042875 20833341 21583777
58838B1583777O91727O13828N17316M03750K75311J35397j0495j55607k94163
$$ 21583777 22275504 22889332 23406648 23810398 24085709 24221106 24210611 24055004 23760841
58829B3760841m21974n34943o28665p00632p51898p85508q03874q08492q01256
$$ 23760841 23338867 22803924 22175259 21474627 20722729 19937221 19133347 18324855 17523599
58820A7523599p84390p59335p27173o90390o52754o16718n81956n47330n13353
$$ 17523599 16739209 15979874 15252701 14562311 13909557 13292839 12710883 12163553 11650200
58811A1650200m81576m52120m23544l95278l68653l44832l22921l01304k79924
$$ 11650200 11168624 10716504 10292960 9897682 9529029 9184197 8861276 8559972 8280048
58802H280048k59948k41701k24399k07813j92636j78954j65606j51723j37876
$$ 8280048 8020100 7778399 7554000 7346187 7153551 6974597 6808991 6657268 6519392
58793F519392j25148j13858j03678r4093q4280p3375o1589n0223l9923k9710j8552
$$ 6519392 6394244 6280386 6176708 6082615 5998335 5924960 5863371 5813148 5773225 5743515 5724963
58782E724963p179K791J1131J9439K9352M1048N3499O5558P6782Q7503R8204J08875
$$ 5724963 5717784 5720575 5731706 5751145 5780497 5821545 5875044 5940602 6017384 6104887 6203091 6311966
58770F311966J19334J30067J41943J54934J68049J80953J94701K10181K26670
$$ 6311966 6431300 6561367 6703310 6858244 7026293 7207246 7401947 7612128 7838798
58761G838798K42929K59075K76372K95489L16005L37483L60106L84231M09875
$$ 7838798 8081727 8340802 8617174 8912663 9228668 9566151 9926257 10310488 10720363
58752A0720363M36907M65437M96034N29412N65491O02707O38818O72636P04219
$$ 10720363 11157270 11622707 12118741 12648153 13213644 13816351 14455169 15127805 15832024
58743A5832024P33111P57174P73618P80346P75586P57014P22141O69273N97508
$$ 15832024 16565135 17322309 18095927 18876273 19651859 20408873 21131014 21800287 22397795
58734B2397795N06362L96250K69354J29789j6663j63012l02361m29674n42143
$$ 22397795 22904157 23300407 23569761 23699550 23682887 23519875 23217514 22787840 22245697
58725B2245697o37739p14348p70802q07917q27868q33059q25973q09293p85464
$$ 22245697 21607958 20893610 20122808 19314891 18487023 17653964 16827991 16018698 15233234
58716A5233234p56448p23971o89445o53666o17478n82409n49417n17364m84762
$$ 15233234 14476786 13752815 13063370 12409704 11792226 11209817 10660400 10143036 9658274
58707I658274m52918m24883m00813l77220l52023l27483l06265k87344k68488
$$ 9658274 9205356 8780473 8379660 8002440 7650417 7322934 7016669 6729325 6460837
58698F460837k50472k35465k22729k09321j94547j80454j68161j56626j45297
$$ 6460837 6210365 5974900 5752171 5542850 5348303 5167849 4999688 4843062 4697765
58689D697765j35286j27224j19985j12289j04052r5765q7841q0780p4874o9812
$$ 4697765 4562479 4435255 4315270 4202981 4098929 4003164 3915323 3834543 3759669 3689857
58679C689857o5510o2636o1182n9408n6043n2559n1071n0799m9160m6064m4290
$$ 3689857 3624347 3561711 3500529 3441121 3385078 3332519 3281448 3230649 3181489 3135425 3091135
58668C091135m5313m7319m7982m7052m5484m4026m3404m4249m6068m7585m8469
$$ 3091135 3045822 2998503 2950521 2903469 2857985 2813959 2770555 2726306 2680238 2632653 2584184
58657B584184m9295m9922m9685m9143m9573n0396m9472m6516m3880m3026m2436
$$ 2584184 2534889 2484967 2435282 2386139 2336566 2286170 2236698 2190182 2146302 2103276 2060840
58646B060840m0282l7205l4851l3276l1475k9337k7491k5985k4503k3330k2965
$$ 2060840 2020558 1983353 1948502 1915226 1883751 1854414 1826923 1800938 1776435 1753105 1730140
58635A730140k3142k3123k2794k2727k3257k3794k3142k0721j7671j6069j6384
$$ 1730140 1706998 1683875 1661081 1638354 1615097 1591303 1568161 1547440 1529769 1513700 1497316
58624A497316j6566j4701j1702r887r623r327q227o960n558l063M44L568N717
$$ 1497316 1480750 1466049 1454347 1444460 1434837 1425510 1417283 1410323 1404765 1401702 1402146 1405714 1411431
58611A411431P644R519J0453J0294R965R465P684M815K764K204J412p46k761k867
$$ 1411431 1419075 1428594 1439047 1449341 1459306 1468771 1476455 1481270 1484034 1486238 1487650 1486904 1484143 1481276
58597A481276j828j734l168n061o422o882o325m956l290j445Q67L508N949Q274
$$ 1481276 1479448 1477714 1474546 1469485 1463063 1456181 1449856 1444900 1441610 1440165 1441032 1444540 1450489 1458763
58583A458763J0947J3671J5876J8151K1332K4352K5382K5243K6923L1056L4810
$$ 1458763 1469710 1483381 1499257 1517408 1538740 1563092 1588474 1613717 1640640 1671696 1706506
58572A706506L6452L8082M2017M7205N1443N4819N8334O1136O2136O3108O7183
$$ 1706506 1742958 1781040 1823057 1870262 1921705 1976524 2034858 2095994 2158130 2221238 2288421
58561B288421P4722Q3142R0510R7083J03534J09899J16542J24421J33969J44740
$$ 2288421 2363143 2446285 2536795 2633878 2737412 2847311 2963853 3088274 3222243 3366983
58551C366983J56396J68967J82050J94527K05359K14234K21534K27570K31446
$$ 3366983 3523379 3692346 3874396 4068923 4274282 4488516 4710050 4937620 5169066
58542E169066K30706K22935K07769J86206J58216J22712Q0361L4527j1355n5639
$$ 5169066 5399772 5622707 5830476 6016682 6174898 6297610 6377971 6412498 6401143 6345504
58532F345504r6873j32464j60523j81640j97273k07618k12409k12545k09284k02847
$$ 6345504 6248631 6116167 5955644 5774004 5576731 5369113 5156704 4944159 4734875 4532028
58522D532028j93439j82673j72435j62883j52816j41411j28615j14843j01382
$$ 4532028 4338589 4155916 3983481 3820598 3667782 3526371 3397756 3282913 3181531
58513C181531r0188q2032p5647o9708o4568o0910n7964n4525n0733m7341m4023
$$ 3181531 3091343 3009311 2933664 2863956 2799388 2738478 2680514 2625989 2575256 2527915 2483892
58502B483892l9968l5506l1753k9163k7598k7236k8163k9610l0716l1732l3526
$$ 2483892 2443924 2408418 2376665 2347502 2319904 2292668 2264505 2234895 2204179 2172447 2138921
58491B138921l6300l9385m1877m3063m2915m2368m2107m1106l7885l3309l0126
$$ 2138921 2102621 2063236 2021359 1978296 1935381 1893013 1850906 1809800 1771915 1738606 1708480
58480A708480k9208k8395k5960k2894k0633j8858j7141j6445j7099j7267j5555
$$ 1708480 1679272 1650877 1624917 1602023 1581390 1562532 1545391 1528946 1511847 1494580 1479025
58469A479025j3346j2356j1695r686p186o449p723r430j0948j2871j5094j6654
$$ 1479025 1465679 1453323 1441628 1431942 1424756 1418307 1410584 1401154 1390206 1377335 1362241 1345587
58457A345587j7164j6965j6393j6030j6577j7403j6689j4294j2561j2733j2709
$$ 1345587 1328423 1311458 1295065 1279035 1262458 1245055 1228366 1214072 1201511 1188778 1176069
58446A176069j0491p593o417o244m930k983k553l546m067l792l668k958j51L531
$$ 1176069 1165578 1157985 1151568 1145324 1140394 1137411 1134858 1131312 1127245 1123453 1119785 1116827 1116676 1120207
58432A120207N037M009L300M599O423O992O374N141L356J605J060J733K256J778
$$ 1120207 1125244 1129253 1132553 1137152 1143575 1150567 1156941 1162082 1165438 1167043 1168103 1169836 1172092 1173870
58418A173870O47p56k308l388l468l311l939m671l941j846j42J25o43j801k779
$$ 1173870 1174517 1173761 1171453 1168065 1164597 1161286 1157347 1152676 1148735 1146889 1146747 1146872 1146229 1144428 1141649
58403A141649k686j347k81r21k474l228l195l513m100m154m162n163o535o814
$$ 1141649 1138963 1137616 1137335 1136414 1133940 1130712 1127517 1124004 1119904 1115750 1111588 1106425 1099890 1093076
58389A093076o139n589m833k903o67J20j47N72K667M617N768O848P861P866O914
$$ 1093076 1086937 1081348 1076515 1073612 1072945 1073065 1072918 1073490 1076157 1080774 1086542 1093390 1101251 1109117 1116031
58374A116031O042N572N339N947P634Q694P441M944L293K178N8k399l330l356
$$ 1116031 1122073 1127645 1132984 1138931 1146565 1155259 1162700 1167644 1170937 1173115 1173173 1170774 1167444 1164088
58360A164088m581o492o554m629l032k267n30K388M636O110Q684J2000J3051J1167
$$ 1164088 1159507 1153015 1146461 1141832 1138800 1136533 1136003 1138391 1143027 1149137 1157821 1169821 1182872 1194039
58346A194039R585J0610J2678J3707J4149J4877J5075J4036J2673J1591R779O525
$$ 1194039 1203624 1214234 1226912 1240619 1254768 1269645 1284720 1298756 1311429 1323020 1332799 1339324
58334A339324K668r20m097o246o693o621p951r876r515o461l587k618k173j134
$$ 1339324 1341992 1341072 1336975 1330729 1324036 1317415 1309464 1299588 1290073 1283612 1280025 1277407 1275234 1274100
58320A274100n70r78p70J026L270N246P757J0550J1637J0672J0040J1015J1756
$$ 1274100 1273530 1272552 1271782 1272808 1276078 1281324 1289081 1299631 1311268 1321940 1331980 1342995 1354751
58307A354751J0754R369R153R307Q886R063J1054J3734J5293J5667J5821J6142
$$ 1354751 1365505 1374874 1384027 1393334 1402220 1411283 1422337 1436071 1451364 1467031 1482852 1498994
58295A498994J6682J7468J7887J7424J7262J8958K1338K1455J8944J6521J5595
$$ 1498994 1515676 1533144 1551031 1568455 1585717 1604675 1626013 1647468 1666412 1682933 1698528
58284A698528J4678J2912J1752J1807J1330R367P505P113P567Q416J0343J2781
$$ 1698528 1713206 1726118 1737870 1749677 1761007 1770374 1777879 1784992 1792559 1800975 1811318 1824099
58272A824099J3648J2806J2815J5003J7689J9467K1008K2453K2474K1358K1757
$$ 1824099 1837747 1850553 1863368 1878371 1896060 1915527 1936535 1958988 1981462 2002820 2024577
58261B024577K4700K7926K9591L0457L1219L1149L0765L2156L5188L6922L6392
$$ 2024577 2049277 2077203 2106794 2137251 2168470 2199619 2230384 2262540 2297728 2334650 2371042
58250B371042L6196L7830L9241L8799L7787L7151L5725L3540L2884L4151L4636
$$ 2371042 2407238 2445068 2484309 2523108 2560895 2598046 2633771 2667311 2700195 2734346 2768982
58239B768982L3410L3091L4899L6487L6839L8525M2516M5657M6173M7052N0710
$$ 2768982 2802392 2835483 2870382 2906869 2943708 2982233 3024749 3070406 3116579 3163631 3214341
58228C214341N4883N7042N8485O0836O2953O4567O8305P4637P9492Q0689Q1969
$$ 3214341 3269224 3326266 3384751 3445587 3508540 3573107 3641412 3716049 3795541 3876230 3958199
58217C958199Q6690R2379R5788R8590J03325J08179J10733J12927J17360J22407
$$ 3958199 4044889 4137268 4233056 4331646 4434971 4543150 4653883 4766810 4884170 5006577
58207E006577J25702J28825J33876J38999J41821J43820J47183J51050J55025
$$ 5006577 5132279 5261104 5394980 5533979 5675800 5819620 5966803 6117853 6272878
58198F272878J62199J74440J88809K02766K18414K37239K55730K70953K85528
$$ 6272878 6435077 6609517 6798326 7001092 7219506 7456745 7712475 7983428 8268956
58189H268956L02241L18940L33797L50196L70939L93172M14717M39608M71218
$$ 8268956 8571197 8890137 9223934 9574130 9945069 10338241 10752958 11192566 11663784
58180A1663784N05702N38587N71895O07950O42307O70230O94474P19348P43381
$$ 11663784 12169486 12708073 13279968 13887918 14530225 15200455 15894929 16614277 17357658
58171A7357658P65622P92726Q31007Q77433R26810R81282J043815J109370J173018
$$ 17357658 18123280 18916006 19747013 20624446 21551256 22532538 23576353 24685723 25858741
58162B5858741J240485J320114J410296J505216J606395J717258J832846J947095
$$ 25858741 27099226 28419340 29829636 31334852 32941247 34658505 36491351 38438446
58154C8438446K064673K194448K337629K493548K669054K869798L091044L330584
$$ 38438446 40503119 42697567 45035196 47528744 50197798 53067596 56158640 59489224
58146E9489224L601021L914328M264932M645115N066954N552706O118113O786447
$$ 59489224 63090245 67004573 71269505 75914620 80981574 86534280 92652393 99438840
58138I9438840P603278Q609312R808747J1188055J2748502J4490522J6390299
$$ 99438840 107042118 115651430 125460177 136648232 149396734 163887256 180277555
58131A80277555J8439622K0700496K3278981K6239918K9510535L2682902L4706843
$$ 180277555 198717177 219417673 242696654 268936572 298447107 331130009 365836852
58124C65836852L3877508K8593073J8592474N563989p624865j8479820k5884746
$$ 365836852 399714360 428307433 446899907 452463896 444839031 426359211 400474465
58117D00474465k9964201l1380805l0861223k9089192k6666738k4027436k1420575
$$ 400474465 370510264 339129459 308268236 279179044 252512306 228484870 207064295
58110B07064295j8985280j6795437j4849363j3091813j1478712r999109q639853
$$ 207064295 188079015 171283578 156434215 143342402 131863690 121864581 113224728
58103A13224728p373156o189172n104221m122377l218132k365562j545395p07583
$$ 113224728 105851572 99662400 94558179 90435802 87217670 84852108 83306713 82599130
58095H2599130K08140J131165J744839J613223N22681j277233l196658m686795
$$ 82599130 82807270 83938435 85683274 87296497 87819178 86541945 83345287 78658492
58087G8658492n523432n786434n661676n303397m824087m315670l838338l411983
$$ 78658492 73135060 67348626 61686950 56383553 51559466 47243796 43405458 39993475
58079C9993475l038596k721800k458629k231845k025023j835700j665656j509839
$$ 39993475 36954879 34233079 31774450 29542605 27517582 25681882 24016226 22506387
58071B2506387j364324j234660j126037j033013r47944q72195q10128p58553p10845
$$ 22506387 21142063 19907403 18781366 17748353 16800409 15928214 15118086 14359533 13648688
58062A3648688o66156o26567n90105n53868n19707m89964m61907m32609m04960
$$ 13648688 12982532 12355965 11765860 11211992 10692285 10202321 9740414 9307805 8902845
58053H902845l82733l64147l46198l30774l20340l11887l01504k90800k82582
$$ 8902845 8520112 8155965 7809767 7478993 7158653 6846766 6545262 6254462 5971880
58044E971880k74132k61269k45667k31806k19784k07062j94301j83382j72415
$$ 5971880 5697748 5436479 5190812 4959006 4739222 4532160 4337859 4154477 3982062
58035C982062j58756j44433j33003j23510j13142j03205r6688r2281q6636q0503
$$ 3982062 3823306 3678873 3545870 3422360 3309218 3206013 3109325 3017044 2930408 2849905
58025B849905p6799p4591p0982o7222o6842o8675o7846o3334n9079n7516n7017
$$ 2849905 2773106 2698515 2627533 2560311 2493469 2424794 2356948 2293614 2234535 2177019 2120002
58014B120002n5864n4361n2516m9543m6022m3423m1579l9318l6905l5014l2495
$$ 2120002 2064138 2009777 1957261 1907718 1861696 1818273 1776694 1737376 1700471 1665457 1632962
58003A632962k8199k3910k2195k2447k2159k0930k0070j9625j8979j9132k0923
$$ 1632962 1604763 1580853 1558658 1536211 1514052 1493122 1473052 1453427 1434448 1415316 1394393
57992A394393k2343k1038j8317j7240j7853j7672j5939j3936j2070r866p986p167
$$ 1394393 1372050 1351012 1332695 1315455 1297602 1279930 1263991 1250055 1237985 1228119 1220133 1212966
57980A212966o216m027k290l098n260o232o215o856p320n498k144l3J67k00r51
$$ 1212966 1206750 1202723 1200433 1197335 1192075 1185843 1179628 1172772 1165452 1159954 1157810 1157777 1157944 1157744 1156793
57965A156793k651m197m291m225n660o964n644l131k871m738n734n408n848o819
$$ 1156793 1154142 1149945 1145654 1141429 1135769 1128805 1123161 1120030 1117159 1112421 1106687 1101279 1095431 1088612
57951A088612n895l519l114n547p862q232p952p801o557m265l032l387l380k363
$$ 1088612 1082717 1079198 1076084 1070537 1062675 1054443 1046491 1038690 1032133 1027868 1024836 1021449 1018069 1015706
57937A015706k040k680j936R98L437L160J463N72O42R12J526K492K842K097R70
$$ 1015706 1013666 1010986 1009050 1010048 1013485 1016645 1018108 1018680 1019322 1020234 1021760 1024252 1027094 1029191 1030161
57922A030161k24j997l997m870m437l975m005l812l441l802m541m201k888k275
$$ 1030161 1029937 1027940 1023943 1019073 1014636 1010661 1006656 1002844 999403 995601 991060 986859 983971 981696
57908I81696k640k440j323q51j658k470k545k513k353j248K0m67k281k686j134
$$ 981696 979056 976616 975293 974442 972784 970314 967769 965256 962903 961655 961675 961208 958927 956241 955107
57893I55107n14k734o050q175r136r514q688o630m896m193l312j931j684k857
$$ 955107 954593 951859 945809 937634 928498 918984 910296 903666 898770 894577 891265 889334 887650 884793
57879H84793k884k82K643L380L022L786M898L929O84k906n722p774q733q547q636
$$ 884793 881909 881627 884270 887650 890672 894458 899356 903285 903969 901063 895341 887567 878834 870287 861651
57864H61651j0315j2708j4011j4016j3622j2846j1276r674r127r185q567p195
$$ 861651 851336 838628 824617 810601 796979 784133 772857 763183 754056 744871 736304 729109
57852G29109n963n002l738k102l16J895M482O199O006M737L990M029M178M554
$$ 729109 723146 718144 714406 712304 711988 713883 718365 724564 730570 735307 739297 743326 747504 752058
57838G52058N697P004P255O481N901O098O516O536N873M235J799j63n22L7l67
$$ 752058 757755 764759 772014 778495 784396 790494 797010 803546 809419 813654 815453 815290 814768 814805 814438
57823H14438k494n316p529q707q972q512p746p217p114p151o883n943m220k111
$$ 814438 811944 806628 799099 790392 781420 772908 765162 757945 750831 743680 736797 730854 726634 724523
57809G24523k96R93K054K919L217L014L031L721M878O489Q835J1290J2182J0775
$$ 724523 724227 725220 727274 730193 733410 736424 739455 743176 748054 754543 763378 774668 786850 797625
57795G97625Q381O663N702M632L253J959Q24j60o30o60j362l541o389q523r694
$$ 797625 806006 812669 818371 823003 826256 828215 829039 828879 828249 827589 826227 822686 816297 807774 798080
57780G98080j0349j0140q424n919m358m427n171n587n773o144o496o302n417m139
$$ 798080 787731 777591 769167 763248 758890 754463 749292 743705 737932 731788 725292 718990 713573 709434
57766G09434k890k017j726k123l307n247p499r396j0679j1597j2258j2413j2056
$$ 709434 706544 704527 702801 700678 697371 692124 684625 675229 664550 652953 640695 628282 616226
57753F16226j1647j1429j1003r915q276o540n030l813k603r05J167K374J731K45
$$ 616226 604579 593150 582147 572232 563956 557416 552386 548573 545970 545065 546232 548606 550337 550582
57739E50582J00J930M237N817P245R236J0938J0975R238O758M586L480L758M687
$$ 550582 550682 552612 556849 562666 569911 579147 590085 601060 610298 617056 621642 625122 628880 633567
57725F33567M851L837K665K140J985K201L579N786O540M324O77j824k878m031
$$ 633567 638418 642255 644920 647060 649045 651246 654825 660611 667151 671475 672152 670328 667450 663419
57711F63419n858p319p474o337m548l501m812q072j0057q202m250k207l077m041
$$ 663419 657561 650242 642768 636431 631883 628382 623570 615498 605441 597239 592989 590782 587705 583664
57697E83664k912p74M09N68O41P13M78N13J696L859N927P100P291O817O105N442
$$ 583664 580752 579978 580387 580955 581596 582309 582787 583300 584996 588855 594782 601882 609173 615990 622095 627537
57681F27537M784M143M059N125O997Q614R464R967J0401J0332R382P965O843O382
$$ 627537 632321 636464 640523 645648 652645 661259 670723 680690 691091 701423 710805 718770 725613 731995
57667G31995O501O989P603Q203Q974J0306J2299J4497J6163J6851J6919J7354
$$ 731995 738496 745485 753088 761291 770265 780571 792870 807367 823530 840381 857300 874654
57655H74654J8709K0193K0553K0042K0371K2290K4240K4395K3120K2212K2467
$$ 874654 893363 913556 934109 954151 974522 996812 1021052 1045447 1068567 1090779 1113246
57644A113246K3346K4485K6081K8025L0027L2558L6294M0696M4393M6984M9282
$$ 1113246 1136592 1161077 1187158 1215183 1245210 1277768 1314062 1354758 1399151 1446135 1495417
57633A495417N1738N4021N6196N8887O1978O4641O7165P1316P8113Q6365R4383
$$ 1495417 1547155 1601176 1657372 1716259 1778237 1842878 1910043 1981359 2059472 2145837 2240220
57622B240220J02168J10955J21400J33139J45684J58720J71788J84538J97205
$$ 2240220 2342388 2453343 2574743 2707882 2853566 3012286 3184074 3368612 3565817
57613C565817K10234K23409K35758K46219K53924K57822K56484K48448K32479
$$ 3565817 3776051 3999460 4235218 4481437 4735361 4993183 5249667 5498115 5730594
57604E730594K06916J68872J15292M6341l1748j08248j73238k21610k52706k67969
$$ 5730594 5937510 6106382 6221674 6268015 6236267 6128019 5954781 5733171 5480465 5212496
57594E212496k70153k63149k50515k34030k14751j94808j76593j60573j45588
$$ 5212496 4942343 4679194 4428679 4194649 3979898 3785090 3608497 3447924 3302336
57585C302336j31262j18439j07066r5541q2868p0067n8687m9049m0673l3308k6720
$$ 3302336 3171074 3052635 2945569 2850028 2767160 2697093 2638406 2589357 2548684 2515376 2488656
57574B488656k0246j3385o347L46O265J1085J5078J9629K6002L3424L9809M4835
$$ 2488656 2468410 2455025 2448678 2449024 2455289 2466374 2481452 2501081 2527083 2560507 2600316 2645151
57562B645151N0695N9050O8811P8034Q6560R5332J04318J12784J20855J29096
$$ 2645151 2695846 2754896 2823707 2901741 2988301 3083633 3187951 3300735 3421590 3550686
57552C550686J36963J43240J47637J50344J50028J43904J30159J09317Q3001N2564
$$ 3550686 3687649 3830889 3978526 4128870 4278898 4422802 4552961 4662278 4745279 4797843
57542D797843J9228j5443m9879q2649j12037j36159j54097j66310j73649j76432
$$ 4797843 4817071 4801628 4751749 4669100 4557063 4420904 4266807 4100497 3926848 3750416
57532C750416j74982j70509j64812j59031j53032j45862j36716j25758j14378
$$ 3750416 3575434 3404925 3240113 3081082 2928050 2782188 2645472 2519714 2405336
57523B405336j04514r7269r1976q6813q0512p3350o6457o0420n4957m9827m5342
$$ 2405336 2300822 2203553 2111577 2024764 1944252 1870902 1804445 1744025 1689068 1639241 1593899
57512A593899m1746l8587l5346l2303l0108k8603k6775k3962k0470j6916j3652
$$ 1593899 1552153 1513566 1478220 1445917 1415809 1387206 1360431 1336469 1315999 1299083 1285431
57501A285431j1037r569r315r571r453q514o633l871q05J465K290K278K772M559
$$ 1285431 1274394 1264825 1255510 1245939 1236486 1227972 1221339 1217468 1216663 1218128 1220418 1222696 1225468 1230027
57487A230027P269R876J1723J3151J5142J8056K1009K2980K4237K5845K7991K9881
$$ 1230027 1237296 1247172 1258895 1272046 1287188 1305244 1326253 1349233 1373470 1399315 1427306 1457187
57475A457187L1404L3529L6500L9131M0878M3334M8162N4409N9640O3339O7343
$$ 1457187 1488591 1522120 1558620 1597751 1638629 1681963 1730125 1784534 1844174 1907513 1974856
57464A974856P2822P8716Q3828Q8863R5211J02637J09387J14121J16747J17550
$$ 1974856 2047678 2126394 2210222 2299085 2394296 2496933 2606320 2720441 2837188 2954738
57454B954738J16381J12614J05339R3640P7326N7352L4983J0733j5093m0778o3257
$$ 2954738 3071119 3183733 3289072 3382712 3460038 3517390 3552373 3563106 3548013 3507235 3443978
57443C443978q0489r3126j03042j10659j14756j14772j12122j08666j04663r9040
$$ 3443978 3363489 3270363 3167321 3056662 2941906 2827134 2715012 2606346 2501683 2402643
57433B402643r1415q3025p5502o9188o3023n5946m8240m1355l6380l2854k9228
$$ 2402643 2311228 2228203 2152701 2083513 2020490 1964544 1916304 1874949 1838569 1805715 1776487
57422A776487k4368j8389j2292p190l606r33K335P019J1995J5493J7647K0516
$$ 1776487 1752119 1733730 1721438 1714248 1710642 1709709 1712044 1719063 1731058 1746551 1764198 1784714
57410A784714K5256L0694L5472M0022M5191N0233N4059N7550O2638O9447P6248
$$ 1784714 1809970 1840664 1876136 1916158 1961349 2011582 2065641 2123191 2185829 2255276 2331524
57399B331524Q2166Q7908R3620R7966R9980J00133R8828R5120Q7755P6271O0440
$$ 2331524 2413690 2501598 2595218 2693184 2793164 2893297 2992125 3087245 3175000 3251271 3311711
57388C311711L9944J5549j0468l6009o0331q2824j01813j15765j24892j30351
$$ 3311711 3351655 3367204 3356736 3320727 3260396 3177572 3075759 2959994 2835102 2704751
57378B704751j32402j30532j25129j18019j11259j05861j01392r6452q9977q2491
$$ 2704751 2572349 2441817 2316688 2198669 2087410 1981549 1880157 1783705 1693728 1611237
57368A611237p5614p0076o4934n9194n3287m8270m4349m0985l7843l4933l2250
$$ 1611237 1535623 1465547 1400613 1341419 1288132 1239862 1195513 1154528 1116685 1081752 1049502
57357A049502l0022k8537k7232k4759k0846j7263j5826j6112j6267j5545j4740
$$ 1049502 1019480 990943 963711 938952 918106 900843 885017 868905 852638 837093 822353
57346H22353j4402j3988j2900j1398j0147r535r452r284q258o299m360l360l008
$$ 822353 807951 793963 781063 769665 759518 749983 740531 731247 722989 716690 712330 708970 705962
57333G05962k304r66K76P39N54M22R67K281L855M980N290M745L410J856J457L158
$$ 705962 703658 702692 702968 703707 704261 704683 705650 707931 711786 716766 722056 726801 730211 732067 733524 736682
57317G36682N928P737Q135Q463R301R525Q693Q227Q966R440Q394P376Q518J1134
$$ 736682 742610 750347 758482 766945 776246 785771 794464 802691 811657 821097 829491 836867 845385 856519
57303H56519J2836J3191J3659J4521J4576J3785J3662J4711J5883J6883J8724
$$ 856519 869355 882546 896205 910726 925302 939087 952749 967460 983343 1000226 1018950
57292A018950K1372K3128K3225K2917K2973K2237K0075J8321J8774K0178J9812
$$ 1018950 1040322 1063450 1086675 1109592 1132565 1154802 1174877 1193198 1211972 1232150 1251962
57281A251962J7369J5276J5239J6356J6932J6791J7010J8148J9489K0003J9542
$$ 1251962 1269331 1284607 1299846 1316202 1333134 1349925 1366935 1385083 1404572 1424575 1444117
57270A444117J8929J9009J9777K0573K0920K1051K1645K3154K5201K6692K6927
$$ 1444117 1463046 1482055 1501832 1522405 1543325 1564376 1586021 1609175 1634376 1661068 1687995
57259A687995K6580K6924K8048K8815K8865K9306L0658L1492L0562K9210K9791
$$ 1687995 1714575 1741499 1769547 1798362 1827227 1856533 1887191 1918683 1949245 1978455 2008246
57248B008246L2326L4529L4972L4450L4186L4371L4776L5428L6259L7163L8499
$$ 2008246 2040572 2075101 2110073 2144523 2178709 2213080 2247856 2283284 2319543 2356706 2395205
57237B395205M0490M2309M3017M3258M4583M7104M9435N0989N2688N5098N7557
$$ 2395205 2435695 2478004 2521021 2564279 2608862 2655966 2705401 2756390 2809078 2864176 2921733
57226B921733N9592O1663O4038O6188O7735O8787O9255O9263P0137P3097P6759
$$ 2921733 2981325 3042988 3107026 3173214 3240949 3309736 3378991 3448254 3518391 3591488 3668247
57215C668247P8143P6597P4450P2994P0353O4784N7627N0888M3789L4352K3334
$$ 3668247 3746390 3822987 3897437 3970431 4040784 4105568 4163195 4214083 4257872 4292224 4315558
57204D315558J4031Q367N230K891J397K155N970J2000J8373K3930K9282L5666
$$ 4315558 4329589 4337956 4343186 4346077 4347474 4349629 4355599 4367599 4385972 4409902 4439184 4474850
57192D474850M2843M9067N3146N5221N5373N3064M8724M4187M0518L6907L2949
$$ 4474850 4517693 4566760 4619906 4675127 4730500 4783564 4832288 4876475 4916993 4953900 4986849
57181D986849L0443L1371L5207M0085M5703N3208O2649P2468Q1515R0099R8687
$$ 4986849 5017292 5048663 5083870 5123955 5169658 5222866 5285515 5357983 5439498 5529597 5628284
57170E628284J06706J13057J17178J19260J19586J17790J13104J05803R8061R2201
$$ 5628284 5734990 5848047 5965225 6084485 6204071 6321861 6434965 6540768 6638829 6731030
57160F731030Q8083Q3533P7565P1586O6858O2590N7672N2826M9555M8145M8025
$$ 6731030 6819113 6902646 6980211 7051797 7118655 7181245 7238917 7291743 7341298 7389443 7437468
57149G437468M9074N1293N4037N6972O0982O6843P3745Q0340Q6432R2339R7404
$$ 7437468 7486542 7537835 7591872 7648844 7709826 7776669 7850414 7930754 8017186 8109525 8206929
57138H206929J00699J02702J04734J07048J08648J08817J07730J05770J03129
$$ 8206929 8307628 8410330 8515064 8622112 8730760 8839577 8947307 9053077 9156206
57129I156206R9886R5886R0838Q5046P9584P5282P2152O9937O8370O6655O3933
$$ 9156206 9256092 9351978 9442816 9527862 9607446 9682728 9754880 9824817 9893187 9959842 10023775
57118A0023775O0603N7907N5905N3501N0758M9167M8965M8438M6813M5399M4527
$$ 10023775 10084378 10142285 10198190 10251691 10302449 10351616 10400581 10449019 10495832 10541231 10585758
57107A0585758M1919L6029K8539K1333J3254K628r013j8780k6550l4187m1721
$$ 10585758 10627677 10663706 10692245 10713578 10726832 10729460 10720447 10701667 10675117 10640930 10599209
57096A0599209m7338n0541n2406n3076n1580m7981m3477l8696l4065l1390l3039
$$ 10599209 10551871 10501330 10448924 10395848 10344268 10296287 10252810 10214114 10180049 10148659 10115620
57085A0115620l9686n0546o5181q3296j03405j23409j41925j57952j70708j81412
$$ 10115620 10075934 10025388 9960207 9876911 9773506 9650097 9508172 9350220 9179512 8998100
57075H998100j93488k09121k27438k48045k73852l07497l47171l89367m33732
$$ 8998100 8804612 8595491 8368053 8120008 7846156 7538659 7191488 6802121 6368389
57066F368389m81685n32259n83493o36567o94420p57263q23423q93583d327j052766
$$ 6368389 5886704 5354445 4770952 4134385 3439965 2682702 1859279 965696 -4327 -1057093
57056a057093j140791j236279j343382j463413j595542j741390j904472k085916
$$ -1057093 -2197884 -3434163 -4777545 -6240958 -7836500 -9577890 -11482362 -13568278
57048a3568278k285542k506501k754049l030420l335753l673337m048806m464701
$$ -13568278 -15853820 -18360321 -21114370 -24144790 -27480543 -31153880 -35202686 -39667387
57040c9667387m920672n417782n957394o538032p160393p834442q574253r385881
$$ -39667387 -44588059 -50005841 -55963235 -62501267 -69661660 -77496102 -86070355 -95456236
57032i5456236j0264687j1199375j2167862j3130365j4036136j4836444j5485588
$$ -95456236 -105720923 -116920298 -129088160 -142218525 -156254661 -171091105 -186576693
57025a86576693j5938547j6158066j6103713j5683470j4737636j3144449j0981943
$$ -186576693 -202515240 -218673306 -234777019 -250460489 -265198125 -278342574 -289324517
57018b89324517q542589o126585l817403j484980J013484L685868O442233R195317
$$ -289324517 -297867106 -303993691 -307811094 -309296074 -308282590 -304596722 -298154489 -288959172
57010b88959172J1871527J4354888J6477311J8077013J9055075J9390178J9131887
$$ -288959172 -277087645 -262732757 -246255446 -228178433 -209123358 -189733180 -170601293
57003a70601293J8387502J7293943J5982489J4561394J3117879J1718356J0402750
$$ -170601293 -152213791 -134919848 -118937359 -104375965 -91258086 -79539730 -69136980
56996f9136980R188208Q082868P092632O216978N447590M774324M187916L676865
$$ -69136980 -59948772 -51865904 -44773272 -38556294 -33108704 -28334380 -24146464 -20469599
56988b0469599L227982K832201K485684K184127J920364J688704J487412J314890
$$ -20469599 -17241617 -14409416 -11923732 -9739605 -7819241 -6130537 -4643125 -3328235
56980c328235J166380J035886b07030F05423P14381O24616N44456M74097M12088
$$ -3328235 -2161855 -1125969 -207030 605423 1319804 1944420 2488876 2962973 3375061
56971C375061L57374L10050K69712K34688K03077J73227J43446J12982Q3459N7868
$$ 3375061 3732435 4042485 4312197 4546885 4749962 4923189 5066635 5179617 5263076 5320944
56961E320944L7871K3031J2046L151o176j7924l1694m5586n9044p3504q9977j07056
$$ 5320944 5358815 5381846 5393892 5397043 5390867 5372943 5341249 5295663 5236619 5163115 5073138 4966082
56949D966082j21568j30527j32745j29397j23143j16455j10896j07544j06383
$$ 4966082 4844514 4713987 4581242 4451845 4328702 4212247 4101351 3993807 3887424
56940C887424j05114j01301r7697j03642j28158j71453k24206k73956l10776l28978
$$ 3887424 3782310 3681009 3583312 3479670 3351512 3180059 2955853 2681897 2371121 2042143
56930B042143l27715l11161k86078k57801k28888k00710j74364A05373b2143j07545
$$ 2042143 1714428 1403267 1117189 859388 630500 429790 255426 105373 -22143 -129688
56920a29688r1667q0199p1908o5754o1503n8395n4790m9753m3891l8110l2552
$$ -129688 -221355 -301554 -373462 -439216 -500719 -559114 -613904 -663657 -707548 -745658 -778210
56909g78210k7151k2136j7438j2367o428Q5O510J2382J7495K1949K6138L0133
$$ -778210 -805361 -827497 -844935 -857302 -863730 -863645 -857135 -844753 -827258 -805309 -779171 -749038
56897g49038L3246L4787L4879L3695L0340K3846J5284P473K170j428m890q201
$$ -749038 -715792 -681005 -646126 -612431 -582091 -558245 -542961 -535488 -533318 -534746 -539636 -547837
56885e47837r931r093o097k131J881N674R297J2592J5258J7428J9743K2539K5373
$$ -547837 -557768 -566861 -572958 -575089 -573208 -567534 -558237 -545645 -530387 -512959 -493216 -470677 -445304
56872d45304K7755K9778L1506L2106L0335K5614J8208Q898p51q537j3132j5185
$$ -445304 -417549 -387771 -356265 -324159 -293824 -268210 -250002 -241104 -241855 -250392 -263524 -278709
56860b78709j6074j6026j4605j2466j1023j0415r324p116m760l226k302j533r65
$$ -278709 -294783 -310809 -325414 -337880 -348903 -359318 -368642 -375758 -380518 -383744 -386046 -387579 -388544
56847c88544m01Q85K742L701L055K317L304N499O891O981P356R239J2069J4871
$$ -388544 -388945 -388060 -385318 -381617 -378562 -376245 -372941 -367442 -360551 -353570 -346214 -336975 -324906 -310035
56833c10035J7603K0302K2050K2017K1011K0834K2294K4688K7065K8938K9569
$$ -310035 -292432 -272130 -250080 -228063 -207052 -186218 -163924 -139236 -112171 -83233 -53664
56822e3664b5829b297A5928J3866J0854Q214N410L148K224K371K802L424M855
$$ -53664 -25829 -2297 15928 29794 40648 48862 54272 57420 59644 62015 64817 68241 73096
56809G3096P290R875J1628J2759J4573J7837K1666K4708K7021K9887L3562L6350
$$ 73096 80386 90261 101889 114648 129221 147058 168724 193432 220453 250340 283902 320252
56797C20252L6406L3537K8359K0805J0819Lq971j4692j7574j8204j6487j2610
$$ 320252 356658 390195 418554 439359 450178 450181 441210 426518 408944 390740 374253 361643
56785C61643p640k642K001O199R973J3857J8451K3476K8218L3015L8956M5888
$$ 361643 354003 351361 353362 359561 369534 383391 401842 425318 453536 486551 525507 571395
56773E71395N2157N6715N9602N9522N2951L7699J6332n557k4013l8127m7797n2396
$$ 571395 623552 680267 739869 799391 852342 890041 906373 900816 876803 838676 790879 738483
56761G38483n2019m8295m2997l6720k9540k2262j6176j1687p690k572M213J1682
$$ 738483 686464 638169 595172 558452 528912 506650 490474 478787 471097 468525 472738 484420
56749D84420J8568K4769L1128L7835M3460M5400M0922K8479R487j1080k7429l7142
$$ 484420 502988 527757 558885 596720 640180 685580 726502 754981 764468 753388 725959 688817
56737F88817m1940m4249m4568m2679l9451l5864l1506k5792j9863j5493j2573
$$ 688817 646877 602628 558060 515381 475930 440066 408560 382768 362905 347412 334839
56726C34839r352m862K80N282R864J3618J6141J7816J9083J8717J4302N047o727
$$ 334839 325487 320625 320905 326187 336051 349669 365810 383626 402709 421426 435728 440775 434048
56713D34048j7361k4503k7956k8913k8841k8484k7570k5632k2992k0413j8096
$$ 434048 416687 392184 364228 335315 306474 277990 250420 224788 201796 181383 163287
56702A63287j5811j3793j2495j1516r872p515n664n230n774o256o142n361m012
$$ 163287 147476 133683 121188 109672 99800 92285 86621 81391 75617 69361 63219 57858 53846
56689E3846k561j735j649j540p54L41R14P20J25o83j904l480m701m745l484j627
$$ 53846 51285 49550 47901 46361 45607 45948 46862 47582 47707 47024 45120 41640 36939 32194 28710 27083
56673B7083m9P99Q01q5j684l348m336m460m075l548l173F24c205l821k581j029
$$ 27083 27034 27833 28634 28549 26865 23517 19181 14721 10646 7098 3925 624 -3205 -7026 -9607 -10636
56657a0636p84j799k285j352k46j88n68l87j16n93j215q83J28Q37J415K487L191
$$ -10636 -11420 -13219 -15504 -16856 -17102 -17290 -17858 -18245 -18361 -18954 -20169 -21052 -20924 -20087 -18672 -16185 -12994
56640a2994J978o80k488k394j708j683j918j800j944l019m322m677m019l153k438
$$ -12994 -11016 -11696 -14184 -16578 -18286 -19969 -21887 -23687 -25631 -28650 -32972 -37649 -41668 -44821 -47259
56625d7259j538j49J589L264M442N020N505O527P946e766B998P924P010O264N459
$$ -47259 -48797 -48946 -47357 -44093 -39651 -34631 -29126 -22599 -14653 -5766 2998 10922 17932 24196 29655
56610B9655M318K987K292L086M870N704M361K183J560K728L507K416O40J96J300
$$ 29655 33973 36960 39252 42338 47208 52912 57273 59456 61016 63744 67251 69667 70307 70503 71803
56595G1803K509K793K491K404K686K730J931N43l82j50N94O07l41j176q94L05
$$ 71803 74312 77105 79596 82000 84686 87416 89347 89890 89508 89358 89952 90559 90218 89042 88148 88453
56579H8453J397J493L39j577l170l470k516j269n83m72l96j3L72K4j260k428k012
$$ 88453 89850 91343 91682 90105 86935 83465 80949 79680 79097 78625 78229 78216 78588 78612 77352 74924 72912
56562G2912K7J964K381J676Q33k11j714k584j495P74J969J429Q18J335J995J430
$$ 72912 72939 74903 77284 78960 79793 79582 77868 75284 73789 74563 76532 77961 78779 80114 82109 83539
56546H3539R6n22K0Q46J152R95R05J211J762K186K447K912L559L607K603J387
$$ 83539 83635 83113 83133 83979 85131 86126 87031 88242 90004 92190 94637 97549 101108 104715 107318 108705
56530A08705J052J397J527J662K801M611N297L998J932N64j40r47j930k622k711
$$ 108705 109757 111154 112681 114343 117144 121755 127052 131050 132982 133546 133406 132459 130529 127907 125196
56515A25196j979k94J704K757K465J912K296L559M839N510N353M397L219K760
$$ 125196 123217 122923 124627 127384 129849 131761 134057 137616 142455 147965 153318 157715 160934 163694
56501A63694L413M650N760O269N730M144K827L475N855P582O898M594K536J476
$$ 163694 167107 171757 177517 183786 189516 193660 196487 199962 205817 213399 220297 224891 227427 228903
56487B28903J241J808K920L478K699J378Q62J186J275O28l33j314k395l204k947
$$ 228903 230144 231952 234872 238350 241049 242427 243289 244475 245750 246378 246045 244731 242336 239132 236185
56472B36185j553j58l0j310k919l624l133k195j556j109n16l02j344l241m343
$$ 236185 234632 234474 234444 233134 230215 226591 223458 221263 219707 218598 218082 217780 216436 213195 208852
56457B08852l792k587k058k251k517k723k945k725j712n94l60q99j204p90j38
$$ 208852 205060 202473 200415 198164 195647 192924 189979 187254 185542 184948 184588 183689 182485 181695 181557
56442A81557K03K54L35N92Q41P48L05Q5N55J163Q78j52m46R00L004M448M770M158
$$ 181557 181760 182014 182349 182941 183782 184530 184835 184920 185475 186638 187516 187364 186918 187818 190822 195270 200040 204198
56424B04198K693Q59j25K31P14J17o97N0K124L188J974Q0n7J949M386N712O002
$$ 204198 206891 207750 207625 207856 208570 208687 207990 208040 210164 213352 215326 215406 215349 217298 221684 227396 233398
56407B33398O190O504O122M458K308J288K058L770N292O412P392Q024P782O630
$$ 233398 239588 246092 252214 256672 258980 260268 262326 266096 271388 277800 285192 293216 300998 307628
56393C07628N121L855L162L038L116K917K390J868J403O31n16j530k056k281k257
$$ 307628 312749 316604 319766 322804 325920 328837 331227 333095 334498 335129 334613 333083 331027 328746 326489
56378C26489j646o16k55j344l275m796n342n008l897k383j479j918l145m038m323
$$ 326489 324843 324227 323972 322628 319353 314557 309215 304207 300310 297927 296448 294530 291385 287347 283024
56363B83024m513m652m160k880j387j43R09J774K103J694Q99L10J77K33p6j063
$$ 283024 278511 273859 269699 266819 265432 265289 266198 267972 270075 271769 272668 272978 273155 273388 273312 272249
56347B72249k337l047k723j662m40M89O46k93j755k390j598l69rm90q41o72l38
$$ 272249 269912 266865 264142 262480 262040 262529 263175 262882 261127 258737 257139 256770 256761 256271 255430 254758 254420
56330B54420P5R26K054K633K238J449J057J132J175R14O28P88J500K333K741K592
$$ 254420 254495 255421 257475 260108 262346 263795 264852 265984 267159 268073 268701 269489 270989 273322 276063 278655
56314B78655K204J904J867K294L225M060L862K531J254J365K919M713N486M949
$$ 278655 280859 282763 284630 286924 290149 294209 298071 300602 301856 303221 306140 310853 316339 321288
56300C21288L889L363L566L509K302O55L96K234M755O001N438L935K459J425R39
$$ 321288 325177 328540 332106 335615 337917 338572 338968 341202 345957 351958 357396 361331 363790 365215 366154
56285C66154J028J618K552L428L582K698J489J078J671K592L648N359P459Q499
$$ 366154 367182 368800 371352 374780 378362 381060 382549 383627 385298 387890 391538 396897 404356 412855
56271D12855P696O176N323M834L705K499K956N399P981Q975Q784Q982J0026J0793
$$ 412855 420551 426727 432050 436884 440589 443088 446044 451443 459424 468399 477183 486165 496191 506984
56257E06984J0349R288Q946R647J0397J0315R596Q844Q305Q287R443J1624J3179
$$ 506984 517333 526621 535567 545214 555611 565926 575522 584366 592671 600958 610401 622025 635204
56244F35204J2691J0943R826R712R533R159R657J0950J1355J0166Q831Q564Q544
$$ 635204 647895 658838 668664 678376 687909 697068 706725 717675 729030 739196 748027 756591 765135
56231G65135P664O527O253O669P174Q272J0515J2839J3722J3560J4209J6313J8619
$$ 765135 772799 779326 785579 792248 799422 807694 818209 831048 844770 858330 872539 888852 907471
56218I07471J9980K0780K2029K4074K6600K9305L2146L5127L8102M0971M4112
$$ 907471 927451 948231 970260 994334 1020934 1050239 1082385 1117512 1155614 1196585 1240697
56207A240697M8189N3090N7518O0567O3290O7510P3284P9050Q4327R0414R7999
$$ 1240697 1288886 1341976 1399494 1460061 1523351 1590861 1664145 1743195 1827522 1917936 2015935
56196B015935J05909J13068J20011J27443J34838J41563J47980J54149J58730
$$ 2015935 2121844 2234912 2354923 2482366 2617204 2758767 2906747 3060896 3219626
56187C219626J60450J59527J56456J50599J41245J28915J14389R7618P8846N9563
$$ 3219626 3380076 3539603 3696059 3846658 3987903 4116818 4231207 4328825 4407671 4467234
56177D467234M0785K1740J826j7280l3297m6144n7203o6657p3547p7947q1140
$$ 4467234 4508019 4529759 4531585 4514305 4481008 4434864 4377661 4311004 4237457 4159510 4078370
56166D078370q3855q5966q7813r0293r3645r7247j00431j02759j03991j04682
$$ 4078370 3994515 3908549 3820736 3730443 3636798 3539551 3439120 3336361 3232370 3127688
56156C127688j05945j07663j08009j05910j02892j01001j00031r8356r5452r1732
$$ 3127688 3021743 2914080 2806071 2700161 2597269 2496268 2396237 2297881 2202429 2110697
56146B110697q6943q0874p4920p0747o7697o3636n8125n2789m8578m4714m0513
$$ 2110697 2023754 1942880 1867960 1797213 1729516 1665880 1607755 1554966 1506388 1461674 1421161
56135A421161l6425l2870k9589k6550k4274k2890k1761k0268j8261j5893j3686
$$ 1421161 1384736 1351866 1322277 1295727 1271453 1248563 1226802 1206534 1188273 1172380 1158694
56124A158694j2263j1383r913p519n428m492l648j624R44K708L872N424P023P755
$$ 1158694 1146431 1135048 1125135 1117616 1112188 1107696 1104048 1102424 1103368 1106076 1109948 1115372 1122395 1130150
56110A130150Q360J0485J3984J6948J8383J9080J9860K0695K1645K3062K4700
$$ 1130150 1138510 1148995 1162979 1179927 1198310 1217390 1237250 1257945 1279590 1302652 1327352
56099A327352K5912K6768K7851K9152L0241L1239L2444L3383L3369L2642L1964
$$ 1327352 1353264 1380032 1407883 1437035 1467276 1498515 1530959 1564342 1597711 1630353 1662317
56088A662317L1638L1951L3731L7279M1562M5827N1062N8414O7070P5410Q3598
$$ 1662317 1693955 1725906 1759637 1796916 1838478 1884305 1935367 1993781 2060851 2136261 2219859
56077B219859R3422J06008J20987J37279J53479J68265J81345J92927K01296K02832
$$ 2219859 2313281 2419289 2540276 2677555 2831034 2999299 3180644 3373571 3574867 3777699
56067C777699J95886J82929J67169J49232J29474J11266R8448R0370Q2379P0624
$$ 3777699 3973585 4156514 4323683 4472915 4602389 4713655 4812103 4902473 4984852 5055476
56057E055476N4115L3229R417j3989l3481m8267o0044p0707q1976r5924j13411
$$ 5055476 5109591 5142820 5152237 5138248 5104767 5056500 4996456 4925749 4843773 4747849 4634438
56046D634438j32693j51254j67683j80119j85170j81263j71336j59367j45989
$$ 4634438 4501745 4350491 4182808 4002689 3817519 3636256 3464920 3305553 3159564
56037C159564j30473j14645j00969q8395p4431o0153m8991m1343l4531k7500k1574
$$ 3159564 3029091 2914446 2813477 2725082 2650651 2590498 2541507 2500164 2465633 2438133 2416559
56026B416559j7017j2789r388q150q092p073n586n688o719o014l371r94M55J908
$$ 2416559 2399542 2386753 2377365 2369215 2361123 2354050 2348464 2342776 2336057 2330043 2326672 2325678 2326133 2328041
56012B328041K908K696L424P691J3501J6471J6564J7728K1125K4014K5398K7472
$$ 2328041 2330949 2333645 2337069 2344760 2358261 2374732 2391296 2409024 2430149 2454163 2479561 2507033
56000B507033L0768L3045L3824L5356L8123L9912M0151M0858M2614M3961M5152
$$ 2507033 2537801 2570846 2604670 2640026 2678149 2718061 2758212 2799070 2841684 2885645 2930797
55989B930797M8047N1969N4293N5324N7830O1647O3858O4446O6376O9887P2429
$$ 2930797 2978844 3030813 3085106 3140430 3198260 3259907 3323765 3388211 3454587 3524474 3596903
55978C596903P4488P9350Q6326R0649R1374R3015R7824J02692J05597J08839J13680
$$ 3596903 3671391 3750741 3837067 3927716 4019090 4112105 4209929 4312621 4418218 4527057 4640737
55967D640737J17619J19695J22956J29250J36458J43080J50541J59197J67074
$$ 4640737 4758356 4878051 5001007 5130257 5266715 5409795 5560336 5719533 5886607
55958E886607J74270J83769J96506K10472K25202K41784K58292K71501K83303
$$ 5886607 6060877 6244646 6441152 6651624 6876826 7118610 7376902 7648403 7931706
55949G931706K98534L16299L31148L43217L58738L79535M01000M22073M47934
$$ 7931706 8230240 8546539 8877687 9220904 9579642 9959177 10360177 10782250 11230184
55940A1230184M80345N14465N47882N83562O20855O53004O77290O99005P22240
$$ 11230184 11710529 12224994 12772876 13356438 13977293 14630297 15307587 16006592 16728832
55931A6728832P45802P71059Q04042Q46230Q92788R42912J001616J068513J136190
$$ 16728832 17474634 18245693 19049735 19895965 20788753 21731665 22733281 23801794 24937984
55922B4937984J203340J277869J363329J454483J549972J655958J772742J891772
$$ 24937984 26141324 27419193 28782522 30237005 31786977 33442935 35215677 37107449
55914C7107449K011319K141279K287524K446240K618431K813522L033541L271888
$$ 37107449 39118768 41260047 43547571 45993811 48612242 51425764 54459305 57731193
55906E7731193L533399L835469M182467M561460M972466N441074N994065O649665
$$ 57731193 61264592 65100061 69282528 73843988 78816454 84257528 90251593 96901258
55898I6901258P440891Q414898R590870J0947515J2468300J4168540J6067522
$$ 96901258 104342149 112757047 122347917 133295432 145763732 159932272 175999794
55891A75999794J8179757K0553395K3262853K6327325K9659532L3028987L5845436
$$ 175999794 194179551 214732946 237995799 264323124 293982656 327011643 362857079
55884C62857079L6842758L4239757K6743009J4737512M68237j3111338k3811073
$$ 362857079 399699837 433939594 460682603 475420115 475888352 462777014 438965941
55877D38965941l0821628l4369084l5131565l3916352l1515123k8567614k5491150
$$ 438965941 408144313 373775229 338643664 304727312 273212189 244644575 219153425
55870B19153425k2533287j9841632j7471395j5396382j3570849j1972343j0580678
$$ 219153425 196620138 176778506 159307111 143910729 130339880 118367537 107786859
55863A07786859r357782q274051p327572o516777n816999n201033m661290m195189
$$ 107786859 98429077 90155026 82827454 76310677 70493678 65292645 60631355 56436166
55855E6436166l787984l425710l108537k837054k599679k385490k195581k030767
$$ 56436166 52648182 49222472 46113935 43276881 40677202 38291712 36096131 34065364
55847C4065364j881609j741393j616440j513078j425469j345417j273297j210359
$$ 34065364 32183755 30442362 28825922 27312844 25887375 24541958 23268661 22058302
55839B2058302j150464j088200j026301r67948r10532q53161q00918p55565p11386
$$ 22058302 20907838 19819638 18793337 17825389 16914857 16061696 15260778 14505213 13793827
55830A3793827o65935o25020n91244n57733n19887m83550m54673m30112m05703
$$ 13793827 13127892 12502872 11911628 11353895 10834008 10350458 9895785 9465673 9059970
55821I059970l84302l68259l52491l32906l14103l01041k90110k75995k60770
$$ 9059970 8675668 8307409 7954918 7622012 7307909 7006868 6716758 6440763 6179993
55812F179993k48630k37779k24994k12770k04655j98368j90249j82057j77041
$$ 6179993 5931363 5693584 5468590 5255820 5051165 4852797 4662548 4480491 4303450
55803D303450j73548j68381j62238j56408j48531j36949j24922j15362j05946
$$ 4303450 4129902 3961521 3799283 3642875 3494344 3357395 3232473 3117111 3011165
55794C011165r4681q5546q2917q4579q5737q5954q6671q5988q1675p5967p1920
$$ 3011165 2916484 2830938 2748021 2663442 2577705 2491751 2405080 2319092 2237417 2161450 2089530
55783B089530o8206o2511n6672n3253n0389m5207l9336l5826l3559k9847k5745
$$ 2089530 2021324 1958813 1902141 1848888 1798499 1753292 1713956 1678130 1644571 1614724 1588979
55772A588979k3690k2502j9854j7203j7181j8305j7334j4962j4237j5227j5944
$$ 1588979 1565289 1542787 1522933 1505730 1488549 1470244 1452910 1437948 1423711 1408484 1392540
55761A392540j6950k0152k4425k7018k8219l0257l2602l2643l0299k8034k6856
$$ 1392540 1375590 1355438 1331013 1303995 1275776 1245519 1212917 1180274 1149975 1121941 1095085
55750A095085k5770k4575k3879k3061k1177j9158j8295j7566j5215j1938r652
$$ 1095085 1069315 1044740 1020861 997800 976623 957465 939170 921604 906389 894451 884799
55739H84799q119n708k589m71J21n1p06j811k529k280j786j568r57j22r63m096
$$ 884799 876680 870972 868383 867912 868033 867982 867276 865465 862936 860656 858870 857302 856345 856223 855260 851164
55723H51164p161q174q337r231r745q367o214n048m425l774m957r442j4747j7116
$$ 851164 844003 835829 827492 818261 808516 800149 793935 788887 784462 780688 775731 766289 751542 734426
55709G34426j6366j5115j4657j4548j4756j5152j4274j1492r145r574j1421j1850
$$ 734426 718060 702945 688288 673740 658984 643832 629558 618066 608921 599347 587926 576076
55697E76076j0956j0930j2011j2551j2032j1083r381o582m388m717o506p107o127
$$ 576076 565120 554190 542179 529628 517596 506513 497132 490550 486162 481445 474939 467832 461705
55684D61705n289n382n977p209r070r935q672p261q278j0632j0880q285n398l894
$$ 461705 456416 451034 445057 437848 428778 418843 410171 402910 394632 384000 373120 364835 359437 355543
55670C55543k971j846j090j131j755l130n324o999o729n277m591n048n634o170
$$ 355543 352572 350726 349636 348505 346750 343620 338296 331297 324568 319291 314700 309652 304018 297848
55656B97848p031p335n911l743l036m088n226n507n264m377k379q5J109J444K278
$$ 297848 290817 283482 277571 273828 270792 266704 261478 255971 250707 246330 243951 243866 244975 246419 248697
55641B48697L568M020L401K653J868K96j699k795k772k654k757k437j580p24O3
$$ 248697 252265 256285 259686 262339 264207 264503 262804 260009 257237 254583 251826 249389 247809 247085 247148
55626B47148R02J097J70n45Q01M013P172R091R878R659Q498P120O125M953L006
$$ 247148 248050 249147 249317 248772 249573 253586 260758 269849 279727 289386 297884 305004 311129 316082 319088
55611C19088R02p78k732n124o110m451k183k044l436l762k616j589p94R49L031
$$ 319088 319990 319212 316480 311356 305246 300795 298612 296568 293132 289370 286754 285165 284371 285320 288351
55596B88351L587K944L185M367M617L974M478N918N364K043q84r75J69J6j267
$$ 288351 291938 294882 298067 302434 307051 311025 315503 321421 326785 328828 327944 326969 327138 327154 325887
55581C25887k246k860l516l593k924l049m956p004p063n692n225o480q170r139
$$ 325887 323641 320781 317265 313672 310748 307699 302743 295739 288676 282984 277759 271279 263109 253970
55567B53970r587j0177j1026j1670j1396r779p316n235m380m538n008n317n263
$$ 253970 244383 234206 223180 211510 200114 190335 183019 177784 173404 168866 163858 158541 153278
55554A53278m776m033l338k825k542k584k769k688k476k847l672l516j723o3o85
$$ 153278 148502 144469 141131 138306 135764 133180 130411 127723 125247 122400 118728 115212 113489 113426 112741
55539A12741l055m561l896k178p82J85J082J827K166J903P94r18k128j966r27
$$ 112741 109686 105125 101229 99051 98269 98454 99536 101363 103529 105432 106226 105308 103180 101214 100287
55524A00287rO40J140R59M9j87J013J831L77j687j069J943L577K272R28K207M573
$$ 100287 100278 100918 102058 103017 103066 102879 103892 105723 106100 104413 103344 105287 108864 111136 112064 114271 118844
55507A18844N104L907L422M663O389P278P172O367N088L628K196O18j311l434
$$ 118844 123948 127855 131277 135940 142329 149607 156779 163146 168234 171862 174058 174676 173365 169931
55493A69931n369o704o966n996m562l962m743o198p161o919n501l700k610k589
$$ 169931 164562 157858 150892 144896 140334 136372 131629 125431 118270 111351 105850 102150 99540 96951
55479I6951k936l001k989l048k471r22L94L04l29K04J739K514J930J239J415J965
$$ 96951 94015 91014 88025 84977 82506 81584 81978 82282 81953 82157 83896 86410 88340 89579 90994 92959
55463I2959K013J277q7j360j337J49J326P54j53R76L428L876J118k250l572l174
$$ 92959 94972 96249 96162 94802 93465 93614 94940 95694 95541 96517 99945 103821 104939 102689 99117 95943
55447I5943k703k543k267k097k499l256l849m063l755k993k642l576n152n711
$$ 95943 93240 90697 88430 86333 83834 80578 76729 72666 68911 65918 63276 59700 54548 48837
55433D8837m796l456k379j335o26j138k509l118k523k000k192k116j320r48j594
$$ 48837 44041 40585 38206 36871 36245 35107 32598 29480 26957 24957 22765 20649 19329 18381 16787
55418A6787j981j115p3k13j086j564j721k090k140j059N87J385Q12m83j643k150
$$ 16787 14806 13691 13618 13405 12319 10755 9034 6944 4804 3745 4332 5717 6529 6046 4403 2253
55402B253B79a438j966k138j076R58K055J241j14k23P71e00E42O0a70r33l31M23
$$ 2253 279 -1438 -3404 -5542 -6618 -5660 -3605 -2364 -2478 -2701 -1930 -500 542 602 -170 -1103 -1434 -1011
55384a011M97n7m08k05K08b74A002J074p17a463k794n76Q97k06k035k004n17O7
$$ -1011 -514 -571 -979 -1184 -976 -274 1002 2076 1359 -1463 -4257 -4833 -3936 -4142 -6177 -8181 -8698 -8631
55366h631r27j996j955j238q33j138j771j802n20J619L250L640L261K694K049
$$ -8631 -9558 -11554 -13509 -14747 -15580 -16718 -18489 -20291 -20811 -19192 -15942 -12302 -9041 -6347 -4298
55351d298J614i40H85Q60n36n39Q89J472J24j195n29J121J799J706K136K619J666
$$ -4298 -2684 -940 885 1745 1209 670 1559 3031 3155 1960 1431 2552 4351 6057 8193 10812 12478
55334A2478m72k013k272k096j930j345m39r5o11e6j239k68a24B834L047J618J95
$$ 12478 12006 9993 7721 5625 3695 2350 1911 1816 1205 -56 -1295 -1563 -124 2834 5881 7499 7694
55317G694j64l26j303k081j106P54R60j149a92m082l321k528k181k018j882j652
$$ 7694 7530 7204 5901 3820 2714 3468 4428 3279 -192 -4274 -7595 -10123 -12304 -14322 -16204 -17856
55301a7856j023P7J157J581J118J02p23p89l42j25j99K74J532K265J085j491l456
$$ -17856 -18879 -18802 -17645 -16064 -14946 -14844 -15567 -16356 -16698 -16823 -17022 -16748 -15216 -12951 -11866 -13357 -16813
55284a6813l541k237q70l50p22j302j324p38j23L74J369L062M431M263K537L26
$$ -16813 -20354 -22591 -23461 -23811 -24533 -25835 -27159 -27897 -28020 -27646 -26277 -23215 -18784 -14521 -11984 -11658
55268a1658j267j617p32N31J033N60k6j46j48k28M7N68K67j162k157j120J380
$$ -11658 -12925 -14542 -15274 -14743 -13710 -13150 -13176 -13322 -13470 -13698 -13651 -13083 -12816 -13978 -16135 -17255 -15875
55251a5875L324L490K129J71j253j256j88L90m39j778k364k193j881j442p66l20
$$ -15875 -12551 -9061 -6932 -6761 -8014 -9270 -9458 -9068 -9507 -11285 -13649 -15842 -17723 -19165 -19931 -20251
55235b0251j73O49K512L911L284J203o43j708k359k371j437m51l62l97P55K500
$$ -20251 -20424 -19775 -17263 -13352 -10068 -8865 -9508 -11216 -13575 -15946 -17383 -17834 -18196 -18593 -17838 -15338
55219a5338L017K031R92O60M55J04M3J40j76m87K17J551J997J273P15R98e52B85
$$ -15338 -12321 -10290 -9298 -8638 -8183 -8079 -8036 -7896 -8072 -8559 -8342 -6791 -4794 -3521 -2806 -1808 -552 285
55200E06A83a146k770l538l028j862o68N86J543J310M5p60l39M01P16J247K315
$$ 506 183 -1146 -3916 -7454 -10482 -12344 -13012 -12426 -10883 -9573 -9528 -10288 -10627 -10226 -9510 -8263 -5948
55183e948K595R80j298k015r22J89M8q17j323j200q17m16J2N01R30J026O63R6
$$ -5948 -3353 -2373 -3671 -5686 -6608 -6419 -6371 -7188 -8511 -9711 -10528 -10944 -10932 -10431 -9501 -8475 -7812 -7716
55165g716l05n91j040j389r65J98J044Q74M34Q67J958K296J248j21m42K91J046
$$ -7716 -8021 -8612 -9652 -11041 -12006 -11808 -10764 -9890 -9456 -8589 -6631 -4335 -3087 -3208 -3650 -3359 -2313
55148b313i61F81K057J878P84k16r1M89K4j446A823a92j679k149k385j342J62
$$ -2313 -961 681 2738 4616 5400 5184 5093 5582 5606 4160 1823 -192 -1871 -4020 -6405 -7747 -7585
55131g585P90Q11J225J615P56j004j818j009N9L9q26j574j791j483o21N78J530
$$ -7585 -6795 -5984 -4759 -3144 -2388 -3392 -5210 -6219 -6160 -6121 -6947 -8521 -10312 -11795 -12416 -11838 -10308
55114a0308J856J641J068L65K6L95R68P53n01j943k476j457R14L305a682b79j795
$$ -10308 -8452 -6811 -5743 -5378 -5352 -4957 -3989 -3236 -3737 -5680 -8156 -9613 -8699 -5394 -1682 -279 -2074
55097b074l172k201q52r07j966k423j349Q58K906L349J695q21k166j548p4O76
$$ -2074 -5246 -7447 -8299 -9206 -11172 -13595 -14944 -14086 -11180 -7831 -6136 -6957 -9123 -10671 -10745 -10069
55081a0069J86r37j723j523m38P92J699K617L798a154B454J780N62O56J169J027
$$ -10069 -9883 -10820 -12543 -14066 -14504 -13712 -12013 -9396 -5598 -1154 2454 4234 4796 5452 6621 7648
55065G648K00o87j100p43L04J366J692J343J039J215J767K530L262L415K772K114
$$ 7648 7848 7161 6061 5318 5622 6988 8680 10023 11062 12277 14044 16574 19836 23251 26023 28137
55049B8137K264K706K232Q72p1rK56R9J46J127K614L445K870J012j253k726k866
$$ 28137 30401 33107 35339 36211 36140 36131 36387 36486 36632 37759 40373 43818 46688 47700 46447 43721 40855
55032D0855k353k003j507j58J439J793P19l61n65n15p26n45M30J178O47n90j178
$$ 40855 38502 36499 34992 34834 36273 38066 38785 38424 37859 37344 36618 36073 36503 37681 38328 37738 36560
55015C6560q39l08Q3O25J186R50l93j844j950m82J101J158l14j769k000j173J50
$$ 36560 35721 35413 35496 36121 37307 38257 37864 36020 34070 33588 34689 35847 35533 33764 31764 30591 30741
54998C0741J862L458L519J372j431k714k157r21M32J937K787K057P87J066K865
$$ 30741 32603 36061 39580 40952 39521 36807 34650 33729 34161 36098 38885 40942 41729 42795 45660
54983D5660L922L163K020J568O84j608l912m258k809j228l86j01k28o15n44N04
$$ 45660 49582 52745 54765 56333 57017 55409 51497 47239 44430 43202 42816 42715 42487 41872 41328 41832
54967D1832J990L012L306K876J550j80q19M12K157K360O93j423k775l278l223
$$ 41832 43822 46834 50140 53016 54566 54386 53567 53979 56136 58496 59189 57766 54991 51713 48490
54952D8490k593j253O22K343K917K033Q23Q25J931K325R35j043j708o14J208K465
$$ 48490 45897 44644 45266 47609 50526 52559 53382 54207 56138 58463 59398 58355 56647 56033 57241 59706
54936E9706K290P04r06q00Q43J784O29j219j700r93q27j707k415k003q69O3K48
$$ 59706 61996 62700 61794 60994 61837 63621 64250 63031 61331 60338 59511 57804 55389 53386 52517 52580 52828
54919E2828l10j024j084m50n2m10o95P0J534K628L058L240L291L068K779K638
$$ 52828 52518 51494 50410 49960 49908 49498 48803 48873 50407 53035 56093 59333 62624 65692 68471 71109
54903G1109K343J768J626K437L389L301K368J906K624M076N511O346O157N125
$$ 71109 73452 75220 76846 79283 82672 85973 88341 90247 92871 96947 102458 108804 114961 120086
54889A20086M253M319N039N911P230R236J1009J1541J1372J1767J2682J3024J2659
$$ 120086 124339 128658 133697 139608 146838 156074 167083 178624 189996 201763 214445 227469 240128
54876B40128J2543J2839J2518J1003Q730N726J310m230r047j1767j3068j4256
$$ 240128 252671 265510 278028 289031 297761 303487 304797 300567 291520 279753 266685 252429
54864B52429j5284j5278j4378j3653j3366j2564j0693q611p401o825n792m140
$$ 252429 237145 221867 207489 193836 180470 167906 157213 148602 141201 134376 128584 124444
54852A24444k900k657k586j749n09K69P73J701K652K644K231L239O004Q673J0055
$$ 124444 121544 118887 116301 114552 114043 114312 115085 116786 119438 122082 124313 127552 133556 142229 152284
54837A52284J1330J3704J5960J6166J4579J2926J1559R332N951K554j13k539n254
$$ 152284 163614 177318 193278 209444 224023 236949 248508 257840 263791 266345 266232 263693 258439
54824B58439q048j0556j2512j3571j3787j4060j5019j5740j4849j2624j0636r505
$$ 258439 250391 239835 227323 213752 199965 185905 170886 155146 140297 127673 117037 107532
54812A07532q475p142n866m488k346N0J197R50R64J907K013l06l720n457m708
$$ 107532 99057 91915 86049 81561 79215 79265 80462 81412 82376 84283 86296 85990 82270 76813 72105
54797G2105l106k279k305k467k318j857j387j305j542j322j2J793K689K024O29
$$ 72105 68999 66720 64415 61948 59630 57773 56386 55081 53539 52217 52205 53998 56687 58711 59340
54782E9340k78m60o50j357k163k389k144k154k619k772j958o16K91N24O52J107
$$ 59340 59062 58602 57952 56595 54432 52043 49899 47745 45126 42354 40396 39780 40071 40595 41247 42354
54766D2354J748K291K553K304J335j29j449k179k379k368k306j927p50J125K537
$$ 42354 44102 46393 48946 51250 52585 52456 51007 48828 46449 44081 41775 39848 39098 40223 42760
54751D2760K337J188J250L442N938O381M797L044K114J597J467K460M344N456
$$ 42760 45097 46285 47535 50977 56915 63296 68093 71137 73251 74848 76315 78775 83119 88575
54737H8575M845L656L638N067O816P775P603O736O280P324R744J2159J3509J4137
$$ 88575 93420 97076 100714 105781 112597 120372 127975 134711 140991 148315 158059 170218 183727 197864
54723A97864J4826J5417J5150J4015J2823J1884J0290O914J947k891n851o750
$$ 197864 212690 228107 243257 257272 270095 281979 292269 299183 301130 298239 292388 285638
54711B85638o942p710r015r887r643q328o453m743l815l503k965j932j386k139
$$ 285638 278696 270986 261971 252084 242441 234113 227660 222917 219102 215599 212634 210702 209316 207177
54697B07177l226k862q55J141J933K189L160N019P026Q592R588J0083J0353J0807
$$ 207177 203951 201089 200234 201375 203308 205497 208657 213676 220702 229294 238882 248965 259318 270125
54683B70125J1676J2955J4673J6730J8423J8670J6814J2927P563J842k608m914
$$ 270125 281801 294756 309429 326159 344582 363252 380066 392993 400556 402398 399790 394876
54671C94876o340r214j4113j8964k1448k1370k0191j8990j7685j5859j3560j1369
$$ 394876 388536 379322 365209 346245 324797 303427 283236 264246 246561 230702 217142 205773
54659B05773r953r404r065q331p481p086o768n530l445j933j965k890l531l581
$$ 205773 195820 186416 177351 169020 161539 154453 147685 142155 138710 136777 134812 131922 128391 124810
54645A24810l378l126k875k596j823p2J854K057j65l013m208l510k229j052K78
$$ 124810 121432 118306 115431 112835 111012 110940 112794 114851 114686 111673 107465 103955 101726 100674 100952
54630A00952J579K124J914J790J888J253n40k270k313n11J760L050K885J677J73
$$ 100952 102531 104655 106569 108359 110247 111500 110960 108690 106377 105866 107626 110676 113561 115238 115411
54615A15411q38o69Q86L181M884M882L226J089k20m0J598M061O125O606N568M419
$$ 115411 114573 113904 114790 117971 122855 127737 130963 132052 131832 131792 133390 137451 143576 150182 155750 160169
54599A60169M199M208L147J346O60J930L704M234L837M031M808M415K228L23J014
$$ 160169 164368 168576 171723 173069 173729 175659 179363 183597 187434 191465 196273 200688 202916 203239 204253
54584B04253L760N953O413O431P336Q694R599J0256J1174J1943J2114J2471J3977
$$ 204253 208013 213966 220379 226810 234146 242840 252439 262695 273869 285812 297926 310397 324374
54571C24374J5894J6409J4945J2559J0109P285L504j270o561j1308j3983j4126
$$ 324374 340268 356677 371622 384181 394290 401575 405079 403809 397248 385940 371957 357831
54559C57831j3504j4275j5996j6187j4116j1956j1533j1784j0822q770p023n854
$$ 357831 344327 330052 314056 297869 283753 271797 260264 248480 237658 228888 221865 216011
54547B16011m587l447l484m792o138o357n247l283j350n45j309k930m375n330
$$ 216011 211424 207977 204493 199701 193563 187206 181959 178676 177326 176781 175472 172542 168167 162837
54533A62837n802n441m172k930k642k911k756k287k323k660k160p37J57n39k057
$$ 162837 157035 151594 147422 144492 141850 138939 136183 133896 131573 128913 126753 126016 126173 125634 123577
54518A23577k937k788k369k451l066l669l712l210k641k193j453k28Q30J056P76
$$ 123577 120640 117852 115483 113032 109966 106297 102585 99375 96734 94541 93088 92860 93690 94746 95522
54503I5522O29L20q55k407k867j706N2J314J911J834Q92l91p19K69J265J110M07
$$ 95522 96151 96471 95616 93209 90342 88636 88688 90002 91913 93747 94639 94248 93529 93798 95063 96173 96580
54486I6580L84R75J307J419K005K891L119K623K418K930L327K937K190J647J054
$$ 96580 96964 97939 99246 100665 102670 105561 108680 111303 113721 116651 119978 122915 125105 126752 127806
54471A27806K36M6J470M132O570P818Q071Q070Q461R440J0312R641O758K986M29
$$ 127806 128042 128088 129558 133690 140260 148078 156149 164219 172680 182120 192432 202073 208831 211817 212246
54456B12246n83j664l773n756o227n801o106p254p796p053n996n538n300m735
$$ 212246 211663 209999 206226 200470 194243 188442 182336 175082 167286 160233 154237 148699 143399 138664
54442A38664m333m714n251m782l451k595k761k851j792k00M52j16o16M1J393K133
$$ 138664 134331 129617 124366 119584 116133 113538 110777 107926 106134 105934 106386 106270 105654 105695 107088 109221
54426A09221J675N42m73r82r34l96M31J278K030K742L388L781L743L176K109Q93
$$ 109221 110896 111438 110965 109983 109049 108653 109084 110362 112392 115134 118522 122303 126046 129222 131331 132224
54410A32224J88K99O55N33L7j80j06k50l36O17K483L481K362J69j243j609j973
$$ 132224 132412 132711 133366 133899 133936 133756 133650 133400 133064 133681 136164 139645 142007 142176 140933 139324 137351
54393A37351k505k159m76J451K164J284l53j488j404o75o44j724k704k502j811
$$ 137351 134846 132687 132211 133662 135826 137110 136757 135269 133865 133190 132546 130822 128118 125616 123805
54378A23805j997k941l381k977k458j902o17J149K046J684J251J553J847J305
$$ 123805 121808 118867 115486 112509 110051 108149 107532 108681 110727 112411 113662 115215 117062 118367
54364A18367K93n96j531k566k947k269j295p45k59N31J003O59L13Q89J884K293
$$ 118367 118660 118064 116533 113967 111020 108751 107456 106711 106452 106983 107986 108645 108958 109847 111731 114024
54348A14024K418L262M543M863L827K634K366K843L422L987M629N036M890M603
$$ 114024 116442 119704 124247 129110 132937 135571 137937 140780 144202 148189 152818 157854 162744 167347
54334A67347N082O520P723P096M547J822N22L24J0m31j50L83m72k878m803m854
$$ 167347 172429 178949 186672 193768 198315 200137 200659 200983 200993 200562 200412 200795 200323 197445 192642 187788
54318A87788m130m146m509m147l419l189k855j315P10J270p2j838k913l574m139
$$ 187788 183658 179512 175003 170856 167437 164248 161393 160078 160788 162058 161986 160148 157235 153661 149522
54303A49522m160l372k301j492r83o77m66k4P11J134Q43N47R93J450O91q09j269
$$ 149522 145362 141990 139689 138197 137214 136537 136071 136047 136758 137892 138735 139282 140275 141725 142416 141607 140338
54286A40338k37Q65J140J466K678M008M370M085M200M819N165M805L955K749J012
$$ 140338 140101 140966 142106 143572 146250 150258 154628 158713 162913 167732 172897 177702 181657 184406 185418
54271A85418j181l084l702k771j450j542l515n652n822l929j841j209k185l991
$$ 185418 184237 181153 177451 174680 173230 171688 168173 162521 156699 152770 150929 149720 147535 143544
54257A43544n541n660m036k047j464k200k627k221k217l165l722k860j699j693
$$ 143544 138003 132343 128307 126260 124796 122596 119969 117748 115531 112366 108644 105784 104085 102392
54243A02392k270j932q42n68j590k752l105k918k694k478k300k244j844m59J381
$$ 102392 100122 98190 97348 96780 95190 92438 89333 86415 83721 81243 78943 76699 74855 74396 75777
54228G5777K048Q53q71j422q15l53n69o63L1R61J101K33r54j641j372j68J298
$$ 75777 77825 78678 77807 76385 75570 75217 74648 73985 74016 74977 76078 76311 75357 73716 72344 72176 73474
54211G3474J889J042m05r98l82M42P32R99J863K723K444J054k26n44j97J41K00
$$ 73474 75363 76405 76000 75002 74620 75062 75794 76793 78656 81379 83823 84877 84651 84107 83910 84051 84251
54194H4251r4q63j881k366j642L0J592K092J491N86J27Rm20j315j960j721q69
$$ 84251 84157 83294 81413 79047 77405 77435 79027 81119 82610 83196 83323 83332 82912 81597 79637 77916 77047
54177G7047j80j09o59j467j653m09J648K521J197p37j086L9P55M31K92R65J367
$$ 77047 76867 76758 76099 74632 72979 72570 74218 76739 77936 77199 76113 76152 76907 77338 77630 78595 79962
54160G9962O52l77p25o47p29p00k39R3q3%Q72J375K50j465j518J90J226J21j541
$$ 79962 80614 80237 79512 78865 78136 77436 77197 77290 77207 77207 78079 79454 79704 78239 76721 76911 78137 78258 76717
54141G6717j514p1P11R4m62L65J948K721K085O20r15j964k073j296n77q16j589
$$ 76717 75203 75132 75843 75937 75475 75840 77788 80509 82594 83214 82299 80335 78262 76966 76389 75573 73984
54124G3984j708j035o21q85r95p29j410l681n636m885j937L61N13l07o17m07n0
$$ 73984 72276 71241 70620 69735 68740 68011 66601 62920 57284 52399 50462 50823 51336 51029 50412 50005 49955
54107D9955P55J999K723K311J509J273J545J896K413K945K556Q64q51j119k91
$$ 49955 50710 52709 55432 57743 59252 60525 62070 63966 66379 69324 71880 72744 71893 70774 70483
54092G0483J81k5L3O11O77m72k082k934k623j507q0J040J105j39j810k386j057
$$ 70483 70664 70639 70672 71283 71960 71488 69406 66472 63849 62342 62262 63302 64407 64268 62458 60072 59015
54075E9015J447L364L378J655n43k149k963l157k684j555l65J6p05j927k706k518
$$ 59015 60462 63826 67204 68859 68316 66167 63204 60047 57363 55808 55443 55459 54754 52827 50121 47603
54059D7603j566n56p5o5L3N77J316J729J569J011M11J28L83J088J785J835R15
$$ 47603 46037 45481 45406 45341 45374 45951 47267 48996 50565 51576 51987 52115 52498 53586 55371 57206 58121
54042E8121m19q43M49K368K646M89k105k602j039K94k2r99r95K87J959L067L013
$$ 58121 57702 56859 57308 59676 62322 62811 60706 58104 57065 57359 57337 56338 55343 55630 57589 60656 63669
54025F3669J831N29L44J116J347L32p09l95R48J938J898J043k71j353j010J102
$$ 63669 65500 66029 66373 67489 68836 69168 68459 68064 69012 70950 72848 73891 73620 72267 71257 72359
54009G2359L360L741K328J016Q52R78M33l66n46j51K72Q08J976L586M567M185
$$ 72359 75719 79460 81788 82804 83656 84634 85067 84701 84155 84004 84276 85084 87060 90646 95213 99398
53993I9398L008K327K628L059K669J771J484K027K309J624Q26J091K150K765K710
$$ 99398 102406 104733 107361 110420 113089 114860 116344 118371 120680 122304 123130 124221 126371 129136 131846
53978A31846L104M589O093O078M490L002L381N827Q711R889Q584O199N039N945
$$ 131846 134950 139539 145632 151710 156200 159202 162583 168410 177121 187010 195594 201793 206832 212777
53964B12777P420P355N466L505L073L877M534M455M124L791L086K170K024K897
$$ 212777 220197 227552 233018 236523 239596 243473 248007 252462 256586 260377 263463 265633 267657 270554
53950B70554L410K295L00q93j104j570k651l273k905k573l271m536n304n328n128
$$ 270554 273964 276259 276559 275666 274562 272992 270341 267068 264163 261590 258319 253783 248479 243151 238023
53935B38023n212n752o357n968m025j829j542l339m947m616l158k170j710j046
$$ 238023 232811 227059 220702 214734 210709 208880 207338 203999 199052 194436 191278 189108 187398 186352
53921A86352m32n31r31p73l31n24j300j809j805j610j213n90m60j252j815o94
$$ 186352 185920 185389 184458 183685 183354 182830 181530 179721 177916 176306 175093 174503 174043 172791 170976 170282
53905A70282J505K629J762O5j277k294l163l302k212k57J741K956K655R21p55
$$ 170282 171787 174416 176178 176243 174966 172672 169509 166207 163995 163738 165479 168435 171090 172011 171256
53890A71256p43N76J228L09r46j063K7J687L531M982N208M370L949M885O301O929
$$ 171256 170513 171089 172317 172626 171680 170617 170644 172331 175862 180844 186052 190422 194371 199256 205557 212486
53874B12486O972P407Q173Q339P659O758N924M822L519K787K982L403L283K895
$$ 212486 219458 226865 235038 243377 251036 257794 263718 268540 272059 274846 277828 281231 284514 287409
53860B87409L144M203N183N217M438L521K699J912J736L248O449R614J0876J0086
$$ 287409 290553 294756 299939 305156 309594 313115 315814 317726 319462 322710 329159 338773 349649 359735
53846C59735Q465O950N707M895M828N332N776N791N317M085J908n46k223k976
$$ 359735 368200 375150 380857 385752 390580 395912 401688 407479 412796 416881 418789 418243 416020 413044
53832D13044l485l919l700k886k662l902n879p138p054o225n715o181p332q093
$$ 413044 409559 405640 401940 399054 396392 392490 386611 379473 372419 366194 360479 354298 346966 338873
53818C38873p844p429q149r744j0528r726q535q266q491p934o371m738l894m013
$$ 338873 331029 323600 315451 305707 295179 285453 276918 268652 260161 252227 245856 241118 237224 233211
53804B33211m790n430m910l006r01j64j292l562n862p156o785n085l445l061l745
$$ 233211 228421 222991 218081 215075 214174 214010 212718 209156 203294 196138 189353 184268 180823 177762 174017
53789A74017m466m566l999k844j426n79r24j890k307j922j660k216l030k937j520
$$ 174017 169551 164985 160986 158142 156716 156137 155213 153323 151016 149094 147434 145218 142188 139251 137731
53774A37731M80J932K287J863J211M67m25j059p98J81Q85Q46P34J149J579J398
$$ 137731 138211 140143 142430 144293 145504 145971 145546 144487 143689 143870 144755 145601 146335 147484 149063 150461
53758A50461J088J502K331K547K135K126K826L243K633J556Q85O60N45O84J360
$$ 150461 151549 153051 155382 157929 160064 162190 165016 168259 170892 172448 173333 173993 174538 175222 176582
53743A76582K334L183L936M755N361N404N086M820M562M193M173M925N695N244
$$ 176582 178916 182099 186035 190790 196151 201555 206641 211461 216023 220216 224389 229314 235009 240253
53729B40253L866L605N701Q729J0154R247P400N965M964L988L145K615K019R52
$$ 240253 244119 247724 253425 262154 272308 281555 288955 294920 299884 303872 307017 309632 311651 312603
53715C12603l39j344k007k567k953k870k353j809j649k034k808l455l496l187
$$ 312603 312264 310920 308913 306346 303393 300523 298170 296361 294712 292678 289870 286415 282919 279732
53701B79732l384m361n222n069m258l804l930m106m256m910o055o806o603n935
$$ 279732 276348 271987 266765 261696 257438 253634 249704 245598 241342 236432 230377 223571 216968 211033
53687B11033n494n136m268k824j388n09k83n50j196k078k759k563j306J31M87
$$ 211033 205539 200403 196135 193311 191923 191414 191131 190581 189385 187307 184548 181985 180679 180810 181297
53672A81297k90q25q3J160J404M11p13j077o38L76J535J925J022n4M94K717M742
$$ 181297 181007 180182 180099 181259 182663 183074 182361 181284 180646 181022 182557 184482 185504 185450 185944 188661 193403
53655A93403N245M765M055K740O28r17m34J639L593M589M933M774L871K594J894
$$ 193403 198648 203413 207468 210208 210836 209919 209485 211124 214717 219306 224239 229013 232884 235478 237372
53640B37372K109K596K683K321J811J512J777K533K991K487J623J809L494N503
$$ 237372 239481 242077 244760 247081 248892 250404 252181 254714 257705 260192 261815 263624 267118 272621
53626B72621O344N695M360L310L062L527M117M143L363K183J250J022J566K512
$$ 272621 278965 284660 289020 292330 295392 298919 303036 307179 310542 312725 313975 314997 316563 319075
53612C19075L116K766J628O30N31J051J142K24r84j213j76R40Q81r9o11qQ32Q32
$$ 319075 322191 324957 326585 327215 327746 328797 329939 330163 329179 327966 327790 328730 329611 329512 328901 328893 329725 330557
53594C30557J52k48l5J85q0n37o92o93j111k012k584j984l86J141J814J759J390
$$ 330557 330709 330461 330426 330611 330531 329994 329302 328609 327498 325486 322902 320918 320532 321673 323487 325246 326636
53577C26636P17k00n95M23K618M577N038L945K323J487K155L772M902M736L862
$$ 326636 327353 327153 326558 326981 329599 334176 339214 343159 345482 346969 349124 352896 357798 362534 366396
53562C66396K999J732l33j840q90K062M425M931N005N902O467N241L231K725M215
$$ 366396 369395 371127 370794 368954 368064 370126 374551 379482 384487 390389 396856 402097 405328 408053 412268
53547D12268O219P581Q339Q645Q435Q189Q586R235Q908P244N330M438M894O246
$$ 412268 418487 426068 434407 443052 451487 459676 468262 477497 486405 493649 498979 503417 508311 514557
53533E14557P664Q234P606O523O151O854Q053R009R200Q246O321M411L393L064
$$ 514557 522221 530455 538061 544584 550735 557589 565642 574651 583851 592097 598418 602829 606222 609286
53519F09286K730K425K637L169L242K639J853J258R79J272K087K549K013J246
$$ 609286 612016 614441 617078 620247 623489 626128 627981 629239 630218 631490 633577 636126 638139 639385
53505F39385J346J816J254j72p31J98J282J501J486J773J452j78j944k246j180
$$ 639385 640731 642547 643801 643629 642898 643096 644378 645879 647365 649138 650590 650412 648468 646222 645042
53490F45042M1R46J818K496K597K531L069M028M457M024L399L354M247N989P735
$$ 645042 645083 646029 647847 650343 652940 655471 658540 662568 667025 671049 674448 677802 682049 688038 695773
53475F95773Q116O846N705O618Q948J0129R172P976Q610J0624J2082J2263J2066
$$ 695773 703889 710735 716440 723058 732006 742135 751307 759283 767893 778517 790599 802862 814928
53462H14928J2291J2842J3638J5187J7730K0523K2494K3315K3483K3599K3971
$$ 814928 827219 840061 853699 868886 886616 907139 929633 952948 976431 1000030 1024001
53451A024001K4779K6150K7969K9817L1285L2259L2877L3433L4319L5799L7710
$$ 1024001 1048780 1074930 1102899 1132716 1164001 1196260 1229137 1262570 1296889 1332688 1370398
53440A370398L9581M1163M2597M3914M4802M5171M5569M6467M7406M7528M6871
$$ 1370398 1409979 1451142 1493739 1537653 1582455 1627626 1673195 1719662 1767068 1814596 1861467
53429A861467M6392M6562M6658M5871M4489M3506M3377M3732M4052M4161M4081
$$ 1861467 1907859 1954421 2001079 2046950 2091439 2134945 2178322 2222054 2266106 2310267 2354348
53418B354348M3878M3711M3687M3594M3042M1885M0400L8894L7314L5392L3159
$$ 2354348 2398226 2441937 2485624 2529218 2572260 2614145 2654545 2693439 2730753 2766145 2799304
53407B799304L1147K9789K8587K6264K2146J7275J3626J2099J1626J0408P655
$$ 2799304 2830451 2860240 2888827 2915091 2937237 2954512 2968138 2980237 2991863 3002271 3009926
53396C009926M020P21j482k897m767q271j3214j8088k1758k4708k7923l0975l2306
$$ 3009926 3013946 3014667 3013185 3010288 3005521 2997250 2984036 2965948 2944190 2919482 2891559 2860584 2828278
53383B828278l1621l0922l2309l5370l7717l7951l7061l6707l7085l7279l7011
$$ 2828278 2796657 2765735 2733426 2698056 2660339 2622388 2585327 2548620 2511535 2474256 2437245
53372B437245l6945l7302l7238l6045l4273l2911l1901l0134k6877k2591j8346
$$ 2437245 2400300 2362998 2325760 2289715 2255442 2222531 2190630 2160496 2133619 2111028 2092682
53361B092682j4884j2399j0616q850o396l296n10J163K148L761O765J0666J4504
$$ 2092682 2077798 2065399 2054783 2045933 2039537 2036241 2035731 2036894 2039042 2042803 2049568 2060234 2074738
53348B074738J7933K1126K4051K6512K8894L2083L6186M0033M2582M4399M6799
$$ 2074738 2092671 2113797 2137848 2164360 2193254 2225337 2261523 2301556 2344138 2388537 2435336
53337B435336M9860N2465N4330N6685O0328O4227O7041O9123P1795P5238P8381
$$ 2435336 2485196 2537661 2591991 2648676 2709004 2773231 2840272 2909395 2981190 3056428 3134809
53326C134809Q0731Q2911Q5293Q7238Q8185Q8659Q9751R2046R5225R8151R9307
$$ 3134809 3215540 3298451 3383744 3470982 3559167 3647826 3737577 3829623 3924848 4022999 4122306
53315D122306R7944R5016R2304R0435Q8488Q5600Q1943P7830P3039O7617O2334
$$ 4122306 4220250 4315266 4407570 4498005 4586493 4672093 4754036 4831866 4904905 4972522 5034856
53304E034856N7385N1627M4221L6344K9924K5017J9793J3006N210k579j0156j7602
$$ 5034856 5092241 5143868 5188089 5224433 5254357 5279374 5299167 5312173 5317383 5314804 5304648 5287046
53292E287046k4553l0749l6679m3018m9817n6599o2965o8803p4298p9963q6034
$$ 5287046 5262493 5231744 5195065 5152047 5102230 5045631 4982666 4913863 4839565 4759602 4673568
53281D673568r1500r4481r4239r2306r0816r0174q9202q7272q5201q3944q3424
$$ 4673568 4582068 4487587 4393348 4301042 4210226 4120052 4030850 3943578 3858377 3774433 3691009
53270C691009q3027q2375q1186p9157p6671p4846p4128p3242p0497o5912o1119
$$ 3691009 3607982 3525607 3444421 3365264 3288593 3213747 3139619 3066377 2995880 2929968 2868849
53259B868849n7271n3955n0262m6110m2092l8747l6355l4831l3447l1329k8674
$$ 2868849 2811578 2757623 2707361 2661251 2619159 2580412 2544057 2509226 2475779 2444450 2415776
53248B415776k6827k6425k6007k3449j8626j3619j0139p703m889j668N00P87L43
$$ 2415776 2388949 2362524 2336517 2313068 2294442 2280823 2270684 2262981 2258092 2256424 2256924 2257711 2258054
53235B258054R83L042N298P040R262J3053J7476K0233K0585K0553K2554K6579
$$ 2258054 2259037 2262079 2267377 2274417 2283679 2296732 2314208 2334441 2355026 2375579 2398133 2424712
53223B424712L0498L2741L3867L5430L7999M0677M2321M2875M3173M3425M2478
$$ 2424712 2455210 2487951 2521818 2557248 2595247 2635924 2678245 2721120 2764293 2807718 2850196
53212B850196L9286L4730L0911K8632K6779K4524K2680K1906K0959J8184J3880
$$ 2850196 2889482 2924212 2955123 2983755 3010534 3035058 3057738 3079644 3100603 3118787 3132667
53201C132667R674O142K704n57k917m817p781j2112j6352j9595k2724k6549l0275
$$ 3132667 3142341 3148483 3151187 3150630 3147713 3142896 3135115 3123003 3106651 3087056 3064332 3037783 3007508
53188C007508l2896l4879l7273m0134m2952m5721m8385n0056n0158m9724n0072
$$ 3007508 2974612 2939733 2902460 2862326 2819374 2773653 2725268 2675212 2625054 2575330 2525258
53177B525258n0692m9965m7718m5637m5054m5665m6495m6738m5564m2680l9538
$$ 2525258 2474566 2424601 2376883 2331246 2286192 2240527 2194032 2147294 2101730 2059050 2019512
53166B019512l8456l9671m0631l9211l6487l4944l4994l4884l3550l1753l0311
$$ 2019512 1981056 1941385 1900754 1861543 1825056 1790112 1755118 1720234 1686684 1654931 1624620
53155A624620k8894k7037k5036k3188k1297j9667j9447k1060k3072k3773k3360
$$ 1624620 1595726 1568689 1543653 1520465 1499168 1479501 1460054 1438994 1415922 1392149 1368789
53144A368789k3401k4545k5962k6822k6987k6204k3973k0861j8685j8646j9886
$$ 1368789 1345388 1320843 1294881 1268059 1241072 1214868 1190895 1170034 1151349 1132703 1112817
53133A112817k0733k0798k1029k1926k2605k1836j9549j7120j6135j6958j8635
$$ 1112817 1092084 1071286 1050257 1028331 1005726 983890 964341 947221 931086 914128 895493
53122H95493k0233k1691k2967k3069k1119j8072j5999j5584j5674j5479j5600
$$ 895493 875260 853569 830602 807533 786414 768342 752343 736759 721085 705606 690006
53111F90006j6201j5894j3753j1134j0085j0792j1965j2853j3387j3069j1475
$$ 690006 673805 657911 644158 633024 622939 612147 600182 587329 573942 560873 549398
53100E49398r549q729r027r163q560p836p566p782q430r054q497o423m652n171
$$ 549398 539849 531120 522093 512930 504370 496534 488968 481186 472756 463702 455205 448782 444130 438959
53086D38959p094p642o108m705n054o086o228n634n128m585l640k708k168j583
$$ 438959 431865 424223 418115 413410 408356 402270 396042 390408 385280 380695 377055 374347 372179 370596
53072C70596p48m61j361k878m102m742m688l814k849l049m219m498l036j429j331
$$ 370596 369848 369387 368026 365148 361046 356304 351616 347802 344953 341904 337685 333187 330151 328722 327391
53057C27391k118k273j705j139m58N33P43q61l181m102l194j755o30K18L98p35
$$ 327391 325273 323000 321295 320156 319698 320231 320974 320113 316932 312830 309636 307881 307251 307469 307867 307132
53041C07132k544l401k795j832j436j272o73M17J542K043J340k05j021l3J609
$$ 307132 304588 301187 298392 296560 295124 293852 293179 293596 295138 297181 298521 298316 297295 297262 298871
53026B98871J711j03j880j807p1J886K995L170L003L090L255K710J383M34O35
$$ 298871 300582 300479 298599 296792 296721 298607 301602 304772 307775 310865 314120 316830 318213 318647 319282
53011C19282J006K22j327k339k814l760n022n321m496l821l772l399k520k655
$$ 319282 320288 320510 319183 316844 314030 310270 305248 299927 295431 291610 287838 284439 281919 279264
52997B79264m667o883o887m470j732p78j980m031n143m556l242k706l136l370
$$ 279264 274597 267714 260827 256357 254625 253847 251867 247836 242693 238137 234895 232189 229053 225683
52983B25683k671j566p91n60j103k765n023o406o061m632l135j857p97l05n06
$$ 225683 223012 221446 220655 220095 218992 216227 211204 204798 198737 194105 190970 189113 188316 188011 187505
52968A87505q57q70o85n13k51o3m82j446k048j790j281j147j179j136j418k040
$$ 187505 186648 185778 185093 184580 184329 184266 183784 182338 180290 178500 177219 176072 174893 173757 172339 170299
52952A70299j905k30J927K707J704K68k40K51R00Q97K22l12N8R65J311Q32L59
$$ 170299 168394 168164 170091 172798 174502 174770 174530 174781 175681 176578 176800 176488 176546 177511 178822 179654 180013
52935A80013J63o58k361l390k421o09j78j279k003j353l95j60j8R22K049J951
$$ 180013 180176 179518 177157 173767 171346 170737 170559 169280 167277 165924 165529 165369 165351 166273 168322 170273
52919A70273M39j119j332j30J482K540K856K764K473J869R85K27o4l6L0J39L42
$$ 170273 170712 169593 168261 168131 169613 172153 175009 177773 180246 182115 183100 183327 183263 183227 183257 183396 183738
52902A83738M00J80Q8N68J357J817J895K143K836L546L749L409K826K287J941
$$ 183738 184138 184318 184406 184974 186331 188148 190043 192186 195022 198568 202317 205726 208552 210839 212780
52887B12780J780J717J800K276L214M162M568M398M070L930M072M505N078N358
$$ 212780 214560 216277 218077 220353 223567 227729 232297 236695 240765 244695 248767 253272 258350 263708
52873B63708N080M631M553M626M029K648J563J804K899L324K321P97J52N00O16
$$ 263708 268788 273419 277972 282598 286627 289275 290838 292642 295541 298865 301186 301983 302135 302635 303251
52858C03251l75j880k788k946k901k454q05J590K577P03k612m488l901k457j960
$$ 303251 302876 300996 298208 295262 292361 289907 289102 290692 293269 293972 291360 286872 282971 280514 278554
52843B78554k367k554k160j816j953k118j555k26R34Q41n71k216k933k566j722
$$ 278554 276187 273633 271473 269657 267704 265586 264031 263805 264739 265580 265009 262793 259860 257294 255572
52828B55572p94K57J326J962J854J108j7j247k166k381j876q58N62K088K780J899
$$ 255572 254778 255035 256361 258323 260177 261285 261268 260021 257855 255474 253598 252740 253302 255390 258170 260069
52812B60069K40l74N80J512J018pK92J805K466J159p73j516j080p88j181j493
$$ 260069 260309 259935 260515 262027 263045 263038 263330 265135 267601 268760 267987 266471 265391 264603 263422 261929
52796B61929j033k58k37j330k593k553q06J239J690L91q19l49J361K810L418L577
$$ 261929 260896 260638 260401 259071 256478 253925 253119 254358 256048 256439 255620 255271 256632 259442 262860 266437
52780B66437L336K403J294J181K190L005K595J465O17J66l35q90j145j044p17
$$ 266437 269773 272176 273470 274651 276841 279846 282441 283906 284523 284689 284354 283464 282319 281275 280558
52765B80558j27O46J104R30M61J43l1j4O69K007K781J804m23k186k547j962j103
$$ 280558 280431 281077 282181 283111 283572 283715 283684 283670 284339 286346 289127 290931 290508 288322 285775 283813 282710
52748B82710j4J393K789L527K992J020j597l414l778l557l752m110l999l915m627
$$ 282710 282696 284089 286878 290405 293397 294417 292820 289406 285628 282071 278319 274209 270210 266295 261668
52733B61668n420m925l565l171m045m470l625k963l703m803m803m050l563l144
$$ 261668 256248 251323 247758 244587 240542 236072 232447 229484 225781 220978 216175 212125 208562 205418
52719B05418k336k158l717n736n638l070m78Q7q44j682j936k138k605l126l326
$$ 205418 203082 200924 197207 191471 185833 182763 182285 182372 181528 179846 177910 175772 173167 170041 166715
52704A66715k764j183P86J655M37k126m144m415l456k705k831l127k690j915k158
$$ 166715 163951 162768 163554 165209 165646 163520 159376 154961 151505 148800 145969 142842 140152 138237 136079
52689A36079l769n228m798k656o10J19M8K70Q04O58p36k601l572l181k252j701
$$ 136079 132310 127082 122284 119628 119018 119137 119185 119455 120259 120917 120181 117580 114008 110827 108575 106874
52673A06874j445r24k00L03P80J677K370J629k88j384o05O20N51k87j37J199K249
$$ 106874 105429 104505 104305 104608 105388 107065 109435 111064 110776 109392 108787 109407 109958 109671 109534 110733 112982
52656A12982K093J127j37j524k513k551k132k190k350j343N87J369k6j844j790
$$ 112982 115075 116202 116065 114541 112028 109477 107345 105155 102805 101462 102049 103418 103392 101548 99758
52641I9758M9J670J797Q81o9n42n26l45m21o82m35N85J442J090N3m5J259K472
$$ 99758 99807 101477 103274 104155 104086 103544 103018 102673 102252 101570 101135 101720 103162 104252 104305 104260 105519 107991
52623A07991K129P37o9J73L97m9k98N43J665J493Q8o32O16K867M320M446L892
$$ 107991 110120 110857 110788 110961 111358 111309 111011 111554 113219 114712 114800 114168 114784 117651 121971 126417 130309
52606A30309L074K048J240J132J417J568K017L509N305N536L705J395p6j298l084
$$ 130309 133383 135431 136671 137803 139220 140788 142805 146314 151619 157155 160860 162255 162179 160881 157797
52591A57797m437l820j677j72m56j601k315k487k667k999l226l136k598j629p33
$$ 157797 153360 149540 147863 147691 147235 145634 143319 140832 138165 135166 131940 128804 126206 124577 123844
52576A23844o44j439k412l051l447l428k174M68K881L179J593K74L93O45o44k827
$$ 123844 123200 121761 119349 116298 112851 109423 107249 107717 110598 113777 115370 115644 116037 116682 116038 113211
52560A13211l500j583J200K230Q31j256j951r73K05L14l14n39k10j97o71m35J272
$$ 113211 109711 108128 109328 111558 112389 111133 109182 108209 108414 108728 108414 107875 107665 107468 106797 106362 107634
52543A07634L277L834K962K046J462J32k134l559k553J15K329L156L292L451L387
$$ 107634 110911 114745 117707 119753 121215 121347 119213 115654 113101 113216 115545 118701 121993 125444 128831
52528A28831K509P37j242k290j560N34K445K983K414J606P55k80q42J16K376M184
$$ 128831 131340 132077 130835 128545 126985 127519 129964 132947 135361 136967 137722 137442 136600 136716 139092 143276
52512A43276M059K283L51o09n38P5R21J965K958L239K433J222Q83J873L373M390
$$ 143276 147335 149618 149969 149360 148822 148897 149818 151783 154741 157980 160413 161635 162518 164391 167764 172154
52496A72154M541L589J282j659l354k674p56M55N89O36R57J004Q23J223K180K480
$$ 172154 176695 180284 181566 179907 176553 173879 173123 173578 174167 174803 175760 176764 177587 178810 180990 183470
52480A83470J465R0k34Q70K691L996L646J595m26m05J538L234L289K557K262K181
$$ 183470 184935 185025 184791 185661 188352 192348 195994 197589 197163 196758 198296 201530 204819 207376 209638 211819
52464B11819J508M08n07j287k025j986p26O34O78j39j08J059J836J259J59n34
$$ 211819 213327 213735 213228 211941 209916 207930 207204 207838 208516 208377 208269 209328 211164 212423 212582 212048
52448B12048j305k881m519m736l333j649q56q10p21k45M25J022J356J257P09r
$$ 212048 210743 207862 203343 198607 195274 193625 192769 191959 191238 190993 191418 192440 193796 195053 195762 195753
52432A95753n52p86p65n64l24k18n6Q51K865N080N825M317J465j152k555k575
$$ 195753 195201 194415 193650 193086 192762 192544 192488 193339 196204 201284 207109 211426 212891 211739 209184 206609
52416B06609j491%J056J514K026K870L231K356Q27j51k65M5P29J925K919K741
$$ 206609 205118 205118 206174 207688 209714 212584 215815 218171 218998 218847 218582 218627 219356 221281 224200 226941
52400B26941J792J444J872J764N25p09j031j236k218l144k614r59J14j33p25n56
$$ 226941 228733 230177 232049 233813 234338 233629 232598 231362 229144 226000 223386 222427 222541 222408 221683 221127
52384B21127K83R09P07j42q28o79k1P6p65j600j414m35M52R23R32M9j802l299
$$ 221127 221410 222319 223026 222884 222056 221377 221356 221432 220667 219067 217653 217218 217670 218593 219525 219574 217772 214473
52366B14473k849p20J229K011K307K649K347R72m48p77l83k81m50k87p1n72j359
$$ 214473 211624 210904 212133 214144 216451 219100 221447 222419 221971 221194 220811 220530 220080 219793 219722 219150 217791
52349B17791j084M26J746J989J917K246K184R05o22p71L25J158J395K230L907
$$ 217791 216707 217133 218879 220868 222785 225031 227215 228120 227498 226727 227052 228210 229605 231835 235742
52334B35742M749L497J217k28m79l59k48j83o84j958k733j516J098K992L308L119
$$ 235742 240491 243988 245205 244977 244498 244139 243891 243708 243024 241066 238333 236817 237915 240907 244215 247334
52318B47334L197K854J620N84R80K472L714L883K992J552N35Q47K154L053L005
$$ 247334 250531 253385 255005 255589 256569 259041 262755 266638 269630 271182 271717 272564 274718 277771 280776
52303B80776L112M116M870M140K923L214M895N691M413K569K239L484M699M752
$$ 280776 283888 288004 292874 297014 299937 303151 308046 313737 318150 320719 322958 326442 331141 335893
52289C35893L948L263L230L552L566L116K823L301M222M658M283L730L736M336
$$ 335893 339841 343104 346334 349886 353452 356568 359391 362692 366914 371572 375855 379585 383321 387657
52275C87657N088N633N859N819N656N455N134M683M376M473M687M382L392K410
$$ 387657 392745 398378 404237 410056 415712 421167 426301 430984 435360 439833 444520 448902 452294 454704
52261D54704K401L680N561O762O491N338M903O027P655Q120P507P774J0160J3236
$$ 454704 457105 460785 466346 473108 479599 484937 489840 495867 503522 511642 519149 526923 537083 550319
52247E50319J4450J3216J1508J1418J3101J5466J7806J9826K0776K0019J8446
$$ 550319 564769 577985 589493 600911 614012 629478 647284 667110 687886 707905 726351
52236G26351J7958J9014J9977J9664J9357K0870K3495K4671K3521K1927K1728
$$ 726351 744309 763323 783300 802964 822321 843191 866686 891357 914878 936805 958533
52225I58533K2477K2759K2341K1955K1904K1943K1963K1817K0998J9314J7509
$$ 958533 981010 1003769 1026110 1048065 1069969 1091912 1113875 1135692 1156690 1176004 1193513
52214A193513J6285J5278J3817J2345J1981J2745J3278J2402J0231P669N514M169
$$ 1193513 1209798 1225076 1238893 1251238 1263219 1275964 1289242 1301644 1311875 1319544 1325058 1329227
52202A329227L572L166K409J516J218J745K415K393J678J034J225K216L124L058
$$ 1329227 1332799 1335965 1338374 1339890 1341108 1342853 1345268 1347661 1349339 1350373 1351598 1353814 1356938 1359996
52188A359996K203J869L113N457P373P897P537P523Q439R711J0466J0756J1562
$$ 1359996 1362199 1364068 1367181 1372638 1380011 1387908 1395445 1402968 1411407 1421118 1431584 1442340 1453902
52175A453902J3380J5284J6039J5797J5621J5523J4321J1845R836R717J0615J0756
$$ 1453902 1467282 1482566 1498605 1514402 1530023 1545546 1559867 1571712 1581548 1591265 1601880 1612636
52163A612636R907R102Q633P766O185M352K459K88j901l474m486n616o819p165
$$ 1612636 1622543 1631645 1640278 1648044 1654229 1658581 1661040 1661328 1659427 1655953 1651467 1645851 1639032 1631867
52149A631867o364n557o053p802r545j0101r332q142p596p863q267q607r631j1490
$$ 1631867 1625503 1619946 1613893 1606091 1596546 1586445 1577113 1568971 1561375 1553512 1545245 1536638 1527007 1515517
52135A515517j2507j0842p092l871k827l286l911m244m250l745k977k682k951
$$ 1515517 1503010 1492168 1485076 1481205 1478378 1475092 1471181 1466937 1462687 1458942 1455965 1453283 1450332
52122A450332k906k197j777k468l596l959l393k552j738r60o70j415k893m148
$$ 1450332 1447426 1445229 1443452 1440984 1437388 1433429 1430036 1427484 1425746 1424786 1424116 1422701 1419808 1415660
52108A415660m641m580m304m002l877l969l842l077k149k255l924o162p357p040
$$ 1415660 1411019 1406439 1402135 1398133 1394256 1390287 1386445 1383368 1381219 1378964 1375040 1368878 1361521 1354481
52094A354481o397o807p972q109o231l575k089j992j956j450j493k685l940m157
$$ 1354481 1348084 1341277 1333305 1325196 1318965 1315390 1313301 1311309 1309353 1307903 1306410 1303725 1299785 1295628
52080A295628l990m718n976o141m746l096k247j709p66q5r13l164n267n936n447
$$ 1295628 1291638 1286920 1280944 1274803 1270057 1266961 1264714 1263005 1262239 1262154 1261241 1258077 1252810 1246874 1241427
52065A241427m942n089n672o104n948n130m029l243k978k806k284j507o76N52
$$ 1241427 1236485 1231396 1225724 1219620 1213672 1208542 1204513 1201270 1198292 1195486 1193202 1191695 1191019 1191571
52051A191571K434M154M516L856M048O112Q926J1078J2743J4459J5241J3866J1549
$$ 1191571 1194005 1198159 1202675 1206531 1210579 1216691 1225617 1236695 1249438 1263897 1279138 1293004 1304553
52038A304553J1234J3921J7576K0166K1959K3946K5652K6084K5747K6089K7416
$$ 1304553 1315787 1329708 1347284 1367450 1389409 1413355 1439007 1465091 1490838 1516927 1544343
52027A544343K8709K9262K9182K8428K6674K4362K2665K1898K0922J8853J6674
$$ 1544343 1573052 1602314 1631496 1659924 1686598 1710960 1733625 1755523 1776445 1795298 1811972
52016A811972J6031J6707J6312J2986P709L243J139N32j31j133j725j573j333
$$ 1811972 1828003 1844710 1861022 1874008 1881717 1884960 1886099 1886631 1886500 1885367 1883642 1882069 1880736
52003A880736j918l748o432q764r501q610p419p007p007o675o334o650p055o395
$$ 1880736 1878818 1875070 1868638 1859874 1850373 1841763 1834344 1827337 1820330 1813655 1807321 1800671 1793616 1787221
51989A787221m930m042l875k942m89K302M071M789M740L607J612K37M66J400J961
$$ 1787221 1782291 1778249 1774374 1771432 1770943 1773245 1777316 1782105 1786845 1790452 1792064 1792301 1792767 1794167 1796128
51974A796128K870N270Q101Q865O763L535J108q4l58L9M56k56k542n436p501q074
$$ 1796128 1798998 1804268 1812369 1821234 1827997 1831532 1832640 1832556 1832198 1832237 1832693 1832437 1829895 1824459 1816958 1808884
51958A808884p498o808p292r540j2600j4772j5524j5982j7236j8954k0183k0876
$$ 1808884 1801386 1794578 1787286 1777746 1765146 1750374 1734850 1718868 1701632 1682678 1662495 1641619
51946A641619k1808k3301k4778k5572k5698k5758k6325k7475k8690k9243k8904
$$ 1641619 1619811 1596510 1571732 1546160 1520462 1494704 1468379 1440904 1412214 1382971 1354067
51935A354067k8296k8346k9272l0231l0122k8811k7457k7385k8724l0282l0849
$$ 1354067 1325771 1297425 1268153 1237922 1207800 1178989 1151532 1124147 1095423 1065141 1034292
51924A034292l0302k9323k8440k7712k7040k6290k5204k3713k2385k1955k2271
$$ 1034292 1003990 974667 946227 918515 891475 865185 839981 816268 793883 771928 749657
51913G49657k2168k0835j8884j7493j6835j5983j4491j3217j3137j3847j4022
$$ 749657 727489 706654 687770 670277 653442 637459 622968 609751 596614 582767 568745
51902E68745j3151j2000j1319j0905j0266r476q871q436q015p664p265o361n078
$$ 568745 555594 543594 532275 521370 511104 501628 492757 484321 476306 468642 461377 455016 449938
51889D49938m522n340o408o191n069m826n918o811o351n194m303l662l369m421
$$ 449938 445416 440076 433668 427477 422408 417582 411664 404853 398502 393308 389005 385343 381974 377553
51875C77553o938q747p683m671k707k916l466k667j372j395k847m208m385l552
$$ 377553 370615 361868 354185 349514 346807 343891 340425 337758 336386 334991 332144 327936 323551 319999
51861C19999k222o47O83Q98k03j401j217J78R42j83k283l595l839m156m896m773
$$ 319999 317777 317130 317813 318711 318508 317107 315890 316068 317010 316827 314544 310949 307110 302954 298058 293285
51845B93285k798K4J730J588N10m15r16j256j602j883k033k174k557l143l368
$$ 293285 290487 290511 292241 293829 294339 293924 293008 291752 290150 288267 286234 284060 281503 278360 274992
51830B74992k746j690j136j326j604j594j647j819j431l21M45J00m09K83J756
$$ 274992 272246 270556 269420 268094 266490 264896 263249 261430 259999 259678 260123 260223 259814 260097 261853
51815B61853K222J039m66q49j79N24O50L36knN32J528K578L134K846J968J406
$$ 261853 264075 265114 264648 263799 263620 264144 264794 265130 265128 265123 265655 267183 269761 272895 275741 277709 279115
51798B79115J857K740K581Q87r96j422l23J010J581J311N25l18n62J69J417K317
$$ 279115 280972 283712 286293 287180 286184 284762 284439 285449 287030 288341 288866 288548 287986 288155 289572 291889
51782B91889K478K055J372Q80J036J581J485L37q36r24k68J69N13J545L042M043
$$ 291889 294367 296422 297794 298674 299710 301291 302776 303113 302277 301353 301085 301254 301767 303312 306354 310397
51766C10397M460M882M924L498R55p95p79p1K05L51P03M57q33j841j145N06J269
$$ 310397 314857 319739 324663 328161 329116 328321 327542 327471 327676 328027 328730 329187 328354 326513 325368 325874 327143
51749C27143R80J088J968K109O20r65n53J630L262K824J165j24p38j192j061P76
$$ 327143 328123 329211 331179 333288 333908 332943 332390 334020 337282 340106 341271 341147 340409 339217 338156 338932
51733C38932L869N714M496J502m74n47o8Q7P84K657M488M695L500K429K148J897
$$ 338932 342801 348515 353011 354513 354039 353492 353424 353511 354295 356952 361440 366135 369635 372064 374212 376109
51717C76109J029Q1qQ41J785K102J985K222L113M025M145L442K630K337K716L704
$$ 376109 377138 377219 377211 378052 379837 381939 383924 386146 389259 393284 397429 400871 403501 405838 408554 412258
51701D12258N122O575P666Q316Q552Q113O863N432M764M899M891M026K542R93
$$ 412258 417380 423955 431621 439937 448489 456602 463465 468897 473661 478560 483451 487477 490019 491012
51687D91012m69j934l415m874o093o395n232l246j933j847j886r28M37P69j26
$$ 491012 490543 488609 485194 480320 474227 467832 462600 459354 457421 455574 453688 452760 453197 453966 453840
51672D53840r27p67m86j355l045l766k579q43n55j660k074o11J226J218p20k705
$$ 453840 452913 452146 451660 450305 447260 443494 440915 440072 439517 437857 435783 435172 436398 437616 436896 434191
51656D34191l389l016k301j598j185j266j463j248r82j488k519k889k294j751
$$ 434191 430802 427786 425485 423887 422702 421436 419973 418725 417743 416255 413736 410847 408553 406802
51642D06802j789j551l58J000J385P69k40j452k662l049k124p00R4M35J385L104
$$ 406802 405013 403462 403104 404104 405489 406258 406018 404566 401904 398855 396731 396031 396125 396560 397945 401049
51626D01049M409M239K941K033K853N230P359P490N928M661M698M644K666r01
$$ 401049 405458 409697 412638 414671 417524 422754 430113 437603 443531 448192 452890 457534 460200 459299
51612D59299l916m945m573m423n591p917j0101j0736r611p798o257m902l468k464
$$ 459299 455383 450438 445865 441442 435851 427934 417833 407097 397486 389688 383431 378529 375061 372597
51598C72597k521l365m221m760m968m614l673k829k665k809k695k662l219l752
$$ 372597 370076 366711 362490 357730 352762 348148 344475 341646 338981 336172 333477 330815 327596 323844
51584C23844l190j732o75n01l96J46M18l76j890l049l115k094n57P20J274J277
$$ 323844 320654 318922 318247 317746 317350 317496 317914 317538 315648 312599 309484 307390 306833 307553 308827 310104
51568C10104J016L03j101k673l451l121k208j219k39O30J144J252J115P60K61
$$ 310104 311120 311423 310322 307649 304198 301077 298869 297650 297411 298041 299185 300437 301552 302312 302573
51553C02573rJ68L97M14P76J933K919K326M81p48n17O7N4J77J407L155M121M094
$$ 302573 302564 302732 303129 303543 304319 306252 309171 311497 311978 311230 310713 310780 310834 311011 312418 315573 319694 323788
51535C23788L832L657L381L285M053N537O570O327N268M444M218M012L193J910
$$ 323788 327620 331277 334658 337943 341996 347533 354103 360430 365698 370142 374360 378372 381565 383475
51521C83475R52P71Q91M58p00j891k373j961r59O4M85J14m43m73j23L6L39J746
$$ 383475 384427 385198 386089 386547 385847 383956 381583 379622 378663 378727 379212 379326 378883 378410 378287 378323 378662 380408
51503C80408L928M977L939K522K883M529N012L444J493P40Q34R80J661L455N243
$$ 380408 384336 389313 393252 395774 398657 403186 408198 411642 413135 413875 414709 415689 417350 420805 426048
51488D26048N274L659K290K137K108R42r01k071k137j657r73J0J058J535J293
$$ 426048 431322 434981 437271 439408 441516 442458 441557 439486 437349 435692 434719 434729 435787 437322 438615
51473D38615R38J066J620K029J623O2k124l388k426K67K655L212K119L70j458
$$ 438615 439553 440619 442239 444268 445891 445953 443829 440441 438015 438282 440937 444149 446268 446638 445180
51458D45180l085m015l921l129k125j035p5J16n64j037l38P47N26j142k415j789
$$ 445180 442095 438080 434159 431030 428905 427870 427795 427911 427347 426310 425972 426719 427245 426103 423688 421899
51442D21899N5J203O99o74j488j163m58m70j107j056L31J768J604K36l43O43J863
$$ 421899 421954 423157 423856 423182 421694 420531 420073 419603 418496 417440 417771 419539 421143 421379 421036 421679 423542
51425D23542K051J654J532J440Q97O41J658L323L947L124K352L113N227P281P992
$$ 423542 425593 427247 428779 430219 431116 431757 433415 436738 440685 443809 446161 449274 454501 461782 469774
51410D69774O934M759K913K567L490M333M167L284K424J805J211N17j95p22q09
$$ 469774 476708 481467 484380 486947 490437 494770 498937 502221 504645 506450 507661 508178 507983 507261 506452
51395E06452l98L2j24p45j027o04J4L13L94K63o62k561m301m594l775l347l947
$$ 506452 506054 506086 505962 505217 504190 503586 503600 503913 504307 504570 503908 501347 497046 492452 488677 485330 481383
51378D81383m884n648o567p459p063m798k231j592l172n201o118n940n427m892
$$ 481383 476499 470851 464284 456825 449762 444964 442733 441141 437969 432768 426650 420710 415283 410391
51364D10391m188l274k352j637j137o46J1N69N11q6l69J60Q33P76L07L30P26M75
$$ 410391 406203 402929 400577 398940 397803 397157 397168 397737 398248 398162 397793 397953 398786 399562 399869 400199 400925 401400
51346D01400n81j378j381j505k617m059m530l853l143l453m905o759p979p990
$$ 401400 400819 399441 398060 396555 393938 389879 385349 381496 378353 374900 369995 363236 355257 347267
51332C47267p262o835p032p103o357n098m058l533l369l253k676j320J06K26j243
$$ 347267 340005 333170 326138 319035 312678 307580 303522 299989 296620 293367 290691 289371 289477 289703 288460
51317B88460k948l648l663l805l871l265k335j848j698j369j165j647k351k488
$$ 288460 285512 281864 278201 274396 270525 267260 264925 263077 261379 260010 258845 257198 254847 252359
51303B52359k569l677n282n603m338l254l529m127l655k410j476r38j74Q33J661
$$ 252359 249790 246113 240831 235228 230890 227636 224107 219980 216325 213915 212439 211501 211327 212160 213821
51288B13821K296K848K870K009J030J110K258L234L074J922M13r88j842j720o73
$$ 213821 216117 218965 221835 223844 224874 225984 228242 231476 234550 236472 236885 235897 234055 232335 231662
51273B31662O93J910L067M248N000M854M120L564L287K561J039m05p27j96l1o06
$$ 231662 232355 234265 237332 241580 246580 251434 255554 259118 262405 264966 266005 265600 264873 264677 264646 264040
51257B64040j011p40p23j948l794m796m684m525n021n713n981n847n436m541l170
$$ 264040 263029 262289 261566 259618 255824 251028 246344 241819 236798 231085 225104 219257 213821 209280 206110
51242B06110j956j428j341j142q17q15j331k099k833l540m174m175k705K50L178
$$ 206110 204154 202726 201385 200243 199426 198611 197280 195181 192348 188808 184634 180459 177754 178004 181182
51227A81182M026K236o36k567k953k484j800j011k03L98P74J027J084R46R26J096
$$ 181182 185208 187444 186808 184241 181288 178804 177004 175993 175790 176188 176962 177989 179073 180019 180945 182041
51211A82041R12Q6n59o1J138J521L98j408k630k612j502k00J07p48j439q41K24
$$ 182041 182953 183039 182480 182419 183557 185078 185476 184068 181438 178826 177324 177124 177231 176483 175044 174203 174427
51194A74427J90r03j718j882k087k088p94J350K232J132j29m3M97J80m17j58N22
$$ 174427 174617 173714 171996 170114 168027 165939 165145 166495 168727 169859 169730 169687 170184 170364 169947 169789 170311
51177A70311N91M14R56J759J525L48k71N11J949K707J921k80k417k524l59J858
$$ 170311 170902 171316 172272 174031 175556 175904 175633 176144 178093 180800 182721 182441 180024 177500 177141 178999
51161A78999K036Q70N74J726K878K862J916N98q29j913k106j570q51J16J590K895
$$ 178999 181035 181905 182479 184205 187083 189945 191861 192459 191630 189717 187611 186041 185190 185306 186896 189791
51145A89791K957K043J591K240L136L353K791J674K64p07n21L80Q49P11Q27J300
$$ 189791 192748 194791 196382 198622 201758 205111 207902 209576 209840 209133 208612 208992 209841 210552 211379 212679
51129B12679J122M7n82K49J618K014J431J143J852K890L023J563j026l197l459
$$ 212679 213801 213848 213266 213515 215133 217147 218578 219721 221573 224463 227486 229049 228023 224826 221367
51114B21367j913l23k78j694l267l921l516k656k231k630l083k337k96J444J321
$$ 221367 219454 219131 218853 217159 213892 209971 206455 203799 201568 198938 195855 193518 193222 194666 195987
51099A95987l93j989k268j637j340k013l058l323k320o26Q43J653J743J101R7
$$ 195987 195594 193605 191337 189700 188360 186347 183289 179966 177646 177020 177863 179516 181259 182360 182457
51084A82457l29L39J240J059k57j455j647j101n16l86j059k353l209k768j700
$$ 182457 182128 182467 183707 184766 184509 183054 181407 180306 179790 179404 178345 175992 172783 170015 168315
51069A68315j239j070P3J669J541n61j843m36J582J222r52j888p14M61J85l97
$$ 168315 167076 166006 166079 167748 169289 168728 166885 166449 168031 169253 168301 166413 165699 166160 166345 165948
51053A65948J68J517K493K725K349J363J46l61J77Q91R34N92N86R78J419J871
$$ 165948 166116 167633 170126 172851 175200 176563 176709 176348 176525 177416 178350 178942 179528 180506 181925 183796
51037A83796K400K749K683K336J693L74j402k205o33K762N643O066M187J837P47
$$ 183796 186196 188945 191628 193964 195657 196031 194629 192424 191791 194553 200196 206262 210449 212286 213033
51022B13033J175J915J549j35j957k556j554M70K613L959L730J905l86j607j161
$$ 213033 214208 216123 217672 217537 215580 213024 211470 211940 214553 218512 222242 224147 223761 222154 220993
51007B20993K25J383J804J933K578L940N091M762K877R79N73J399J854J026m77
$$ 220993 221218 222601 224405 226338 228916 232856 237947 242709 245586 246565 247138 248537 250391 251417 250940
50992B50940j615k051j971j560j058q53r80r95o67m57p64j149q87n0N63M96M7
$$ 250940 249325 247274 245303 243743 242685 241832 240852 239857 239190 238733 237969 236820 235933 235883 236446 236942 236989
50975B36989l17l93r0O16J485K155K486K497K126J511J362K242L549L990L251
$$ 236989 236672 236279 236189 236805 238290 240445 242931 245428 247554 249065 250427 252669 256218 260208 263459
50960B63459K379K196K268J975J658J833K037J599J052J545L078M527N407O180
$$ 263459 265838 268034 270302 272277 273935 275768 277805 279404 280456 282001 285079 289606 295013 301193
50946C01193O784O352N014M494N813P512P530O026M965N329O362P304Q221Q970
$$ 301193 307977 314329 319343 323837 329650 337162 344692 350718 355683 361012 367374 374678 382899 391869
50932C91869R032Q883R914J2188J3828J3777J3635J5107J6895J6420J4012J2868
$$ 391869 400901 409784 419698 431886 445714 459491 473126 488233 505128 521548 535560 548428
50920E48428J4634J7427J9121K0295K2583K5732K8312L0228L2530L5200L7094
$$ 548428 563062 580489 599610 619905 642488 668220 696532 726760 759290 794490 831584
50909H31584L8079L9511M2263M5675M8914N2235N6208O0541O4403O7419O9861
$$ 831584 869663 909174 951437 997112 1046026 1098261 1154469 1215010 1279413 1346832 1416693
50898A416693P2131P4310P5953P6364P5386P3782P2138O9694O5114N8479N1478
$$ 1416693 1488824 1563134 1639087 1715451 1790837 1864619 1936757 2006451 2071565 2130044 2181522
50887B181522M5387L9806L3791K7305K1047J5539J0962P264M033P65k328m361
$$ 2181522 2226909 2266715 2300506 2327811 2348858 2364397 2375359 2382623 2386656 2387421 2385093 2380732
50875B380732m919m525l841l245l479n610r658j4263j8376k2440k7175l2284l7263
$$ 2380732 2375813 2371288 2367447 2364202 2360723 2355113 2345455 2331192 2312816 2290376 2263201 2230917 2193654
50862B193654m2533m8509n4374n9084o2922o6573o9289o9635o7948o6337o5948
$$ 2193654 2151121 2102612 2048238 1989154 1926232 1859659 1790370 1720735 1652787 1586450 1520502
50851A520502o5624o3648n9736n4877n0080m5747m1608l7044l1981k7472k4636
$$ 1520502 1454878 1391230 1331494 1276617 1226537 1180790 1139182 1102138 1070157 1042685 1018049
50840A018049k3086k1266j8379j5062j2138r715p678o104m822l505k381k054k291
$$ 1018049 994963 973697 955318 940256 928118 918403 910725 904621 899799 896294 893913 891859 889568
50827H89568k026q76L58J105J809K859L937N130P411J0867J3595J3892J2824J2958
$$ 889568 887542 886666 887024 888129 889938 892797 896734 901864 909275 920142 933737 947629 960453 973411
50813I73411J4833J6493J6669J6606J7956K0242K1862K2725K4347K7429L0757
$$ 973411 988244 1004737 1021406 1038012 1055968 1076210 1098072 1120797 1145144 1172573 1203330
50802A203330L3040L4605L6574L9116M1696M4646M9168N5531O2393O8397P3658
$$ 1203330 1236370 1270975 1307549 1346665 1388361 1433007 1482175 1537706 1600099 1668496 1742154
50791A742154P9067Q5008R1609R9517J09207J19718J29108J36379J42146J47443
$$ 1742154 1821221 1906229 1997838 2097355 2206562 2326280 2455388 2591767 2733913 2881356
50781B881356J52602J57384J61535J64810J66817J66915J64155J57623J47227
$$ 2881356 3033958 3191342 3352877 3517687 3684504 3851419 4015574 4173197 4320424
50772D320424J33849J18315J00733Q1440O2023M4353K8986J5541M199m447j0706
$$ 4320424 4454273 4572588 4673321 4754761 4816784 4861137 4890123 4905664 4909863 4905416 4894710
50761D894710j5393j7996j6984j2442p003l357k041k395m595r586j7803k8871
$$ 4894710 4879317 4861321 4844337 4831895 4824892 4821535 4819494 4817099 4812504 4802918 4785115 4756244
50749D756244m2107n6588p1246q5603r9964j14377j27931j39493j48494j54542
$$ 4756244 4714137 4657549 4586303 4500700 4400736 4286359 4158428 4018935 3870441 3715899
50739C715899j57091j56222j53026j48493j42548j34725j25165j14265j02192
$$ 3715899 3558808 3402586 3249560 3101067 2958519 2823794 2698629 2584364 2482172
50730B482172q9606p8058o8582o0287n1456m1747l2335k4103j6811j0172m761
$$ 2482172 2392566 2314508 2245926 2185639 2134183 2092436 2060101 2035998 2019187 2009015 2004254
50719B004254j428j73J7K02L55n99l248o443q351q810r493j1476j3859j5458j6584
$$ 2004254 2002826 2002653 2002670 2002872 2003227 2002628 1999380 1992937 1984586 1975776 1966283 1954807 1940948 1925490 1908906
50704A908906j8080j9671k0602k1128k1899k2482k1903k0346j8897j7810j6407
$$ 1908906 1890826 1871155 1850553 1829425 1807526 1785044 1763141 1742795 1723898 1706088 1689681
50693A689681j4616j3177j2213j0827q362n062j423K124M914O642Q369J1643J6338
$$ 1689681 1675065 1661888 1649675 1638848 1630486 1625424 1624001 1626125 1631039 1637681 1646050 1657693 1674031
50680A674031K0678K3769K6854L1346L6829M1954M6491N1443N7569O4571P1443
$$ 1674031 1694709 1718478 1745332 1776678 1813507 1855461 1901952 1953395 2010964 2075535 2146978
50669B146978P7287Q2028Q6682R2230R7907J01354J01061R8172R5103R2792Q9945
$$ 2146978 2224265 2306293 2392975 2485205 2583112 2684466 2785527 2883699 2978802 3071594 3161539
50658C161539Q4748P6653O6547N5740M4857L3498K0998P559n597j7256k6850l3930
$$ 3161539 3246287 3322940 3389487 3445227 3490084 3523582 3544580 3552139 3546542 3529286 3502436 3468506
50646C468506l7743l7971l5460l1546k6852k1378j5558j0512p178n741o002p761
$$ 3468506 3430763 3392792 3357332 3325786 3298934 3277556 3261998 3251486 3244308 3238567 3232565 3224804
50634C224804j0778j4870k0438k8347l8781n0290o0579o8337p3969p8357q1282
$$ 3224804 3214026 3199156 3178718 3150371 3111590 3061300 3000721 2932384 2858415 2780058 2698776
50623B698776q1546p8609p3530o7925o2234n5582m7356l8404l0258k3447j7034
$$ 2698776 2617230 2538621 2465091 2397166 2334932 2279350 2231994 2193590 2163332 2139885 2122851
50612B122851r802j483P369J6231K4924L3167M0531M6936N2788N8246O2685O5232
$$ 2122851 2113049 2111566 2118935 2135166 2160090 2193257 2233788 2280724 2333512 2391758 2454443 2519675
50600B519675O5619O4214O1479N7871N4005N0294M6498M2213L7865L4575L2977
$$ 2519675 2585294 2649508 2710987 2768858 2822863 2873157 2919655 2961868 2999733 3034308 3067285
50589C067285L2658L2742L2409L0953K8298K5621K4442K4737K4924K4208K3887
$$ 3067285 3099943 3132685 3165094 3196047 3224345 3249966 3274408 3299145 3324069 3348277 3372164
50578C372164K5510K8659L1706L4028L6298L9000M1806M4128M5281M4368M1282
$$ 3372164 3397674 3426333 3458039 3492067 3528365 3567365 3609171 3653299 3698580 3742948 3784230
50567C784230L7526L4712L2158K7459J9751J1057L747k169q183j4659k0224k3563
$$ 3784230 3821756 3856468 3888626 3916085 3935836 3946893 3950640 3948471 3940288 3925629 3905405 3881842
50555C881842k4744k4638k3659k1440j7574j2379o853j870K309N672P900Q572
$$ 3881842 3857098 3832460 3808801 3787361 3769787 3757408 3750555 3748685 3750994 3756666 3764566 3773138
50543C773138P722N671K373k503q951j6662k5690l6296m7971n9370o9650p9188
$$ 3773138 3780860 3786531 3788904 3786401 3777450 3760788 3735098 3698802 3650831 3591461 3521811 3442623
50531C442623q8364r6165j00948j02407j01970j01079r9696r6950r2724q7841
$$ 3442623 3354259 3258094 3157146 3054739 2952769 2851690 2751994 2655044 2562320 2474479
50521B474479q2839p7415p1386o5524o0673n6426n1520m5481l9100l3228k7987
$$ 2474479 2391640 2314225 2242839 2177315 2116642 2060216 2008696 1963215 1924115 1890887 1862900
50510A862900k3377j9577j6085j1588n607M30M730P318R797J3296J7611K2086
$$ 1862900 1839523 1819946 1803861 1792273 1786666 1787096 1791826 1799144 1808941 1822237 1839848 1861934
50498A861934K6377L0397L4304L8488M2864M6619M9374N2302N6950O3156O9219
$$ 1861934 1888311 1918708 1953012 1991500 2034364 2080983 2130357 2182659 2239609 2302765 2371984
50487B371984P4094P8245Q2222Q5670Q8074Q9557R0388R0529Q9974Q8841Q6921
$$ 2371984 2446078 2524323 2606545 2692215 2780289 2869846 2960234 3050763 3140737 3229578 3316499
50476C316499Q4109Q1489Q0916Q2881Q5695Q7634Q9084R1706R5993J00737J04771
$$ 3316499 3400608 3482097 3563013 3645894 3731589 3819223 3908307 4000013 4096006 4196743 4301514
50465D301514J08378J12707J18294J24552J30576J36099J41316J45873J48608
$$ 4301514 4409892 4522599 4640893 4765445 4896021 5032120 5173436 5319309 5467917
50456E467917J48677J46467J42737J37234J28774J16495J00393Q1000N9283L6582
$$ 5467917 5616594 5763061 5905798 6043032 6171806 6288301 6388694 6469694 6528977 6565559
50446F565559J3807r149l2458n5235p6298r5433j12670j26699j35704j39710j40323
$$ 6565559 6579366 6570217 6537759 6482524 6406226 6310793 6198123 6071424 5935720 5796010 5655687
50435E655687j37938j31104j19231j04162q8057p1303n3558l5597j8863m252P527
$$ 5655687 5517749 5386645 5267414 5163252 5075195 5003892 4950334 4914737 4895874 4891622 4899149
50424D899149J5221J7803J5313Q106l923k0523m0228o1283q2729j03833j23348
$$ 4899149 4914370 4932173 4947486 4955592 4951669 4931146 4890918 4829635 4746906 4643073 4519725
50413D519725j40046j53256j62209j66072j65475j62688j59107j53823j45901
$$ 4519725 4379679 4226423 4064214 3898142 3732667 3569979 3410872 3257049 3111148
50404C111148j36659j28027j20085j12070j04536r8014r0663q0202o8042n8419
$$ 3111148 2974489 2846462 2726377 2614307 2509771 2411757 2321094 2240892 2172850 2114431
50394B114431n2958m8822m3126l6544l1116k6778k2087j6999j2723r511o296k365
$$ 2114431 2061473 2012651 1969525 1932981 1901865 1875087 1853000 1836001 1823278 1813767 1807471 1805106
50382A805106J940O084R815J2835J4965J6811J9518K3541K7993L1354L2778L2764
$$ 1805106 1807046 1813130 1822945 1835780 1850745 1867556 1887074 1910615 1938608 1969962 2002740 2035504
50370B035504L2756L3949L6316L8818M0498M1313M1944M3024M4566M5960M6689
$$ 2035504 2068260 2102209 2138525 2177343 2217841 2259154 2301098 2344122 2388688 2434648 2481337
50359B481337M7105M8185N0239N2369N3683N4548N5900N7800N9671O1612O4292
$$ 2481337 2528442 2576627 2626866 2679235 2732918 2787466 2843366 2901166 2960837 3022449 3086741
50348C086741O7591P0589P3113P5972P9195Q1331Q1244P9586P7468P4555O9670
$$ 3086741 3154332 3224921 3298034 3374006 3453201 3534532 3615776 3695362 3772830 3847385 3917055
50337C917055O2804N5254M7750L9443K8976J5906R05j4880l0392m4947n8422p1120
$$ 3917055 3979859 4035113 4082863 4122306 4151282 4167188 4168093 4153213 4122821 4077874 4019452 3948332
50325C948332q3411r5227j05759j13495j16909j15532j10395j03239r5202q6227
$$ 3948332 3864921 3769694 3663935 3550440 3433531 3317999 3207604 3104365 3009163 2922936
50315B922936p5741o3853n1862m1292l2395k3908j4763n689J435N570P056O223
$$ 2922936 2847195 2783342 2731480 2690188 2657793 2633885 2619122 2613433 2614868 2620438 2627494 2633717
50303B633717K519m444j3683k3432l2579m0940m8566n5438o1574o6716p0093p1149
$$ 2633717 2636236 2631792 2618109 2594677 2562098 2521158 2472592 2417154 2355580 2288864 2218771 2147622
50291B147622p0456o9109o7269o4188n9919n5961n3545n1981m9523m5578m1051
$$ 2147622 2077166 2008057 1940788 1876600 1816681 1760720 1707175 1655194 1605671 1560093 1519042
50280A519042l6796l2776k8931k5767k3560k1794k0029j8587j7539j5736j1983
$$ 1519042 1482246 1449470 1420539 1394772 1371212 1349418 1329389 1310802 1293263 1277527 1265544
50269A265544o914k530J90K011L761N154N867O604Q168J0195J1738J2618J3394
$$ 1265544 1258630 1256100 1256290 1258301 1262062 1267216 1273083 1279687 1287855 1298050 1309788 1322406 1335800
50256A335800J4369J5534J7151J9451K1751K2740K2029K0816K0821K2623K5164
$$ 1335800 1350169 1365703 1382854 1402305 1424056 1446796 1468825 1489641 1510462 1533085 1558249
50245A558249K6691K6219K4305K2292K0953K0119J9523J9225J8967J7880J5482
$$ 1558249 1584940 1611159 1635464 1657756 1678709 1698828 1718351 1737576 1756543 1774423 1789905
50234A789905J2380R426O737M083J599n95k899n504p841r733j2354j6653k1279
$$ 1789905 1802285 1811711 1818448 1822531 1824130 1823535 1820636 1815132 1807291 1797558 1785204 1768551 1747272
50221A747272k3663k3365k2721k3882k6419k8410k8781k7839k6394k5063k4042
$$ 1747272 1723609 1700244 1677523 1653641 1627222 1598812 1570031 1542192 1515798 1490735 1466693
50210A466693k3065k1884k0848k0465k0443k0002j9209j8926j9082j8156j5107
$$ 1466693 1443628 1421744 1400896 1380431 1359988 1339986 1320777 1301851 1282769 1264613 1249506
50199A249506j1022q033p062p316p472o688m913k913j755j679j703q37N82J255
$$ 1249506 1238484 1230451 1223389 1216073 1208601 1201913 1197000 1194087 1192332 1190653 1188950 1188113 1188695 1189950
50185A189950N71o38j069l67M69J72j325k704k853k295k413l494m470m776n269
$$ 1189950 1190521 1189883 1188814 1188447 1188916 1189088 1187763 1185059 1182206 1179911 1177498 1174004 1169534 1164758 1159489
50170A159489o763q543r249q712q035q019q299q035o974n564m326l348k426j653
$$ 1159489 1152726 1144183 1134934 1126222 1118187 1110168 1101869 1093834 1086860 1081296 1076970 1073622 1071196 1069543
50156A069543j450j685j267O04K975L998L305K466K719L322K892J434M3p60j380
$$ 1069543 1068093 1066408 1065141 1065745 1068720 1072718 1076023 1078489 1081208 1084530 1087422 1088856 1088899 1088139 1086759
50141A086759k108k775l397m351n714o909p222o564n751o072q159j1070j2919
$$ 1086759 1084651 1081876 1078479 1074128 1068414 1061505 1054283 1047719 1041968 1035896 1027737 1016667 1003748
50128A003748j2723j1307j0152r945j0442j1143j1483j0918r507q005o964o086
$$ 1003748 991025 979718 969566 959621 949179 938036 926553 915635 906128 898123 891159 885073
50116H85073m983l984l502l246k736k269k484l349m403n553o713p019n634l133
$$ 885073 880090 876106 872604 869358 866622 864353 861869 858520 854117 848564 841851 834832 829198 826065
50102H26065j103k67j91o97k213m335n550n231m789n729p389p925o989o048o088
$$ 826065 824962 824695 824504 823807 821594 817259 811709 806478 801689 795960 788571 780646 773657 767609 761521
50087G61521o367n879m821l947l250k255j111l35K18J060J845J662Q16R08K475
$$ 761521 755154 749275 744454 740507 737257 735002 733891 733556 733774 734834 736679 738341 739157 740065 742540
50072G42540L770L056J192M38J341K440K912L605N098O494O897O790P047P701
$$ 742540 746310 749366 750558 750996 752337 754777 757689 761294 766392 772886 779783 786573 793620 801321
50058H01321Q532R762J1215J1725J0548Q661P562P416P417P399P782Q370Q428
$$ 801321 809853 819615 830830 842555 853103 861764 869326 876742 884159 891558 899340 907710 916138
50045I16138P927P556P593P649P484P239O855O082N067M356M345N143O687Q436
$$ 916138 924065 931621 939214 946863 954347 961586 968441 974523 979590 983946 988291 993434 1000121 1008557
50031A008557R505R669R683J0018J0113R711R940J1698J3901J5011J5527J6931
$$ 1008557 1018062 1027731 1037414 1047432 1057545 1067256 1077196 1088894 1102795 1117806 1133333 1150264
50019A150264J8610J8359J6075J4506J5469J7500J8352J8044J8063J8979K0407
$$ 1150264 1168874 1187233 1203308 1217814 1233283 1250783 1269135 1287179 1305242 1324221 1344628
50008A344628K2247K4552K6829K8693L0567L2816L4897L6229L7169L8200L9070
$$ 1344628 1366875 1391427 1418256 1446949 1477516 1510332 1545229 1581458 1618627 1656827 1695897
49997A695897L9777M1382M4557M8143N0693N2750N5943O0193O3681O5566O7055
$$ 1695897 1735674 1777056 1821613 1869756 1920449 1973199 2029142 2089335 2153016 2218582 2285637
49986B285637O9383P2178P4249P4700P2686O7301N8682M8509L8690K9905K1923
$$ 2285637 2355020 2427198 2501447 2576147 2648833 2716134 2774816 2823325 2862015 2891920 2913843
49975B913843J4744Q815M512J871N06p11l363q186j4237j9933k5074l1261m0121
$$ 2913843 2928587 2937402 2941914 2943785 2944291 2943580 2940217 2932031 2917794 2897861 2872787 2841526 2801405
49962B801405n1314o2577p1613p7657q1186q2538q1478p7971p2758o6787o0519
$$ 2801405 2750091 2687514 2615901 2538244 2457058 2374520 2293042 2215071 2142313 2075526 2015007
49951B015007n4192m8412m3857m0536l7795l5059l2210k9387k6870k5034k4005
$$ 2015007 1960815 1912403 1868546 1828010 1790215 1755156 1722946 1693559 1666689 1641655 1617650
49940A617650k3383k2718k2161k2254k3130k4244k4796k4109k1925j8907j6641
$$ 1617650 1594267 1571549 1549388 1527134 1504004 1479760 1454964 1430855 1408930 1390023 1373382
49929A373382j6363j7706j9314k0534k1648k2446k1804j9139j5454j2270j0205
$$ 1373382 1357019 1339313 1319999 1299465 1277817 1255371 1233567 1214428 1198974 1186704 1176499
49918A176499r108q856r156r025p479m716k047o09n17j093j407p55Q62K714M068
$$ 1176499 1167391 1158535 1149379 1140354 1132875 1128159 1126112 1125503 1124986 1123893 1122486 1121731 1122593 1125307 1129375
49903A129375M882N534O185O839P717R020J0414J1334J1770J2205J2854J3434
$$ 1129375 1134257 1139791 1145976 1152815 1160532 1169552 1179966 1191300 1203070 1215275 1228129 1241563
49891A241563J3776J4179J4996J6278J7914J9853K2111K4747K7721L0623L2873
$$ 1241563 1255339 1269518 1284514 1300792 1318706 1338559 1360670 1385417 1413138 1443761 1476634
49880A476634L4608L6924M0656M5288M9909N4960O1849P0806Q0248Q8574R5561
$$ 1476634 1511242 1548166 1588822 1634110 1684019 1738979 1800828 1871634 1951882 2040456 2136017
49869B136017J01550J06378J09717J11527J11345J08057J01316R2604Q3979P6261
$$ 2136017 2237567 2343945 2453662 2565189 2676534 2784591 2885907 2978511 3062490 3138751
49859C138751O9284O3116N7925N3207M8527M4686M2524M0544L5231K4283Q529
$$ 3138751 3208035 3271151 3329076 3382283 3430810 3475496 3518020 3558564 3593795 3618078 3626607
49848C626607r552k7969m5520o1348p5253q7675r8472j06364j10487j12013j13276
$$ 3626607 3617055 3589086 3543566 3482218 3406965 3319290 3220818 3114454 3003967 2891954 2778678
49837B778678j15347j17142j16724j13030j06605r9297r3036q8287q3768p8117
$$ 2778678 2663331 2546189 2429465 2316435 2209830 2110533 2017497 1929210 1845442 1767325
49827A767325p1659o5954o1755n8195n4189m9858m6020m2743l9196l5022l1248
$$ 1767325 1695666 1629712 1567957 1509762 1455573 1405715 1359695 1316952 1277756 1242734 1211486
49816A211486k9199k8676k7885k5410k1786j8640j6871j6223j6263j6806j7343
$$ 1211486 1182287 1153611 1125726 1100316 1078530 1059890 1043019 1026796 1010533 993727 976384
$$ [...]
##END NTUPLES=NMR SPECTRUM
##END=
