##TITLE=coffee_type CCPA01
COFFEE_meoh_noesyp64 COFFEE_meoh {C:\Bruker\TOPSPIN} Administrator 4
##JCAMPDX= 6.0         $$ Bruker NMR JCAMP-DX V2.0
##DATA TYPE= NMR SPECTRUM
##DATA CLASS= NTUPLES
##ORIGIN= Bruker BioSpin GmbH
##OWNER= Administrator
$$ 1.72 TOPSPIN		Version 2.1
$$ 2012-05-18 15:50:58.198 -0700  Administrator@X
$$ Compression mode = diff/dup
##.OBSERVE FREQUENCY= 400.13188235
##.OBSERVE NUCLEUS= ^1H
##.ACQUISITION MODE= SIMULTANEOUS (DQD)
##.ACQUISITION SCHEME= undefined
##.AVERAGES= 64
##.DIGITISER RES= 22
##SPECTROMETER/DATA SYSTEM= spect
##.PULSE SEQUENCE= noesygpps1d.comp
##.SOLVENT NAME= COFFEE_meoh
##.SHIFT REFERENCE= INTERNAL, COFFEE_meoh, 1, 14.98061
##AUDIT TRAIL= $$ (NUMBER, WHEN, WHO, WHERE, PROCESS, VERSION, WHAT)
$$ ##TITLE= Audit trail, TOPSPIN		Version 2.1
$$ ##JCAMPDX= 5.01
$$ ##ORIGIN= Bruker BioSpin GmbH
$$ ##OWNER= Administrator
$$ $$ C:\Bruker\TOPSPIN/data/Administrator/nmr/12-COFFEE-2502/142/pdata/1/auditp.txt
$$ ##AUDIT TRAIL=  $$ (NUMBER, WHEN, WHO, WHERE, PROCESS, VERSION, WHAT)
(   1,<2012-02-25 18:36:16.312 -0500>,<Administrator>,<TOPSPIN>,<go>,<TOPSPIN 2.1>,
      <created by zg
	started at 2012-02-25 18:24:46.109 -0500,
	POWCHK enabled, PULCHK disabled,
       configuration hash MD5:
       B0 76 FB 9C 50 81 44 7D 18 B3 26 32 4E 60 AD 96
       data hash MD5: 64K
       FE 0D 2F 6E 93 02 C5 1D 16 78 0D 57 74 43 B8 F4>)
(   2,<2012-02-25 18:36:19.125 -0500>,<Administrator>,<TOPSPIN>,<proc1d>,<TOPSPIN 2.1>,
      <Start of raw data processing
       efp LB = 0.3 FT_mod = 6 PKNL = 1 PHC0 = 0 PHC1 = 0 SI = 128K 
       data hash MD5: 128K
       A2 7F 80 CE 8D FA FC 58 EE B0 3E 8F CA C8 66 EF>)
(   3,<2012-02-25 18:36:20.359 -0500>,<Administrator>,<TOPSPIN>,<proc1d>,<TOPSPIN 2.1>,
      <pk PHC0 = 24.80713 PHC1 = 0 
       data hash MD5: 128K
       C0 90 4C BB 79 0F 1F 56 23 9F 5C 2E 5F 09 D8 E0>)
(   4,<2012-02-25 18:36:20.578 -0500>,<Administrator>,<TOPSPIN>,<proc1d>,<TOPSPIN 2.1>,
      <abs ABSG = 1 
       data hash MD5: 128K
       58 EB EE D8 C9 DC 5E C1 EB 26 4E 98 F2 4F D1 B4>)
(   5,<2012-02-25 18:36:20.656 -0500>,<Administrator>,<TOPSPIN>,<proc1d>,<TOPSPIN 2.1>,
      <abs ABSG = 2 
       data hash MD5: 128K
       3F A6 15 F6 FC 15 60 33 8E 56 ED 8A E4 20 F4 7D>)
(   6,<2012-02-25 18:36:20.719 -0500>,<Administrator>,<TOPSPIN>,<proc1d>,<TOPSPIN 2.1>,
      <abs ABSG = 3 
       data hash MD5: 128K
       18 7A 07 DF CA AC 91 8C 5E C0 63 FC 6A 7B 36 F4>)
(   7,<2012-02-25 18:36:20.953 -0500>,<Administrator>,<TOPSPIN>,<proc1d>,<TOPSPIN 2.1>,
      <abs ABSG = 4 
       data hash MD5: 128K
       F6 A2 D1 14 C7 39 11 3E B7 B6 E6 C7 A6 B0 22 11>)
(   8,<2012-02-25 18:36:21.031 -0500>,<Administrator>,<TOPSPIN>,<proc1d>,<TOPSPIN 2.1>,
      <abs ABSG = 5 
       data hash MD5: 128K
       72 40 66 B9 5E 69 3C DA 84 F1 75 D5 D9 D5 1F 22>)
(   9,<2012-02-25 18:36:21.172 -0500>,<Administrator>,<TOPSPIN>,<audit>,<TOPSPIN 2.1>,
      <user comment:
       ICON-NMR User ID: Administrator
$$ [...]
150 150 150 150 150 150 150 150
##$TP07= 0
##$TPNAME0= <>
##$TPNAME1= <>
##$TPNAME2= <>
##$TPNAME3= <>
##$TPNAME4= <>
##$TPNAME5= <>
##$TPNAME6= <>
##$TPNAME7= <>
##$TPOAL= (0..7)
0.5 0.5 0.5 0.5 0.5 0.5 0.5 0.5
##$TPOFFS= (0..7)
0 0 0 0 0 0 0 0
##$TUNHIN= 0
##$TUNHOUT= 0
##$TUNXOUT= 0
##$USERA1= <user>
##$USERA2= <user>
##$USERA3= <user>
##$USERA4= <user>
##$USERA5= <user>
##$V9= 5
##$VALIST= <valist>
##$VCLIST= <CCCCCCCCCCCCCCC>
##$VD= 0
##$VDLIST= <DDDDDDDDDDDDDDD>
##$VPLIST= <PPPPPPPPPPPPPPP>
##$VTLIST= <TTTTTTTTTTTTTTT>
##$WBST= 1024
##$WBSW= 4
##$XGAIN= (0..3)
0 0 0 0
##$XL= 0
##$YL= 0
##$YMAX_a= 13930008
##$YMIN_a= -6481794
##$ZGOPTNS= <>
##$ZL1= 120
##$ZL2= 120
##$ZL3= 120
##$ZL4= 120
##$ABSF1= 14.98061
##$ABSF2= -5.57192
##$ABSG= 5
##$ABSL= 3
##$ALPHA= 0
##$AQORDER= 0
##$ASSFAC= 0
##$ASSFACI= 0
##$ASSFACX= 0
##$ASSWID= 0
##$AUNMP= <proc_prof1d_extract>
##$AXLEFT= 0
##$AXNAME= <>
##$AXNUC= <1H>
##$AXRIGHT= 0
##$AXTYPE= 0
##$AXUNIT= <>
##$AZFE= 0.1
##$AZFW= 0.1
##$BCFW= 0
##$BC_mod= 0
##$BYTORDP= 0
##$COROFFS= 0
##$CY= 15
##$DATMOD= 1
##$DC= 0
##$DFILT= <>
##$DTYPP= 0
##$F1P= 0
##$F2P= 0
##$FCOR= 0.5
##$FTSIZE= 131072
##$FT_mod= 6
##$GAMMA= 0
##$GB= 0
##$INTBC= 1
##$INTSCL= 1
##$ISEN= 128
##$LB= 0.3
##$LEV0= 0
##$LPBIN= 0
##$MAXI= 10000
##$MC2= 0
##$MEAN= 0
##$ME_mod= 0
##$MI= 0
##$NCOEF= 0
##$NC_proc= -3
##$NLEV= 6
##$NOISF1= 0
##$NOISF2= 0
##$NSP= 0
##$NTH_PI= 0
##$NZP= 0
##$OFFSET= 14.98061
##$PC= 1
##$PHC0= 24.80713
##$PHC1= 0
##$PH_mod= 1
##$PKNL= yes
##$PPARMOD= 0
##$PPDIAG= 0
##$PPIPTYP= 0
##$PPMPNUM= 2147483647
##$PPRESOL= 1
##$PSCAL= 4
##$PSIGN= 0
##$PYNMP= <proc.py>
##$REVERSE= no
##$SF= 400.13
##$SI= 131072
##$SIGF1= 0
##$SIGF2= 0
##$SINO= 400
##$SIOLD= 131072
##$SPECTYP= <>
##$SREGLST= <1H.CDCl3>
##$SSB= 0
##$STSI= 131072
##$STSR= 0
##$SW_p= 8223.68421052632
##$SYMM= 0
##$S_DEV= 0
##$TDeff= 65536
##$TDoff= 0
##$TI= <>
##$TILT= no
##$TM1= 0
##$TM2= 0
##$TOPLEV= 0
##$USERP1= <user>
##$USERP2= <user>
##$USERP3= <user>
##$USERP4= <user>
##$USERP5= <user>
##$WDW= 1
##$XDIM= 131072
##$YMAX_p= 521991729
##$YMIN_p= -342154404
##$CURPLOT= <Network HP LaserJet P1505>
##$CURPRIN= <$Network HP LaserJet P1505>
##$DFORMAT= <normdp>
##$LAYOUT= <+/1D_H.xwp>
##$LFORMAT= <normlp>
##$PFORMAT= <normpl>
##$SURQMSG= 1
$$ End of Bruker specific parameters
$$ ---------------------------------
##NTUPLES= NMR SPECTRUM
##VAR_NAME=  FREQUENCY,     SPECTRUM/REAL,   SPECTRUM/IMAG
##SYMBOL=    X,             R,               I
##VAR_TYPE=  INDEPENDENT,   DEPENDENT,       DEPENDENT
##VAR_FORM=  AFFN,          ASDF,            ASDF
##VAR_DIM=   131072,        131072,          131072
##UNITS=     HZ,            ARBITRARY UNITS, ARBITRARY UNITS
##FACTOR=    0.0627417313425165, 1,          1
##FIRST=     8223.62146879498, 10904,        -92747
##LAST=      0,             14194,           -91316
##MIN=       0,             -342154404,      0
##MAX=       8223.62146879498, 521991729,    0
$$ Real data points
##PAGE= N=1
##DATA TABLE= (X++(R..R)), XYDATA
$$ [...]
60708A373764J2699J2584J3352J4069J4343J4159J3101J0965Q798P983Q341Q453
$$ 1373764 1386463 1399047 1412399 1426468 1440811 1454970 1468071 1479036 1487834 1495817 1504158 1512611
60696A512611P905P750Q424Q671P395N427M388M510M660M133L384K927K450J383
$$ 1512611 1520516 1528266 1536690 1545361 1552756 1558183 1562571 1567081 1571741 1575874 1579258 1582185 1584635 1586018
60682A586018j34j297j619j551k015l538n943q734j1329j2964j2990j1683j0494
$$ 1586018 1585884 1584587 1582968 1581417 1579402 1575864 1569921 1561187 1549858 1536894 1523904 1512221 1501727
60669A501727j0823j2524j3885j3234j0544p388n394m806m741m670n047o020o421
$$ 1501727 1490904 1478380 1464495 1451261 1440717 1433329 1427935 1423129 1418388 1413718 1408671 1402651 1396230
60656A396230n114k959k060l016m276m556m486n110o062o318n840n381n282n438
$$ 1396230 1391116 1388157 1386097 1383081 1378805 1374249 1369763 1364653 1358591 1352273 1346433 1341052 1335770 1330332
60642A330332n857o417o610o311o168o452o267m869k979j729j043k22M56N7j516
$$ 1330332 1324475 1318058 1311448 1305137 1298969 1292517 1286250 1281381 1278402 1276673 1275630 1275408 1275864 1275921 1274405
60627A274405l570n804q223j0319j1586j2506j3758j4931j5359j5704j7013j8514
$$ 1274405 1270835 1265031 1256808 1246489 1234903 1222397 1208639 1193708 1178349 1162645 1145632 1127118
60615A127118j8393j6719j5479j5258j4109j0747p013n588o475p310o431m226
$$ 1127118 1108725 1092006 1076527 1061269 1047160 1036413 1029400 1023812 1017337 1010027 1003596 999370
60603I99370j740O46K977N038O348O665O340O012N913N722N439N852P345Q747
$$ 999370 997630 998276 1001253 1006291 1012639 1019304 1025644 1031656 1037569 1043291 1048730 1054582 1061927 1070674
60589A070674Q599P423P272Q690R735Q713O530N266N485O301P211Q245Q752P730
$$ 1070674 1079273 1086696 1093968 1102658 1112393 1121106 1127636 1132902 1138387 1144688 1151899 1160144 1168896 1176626
60575A176626N653M595N875Q443J0260J0767J1225J2786J5071J6868J7774J8491
$$ 1176626 1182279 1186874 1192749 1201192 1211452 1222219 1233444 1246230 1261301 1278169 1295943 1314434
60563A314434J9509K0226J9964J9321J9548K0606K0815J8962J5902J3370J1756
$$ 1314434 1333943 1354169 1374133 1393454 1413002 1433608 1454423 1473385 1489287 1502657 1514413
60552A514413R984P293M184J516n36k253l740m939n980p074q191r072r486r397
$$ 1514413 1524397 1531690 1535874 1537390 1536854 1534601 1530861 1525922 1519942 1512868 1504677 1495605 1486119 1476722
60538A476722r149r500j1093j3549j5569j6277j6167j6094j5834j4493j2158r936
$$ 1476722 1467573 1458073 1446980 1433431 1417862 1401585 1385418 1369324 1353490 1338997 1326839 1316903
60526A316903q155n873k812m57N9J05J928N351P863P948O537M860K850N52o22
$$ 1316903 1308748 1302875 1300063 1299606 1299665 1299770 1301698 1307049 1314912 1322860 1329397 1334257 1337107 1337659 1337037
60511A337037M33K588L690L204K396K356L018L912M709N101N022M958N321N682
$$ 1337037 1337470 1340058 1343748 1346952 1349348 1351704 1354722 1358634 1363343 1368444 1373466 1378424 1383745 1389427
60497A389427N373M548L864L280K197O85m20o99n25j09J013L236O255R443J2458
$$ 1389427 1394800 1399348 1403212 1406492 1408689 1409374 1408954 1408255 1407730 1407621 1408634 1411870 1418125 1427568 1440026
60482A440026J5296J8106K1104K4357K7835L1896L7239M3732M9660N3109N3839
$$ 1440026 1455322 1473428 1494532 1518889 1546724 1578620 1615859 1659591 1709251 1762360 1816199
60471A816199N2897N0422M5048L5718K3193R351m180j6220k5653l1508l3379l1620
$$ 1816199 1869096 1919518 1964566 2000284 2023477 2032828 2028648 2012428 1986775 1955267 1921888 1890268
60459A890268k7447k2656j8435j4310q873j838N304J0862J4563J7360K0279K3684
$$ 1890268 1862821 1840165 1821730 1807420 1798547 1796709 1802013 1812875 1827438 1844798 1865077 1888761
60447A888761K7136K9606L0578L1206L3735L9231M6534N3865O0916O8865P8918
$$ 1888761 1915897 1945503 1976081 2007287 2041022 2080253 2126787 2180652 2241568 2310433 2389351
60436B389351R1363J05620J20618J35627J51110J68205J86837K05069K21299K36434
$$ 2389351 2480714 2586334 2706952 2842579 2993689 3161894 3348731 3553800 3775099 4011533
60426D011533K52832K71359K90999L11372L34059L60344L88005M10898M21128
$$ 4011533 4264365 4535724 4826723 5138095 5472154 5832498 6220503 6631401 7052529
60417G052529M11356L76109L12880K23270J13223q140j30296k42784l36378m04591
$$ 7052529 7463885 7839994 8152874 8376144 8489367 8481227 8350931 8108147 7771769 7367178
60407G367178m45311m61237m58177m42200m17858l88483l57033l25869k96006
$$ 7367178 6921867 6460630 6002453 5560253 5142395 4753912 4396879 4071010 3775004
60398C775004k67431k40303k15292j92791j72576j54469j38676j25068j12784
$$ 3775004 3507573 3267270 3051978 2859187 2686611 2532142 2393466 2268398 2155614
60389B155614j01165r0598q1709p4194o7115o0167n3778m8186m3328l9513l7213
$$ 2155614 2054449 1963851 1882142 1807948 1740833 1680666 1626888 1578702 1535374 1495861 1458648
60378A458648l5973l4495l2069k9186k6524k4166k2176k0855j9975j8708j7051
$$ 1458648 1422675 1388180 1356111 1326925 1300401 1276235 1254059 1233204 1213229 1194521 1177470
60367A177470j6252j6940j7781j7114j5149j3293j1934j0332q359o773n756m495
$$ 1177470 1161218 1144278 1126497 1109383 1094234 1080941 1069007 1058675 1050316 1043543 1037787 1033292
60355A033292k474j40J814L000L192K568K039K386L194L539L346L046K365J055
$$ 1033292 1030818 1030678 1032492 1035492 1038684 1041252 1043291 1045677 1048871 1052410 1055756 1058802 1061167 1062222
60341A062222L32J731M456N970N452M700N133O083O794P732Q708Q033N358L437
$$ 1062222 1062554 1064285 1068741 1074711 1080163 1084863 1089996 1096079 1102873 1110605 1119313 1127346 1132704 1136141
60327A136141M843Q257J0232R632Q094O859N560L984K827K420K198J682P92o63
$$ 1136141 1140984 1149241 1159473 1169105 1177199 1184058 1189618 1193602 1196429 1198849 1201047 1202729 1203521 1202858
60313A202858k596m002m098l772m442n616n390l378j371o85n21L11J561K427L104
$$ 1202858 1200262 1196260 1192162 1188390 1183948 1178332 1172942 1169564 1168193 1167508 1166987 1167298 1168859 1171286 1174390
60298A174390M304N933P254P959Q293Q368Q104P786Q049R133J0474J1272J1331
$$ 1174390 1178694 1184627 1191881 1199840 1208133 1216501 1224605 1232391 1240440 1249573 1260047 1271319 1282650
60285A282650J1145J1056J0773J0002R249R187R398Q631O545M239K690J664P14
$$ 1282650 1293795 1304851 1315624 1325626 1334875 1344062 1353460 1362091 1368636 1372875 1375565 1377229 1377943
60272A377943J29R5p3p23p40J139M415P311Q864R411R430Q925P738N701K721o13
$$ 1377943 1378072 1378167 1378094 1377371 1376631 1377770 1382185 1389496 1398360 1407771 1417201 1426126 1433864 1439565 1442286 1441673
60256A441673l160m626o017p883r191r111q710r216r644q236n620m246m855n700
$$ 1441673 1438513 1433887 1427870 1419987 1410796 1401685 1392975 1383759 1374115 1365879 1360259 1356013 1351158 1345458
60242A345458n472m766m249l468k240j436j408j142O5J306J495J032J051J750
$$ 1345458 1339986 1335220 1330971 1327503 1325263 1323827 1322419 1321277 1321342 1322648 1324143 1325175 1326226 1327976
60228A327976K381K367J699O81j96l68L74J773L398M782N567O027P073R036J0954
$$ 1327976 1330357 1332724 1334423 1335104 1334908 1334540 1334914 1336687 1340085 1344867 1350434 1356461 1363534 1372570 1383524
60213A383524J1881J2331J3183J3864J3142J1444J0595J1322J2715J4227J6363
$$ 1383524 1395405 1407736 1420919 1434783 1447925 1459369 1469964 1481286 1494001 1508228 1524591
60202A524591J8972K0768K1330K2018K4114K7284L0586L3719L6589L8931M1137
$$ 1524591 1543563 1564331 1585661 1607679 1631793 1659077 1689663 1723382 1759971 1798902 1840039
60191A840039M4317M8763N3410N7468O1495O6207P1386P6800Q3128R0917R9449
$$ 1840039 1884356 1933119 1986529 2043997 2105492 2171699 2243085 2319885 2403013 2493930 2593379
60180B593379J07480J14605J21326J28391J36341J44978J53016J59169J63630
$$ 2593379 2700859 2815464 2936790 3065181 3201522 3346500 3499516 3658685 3822315
60171C822315J67361J69952J69679J65893J59655J51548J40754J27157J12363
$$ 3822315 3989676 4159628 4329307 4495200 4654855 4806403 4947157 5074314 5186677
60162E186677R7476Q1513O3430M4260K5719Q165q361k2266l1574l6394l8512l8951
$$ 5186677 5284153 5365666 5429096 5473356 5499075 5507240 5498879 5476613 5445039 5408645 5370133 5331182
60150E331182l7380l3497k7573j9798j0253O60J2648K5973M0695N6060P1445Q7186
$$ 5331182 5293802 5260305 5232732 5212934 5202681 5203341 5215989 5241962 5282657 5338717 5410162 5497348
60138E497348J03468J19137J32788J44313J54264J62227J67061J68101J64986
$$ 5497348 5600816 5719953 5852741 5997054 6151318 6313545 6480606 6648707 6813693
60129F813693J56851J43178J25115J04662Q2757N9286L4632J0011j3591l5795
$$ 6813693 6970544 7113722 7238837 7343499 7426256 7485542 7520174 7530185 7516594 7480799
60119G480799n6314p4991r1898j06319j16177j19745j17684j12141j04021r2501
$$ 7480799 7424485 7349494 7257596 7151277 7035100 6915355 6797671 6685530 6581509 6489008
60109F489008p7067n8740l9146j9487m55J7800L5719N3437O9910Q3834R5072J03969
$$ 6489008 6411941 6353201 6314055 6294568 6294113 6311913 6347632 6401069 6470979 6554813 6649885 6753854
60097F753854J09574J10089J05192R6467Q5327P1982N6866M1530K7274J4101J979
$$ 6753854 6863428 6973517 7078709 7175176 7260503 7332485 7389351 7430881 7458155 7472256 7474235
60086G474235p851j3940j6234j5504j1583l313R758K6548M5534O6087Q8467J12937
$$ 7474235 7466384 7452444 7436210 7420706 7409123 7405810 7415568 7442116 7487650 7553737 7642204 7755141
60074G755141J39339J67494J97566K29575K62704K95647L27993L60558L93863
$$ 7755141 7894480 8061974 8259540 8489115 8751819 9047466 9375459 9736017 10129880
60065A0129880M26671M56946M83987N08425N29765N45218N51813N48991N37996
$$ 10129880 10556551 11013497 11497484 12005909 12535674 13080892 13632705 14181696 14719692
60056A4719692N19108M90948M52762M05992L52628K92860K25696J51552P2755
$$ 14719692 15238800 15729748 16182510 16588502 16941130 17233990 17459686 17611238 17683993
60047A7683993q524r1226j73531k51528l21034l79831m26962m60776m79514m83576
$$ 17683993 17675469 17584243 17410712 17159184 16838150 16458319 16031357 15570581 15091067 14607491
60037A4607491m75470m57486m30891l97378l59456l18840k75963k31600j87418
$$ 14607491 14132021 13674535 13243644 12846266 12486810 12167970 11892007 11660407 11472989
60028A1472989j44257j01604n9857k1627J0580L6878N8623P5430Q5146Q6371P9660
$$ 11472989 11328732 11227128 11167271 11145644 11156224 11193102 11251725 11327155 11412301 11498672 11578332
60017A1578332O6444M8184K6615L715j9105m1375o3149q4413j04693j23157j39492
$$ 11578332 11644776 11692960 11719575 11723290 11704185 11662810 11599661 11515248 11410555 11287398 11147906
60006A1147906j54680j70023j85205j98401k08594k16431k22240k24741k22982
$$ 11147906 10993226 10823203 10637998 10439597 10231003 10014572 9792332 9567591 9344609
59997I344609k18121k11746k03405j91435j75520j56733j35679j12427q8029o4222
$$ 9344609 9126488 8914742 8711337 8519902 8344382 8187649 8051970 7939543 7851514 7787292
59987G787292m1377j8187O256L1153N4947P6612R6001J13708J30512J45994J57906
$$ 7787292 7745915 7727728 7733984 7765137 7820084 7896696 7992697 8106405 8236917 8382911 8540817
59976H540817J63761J62949J56464J45168J29490J10277Q8263O2924L3533J370
$$ 8540817 8704578 8867527 9023991 9169159 9298649 9408926 9497189 9560113 9593646 9595016
59966I595016l0762o1421r1173j19889j45196j64672j78238j87261j92264j92604
$$ 9595016 9564254 9502833 9411660 9291771 9146575 8981903 8803665 8616404 8424140 8231536
59956H231536j87765j77889j63517j45640j25694j04869q3599o2030m0436j8586
$$ 8231536 8043771 7865882 7702365 7556725 7431031 7326162 7242563 7180533 7140097 7121511
59946G121511M506K9253N4230P7254R7903J18215J40577J65173J89706K11272
$$ 7121511 7126017 7155270 7209500 7286754 7384657 7502872 7643449 7808622 7998328 8209600
59936H209600K28129K39770K45882K45740K38679K24769K04733J79426J49617
$$ 8209600 8437729 8677499 8923381 9169121 9407800 9632569 9837302 10016728 10166345
59927A0166345J16155Q0025M2204L545l5185p3103j08908j40794j66909j86022
$$ 10166345 10282500 10362525 10404729 10408274 10373089 10299986 10191078 10050284 9883375 9697353
59917I697353j97697k02046j99687j91707j79000j61657j39720j14608q8819o3784
$$ 9697353 9499656 9297610 9097923 8906216 8727216 8565559 8425839 8311231 8222412 8158628
59907H158628l8791j2557J4730M1459O6092Q8100J07844J26035J42806J57122
$$ 8158628 8119837 8107280 8122010 8163469 8229561 8317661 8425505 8551540 8694346 8851468
59897H851468J67599J74079J77501J78038J74629J67015J56921J46244J35186
$$ 8851468 9019067 9193146 9370647 9548685 9723314 9890329 10047250 10193494 10328680
59888A0328680J23371J11655J01384R2739Q5570Q1247Q1805Q7482R6967J10131
$$ 10328680 10452051 10563706 10665090 10757829 10843399 10924646 11006451 11093933 11190900 11301031
59878A1301031J28689J53661J83737K16893K52365K90137L29565L69490M09089
$$ 11301031 11429720 11583381 11767118 11984011 12236376 12526513 12856078 13225568 13634657
59869A3634657M47506M82692N11231N29523N34972N25956N00898M57718L94862
$$ 13634657 14082163 14564855 15076086 15605609 16140581 16666537 17167435 17625153 18020015
59860A8020015L13122K16052J08497m719j18267k25549l19959l97349m56891m99669
$$ 18020015 18333137 18549189 18657686 18652967 18534700 18309151 17989192 17591843 17134952 16635283
59850A6635283n26849n39032n36722n21277m95403m62398m24564l82771l37717
$$ 16635283 16108434 15569402 15032680 14511403 14016000 13553602 13129038 12746267 12408550
59841A2408550k90933k43958j97254j50707j04843o0782j9213J9859N6577R0834
$$ 12408550 12117617 11873659 11676405 11525698 11420855 11360073 11340860 11360719 11417296 11508130
59831A1508130J22142J49376J70900J85343J91869J89523J76962J53380J19141
$$ 11508130 11630272 11779648 11950548 12135891 12327760 12517283 12694245 12847625 12966766
59822A2966766P5094K2047l8434j03171j67904k28574k82216l27429l64121l91995
$$ 12966766 13041860 13063907 13025473 12922302 12754398 12525824 12243608 11916179 11552058 11160063
59812A1160063m09499m15627m12570m04502l93305l77627l56877l33531l09921
$$ 11160063 10750564 10334937 9922367 9517865 9124560 8746933 8390056 8056525 7746604
59803G746604k85365k58696k31681k07126j85048j63483j42132j22556j05489
$$ 7746604 7461239 7202543 6970862 6763736 6578688 6415205 6273073 6150517 6045028
59794F045028r0550p8047o8536o1021n4203m9120m7829m9546n0732m9295m6286
$$ 6045028 5954478 5876431 5807895 5746874 5692671 5643551 5595722 5546176 5495444 5446149 5399863
59783E399863m3215m0183l7194l4899l3374l2139l1979l4650m0206m6531n2189
$$ 5399863 5356648 5316465 5279271 5244372 5210998 5178859 5146880 5112230 5072024 5025493 4973304
59772D973304n7699o3254o7210o7979o5830o1825n6324m9421m1557l2921k3536
$$ 4973304 4915605 4852351 4785141 4717162 4651332 4589507 4533183 4483762 4442205 4409284 4385748
59761D385748j4578q285n609m908l575j01N722J3480K2483L2171M2186N1410N7566
$$ 4385748 4371170 4362885 4357276 4352368 4348793 4348692 4354414 4367894 4390377 4422548 4464734 4516144 4573710
59748D573710N9476N9271O0609O4757P0091P5023P9031Q1032P9481P4754O9027
$$ 4573710 4633186 4692457 4753066 4817823 4887914 4962937 5041968 5123000 5202481 5277235 5346262
59737E346262O3126N5885M7324L9862L5181L2306L0219L0162L3694M0349M8951
$$ 5346262 5409388 5465273 5512597 5552459 5587640 5619946 5650165 5680327 5714021 5754370 5803321
59726E803321N9522P2265Q6260J00926J17433J36934J58547J80747K03625K28316
$$ 5803321 5862843 5935108 6021368 6122294 6239727 6376661 6535208 6715955 6919580 7147896
59716G147896K55132K83803L14587L47641L82016M16417M49887M80253N02539
$$ 7147896 7403028 7686831 8001418 8349059 8731075 9147492 9597379 10077632 10580171
59707A0580171N10042M96298M55478L83116K79588J53389J9633j05566k10053
$$ 10580171 11090213 11586511 12041989 12425105 12704693 12858082 12877715 12772149 12562096
59698A2562096k87545l37319l62420l67188l55863l32875l02777k68879k32583
$$ 12562096 12274551 11937232 11574812 11207624 10851761 10518886 10216109 9947230 9714647
59689I714647j94769j56931j20338q5072n0804j7772J3716M4002P3563J02505
$$ 9714647 9519878 9362947 9242609 9157537 9106733 9088961 9102677 9146679 9220242 9322747
59679I322747J31002J59379J87397K14699K42332K72537L06160L41627L77250
$$ 9322747 9453749 9613128 9800525 10015224 10257556 10530093 10836253 11177880 11555130
59670A1555130M13400M51488M92030N34654N78974O24643O71553P20562P72665
$$ 11555130 11968530 12420018 12912048 13446702 14025676 14650319 15321872 16042434 16815099
59661A6815099Q26865Q80346R31349R80029J025464J063833J091032J105391J106406
$$ 16815099 17641964 18522310 19453659 20433688 21459152 22522985 23614017 24719408 25825814
59652B5825814J092782J064153J023788R77684R31650Q90473Q58266Q37150Q25935
$$ 25825814 26918596 27982749 29006537 29984221 30915871 31806344 32664610 33501760 34327695
59643C4327695Q21680Q21942Q24035Q23096Q13040P89355P49728O92641O17285
$$ 34327695 35149375 35971317 36795352 37618448 38431488 39220843 39970571 40663212 41280497
59634D1280497N24813M18526L02932J83614O7270l9380j30877k02991k52737k79502
$$ 41280497 41805310 42223836 42526768 42710382 42777652 42738272 42607395 42404404 42151667 41872165
59624D1872165k84981k70757k36859j83847j14876l3989N6652J56157K62591L73271
$$ 41872165 41587184 41316427 41079568 40895721 40780845 40746856 40803508 40959665 41222256 41595527
59614D1595527M86598O01482P15334Q24372R25533J015982J090811J142874J164986
$$ 41595527 42082125 42683607 43398941 44223313 45148846 46164828 47255639 48398513 49563499
59605D9563499J150691J093116R85387Q23470O08649L47802N2674k61084n75603
$$ 49563499 50714190 51807306 52792693 53616163 54224812 54572614 54625288 54364204 53788601
59596E3788601q72762j135745j351105j511611j617316j672905j684175j657357
$$ 53788601 52915839 51780094 50428989 48917378 47300062 45627157 43942982 42285625
59588D2285625j600350j522284j431553j335203j240267j154948j088543j050014
$$ 42285625 40685275 39162991 37731438 36396235 35155968 34001020 32912477 31862463
59580C1862463j044735j070480j116592j168249j212136j239037j243884j225885
$$ 31862463 30817728 29747248 28630656 27462407 26250271 25011234 23767350 22541465
59572B2541465j188311j136360j074766j007420r37792q68248p99728p33221o70727
$$ 22541465 21353154 20216794 19142028 18134608 17196816 16328568 15528840 14795619 14124892
59563A4124892o13621n61174n11983m65976m23708l84817l48661l15542k85872
$$ 14124892 13511271 12950097 12438114 11972138 11548430 11163613 10814952 10499410 10213538
59554A0213538k59110k34934k14146j96898j81543j67132j55539j48750j45470
$$ 10213538 9954428 9719494 9505348 9308450 9126907 8959775 8804236 8655486 8510016
59545H510016j43097j41883j44023j49139j54051j57025j59233j61513j62515
$$ 8510016 8366919 8225036 8081013 7931874 7777823 7620798 7461565 7300052 7137537
59536G137537j60883j56951j51350j43937j34924j25354j15629j05068r3557q2302
$$ 7137537 6976654 6819703 6668353 6524416 6389492 6264138 6148509 6043441 5949884 5867582
59526E867582p2183o2587n2411m1344k9896j8877q894K98R517J8550K5710L0288
$$ 5867582 5795399 5732812 5680401 5639057 5609161 5590284 5581390 5581688 5591205 5609755 5635465 5665753
59514E665753L4320M0128M6986N2265N5252N7557O0319O3478O7637P3966Q1976
$$ 5665753 5700073 5740201 5787187 5839452 5894704 5952261 6012580 6076058 6143695 6217661 6299637
59503F299637Q9729R6749J04686J14735J26436J39288J53528J68897J84646K01140
$$ 6299637 6389366 6486115 6590801 6705536 6831972 6971260 7124788 7293685 7478331 7679471
59493G679471K19526K39443K59119K78131K97825L18494L38363L56218L72749
$$ 7679471 7898997 8138440 8397559 8675690 8973515 9292009 9630372 9986590 10359339
59484A0359339L88194M00553M07524M08781M05256L97352L84706L66757L43148
$$ 10359339 10747533 11148086 11555610 11964391 12369647 12766999 13151705 13518462 13861610
59475A3861610L14740K84164K53614K21970J86175J45933J04997O7466L5027Q482
$$ 13861610 14176350 14460514 14714128 14936098 15122273 15268206 15373203 15440669 15475696 15484178
59465A5484178j0915k3168l0261l3242l0277j9237p37K3044N1080Q3227J18291
$$ 15484178 15473263 15450095 15419834 15386592 15356315 15337078 15336341 15359385 15410465 15493692 15611983
59454A5611983J53957J87674K16134K34833K39827K29506K03791J62643J06623
$$ 15611983 15765940 15953614 16169748 16404581 16644408 16873914 17077705 17240348 17346971
59445A7346971L8069l9757j24046k11798k98591l79301m49788n06989n48253n72132
$$ 17346971 17385040 17345283 17221237 17009439 16710848 16331547 15881759 15374770 14826517 14254385
59435A4254385n79675n73852n57595n32968n01756m65894m27276l87568l48028
$$ 14254385 13674710 13100858 12543263 12010295 11508539 11042645 10615369 10227801 9879773
59426I879773l09204k71083k33821j97925j63707j31131j00270p1004m2273j2727
$$ 9879773 9570569 9299486 9065665 8867740 8704033 8572902 8472632 8401628 8359355 8346628
59416H346628J7444M6524P3677J00237J27699J55462J81654K05494K27563K48103
$$ 8346628 8364072 8410596 8484273 8584510 8712209 8867671 9049325 9254819 9482382 9730485
59406I730485K66127K80395K90336K95602K94964K86267K67594K38387J99182
$$ 9730485 9996612 10277007 10567343 10862945 11157909 11444176 11711770 11950157 12149339
59397A2149339J50693R3959L1404l3473r8021j60914k20159k72201l14470l47590
$$ 12149339 12300032 12393991 12425395 12391922 12293901 12132987 11912828 11640627 11326157 10978567
59387A0978567l73275l91193l99974m00528l95694l86823l73192l55092l34978
$$ 10978567 10605292 10214099 9814125 9413597 9017903 8631080 8257888 7902796 7567818
59378G567818l14891k94772k74098k53349k33107k13330j94286j76744j60720
$$ 7567818 7252927 6958155 6684057 6430708 6197601 5984271 5789985 5613241 5452521
59369E452521j45422j30828j17720j05765r3396q0159o7474n6441m6637l7575
$$ 5452521 5307099 5176271 5058551 4952786 4859390 4779231 4711757 4655316 4608679 4571104
59359D571104k9548k2246j4397n763K230Q695J4623K1217K8559L6520M4888N1670
$$ 4571104 4541556 4519310 4504913 4499150 4501380 4510075 4524698 4545915 4574474 4610994 4655882 4707552
59347D707552N3407M8859M0990L4121L0632L1282L6495M5462N5719O5770P7030
$$ 4707552 4760959 4809818 4850808 4884929 4915561 4946843 4983338 5028800 5084519 5150289 5227319
59336E227319R1285J06947J19606J26126J27351J27556J31915J43272J60232J79079
$$ 5227319 5318604 5425551 5545157 5671283 5798634 5926190 6058105 6201377 6361609 6540688
59326F540688J98196K19435K44778K73545L04021L35945L69883M05638M42912
$$ 6540688 6738884 6958319 7203097 7476642 7780663 8116608 8486491 8892129 9335041
59317I335041M82303N24123N67402O11503O57341P05236P52620P95505Q31253
$$ 9335041 9817344 10341467 10908869 11520372 12177713 12882949 13635569 14431074 15262327
59308A5262327Q58180Q73514Q73903Q57890Q26485P81963P27352O66581O03424
$$ 15262327 16120507 16994021 17867924 18725814 19552299 20334262 21061614 21728195 22331619
59299B2331619N40308M78757M20223L65407L13420K62672K11903J59566J03324
$$ 22331619 22871927 23350684 23770907 24136314 24449734 24712406 24924309 25083875 25187199
59290B5187199M1284k7042j01846j83644k71315l60608m46360n25649n97615o61161
$$ 25187199 25228483 25201441 25099595 24915951 24644636 24284028 23837668 23312019 22714404 22053243
59280B2053243p14429p56033p85557q03217q10002q07283p95503p74355p45201
$$ 22053243 21338814 20582781 19797224 18994007 18184005 17376722 16581219 15806864 15061663
59271A5061663p11746o76848o40008n99689n56775n13782m71804m30538l90585
$$ 15061663 14349917 13673069 13033061 12433372 11876597 11362815 10891011 10460473 10069888
59262A0069888l53429l19429k87762k58075k30449k04174j78381j53582j30823
$$ 10069888 9716459 9397030 9109268 8851193 8620744 8416570 8238189 8084607 7953784
59253G953784j09662q8792o8412m9951l3542j7771k079J2493K5350L7340M9086
$$ 7953784 7844122 7755330 7686918 7636967 7603425 7585654 7583575 7596068 7621418 7658758 7707844
59242G707844N9929O9269P7666Q5673R2487R6606R7455R5789R2661Q8294Q1946
$$ 7707844 7767773 7837042 7914708 8000381 8092868 8189474 8286929 8382718 8475379 8563673 8645619
59231H645619P3171O3183N4248M7326M1222L4765K9048K6294K7217L0814L6408
$$ 8645619 8718790 8781973 8836221 8883547 8924769 8959534 8988582 9014876 9042093 9072907 9109315
59220I109315M4448N5112O7475Q0522R4222J08996J24399J38676J49853J57167
$$ 9109315 9153763 9208875 9276350 9356872 9451094 9560090 9684489 9823165 9973018 10130185
59210A0130185J60872J60054J51414J31838J02297O7701L2555j658l4422o3893
$$ 10130185 10291057 10451111 10602525 10734363 10836660 10904361 10936916 10935258 10900836 10836943
59200A0836943q8284j07930j24042j36206j42824j43392j39015j31170j21107
$$ 10836943 10748659 10640729 10516687 10380481 10237657 10094265 9955250 9824080 9702973
59191I702973j09842r7643q4121o9755n6431m5520l6435k8279k1758j7982j6386
$$ 9702973 9593131 9495488 9411367 9341612 9285181 9239661 9203226 9174947 9153189 9135207 9118821
59180I118821j5507j5132j5985j7870j9630k0595k0671j9265j5355q325K225J6877
$$ 9118821 9103314 9088182 9072197 9054327 9034697 9014102 8993431 8974166 8958811 8950486 8952711 8969588
59168H969588L5650N7486Q1413J07526J36067J66653J99398K35390K74606L14596
$$ 8969588 9005238 9062724 9144137 9251663 9387730 9554383 9753781 9989171 10263777 10578373
59158A0578373L52730L88463M21698M50112M70101M79365M76435M58676M23250
$$ 10578373 10931103 11319566 11741264 12191376 12661477 13140842 13617277 14075953 14499203
59149A4499203L69779L00158K16235J19822J4694r3681k00537l02346l95164m74402
$$ 14499203 14868982 15169140 15385375 15505197 15519891 15426210 15225673 14923327 14528163 14053761
59139A4053761n36629n80476o06002o14509o08756n91951n66597n35071n00337
$$ 14053761 13517132 12936656 12330654 11716145 11107389 10515438 9948841 9413770 8913433
59130H913433m64702m28770l93065l59541l29647l02059k74791k48697k26261
$$ 8913433 8448731 8019961 7626896 7267355 6937708 6635649 6360858 6112161 5885900
59121E885900k07395j89163j69842j50868j34375j20861j09551r9144q7996p5413
$$ 5885900 5678505 5489342 5319500 5168632 5034257 4913396 4803845 4704701 4616705 4541292
59111D541292o3019n3081m5466l7977k9582k1223j3430n479K604R403J4451J9405
$$ 4541292 4478273 4425192 4379726 4341749 4312167 4290944 4277514 4272035 4274639 4284042 4298493 4317898
59099D317898K5898L3481M0568M6470N1859N7972O5518P3724Q0757Q5917R0864
$$ 4317898 4343796 4377277 4417845 4464315 4516174 4574146 4639664 4713388 4794145 4880062 4970926
59088D970926R7326J04325J09464J12544J15698J19863J23206J23566J20791J16033
$$ 4970926 5068252 5172577 5282041 5394585 5510283 5630146 5753352 5876918 5997709 6113742
59078F113742J10183J03534R5855Q6342P4429O0836M7108L4198K2360J1984L501
$$ 6113742 6223925 6327459 6423314 6509656 6584085 6644921 6692029 6726227 6748587 6760571 6764072
59067F764072l173p972j0129r389o924l666J359R465K0088L1969M5448O1264P8011
$$ 6764072 6760899 6752927 6742798 6733409 6726485 6722819 6724178 6733643 6753731 6785700 6831148 6892412 6970423
59054F970423R3334J07194J21343J36020J49952J63437J78425J95229K11706K26228
$$ 6970423 7063757 7170951 7292294 7428314 7578266 7741703 7920128 8115357 8327063 8553291
59044H553291K39031K50356K59826K68133K76672K84599K88495K85800K76605
$$ 8553291 8792322 9042678 9302504 9570637 9847309 10131908 10420403 10706203 10982808
59035A0982808K61394K39066K08148J68211J19629O3722L725n6213j13456j66749
$$ 10982808 11244202 11483268 11691416 11859627 11979256 12042978 12046703 11990490 11877034 11710285
59025A1710285k13982k52570k82470l06221l25298l38747l46153l49435l50510
$$ 11710285 11496303 11243733 10961263 10655042 10329744 9990997 9644844 9295409 8944899
59016H944899l49311l45172l38351l29182l17611l04454k91355k78767k65708
$$ 8944899 8595588 8250416 7912065 7582883 7265272 6960818 6669463 6390696 6124988
59007F124988k52091k39225k27462k15591k03316j91945j81740j71016j59043
$$ 6124988 5872897 5633672 5406210 5190619 4987303 4795358 4613618 4442602 4283559
58998D283559j47533j37920j29406j20925j12854j05410r7710q9929q4121q0987
$$ 4283559 4136026 3998106 3868700 3747775 3634921 3529511 3431801 3341872 3257751 3176764
58988C176764p7996p2711o6218o1103n7696n4445n0819m7595m5050m2776m0535
$$ 3176764 3098768 3026057 2959839 2898736 2841040 2786595 2735776 2688181 2643131 2600355 2559820
58977B559820l7944l4141k9092k4311k0971j8311j5106j1607q712o269l611r00
$$ 2559820 2521876 2487735 2458643 2434332 2413361 2395050 2379944 2368337 2359625 2353356 2349745 2348845
58965B348845J381L409N373O734P224P611Q311Q325O757M428K712J659N40n42
$$ 2348845 2350226 2353635 2359008 2365742 2372966 2380577 2388888 2397213 2403970 2408398 2411110 2412769 2413309 2412767
58951B412767q62l22P19K309M535O712P891P895P277O586O103N703M717K575k47
$$ 2412767 2411905 2411583 2412302 2414611 2419146 2425858 2433749 2441644 2448921 2455507 2461610 2467313 2472030 2474605 2474358
58936B474358k697m599o602q628r685r460q634p522n736l522j796m89J432L898
$$ 2474358 2471661 2467062 2460460 2451832 2442147 2432687 2424053 2416531 2410795 2407273 2405477 2404988 2406420 2410318
58922B410318N538O229P840J1468J5533J7960J8877J9916K1946K4529K6862K8346
$$ 2410318 2415856 2422085 2429925 2441393 2456926 2474886 2493763 2513679 2535625 2560154 2587016 2615362
58910B615362K8881K9080K9633L0628L2179L5174L9867M4375M6531M6773M7023
$$ 2615362 2644243 2673323 2702956 2733584 2765763 2800937 2840804 2885179 2931710 2978483 3025506
58899C025506M7314M6350M5083M6254M9962N3189N4551N6128N9413O2976O5833
$$ 3025506 3072820 3119170 3164253 3210507 3260469 3313658 3368209 3424337 3483750 3546726 3612559
58888C612559O9731P5851Q2216Q6775R0472R4983R9904J04622J10534J18792J27920
$$ 3612559 3682290 3758141 3840357 3927132 4017604 4112587 4212491 4317113 4427647 4546439 4674359
58877D674359J36397J45605J57478J70959J83615J95353K07801K21323K35333
$$ 4674359 4810756 4956361 5113839 5284798 5468413 5663766 5871567 6092890 6328223
58868F328223K50443K67703K86488L05611L25813L48961L75295M03445M32533
$$ 6328223 6578666 6846369 7132857 7438468 7764281 8113242 8488537 8891982 9324515
58859I324515M62714M94377N28252N65355O05369O46313O87186P29410P74062
$$ 9324515 9787229 10281606 10809858 11375213 11980582 12626895 13314081 14043491 14817553
58850A4817553Q19148Q61352Q98995R31476R57490R75546R84408R80938R59392
$$ 14817553 15636701 16498053 17397048 18328524 19286014 20261560 21245968 22226906 23186298
58841B3186298R15349Q48660P60366O48828N12339L54360J83025O364j69236l37081
$$ 23186298 24101647 24950307 25710673 26359501 26871840 27226200 27409225 27415589 27246353 26909272
58831B6909272m90468o25077p38661q28682q92991r32697r51944r54761r43878
$$ 26909272 26418804 25793727 25055066 24226384 23333393 22400696 21448752 20493991 19550113
58822A9550113r21899q91267q53327q09565p63323p18013o74152o30390n87172
$$ 19550113 18628214 17736947 16883620 16074055 15310732 14592719 13918567 13288177 12701005
58813A2701005n46896n10761m77841m47217m18764l91855l65607l40627l18380
$$ 12701005 12154109 11643348 11165507 10718290 10299526 9907671 9542064 9201437 8883057
58804H883057k98609k79296k59464k40151k22419k06092j90752j76344j62449
$$ 8883057 8584448 8305152 8045688 7805537 7583118 7377026 7186274 7009930 6847481
58795F847481j48479j34831j22689j12305j02575r2387q1513p0281n9191m8586
$$ 6847481 6699002 6564171 6441482 6329177 6226602 6134215 6052702 5982421 5923230 5874644
58785E874644l8026k6548j4149k100R026K0384L2796M5022N5634O5507P6647Q9523
$$ 5874644 5836618 5810070 5795921 5793821 5802847 5823231 5856027 5901049 5956683 6022190 6098837 6188360
58773F188360J03170J17090J31247J45021J58035J71503J87169K05220K24480
$$ 6188360 6291530 6408620 6539867 6684888 6842923 7014426 7201595 7406815 7631295
58764G631295K43956K63175K82057L01733L24243L50130L77591M05354M34720
$$ 7631295 7875251 8138426 8420483 8722216 9046459 9396589 9774180 10179534 10614254
58755A0614254M67154N01867N37800N76122O18076O61985P05204P47680P90547
$$ 10614254 11081408 11583275 12121075 12697197 13315273 13977258 14682462 15430142 16220689
58746A6220689Q32265Q69285Q99797R23668R38910R41223R26903Q93574Q38276
$$ 16220689 17052954 17922239 18822036 19745704 20684614 21625837 22552740 23446314 24284590
58737B4284590P57808O51664N22584L74204K10220L6022j40964l12933m72661
$$ 24284590 25042398 25694062 26216646 26590850 26801070 26837092 26696128 26383195 25910534
58728B5910534o13699p31799q26156q97751r46964r74259r82169r74593r54679
$$ 25910534 25296835 24565036 23738880 22841129 21894165 20919906 19937737 18963144 18008465
58719A8008465r25002q88580q47724q03024p55659p09260o66930o27781n89269
$$ 18008465 17083463 16194883 15347159 14544135 13788476 13079216 12412286 11784505 11195236
58710A1195236n51801n17818m87369m58086m29094m01581l75787l50796l27155
$$ 11195236 10643435 10125617 9638248 9180162 8751068 8349487 7973700 7622904 7295749
58701G295749l06379k87775k69004k49987k33048k18822k05297j91367j78182
$$ 7295749 6989370 6701595 6432591 6182604 5949556 5730734 5525437 5334070 5155888
58692E155888j66280j54443j42429j31887j23389j15110j05716r6461q9140q3833
$$ 5155888 4989608 4835165 4692736 4560849 4437460 4322350 4216634 4120173 4031033 3947200
58682C947200p9537p5430p0831o5571o0806n7934n6493n4845n2862n1834n1785
$$ 3947200 3867663 3792233 3721402 3655831 3595025 3537091 3480598 3425753 3372891 3321057 3269272
58671C269272n1214m9903m9555n0889n2144n1404m8830m5965m4169m4070m5330
$$ 3269272 3218058 3168155 3118600 3067711 3015567 2964163 2915333 2869368 2825199 2781129 2735799
58660B735799m6668m7171m7428m8327m9459n0006n0256n0570m9957m7685m5166
$$ 2735799 2689131 2641960 2594532 2546205 2496746 2446740 2396484 2345914 2295957 2248272 2203106
58649B203106m4012m3398m1851m0311m0385m0735l8734l5026l2586l1662k9537
$$ 2203106 2159094 2115696 2073845 2033534 1993149 1952414 1913680 1878654 1846068 1814406 1784869
58638A784869k5575k2549k2108k2554k2212k1797k2108k2209k1343k0390k0145
$$ 1784869 1759294 1736745 1714637 1692083 1669871 1648074 1625966 1603757 1582414 1562024 1541879
58627A541879j9998j9241j7912j5908j2992r899p704o094m068j816R9K516O092
$$ 1541879 1521881 1502640 1484728 1468820 1455828 1445929 1438225 1432131 1428063 1426247 1426346 1428862 1434954
58614A434954Q921Q971Q049R530J2596J2850Q859L951Q35j425l873n150m254k654
$$ 1434954 1443875 1452846 1460895 1470425 1483021 1495871 1504730 1508681 1509516 1508091 1504218 1499068 1494814 1492160
58600A492160j937j988k715m801p622r185r192r442j0237r416o149k713r98M7
$$ 1492160 1490223 1488235 1485520 1480719 1473097 1463912 1454720 1445278 1435041 1425625 1419476 1416763 1415765 1415812
58586A415812K121N244R004J3596J8312K1383K2560K3742K6070K8686L1037L3864
$$ 1415812 1417933 1423177 1432181 1445777 1464089 1485472 1508032 1531774 1557844 1586530 1617567 1651431
58574A651431L7125L9570M1273M3937M7862N1429N4457N9127O6431P4412Q1236
$$ 1651431 1688556 1728126 1769399 1813336 1861198 1912627 1967084 2026211 2092642 2167054 2248290
58563B248290Q7343R3546R9676J06160J14321J23993J33484J42884J54541J69255
$$ 2248290 2335633 2429179 2528855 2635015 2749336 2873329 3006813 3149697 3304238 3473493
58553C473493J84872J99825K15036K30973K45779K58001K68520K77978K84493
$$ 3473493 3658365 3858190 4073226 4304199 4549978 4807979 5076499 5354477 5638970
58544E638970K85249K78458K62828K37386K02796J60816J12083N6927j430n7524
$$ 5638970 5924219 6202677 6465505 6702891 6905687 7066503 7178586 7235513 7234083 7176559
58534G176559j08004j52503j90068k18301k36755k47684k52595k51483k45896
$$ 7176559 7068555 6916052 6725984 6507683 6270928 6023244 5770649 5519166 5273270
58525E273270k38794k30479k18681k03735j89349j76978j63876j48540j33740
$$ 5273270 5034476 4803997 4585316 4381581 4192232 4015254 3851378 3702838 3569098
58516C569098j21951j11857j01751r2480q4623p6475o7479o0169n6180n3582n0352
$$ 3569098 3447147 3335290 3233539 3141059 3056436 2979961 2912482 2852313 2796133 2742551 2692199
58505B692199m7210m4763m1464l6882l3489l2686l2339l0814k9969l1569l4122
$$ 2692199 2644989 2600226 2558762 2521880 2488391 2455705 2423366 2392552 2362583 2331014 2296892
58494B296892l6083l8771m3155m6856m7464m6056m4748m3464m1609m0104l9240
$$ 2296892 2260809 2222038 2178883 2132027 2084563 2038507 1993759 1950295 1908686 1868582 1829342
58483A829342l7369l3910l0745k8659k5889k2220k0511k1530k1502j7880j3542
$$ 1829342 1791973 1758063 1727318 1698659 1672770 1650550 1630039 1608509 1587007 1569127 1555585
58472A555585j1855j1471r864q279q954j0561j0700j0313j1483j3299j3727j3507
$$ 1555585 1543730 1532259 1522395 1514116 1505162 1494601 1483901 1473588 1462105 1448806 1435079 1421572
58460A421572j4462j6044j6764j7041j7613j7476j6260j6022j7723j8696j6662
$$ 1421572 1407110 1391066 1374302 1357261 1339648 1322172 1305912 1289890 1272167 1253471 1236809
58449A236809j3408j1427r952p659o091o694p355n683l112k034j601r7J231O11
$$ 1236809 1223401 1211974 1202022 1194363 1188272 1181578 1174223 1168540 1165428 1163394 1161793 1161696 1162927 1163538
58435A163538n03N0J190R25K19R90K529L314M071N659O548N632M707M925M058
$$ 1163538 1163035 1163085 1164275 1165200 1165419 1166409 1168938 1172252 1176323 1181982 1188530 1194162 1198869 1203794 1207852
58420A207852Q43j533l86J533M61k264l243k980l744m388k547K22P45l25k16O90
$$ 1207852 1208695 1207162 1206776 1208309 1208770 1206506 1203263 1200283 1196539 1192151 1189604 1189826 1190571 1190246 1190030 1190720
58404A190720N9j755k822l593n369o757o095n316o951r447r826q764q496q092
$$ 1190720 1190779 1189024 1186202 1182609 1177240 1170483 1164388 1159072 1152121 1142674 1132848 1124084 1115588 1107496
58390A107496n618k727k088k439j076Q73P98o2J109L179L303K597L985O286O303
$$ 1107496 1101878 1099151 1097063 1094624 1093548 1094421 1095219 1095157 1096266 1099445 1102748 1105345 1109330 1115616 1121919
58375A121919N196O687J0123J1413J0112R528J0207R148N585K195K42j703l933
$$ 1121919 1127115 1133802 1143925 1155338 1165450 1174978 1185185 1194333 1199918 1202113 1202355 1200652 1196719
58362A196719m912m625m657m885l720j271R45K759M725O060O305P294J0269J3137
$$ 1196719 1191807 1187182 1182525 1177640 1173920 1172649 1173594 1176353 1181078 1187138 1193443 1200737 1211006 1224143
58348A224143J3899J4276J6216J7778J6689J4949J5258J5800J3653J0410R135
$$ 1224143 1238042 1252318 1268534 1286312 1303001 1317950 1333208 1349008 1362661 1373071 1382206
58337A382206Q514N606J768J51j94k070m414m572l713m201m288j470J682J477
$$ 1382206 1390720 1396326 1398094 1398245 1398051 1395981 1391567 1386995 1383282 1379081 1374793 1373323 1375005 1376482
58323A376482Q0J801N042M976J825n46j922m285n539k490J983K610Q03K005N787
$$ 1376482 1376562 1378363 1383405 1388381 1390206 1389660 1387738 1383453 1377914 1375424 1377407 1380017 1380820 1382825 1388612
58308A388612P103O064P581J1821J3788J2495J2320J4829J6977J7826J9575K1648
$$ 1388612 1395715 1401779 1409360 1421181 1434969 1447464 1459784 1474613 1491590 1509416 1528991 1550639
58296A550639K1075J8855J8796K0141J8640J4791J3563J5961J8153J8835K0114
$$ 1550639 1571714 1590569 1609365 1629506 1648146 1662937 1676500 1692461 1710614 1729449 1749563
58285A749563K1325J9458J5563J3437J2339Q532L307J628L416M295M275P182J1864
$$ 1749563 1770888 1790346 1805909 1819346 1831685 1840217 1843524 1845152 1848568 1852863 1857138 1864320 1876184
58272A876184J2941J0348R425J1373J2249J1614J3291J7192J9178J9328K1569
$$ 1876184 1889125 1899473 1908898 1920271 1932520 1944134 1957425 1974617 1993795 2013123 2034692
58261B034692K5011K4878K2338K3782K9615L3414L3104L3313L5544L5773L3449
$$ 2034692 2059703 2084581 2106919 2130701 2160316 2193730 2226834 2260147 2295691 2331464 2364913
58250B364913L3311L6388L8191L7401L7504L8565L6539L2057L0674L3203L4790
$$ 2364913 2398224 2434612 2472803 2510204 2547708 2586273 2622812 2654869 2685543 2718746 2753536
58239B753536L4502L6369M0153M0962L9089M0264M5048M7861M7520M8705N2176
$$ 2753536 2788038 2824407 2864560 2905522 2944611 2984875 3029923 3077784 3125304 3174009 3226185
58228C226185N3736N3603N6229O0331O0115N6815N7551O2310O4110O2583O4749
$$ 3226185 3279921 3333524 3389753 3450084 3510199 3567014 3624565 3686875 3750985 3813568 3878317
58217C878317P1397P5770P7032Q1744R0311R5456R5992R8583J04165J06467J05763
$$ 3878317 3949714 4025484 4102516 4184260 4274571 4370027 4466019 4564602 4668767 4775234 4880997
58206D880997J09519J17484J21153J20173J23614J32520J37477J36738J40053
$$ 4880997 4990516 5108000 5229153 5349326 5472940 5605460 5742937 5879675 6019728
58197F019728J50578J59763J64609J73228J88451K02634K13660K29254K50394
$$ 6019728 6170306 6330069 6494678 6667906 6856357 7058991 7272651 7501905 7752299
58188G752299K67399K77371K88332L01815L09765L13339L25185L47587L68292
$$ 7752299 8019698 8297069 8585401 8887216 9196981 9510320 9835505 10183092 10551384
58179A0551384L83643M05102M36358M65586M87654N12277N42532N67860N86731
$$ 10551384 10935027 11340129 11776487 12242073 12729727 13242004 13784536 14352396 14939127
58170A4939127O13391O53236O94629P33814P83478Q47424R12286R74468J049053
$$ 14939127 15552518 16205754 16900383 17634197 18417675 19265099 20177385 21151853 22200906
58161B2200906J141522J238138J335517J450790J590167J736913J882947K041522
$$ 22200906 23342428 24580566 25916083 27366873 28957040 30693953 32576900 34618422
58153C4618422K216182K391100K566174K766244L000717L252544L523411L848675
$$ 34618422 36834604 39225704 41791878 44558122 47558839 50811383 54334794 58183469
58145E8183469M249655M715974N255228N911353O709802P634826Q684174R887545
$$ 58183469 62433124 67149098 72404326 78315679 85025481 92660307 101344481 111232026
58137A11232026J1241767J2690245J4199600J5795942J7514763J9425549K1748267
$$ 111232026 122473793 135164038 149363638 165159580 182674343 202099892 223848159
58130B23848159K4803683K8731263L3311189L8031483M2001825M3575008M0465636
$$ 223848159 248651842 277383105 310694294 348725777 390727602 434302610 474768246
58123D74768246L1073160J6150323j019548j6442442k7587600l4065001l6777818
$$ 474768246 505841406 521991729 520972181 504529739 476942139 442877138 406099320
58116D06099320l6873306l5322830l2892255l0102587k7215796k4352157k1604115
$$ 406099320 369226014 333903184 301010929 270908342 243692546 219340389 197736274
58109A97736274j9031508j6637925j4417712j2396440j0598570r010217p598946
$$ 197736274 178704766 162066841 147649129 135252689 124654119 115643902 108044956
58102A08044956o346458n244909m276642l405243k576157j725834p97622K40238
$$ 108044956 101698498 96453589 92176947 88771704 86195547 84469713 83672091 83912329
58094H3912329J341113K271242K578720J832363L0208k258112m257059n510821
$$ 83912329 85253442 87524684 90103404 91935767 91965975 89707863 85450804 79939983
58086G9939983o037872o074081n813431n384180m903508m447861m020128l603964
$$ 79939983 73902111 67828030 62014599 56630419 51726911 47279050 43258922 39654958
58078C9654958l216664k878077k573429k284933k025767j811138j627231j457663
$$ 39654958 36438294 33560217 30986788 28701855 26676088 24864950 23237719 21780056
58070B1780056j311594j198969j104791j013206r32548q73316q24634p74303p29714
$$ 21780056 20468462 19269493 18164702 17151496 16218948 15345632 14520998 13746695 13016981
58061A3016981o97812o65740o21979n76656n41347n08104m67597m29225m03849
$$ 13016981 12319169 11653429 11031450 10454794 9913447 9405343 8937746 8508521 8104672
58052H104672l83735l58373l34126l20214l10217k94827k78731k68496k57492
$$ 8104672 7720937 7362564 7028438 6708224 6398007 6103180 5824449 5555953 5298461
58043E298461k38853k20157k09811k01604j87509j73118j65815j60077j48828
$$ 5298461 5059608 4839451 4629640 4428036 4240527 4067409 3901594 3741517 3592689
58034C592689j37488j32522j27892j16827j05718j02238j00768r3533q5536q4361
$$ 3592689 3455201 3322679 3194787 3077960 2972242 2870004 2769236 2675703 2590167 2505806
58024B505806q5307q0687p4461p3794p4945p0959o4990o2881o0780n3077m4741
$$ 2505806 2420499 2339812 2265351 2191557 2116612 2045653 1980663 1917782 1857002 1803925 1759184
58013A759184m2857m3395l9067l3079l2368l4032l1174k6140k5441k7006k4501
$$ 1759184 1716327 1672932 1633865 1600786 1568418 1534386 1503212 1477072 1451631 1424625 1400124
58002A400124j9493j7747j8044j5535j1965j2299j5181j6285j6755j9315k0789
$$ 1400124 1380631 1362884 1344840 1329305 1317340 1305041 1289860 1273575 1256820 1237505 1216716
57991A216716j7546j3489j3752j5498j3774j1166j2515j5225j4074j0761r702
$$ 1216716 1199170 1185681 1171929 1156431 1142657 1131491 1118976 1103751 1089677 1078916 1069214
57980A069214r342o672n149q634j2450j0076m364k384l454k110R07O37k192k782
$$ 1069214 1059872 1053200 1048051 1039417 1026967 1016891 1012527 1010143 1006689 1004579 1005486 1006123 1003931 1001149
57966A001149j270j331k343j294J88j240l498k686q20k132m845m587k874m080
$$ 1001149 999879 998548 996205 994911 995099 993859 990361 987675 986855 984723 979878 975291 972417 968337
57952I68337o932p074n217m839m768k151J47k409p226q163n608m798o298o429
$$ 968337 961405 954331 949114 944275 939507 937356 937503 935094 927868 919705 914097 909299 903001 896572
57938H96572n212n676o934n906m271n935r260r697q409j0128j3845j4021j0175
$$ 896572 891360 885684 878750 872844 868573 862638 853378 843681 835272 825144 811299 797278 787103
57925G87103p124o244m402j311k08r80L4L056M499L748L799M962M474K549K548
$$ 787103 779979 773735 769333 768022 767814 766834 766868 769924 774423 778171 781970 786932 791406 793955 796503
57910G96503M653N413L893K654K423J342l90n29M49k55k595l846l648l966m690
$$ 796503 801156 806569 810462 813116 815539 816881 816491 815962 816411 816156 813561 809715 806067 802101 797411
57895G97411m162l427m770o798o212l765l062m181m017k311j755k385j492R75
$$ 797411 793249 789822 785052 778254 772042 768277 765215 761034 757017 754706 752951 750566 749074 750049
57881G50049K174J632J718K960L642L758M673N309L442K21j385j822l816p000
$$ 750049 752223 753855 755573 758533 762175 765933 770606 775915 779357 779578 778193 776371 772555 765555
57867G65555q783r644j2098j5241j5893j4521j4442j5545j4554j1276q904q141
$$ 765555 756772 747128 735030 719789 703896 689375 674933 659388 644834 633558 624654 616513
57855F16513o570l909k518k464j335R92K372K967M744O866O967O293P874J0256
$$ 616513 609943 606034 603516 601052 599717 600709 603081 606048 610792 617658 624625 630918 638792 649048
57841F49048R306N882M978P221Q072O143N217O728P218N161L783M712M886K365
$$ 649048 658354 664236 669214 676435 684507 690650 695867 702595 709813 714974 718757 723469 728355 730720
57827G30720l75j471k746n283o989p028p836j0265j1457j0033q742r391r733q064
$$ 730720 730345 728874 726128 720845 713856 706828 698992 688727 677270 667237 658495 649104 639371 631307
57813F31307o490o753o868m859k175n53J094M062P189R182J0610J1628J0891Q665
$$ 631307 624817 618064 611196 606337 604162 603609 604703 608765 615954 625136 635746 647374 658265 666930
57799F66930P630Q705R386Q087O702O794O743M989K758J308m80l417n827o385
$$ 666930 674560 683265 692651 700738 707440 714234 720977 725966 728724 730032 729552 726135 720308 713923
57785G13923o404p176p757p273o906p488p692o464m887m063l593l495m835p071
$$ 713923 707519 700343 692586 685313 678407 670919 663227 656763 651876 647813 644220 640725 635890 628819
57771F28819p737o315n444o652p990p651o900p256p826p573p514q433r039q550
$$ 628819 621082 614767 609323 602671 594681 587030 580130 572874 565048 557475 549961 541528 532489 523939
57757E23939q578j0219j1707j1229r821r205q883p649o105n494n533n335n005
$$ 523939 515361 505142 493435 482206 472385 463180 454297 446648 440543 435049 429516 424181 419176
57744D19176m680l455q10K237M454N579N613M794M677O950J0475J2043J0736Q904
$$ 419176 414496 411041 410231 412468 416922 422501 428114 432908 437585 444535 455010 467053 477789 486693
57730D86693Q042O799M235J926J168J052R53K105M818O821O463N097M413L748
$$ 486693 494735 501534 505769 507695 508863 509915 510868 512973 517791 524612 531075 536172 540585 544333
57716E44333J984k01j983m121p101r516j0154r794r377q421o870o264p325q358
$$ 544333 546317 546116 544133 540012 532911 523395 513241 503447 494070 485649 478779 472515 465190 456832
57702D56832p799o342n059l507j330M03J170K194M052N123M142K365J654K220
$$ 456832 449033 442691 437632 434125 432795 433198 434368 436562 440614 445737 449879 452244 453898 456118
57688D56118L588N715P860Q632Q241Q323Q597O837L453K412N436Q816Q656O100
$$ 456118 459706 465421 473281 481913 490154 498477 507074 513911 517364 519776 525212 534028 542684 548784
57674E48784M358L643K621K231M038O609P374O906P778J0097J1527J1130J0221
$$ 548784 553142 556785 559406 561637 565675 572284 579658 586564 594342 604439 615966 627096 637317
57661F37317R851J0108J1454J4161J6755J7319J6283J5850J6963J8625J9894K0839
$$ 637317 647168 657276 668730 682891 699646 716965 733248 749098 766061 784686 804580 825419
57649H25419K1691K2564K3781K5441K6977K8062K9252L1131L3610L6684M0641
$$ 825419 847110 869674 893455 918896 945873 973935 1003187 1034318 1067928 1104612 1145253
57638A145253M4969M8519N1417N5080N9629O3254O5188O7308P1664P8247Q6300
$$ 1145253 1190222 1238741 1290158 1345238 1404867 1468121 1533309 1600617 1672281 1750528 1836828
57627A836828R5665J05731J15269J24597J35626J48579J61427J73860J88748K07568
$$ 1836828 1932493 2038224 2153493 2278090 2413716 2562295 2723722 2897582 3086330 3293898
57617C293898K27352K44628K59536K73491K85558K94179K99771L02095K97310
$$ 3293898 3521250 3765878 4025414 4298905 4584463 4878642 5178413 5480508 5777818
57608E777818K81619K56519K26816J94251J55784J06879M4059l3305j19426k01204
$$ 5777818 6059437 6315956 6542772 6737023 6892807 6999686 7043745 7010440 6891014 6689810
57598F689810k65124l05773l26012l30556l22871l06820k86698k64803k41628
$$ 6689810 6424686 6118913 5792901 5462345 5139474 4832654 4545956 4281153 4039525
57589D039525k18455j97087j77336j57601j38034j20469j05391r1609p8788o7607
$$ 4039525 3821070 3623983 3446647 3289046 3151012 3030543 2925152 2833543 2754755 2687148
57579B687148n7420m6440l4657k4170j6274j0262n126k94N529J3894K4505L5259
$$ 2687148 2629728 2583288 2548631 2524461 2508187 2497925 2492799 2492505 2498034 2511928 2536433 2571692
57567B571692M4713N3057O0853O8615P7551Q8753J01455J13692J24816J35843
$$ 2571692 2616405 2669462 2730315 2798930 2876481 2965234 3066689 3180381 3305197 3441040
57557C441040J47517J59446J71072J81923J90940J96746J98340J94496J83348
$$ 3441040 3588557 3748003 3919075 4100998 4291938 4488684 4687024 4881520 5064868
57548E064868J63861J36961J03798O4114J8278l0094p5906j16412j51314j79900
$$ 5064868 5228729 5365690 5469488 5533602 5551880 5521786 5445880 5329468 5178154 4998254
57538D998254k00676k13618k20489k22673k20445k14305k05361j94452j82316
$$ 4998254 4797578 4583960 4363471 4140798 3920353 3706048 3500687 3306235 3123919
57529C123919j70230j59065j48300j37321j26763j17097j07151r6157q6040p9174
$$ 3123919 2953689 2794624 2646324 2509003 2382240 2265143 2157992 2061835 1975795 1896621
57519A896621p4852p0520o5655o1597n8118n3263m6641m0225l5613l2749l1282
$$ 1896621 1821769 1751249 1685594 1623997 1565879 1512616 1465975 1425750 1390137 1357388 1326106
57508A326106l0814k9850k6953k3094k0625j9912j9136j7232j4808j2213r244
$$ 1326106 1295292 1265442 1238489 1215395 1194770 1174858 1155722 1138490 1123682 1111469 1102225
57497A102225o724n919o142n283k831j23K335N223Q137R792J0765J3247J7457
$$ 1102225 1095501 1089582 1083440 1078157 1075326 1075203 1077538 1082761 1090898 1100690 1111455 1124702 1142159
57484A142159K0967K2343K2977K4539K7073L0442L5157M0630M4846M6993M8688
$$ 1142159 1163126 1185469 1208446 1232985 1260058 1290500 1325657 1366287 1411133 1458126 1506814
57473A506814N1633N5777O0584O6241P2737P9420Q6243R3855J01945J09295J16025
$$ 1506814 1558447 1614224 1674808 1741049 1813786 1893206 1979449 2073304 2175249 2284544 2400569
57462B400569J23796J33060J41915J48469J52629J54848J54701J51180J42875
$$ 2400569 2524365 2657425 2799340 2947809 3100438 3255286 3409987 3561167 3704042
57453C704042J27677J04426P5162M3721J1758k1469n5135q5522j09746j28099
$$ 3704042 3831719 3936145 4011307 4055028 4066786 4045317 3990182 3904660 3794914 3666815
57443C666815j41466j49053j50397j47422j42615j36796j30034j22937j15461
$$ 3666815 3525349 3376296 3225899 3078477 2935862 2799066 2669032 2546095 2430634
57434B430634j06384r5565q5106p6631o9037o0613n1777m3919l7048l0390k4051
$$ 2430634 2324250 2228685 2143579 2066948 1997911 1937298 1885521 1841602 1804554 1774164 1750113
57423A750113j8237j2121n391K56L292N184Q879J5032K1691K7341L2336L7385
$$ 1750113 1731876 1719755 1714364 1714620 1717912 1723096 1731975 1747007 1768698 1796039 1828375 1865760
57411A865760M2443M7418N2558N7889O3260O9199P6638Q5452R4067J01034J06637
$$ 1865760 1908203 1955621 2008179 2066068 2129328 2198527 2275165 2360617 2454684 2555718 2662355
57400B662355J12498J19669J27248J33003J35151J33162J26752J15046R7387P4286
$$ 2662355 2774853 2894522 3021770 3154773 3289924 3423086 3549838 3664884 3762271 3836557
57390C836557M6672J4936j9952n4893q5954j11275j31401j46947j57535j63100
$$ 3836557 3883229 3898165 3878213 3823320 3737366 3626091 3494690 3347743 3190208 3027108
57380C027108j64499j62496j57548j50708j43146j34693j24585j13813j04855
$$ 3027108 2862609 2700113 2542565 2391857 2248711 2114018 1989433 1875620 1770765
57371A770765r8506r2868q6029p8046o9799o1855n5232n1185m9191m6817m2766
$$ 1770765 1672259 1579391 1493362 1415316 1345517 1283662 1228430 1177245 1128054 1081237 1038471
57360A038471l8368l5189l2896l0592k8394k6465k4131k1404j9708j9685j9757
$$ 1038471 1000103 964914 932018 901426 873032 846567 822436 801032 781324 761639 741882
57349G41882j8414j6435j5193j4268j2563j0574r533r165q255o792n772n409n154
$$ 741882 723468 707033 691840 677572 665009 654435 644902 635737 627482 620690 614918 609509 604355
57336F04355m976n087m828l515k038j966l102l559k443r80n51q32o41K10Q64Q81
$$ 604355 599379 594292 589464 585949 583911 581945 578843 575284 572841 571861 571310 570478 569837 570047 570911 571792
57320E71792R12J528K121J757R15J211K981M528M602M383N507P379Q325Q478R168
$$ 571792 572704 574232 576353 578110 579025 580236 583217 587745 592347 596730 602237 609616 617941 626419 635587
57305F35587J0012R342P443O541P301Q008P821Q006R054R458Q722Q777J0790J2915
$$ 635587 645599 654941 662384 668925 676226 684234 692055 700061 709115 718573 727295 736072 746862 759777
57291G59777J3185J2398J2156J2083J1186J0212J0311J0853J0764J0768J2038
$$ 759777 772962 785360 797516 809599 820785 830997 841308 852161 862925 873693 885731
57280H85731J3748J4189J3579J3557J4553J5551J6070J6658J7721J9102K0497
$$ 885731 899479 913668 927247 940804 955357 970908 986978 1003636 1021357 1040459 1060956
57269A060956K1317K0898J9649J9111K0001K1416K2668K4259K6007K6303K4833
$$ 1060956 1082273 1103171 1122820 1141931 1161932 1183348 1206016 1230275 1256282 1282585 1307418
57258A307418K4064K5939K8748K9434K7742K5815K4892K4687K5131K6450K8031
$$ 1307418 1331482 1357421 1386169 1415603 1443345 1469160 1494052 1518739 1543870 1570320 1598351
57247A598351K9094K9914L0975L1855L2467L3904L6502L8574L9127M0017M3016
$$ 1598351 1627445 1657359 1688334 1720189 1752656 1786560 1823062 1861636 1900763 1940780 1983796
57236A983796M6561M8390M9881N4179O0960O6777P0443P4345Q0040Q5864Q9812
$$ 1983796 2030357 2078747 2128628 2182807 2243767 2310544 2380987 2455332 2535372 2621236 2711048
57225B711048R2021R3247R3160R1354Q8395Q5049Q1723P9181P8462P9752Q2367
$$ 2711048 2803069 2896316 2989476 3080830 3169225 3254274 3335997 3415178 3493640 3573392 3655759
57214C655759Q5807Q9677R2961R4850R5902R6903R6977R4545Q9753Q4063P7829
$$ 3655759 3741566 3831243 3924204 4019054 4114956 4211859 4308836 4403381 4493134 4577197 4655026
57203D655026P0122O0820N0974M1167L1141K0875J0518k27j0993j9509k3398k2728
$$ 4655026 4725148 4785968 4836942 4878109 4909250 4930125 4940643 4940416 4929423 4909914 4886516 4863788
57191D863788j9000j2351j888J1809K6853M2444N8829P5359R0725J04654J17233
$$ 4863788 4844788 4832437 4830549 4842358 4869211 4911655 4970484 5045843 5136568 5241222 5358455
57180E358455J27069J32680J35067J36153J35209J29857J20283J09407R8912Q8273
$$ 5358455 5485524 5618204 5753271 5889424 6024633 6154490 6274773 6384180 6483092 6571365
57170F571365P7753O8888O1522N3647M5041L8010L3763L0976K8881K8793L1500
$$ 6571365 6649118 6718006 6779528 6833175 6878216 6916226 6949989 6980965 7009846 7038639 7070139
57159G070139L5905M1272M8141N6136O3645P0573P8465Q6761R2085R2770R1234
$$ 7070139 7106044 7147316 7195457 7251593 7315238 7385811 7464276 7551037 7643122 7735892 7827126
57148G827126R0247Q9621Q8227Q6549Q5141Q3096Q0077P7669P6764P5748P3182
$$ 7827126 7917373 8006994 8095221 8181770 8266911 8350007 8430084 8507753 8584517 8660265 8733447
57137H733447P0230O8460O7370O6113O5611O6590O7190O4828N9281N2105M4358
$$ 8733447 8803677 8872137 8939507 9005620 9071231 9137821 9205011 9269839 9329120 9381225 9425583
57126I425583L6693L0437K6679K5221K5707K8586L3601L8592M1180M0697L7746
$$ 9425583 9462276 9492713 9519392 9544613 9570320 9598906 9632507 9671099 9712279 9752976 9790722
57115I790722L3334K9069K6296K4107K0071J3734P123R42o940j7787k9576m0036
$$ 9790722 9824056 9853125 9879421 9903528 9923599 9937333 9944456 9945398 9938458 9920671 9891095 9851059
57103I851059m9450n8282o4597o6484o5216o3638o3005o3399o5568p0211p6859
$$ 9851059 9801609 9743327 9678730 9612246 9547030 9483392 9420387 9356988 9291420 9221209 9144350
57092I144350q5109r5334j06662j16260j22215j25251j26455j25817j24659j26469
$$ 9144350 9059241 8963907 8857245 8740985 8618770 8493519 8367064 8241247 8116588 7990119
57082G990119j33234j43631j56798j74778j98649k25156k50017k72085k91869
$$ 7990119 7856885 7713254 7556456 7381678 7183029 6957873 6707856 6435771 6143902
57073F143902l09099l24718l42234l63896l88229m14044m43605m78531n16244
$$ 6143902 5834803 5510085 5167851 4803955 4415726 4001682 3558077 3079546 2563302
57064B563302n54128n93740o36944I6867f28845p71922q23598q79678r38848j005296
$$ 2563302 2009174 1415434 778490 96867 -628845 -1400767 -2224365 -3104043 -4042891 -5048187
57054e048187j084667j177713j283694j406402j550395j714806j898063k105541
$$ -5048187 -6132854 -7310567 -8594261 -10000663 -11551058 -13265864 -15163927 -17269468
57046a7269468k345146k618380k923632l265089l650255m081784m561079n097048
$$ -17269468 -19614614 -22232994 -25156626 -28421715 -32071970 -36153754 -40714833 -45811881
57038d5811881n701601o379256p131552p969207q908340r954631j1096731j2307884
$$ -45811881 -51513482 -57892738 -65024290 -72993497 -81901837 -91856468 -102953199 -115261083
57030a15261083j3547339j4777217j5989689j7177389j8222842j8845944j8774103
$$ -115261083 -128808422 -143585639 -159575328 -176752717 -194975559 -213821503 -232595606
57023b32595606j8032008j6999711j6076684j5264918j4130047j2187009r298076
$$ -232595606 -250627614 -267627325 -283704009 -298968927 -313098974 -325285983 -334584059
57016c34584059n719103j851242J999274N683447R148458J2360151J5252581J7713739
$$ -334584059 -340303162 -342154404 -340155130 -334471683 -325323225 -312963074 -297710493 -279996754
57008b79996754J9612314K0846603K1379800K1248310K0553524J9441144J8066469
$$ -279996754 -260384440 -239537837 -218158037 -196909727 -176356203 -156915059 -138848590
57001a38848590J6561004J5020878J3513325J2081884J0747418R515682Q389233
$$ -138848590 -122287586 -107266708 -93753383 -81671499 -70924081 -61408399 -53019166
56994e3019166P370782O458730N647162M930808M305208L762399L291668K884315
$$ -53019166 -45648384 -39189654 -33542492 -28611684 -24306476 -20544077 -17252409 -14368094
56986a4368094K533574K230811J966864J736654J537798J365173J211587g12224
$$ -14368094 -11834520 -9603709 -7636845 -5900191 -4362393 -2997220 -1785633 -712224
56977B38299Q40746P39405O45249N61861M91958M33987L84987L42711L03929K64731
$$ 238299 1079045 1818450 2463699 3025560 3517518 3951505 4336492 4679203 4983132 5247863
56967E247863K24314J85483J50165J17419Q6710N9850L8234K0930O481o150j9278
$$ 5247863 5472177 5657660 5807825 5925244 6011954 6071804 6110038 6130968 6137449 6131299 6112021
56956F112021l5966n6459p7588r6687j13242j26095j32643j32680j29985j28312
$$ 6112021 6076055 6019596 5942008 5845321 5732079 5605984 5473341 5340661 5210676 5082364
56946E082364j28211j28740j28826j25370j14031r4525p1443m7152j8866J1694
$$ 5082364 4954153 4825413 4696587 4571217 4457186 4362661 4291218 4244066 4225200 4236894
56936D236894K9241J3539m0943j17916j92441k47932k80738k94359k93806k83660
$$ 4236894 4266135 4279674 4238731 4120815 3928374 3680442 3399704 3105345 2811539 2527879
56926B527879k67382k46992k23862j99718j76555j55990j38988j25899j16584
$$ 2527879 2260497 2013505 1789643 1589925 1413370 1257380 1118392 992493 875909
56917H75909j10705j07459j04824j00011r1706q1361p1373o2480n3912m5222A0323
$$ 875909 765204 657745 552921 452910 361204 279843 208470 145990 92078 46856 10323
56905a7237j7970q530n35N971J1946h828A3087K5238K8811L3003L5870L4603K7846
$$ -17237 -35207 -43737 -44272 -38301 -26355 -8828 13087 38325 67136 100139 136009 170612 198458
56892A98458J6675M155o096j2071j4488j5364j5751j5569j4894j3930j2077q718
$$ 198458 215133 219288 213192 201121 186633 171269 155518 139949 125055 111125 99048 90330
56880I0330m913k578j741k49L391Q454J3698J8848K3781K7823L0798L3137L3967
$$ 90330 85417 82839 81098 80849 84240 92694 106392 125240 149021 176844 207642 240779 274746
56867B74746L0737K2181J0615j51q152j3451j6300j6994j6712j6520j5832j3493
$$ 274746 305483 327664 338279 338128 329976 316525 300225 283231 266519 249999 234167 220674
56855B20674j0258q425q899j0097j0236r282q122p031n914n200n371n994o071
$$ 220674 210416 201991 193092 182995 172759 163477 155355 148324 142410 137210 131839 125845 119774
56842A19774n414m879n045n180m032j502J033K231K122J644J379J316J586K509
$$ 119774 114360 109481 104436 99256 95224 93722 94755 96986 99108 100752 102131 103447 105033 107542
56828A07542L843M786M957M832M926N079M671L125L13k887m582l544r50P63J060
$$ 107542 111385 116171 121128 125960 130886 135965 140636 143761 144074 141187 136605 133061 132111 132874 133934
56813A33934J953M947Q780J1340J2518J3714J5459J7232J9144K2035K5875K9491
$$ 133934 135887 140834 149614 160954 173472 187186 202645 219877 239021 261056 286931 316422
56801C16422L2262L4919L8190M1368M2621M0173L3125K1886Q416m257j3308j7496
$$ 316422 348684 383603 421793 463161 505782 545955 579080 600966 609382 605125 591817 574321
56789E74321j7637j5763j3315j0119n384M49N826R980J3545J6957J9683K1879
$$ 574321 556684 540921 527606 517487 512103 512552 518378 528358 541903 558860 578543 600422
56777F00422K5377L1654L9903M8455N6895O4718O8618O3762M8394K5730J107k1232
$$ 600422 625799 657453 697356 745811 802706 867424 936042 999804 1048198 1073928 1075035 1053803
56765A053803l8484m8801n2060n0357m6519m2220l7701l2653k6819k0329j3817
$$ 1053803 1015319 966518 914458 864101 817582 775362 737661 705008 678189 657860 644043
56754F44043p892k377L566J0516J8402K6750L4692M0998M4837M6120M4135L6500
$$ 644043 636151 633774 637340 647856 666258 693008 727700 768698 813535 859655 903790 940290
56742I40290K1296N47j9953l5027m3486m7053m7461m5480m1651l6699l1413k6581
$$ 940290 961586 962133 942180 907153 863667 816614 769153 723673 682022 645323 613910 587329
56730E87329k2561j8683j3859q132k814J301N053R620J4889J9649K2787K3721
$$ 587329 564768 546085 532226 524094 521280 522581 527634 537254 552143 571792 594579 618300
56718F18300K2218J8401J2533M662m813j4077k0570k3395k4128k4558k4598k3360
$$ 618300 640518 658919 671452 676114 671301 657224 636654 613259 589131 564573 539975 516615
56706E16615k1191j9361j8227j7067j5491j3843j2300j0721r358q715q493p668
$$ 516615 495424 476063 457836 440769 425278 411435 399135 388414 379056 370341 361848 354180
56694C54180n962m448m238n094n789n537m595l732l443l597l576k802j390k65
$$ 354180 348218 343770 339532 334438 328649 323112 318517 314785 311342 307745 304169 301367 299977 299712
56680B99712m47j996l761m240k815j40K372L384K298k08k378k711j429j49L9l85
$$ 299712 299265 297269 293508 289268 286453 286313 288685 292069 294367 294159 291781 289070 287641 287492 287531 287146
56664B87146m83j50J66K55o0j130k528k730j012R43Q06j203k475j381R31K398
$$ 287146 286663 286513 286679 286934 286874 285744 283216 280486 279474 280417 281223 280020 277545 276164 277095 279493
56648B79493K364J571R79J193K203L151L073K126J402J370J463J274J131J226
$$ 279493 281857 283428 284407 285600 287803 290954 294027 296153 297555 298925 300388 301662 302793 304019
56634C04019J290J429K085K794K189j13k615l696l292k332j478j130j650k735
$$ 304019 305309 306738 308823 311617 313806 313693 311078 307382 304090 301758 300280 299150 297500 294765
56620B94765l357l030k567k894l732m016l018q28J572K514R27k092l984l517j902
$$ 294765 291408 288378 285811 282917 279185 275169 272151 271323 272895 275409 276336 274244 270260 266743 264841
56605B64841q22n48m62j34Q13K570M089L564Q86j693k295j445l89J022L182M864
$$ 264841 264019 263471 263009 262875 263688 266258 270347 273911 274797 273104 270809 269364 268975 269997 273179 278043
56589B78043M548K702J045J70l95n27K41J148P89p49j842j519m04N50J012R93
$$ 278043 282591 285293 286338 286508 286113 285586 285827 286975 287764 287015 285173 283654 283250 283800 284812 285805
56573B85805O93O76J339K167K299J550K01j630l546m479l768k230j096n25p4J03
$$ 285805 286498 287174 288513 290680 292979 294529 294730 293100 289554 285075 281307 279077 277981 277456 277382 277485
56557B77485j46o4Q30J428O16m87J45K217L371K619J355O27k73j848k911k331
$$ 277485 277339 277275 278105 279533 280149 279662 279807 282024 285395 288014 289369 289996 289723 287875 284964 282633
56541B82633q21J34R1n19j360k055j919q57P4j48j118j539q54L41J271J749J936
$$ 282633 281812 281946 282037 281518 280158 278103 276184 275327 275401 275253 274135 272596 271742 272083 273354 275103 277039
56524B77039J834J263L47l14j89M68Q61O60K77M8j33p4Q77K631L846L451K091
$$ 277039 278873 280136 280483 280169 279980 280448 281309 281969 282246 282294 282161 282087 282964 285595 289441 292892 294983
56507B94983J124Q84Q47R57J573K535L343M017M751N073M502L688L743M556M993
$$ 294983 296107 296991 297838 298795 300368 302903 306246 310263 315014 320087 324589 328277 332020 336576 341569
56492C41569M698M566N221O081O211N490M608M335M733M859L580J024j383k576
$$ 341569 346267 350833 356054 362135 368346 373836 378444 382779 387512 392371 395951 396975 395592 393016
56478C93016k869k873k427j424o26p43j423k097k858l616l655k985k929l950m358
$$ 393016 390147 387274 384847 383423 382797 382054 380631 378534 375676 372060 368405 365420 362491 358541 354183
56463C54183k777n46J96m98j290k193l851n303n100l888l223k601n99J580J102
$$ 354183 351406 350860 351056 350558 349268 347075 343224 337921 332821 328933 325710 323109 322510 324090 325192
56448C25192j928m159l764k434j922j720j206j281k229k301j52K988M901M821
$$ 325192 323264 319105 315341 312907 310985 309265 308059 306778 304549 302248 302096 305084 309985 314806
56434C14806L288J189l15l45L63J65j048j703j259r46j225p47J156K908K893J560
$$ 314806 318094 319283 318968 318623 318986 319151 318103 316400 315141 314195 312970 312223 313379 316287 319180 320740
56418C20740K86k48K68J978L828M144L052K567L406L839K763J729K444M228N549
$$ 320740 321026 320778 321046 323024 326852 330996 334048 336615 340021 343860 346623 348352 350796 355024 360573
56403C60573O285O820O571N115L513K938L189L740M791O043O166M867L760L705
$$ 360573 366858 373678 380249 385364 388877 391815 395004 398744 403535 409578 415744 420611 424371 428076
56389D28076L188J181l92O45L031L707K142N08J71M15M69N11M92k29j788l453
$$ 428076 431264 432445 432053 432698 435729 439436 441578 442086 442257 442672 443141 443652 444144 443915 442127 438674
56373D38674m529m771m078k685j459j169j704k433k864k570j349OJ4j663l556
$$ 438674 434145 429374 425296 422611 421152 419983 418279 415846 412982 410412 409063 409069 409083 407420 403864
56358D03864m216l784l199k940l104l640l846k850j099p9j41k27j59j070k817
$$ 403864 399648 395864 392665 389725 386621 382981 379135 376285 375186 375107 374966 374739 374580 373510 370693
56343C70693l211j317P78J041K72N8m0r63j636n26J491K228J298p2j348k598k934
$$ 370693 367482 366165 366943 367984 368256 368314 368274 367311 365675 365149 366640 368868 370166 370094 368746 366148 363214
56326C63214j370J176K804L210L469L701K939J158l86r55j022j099j029n26M60
$$ 363214 361844 363020 365824 369034 372503 376204 379143 380301 379915 378960 377938 376839 375810 375284 375744
56311C75744J760K871L341L551M309N277N143L932L494M756O141N887M334K718
$$ 375744 377504 380375 383716 387267 391576 396853 401996 405928 409422 414178 420319 426206 430540 433258
56297D33258J353M75R71K707L802L276K652L252L887L331K961M284N675M591J765
$$ 433258 434611 435086 436057 438764 442566 445842 448494 451746 455633 458964 461925 466209 471884 476475 478240
56282D78240J99P95J827K141K265K667L239M207N607O491O346O316P180P493N917
$$ 478240 478439 479234 481061 483202 485467 488134 491373 495580 501187 507678 514024 520340 527520 535013 540930
56267E40930L976L958N383O289O683P749Q832Q510P756Q684J0718J1477J0926
$$ 540930 544906 548864 554247 560536 567219 574968 583800 592310 600066 608750 619468 630945 641871
56254F41871J1036J1661J0612Q160P529J0013J3015J4105J3975J3989J3621J1928
$$ 641871 652907 664568 675180 683340 690869 700882 713897 728002 741977 755966 769587 781515
56242G81515R491P304N458M055L873M999O103N911M501K815J835K346M167N796
$$ 781515 791006 798310 803768 807823 811696 816695 822798 828709 833210 836025 837860 840206 844373 850169
56228H50169N991N540O083P724R384J0966J3276J6132J8481K0105K1578K2943
$$ 850169 856160 861700 867783 875507 884891 895857 909133 925265 943746 963851 985429 1008372
56216A008372K4103K5869K8802L1809L3818L5857L9252M3013M5643M8460N3858
$$ 1008372 1032475 1058344 1087146 1118955 1152773 1188630 1227882 1270895 1316538 1364998 1418856
56205A418856O1151O7594P3046P9806Q7953R4794R9648J05360J13838J23483J32367
$$ 1418856 1480007 1547601 1620647 1700453 1788406 1883200 1982848 2088208 2202046 2325529 2457896
56194B457896J41040J50556J60134J68440J75257J80590J83798J84589J83346
$$ 2457896 2598936 2749492 2909626 3078066 3253323 3433913 3617711 3802300 3985646
56185C985646J79786J72839J62175J48280J30976J09761Q5650O0634L5480J0324
$$ 3985646 4165432 4338271 4500446 4648726 4779702 4889463 4975113 5035747 5071227 5081551
56175E081551j2848l1230m4941n6983o8932p9354q6969r2542r6794r9238j00175
$$ 5081551 5068703 5037473 4992532 4935549 4866617 4787263 4700294 4607752 4510958 4411720 4311545
56164D311545j01503j04300j07570j10286j12716j15064j16825j18166j19900
$$ 4311545 4210042 4105742 3998172 3887886 3775170 3660106 3543281 3425115 3305215
56155C305215j21452j21005j18402j15844j14723j13633j10473j04976r8472r2381
$$ 3305215 3183763 3062758 2944356 2828512 2713789 2600156 2489683 2384707 2286235 2193854
56145B193854q7444q3290p8661p2973o7142o1794n5944m9212m3728m1268l9906
$$ 2193854 2106410 2023120 1944459 1871486 1804344 1742550 1686606 1637394 1593666 1552398 1512492
56134A512492l6564l1750k8309k6459k3865k0157j7405j6130j4700j2777j1674
$$ 1512492 1475928 1444178 1415869 1389410 1365545 1345388 1327983 1311853 1297153 1284376 1272702
56123A272702j1092r314o901o312p403p082m118o24J858M123O606Q491J0103J2594
$$ 1272702 1261610 1252296 1245395 1239083 1231680 1224598 1220480 1219856 1221714 1225837 1232443 1240934 1251037 1263631
56109A263631J4976J5144J4160J5396J9114K2233K3825K6128K9337L0508K8990
$$ 1263631 1278607 1293751 1307911 1323307 1342421 1364654 1388479 1414607 1443944 1474452 1503442
56098A503442K7919K8609K8370K5943K4328K5764K8204K9390L0328L2287L4172
$$ 1503442 1531361 1559970 1588340 1614283 1638611 1664375 1692579 1721969 1752297 1784584 1818756
56087A818756L5476L8199M3328M8814N3276N8276O4903P1691P8072Q6309R7758
$$ 1818756 1854232 1892431 1935759 1984573 2037849 2096125 2161028 2232719 2310791 2397100 2494858
56076B494858J10803J24591J40954J60273J79107J94266K05552K12139K10325
$$ 2494858 2605661 2730252 2871206 3031479 3210586 3404852 3610404 3822543 4032868
56067D032868J98073J78707J57398J36897J18825J05503R7435R1362Q3051O9908
$$ 4032868 4230941 4409648 4567046 4703943 4822768 4928271 5025706 5117068 5200119 5270027
56057E270027N0300K4277l466k5552l9110m8031n7080o7959q2132j02059j26918
$$ 5270027 5320327 5344604 5341138 5315586 5276476 5228445 5171365 5103406 5021274 4919215 4792297
56046D792297j51438j71402j86311j95222j95210j86477j73876j60667j45543
$$ 4792297 4640859 4469457 4283146 4087924 3892714 3706237 3532361 3371694 3226151
56037C226151j28127j11886r8561q5190p0138n6917m8362m2133l5644l0424k7851
$$ 3226151 3098024 2986138 2887577 2802387 2732249 2675332 2626970 2584837 2549193 2518769 2490918
56026B490918k5533k1997j9983k1036k1592j8739j5125j3992j3867j2310j0391
$$ 2490918 2465385 2443388 2423405 2402369 2380777 2362038 2346913 2332921 2319054 2306744 2296353
56015B296353r226o606j313L554N527O652Q972J0918J1755J4369J9789K4244K5575
$$ 2296353 2287127 2280521 2279208 2282762 2288289 2294941 2303913 2314831 2326586 2340955 2360744 2384988 2410563
56002B410563K6949L0387L2678L2030L2482L6758M0958M1482M1187M3425M5952
$$ 2410563 2437512 2467899 2500577 2532607 2565089 2601847 2642805 2684287 2725474 2768899 2814851
55991B814851M6132M6136M7749M8215M6467M6789N0831N3135N0551M8696N2437
$$ 2814851 2860983 2907119 2954868 3003083 3049550 3096339 3147170 3200305 3250856 3299552 3351989
55980C351989N7392N8105N7397N9981O3824O5725O8685P5570Q2059Q3850Q4512
$$ 3351989 3409381 3467486 3524883 3584864 3648688 3714413 3783098 3858668 3940727 4024577 4109089
55969D109089Q8364R2502R3758R6321J04025J12552J17729J23746J34190J43235
$$ 4109089 4197453 4289955 4383713 4480034 4584059 4696611 4814340 4938086 5072276 5215511
55959E215511J45731J47718J56385J67666J74763J80912J92120K05149K14759
$$ 5215511 5361242 5508960 5665345 5833011 6007774 6188686 6380806 6585955 6800714
55950F800714K25147K41791K59368K70347K78184K89396L00461L05864L11320
$$ 6800714 7025861 7267652 7527020 7797367 8075551 8364947 8665408 8971272 9282592
55941I282592L25129L43952L60978L80070M07350M36978M60411M81615N07911
$$ 9282592 9607721 9951673 10312651 10692721 11100071 11537049 11997460 12479075 12986986
55932A2986986N34614N54949N76072O08033O46036O81409P20448P73454Q34763
$$ 12986986 13521600 14076549 14652621 15260654 15906690 16588099 17308547 18082001 18916764
55923A8916764Q93696R55745J032286J119549J209441J310608J435233J575213
$$ 18916764 19810460 20766205 21798491 22918040 24127481 25438089 26873322 28448535
55915B8448535J715349J859270K017584K183293K346767K522321K730382K966781
$$ 28448535 30163884 32023154 34040738 36224031 38570798 41093119 43823501 46790282
55907D6790282L221623L514520L876797M314199M825027N438172O189424P073722
$$ 46790282 50011905 53526425 57403222 61717421 66542448 71980620 78170044 85243766
55899H5243766Q064161R160538J0372465J1679257J3065738J4576766J6277789
$$ 85243766 93307927 102468465 112840930 124520187 137585925 152162691 168440480
55892A68440480J8197025K0381296K2958668K6035102K9563696L3397107L7267920
$$ 168440480 186637505 207018801 229977469 256012571 285576267 318973374 356241294
55885C56241294M0316738M0621630L5811179K4845781R361561o989318k0703976
$$ 356241294 396558032 437179662 472990841 497836622 507198183 500208865 479504889
55878D79504889l0081617l5211962l7007632l6481624l4540289l1901624k9002971
$$ 479504889 449423272 414211310 377203678 340722054 306181765 274280141 245277170
55871B45277170k6052348k3181137k0495241j8031066j5775459j3741281j1965999
$$ 245277170 219224822 196043685 175548444 157517378 141741919 128000638 116034639
55864A16034639j0447821r143758q024475p080490o283354n591109m989308m485339
$$ 116034639 105586818 96443060 88418585 81338095 75054741 69463632 64474324 59988985
55856E9988985m066624l701851l377852l099261k856480k627971k410876k218386
$$ 59988985 55922361 52220510 48842658 45743397 42886917 40258946 37848070 35629684
55848C5629684k049897j892247j746446j625275j527191j438281j356536j289183
$$ 35629684 33579787 31687540 29941094 28315819 26788628 25350347 23993811 22704628
55840B2704628j229418j160738j082701j009369r44305q79363q16117p65799p28145
$$ 22704628 21475210 20314472 19231771 18222402 17278097 16398734 15582617 14816818 14088673
55831A4088673o90970o51109o16714n89027n60207n29399n03526m82116m57879
$$ 14088673 13397703 12746594 12129880 11540853 10980646 10451247 9947721 9465605 9007726
55822I007726m31980m12503l98090l79108l54774l33695l17514k99510k79475
$$ 9007726 8575746 8163243 7765153 7386045 7031271 6697576 6380062 6080552 5801077
55813E801077k64684k55200k42803k25733k10766j99576j86325j70125j57084
$$ 5801077 5536393 5281193 5038390 4812657 4601891 4402315 4215990 4045865 3888781
55804C888781j48597j39530j29121j21970j17443j09648r8809r1188q7112q0516
$$ 3888781 3740184 3600654 3471533 3349563 3232120 3122472 3023663 2932475 2845363 2764847
55794B764847p1389o7087o9804p3610p5476p8568q2921q3382p9015p4872p2487
$$ 2764847 2693458 2626371 2556567 2482957 2407481 2328913 2245992 2162610 2083595 2008723 1936236
55783A936236o7817o0295n4724n2349m8842m2904l8302l5884l1904k5807k1505
$$ 1936236 1868419 1808124 1753400 1701051 1652209 1609305 1571003 1535119 1503215 1477408 1455903
55772A455903j9572j6149j0856p857q018p758o655q233j2310j4618j4910j7474
$$ 1455903 1436331 1420182 1409326 1401469 1393451 1385693 1379038 1370805 1358495 1343877 1328967 1311493
55760A311493k2528k5265k4573k4613k6542k6754k4774k4728k7155k7407k4070
$$ 1311493 1288965 1263700 1239127 1214514 1187972 1161218 1136444 1111716 1084561 1057154 1033084
55749A033084k1251k0511j8367j3988j1656j2879j3491j1236r313r580r104o381
$$ 1033084 1011833 991322 972955 958967 947311 934432 920941 909705 900392 890812 881708 875327
55737H75327m395m569l830o81J700J167j41q35k920o870r505r416r390j1174j2722
$$ 875327 870932 866363 862533 861852 863552 864719 864578 863743 860823 853953 844448 835032 825642 814468 801746
55722H01746j2801j3096j3851j2590r108o585n964m604k266k732p253j2049j4539
$$ 801746 788945 775849 761998 749408 740300 733715 727751 723147 720881 718149 710896 698847 684308
55709F84308j6573j9006j8946j5377j2176j2148j2821j1321r003q120q110q180
$$ 684308 667735 648729 629783 614406 602230 590082 577261 565940 556937 548817 540707 532527
55697E32527r596j2555j4479j4043j3306j3817j4258j3904j4263j5414j4830j1932
$$ 532527 522931 510376 495897 481854 468548 454731 440473 426569 412306 396892 382062 370130
55685C70130r566r003p906n313l934m979n419l342j474k137l065j717J07j41j003
$$ 370130 360564 351561 343655 338342 334408 329429 324010 320668 319194 317057 313992 312275 312382 312241 311238
55670C11238K42K673L299J519j002l130m466m592m126m637o023o258m977m523
$$ 311238 311480 314153 317452 318971 317969 314839 310373 305781 301655 297018 290995 284737 279760 275237
55656B75237n922o920n702l570k126q52O01Q53m48j224l50M33p2k02J187K125
$$ 275237 269315 262395 256693 253123 250997 250145 250746 251599 251151 249927 249577 250010 249938 249736 250923 253048
55640B53048Q32r36o19J173J880N67j718l630l972k097Q94K901L588M469N838
$$ 253048 253880 252944 252325 253498 255378 255945 254227 250597 246625 244528 245422 248323 251911 256380 262218
55625B62218O247N609N880P560Q592P901P121P409P388N756L306J149o07j475
$$ 262218 268465 274074 279954 287514 296106 304007 311128 318537 325925 331681 334987 336136 335529 334054
55611C34054p40K02j158m166n079k566L98J424J814L176M519M825N038N484M556
$$ 334054 333314 333516 332358 328192 323113 320547 320945 322369 324183 327359 331878 336703 341741 347225 351781
55596C51781K010M85J502L012L023K689L492M341L836K834K371J539m01k218l039
$$ 351781 353791 354276 355778 358790 361813 364502 367994 372335 376171 379005 381376 382915 382514 380296 377257
55581C77257m043n922p145o616n662n605n906o324q088j1058j2610j1443r757
$$ 377257 373214 367292 360147 353531 347869 342264 336358 330034 321946 310888 298278 286835 277078
55568B77078r640j0116r796r640j0717j1764j1342j0132r120p789n915m693m378
$$ 277078 267438 257322 247526 237886 227169 215405 204063 193931 184811 177022 171107 166414 162036
55555A62036l459j691j081k229k875j903j352k393k887j384n9q81k165j815q53
$$ 162036 158577 156886 155805 153576 150701 148798 147446 145053 142166 140782 140723 139842 137677 135862 135009
55540A35009p91o44M86R29l96j388m62L10r13j997p03P53p92l972n217m363l711
$$ 135009 134218 133574 134060 134989 134593 133205 132743 133053 132140 130143 129440 130193 129401 125429 120212 115849 112138
55523A12138l426k144n65l27n35O99K462K459J116O86J342J580J420J831K124
$$ 112138 108712 106568 106003 105676 105141 105840 108302 110761 111877 112563 113905 115485 116905 118736 120860
55508A20860J277P20K445N296O607O440O865P968Q067P013N841L950J30m227o436
$$ 120860 122137 122857 125302 130598 137205 143645 150510 158478 166545 173558 179399 183349 183479 179252 172816
55493A72816o601o950p621o752m653m139o055p677o550l498j075p92k399m320
$$ 172816 166215 159265 151644 144892 140239 136100 130045 122368 115818 112320 111245 110453 108054 103734
55479A03734m676l084j104Q6J289L267M647L970K384J997K782L456M122N397O110
$$ 103734 99058 95974 94870 94956 96245 99512 104159 108129 110513 112510 115292 118748 122870 128267 134377
55464A34377M799K604J835K394K357J429R75J157Q80K60M96J508K049J892J629
$$ 134377 139176 141780 143615 146009 148366 149795 150770 151927 152807 153067 153563 155071 157120 159012 160641
55449A60641P85j489m222n476n063m390m049l701l666m442n256n186n057o043
$$ 160641 161426 159937 155715 150239 145176 140786 136737 133036 129370 124928 119672 114486 109429 103386
55435A03386p339p377o510o047n730m615l523l796m510l826k281j801k100j181
$$ 103386 96047 88670 82160 76113 70383 65768 62245 58449 53939 50113 47832 46031 43931 42750
55421D2750R38K126J573M55o51k161l432l206k044j605j604l52J701K028j6k131
$$ 42750 43688 45814 47387 47842 47191 45030 41598 38392 36348 34743 33139 32787 34488 36516 36500 34369
55405C4369k498j829j487j739k320k762k053K7J546N15j921k803j512n1M60P25
$$ 34369 31871 30042 28555 26816 24496 21734 19681 19708 21254 21769 19848 17045 15533 15482 15942 16667
55389A6667Q23j72j764k101r36L7J54M75J075M87j416k561j658J14J226J553J377
$$ 16667 17490 17318 15554 13453 12517 12554 12708 13183 14258 14745 13329 10768 9110 9224 10450 12003 13380
55372A3380P35L46J233K825L348K564K020K202J744J60q77l8J768L019L421L235
$$ 13380 14115 14461 15694 18519 21867 24431 26451 28653 30397 30557 29680 29642 31410 34429 37850 41085
55356D1085K249M77j157j668r73J53N02p48k757l353j802j56l03r86L5K165L102
$$ 41085 43334 43811 42654 40986 40013 40166 40668 39920 37163 33810 32008 31852 31549 30563 30598 32763 35865
55339C5865K682K518K383N86k204l113j641o66j927l620l589k179o87N32J194
$$ 35865 38547 41065 43448 44034 41830 38717 37076 36410 34483 30863 27274 25095 24408 24940 26134
55324B6134O18o85j021q1M99j02o88m72m37j280k089k117j939j875j251j07L49
$$ 26134 26752 26067 25046 24965 25464 25362 24674 24202 23765 22485 20396 18279 16340 14465 13214 13107 13456
55307A3456j48l03M18Q73N44M89J049R13k88p10P36K227J678j16q21J61J479J915
$$ 13456 13308 13005 13423 14296 14840 15329 16378 17291 17003 16293 17029 19256 20934 20818 19997 20158 21637 23552
55289B3552J193n20k658m220m579l943k761j394l17K39Q53J910K341J058p10o11
$$ 23552 24745 24225 21567 17347 12768 8825 6064 4670 4353 4592 5445 7355 9696 10754 10044 9433
55273I433J244K203R86p20j142o58k10L47J148J474J015N26M81N67R48K049K777
$$ 9433 10677 12880 13866 13146 12004 11346 11136 11483 12631 14105 15120 15646 16127 16694 17642 19691 22468
55256B2468J283j888l814l206j852j156j29J755K605J173n47k15J214J244k53
$$ 22468 23751 21863 18049 14843 12991 11835 11706 13461 16066 17239 16692 16477 17691 18935 18682
55241A8682j355j259r17j017j237j115m42P09J498Q39p30j098N06K085J670J7
$$ 18682 17327 16068 15151 14134 12897 11782 11340 12049 13547 14386 13656 12558 13064 15149 16819 16836
55225A6836r32q36n06N8J206K222K128J291O89K11q09j992k318j716r50l63J68
$$ 16836 15904 15068 14562 14620 15826 18048 20176 21467 22156 22367 21558 19566 17248 15532 14582 14219 14387
55208A4387N10N25N33O30K09r35j822j574p38k51J06R94J998K099J310O40O23
$$ 14387 14897 15422 15955 16585 16794 15859 14037 12463 11725 11474 11580 12574 14572 16671 17981 18621 19244
55191A9244R11J070R66N00k28o67l37M44R00P33L91M09O88M74p52k221k287m13
$$ 19244 20155 21225 22191 22691 22463 21796 21459 21903 22803 23536 23927 24336 25024 25498 24746 22525 20238 19825
55173A9825J837K613J938J078N13j06n74m04j17m67o99M55K232K402N73j187j370
$$ 19825 21662 24275 26213 27291 27804 27698 27124 26720 26603 26136 25437 25892 28124 30526 31099 29912 28542
55156B8542o45j4N13Q55M32m58o55m2K85J21M23J128R08l83j233r92n52nJ575
$$ 28542 27897 27883 28396 29251 29683 29225 28570 28528 28813 28934 29357 30485 31393 31010 29777 28785 28233 28228 29803
55137B9803L335K674n23k731j604Q01J547R17O89P21k0q96o60J92M84M98J023
$$ 29803 33138 35812 35289 32558 30954 31755 33302 34219 34908 35629 35609 34713 34053 34245 34729 35227 36250
55120C6250J460R37K0n17j257k646l356k293p77n25q03Q4J557J578K2j209j020
$$ 36250 37710 38647 38667 38150 36893 34247 30891 28598 27821 27296 26493 26577 28134 29712 29734 28525 27505
55103B7505k08J60k39j208k004j690n19M0l05K24K605M864M684K632Q53r1q36
$$ 27505 27297 27457 27218 26010 24006 22316 21797 21837 21532 21756 24361 29225 33909 36541 37394 37303 36467
55086C6467j127n78k77j188j904o44J411J604j6r28l06K7r25j748j200j30K08
$$ 36467 35340 34762 34485 33297 31393 30749 32160 33764 33748 32820 32514 32541 31616 29868 28668 28538 28746
55069B8746%J81J110K424L303K772Q63o59l5K153L675L588L068L233L643L366
$$ 28746 28746 28927 30037 32461 35764 38536 39399 38740 38705 40858 44533 48121 51189 54422 58065 61431
55053F1431K364J300O67N17O24P59Q47P63J09j151k015j531n30p02j798j693K22
$$ 61431 63795 65095 65762 66279 66903 67662 68509 69272 69381 68230 66215 64684 64154 63452 61654 59961 60183
55036F0183J906J999J820K548K837J367l77m63K05k85j322j077p5k25j152p63
$$ 60183 62089 64088 65908 68456 71293 72660 72283 71820 72025 71740 70418 69341 69266 69041 67889 67126
55020F7126Q64J453L93l87K45J189J508J722K091J893J114P68R81O46m37j006
$$ 67126 67990 69443 69836 69449 69694 70883 72391 74113 76204 78097 79211 79979 80960 81606 81169 80163
55004H0163m98L4j78n01m12m84j074j455j127p51r91j421j388j010p19m22K22
$$ 80163 79665 79699 79521 79020 78608 78124 77050 75595 74468 73717 72726 71305 69917 68907 68188 67766 67988
54987F7988J119J781J819J320Q35P78P55P2r47j173m98j49n43l84J005K144J682
$$ 67988 69107 70888 72707 74027 74862 75640 76395 76467 75520 74347 73849 73700 73157 72773 73778 75922 77604
54970G7604P01P89J215L34j260j514k04J007J482K138L102L115J634l25j801k741
$$ 77604 78305 79094 80309 80643 79383 77869 77665 78672 80154 82292 85394 88509 90143 89818 88017 85276
54954H5276l133k725j802j033n97l62m70o83l8J654K959K836K222J998R96j633
$$ 85276 82143 79418 77616 76583 75986 75624 75154 74471 74433 76087 79046 81882 84104 86102 87098 85465
54938H5465l719k703J75J538R23P17J486J100j051k614j992n46%j92l75m60j14
$$ 85465 81746 79043 79218 80756 81679 82396 83882 84982 83931 81317 79325 78779 78779 78587 78212 77752 77638
54921G7638J236K756K699J071k93o58q70p70J089M197N628M093J889J359J810
$$ 77638 78874 81630 84329 85400 85107 84449 83579 82809 83898 88095 93723 97816 99705 101064 102874
54906A02874J644J169J461K081J974J324R96J131J528K356L549M517N166O023
$$ 102874 104518 105687 107148 109229 111203 112527 113523 114654 116182 118538 122087 126604 131770 137793
54892A37793O859O703N701N350O294P592Q670R992J1341J1602J1066J1566J3325
$$ 137793 144652 151355 157056 162406 168700 176292 184962 194954 206295 217897 228963 240529 253854
54879B53854J4208J3398J3146J4845J5862J2873O582N24l656p132j0865j4247
$$ 253854 268062 281460 294606 309451 325313 338186 344768 345292 341636 334504 323639 309392
54867C09392j6548j7757j7786j6418j4145j2013j0507r349q107o499m480k671
$$ 309392 292844 275087 257301 240883 226738 214725 204218 194869 186762 180263 175783 173112
54855A73112k098k950m107m439l874k864j494L23K396M396N865O053M750L305
$$ 173112 171014 168064 163957 159518 155644 152780 151286 151609 154005 158401 164266 170319 175069 178374
54841A78374L589N809Q550J1070J3881J6806J8327J7608J5526J2922R431M942
$$ 178374 181963 187772 196322 207392 221273 238079 256406 274014 289540 302462 311893 316835
54829C16835N62k953o293j0036j3271j4861j5033j4670j4086j3385j2920j2700
$$ 316835 317397 314444 308151 298115 284844 269983 254950 240280 226194 212809 199889 187189
54817A87189j2171j1207j0193q850o497l866k906m003n136m749l681l311l421
$$ 187189 175018 163811 153618 144768 138271 134405 131499 127496 122360 117611 113930 110619 107198
54804A07198l127k368j311K32J773K073J051J84Q6m36j902k873k461j911k090
$$ 107198 104071 101703 100392 100624 102397 104470 105521 105705 105791 105355 103453 100580 98119 96208 94118
54789I4118j805n51n53l307o068m980n34L159L750K401O32j368l156l465k001
$$ 94118 92313 91762 91209 87902 81834 76854 76320 79479 83229 85630 86262 84894 81738 78273 76272
54774G6272m2J293J892J711N58r17j467q35m1R9k77p48j077r91l74M16J038J745
$$ 76272 76230 77523 79415 81126 81684 80767 79300 78465 78424 78523 78246 77498 76421 75430 75056 75472 76510 78255
54756G8255K763L577L543K722J520K05n75J53K197L753L646K978L285M068L773
$$ 78255 81018 84595 88138 90860 92380 92585 92010 92163 94360 98113 101759 104737 108022 112090 115863
54741A15863K426J603K162L599N325O993P834P158N639M965O120Q686J1567J3665
$$ 115863 118289 119892 122054 125653 130978 137971 145805 152963 158602 163567 169687 178373 189940 203605
54727B03605J4317J4011J4185J5439J6594J6291J4774J3068J1284Q940O157L178
$$ 203605 217922 231933 246118 261557 278151 294442 309216 322284 333568 342508 348665 351843
54715C51843n08n200r769j2730j3942j4018j2925j0754q903q682r169q318n812
$$ 351843 351335 346135 336366 323636 309694 295676 282751 271997 263094 254412 245243 236925 231113
54702B31113l151j311j32L76J36K00J802M095M891L946L537N220P882R838J1123
$$ 231113 227962 226651 226519 226895 227031 227231 229033 233128 238019 241965 245502 250722 258604 268442 279565
54687B79565J2661J4486J6041J7277J8439J9362J9817J9987J9807J8359J4707
$$ 279565 292226 306712 322753 340030 358469 377831 397648 417635 437442 455801 470508
54676D70508R159L044k708q120j3364j7878k0704k1664k1675k1737k1811k1284
$$ 470508 479667 482711 480003 471883 458519 440641 419937 398273 376598 354861 333050 311766
54664C11766k0151j9026j8049j6666j4664j2560j0740r020p311n818m493l206
$$ 311766 291615 272589 254540 237874 223210 210650 199910 190890 183579 177761 173268 170062
54652A70062k498k928l583k853j030k12j044j656r39n49j971l616l177j324m69
$$ 170062 167564 164636 161053 158200 157170 156958 155914 154258 153319 152770 150799 147183 144006 142682 142213
54637A42213r17q93J70R82Q25L52j56j160k278k222p60Q31J649K110K626K662
$$ 142213 141296 140403 140573 141555 142380 142732 142576 141416 139138 136916 136156 136987 138636 140746 143372 146034
54621A46034J651j3j269j240J83J982K644J743M39j08m4J26O12J481J927J765
$$ 146034 147685 147672 146403 145163 145346 147328 149972 151715 152154 152046 152002 152128 152740 154221 156148 157913
54605A57913K323M360O368O759O436O993P616O466M294L544M262M007K065O81
$$ 157913 160236 164596 170964 177723 184159 191152 198768 205234 209528 213072 217334 221341 223406 224087
54591B24087J381K873L520L496L361K827K192K973N528P775P907O926P069Q777
$$ 224087 225468 228341 231861 235357 238718 241545 243737 246710 252238 260013 267920 274846 281915 290692
54577B90692J0731J2107J3250J4578J5946J7038J7608J7439J6285J3709R179K985
$$ 290692 301423 313530 326780 341358 357304 374342 391950 409389 425674 439383 448562 451547
54565D51547l179p544j0209j2701j5625j7972j8943j9014j8722j7676j5469j2666
$$ 451547 448368 440824 430615 417914 402289 384317 365374 346360 327638 309962 294493 281827
54553B81827j0188q501p731p725p549o029l371j350j220k150k462j765j162j629
$$ 281827 271639 263138 255407 247682 240133 234104 230733 229383 228163 226013 223551 221786 220624 218995
54539B18995k932m113m652m911n360n611m863l351k410k730l498l969m593n547
$$ 218995 216063 211950 207298 202387 197027 191416 186553 183202 180792 178062 174564 170595 166002 160455
54525A60455n542l910k629l981o775p457m997k105j151j325q96r7j59r46j279
$$ 160455 154913 151003 148374 144393 137618 130161 125164 123059 121908 120583 119687 119590 119431 118485 117206
54510A17206r06p12j177j584q29J323L657M307K559k11j938j926r57R4P41M97
$$ 117206 116300 115588 114411 112827 111998 113321 116978 121285 123844 123633 121695 119769 118812 118906 119647 120144
54494A20144o14j414p56P04J273N85p1K20J131K208L370M112L742K578J749J563
$$ 120144 119530 118116 117360 118064 119337 119922 119851 120071 121202 123410 126780 130892 134634 137212 138961 140524
54478A40524J500J654K607L753L615K241J560K699M520N528N767O046O611P347
$$ 140524 142024 143678 146285 150038 153653 155894 157454 160153 164673 170201 175968 182014 188625 195972
54464A95972Q288R152R228Q204O461M354K113K12j232l145o100q569q459o342
$$ 195972 204260 213412 222640 230844 237305 241659 243772 243984 242752 239607 233507 224938 216479 210137
54450B10137m961n355n788n048m393n066o160o377o166o476o825o147m579l085
$$ 210137 205176 199821 194033 188985 184592 179526 173366 166989 160823 154347 147522 141375 136796 133711
54436A33711k065j399j048q06k48M49N54J30J59Q96J325Q98M41P08J312J730K037
$$ 133711 131646 130247 129199 128393 128145 128594 129148 129278 129437 130333 131658 132556 132997 133705 135017 136747 138784
54419A38784K028J142j18k09J220K500K198P67o70j602j603k84J420J761P78N09
$$ 138784 140812 141954 141836 141627 142847 145347 147545 148312 147642 146040 144437 144153 145573 147334 148112 148621
54403A48621J759K853K703K612L454L523J408j076j299L54J461J095J4j408l030
$$ 148621 150380 153233 155936 158548 162002 165525 166933 165857 164558 164912 166373 167468 167482 166074 163044
54388A63044l684k539r93r88k026k069q02K70N25O81Q12J31j222k128k289k280
$$ 163044 159360 156821 155828 154840 152814 150745 149943 150213 150738 151419 152231 152362 151140 149012 146723 144443
54372A44443j999q96K81k7j731k958k705j907j448r04J85J185J407J140J039J227
$$ 144443 142444 141548 141829 141802 140071 137113 134408 132501 131053 130149 130334 131519 132926 134066 135105 136332
54356A36332J603K237L006L402L048K086R38J46K87J462K926L778L913L832L756
$$ 136332 137935 140172 143178 146580 149628 151714 152652 152798 153085 154547 157473 161251 165164 168996 172752
54341A72752L522L100K630K191K029K627M014N418O220O748P405P605O488M340
$$ 172752 176274 179374 182004 184195 186224 188851 192865 198283 204503 211251 218656 226261 232749 237089
54327B37089K367J176K86r29k468l840m568m596m308l978l358k293j514j794k525
$$ 237089 239456 240632 240918 239989 237521 233681 229113 224517 220209 216231 212873 210580 209066 207272 204747
54312B04747k468k022k965n450p088o047l428j355l21K03R8o48q77J30R21k18
$$ 204747 202279 200257 197292 191842 184754 178707 175279 173924 173603 173806 173904 173256 172379 172509 173430 173212
54296A73212k366k963j257J007K042J574K02j123j258Q1J566J841J534K294M245
$$ 173212 170846 167883 166626 167633 169675 171249 171451 170328 169070 169151 170717 172558 174092 176386 180631
54281A80631N771N680M257K405R94P51J629K448K198J293N50k30j419k217j818
$$ 180631 186402 192082 196339 198744 199738 200489 202118 204566 206764 208057 208607 208377 206958 204741 202923
54266B02923j189j875l498m266l751l359m078n343o207o128m814k561p20n00j492
$$ 202923 201734 199859 196361 192095 188344 184985 180907 175564 169357 163229 158415 155854 155134 154634 153142
54251A53142k429k867k931k330j238j149k884m501l613j115o5j230k482k661k948
$$ 153142 150713 147846 144915 142585 141347 140198 137314 132813 129200 128085 128020 126790 124308 121647 118699
54236A18699l973m490l939l602l944l234m96K194K295K06j656k044j603j242j300
$$ 118699 114726 110236 106297 102695 98751 95517 95021 97215 99510 99716 98060 96016 94413 93171 91871
54221I1871j772k243j976q53L09R00J312J957K346J848P36j69m29j58K78M51J91
$$ 91871 90099 87856 85880 85027 85336 86236 87548 89505 91851 93699 94435 94266 93837 93679 93957 94408 94599
54204I4599j19l4L65Q87J779K913L047J354p70j157RN30l90j161p13q7j95j74
$$ 94599 94480 94446 94811 95698 97477 100390 103437 104791 104021 102864 102873 103403 103013 101852 101139 101052 100857 100683
54186A00683P16J363P05j52M78K104K661J405l74j244j014l73j04n75j315j249
$$ 100683 101399 102762 103467 103315 103793 105897 108558 109963 109589 108345 107331 106958 106854 106279 104964 103715
54170A03715M7J651K210J315m09k076l016k953k216j413p61o8N61P99R13J702
$$ 103715 103762 105413 107623 108938 108529 106453 103437 100484 98268 96855 96094 96026 96587 97386 98299 100001
54154A00001L230M401M141K590Q27o1L11J164J009o09k049j373R51K509K026M66
$$ 100001 103231 107632 111773 114363 115190 115129 115440 116604 117613 117004 114955 113582 114533 117042 119068 119534
54138A19534j079k697m358n057m216k634j126M23J866K111P96o87j106j203k258
$$ 119534 118455 115758 111400 106343 102127 99493 98367 98790 100656 102767 103563 102876 101770 100567 98309
54123I8309l767m046k568l68J428K383K436J874J398J385J309N33o86j490j305
$$ 98309 94542 90496 87928 87560 88988 91371 93807 95681 97079 98464 99773 100306 99620 98130 96825
54108I6825n7J805L086K465J27k014k353j232o2L09j85j189j666m66J890L099
$$ 96825 96768 98573 101659 104124 104251 102237 99884 98652 98590 98899 98714 97525 95859 95393 97283 100382
54092A00382J874k14j062j031j818l269l563k279j054q53o41M86J548J232m7q35
$$ 100382 102256 102042 100980 99949 98131 94862 91299 89020 87966 87113 86472 86958 88506 89738 89691 88856
54076H8856o04O3P65J515J907J202m74j881k128j643j233q07P9P93O8k004l634
$$ 88856 88252 88315 89080 90595 92502 93704 93230 91349 89221 87578 86345 85538 85617 86410 86478 84474 80840
54059H0840l534k327j198k36P89J166K68q28n25Q61J454M99r02j682j748j040
$$ 80840 77306 74979 73781 73545 74334 75500 75768 74940 74415 75276 76730 77229 76327 74645 72897 71857
54043G1857N65K103K052N43n81l62L16P35J427K473K742J914J416K028K384J289
$$ 71857 72422 74525 76577 77120 76539 76177 76493 77228 78655 81128 83870 85784 87200 89228 91612 92901
54027I2901j23l50q1q20k051j962l53J186J694J819K384L338L998L485J388j240
$$ 92901 92778 92428 92347 91527 89476 87514 87161 88347 90041 91860 94244 97582 101580 105065 106453 105213
54011A05213k392j569o78j288k233j562L33J427J151N90L18J15M11J720K855J946
$$ 105213 102821 101252 100574 99286 97053 95491 95824 97251 98402 98992 99310 99425 99836 101556 104411 106357
53995A06357n79k224j850p43O7J229L027M159L737K902L075L979M558M638M573
$$ 106357 105778 103554 101704 100961 101028 102257 105284 109443 113180 116082 119157 123136 127694 132332 136905
53980A36905M321M054M550N825O387N369M453N882R009J0704R306O498M752M393
$$ 136905 141226 145280 149830 155655 162042 167411 171864 177746 186755 197459 206765 213263 218015 222408
53966B22408M108L366L093M144O145P934Q591P884O273M721M095M385M647M031
$$ 222408 226516 229882 232975 237119 243264 251198 259789 267673 273946 278667 282762 287147 291794 295825
53952B95825K701J536J066R77N52o51k346l470l007j220L04L34p15j887l323n580
$$ 295825 298526 300062 301128 302105 302657 302006 299660 296190 293183 291963 292267 292601 291886 289999 286676 281096
53936B81096p766q081o384m606m161m408m356m267m486m139k473n91l37j925l884
$$ 281096 273330 265249 258865 254259 250098 245690 241334 237067 232581 228442 225969 225378 225041 223116 219232
53921B19232m861m396k529L8J774J555l9j461j875j348j06J280J631M36r64q66
$$ 219232 214371 209975 207446 207484 209258 210813 210774 209313 207438 206090 205984 207264 208895 209331 208367 207501
53905B07501M90J409J272J040J202Q62p91l284n548o836o757n279l039q83R28
$$ 207501 207991 209400 210672 211712 212914 213776 212985 209701 204153 197317 190560 185281 182242 181359 182287
53890A82287K330K687J421n42j301j15K020L953N394O244O284N930O157P107P794
$$ 182287 184617 187304 188725 188183 186882 186767 188787 192740 198134 204378 210662 216592 222749 229856 237650
53875B37650P643P362P684Q278Q588Q820R272R288P818M784J403p92j051K6J003
$$ 237650 245293 252655 260339 268617 277205 286025 295297 304585 312403 317187 318590 317798 316747 316773 317776
53860C17776J093J119K344M443N669N261M538M990O212O615N578M046L293L823
$$ 317776 318869 319988 322332 326775 332444 337705 342243 347233 353445 360060 365638 369684 372977 376800
53846C76800N315P075Q527R538J0272J0617J0123Q548O212L649J279n43j554j878
$$ 376800 382115 389190 397717 407255 417527 428144 438267 446815 453027 456676 457955 457412 455858 453980
53832D53980j901j846j806k173l350n054o457p193p628q040q297q511r110r870
$$ 453980 452079 450233 448427 446254 442904 437850 431393 424200 416572 408532 400235 391724 382614 372744
53818C72744r824q776q097r012j0584j0580q326n722n065o504q131q262o979n591
$$ 372744 362920 354144 346047 337035 326451 315871 307545 301823 296758 290254 282123 273861 266882 261291
53804B61291n059n363n983o403o164n046l559k776l259m383n067m824l864k688
$$ 261291 256232 250869 244886 238483 232319 227273 223714 220938 217679 213296 208229 203405 199541 196853
53790A96853k033k548l821m278k946r16k0m51q50n80n22j312k128j852o68K44
$$ 196853 194820 192272 188451 184173 181227 180311 180291 179840 178990 178410 177888 176576 174448 172596 171928 172172
53774A72172N4r97j922j921j283j262k369l238k176L39K196K562K631L055K652
$$ 172172 172226 171229 169307 167386 166103 164841 162472 159234 157058 157397 159593 162155 164786 167841 170493
53759A70493P77p84r9J876K517J326L96J043J951J444J99L33K481M945N797M917
$$ 170493 171270 170486 170387 172263 174780 176106 176502 177545 179496 180940 181139 181472 183953 188898 194695 199612
53743A99612L666L111L233L724M651N861O366N358L706L316M777O549P092O862
$$ 199612 203278 206389 209622 213346 217997 223858 230224 235582 239288 242604 247381 253930 261022 267884
53729B67884P316Q494Q762O974M020J908J787L120M574N459O074O649O403M374
$$ 267884 275200 283694 292456 299430 303450 305358 307145 310265 314839 320298 326372 333021 339424 343798
53715C43798J178j089j212k70n6q47j714k339l185m087m262l890m199n452o249
$$ 343798 344976 343887 342675 342405 342349 341502 339788 337449 334264 330177 325915 322025 317826 312374 306125
53700C06125n678m912n337o132n469l567k587l305l884k810j248j160k347l196
$$ 306125 300447 295535 290198 284066 278597 275030 272443 269138 265254 262444 261196 260036 257689 254493
53686B54493l510m497o124o608n168l433l144l738l523k154p05P8K62q4q82j413
$$ 254493 250983 246486 240362 233754 228586 225153 222009 218271 214748 212594 211889 211967 212229 212145 211263 209850
53670B09850r23J76P13L80k7J1J16j17n35j057j813k383j802J09K134L019K943
$$ 209850 208927 209103 209816 210196 210169 210180 210296 210179 209644 208587 206774 204391 202589 202698 204832 207851 210794
53653B10794K968L480L827L415K557K108K504L249L503L172L140M113N480N896
$$ 210794 213762 217242 221069 224484 227041 229149 231653 234902 238405 241577 244717 248830 254310 260206
53639B60206M931L451K384J801J534J948L467N620P132P025N455L526K364K211
$$ 260206 265137 268588 270972 272773 274307 276255 279722 285342 292474 299499 304954 308480 310844 313055
53625C13055K423K456K639L494M545M489K931J296J471L707O226O888N079K116
$$ 313055 315478 317934 320573 324067 328612 333101 336032 337328 338799 342506 348732 355620 360699 362815
53611C62815j4l21N36J197J030N43N18R91J191L89j255k715l112k597j988j697
$$ 362815 362801 362480 363016 364213 365243 365786 366304 367295 368486 368875 367620 364905 361793 359196 357208 355511
53595C55511j436r04j25Q98J988K180M59k313l522j999J19J34j528k168q25P09
$$ 355511 354075 353171 353046 353944 355932 358112 358571 356258 352736 350737 350856 350990 349462 347294 346469 347178
53579C47178R02L76K16L34M62J168K602L443K524P47O9J073K650L679L939L549
$$ 347178 348080 348456 348672 349006 349468 350636 353238 356681 359205 359952 360021 361094 363744 367423 371362 374911
53563C74911K663J874K013L224M671N358N039M255L644L372L176L047L582N232
$$ 374911 377574 379448 381461 384685 389356 394714 399753 404008 407652 411024 414200 417247 420829 426061
53549D26061P309Q419Q121P445P440P877P941P597P532P943Q261Q016P361O558
$$ 426061 433370 441789 449910 457355 464795 472672 480613 488210 495742 503685 511946 519962 527323 533881
53535E33881N683N018N180O277P361P424O882P196Q632R448Q186O121N826P474
$$ 533881 539564 544582 549762 556039 563400 570824 577706 584902 593534 602982 611168 617289 623115 630589
53521F30589Q443P110N221N168O399O462M668K682J789J577J452J615K038K042
$$ 630589 639032 646142 651363 656531 662930 669392 674060 676742 678531 680108 681560 683175 685213 687255
53507F87255J462J008J041J127J041J060R94L32m19j82N40j39k223k889l60L023
$$ 687255 688717 689725 690766 691893 692934 693994 694988 695320 694901 694719 695259 695120 692897 690008 689648 692671
53491F92671L719J831O33J778L385L175J391k15p39l11J012L170N237N782M507
$$ 692671 696390 698221 698854 700632 704017 707192 708583 708368 707629 707318 708330 711500 716737 722519 727026
53476G27026K830K400L308M294M535M530N004N734O205O767Q173J0249J1981J2895
$$ 727026 729856 732256 735564 739858 744393 748923 753927 759661 765866 772633 780806 791055 803036 815931
53462H15931J3369J3680J3818J4275J5875J8455K0832K2334K3441K4626K5706
$$ 815931 829300 842980 856798 871073 886948 905403 926235 948569 972010 996636 1022342
53451A022342K6723K8207L0021L1121L1205L1385L2427L3494L3755L4089L5835
$$ 1022342 1049065 1077272 1107293 1138414 1169619 1201004 1233431 1266925 1300680 1334769 1370604
53440A370604L8489M0258M0645M1084M2870M5451M7148M7110M6263M6433M8425
$$ 1370604 1409093 1449351 1489996 1531080 1573950 1619401 1666549 1713659 1759922 1806355 1854780
53429A854780N1066N2403N1770N0100M8401M6877M5646M5167M5462M5920M6212
$$ 1854780 1905846 1958249 2010019 2060119 2108520 2155397 2201043 2246210 2291672 2337592 2383804
53418B383804M6582M6840M6267M4972M4133M4094M3485M1166L8034L5851L5089
$$ 2383804 2430386 2477226 2523493 2568465 2612598 2656692 2700177 2741343 2779377 2815228 2850317
53407B850317L4859L4117L2217K9066K5714K3729K3109K1815J8365J3805R978
$$ 2850317 2885176 2919293 2951510 2980576 3006290 3030019 3053128 3074943 3093308 3107113 3117091
53396C117091O945L578k57l690o474r152j2006j4972j8128k1257k3571k4974k6789
$$ 3117091 3124036 3127614 3127357 3123667 3117193 3108041 3096035 3081063 3062935 3041678 3018107 2993133 2966344
53383B966344l0022l3682l6165l7499l8852m0520m1832m2392m2119m0852l9283
$$ 2966344 2936322 2902640 2866475 2828976 2790124 2749604 2707772 2665380 2623261 2582409 2543126
53372B543126l9233m1248m3029m2217l9729l8019l6996l4436l0055k6049k3410
$$ 2543126 2503893 2462645 2419616 2377399 2337670 2299651 2262655 2228219 2198164 2172115 2148705
53361B148705k0733j7382j4995j4544j4251j2040q350m923k134Q99M450P776J0170
$$ 2148705 2127972 2110590 2095595 2081051 2066800 2054760 2046410 2041487 2039353 2040252 2044702 2052478 2062648
53348B062648J1582J2723J4951J9381K5595L1712L6041L8205L9000L9821M2084
$$ 2062648 2074230 2086953 2101904 2121285 2146880 2178592 2214633 2252838 2291838 2331659 2373743
53337B373743M5950M9899N2615N4855N8027O1554O3756O5051O7794P2593P7350
$$ 2373743 2419693 2469592 2522207 2577062 2635089 2696643 2760399 2825450 2893244 2965837 3043187
53326C043187Q0690Q3837Q7966R1995R4588R6379R8485J00527J01818J02962J04436
$$ 3043187 3123877 3207714 3295680 3387675 3482263 3578642 3677127 3777654 3879472 3982434 4086870
53315D086870J04969J03307J00425R8137R6438R4135R1180Q8333Q5226Q0922P5860
$$ 4086870 4191839 4295146 4395571 4493708 4590146 4684281 4775461 4863794 4949020 5029942 5105802
53304E105802P1172O6299N9489N0712M1978L4490K7443K0091J3092O900N62o813
$$ 5105802 5176974 5243273 5302762 5353474 5395452 5429942 5457385 5477476 5490568 5497468 5498030 5491217
53292E491217j4661k2117k9481l7286m4818n1011n6383o2628p0231p7689q3512
$$ 5491217 5476556 5454439 5424958 5387672 5342854 5291843 5235460 5172832 5102601 5024912 4941400
53281D941400q7948r2108r5927r8061r7725r5856r4089r3066r2268r1192q9998
$$ 4941400 4853452 4761344 4665417 4567356 4469631 4373775 4279686 4186620 4094352 4003160 3913162
53270C913162q8852q7377q5268q3176q2268q2663q2639p9999p4401o8009o3397
$$ 3913162 3824310 3736933 3651665 3568489 3486221 3403558 3320919 3240920 3166519 3098510 3035113
53259C035113o0939n8780n5363n1144m7502m4757m2147l9256l6537l4578l3518
$$ 3035113 2974174 2915394 2860031 2808887 2761385 2716628 2674481 2635225 2598688 2564110 2530592
53248B530592l3001l2064k9456k4905j9903j6196j3766j1392q876p272o726n742
$$ 2530592 2497591 2465527 2436071 2411166 2391263 2375067 2361301 2349909 2341033 2333761 2327035 2321293
53236B321293l280k37K025L570N252P114Q714J0530J3680J8188K2504K5119K6204
$$ 2321293 2318013 2317776 2319801 2323371 2328623 2335737 2344451 2354981 2368661 2386849 2409353 2434472 2460676
53223B460676K7359K9879L3470L6757L8894M0368M2029M3921M5578M6879M7703
$$ 2460676 2488035 2517914 2551384 2588141 2627035 2667403 2709432 2753353 2798931 2845810 2893513
53212B893513M7205M4619M0709L7184L4647L2240K9439K6690K4000K0464J6014
$$ 2893513 2940718 2985337 3026046 3063230 3097877 3130117 3159556 3186246 3210246 3230710 3246724
53201C246724J2224J0219Q873O235K080k089n081p103r222j2420j6890k1714k5678
$$ 3246724 3258948 3269167 3278040 3284275 3286355 3284266 3279185 3272082 3262860 3250440 3233550 3211836 3186158
53188C186158k8709l1809l5366l8527m0809m3002m5637m7784m8557m8735m9588
$$ 3186158 3157449 3125640 3090274 3051747 3010938 2967936 2922299 2874515 2825958 2777223 2727635
53177B727635n0954n1908n2487n3191n3364n1906m9294m7194m6024m4651m2653
$$ 2727635 2676681 2624773 2572286 2519095 2465731 2413825 2364531 2317337 2271313 2226662 2184009
53166B184009m1242m1275m1734m1037l8972l6645l5079l4503l4489l4201l2820
$$ 2184009 2142767 2101492 2059758 2018721 1979749 1943104 1908025 1873522 1839033 1804832 1772012
53155A772012l0252k7389k5505k5316k6507k7878k8162k6991k5141k3737k3402
$$ 1772012 1741760 1714371 1688866 1663550 1637043 1609165 1581003 1554012 1528871 1505134 1481732
53144A481732k4063k5074k5442k4709k3853k4462k6474k7865k7344k6186k6104
$$ 1481732 1457669 1432595 1407153 1382444 1358591 1334129 1307655 1279790 1252446 1226260 1200156
53133A200156k6408k5100k2178j9863j9422j9792j9703j9489j9982k0977k1720
$$ 1200156 1173748 1148648 1126470 1106607 1087185 1067393 1047690 1028201 1008219 987242 965522
53122I65522k2057k2246k2348k2350k2279k1798k0506j8975j8437j8897j8640
$$ 965522 943465 921219 898871 876521 854242 832444 811938 792963 774526 755629 736989
53111G36989j6592j4196j3760j5398j6915j6489j4467j2411j1371j1286j1479
$$ 736989 720397 706201 692441 677043 660128 643639 629172 616761 605390 594104 582625
53100E82625j1286j0561r752r412r622j0007j0135r732q821p934p795q301q165
$$ 582625 571339 560778 551026 541614 531992 521985 511850 502118 493297 485363 477568 469267 461102
53087D61102o388l904k843l939n554n801m816m162m461m788m315l396k655j877
$$ 461102 454714 450810 447967 444028 438474 432673 427857 423695 419234 414446 410131 406735 404080 402203
53073D02203p05J83l63k355m360n061m501l548k766k147j588j144q95p99p36o87
$$ 402203 401498 401681 401318 398963 394603 389542 385041 381493 378727 376580 374992 373848 372953 372154 371418 370731
53057C70731r25j924l732n576o411n818m120j833L61J437P60q78j844j627j310
$$ 370731 369806 367882 364150 358574 352163 346345 342225 340392 340753 342190 342950 342072 340228 338601 337291
53042C37291j782k375k038r91k64k06k61M1O69J365J735J443R81J631L804N924
$$ 337291 335509 333134 331096 330105 329841 329635 329374 329415 330084 331449 333184 334627 335608 337239 341043 346967
53026C46967O040M229K269J228O40K3k37k0j72j395l165m483n103n435n728n914
$$ 346967 353007 357236 359505 360733 361373 361396 361159 361139 360967 359572 356407 351924 346821 341386 335658 329744
53010C29744n861n425m595l919m185n263n815m832l070k307l260m873n642n057
$$ 329744 323883 318458 313863 309944 305759 300496 294681 289849 286779 284472 281212 276339 270697 265640
52996B65640l728k541j981j980k178k197j791r01K29R48O23p36k357l374l434
$$ 265640 261912 259371 257390 255410 253232 251035 249244 248343 248572 249520 250143 249407 247050 243676 240242
52981B40242k666j448m53n03j836l615m619m463l702k857j923j043q63j626k407
$$ 240242 237576 236128 235675 235172 233336 229721 225102 220639 216937 214080 212157 211114 210251 208625 206218
52966B06218k128j129q04j577k273j928j225j321k001k089j236k05N14J088J362
$$ 206218 204090 202961 202157 200580 198307 196379 195154 193833 191832 189743 188507 188302 188816 189904 191266
52951A91266P22o59j554j223l06M11J126K097K512J444n68k021k261j838j231
$$ 191266 191988 191329 189775 188552 188246 188657 189783 191880 194392 195836 195268 193247 190986 189148 187917
52936A87917l13Q57J732J942J640J047L98L13J332K814L154J701j90o81L17J177
$$ 187917 187604 188461 190193 192135 193775 194822 195220 195533 196865 199679 202833 204534 204344 203663 203980 205157
52920B05157N69j119k383k115m17J590K543J836K26o95jJ663K914L137K697J940
$$ 205157 205726 204607 202224 200109 199692 201282 203825 205661 205887 205192 205191 206854 209768 212905 215602 217542
52904B17542R53M33J549M125N988N376L291K027J836J035o49j135P54L095L428
$$ 217542 218495 218928 220477 224602 230590 235966 239257 241284 243120 244155 243506 242371 243125 246220 249648
52889B49648K102J363K061L182M045M968N797N600M390L697M649O443P413O916
$$ 249648 251750 253113 255174 258356 262401 267369 273166 278766 283156 286853 291502 297945 305358 312274
52875C12274N623M469L930L915L844K994J254n65j411j129p72j604l706n698o085
$$ 312274 317897 322366 326296 330211 334055 337049 338303 337738 336327 335198 334426 332822 329116 323418 317333
52860C17333m761k884j423n16j62o30j720k542k601k434k577k648k229j845k080
$$ 317333 312572 309688 308265 307749 307587 306957 305237 302695 300094 297660 295083 292435 290206 288361 286281
52845B86281k364j746m87K80K52K29Q28J821K664K787J697j79j111K38K794M043
$$ 286281 283917 282171 281684 281964 282216 282445 283273 285094 287758 290545 292242 292063 290952 291190 293984 298027
52829B98027L012R76p41k139l306l455k277j028j123k218k743j961n62N62J241
$$ 298027 301039 302015 301274 299135 295829 292374 290097 289069 287946 285728 282985 281024 280462 281024 282265
52814B82265J672J892J870J833K082K476K420J597N50N8O9j36n18m0J634L035
$$ 282265 283937 285829 287699 289532 291614 294090 296510 298107 298657 298715 298784 298648 298130 298090 299724 302759
52798C02759K504L84j496k050j615q60k13k50j265k304j831L09K537L424L085
$$ 302759 305263 305647 304151 302101 300486 299626 299413 299163 297898 295594 293763 294072 296609 300033 303118
52783C03118K431J986J843K077K656L368L928L927K926J129l72q61j001j645k112
$$ 303118 305549 307535 309378 311455 314111 317479 321407 325334 328260 329389 329017 328156 327155 325510 323398
52768C23398j057J184K656K330J156L61J37L33R89J664J580R77J067K155L080
$$ 323398 322341 323525 326181 328511 329667 330028 330165 330498 331487 333151 334731 335708 336775 338930 342010
52753C42010L026K486J868N93j529l444m320m574m605l844k272j387k248l667
$$ 342010 345036 347522 349390 349983 348454 345010 340690 336116 331511 327667 325395 324008 321760 318093
52739C18093l926l369l584m682n201m506l626l565m056m295m096l958m381n175
$$ 318093 314167 310798 307214 302532 297331 292825 289199 285634 281578 277283 273187 269229 264848 259673
52725B59673n386m355k896k606l682m532m060l070k576k109j024k81j197l108
$$ 259673 254287 249932 247036 244430 240748 236216 232156 229086 226510 224401 223377 223096 221899 218791
52711B18791m050l445k568k488l002l558l969m020l498k671j992j394o50j03k16
$$ 218791 214741 211296 208728 206240 203238 199680 195711 191691 188193 185522 183530 182136 181486 181383 181167
52696A81167p55j215j657k177k253j641j190j584k020j563j027j736l108l499
$$ 181167 180412 179197 177540 175363 173110 171469 170279 168695 166675 165112 164085 162349 159241 155742
52682A55742k894k605k666k067j406k399m309m012p61K046J596m84j234r83j926
$$ 155742 152848 150243 147577 145510 144104 141705 137396 133384 132623 134669 136265 135781 134547 133564 131638
52667A31638l779m115k518j265j662k302j590R0J545K479L029K917J963O14o47
$$ 131638 127859 123744 121226 119961 118299 115997 114407 114497 116042 118521 121550 124467 126430 127044 126397
52652A26397j708k281j893r16n56j173j500m03J340K019J213N3m83m82k98K06
$$ 126397 124689 122408 120515 119599 119043 117870 116370 115967 117307 119326 120539 120592 120109 119627 119329 119535
52636A19535J168K106K262J476L75k35j05M18J026J931L352M634M525K683M33
$$ 119535 120703 122809 125071 126547 126922 126687 126582 127000 128026 129957 133309 137943 142468 145151 145584
52621A45584o35m13J29P13J969L771M651L585J531K47K06N87R87J805K951L423
$$ 145584 144949 144536 144665 145378 147347 151118 155769 159354 160885 161132 161338 161925 162912 164717 167668 171091
52605A71091K648J455J022J442J878J710R03m27k061l299l301k145j096j347k553
$$ 171091 173739 175194 176216 177658 179536 181246 182149 181722 179661 176362 173061 170916 169820 168473 165920
52590A65920l107k020k87R4j610l994n061m222k498j218j124k268m009n054m335
$$ 165920 162813 160793 160506 160600 158990 154996 149935 145713 143215 141997 140873 138605 134596 129542 125207
52575A25207k157M6J199J391J144O72K08L57J491K996L755L179J625l9j008r95
$$ 125207 123050 123096 124295 125686 126830 127502 127710 128067 129558 132554 136309 139488 141113 141074 140066 139071
52559A39071m00J43N04R67J270M38j802l973m115k033M09J376Q10j41p79j286
$$ 139071 138671 138814 139318 140285 141555 141993 140191 136218 132103 130070 130479 131855 132665 132524 131745 130459
52543A30459j714j388K67K616M115L763J992N4j010q30K96J485J792J141L91K05
$$ 130459 128745 127357 127624 130240 134355 138118 140110 140164 139154 138324 138620 140105 141897 143038 143429 143634
52527A43634K85J72J28N59J114J287J411J989K535K200J360J225J924K333J846
$$ 143634 143919 144091 144219 144778 145892 147179 148590 150579 153114 155314 156674 157899 159823 162156 164002
52512A64002R82J99m76m91R28L067M032L349K651K995L278K375J176R54J217Q55
$$ 164002 164984 165183 164707 164216 165144 168211 172243 175592 178243 181238 184516 186891 188067 189021 190238 191093
52496A91093L73J147L117M846N361M539K326p96l120l065j126Q97K262L474M498
$$ 191093 191466 192613 195730 200576 205937 210476 212802 212006 208886 205821 204695 205592 207854 211328 215826
52481B15826M442L159J729J114J288J792K092J553M6j366j453m30L74L65J72M58
$$ 215826 220268 223427 225156 226270 227558 229350 231442 232995 233041 231675 230222 229792 230166 230531 230703 231161
52465B31161J157J733J448k04k347k750l02L054M377L213J482M40k24n79o6P57
$$ 231161 232318 234051 235499 235295 232948 230198 229896 232950 237327 240540 242022 242462 242238 241659 241593 242350
52449B42350L14j523k877k520j360n72nO26O30m32j689k136j759p95P57K041J427
$$ 242350 242664 241141 238264 235744 234384 233812 233807 234433 235063 234631 232942 230806 229047 228252 229009 231050 232477
52432B32477j144l240k789n95J198J905K029J448r0j432j081M40J190Q05J019
$$ 232477 231333 228093 225304 224709 225907 227812 229841 231289 231199 229767 228686 229126 230316 231121 232140
52417B32140K762M428M031J915K18J52Q95J081M99j46n59j083j689j675q66j47
$$ 232140 234902 239330 243361 245276 245494 245646 246541 247622 248121 247975 247416 246333 244644 242969 242103 241956
52401B41956K9P97L069N268M804J793p55q85J55N64N96J096J286N5j742k292j466
$$ 241956 241985 242782 245851 251119 255923 257716 256961 256076 256231 256795 257391 258487 259773 259828 258086 255794 254328
52384B54328n74m2P87J788J938J093L01J78K56J46L2j70r44k230l336l903m083
$$ 254328 253754 253712 254499 256287 258225 259318 259619 259797 260053 260199 260231 260061 259117 256887 253551 249648 245565
52367B45565l708k484r67j95j53J99J128J599R10k12o65j62J001K417L392L200
$$ 245565 241857 239373 238406 238211 238058 238257 239385 240984 241894 241682 241017 240855 241856 244273 247665 250865
52351B50865K038Q88J79m85j001m55J184K404K094J064N67L80l32j179j147m60
$$ 250865 252903 253791 253970 253485 252484 252029 253213 255617 257711 258775 259342 259722 259390 258211 257064 256604
52335B56604j76k36L74J521J731N68m58m4J093J557J251R40O99O1p13p19K90J636
$$ 256604 256428 256192 256566 258087 259818 260386 259928 259884 260977 262534 263785 264725 265424 265485 264772 264053 264343 265979
52317B65979K727L527M006L920L217K202J132K52N0Q09K006K772L009L242L426
$$ 265979 268706 272233 276239 280159 283376 285578 286710 286962 287012 287821 289827 292599 295608 298850 302276
52302C02276K933J946J716K962M856O250O966P192O544M844L221L225M933O927
$$ 302276 305209 307155 308871 311833 316689 322939 329905 337097 343641 348485 351706 354931 359864 366791
52288C66791P910P596O275M419K725J722J348J401K083L475M899N704O170O715
$$ 366791 374701 382297 388572 392991 395716 397438 398786 400187 402270 405745 410644 416348 422518 429233
52274D29233O644N036K579J031R49J413J992L229M868N421M396L327L559M311
$$ 429233 435877 440913 443492 444523 445472 446885 448877 452106 456974 462395 466791 470118 473677 477988
52260D77988M166L355L227M226N738P269Q643R399R261Q881R159J0039J0860J1571
$$ 477988 482154 485509 488736 492962 498700 505969 514612 524011 533272 542153 551312 561351 572211 583782
52246E83782J2684J4254J5725J6687J7087J6994J6778J7133J8230J9231J9422
$$ 583782 596466 610720 626445 643132 660219 677213 693991 711124 729354 748585 768007
52235G68007J9379K0111K1493K2605K3272K4126K5252K5988K6181K6435K6879
$$ 768007 787386 807497 828990 851595 874867 898993 924245 950233 976414 1002849 1029728
52224A029728K6755K5693K4552K4352K5027K5706K5851K5491K4549K2633J9693
$$ 1029728 1056483 1082176 1106728 1131080 1156107 1181813 1207664 1233155 1257704 1280337 1300030
52213A300030J6603J4646J4125J3785J2181R607Q035Q730J0524J1046R185N930
$$ 1300030 1316633 1331279 1345404 1359189 1371370 1380977 1389012 1397742 1408266 1419312 1428497 1434427
52201A434427L205K394L553N347O045N043L260J771P51J52L95J397J905R92k82
$$ 1434427 1437632 1440026 1443579 1448926 1454971 1460014 1463274 1465045 1465796 1465948 1466343 1467740 1469645 1470637 1470355
52186A470355q9J718L725N153O435P855R191J0766J3103J5330J5665J4168J3366
$$ 1470355 1470266 1471984 1475709 1480862 1487297 1495152 1504343 1515109 1528212 1543542 1559207 1573375 1586741
52173A586741J5133J8232J9950J9224J7151J5287J4487J4772J5329J5036J3613
$$ 1586741 1601874 1620106 1640056 1659280 1676431 1691718 1706205 1720977 1736306 1751342 1764955
52162A764955J1754R794P257M299K433K525L182K571J051L46N70J0k077m356n701
$$ 1764955 1776709 1786503 1793760 1798059 1800492 1803017 1806199 1808770 1809821 1810167 1810737 1810747 1808670 1804314 1798613
52147A798613o929r293j2392j4695j5423j4969j4017j3155j2862j2981j2523j0922
$$ 1798613 1791684 1782391 1769999 1755304 1739881 1724912 1710895 1697740 1684878 1671897 1659374 1648452
52135A648452r087q284q262p714o526o092p027p974p606o513n876n250l364p33
$$ 1648452 1639365 1631081 1622819 1615105 1608579 1602487 1595460 1587486 1579880 1573367 1567491 1562241 1558877 1558144
52121A558144M44p03k400k634j653j191k080l608m600m375k984j292m63q50j756
$$ 1558144 1558588 1557885 1555485 1552851 1551198 1550007 1547927 1544319 1539719 1535344 1532360 1531068 1530605 1529755 1527999
52106A527999k628l704m979n486m717l845m282n563o086n547n069n080m862m364
$$ 1527999 1525371 1521667 1516688 1511202 1506485 1502640 1498358 1492795 1486709 1481162 1476093 1471013 1466151 1461787
52092A461787m702o139p146o458m874l954l880l789l544l842m765n421n145m404
$$ 1461787 1457085 1450946 1443800 1437342 1432468 1428514 1424634 1420845 1417301 1413459 1408694 1403273 1398128 1393724
52078A393724m246n209o719p467o528m401k663k433l405m522n108n126m849m750
$$ 1393724 1389478 1384269 1377550 1370083 1363555 1359154 1356491 1354058 1350653 1346131 1341023 1335897 1331048 1326298
52064A326298n281o388p402p789p595p025o126n166m760n025n089m026j941K94
$$ 1326298 1321017 1314629 1307227 1299438 1291843 1284818 1278692 1273526 1268766 1263741 1258652 1254626 1252685 1252979
52050A252979K089L438M559N690P061Q639J0195J1703J3241J4384J4572J4398
$$ 1252979 1255068 1258506 1263065 1268755 1275816 1284455 1294650 1306353 1319594 1333978 1348550 1362948
52038A362948J5495J8397K1512K3225K4043K5469K7532K9035K9694L0347L1254
$$ 1362948 1378443 1396840 1418352 1441577 1465620 1491089 1518621 1547656 1577350 1607697 1638951
52027A638951L1823L2008L2254L2064L0445K8005K6642K6600K5883K3474K1006
$$ 1638951 1670774 1702782 1735036 1767100 1797545 1825550 1852192 1878792 1904675 1928149 1949155
52016A949155J9874J8698J5740J2144J0313R971Q534N102J621k15j024k126l669
$$ 1949155 1969029 1987727 2003467 2015611 2025924 2035895 2044429 2049531 2051152 2050937 2049913 2047787 2044118
52003B044118n196o597p779q506r039r842j0440r980r185r881j1917j2565j0145
$$ 2044118 2038922 2032325 2024546 2016040 2007001 1997159 1986719 1976739 1967554 1957673 1945756 1933191 1923046
51990A923046o488m152k985j411L38Q21L95R82K905M415M588M477M860M977M380
$$ 1923046 1916558 1912406 1909421 1908010 1908348 1909169 1909564 1910546 1913451 1917866 1922454 1926931 1931791 1936768 1941148
51975A941148M202N370O956P491O845N830M860M010L509L211K299M47j404k292
$$ 1941148 1945350 1950720 1957676 1965167 1972012 1977842 1982702 1986712 1990221 1993432 1995731 1996178 1994774 1992482
51961A992482k550l141m266n573p044q790j0473j1804j3081j4557j5866j6892
$$ 1992482 1989932 1986791 1982525 1976952 1969908 1961118 1950645 1938841 1925760 1911203 1895337 1878445
51949A878445j8374k0541k2056k1657k0342k0374k2428k5108k7209k8833l0247
$$ 1878445 1860071 1839530 1817474 1795817 1775475 1755101 1732673 1707565 1680356 1651523 1621276
51938A621276l1122l1518l2178l3296l3945l3525l2904l3291l4496l5116l4233
$$ 1621276 1590154 1558636 1526458 1493162 1459217 1425692 1392788 1359497 1325001 1289885 1255652
51927A255652l2323l0507k9325k8513k7875k7961k9253l0851l1008k9430k8004
$$ 1255652 1223329 1192822 1163497 1134984 1107109 1079148 1049895 1019044 988036 958606 930602
51916I30602k8202k8761k7450k4486k2350k2330k3007k2569k0972j9163j7633
$$ 930602 902400 873639 846189 821703 799353 777023 754016 731447 710475 691312 673679
51905F73679j6508j5861j5158j3522j1343j0364j1218j2055j0988q843p839q303
$$ 673679 657171 641310 626152 612630 601287 590923 579705 567650 556662 547819 539980 531677
51893E31677q515p695p167q045r319r208p473n453m259l789l402k819k242k017
$$ 531677 523162 515467 508300 500255 490936 481728 474255 468802 464543 460754 457352 454533 452291 450274
51879D50274k364l281m526n709o460o537n834m502l142k666l559n241o518o749
$$ 450274 447910 444629 440103 434394 427934 421397 415563 411061 407919 405253 401694 396453 389935 383186
51865C83186o225n385m245k941k122k147k388k155j905k546l736m016k708p25
$$ 383186 376961 371576 367331 364390 362268 360121 357733 355578 353673 351127 347391 343375 340667 339942
51851C39942O77J048M27j048k751l746l879l879l872k776p5K667L222J310j191
$$ 339942 340619 341667 342094 341046 338295 334549 330670 326791 322919 320143 320068 322735 325957 327267 326076
51836C26076k544k735k719k902k873k276j501j315j886k401k058j098m34l89m84
$$ 326076 323532 320797 318078 315176 312303 310027 308526 307211 305325 302924 300866 299768 299334 298945 298461
51821B98461m85p54j340j540r06M8O20P75O12k68k051l720l719j590J412L338
$$ 298461 297976 297222 295882 294342 293436 293484 294104 294879 295491 295223 293172 289452 285733 284143 285555 288893
51805B88893L063J143n30l18J688M046N604O075N193K746j93j474k96J705K684
$$ 288893 291956 293099 292569 292251 293939 297985 303589 309664 314857 317603 317410 315936 315640 317345 320029
51790C20029K786K977K997K061Q50P93J758K218J580P14J20o33j469j505n79L76
$$ 320029 322815 325792 328789 330850 331700 332493 334251 336469 338049 338763 338883 338250 336781 335276 334697 335073
51774C35073R91J926L072L080J674Q55K280M578N029L250J467J186J412N93q70
$$ 335073 336064 337990 341062 344142 345816 346671 348951 353529 358558 361808 363275 364461 365873 366466 365596
51759C65596j152N49K912L939L025J382N15O37Q15M37KK78J147J653J121n6p62
$$ 365596 364444 364993 367905 371844 374869 376251 376766 377403 378218 378655 378657 378935 380082 381735 382856 382800 382038
51742C82038k84Q88J500R63J05J66J216K213K445K182J724P93o33j645j348j04
$$ 382038 381754 382642 384142 385105 385210 385376 386592 388805 391250 393432 395156 395949 395316 393671 392323 392219
51726C92219Q93J098J008J204J637J977K111K169K293K501K671K684K588K530
$$ 392219 393112 394210 395218 396422 398059 400036 402147 404316 406609 409110 411781 414465 417053 419583
51712D19583K393J921J330J379K404L650M100L629K855K211J942K625M533O560
$$ 419583 421976 423897 425227 426606 429010 432660 436760 440389 443244 445455 447397 450022 454555 461115
51698D61115O965N652M534N007O101O172N454N589P060Q536Q720P565N475K671
$$ 461115 468080 473732 478266 483273 489374 495546 501000 506589 513649 522185 530905 538470 543945 546616
51684E46616k39k246l215m231n943p427p524o511n481m709l776k754k077j442
$$ 546616 546377 544131 540916 536685 530742 523315 515791 509280 503799 499090 495314 492560 490483 489041
51670D89041k22J182J509L85j210k404l266l938m012l263k216j450j085j164j753
$$ 489041 488819 490001 491510 491895 490685 488281 485015 481077 477065 473802 471586 470136 469051 467887 466134
51655D66134k331k156j543j788l222m488m447l657k996k150p12K11o64k451k895
$$ 466134 463803 461647 460104 458316 455094 450606 446159 442502 439506 437356 436644 436855 436191 433740 430845
51640D30845j489j00j85r57q90J74J235J528R85j22j241j632r77K22J204J716
$$ 430845 429356 429256 429071 428114 427224 427398 428633 430161 431146 431024 429783 428151 427174 427396 428600 430316
51624D30316K042K521L234M045M813N521O163O383N611L831J858M15p59k332m136
$$ 430316 432358 434879 438113 442158 446971 452492 458655 465038 470649 474480 476338 476753 475994 473662 469526
51609D69526n163m793l515k469k612m043n703o146n224m593n756p932q924p809
$$ 469526 464363 459570 456055 453586 450974 446931 441228 435082 429858 425265 419509 411577 402653 394844
51595C94844n691l875k592j647j127j034j182j789l223m899n556m946m103l615
$$ 394844 389153 385278 382686 381039 379912 378878 377696 375907 372684 367785 362229 357283 353180 349565
51581C49565k939j994j895l066l948k940o81R35J179N86o12k368l605k921p29
$$ 349565 346626 344632 342737 339671 335723 332783 332102 333037 334216 334802 334190 331822 328217 325296 324567
51566C24567Q59N75p50j752k088k068j872j697j879k171j630K15K570M171M403
$$ 324567 325426 326001 325251 323499 321411 319343 317471 315774 313895 311724 310094 310309 312879 317050 321453
51551C21453L397J647p8j040j158q06L9J666L307L256J144r07o39J438K877K623
$$ 321453 324850 326497 326419 325379 324221 323415 323454 325120 328427 331683 332827 331920 331281 332719 335596 338219
51535C38219J989K313L310M287N468P145Q504Q570P693O936O360N115L244K163
$$ 338219 340208 342521 345831 350118 355586 362731 371235 379805 387498 394434 400794 405909 409153 411316
51521D11316K867M492N149L833J034k014m234n078m552l061j282j5K39j00J41
$$ 411316 414183 418675 423824 427657 428691 426677 422443 417365 412813 409752 408470 408455 408694 408594 408735
51506D08735J460K694K330P92K99K094M857O471O407N529M515L662L452L931L970
$$ 408735 410195 412889 415219 416011 416310 418404 423261 429732 436139 441668 446183 449845 453297 457228 461198
51491D61198K582P64L90J367J634L85o11K19J767K032J205J257K922M651M671
$$ 461198 463780 464544 464934 466301 467935 468320 467709 467928 469695 471727 472932 474189 477111 481762 486433
51476D86433K897O73n87m08M26O08j52n36O84K759L802L292K489K226J727J90
$$ 486433 489330 490003 489416 489008 489434 490042 489890 489354 490038 492797 496599 499891 502380 504606 506333 506523
51460E06523j698k744k960l188l546l251j967m14L64j65j823l775m863m474l244
$$ 506523 504825 502081 499121 495933 492387 489136 487169 486755 487119 486954 485131 481356 476493 472019 468775
51445D68775k420k480k812k715k191j626j194q32m15J07N47M00n89j756k024j213
$$ 468775 466355 463875 461063 458348 456157 454531 453337 452505 452090 452197 452744 453144 452555 450799 448775 447562
51429D47562k22L30Q86J896K802K838K222J659J105J56o36j20J725L651M945O128
$$ 447562 447340 447670 448556 450452 453254 456092 458314 459973 461078 461234 460598 460478 462203 465854 470799 476927
51413D76927P353P483N850L869L491M585N208M413L417L749N275O604O645N260
$$ 476927 484280 491763 497613 501482 504973 509558 514766 519179 522596 526345 531620 538224 544869 550129
51399E50129K973O56p58q03J65J249J660J141J4j224k417l717m794m565k389N61
$$ 550129 553102 553758 553000 552197 552362 553611 555271 556412 556426 555202 552785 549068 544274 539709 537320 537881
51383E37881K064J282l40j139j386k601n096p347p896p043o209o207o743p220
$$ 537881 539945 541227 540887 539748 538362 535761 530665 523318 515422 508379 502170 495963 489220 482000
51369D82000p315o721n123k933j515j961l720n120n270m774m359l776k681j798
$$ 482000 474685 467964 462841 459908 458393 456432 452712 447592 442322 437548 433189 429413 426732 424934
51355D24934k037k788k369l90J538J980J544J752K713L071K004J96j319k345l126
$$ 424934 422897 420109 417740 417350 418888 420868 422412 424164 426877 429948 431952 432148 430829 428484 425358
51340D25358l456k933j942j724l169n679p427o952m628k553k671m892p190p736
$$ 425358 421902 418969 417027 415303 412134 406455 399028 392076 387448 384895 382224 377332 370142 362406
51326C62406o646n376m792m471l807l040k786l172l922m812n516n407m316l189
$$ 362406 355760 350384 345592 341121 337314 334274 331488 328316 324394 319582 314066 308659 304343 301154
51312C01154l125l857m071l359k830l408m403m446l241j765j106j636k957m220
$$ 301154 298029 294172 290101 286742 283912 280504 276101 271655 268414 266649 265543 263907 260950 256730
51298B56730m675m346l850l417k629j413m91l42m45k48k42j064k112k073o38J294
$$ 256730 252055 247709 243859 240442 237813 236400 235909 235567 235122 234874 234632 233568 231456 229383 228745 230039
51282B30039K867L858M200L881L317K963K624J893J102Q38P42k8j020n97J739
$$ 230039 232906 236764 240964 244845 248162 251125 253749 255642 256744 257582 258324 258296 257276 256679 258418
51267B58418M239M925L947L085L323L808L177J434J50P13K557L635K820J070j95
$$ 258418 262657 267582 271529 274614 277937 281745 284922 286356 286506 287219 289776 293411 296231 297301 297106
51252B97106j081k585m631o104o540o455o202n744n494n877o059m727k401j283
$$ 297106 296025 293440 288809 282705 276165 269710 263508 257764 252270 246393 240334 235607 233206 231923
51238B31923k277l746l940l068k101j096r8j25j735l539l785k763k118k354k481
$$ 231923 229646 225900 221960 218892 216791 215695 215597 215472 213737 210198 206413 203650 201532 199178 196697
51223A96697j833q15O4P01R76Q17O97J144J841J944J229K44m56o08r1P51R97K11
$$ 196697 194864 194049 194113 194814 195790 196607 197304 198448 200289 202233 203462 203706 203250 202642 202551 203302 204299 204510
51205B04510p16o58J65N95K83l4J27L96L82J64j66o94j306j696j811j745j351
$$ 204510 203794 203136 203301 203896 204179 204145 204272 204668 205050 205214 205048 204354 203048 201352 199541 197796 196445
51188A96445n17K88M34p1p74j455j884j297O73K753K959J048r98j358l44M09O2
$$ 196445 195928 196216 196650 196579 195805 194350 192466 191169 191842 194595 197554 198602 197604 196246 195902 196311 196373
51171A96373q05j201p66M8N78N77K73r7l84j58J072K769L375K219Q39J239L160
$$ 196373 195568 194367 193601 193649 194227 194804 195077 194980 194596 194438 195510 198279 201654 203873 204712 205951 209111
51154B09111M297L211Q49q96j155l12P34J154P84M01Q53J819K075J115k89j171
$$ 209111 213408 216619 217468 216572 215417 215105 215839 216993 217777 218178 219031 220850 222925 224040 223751 222580
51138B22580j369j195q12k22N91J662K809L447L146K246J371P39M24Q29J911K555
$$ 222580 221211 220016 219204 218982 219573 221235 224044 227491 230637 232883 234254 234993 235417 236246 238157 240712
51122B40712J841N76J78N03K34p89j465j483j562j543n00Q39K63k346m010k764
$$ 240712 242553 243129 243307 243810 244044 243255 241790 240307 238745 237202 236702 237541 237804 235458 231448 228684
51106B28684n75l08j643k307j886j822k438k596j973j483j381j022n63r56k000
$$ 228684 228109 227801 226158 223851 221965 220143 217705 215109 213136 211653 210272 209250 208687 207731 205731
51091B05731k179r21N54J044O16k49j329j984j324K66J044J38j174j191J66J706
$$ 205731 203552 202631 203185 204229 204845 204596 203267 201283 199959 200225 201269 201407 200233 199042 199208 200914
51075B00914K506K339J375K38k54o5r5q39j570j459p88m29p38j546k564l127k287
$$ 200914 203420 205759 207134 207372 207118 207053 206958 206119 204549 203090 202302 201873 201135 199589 197025 193898 191611
51058A91611q1J897K196J292P02P58L64j177l182m511m572l384j391N80J836K460
$$ 191611 191530 193427 195623 196915 197617 198375 198739 197562 194380 189869 185297 181913 180522 181102 182938 185398
51042A85398K966L391L385L090L062L236K831J590L54J5N13J214J674J712J260
$$ 185398 188364 191755 195140 198230 201292 204528 207359 208949 209303 209318 209831 211045 212719 214431 215691
51027B15691P11P94J602K171J683P38O86J872L162L289K110M14j020j858j981
$$ 215691 216402 217196 218798 220969 222652 223390 224076 225948 229110 232399 234509 234923 233903 232045 230064
51012B30064j158P62L265N026M844K907Q42J83R97K218K995L335L528L433K500
$$ 230064 228906 229668 232933 237959 242803 245710 246552 246735 247732 249950 252945 256280 259808 263241 265741
50997B65741M94j847l111k495p25P48J324J476J398N75r58j983j650q37q39j298
$$ 265741 266235 264388 261277 258782 258057 258805 260129 261605 263003 263578 262620 260637 258987 258150 257311 256013
50981B56013p74Q86K118J692Q6j360j713o90J272K874K867J516M44O80J632K300
$$ 256013 255239 256125 258243 259935 260021 258661 256948 256258 257530 260404 263271 264787 265231 265911 267543 269843
50965B69843K596K966L501L965M097L565K269R23M67O16J61r39j135L35K104K855
$$ 269843 272439 275405 278906 282871 286968 290533 292802 293725 294192 294808 294969 294030 292895 293230 295334 298189
50949B98189L364M843O483O644N679N319N555M565K131P47K249N171O887P033
$$ 298189 301553 306396 312879 319523 325202 330521 336076 340641 342772 343519 345768 350939 357826 364859
50935C64859P265Q383R493R740R506R500R764R999J0343J1185J2509J3778J4524
$$ 364859 372124 380507 390000 399740 409246 418746 428510 438509 448852 460037 472546 486324 500848
50922E00848J4836J5198J6031J7496J9594K2221K5068K7728K9986L1941L3811
$$ 500848 515684 530882 546913 564409 584003 606224 631292 659020 689006 720947 754758
50911G54758L5934L8833M2788M7124N0625N3079N5858O0239O5601P0101P3010
$$ 754758 790692 829525 872313 919437 970062 1023141 1078999 1139238 1204839 1274940 1347950
50900A347950P5445P8675Q2524Q5784Q7677Q8319Q8068Q6857Q4384Q0617P5903
$$ 1347950 1423395 1502070 1584594 1670378 1758055 1846374 1934442 2021299 2105683 2186300 2262203
50889B262203P0459O4058N6543M8414M0427L2710K4951J7467J1189O414K497p62
$$ 2262203 2332662 2396720 2453263 2501677 2542104 2574814 2599765 2617232 2628421 2634835 2637332 2636570
50877B636570k565k646k304k760l489l453l359n131r459j5239k1201k6800l1753
$$ 2636570 2634005 2631359 2629055 2626295 2622806 2619353 2615994 2610863 2601404 2586165 2564964 2538164 2506411
50864B506411l6179m1135m7520n4405o0001o4344o9272p5255q0154q1989q1288
$$ 2506411 2470232 2429097 2381577 2327172 2267171 2202827 2133555 2058300 1978146 1896157 1814869
50853A814869p9610p7186p3571o9452o5975o2794n8433n2654m7073m3072m0083
$$ 1814869 1735259 1658073 1584502 1515050 1449075 1386281 1327848 1275194 1228121 1185049 1144966
50842A144966l6511l1807k7081k3726k1796k0037j7491j4631j2593j1585j0644
$$ 1144966 1108455 1076648 1049567 1025841 1004045 984008 966517 951886 939293 927708 917064
50831I17064q803n922k594J31J141L69p32o75K13O71R49K617N720Q060Q274P877
$$ 917064 908261 902339 899745 899876 901017 901386 900654 899979 900192 900863 901812 904429 910149 918209 926483 934360
50815I34360Q958J1197J2827J3479J4261J5625J6945J8090J9744K2030K4256K6281
$$ 934360 943318 954515 967342 980821 995082 1010707 1027652 1045742 1065486 1087516 1111772 1138053
50803A138053K8994L2870L7011M0183M2322M4544M7973N2831N8463O4217P0313
$$ 1138053 1167047 1199917 1236928 1277111 1319433 1363977 1411950 1464781 1523244 1587461 1657774
50792A657774P7712Q6914R7178J07225J16415J25001J33601J42810J52840J62972
$$ 1657774 1735486 1822400 1919578 2026803 2143218 2268219 2401820 2544630 2697470 2860442
50782B860442J71754J78425J83816J89078J93732J95797J93783J87924J79248
$$ 2860442 3032196 3210621 3394437 3583515 3777247 3973044 4166827 4354751 4533999
50773D533999J68183J54326J37256J17365R5978P4706N4535L5650J8234L107q646
$$ 4533999 4702182 4856508 4993764 5111129 5207107 5281813 5336348 5371998 5390232 5393339 5384693
50762E384693j6395k0161k0472j8350j5041j1323p333l414p78r92n128j3702k6695
$$ 5384693 5368298 5348137 5327665 5309315 5294274 5282951 5275618 5272204 5271426 5270434 5265306 5251604 5224909
50749E224909m3062o0799p8337r5662j13424j31275j47784j61609j72015j78547
$$ 5224909 5181847 5121048 5042711 4947049 4833625 4702350 4554566 4392957 4220942 4042395
50739D042395j81146j80520j77458j71827j63095j51897j40090j28864j17718
$$ 4042395 3861249 3680729 3503271 3331444 3168349 3016452 2876362 2747498 2629780
50730B629780j05756r3281q1435p0671o0512n0659m1609l3864k6975k0071j3156
$$ 2629780 2524024 2430743 2349308 2278637 2218125 2167466 2125857 2091993 2065018 2044947 2031791
50719B031791p433l977k491j809j334j487k707m747p070r455j1919j4347j6487
$$ 2031791 2024358 2020381 2017890 2016081 2014747 2013260 2010553 2005806 1998736 1989281 1977362 1963015 1946528
50706A946528j8077j9080j9919k1297k3258k4749k4855k4165k3910k3876k2601
$$ 1946528 1928451 1909371 1889452 1868155 1844897 1820148 1795293 1771128 1747218 1723342 1700741
50695A700741j9735j6737j4689j2850j0261p351m814k091J578N541Q567J0737
$$ 1700741 1681006 1664269 1649580 1636730 1626469 1619118 1614304 1612213 1613791 1619332 1627899 1638636
50683A638636J3133J6142J9382K2897K7078L1570L5596L9273M3533M8932N5438
$$ 1638636 1651769 1667911 1687293 1710190 1737268 1768838 1804434 1843707 1887240 1936172 1991610
50672A991610O3108P1751Q0248Q7416R3512R9685J06055J11511J15272J17388
$$ 1991610 2054718 2126469 2206717 2294133 2387645 2487330 2593385 2704896 2820168 2937556
50662B937556J17697J15647J11366J05717R8931R0235P9223O6606N3214L9134
$$ 2937556 3055253 3170900 3282266 3387983 3486914 3577149 3656372 3722978 3776192 3815326
50652C815326K4264R040n654j8767k9264l6740m1754m4867m5506m2710l6822k9416
$$ 3815326 3839590 3848630 3842976 3824209 3794945 3758205 3716451 3671584 3626078 3583368 3546546 3517130
50640C517130k1743j4428q598n698n915q105j1740j7646k6341l6854m7904n9115
$$ 3517130 3495387 3480959 3472361 3466663 3460748 3452643 3440903 3423257 3396916 3360062 3312158 3253043
50628C253043p0263q0301q8021r3127r6024r7028r6138r3081q7341p8964o9402
$$ 3253043 3182780 3102479 3014458 2921331 2825307 2728279 2632141 2539060 2451719 2372755 2303353
50617B303353o0560n2697m4378l4823k5091j6309q069N10R193J7271K4945L2998
$$ 2303353 2242793 2190096 2145718 2110895 2085804 2069495 2061426 2061936 2071129 2088400 2113345 2146343
50605B146343M1572N0036N7542O3001O5381O4894O3219O1588N9316N5241M9867
$$ 2146343 2187915 2237951 2295493 2358494 2423875 2488769 2551988 2613576 2672892 2728133 2778000
50594B778000M4938M1272L8395L5950L4159L2928L1702L0512K9977L0106L0060
$$ 2778000 2822938 2864210 2902605 2938555 2972714 3005642 3037344 3067856 3097833 3127939 3157999
50583C157999K9498K9247L0002L1128L1597L1720L3127L6810M1743M5786M7752
$$ 3157999 3187497 3216744 3246746 3277874 3309471 3341191 3374318 3411128 3452871 3498657 3546409
50572C546409M8310M8879M9972N0757N0009M7196M2772L7662L2372K6452J9129
$$ 3546409 3594719 3643598 3693570 3744327 3794336 3841532 3884304 3921966 3954338 3980790 3999919
50561C999919J0642K559l723q382j2448j6115j8674j9845j9961j8884j5880j0952
$$ 3999919 4010561 4013120 4009397 4001015 3988567 3972452 3953778 3933933 3913972 3895088 3879208 3868256
50549C868256n339k95L777O768Q465R092R192Q389N290o15p887j4875k1842l0506
$$ 3868256 3862917 3862622 3866399 3873167 3881632 3890724 3899916 3908305 3913595 3912980 3905093 3890218 3868376 3837870
50535C837870m1940n5552o9570q1892r1153r7684j02972j07602j10549j10965
$$ 3837870 3795930 3740378 3670808 3588916 3497763 3400079 3297107 3189505 3078956 2967991
50525B967991j09675j07911j05492j01392r5503q8659q1500p4381o7959o2560
$$ 2967991 2858316 2750405 2644913 2543521 2448018 2359359 2277859 2203478 2135519 2072959
50515B072959n7485n2002m6584m1803l6757l0268k3320j8198j5161j1950p159
$$ 2072959 2015474 1963472 1916888 1875085 1838328 1808060 1784740 1766542 1751381 1739431 1732272
50504A732272k039J945N449R783J4504J8343K1608K5825L1214L6246L9934M3267
$$ 1732272 1730233 1732178 1737627 1747410 1761914 1780257 1801865 1827690 1858904 1895150 1935084 1978351
50492A978351M7768N3511N9149O3527O6764O9960P4086P9058Q3735Q6971Q8682
$$ 1978351 2026119 2079630 2138779 2202306 2269070 2339030 2413116 2492174 2575909 2662880 2751562
50481B751562Q9698R0574R0878Q9885Q7686Q5338Q3874Q3517Q3864Q4808Q6921
$$ 2751562 2841260 2931834 3022712 3112597 3200283 3285621 3369495 3453012 3536876 3621684 3708605
50470C708605R0822R6104J01214J04787J07133J10054J14924J21371J28192J35073
$$ 3708605 3799427 3895531 3996745 4101532 4208665 4318719 4433643 4555014 4683206 4818279
50460D818279J42395J49483J54379J55956J55343J54288J52651J48586J40649
$$ 4818279 4960674 5110157 5264536 5420492 5575835 5730123 5882774 6031360 6172009
50451F172009J28809J13621R5659P5672N4136L0668N057k1157m5562o7515q8284
$$ 6172009 6300818 6414439 6510098 6585770 6639906 6670574 6675631 6654474 6608912 6541397 6453113
50440F453113j07994j24280j35073j41120j44122j43716j38275j27933j14670
$$ 6453113 6345119 6220839 6085766 5944646 5800524 5656808 5518533 5390600 5275930
50431E275930r9569q2050o2200m2011k3676p877N517J6118K3006K5189K1631J1688
$$ 5275930 5176361 5094311 5032111 4990100 4966424 4958547 4964064 4980182 5003188 5028377 5050008 5061696
50419E061696l746k2493m3030o5492r0010j14868j37236j55250j68382j76321
$$ 5061696 5057950 5035457 4992427 4926935 4836925 4722057 4584821 4429571 4261189 4084868
50409D084868j78764j76428j71212j64863j58026j50718j43051j35051j26260
$$ 4084868 3906104 3729676 3558464 3393601 3235575 3084857 2941806 2806755 2680495
50400B680495j16189j05118r4171q4481p6390o9268o2048n4159m6162l9324l4226
$$ 2680495 2564306 2459188 2365017 2280536 2204146 2134878 2072830 2018671 1972509 1933185 1898959
50389A898959l0048k5484k0193j4817r779m810J40M364P337R641J2239J5172J7825
$$ 1898959 1868911 1843427 1823234 1808417 1798638 1793828 1793968 1798332 1805669 1815310 1827549 1842721 1860546
50376A860546K0238K3240K7082L0813L3465L5211L6895L8810M0599M2093M3607
$$ 1860546 1880784 1904024 1931106 1961919 1995384 2030595 2067490 2106300 2146899 2188992 2232599
50365B232599M5215M6213M5837M4551M4077M5678M8691N1391N3178N4957N7160
$$ 2232599 2277814 2324027 2369864 2414415 2458492 2504170 2552861 2604252 2657430 2712387 2769547
50354B769547N8714N8815N8675O0148O3373O7099P0710P4291P7144P8378P8967
$$ 2769547 2828261 2887076 2945751 3005899 3069272 3136371 3207081 3281372 3358516 3436894 3515861
50343C515861Q1044Q4514Q6307Q4039P8722P2690O6526N9373N0915M1393L0622
$$ 3515861 3596905 3681419 3767726 3851765 3930487 4003177 4069703 4129076 4179991 4221384 4252006
50332D252006J8524N804p276k1858l8775n6624p3092q7377r9714j09415j15504
$$ 4252006 4270530 4276334 4269058 4247200 4208425 4151801 4078709 3991332 3891618 3782203 3666699
50321C666699j18703j20444j20115j15670j07236r7617q8545p8618o6174n2183
$$ 3666699 3547996 3427552 3307437 3191767 3084531 2986914 2898369 2819751 2753577 2701394
50311B701394l8806k6651j5175m815L134Q287J1236J1990R809M644k408j0407
$$ 2701394 2662588 2635937 2620762 2615947 2619081 2627368 2638604 2650594 2660403 2665047 2662639 2652232
50299B652232j9529l0209m1853n2841o1708o8025p2166p4395p4554p2806p0284
$$ 2652232 2632703 2602494 2560641 2507800 2446092 2378067 2305901 2231506 2156952 2084146 2013862
50288B013862o8361o7139o5297o1712n6845n2155m8447m5272m1741l7554l3068
$$ 2013862 1945501 1878362 1813065 1751353 1694508 1642353 1593906 1548634 1506893 1469339 1436271
50277A436271k8759k4833k1416j8755j6882j5204j2935j0062p362n204k953o4
$$ 1436271 1407512 1382679 1361263 1342508 1325626 1310422 1297487 1287425 1280063 1274859 1271906 1271842
50265A271842K848M823O120P978J0850J3684J5189J5259J4966J5591J7629K0372
$$ 1271842 1274690 1279513 1285633 1293611 1304461 1318145 1333334 1348593 1363559 1379150 1396779 1417151
50253A417151K2524K3584K4360K5654K6961K7323K6997K7065K7552K7389K6395
$$ 1417151 1439675 1463259 1487619 1513273 1540234 1567557 1594554 1621619 1649171 1676560 1702955
50242A702955K5858K6526K7257K6647K4952K3345K1902J9567J5814J1345P128
$$ 1702955 1728813 1755339 1782596 1809243 1834195 1857540 1879442 1899009 1914823 1926168 1933296
50231A933296L533M48k310m863p172r066j0609j2315j4751j7944k1342k4212k6035
$$ 1933296 1936829 1937277 1934967 1930104 1922932 1913866 1903257 1890942 1876191 1858247 1836905 1812693 1786658
50218A786658k6805k7238k8129k9224k9276k7735k6010k6099k8122k9962k9667
$$ 1786658 1759853 1732615 1704486 1675262 1645986 1618251 1592241 1566142 1538020 1508058 1478391
50207A478391k7458k5111k3876k3605k3491k2892k1330j8459j4531j0598p748
$$ 1478391 1450933 1425822 1401946 1378341 1354850 1331958 1310628 1292169 1277638 1267040 1259292
50196A259292o037m584k783r82J87Q24J537K415K774K121J004M82Q13J119N11
$$ 1259292 1253255 1248671 1245888 1244906 1245093 1245917 1247454 1249869 1252643 1254764 1255768 1256250 1257063 1258182 1258693
50181A258693p48j625j714j731k442l618m514n006n564o377p177p893q701r394
$$ 1258693 1257945 1256320 1254606 1252875 1250433 1246815 1242301 1237295 1231731 1225354 1218177 1210284 1201583 1192189
50167A192189r456q916q425q214p711o491n000l986l732m058m428l878j848P62
$$ 1192189 1182733 1173817 1165392 1157178 1149467 1142976 1137976 1133990 1130258 1126200 1121772 1117894 1116046 1116808
50153A116808K263K268K124K790L564L584L301L457L699L354K663K083J238k95
$$ 1116808 1119071 1121339 1123463 1126253 1129817 1133401 1136702 1140159 1143858 1147212 1149875 1151958 1153196 1152901
50139A152901k015l426m948o723p720p542p749r533j1368j1250j0194j0669j2296
$$ 1152901 1150886 1147460 1142512 1135789 1128069 1120527 1112778 1103245 1091877 1080627 1070433 1059764 1047468
50126A047468j2332j0382r248j0433j1882j1544j0329r881r736q656p073o269
$$ 1047468 1035136 1024754 1015506 1005073 993191 981647 971318 961437 951701 943045 935972 929703
50114I29703o314o449o485o565o513o515p252q329p953n362k229k64R81K338K701
$$ 929703 923389 916940 910455 903890 897377 890862 883610 875281 867328 861966 859737 859473 860454 862792 865493
50099H65493O61k628m665n082n630p054q271q768r463j0581j0651q606n580l516
$$ 865493 866154 863526 858861 853779 848149 841095 832824 824056 814593 804012 793361 784755 779175 775659
50085G75659k946l115l548m395n420n639m394k356r32n78l06P37J738J279l79
$$ 775659 772713 769598 766050 761655 756235 750596 746202 743846 742914 742336 742030 742767 744505 745784 745405
50070G45405j274k13J932L789M975N467M906L725L707O006R268J1082J0848J0015
$$ 745405 744131 743918 745850 749639 754614 760081 764987 768712 772419 778425 787693 798775 809623 819638
50056H19638R941J0634J1263J0944R436P765P569Q956R873Q846P268P391Q764
$$ 819638 829579 840213 851476 862420 871856 879621 887190 896146 906019 914865 922133 929524 938288
50043I38288Q799O656M372L762M134L952L276L336M490N706N890N134M567N192
$$ 938288 947087 953743 958115 961877 966011 969963 973239 976575 981065 986771 992661 997795 1002362 1007554
50029A007554O976R108J1054J2751J3769J3351J1819J0825J1344J2405J2850J3113
$$ 1007554 1014530 1023638 1034692 1047443 1061212 1074563 1086382 1097207 1108551 1120956 1133806 1146919
50017A146919J3912J4447J3770J3076J4314J6988J8730J8889J9103K0194K1123
$$ 1146919 1160831 1175278 1189048 1202124 1216438 1233426 1252156 1271045 1290148 1310342 1331465
50006A331465K1614K3119K6048K8411K8762K8513K9531L1171L1693L1259L1422
$$ 1331465 1353079 1376198 1402246 1430657 1459419 1487932 1517463 1548634 1580327 1611586 1643008
49995A643008L2519L3681L4878L6938L9677M1905M3393M5246M8008N0894N3258
$$ 1643008 1675527 1709208 1744086 1781024 1820701 1862606 1905999 1951245 1999253 2050147 2103405
49984B103405N5622N8586O1660O3940O5350O6550O7800O8250O6288O0674N1738
$$ 2103405 2159027 2217613 2279273 2343213 2408563 2475113 2542913 2611163 2677451 2738125 2789863
49973B789863M1477L2003K3867J6252Q865K950P1K30J610K108P91k041n815j0558
$$ 2789863 2831340 2863343 2887210 2903462 2912327 2915277 2915348 2915578 2917188 2919296 2920087 2918046 2912231 2901673
49959B901673j6933k5596l6363m7855n8092o5840p1321p5351p7755p7469p4347
$$ 2901673 2884740 2859144 2822781 2774926 2716834 2650994 2579673 2504322 2426567 2349098 2274751
49948B274751p0029o6212o2764n8511n3394m8541m4401m0310l6158l3107l1930
$$ 2274751 2204722 2138510 2075746 2017235 1963841 1915300 1870899 1830589 1794431 1761324 1729394
49937A729394l1838l1726l1594l1778l1770l0956k9849k9293k8850k7331k4809
$$ 1729394 1697556 1665830 1634236 1602458 1570688 1539732 1509883 1480590 1451740 1424409 1399600
49926A399600k2808k2328k2815k3300k3546k3597k3129k1912k0257j8559j6788
$$ 1399600 1376792 1354464 1331649 1308349 1284803 1261206 1238077 1216165 1195908 1177349 1160561
49915A160561j4899j3173j1659r851p492n306m130l657k756r93Q71J917J891J074
$$ 1160561 1145662 1132489 1120830 1110979 1103487 1098181 1094051 1090394 1087638 1086645 1087516 1089433 1091324 1092398
49901A092398R8m4J276L182L800K523J070J405L258M771N123N220N873O778P689
$$ 1092398 1092496 1092452 1093728 1096910 1100710 1103233 1104303 1105708 1108966 1113737 1118860 1124080 1129953 1136731 1144420
49886A144420R213J1670J4066J5230J5376J5690J6757J8364K0493K3649K8095
$$ 1144420 1153633 1165303 1179369 1194599 1209975 1225665 1242422 1260786 1281279 1304928 1333023
49875A333023L3362L8492M2534M5192M7462N1198N7357O5093P3048Q1033Q9455
$$ 1333023 1366385 1404877 1447411 1492603 1540065 1591263 1648620 1713713 1786761 1867794 1957249
49864A957249R7766J04769J10287J15146J19172J20487J17263J09504R8874Q7755
$$ 1957249 2055015 2159784 2270071 2385217 2504389 2624876 2742139 2851643 2950517 3038272
49854C038272P8504P2263O7877O3038N7225N2347M9713M7550M2913L5000K4800
$$ 3038272 3116776 3189039 3256916 3319954 3377179 3429526 3479239 3526789 3569702 3604702 3629502
49843C629502J2174m388k4613m5045o2111p5470q7115r7948j06804j12684j16357
$$ 3629502 3641676 3637288 3612675 3567630 3505519 3430049 3342934 3244986 3138182 3025498 2909141
$$ [...]
##END NTUPLES=NMR SPECTRUM
##END=
