##TITLE=NES1000_872015067_9224993_pcruELpAMf
##JCAMPDX= 6.0         $$ Bruker NMR JCAMP-DX V2.0
##DATA TYPE= NMR SPECTRUM
##DATA CLASS= NTUPLES
##ORIGIN= BRUKER
##OWNER= Administrator
$$ 1.72 TOPSPIN		Version 2.1
$$ 2015-06-17 14:58:52.894 -0700  Administrator@X
$$ Compression mode = diff/dup
##.OBSERVE FREQUENCY= 400.02188249412
##.OBSERVE NUCLEUS= ^1H
##.ACQUISITION MODE= SIMULTANEOUS (DQD)
##.ACQUISITION SCHEME= undefined
##.AVERAGES= 8
##.DIGITISER RES= 22
##SPECTROMETER/DATA SYSTEM= spect
##.PULSE SEQUENCE= zg30
##.SOLVENT NAME= COFFEE_meoh
##.SHIFT REFERENCE= INTERNAL, COFFEE_meoh, 1, 14.98509
##AUDIT TRAIL= $$ (NUMBER, WHEN, WHO, WHERE, PROCESS, VERSION, WHAT)
$$ ##TITLE= Audit trail, TOPSPIN		Version 2.1
$$ ##JCAMPDX= 5.01
$$ ##ORIGIN= Bruker BioSpin GmbH
$$ ##OWNER= Administrator
$$ $$ E:\/data/COFFEE/nmr/NES1000_872015067_9224993_pcruELpAMf/10/pdata/1/auditp.txt
$$ ##AUDIT TRAIL=  $$ (NUMBER, WHEN, WHO, WHERE, PROCESS, VERSION, WHAT)
(   1,<2015-06-17 14:58:45.675 -0700>,<Administrator>,<X>,<go>,<TOPSPIN 2.1>,
      <created by zg
	started at 2015-06-17 14:57:39.659 -0700,
	POWCHK enabled, PULCHK disabled,
       configuration hash MD5:
       21 0F 79 D6 B3 7B B4 F6 88 20 88 DB 03 48 BD 9F
       data hash MD5: 64K
       4F 3F AF 14 77 DC 41 86 84 D3 6A 49 01 8E 77 42>)
(   2,<2015-06-17 14:58:48.831 -0700>,<Administrator>,<X>,<proc1d>,<TOPSPIN 2.1>,
      <Start of raw data processing
       efp LB = 0 FT_mod = 6 PKNL = 1 PHC0 = 0 PHC1 = 0 SI = 32K 
       data hash MD5: 32K
       5D 16 53 57 92 BF 83 2E 8A 0E DB C0 42 86 57 45>)
(   3,<2015-06-17 14:58:49.097 -0700>,<Administrator>,<X>,<proc1d>,<TOPSPIN 2.1>,
      <pk PHC0 = 89.32434 PHC1 = 0 
       data hash MD5: 32K
       1F 33 17 F6 01 76 B7 5F 84 B4 2B F1 5A E6 23 D6>)
(   4,<2015-06-17 14:58:49.222 -0700>,<Administrator>,<X>,<proc1d>,<TOPSPIN 2.1>,
      <abs ABSG = 1 
       data hash MD5: 32K
       3A A4 21 F2 01 F5 EE 44 21 FF 29 A3 82 E7 49 19>)
(   5,<2015-06-17 14:58:49.284 -0700>,<Administrator>,<X>,<proc1d>,<TOPSPIN 2.1>,
      <abs ABSG = 2 
       data hash MD5: 32K
       6F 13 79 80 8B 4D 74 07 F6 59 AD 68 98 CF EA 54>)
(   6,<2015-06-17 14:58:49.331 -0700>,<Administrator>,<X>,<proc1d>,<TOPSPIN 2.1>,
      <abs ABSG = 3 
       data hash MD5: 32K
       20 E8 56 73 F3 CA 9A 1A C7 2D BF DD 97 00 6A 08>)
(   7,<2015-06-17 14:58:49.394 -0700>,<Administrator>,<X>,<proc1d>,<TOPSPIN 2.1>,
      <abs ABSG = 4 
       data hash MD5: 32K
       05 86 28 E7 A3 05 37 17 0D 1C 33 91 84 AD E2 E2>)
(   8,<2015-06-17 14:58:49.456 -0700>,<Administrator>,<X>,<proc1d>,<TOPSPIN 2.1>,
      <abs ABSG = 5 
       data hash MD5: 32K
       66 B6 19 50 A2 6F F7 83 E4 13 07 D6 2E D1 BC 6A>)
$$ ##END=
$$ 
$$ $$ hash MD5
$$ $$ 6A 45 49 B8 E6 A3 C6 08 3C 33 A8 4F 5E 10 6B 12
##$RELAX= 
##$RELAX= 
##$RELAX= 
##$RELAX= 
##$RELAX= 
##$RELAX= 
##$RELAX= 
$$ Bruker specific parameters
$$ --------------------------
##$DU= <E:\>
##$EXPNO= 10
##$NAME= <NES1000_872015067_9224993_pcruELpAMf>
$$ [...]
150 150 150 150 150 150 150 150
##$TP07= 0
##$TPNAME0= <>
##$TPNAME1= <>
##$TPNAME2= <>
##$TPNAME3= <>
##$TPNAME4= <>
##$TPNAME5= <>
##$TPNAME6= <>
##$TPNAME7= <>
##$TPOAL= (0..7)
0.5 0.5 0.5 0.5 0.5 0.5 0.5 0.5
##$TPOFFS= (0..7)
0 0 0 0 0 0 0 0
##$TUNHIN= 0
##$TUNHOUT= 0
##$TUNXOUT= 0
##$USERA1= <user>
##$USERA2= <user>
##$USERA3= <user>
##$USERA4= <user>
##$USERA5= <user>
##$V9= 5
##$VALIST= <valist>
##$VCLIST= <CCCCCCCCCCCCCCC>
##$VD= 0
##$VDLIST= <DDDDDDDDDDDDDDD>
##$VPLIST= <PPPPPPPPPPPPPPP>
##$VTLIST= <TTTTTTTTTTTTTTT>
##$WBST= 2048
##$WBSW= 25
##$XGAIN= (0..3)
0 0 0 0
##$XL= 0
##$YL= 0
##$YMAX_a= 584536
##$YMIN_a= -492248
##$ZGOPTNS= <>
##$ZL1= 120
##$ZL2= 120
##$ZL3= 120
##$ZL4= 120
##$ABSF1= 14.98509
##$ABSF2= -5.573092
##$ABSG= 5
##$ABSL= 3
##$ALPHA= 0
##$AQORDER= 0
##$ASSFAC= 0
##$ASSFACI= 0
##$ASSFACX= 0
##$ASSWID= 0
##$AUNMP= <proc_prof1d_extract_pilot.lims>
##$AXLEFT= 0
##$AXNAME= <>
##$AXNUC= <1H>
##$AXRIGHT= 0
##$AXTYPE= 0
##$AXUNIT= <>
##$AZFE= 0.1
##$AZFW= 0.1
##$BCFW= 0
##$BC_mod= 0
##$BYTORDP= 0
##$COROFFS= 0
##$CY= 15
##$DATMOD= 1
##$DC= 0
##$DFILT= <>
##$DTYPP= 0
##$F1P= 0
##$F2P= 0
##$FCOR= 0.5
##$FTSIZE= 32768
##$FT_mod= 6
##$GAMMA= 0
##$GB= 0
##$INTBC= 1
##$INTSCL= 1
##$ISEN= 128
##$LB= 0
##$LEV0= 0
##$LPBIN= 0
##$MAXI= 10000
##$MC2= 0
##$MEAN= 0
##$ME_mod= 0
##$MI= 0
##$NCOEF= 0
##$NC_proc= -8
##$NLEV= 6
##$NOISF1= 0
##$NOISF2= 0
##$NSP= 0
##$NTH_PI= 0
##$NZP= 0
##$OFFSET= 14.98509
##$PC= 1
##$PHC0= 89.32434
##$PHC1= 0
##$PH_mod= 1
##$PKNL= yes
##$PPARMOD= 0
##$PPDIAG= 0
##$PPIPTYP= 0
##$PPMPNUM= 2147483647
##$PPRESOL= 1
##$PSCAL= 4
##$PSIGN= 0
##$PYNMP= <proc.py>
##$REVERSE= no
##$SF= 400.02
##$SI= 32768
##$SIGF1= 0
##$SIGF2= 0
##$SINO= 400
##$SIOLD= 32768
##$SPECTYP= <>
##$SREGLST= <1H.CDCl3>
##$SSB= 0
##$STSI= 32768
##$STSR= 0
##$SW_p= 8223.68421052631
##$SYMM= 0
##$S_DEV= 0
##$TDeff= 65536
##$TDoff= 0
##$TI= <>
##$TILT= no
##$TM1= 0
##$TM2= 0
##$TOPLEV= 0
##$USERP1= <user>
##$USERP2= <user>
##$USERP3= <user>
##$USERP4= <user>
##$USERP5= <user>
##$WDW= 1
##$XDIM= 32768
##$YMAX_p= 415275513
##$YMIN_p= -773735
##$CURPLOT= <Network HP LaserJet P1505>
##$CURPRIN= <$Network HP LaserJet P1505>
##$DFORMAT= <normdp>
##$LAYOUT= <+/1D_H.xwp>
##$LFORMAT= <normlp>
##$PFORMAT= <normpl>
##$SURQMSG= 1
$$ End of Bruker specific parameters
$$ ---------------------------------
##NTUPLES= NMR SPECTRUM
##VAR_NAME=  FREQUENCY,     SPECTRUM/REAL,   SPECTRUM/IMAG
##SYMBOL=    X,             R,               I
##VAR_TYPE=  INDEPENDENT,   DEPENDENT,       DEPENDENT
##VAR_FORM=  AFFN,          ASDF,            ASDF
##VAR_DIM=   32768,         32768,           32768
##UNITS=     HZ,            ARBITRARY UNITS, ARBITRARY UNITS
##FACTOR=    0.250966925370066, 1,           1
##FIRST=     8223.43324360094, -130880,      -41788
##LAST=      0,             -139912,         -196398
##MIN=       0,             -773735,         0
##MAX=       8223.43324360094, 415275513,    0
$$ Real data points
##PAGE= N=1
##DATA TABLE= (X++(R..R)), XYDATA
$$ [...]
23766 -292463 -129944 208416 39759 10904 36580 -292094 346705 -13768 45569 -47026 270075
23754 -103194 107747 -221260 -23595 -258376 112016 77574 -114616 226859 63091 -47055
23743 102576 37878 68053 279484 -312227 116565 3252 78912 -71719 -121703 -70946 -125969
23732 -125969 47655 -8528 212821 -495839 -132039 -25847 180644 15273 -332237 -288872 -72098
23720 -330845 92954 166635 36073 -128296 265124 -194332 -3188 36274 -9367 -116224 55984
23708 299073 85261 170035 -365710 -300101 90543 320064 -42310 -68676 147332 -45173 -328441
23697 -328441 -98666 151680 -229974 34260 107567 -235351 166142 -52818 437115 77458
23686 -112960 128313 60700 -127455 -161687 63447 -61045 155630 -87534 227455 133547 -139754
23674 -73665 -151227 46345 -347546 117355 -64 134622 169773 110286 119777 -52077 193850 -95744
23661 -59657 319523 166766 -112699 -356437 -121443 -258512 -213605 -22113 -197753 102389
23650 83203 -233745 -158996 232940 71015 -109265 -238164 -937 -35247 133423 26295 -79262
23638 -113718 15896 -163350 -314876 -11901 -213128 74857 79396 142122 -149546 -250978 46824
23626 -102779 -72445 -75458 65887 -85217 -120466 -50261 170973 169560 -37880 -256910 -169435
23615 -169435 -159459 77604 219649 86763 -185484 6748 -168769 -66195 -84712 76892 -12875
23603 -13368 -10541 92569 2919 -221120 53975 24776 -44885 -98481 -35147 -133717 -37131 125020
23590 -97726 -126392 -67274 111600 -64874 300714 97078 254901 13828 190853 36338 -54011
23578 -1333 375516 283145 -68893 168456 392558 62561 65894 23652 -472639 -357156 53627
23566 144823 75258 -94275 41240 31134 -157584 -21883 30815 -110468 -65466 365300 202351
23555 202351 160526 -88854 -60892 6626 29780 50661 -16399 52212 -218013 -323288 35534
23543 227889 -265009 84247 -167999 -150095 6137 153208 -119010 -246764 -61065 -10919 -240365
23532 -240365 321508 174936 130824 -169886 57714 -78289 134789 -34539 -268794 -132972
23521 -39080 134989 136928 340134 -321463 -265228 -59901 147061 46527 59102 4987 152534
23510 152534 240284 42630 42936 8339 49953 -129741 -36216 123918 223052 82148 178274 -117005
23497 137492 -251173 100040 -15282 -90160 -72585 -73596 -12674 -53972 -4190 -349335 186465
23485 -56380 108568 80718 -107035 -18413 -53273 19523 -3739 189573 59501 88922 108550
23474 108550 -213430 115198 -132846 -15259 -106156 -69018 103007 -41869 -106769 113346
23463 162027 37571 -183587 163358 6989 -57067 189711 -362870 2318 -185601 -82692 -224165
23452 -224165 -234500 -67238 -23282 110397 -142549 -427853 -9636 35092 175530 -128423 110579
23440 200381 -130880 -122152 -64469 107260 4383 -156567 -38566 65959 -129358 55798 380116
23429 380116 -93951 -209670 -317285 -168691 41377 40586 -87674 81221 -29172 37144 123028
23418 123028 -107521 -427637 225890 108657 -202666 -82576 -51403 324503 146308 101485
23408 101485 -31749 -192971 124875 -7888 -166473 -76413 6128 -133657 -190197 37632 298098
23397 298098 101657 -205214 -643 90213 37365 -117671 350321 1999 72461 -111474 5052
23385 52703 -173381 -426226 -144709 140526 -327207 -92292 -164005 -204068 136547 147411
23375 147411 -106895 -128549 79363 -102846 185533 184004 -187999 -67291 -260322 -29005 -65988
23364 -65988 -31523 78090 -351024 135002 203652 -211600 -298888 -455625 16954 229088 339047
23353 339047 162267 -223419 93635 -26147 -178677 31360 177253 35130 -269090 33852
23342 -88274 175261 -380262 114753 -18305 -64747 208044 -27131 -177211 22496 -349783
23331 27643 -67131 79279 -221991 -173567 145347 -164111 -213760 -187714 165105 -85948 -422797
23320 -422797 40843 192878 193680 -109746 -295579 -139306 -228316 54915 -225215 259354 -173150
23308 -80227 -253928 198902 118483 -65530 -13221 73134 -98419 -216943 136846 127717 -385283
23296 -145890 -254704 -70265 11307 -270685 49425 -241918 79387 196370 127116 134318 44267
23284 93143 -346852 -258249 -30487 245610 23513 -132542 293523 -66202 265526 33443 358875
23273 358875 149582 -81202 -121249 -14402 -90813 81033 -45728 62392 -292991 -98500 -177896
23262 -177896 -71245 -52832 -97995 -117980 -110692 21547 52140 -51883 -23324 -38349 59869 111337
23250 111337 -116286 -172448 -106026 -95829 11507 37345 -58735 -30024 6305 57040 42039
23239 42039 -92133 -17943 -493609 121123 139301 77985 8123 333209 504164 102566 27708
23227 -75436 382536 -90165 132151 -165494 388461 -176657 -36935 162053 -272728 -3482
23216 -148470 -46830 -327565 -73682 -82280 -223423 -60000 -130945 92588 90753 57947 120526
23205 120526 -314976 330065 -141146 66627 125235 59500 144674 324963 113462 278065
23195 278065 -1533 108821 -1209 22334 -47041 -361970 144471 137125 -180136 -189278 -101200
23184 -101200 105359 -218578 -45585 -26810 -205176 -72426 197723 63680 -60754 -279823
23174 -279823 -133891 -16339 107271 -13496 26896 -131082 263066 166486 -163206 -203580
23164 -203580 -211316 179619 100892 -270423 -98193 -242149 -137109 76452 -49317 -181553 270468
23152 -434922 65104 138529 15172 -155489 -279609 -259934 30197 140492 42828 -46781 106245
23140 -207629 86773 162714 -55778 -120170 130578 -56074 184122 20007 113498 -12459 -7212
23129 -7212 -310850 41617 189074 -110189 -33615 -59549 -258595 48745 2336 -53575 132641
23117 26356 -145428 188160 -176036 -113220 300891 -171974 184092 219900 98643 31985
23106 152093 227514 -124167 -89295 194779 -159166 355371 273273 282719 32498 -169910 93227
23094 48358 -25284 -93271 161156 142406 -319063 81273 84536 -214119 138788 -228368 317964
23082 105418 378312 152732 342464 8978 112848 339369 8561 19210 -46531 179552 216616
23071 216616 15197 -78538 2282 83725 124234 -193607 -27560 46333 82612 289896 216796
23060 216796 183387 -332399 241996 -282583 -92273 -104377 274225 -258217 12871 41799
23050 41799 192397 54211 313470 69763 58469 82452 283347 -59519 21696 -314492 -175961
23039 -175961 -72923 -26957 -223819 28030 -162464 171108 -218999 -54057 120890 161973
23029 161973 -56543 165087 80259 85022 272285 45126 1887 -379496 -10915 74847 62995
23018 62995 -74626 -24787 11108 133690 144679 33224 58632 218131 102471 11192 92941
23007 92941 -214508 -162095 114543 44057 -272490 -333097 -20394 -245581 -9599 -10671 5806
22995 -202184 -50500 -67746 -45526 6581 -328546 -155370 -271096 77136 -27221 -114783 13133
22983 -226385 -69613 6185 118671 -203215 198520 -2264 -242273 -211170 -17338 367412 194718
22972 194718 -237075 398593 192999 -58006 -44503 -178575 -44155 90678 18529 127962
22962 127962 -77407 -112410 -111702 -37387 -178136 26716 -44683 -109338 79821 -140734 1589 -43875
22949 -49159 340458 154825 -172033 57360 116331 -164801 6506 386936 91466 -66578 100859
22937 -231377 -143608 -271127 -57082 -58136 18976 -112142 -59668 136204 42706 44002 -165283
22925 1850 -264566 -269328 -50612 50314 -192090 7176 68523 5925 145277 -20350 -61498 15933
22912 -110986 104043 312791 -209952 85207 40197 29968 142284 -170837 -172231 -152746 -125574
22901 -125574 -196965 88130 -116041 -231865 122445 -119354 -58810 80641 -149932 -261078
22891 -261078 80659 -138527 -118261 155164 -331102 -37673 273717 130116 16824 -112438
22880 -53224 -129234 -54227 56109 102914 -143270 77665 111931 97833 -220647 264630 -16473
22868 -69548 -197297 215262 -194210 -239855 -152389 -175834 -198482 -105984 -11137 -314030 -283779
22857 -283779 -183136 85875 -18914 -182240 188547 -210738 -376550 96047 -25611 -49931
22847 -49931 -218829 15334 290553 135688 115218 -80805 -2855 -348070 -132941 -14506 -346931
22836 -346931 140901 -351307 145303 -349333 -196259 1788 161845 73633 -238653 -390945
22826 -390945 -113757 63511 44592 -268539 6797 -98129 68043 20426 -61287 200024 -308233
22814 -373050 188849 157794 210774 133297 -186180 -325597 -121599 17830 -137247 149034
22803 -185258 -151961 -169451 230976 -35653 201692 209663 -264150 55718 -123206 182910 -142593
22791 115514 -173635 -235960 54852 -73245 -315732 126851 -17163 -103356 154735 220678 -132635
22779 -115581 -179731 -8926 -73384 -16944 -259771 -192450 -55257 457993 -419122 -196331 -170244
22768 -170244 317880 116937 -57690 -138332 -289128 -41960 -119794 -356743 -63547 141500
22757 197289 188726 -207876 -26201 52608 -281465 -341477 163892 -138796 -19528 96127 120698
22746 120698 147746 -141837 -29814 -199847 -125979 -77851 106749 138685 -268115 -297546 -179769
22735 -179769 -116425 225162 165917 -252859 93383 207480 460146 67528 2874 50020 -229162
22723 -152266 217140 146336 -13380 -57633 -158250 -98653 10506 -76937 -196880 362818 81509
22711 -33685 181545 -50575 46590 245728 60411 41247 -164422 119825 6179 -40680 -106758
22700 -106758 321092 163319 72002 99266 -65340 -64902 -250548 -129136 119513 -119862 -128091
22689 -128091 222910 1578 -340993 50332 88685 -87558 117373 -38945 47229 152223 27599
22677 108023 -530938 -298476 -241542 -216365 -240194 129855 -86107 111892 -154001 36129
22666 5344 -220011 158975 90395 284781 -223140 -116520 116719 -293447 58228 3890 8820
22655 8820 -8095 8276 29476 -147509 -86969 243761 183682 151574 -291906 -382687 -98740 17092
22642 -189901 248771 -38873 -307798 63941 191437 -34157 92721 186046 -93793 155864 -217838
22630 119952 -98472 7051 -107504 110311 -197885 -139756 43522 214523 -59224 -63883 -69764
22619 -69764 -97397 -23419 -210899 49235 221162 -258453 -14244 -91737 65816 -51721 -88565
22608 -88565 148140 344625 -12908 101630 -196238 235638 12228 -220081 -77070 253606
22597 -158010 151847 53998 -173856 -163161 -173286 -74467 27738 10880 69631 181720 30523
22585 -18979 249014 -260637 -237531 -75361 -164707 -62733 -32760 -92620 153408 55137 -30722
22573 69325 -127396 -106740 -197096 -8259 232967 -66296 -149342 -38588 25342 -178115 116086
22561 -126740 51172 -310984 -154869 -250795 -264615 -271718 -80588 -239828 -346811 -13886 -175489
22550 -175489 251583 -122747 -101240 -191065 5233 203272 179716 -204405 239275 -223889
22539 4961 204119 24578 64350 -233947 -336150 210701 -69620 222884 75138 -107260 48615
22527 -219652 -222988 53218 -33078 11508 26993 -33045 -47496 100677 -288715 273603 -54241
22515 -199441 225799 -56613 -92197 -117554 71837 -114933 -169858 -101301 -43007 -92811 2267
22503 78444 -296249 -160628 -273812 153867 9453 -274484 991 -82078 -101918 36390 -234165
22491 -40666 -191342 -337045 -23641 -19374 -551106 87015 11285 -110920 -27972 -376521 241008
22479 -271750 -48079 -72275 -111618 39564 -259136 -364086 40558 -193541 317348 29891 131321
22468 131321 -179549 -25745 -90847 -84291 84084 -254311 -104703 -16138 153020 179831 232842
22457 232842 331252 -75968 20917 -16244 102772 65353 54240 -278426 4543 -17988 -56924
22446 -56924 189266 165125 -324509 25251 -251828 -241371 330473 44484 -391350 116187
22435 -183835 10113 -47543 -160701 26907 325430 -259408 -18507 -211641 -142184 -12009 -152407
22424 -152407 13069 155562 -438174 -151234 -322995 115867 314125 -162764 98519 -184750
22413 -304997 -242574 -136481 -301316 13267 48362 203425 97813 8228 162554 -91673 -147188
22402 -147188 198894 63232 -143228 -168379 -76761 125258 -41924 -67973 17446 -264609 -127607
22390 -220312 241103 -193064 249408 -201449 -182405 8086 61806 101522 -69373 -131692 155271
22378 160713 -238302 -253975 -94888 -2800 -11371 -274319 -141814 -49414 38130 -160536 120730
22366 -3434 228565 -23944 1539 393854 27018 117178 -109192 72106 315264 -50145 -215237
22355 -215237 -264580 -148060 185679 -192272 95430 -217719 250982 -15660 -6772 -50627 64673
22343 -56171 -356566 -129472 -97937 -270475 -451510 -30638 10603 106831 41028 -86976 -273161
22332 -273161 -81368 -255638 -98334 -63444 174869 220989 111698 6926 214407 38834 52232
22321 52232 248153 171139 -237286 -40374 160842 -90774 85283 127944 -152246 -228516 30798
22309 40465 49157 -14337 -133140 -148564 63517 -254862 -215859 141304 -197637 -37073 19646
22297 -318460 57881 -35499 190789 -339574 19548 -24266 134825 248376 -68305 -6777 64031
22285 -32945 -84139 24842 90522 83165 10525 -60403 -220485 85335 34741 105518 61165 108943
22273 108943 205230 -168885 -73127 -659409 144127 144483 -345587 -505 -248599 86025 -153255
22261 -17066 -1 -19887 -89822 -60967 275203 -95349 103853 184943 -235226 33842 192318 -207602
22248 -116585 -254656 76061 -647 -66376 -61517 -135227 -77860 95072 -130346 -270418 150410
22236 -331616 -129348 -103750 -28530 67523 -72613 215158 -150988 18427 -324301 -14688 -27011
22225 -27011 80106 -30480 -99454 -133649 -21291 50774 -200389 18433 -266780 -376989 -131528
22213 -447939 -33706 29276 -194844 -86673 238060 37350 -414865 -47301 -226003 -88611 -7703
22201 -123202 -222604 55847 -10568 -53026 -177549 277004 -195759 -165137 306288 66849 40975
22190 40975 -30872 -126191 224610 11945 169205 246150 -59337 -320247 -124730 -353182 -71210
22178 -197744 186646 161935 89057 -38524 68387 -8904 334398 46846 -34446 -153106 278748
22166 13397 -267566 134202 -163245 43382 -235202 114248 -356953 -253551 28766 157175
22156 157175 -141582 -134230 -227001 371280 -109732 122473 -39530 -56455 305030 49641 -137033
22144 -257421 127386 -203140 147318 -22555 -43893 -87588 21896 118229 -38908 -255368 -192811
22133 -192811 -167911 -237987 -14751 -68465 89505 28072 -202918 14110 -168274 131294 128793
22122 128793 -128424 -9429 -182660 34306 19094 -80008 -271372 414151 231836 -38779 -44372
22111 -44372 -1298 51053 -228400 319520 161412 -392375 240202 12741 -84451 365950 -250341
22099 556874 -312621 -262459 123654 290592 269045 -185922 -183218 -61499 -99080 239151 -108460
22087 -85907 212571 -228809 220866 -77016 -145461 -226727 93441 -121814 -221373 -41166 -129863
22076 -129863 60746 161411 -403397 -250408 -71453 -209183 27070 -79389 182810 -331153
22065 123446 47494 -169895 -152637 -190344 -192202 -156552 -167098 159054 109047 -161810 37934
22053 -14854 199790 2760 -65215 -10913 -132498 -65751 -97758 -28048 -409282 -134840 22133
22041 -334906 52066 -50434 -371193 -111175 -65562 156283 138769 -87298 119338 194873 -116802
22029 112189 6615 -201697 -212949 91895 -274129 67755 -188020 154056 -272873 129833
22018 237243 -24860 -131749 -277516 -3118 -122468 45731 -586789 50392 96554 29921 -74911
22006 59201 128873 167636 -21009 -295767 30026 265846 -119746 -6082 -40527 49502 122075
21995 122075 -227662 6907 60028 80135 -27670 -98191 11583 -162579 193634 133233 117328
21984 117328 -104998 10838 -512359 404667 -135391 -307223 -344385 -26496 -309418 -140695
21973 3854 210988 363331 -62913 -264052 -3966 34235 -45533 -236394 257404 4202 -22028
21961 -225945 6398 -115785 164890 112767 224505 67622 112292 -76001 119114 -72314 91358
21949 -186224 -71755 -158340 -142381 -170438 -209865 82884 -260194 81530 162277 258996 177554
21938 177554 -281696 -179615 -255980 83864 -200077 153989 -228055 209173 -46218 43682
21927 287229 -57406 55247 -97615 130199 91144 -41331 132842 91228 -18358 489947 86654
21915 -156693 227780 -123452 40416 -168008 110364 -142678 -116023 -148085 -188614 90835
21904 -228607 171859 -267228 123390 -25377 30261 -25330 -210405 -42887 175734 -114825
21893 39849 205671 -181514 -304867 -156109 -1035 49635 -346545 144483 10951 -35743 93943
21881 -163182 -195941 -43348 152520 -175609 233795 -223809 -61243 -152311 -121585 -32219 -393095
21870 -393095 13554 129774 -74551 11635 177882 11448 123766 -108848 345502 185412
21860 185412 -79885 -300831 -77984 -83024 16071 112244 -354881 135066 -238988 -379440 -7999
21848 293667 -7132 66036 167659 -15576 -172587 90958 -27558 -393418 -49337 229327 -131827
21836 -306114 -94160 -276192 -107592 -66532 174443 -71273 -231676 103783 -89315 -468740
21826 -468740 179876 -310341 -66851 -71259 -89267 -32504 33052 -324133 128647 149374 287338
21815 287338 164030 216665 106020 -466416 107509 246680 -34840 111203 206672 -367106
21804 -2763 106240 -13483 -755 149970 52516 -72433 -184689 112753 -243901 -126435 259850
21792 34709 107181 167980 -8147 -348418 -264681 -431524 -66540 -56176 292101 -19777 -111051
21781 -111051 232457 -128037 -166333 -159951 -253712 51916 -38758 220152 202788 -187261 -396027
21770 -396027 6589 11879 136373 20616 18596 141475 -276330 75566 126539 106982 -48964
21758 -27819 -219020 -34627 -249064 -67347 -96419 175146 88763 182461 -210740 -67095 -260955
21747 -260955 33167 136601 19382 237764 -41978 -28512 -267426 177730 -66202 -17785 -364393
21736 -364393 -157076 -28875 -178850 -258440 -69545 234821 195384 11373 -123026 -178326 3177
21724 109257 -137865 -5311 -196679 -90400 34597 -21756 46167 -43643 -45138 -66242 52279
21712 -278162 17879 -49774 -58606 291691 133970 180295 180635 -65889 130736 -45414 50116
21700 164840 -87676 -334650 -101520 391007 785 -18774 -64556 128430 -42387 -259812 -127370
21688 -90788 175263 97624 -121791 89285 -78523 203643 -226036 -115474 200854 -190636
21677 -226447 -111957 -228387 -203295 -231092 -86115 -19109 -98915 -18304 -140446 -238268 -141521
21666 -141521 -89090 17927 -55249 -66223 -350532 -93468 366739 -22931 -31676 -289272 -209380
21655 -209380 117380 -94306 -333358 58555 -247956 -94549 176673 -26858 -43263 -51852 95196
21643 -114992 7151 -339174 86350 -105638 175861 -48671 -290983 77898 389114 89014 -162051
21631 158814 -175916 -112898 125554 -55316 -422305 79947 -489607 231795 -186278 -106585
21621 -106585 79149 -221654 -35187 73514 334906 -133811 -94164 41653 -137129 -347364
21611 -347364 99801 164396 61569 332750 37252 25816 123978 39969 -93076 -19844 -50397
21600 -50397 -193446 29617 67605 16847 -240086 21938 -37766 -250946 -132117 -44472 -241313
21589 -241313 -154164 -46067 72036 135824 -180673 -240159 -135589 33697 -302180 -238790 -124809
21578 -124809 20045 233689 -6233 -59772 -94922 60658 -252787 85459 -83512 32245 -343215
21566 -132685 -154586 -119971 -43254 -72520 -151497 -291103 168838 13873 -308506 -37112 -188500
21555 -188500 65624 10837 -107159 -32187 -49239 -213977 -42521 -523779 -224905 216881
21544 14881 -117274 238043 -79428 29853 32515 83394 -184633 -15121 -308754 125758 37055
21532 32465 30167 -39495 240714 -74822 17167 -300378 149934 -12655 4876 112740 -83723
21520 24406 59248 -306264 -212208 -6559 50430 31005 -61175 135548 266354 51100 138196
21509 138196 -60850 -226156 -474430 48662 3853 -446312 -214721 -236972 358354 -167408
21498 75778 185026 -110375 -19297 371128 388265 -115979 -238173 -103653 -52053 -294847
21488 -294847 -72791 -77350 -7343 -130944 -21745 -198103 -232549 -237327 -85760 -20522 71666 23999
21475 -316008 -160851 1665 204363 138416 -5689 -152131 11407 -199429 150871 179832 87387
21463 177861 -38154 206566 -149005 19359 10746 -158178 -44821 -75115 -311490 -68415 -217868
21452 -217868 24635 -20884 17129 -250164 143130 -166752 165596 13659 505806 360855
21442 360855 357651 162328 557702 183235 -93097 -132598 -48071 28412 118645 129687 -151970
21430 -103468 -494852 63214 -127303 -100867 143236 168847 219394 102616 41423 -199042
21419 -71918 -290009 30419 92783 -37632 35738 -149318 -138973 312871 -144092 46391 273132
21408 273132 -148846 -202044 -8165 142491 -157708 -180571 8736 64281 83260 -215340 -239412
21397 -239412 62413 -436110 -116860 -24732 -78492 -133540 -120760 129581 10878 -10553 -157746
21386 -157746 -98633 -162665 142017 23576 43 -237547 -164808 48126 -115201 126414 130339
21375 130339 -113552 -64513 -69779 -78520 -117926 -247574 160686 -20258 40554 -108856 -76554
21364 -76554 18185 89413 -187233 -340314 -3232 114074 178353 271440 -28417 -21046 -30033 -214140
21352 -214140 -248159 -394598 -107869 34231 -172257 -221235 -297393 -34568 -43919 81677 186137
21341 186137 76153 -131060 -33622 -140666 -142048 240065 -123764 -211852 -157269 -177954 -64624
21329 45587 53863 18182 -85449 -84587 140296 131018 43955 191562 -4294 -346028 229510 -15378
21316 841 128836 38154 31266 16691 -124968 -67851 -2223 65358 77182 23367 -431927 -382661
21304 -382661 -38418 -10382 -265996 135560 125609 -170329 -158409 80027 -378312 -266201 -130214
21292 -133311 -98239 -118007 -387828 -306784 -124318 -183591 -318143 118710 -280892 -180668
21282 -180668 43280 21777 -143688 -83489 218717 50956 -52811 -257048 324159 250439 155449
21271 155449 448977 -19443 11694 -359902 -157407 -11439 -284895 -106622 144145 91102
21261 91102 22468 -106842 -212719 129670 -83453 39307 -366978 -252941 -86548 281571
21250 62865 -193492 -13461 -156260 -303285 14849 76067 119036 209473 71866 202230 -72696
21238 -23466 -160763 -368326 -89889 -85503 159650 -150522 14175 -142219 161455 -128557
21227 185422 51988 57594 288902 -23020 176917 -239127 -477868 106036 10357 -8962 335437
21215 5991 -119380 47379 -14763 72602 202637 -180495 -177905 -155934 -23032 -82582 -212253
21204 -212253 155883 -54806 -184679 -242577 -34992 -50250 135872 39559 -70951 -132160 -82657
21193 -82657 36783 -334074 -207402 -350700 -14642 -217236 56276 -164016 -108603 12082 -72483
21181 -137235 45707 -178960 99530 194263 -341986 -328138 17634 -161107 -146744 -112384 -111247
21170 -111247 186400 133060 -5180 -175904 -131480 189284 -146211 -73634 69759 145684 -130833
21158 -81691 -16073 321664 -327834 164166 -166902 -67460 -52835 79365 -10885 75709 -342887
21146 -123413 -268930 -146990 -89835 146064 -42701 -5745 -100719 -89372 -53475 14929 25538
21135 25538 -19656 -78702 79208 -38542 -389871 210173 -151675 124824 5842 -198836 -32043
21123 53477 -285745 182975 -23119 -332852 -218435 -195175 12298 -210996 138237 264951
21113 264951 311798 9560 -88241 94347 -41997 188315 113670 -311467 -174537 -134886 150019
21101 -54494 182793 208507 -230810 7835 -230661 5978 -344704 -194451 7026 111294 70044
21090 70044 78319 -24702 -77399 -19169 -92200 124613 -45191 -152470 3658 -106276 -182263
21079 -182263 -173293 -222134 -385940 76153 -233562 14514 65419 349663 -37204 -27446 60401
21067 -217789 -111460 -150973 86716 158891 -171231 30388 -72447 -249791 323811 -187150
21056 -148738 -134758 147782 -57490 89478 43010 293603 327037 -294907 -65445 -223899 -76938
21044 -70216 31548 126601 242563 -149512 -342378 -211506 -298961 -136516 154453 -15226
21033 70981 101471 107853 138913 40868 -224846 124155 31504 -168545 -210777 56088 -352836
21021 -220921 -336593 136030 -11461 -166227 32018 74450 -186246 128769 -156371 -32862
21010 -99017 -90998 127225 216729 -260794 -192548 -55524 29708 102599 84110 -112546 -3383
20998 10335 90290 3107 -68555 -276420 -107344 -73445 -144818 -301941 62355 -79131 -109183
20987 -109183 136440 132635 -67129 -189642 -111137 -118700 56393 -281296 -251907 -148157 189018
20975 -317979 -29639 94816 -260222 -177498 -36970 49399 -53826 -141988 -89378 9407 45624
20964 45624 180574 -157979 213757 192131 -220950 316228 -164234 -265613 247233 168140
20954 168140 -1604 15885 291465 24240 -28173 166671 147184 -137926 -124137 -122567 115200
20942 -224615 -138252 -181692 190963 23886 -207785 -327791 125874 -68215 30193 109875 141490
20931 141490 -68530 173664 -8048 -256131 12114 -156053 -115434 -34848 200291 -203356 98109
20919 -54445 -295230 -302579 186074 21016 -132898 -96146 -206300 -199915 -69318 -52694 -45232
20908 -45232 -137206 -37656 54672 67993 -229257 -989 -61055 48087 -97667 146918 -52343 106834
20895 -62844 -245434 125142 -196684 336339 -100666 52751 89858 -172524 -265657 -63491
20884 -168995 193663 -219957 262834 -243649 180186 222712 -154132 195659 -21918 -28603
20874 -28603 -260598 -79532 -37805 3594 -92013 -117215 64184 -86768 332747 172532 -51103
20862 109416 53617 -20922 -89900 -110903 -124379 -196964 150412 -111680 86409 70485 -375640
20850 -99651 45972 -284195 -36036 -230648 -70491 -31262 62016 94537 197944 144842 -29800
20838 -237022 -212760 168550 -439556 -162539 87371 -135218 46474 -165652 -63299 -186569
20828 -186569 12705 574703 41353 55986 -149254 35694 -8317 311962 -282995 -132563 52493
20816 59192 16620 -238385 303694 125211 -131965 -76900 -69970 1371 -114553 241218 -37204
20804 -186095 653 -1003 -53136 162696 -231989 -199335 -309904 -38456 32783 39186 -145919
20792 -541984 116034 -68747 -193346 -24099 85063 30657 11902 -132072 -220672 30150 65761
20781 65761 40800 -48021 202012 -38884 195069 -249253 72671 59267 -197144 -48295 -140585
20770 -140585 118936 -101938 3724 162983 -229002 -248249 163590 208150 35477 -117644
20759 77869 -423820 10321 -99128 -87882 -107797 121930 216518 126666 149116 -310453 81069
20747 317816 195278 -72288 -143598 32687 -23713 -70791 -356346 -75966 6709 -71790 54109
20735 176550 -235607 86366 -252714 -84342 149888 195551 -2702 -100675 -158438 -48303 -76501
20724 -76501 -153293 42736 -410209 -149349 204577 -445819 -30171 66175 86172 -287289 -8083
20712 156884 -384254 18997 -51285 -61007 -47833 -23422 43584 105843 -61612 -283964 103312
20700 -22629 -248359 360980 -281214 -38533 -167098 -272430 -57466 -46536 -191295 3939 9695
20689 9695 11139 -256868 -206401 -46170 184480 -240673 67212 118259 91574 -118423 -141815
20678 -141815 36672 -32390 -54206 -248871 68465 -42997 -161947 199817 -259789 32560 117676
20667 117676 -48454 -339974 -27615 -33144 160437 -103932 -422734 -334731 -12731 1603 -164657
20655 -3499 50082 -81422 236022 69213 -11646 -323751 -144670 -433643 -332785 -35043 -68076
20644 -68076 19311 -34161 25329 17177 -283563 238914 -172976 -118525 -243997 -12607 -53526
20633 -53526 -196333 -265592 132351 -36426 -108747 255705 107557 -89387 -273735 2015 -317892
20621 159612 -69485 75019 -132811 -233198 -168068 -26748 243357 -222062 -29342 198460
20610 -74436 -191137 92617 -209605 -321009 10796 -227278 -93840 -4975 107330 -86638 -28371
20598 -146111 -59545 18121 119194 228591 -106137 -20499 -189981 37563 33416 65512 -19851
20586 28028 -127556 61657 -118026 -169640 66865 -175670 216414 -126466 -11412 -135703
20576 -135703 303203 13116 214590 -148589 14200 40864 -194870 98552 288 -99064 118835
20564 -221375 -272301 161089 53611 86023 -248714 49280 158784 -335198 -10509 -13027 -97024
20553 -97024 -49017 145690 -178066 -160570 -185334 -420518 120042 99104 -354043 32135 -308400
20541 -257122 52050 275001 -165538 77639 76892 2153 129676 -13562 -111259 51194 -403994
20529 256972 65082 -125380 200366 142093 22070 -72639 -385140 -87307 118428 -6806 421246
20517 -76093 -237993 -46604 -86811 -117812 -62572 -92831 -35863 -396604 -114785 -30183 -44660
20506 -44660 178278 -319918 -156538 146461 -17007 -105072 18861 -113627 456443 -217437
20495 -325113 72081 26500 -130923 -55679 -219970 -9506 60180 32024 -95358 -88380 -96494 97321
20482 -68064 35078 -51162 -64858 -323455 -471994 153586 207022 -333223 -139420 237203
20471 19511 -38820 -471450 93034 -102456 22360 -104774 -9542 -133576 -81667 75115 140658
20460 140658 232113 60762 -195973 -50636 -57039 270315 63731 -88756 51953 -214923 -41321
20448 -114565 36036 -40167 -259861 -107562 3005 114388 47482 -304904 184477 101802 -182989
20436 -191981 140896 -63414 -139570 -343423 17931 77885 -255061 -219221 -43916 51718 88386
20425 88386 -100175 -205647 -215866 -133497 -252477 -393967 -187198 -35311 -390535 -52450
20414 275009 -52129 -45028 -137433 191524 -287343 -197034 -153254 -141984 71887 66052 -143619
20402 -186589 -184925 54109 -100061 45225 -70701 -172290 -82392 195640 -107635 49788 -218215
20390 22636 31023 -32960 -234168 93331 32271 -154176 -241367 -33432 174352 52006 158916
20379 158916 -228936 -194948 194804 69584 -184551 -61727 -308170 71721 -53385 -288827
20369 -288827 63386 -375260 -237095 104174 348158 -102092 19297 -140997 51058 152419
20359 152419 65823 -182535 -201674 108425 -92755 -49389 205980 -57631 3044 -36923 63218
20347 -204302 -287141 21133 52832 -161911 272914 -274901 -192446 -184076 175317 135991 -61123
20335 237642 -76030 -130416 32470 -187307 287157 -123684 -254013 156429 222879 158561
20325 158561 11398 -9589 95164 -22871 -121292 -214451 26687 -265708 -65116 -355881 -10788
20313 -290648 114487 -146775 -305913 -150851 -275979 78020 -276853 -121165 -32276 -382813
20303 -382813 -265674 116571 -32259 -115408 -308286 -263742 191412 -138498 -86899 -263637
20293 -263637 -29313 281421 130337 -59198 -158621 43545 -146925 -164034 -14835 134875 -184874
20281 -59871 12244 -229853 -62577 -441166 206701 -261525 -64342 -23751 166542 -68907 -46034
20270 -46034 62784 -68844 -262380 364538 17239 -70513 -108129 285492 -216178 -217732 -338125
20259 -338125 -212151 -97111 11244 21494 213773 -250636 -34810 -217959 -273691 -90036 -286484
20248 -286484 -9858 -273407 235488 165889 -72405 -217276 -81079 -49796 -308014 -131102 -96555
20237 -96555 -80626 -53343 284363 115061 -56513 96062 189532 -178385 -120428 -531174 8387
20225 -176222 44206 99895 -107132 366934 -246630 -9284 67766 23617 -321605 -26394 15690
20213 -85439 -40662 -67708 -26043 -110191 47131 -52404 24418 145938 -182339 -18702 -206051
20202 -206051 -116362 -35488 -218506 -213128 -77598 -12511 -192016 167897 19127 7861 -27459
20190 -65733 -331260 145516 -375405 -127501 -115988 -45093 -20367 -69151 110716 -148103
20179 -338622 35049 56477 -273569 -61000 -55141 114006 339560 -390686 -161465 157298
20168 21901 -176779 50649 -225762 149414 -207417 -281565 -286282 -282962 177156 138976 -8900
20156 41488 -45114 -135908 65576 240653 269180 205234 -43318 3026 38755 -2346 -59629 296576
20143 165460 98380 17652 25664 -142983 -27324 280763 62119 -101752 -259605 -44395 72844
20131 33512 -103649 -102860 -10925 96296 113537 127828 -3380 77664 246619 -193305 -42421 -274052
20119 -274052 105051 -186148 -104845 217198 81541 -79329 -17958 33574 -236395 -47805 20114
20107 -102677 -51843 -125303 -203143 -129965 24270 -184556 76243 211743 19040 182766 -185433
20095 -62182 -158949 -83564 -93695 -22778 126316 -151955 73759 -198970 -114394 218162 -105532
20083 -46130 -64614 -124587 -269982 177827 260151 106621 -409350 -20852 -37295 -33876 -38225
20072 -38225 345002 43349 -177515 -140161 -143888 538034 -297018 43994 -329991 -29181 -252455
20061 -252455 127342 140784 287790 -194591 97397 -78620 -182764 -107549 -190509 -70952 76645
20049 130095 -79428 371579 -127416 -134824 173806 159116 94659 48874 -107277 -334291 -69815
20037 -22983 6622 235192 -104290 -201818 91839 -31705 367424 138847 71350 -210288 44722
20025 -124389 -115565 -143340 -2625 -109694 -126942 359029 -174174 -51812 -142583 -271909 162508
20013 130539 -25175 77546 -138399 -49161 62693 -25824 720 80384 134969 29583 -31900 425607
20000 -178407 368472 -336930 48321 -293375 -267616 -359847 4759 159267 -199051 -312830
19990 -312830 -8171 -215255 -141225 26862 -73216 -300522 55311 94797 180917 -274645 83608
19978 -95934 -159701 -352704 11003 -71745 -211139 202710 -45859 26460 -70072 -95986 -811
19966 65765 13340 277844 -123022 -22737 54053 -151915 -197414 397482 249946 155061 -110950
19954 171113 -7736 -95267 89461 -290284 -332036 -129963 197865 79558 -14284 180394 80055
19942 7133 300862 -164972 -15122 -543648 38192 -312453 -93465 -252192 13344 -17999 87822
19930 46682 -425236 -56960 -266209 124418 -387456 147572 129519 -125555 -163872 13163
19919 -269674 -226077 -11742 247650 -434793 -53381 -112270 195274 83745 -161339 -110793 -27597
19907 63887 -291273 -99178 -246006 -144785 -177477 -127420 -315551 194668 19651 -100392
19896 -135967 14947 23201 -250621 -194414 -25087 -112337 -118790 -17632 -341304 174035 35076
19884 -275433 -119687 -182615 -84146 101686 -28854 -147327 -199443 -76563 -153350 -222370 -98660
19872 208886 24219 -428081 -103671 126218 -96393 -133937 132785 -133901 161751 -88775
19861 408811 109343 311631 276369 136664 -297307 -110213 -152223 36209 -128658 -145917
19851 -145917 -71472 -493255 -308508 119679 -255950 -16406 -427362 -336012 167814 -12085
19840 -136357 28318 -67226 102216 -63667 36884 -179820 -243467 378012 -577899 -218793
19829 -55399 32754 12623 194081 -319799 -95842 -174177 107699 189950 -92618 -262470 -143799
19818 -143799 -5728 -493515 33471 -355838 167596 -53347 -156377 -8579 -12649 101655 -197380
19806 46605 -38644 171183 -139246 -135931 -291796 80469 252485 -32534 -273278 -126095 -197286
19795 -197286 -121937 -142486 24053 -9692 191987 339410 290268 -318168 -132426 3738 -358461
19783 -108942 -58112 60962 74259 68525 -16068 -301658 -269912 -245105 -1054 -103544 -218047
19772 -218047 74113 -34406 -19491 -160074 199245 30407 -264406 166192 45296 -82647 -116309
19761 -116309 188870 -23216 53720 80191 -131749 -252187 -3967 -152758 -176948 240933 -303643
19749 77369 229674 102741 176491 -48378 -168804 -105307 446393 -228820 89591 -62475 2489
19737 91165 44281 -163600 -141473 -36454 -1838 58330 -60727 298488 -41783 149074 86092
19726 86092 -117243 219225 -387211 171469 -161155 -137403 -198173 34559 -163043 -11331
19715 118867 -14964 -155586 -23788 83145 235678 88760 80004 53614 217961 152070 87712
19704 87712 -173365 29709 -459695 167968 170695 -185159 -23451 -41912 33726 322142 88164
19692 273990 -355 -7646 8567 38146 -256569 -139211 -79404 106017 -242198 -149564 264554
19680 154268 114650 -230003 39908 -209662 -484995 30455 27152 -243554 -176441 -221394 -118624
19669 -118624 95589 -398507 52628 160542 266144 -118369 -204728 51152 65671 -285184
19658 -30975 150500 -65371 92904 -95667 -42724 367 -54740 1707 3930 -500456 196502 -108766
19645 55697 -263556 -91046 -74546 155816 160488 -117210 -273390 -208676 111160 -140412 125507
19633 215798 -274426 -440610 64624 -34505 102274 -124425 -186759 -32908 -186591 -252369
19623 -252369 -146035 348190 90162 -3836 -334182 256531 -114601 -87783 -144994 188712
19612 -166459 -184195 -202414 31282 -18696 -116195 -174091 48449 196546 -214034 -84580 -45367
19601 -45367 -86787 93592 -65538 -292784 -398332 46119 -342559 -229674 294940 -354336
19590 120415 -301385 -117972 -58954 98166 -36762 40995 -461739 175290 -273018 -72758
19579 93156 -121083 -106541 54597 -58959 -162648 -262494 109174 -339540 -33426 -192174 121048
19567 -291248 -164252 -80899 -8794 -105435 202987 52178 -68144 -60793 116835 -239573 -245598
19556 -245598 -261189 65772 139144 -423676 290377 52038 -46689 276352 180376 -141100 -135382
19545 -135382 233342 -177889 -323435 71157 -69970 -307469 -12347 -154700 -120100 -384740
19535 -384740 -61836 32395 -243162 -19032 -25737 204840 138680 -393453 -59742 -89407 -143012
19524 -143012 32435 50868 33911 -18139 -76517 150729 -19875 -127739 82450 -215268 -185235
19513 -185235 207959 48912 -191701 42185 -286731 -260974 40700 -169214 -28256 147592
19502 -171367 -80434 -161537 -123688 -91483 450948 -159278 10273 28545 -37583 -552571 132695
19490 -82047 -21353 -317507 -107994 -413111 166282 -282705 161395 -222394 -155802 55511
19479 102617 -331391 -384191 81681 -211892 215264 48816 218774 27975 -195230 -125424
19469 -125424 126286 78402 -221396 111388 -168605 42838 -298894 -142684 -390233 169272
19458 24873 -91236 217452 187664 77394 82666 -235810 224733 -32064 -88611 81357 243537
19447 243537 -197622 -335632 -184299 177256 -212033 -239288 -3359 -150279 -84340 -203060
19437 -203060 -372928 -217473 -56417 123955 -312915 111030 199289 143561 -90096 -282568
19427 -282568 -31397 313523 89901 -69187 -77482 -308965 196295 -34762 37646 24656 75252
19416 75252 108278 58279 -217193 -111423 -327010 183248 11061 -154544 70656 -202499
19405 72450 -269844 128808 -85168 -53363 103478 127689 110005 -292329 47831 -416252 26554
19393 15049 48516 -368146 93327 -39897 -105587 -55699 -112021 39829 -85562 -65681 60112
19381 -335273 89842 168140 146580 -167152 117634 81051 302797 -225861 -92545 -81760 -115474
19370 -115474 -110467 -183942 -251909 87817 -202817 -258515 92687 -162258 31402 240213 -58308
19358 -465543 -17466 -117601 -124459 -227928 -96534 20313 -125301 19970 199006 -249163 -162658
19347 -162658 44402 -183287 72006 -175453 -125188 -199766 -72949 -73388 -118127 -492112 -39218
19335 29725 -341663 29921 142862 -98921 -25306 -275119 -141066 -284233 -287466 112953 -275396
19323 -173692 -127392 -24813 311771 9069 -70596 202889 -193346 -315586 -333153 -15867 -163614
19312 -163614 -111536 -276020 -42345 -49144 36911 -197046 26894 127917 174566 -29275 206557
19300 -347484 157891 83938 -319376 -155252 -321900 -289632 -6661 -81793 -91663 -161209 -22965
19288 -8987 4243 186921 -140870 94850 -46326 -159468 -210273 25381 -244209 -115040 -14362
19276 -33862 -332568 8212 192847 -53734 -383 -77601 10105 -489937 242702 -21001 349341
19264 122600 -405024 240839 130703 -172807 -173354 -184859 98170 101000 41606 158176 78806
19252 33899 111823 -51136 -51529 -70995 -426995 -161345 143881 147882 261395 -255296 -75026
19240 -148756 -184974 359176 144564 74016 -102881 -276647 97235 -95711 -15882 -111731 -179947
19229 -179947 -64443 -178560 125874 58123 -102086 -137537 9783 -154173 -176689 -163236 -82622
19218 -82622 -87977 -50125 -97953 161674 -164535 -122022 101478 274504 -133422 149632 -210912
19206 327842 -135366 25651 222986 -289071 -262827 30368 141522 -140906 -72011 270552
19195 -95209 -301449 -84941 -72814 -33599 -158423 46130 -128339 -416053 -20099 -310272 -312546
19184 -312546 20666 -89454 -325210 104733 -112116 159007 -400591 -121304 150910 113141
19174 113141 -107934 -396433 50518 127233 -38625 -234772 -375894 -189929 -31150 -177487
19164 -177487 -285755 143941 34567 9666 -119657 -51871 -105968 55779 -203929 -37103 -202846
19153 -202846 -169144 421091 -322692 271458 -133475 -117926 91710 -135517 -25308 -118294
19143 -118294 212268 127233 -41345 99001 -491052 -160875 104063 -87908 -211395 -222012
19133 -222012 -255105 -245454 -94162 -194652 -205682 -64879 65118 40784 -240151 60237 -369983
19121 -130539 -111908 -11735 -68046 133375 -170351 -315517 119984 -275258 -247921 80580
19110 -84179 -355436 -91562 -331345 -92924 -116320 -4999 50149 -93971 -84159 -23679 -129240
19099 -129240 263428 -110807 54426 -52187 -15558 -48760 -58185 -39647 -18797 -138202 -162938
19088 -162938 -140653 225513 146988 -2778 -157712 113124 157884 70449 -266919 233979 82912
19076 377347 110624 76069 -241045 -110576 61543 -51945 -53553 18526 -134250 -24534 -15005
19065 -15005 238580 -249323 167881 79814 -236454 -32558 -45431 -17074 15142 -179944 37818
19053 39300 -117489 -131298 318347 -133712 17274 -154118 15653 -319764 -117322 -1645 -114815
19042 -114815 -430142 -190791 293 -230278 -206321 234383 -136046 -123606 -1992 19869 106475
19031 106475 130399 68191 56159 -9430 -65805 9160 -186941 424189 154957 62388 -22764
19019 -4221 -563 -71731 -99138 10775 -98159 -92605 -57170 95254 16486 35439 -161451 186161
19006 -23333 406088 -134381 -287 -82418 110897 -104242 153856 -126847 -102948 -37366 118278
18994 -153651 -348508 -135272 -76399 44531 -150862 -162637 41293 -221059 -17552 -60907 -48776
18983 -48776 -85667 -32879 -439139 133470 -10690 -52203 -251497 164952 207747 -294515 -105222
18971 -35250 -29025 -999 360813 202638 189606 -112770 182885 97587 340986 -72522 -102756
18960 -102756 -325043 439948 -159910 -91833 -280997 -1341 -238497 -10799 27942 -85461 -363938
18949 -363938 -109479 -180461 -176201 -136382 212168 -154202 -227052 2700 -114030 -68386 -43109
18938 -43109 128100 178182 -169454 329012 70938 58583 -141412 -5270 -286828 -303676 -196802
18927 -196802 -11437 -324067 -10155 61319 -240578 -185460 11300 136066 30202 165548 -99798
18915 274653 -379693 -117956 57660 -113952 283434 60900 -41675 -208513 67251 -329442
18904 71397 227512 56190 -178643 362116 -262965 -288085 4108 -117153 259807 -163441
18893 -1014 -493228 -49923 -82129 74089 66750 -108067 117422 -99121 -67219 -165812 279806
18881 -233442 -79596 -10623 -250234 -109313 -84345 93361 -69751 -470793 -2355 23369 21408
18870 21408 76876 -282133 203300 -9894 -67233 -107075 146811 39013 -205495 56903 17336
18858 -242392 -40881 -361962 234713 -206754 -256786 8032 116401 19559 76050 264328 38636
18846 67639 -325349 395753 -186823 -23364 -63916 6812 -54180 -230890 -135401 -8557 -126280
18835 -126280 -103419 -62842 -29588 -94155 -159042 -158269 190745 -239172 -66677 -172285 -27460
18823 -150880 43944 118633 -196976 -199402 -40838 192679 60911 110874 90015 39479 262280
18812 262280 91664 119803 240270 48422 -112019 -62306 126711 -299767 24804 -118059
18801 303449 -79884 81449 434979 5988 -38274 54027 -76963 -2175 54855 -53650 -26999 211006
18788 -56128 147351 79255 301990 -92740 -190815 -230248 -242569 -352666 -132691 2062 142099
18777 142099 -107952 -131934 -166650 -116734 -34535 -173916 -253601 79202 -165942 244034 -24635
18765 -180773 -101053 -43403 144747 -275808 -368475 -63934 -222762 -296455 -142487 93562 -28796
18753 -258084 8309 -72613 -6777 124794 -106701 -253183 4726 -21926 -95859 128506 196647
18742 196647 92677 -205237 -102104 29849 -249603 -493131 -48216 -110470 45781 -64998 17499
18730 -221518 -133522 -213192 57876 43562 293697 61893 205592 -73484 -31968 43475 47583
18719 47583 -110541 -49286 -149339 140039 118503 115246 -44572 -451140 -108371 -168243 125201
18707 62095 -160585 -152503 95048 129671 -112728 167396 -199939 40557 -442267 -41794 -57378
18696 -57378 -406788 -289072 195947 -60909 -179488 -352671 76176 193677 238614 -209571
18685 52423 -231242 29303 -222389 -76878 -249501 -176827 -195106 -153375 118774 16272 -8976
18673 -30704 -38434 47356 426277 -458675 58064 -158168 229820 -8128 -169621 126244 -335094
18661 50868 -141495 -27964 101133 -149133 257348 44205 -284142 -25573 -177519 172753
18650 -117340 -10712 282985 -212571 311804 207923 42652 -234729 246937 270278 116874
18639 -84595 51666 -35285 24103 -93331 -164635 89021 -188668 -63124 -61835 -248789 -103441
18627 -288029 103743 -527562 -140612 66341 -60417 48457 -195402 -342076 196835 194260
18617 194260 -260799 -292486 2107 48142 202568 108960 69372 -219293 72450 -330472 38468
18605 -21080 -114121 -373386 176329 -336750 -186500 -10292 -60903 -45795 75326 32935 85596
18594 85596 210628 -21669 56992 69080 -48290 -178097 -117114 -195715 -68047 -111314 -229605
18583 -229605 -148965 -18962 -200552 109634 15142 -83394 127169 -231026 -183560 -132176 -202242
18572 -202242 -192187 162505 53757 -284120 -196089 -17935 70472 23900 34675 249736 -62557
18560 -285510 -121781 57017 240774 -20931 65832 -106691 -35797 -68975 -58172 84744 190488
18549 190488 64941 -99282 -61628 27817 54446 -123972 -177761 8641 -97196 -17679 46250
18537 64078 -361333 -24988 -42983 -85100 -197749 -79333 181251 91382 -75644 -157731 -138855
18526 -138855 164646 -157440 -87571 23572 230812 -66227 -35339 -1597 70262 203224 60741
18514 -127645 -272266 -141516 -171624 -97327 -224084 -21178 -193085 -208712 -134074 -349640
18504 -349640 -4712 -151116 -87791 168244 15810 -316610 -14246 120821 13230 85857 73172
18493 73172 -191118 202850 154529 -172841 -183993 -171345 -262896 -285928 217325 124980 105570
18482 105570 -337824 -50295 -92039 -80678 -120044 -30589 -202638 14014 -138353 -247246 -87601
18470 -143149 243754 14035 95847 1593 80444 16360 -82341 -102708 59122 -25104 -19846 43776
18457 38681 -307207 -296001 6645 -169682 -310541 -7971 389966 -264839 84593 150035 105132
18446 105132 -145151 -75950 -316217 50266 -379580 108979 -280450 -230519 -71104 -425946
18436 -425946 45986 -229760 -258207 258129 -139376 207721 35832 -5556 -387890 325005
18425 64621 216435 -305552 -26753 96297 -208465 137585 374795 369449 32379 8002 -41217
18413 -567885 58923 276207 -76987 -39686 68964 289845 51843 46093 -117926 233852 -292998
18401 209151 47780 12194 220887 139589 111926 -111601 -137260 138444 -73324 -16748 134054
18389 108640 131652 401739 68389 43791 -88886 -382087 61508 131307 172669 164242 279585
18378 279585 41238 -6300 -42491 78474 272184 -97566 -266848 141272 -39215 -35703 -208873
18367 -208873 129387 -53910 -133538 -66148 -96370 11717 -76371 -243329 -23228 118264 -38174
18355 -9739 163212 -99071 -71031 -156526 -94887 -88952 97034 -71964 -63368 -220575 -182424 80829
18342 178383 -26494 -128210 28551 183362 20842 72043 348345 275300 -214312 43785 -17165
18330 -79299 75929 -7733 299141 112405 -154884 128651 -162680 28560 -29036 -78676 -214204
18319 -214204 -130989 -93993 -200982 368587 -224019 167735 -205346 -160070 -58153 77213
18308 -7654 -207963 47811 -72695 156636 14202 -419347 -50440 48797 -21305 201204 79353
18296 179715 69192 -201628 -173215 -42984 88016 -68009 134868 52333 174277 140901 21327
18284 187444 -109293 -87805 156970 -64671 218304 -143960 -54812 92938 -268939 87958
18273 -230053 5822 -53086 -20805 -146450 115335 -25735 85502 -282566 -192842 194610 198268
18262 198268 59509 -120977 170270 -294716 -274078 175852 62028 27596 -131681 -21724
18251 -28034 -35388 88945 -152471 191161 -88367 -469539 148806 -53623 -198162 -216162 64956
18239 -202774 -11713 -230689 39033 283913 -11931 29246 -114470 -124461 -392688 -3322 -260859
18228 -260859 -60184 -91422 198812 -5395 136428 -16416 184306 -244405 -19649 -112678 -70743
18217 -70743 112759 -67468 207241 -167839 -49617 -471783 108652 -173849 92306 -107609
18206 152583 101196 -93518 24137 16619 -328147 -131134 -58036 251795 100460 8291 91912
18195 91912 -96 -76574 108338 -14396 -169914 13218 193218 -67460 54963 -45241 -238608
18184 -238608 196501 109518 95968 41771 -559156 31305 15086 80882 -10645 -31027 -174826
18173 -174826 -160843 301365 -2060 -211256 490 -387226 -62227 65815 -171054 91624 -231677
18161 -53986 133248 14086 -105492 124065 -191352 -119767 174733 -17889 -125743 101075
18150 -53985 44452 -146516 -61049 -153137 220514 -46961 7995 -118346 178328 -503780 95346
18138 166080 140799 -59923 -67929 -11566 -97152 -103312 -64558 -156294 330552 142485 37991
18126 -275562 -3244 31068 33906 87238 9417 -217355 223753 250294 88138 -703 -7518 14393
18113 -98808 -129390 -209363 -266993 -129054 -181832 -65004 150760 24038 -9676 170261 -51012
18101 66216 115306 6399 -128289 39443 150526 14517 95616 464804 347741 -14766 38343
18089 -201256 146447 115982 -190194 31275 26694 35925 216601 -131802 -9921 230356 76904
18077 -215804 33574 -97559 -189894 102226 -110284 -184596 45304 -332429 12790 -56664 76861
18065 366267 -10212 90870 -113111 -1607 -121768 215315 -214120 150370 -416475 117615
18054 -35187 44365 -25197 132217 -303254 115228 7102 -274479 68195 14922 -97185 -215937
18043 -215937 -87491 318489 -195401 -131815 -92215 -34406 -82327 34281 118897 5184 -16230
18031 131048 -220301 -111353 11717 67668 -392882 35613 38561 68969 -7596 132123 -82315
18019 190743 -107412 142455 -47028 -54422 202142 -168294 176696 302814 205798 15642
18008 127494 62645 72497 -63080 -125299 -114335 -7969 9288 -141901 105041 -46351 30947 150431
17996 150431 318173 -428498 -280774 134565 -174624 90849 -73591 35898 24965 129721
17986 129721 31760 -70924 74343 184016 192206 -73797 -280833 231301 -48264 60380 -207691
17974 -22860 -88918 33918 -239170 118175 -4062 -63291 111788 151826 108715 -296451 108357
17962 -164798 216305 163093 156749 -79565 -159968 186215 -96488 34090 184623 274191 322874
17951 322874 221513 2423 -71206 -27823 -44908 210928 320522 15797 156845 -193166 26977
17939 24896 295561 332633 123054 -341990 30497 184573 -42444 -407015 -4779 -327730 357644
17927 -269898 54787 -17216 341646 12226 -114802 -216240 -63139 -118156 69996 41097 54797
17916 54797 115924 124905 -114991 -78242 -359816 -212 -28873 175255 21058 166644 -375257
17904 -178324 -331651 6587 -310189 102584 -242545 -135876 27377 -86553 -25144 192687
17893 -251383 -82070 91413 91453 131820 -53385 274761 -248745 237460 209971 189959 71638
17881 -39826 89037 279325 211963 -149862 2756 203208 249620 52034 146294 -395366 16854
17869 29718 -81300 191542 183411 -117497 68331 403942 18439 -73082 -85003 314801 -230
17857 -54248 -182819 506837 88490 96024 -81008 -5712 -139327 153841 55104 -75911 -434840
17846 -434840 -78836 -86209 -961 270379 90300 -88493 -359715 -39101 221142 17583 -178421
17834 -231908 252809 184663 165010 56755 -123756 8599 -269118 -62372 -91074 191965 -25257
17822 326644 30492 145318 108362 200087 230423 -71951 -13403 286790 -134379 286871 375387
17811 375387 233859 -194935 -234862 109637 -302823 -96775 -294668 -38814 -76324 -68755 -60543
17800 -60543 -49829 63554 68382 152406 -76999 -220024 46679 -441993 25671 168759 224943
17789 224943 26687 72640 272284 96788 -160363 67003 176339 94842 334220 203014
17779 203014 238951 -179037 18615 332137 382937 -158920 279976 -64507 7797 153184 -344953
17767 205792 182023 -213187 -258434 341371 229757 -374636 -13087 -226828 -153744 32577
17756 132679 -282734 250995 -19451 248092 165891 -16990 130583 -218496 124562 -97277
17745 -84202 341620 109537 21059 73561 195814 -179831 338411 34853 214464 -90625
17734 77627 100617 49638 24286 195732 128629 -84373 43777 -151598 -31002 -284460 97090
17722 46776 -17885 34136 30383 -98726 -82036 138011 216019 57475 56236 -80958 -41601 601937
17709 375619 462709 30034 128449 120444 237216 -399847 -90470 216349 134651 -81717 128076
17697 217683 454985 -81323 59675 124944 -165855 88478 28121 -106754 -231980 77506 40260
17686 40260 382472 183745 200961 -216071 35664 56005 -23954 -37345 -49614 68399 -62448
17674 283649 23522 85682 110460 167312 -104253 345159 -221929 193644 -17313 94436 -160734
17662 61556 146075 -82744 139748 127726 62427 100225 10549 -169343 88809 252744 -137738
17650 70346 107716 249094 159318 16366 537764 -9654 40358 154741 -5390 92209 -290868
17638 -94993 83420 9053 -178629 213674 -26022 384858 425734 -164142 -142404 -172089 -21706
17626 565017 104098 -37818 277893 15265 -71820 36200 211501 221309 249495 184236 29956
17614 18777 134213 122193 -183785 161999 29030 -57251 251677 456833 108443 166673
17604 166673 120760 -121317 1625 275784 513799 49652 -147938 2998 84902 303631 156014
17593 156014 33812 276956 0 -105453 54151 448405 -377607 -128192 194596 316988 426291
17582 426291 367825 332799 40962 184730 217530 -49894 230942 72922 237784 304018 112047
17570 215247 -224226 47967 303997 -63726 172731 10512 88535 356721 111393 339607
17560 339607 228518 73671 81110 21471 -117203 82826 496198 276621 -206352 -78888 272221
17548 191658 283480 68594 -213064 -62918 573013 170778 132623 149611 246372 436532 122264
17536 377619 68647 3822 155135 248228 32330 421026 257002 16772 67102 -17096 411087
17524 -45460 363418 372944 210668 466628 412980 425748 256284 211072 442292 205703 384003
17513 384003 306902 227458 111186 334116 225645 271382 526497 558909 470251 400576 338756
17502 338756 311414 -39980 -132050 365478 228387 148896 169276 -76918 33930 332982 440953
17491 440953 288837 222689 250094 129180 201516 187106 52525 452467 213177 293204 12377
17479 284979 210940 411069 123853 339211 1651 297880 100676 334391 101204 56184
17469 56184 -67476 7557 303566 177437 193436 131524 369778 183345 26692 -68581 118121
17457 340861 457717 198650 290554 126994 236303 132566 -82454 -51331 358079 274918
17447 274918 208097 617739 400588 642928 170020 39280 259292 460103 515932 182550
17436 249466 277047 25812 308101 192963 56601 -28378 257467 329564 252265 290322 35626
17424 148858 179987 236324 298277 155233 239603 228925 410731 185923 326391 97743 500485
17413 500485 192558 -36556 -982 181077 235768 339372 -91271 604704 -91111 -22905 203293
17401 -64828 221856 181552 300012 -60989 466998 330689 -34819 513161 423852 120877
17390 495320 404529 417921 235716 -128876 -24263 139792 194859 485882 174394 119977
17380 119977 200989 277557 15577 25423 260946 375096 284572 397940 140448 265444 113639
17368 147948 22882 353163 142899 450467 144612 10224 113104 76627 285585 144224
17358 144224 203992 137089 284885 420061 -52109 480941 143072 286644 443182 129578
17347 393794 344089 413909 -25098 49362 94295 197982 289165 142274 551052 101516 57738
17336 57738 143475 115582 324040 373033 347237 326056 440785 436987 520020 135349 60330
17324 428627 20422 602256 346785 124820 203600 87899 216587 245221 271324 127201
17313 329991 20307 197626 161329 71577 166484 260063 417417 181888 280700 490010 -56679
17301 -22551 396034 265720 53484 192061 296505 55260 373959 202658 451937 353474
17291 353474 198164 177613 282208 -137102 395260 425356 118977 131529 426395 -216021
17280 341209 137324 139854 458807 -78821 527043 415540 710585 74145 347463 298664
17270 298664 95063 149420 183569 203930 465853 342646 140857 105195 652430 101854
17259 -69863 244831 77413 305541 166775 100773 224716 230863 181560 84096 495349 181896
17247 175521 315495 265745 169197 418366 500145 566093 103119 180790 349473 454188
17237 454188 306989 130916 544665 299841 286899 453586 300774 483924 230966 311675
17227 311675 530421 559639 601078 373662 199100 361140 204388 209388 259378 217169 368657
17216 368657 258074 306143 302898 272104 587515 300038 304066 -257606 523901 246417 140681
17205 140681 249843 474775 624918 389626 175114 479916 396643 99388 246719 352458
17195 352458 441433 501109 663819 585228 699747 439176 574646 596707 642404 171588
17184 580245 252489 511568 148140 262235 108437 242475 179671 197564 374426 434649
17174 434649 345397 112860 402722 332275 258625 438729 574344 514331 408957 486842
17164 486842 517990 702537 342127 259532 270219 475720 570846 456739 472259 408768 809328
17153 809328 575583 581236 117826 484368 254538 381299 450630 597611 524018 544763
17143 544763 182237 395831 743248 377986 895918 352891 311993 357344 801809 540053
17133 540053 592986 532729 357165 560672 389175 390215 410305 495336 557197 480274 525308
17122 525308 702591 395809 422733 586193 479318 752327 587070 269117 352179 643117
17112 643117 338744 527215 451172 476566 547181 524275 552004 655188 749850 610293 580281
17101 580281 349677 657261 630720 314471 812379 764494 794174 621734 351369 881294
17091 881294 422616 725005 717107 793005 856596 451928 788261 520427 755600 629849
17081 629849 746995 688588 717366 339089 824130 936207 795939 944709 747998 388511
17071 388511 663478 621971 623542 974980 642169 646476 530582 1190707 984934 617604
17061 617604 778055 945643 989937 711910 901037 820216 817751 988329 918707 668793
17051 668793 627386 558412 855457 968620 1008307 989648 783972 555026 1087752 961893
17041 961893 858114 921563 980636 828893 961024 819291 1085665 1008251 992468 863225
17031 863225 961699 813830 989038 879829 1086494 1173992 927732 1072473 945336 1105175
17021 1105175 668298 1292143 1248721 1050532 1170984 985027 1092216 823945 1182117 679648
17011 679648 954431 973034 1246016 1144927 1004747 1221824 1432026 993896 959157 1427791
17001 1427791 1327088 1186322 1255333 1044034 1124769 1324530 1181820 1449316 1157022 1679349
16991 1679349 1484943 1086713 1383868 1291134 1238590 1596222 1306624 1302647 1127665 1153814
16981 1153814 1516992 1278497 1493946 1177755 1702854 1807924 1801688 1562752 1623568 1795299
16971 1795299 1625122 1738372 1442136 1587642 1537747 1335945 1565201 1748324 2019921 1667980
16961 1667980 1536685 1812701 1637109 1771438 1838024 1554474 1740720 1917536 1893149 1872418
16951 1872418 1658292 2100522 2059032 2057670 1838615 1915798 2135178 2267914 2231627 2037676
16941 2037676 2329775 1979374 2251154 2192192 2036206 2407078 1947561 2134051 2189058 2325614
16931 2325614 2171468 2932520 2439603 2858573 2256539 2546368 2395506 2456033 2433843 2805722
16921 2805722 2689748 2259396 2552694 2382571 2657475 2822267 2604245 2717767 2825253
16912 2825253 3226993 2682761 2684542 3104993 2816723 3144351 3336660 2967217 3217641 3273817
16902 3273817 3003540 3146277 3347941 3334299 3197146 3464030 3430968 3591214 3299388 3612977
16892 3612977 3457056 3680038 3514788 3810261 3809560 3609167 3967536 4222443 4136265 3869461
16882 3869461 4168989 4249202 3976793 4074004 4445014 4174099 4425132 4576863 4458971 4928912
16872 4928912 4596958 4628532 4652357 5044347 5149592 5146598 5285615 5251679 5213163 5578453
16862 5578453 5490019 5425003 5735572 5730396 5868792 5898656 5964729 5990787 6304687 6328481 6349107
16851 6349107 6201374 6553413 6702987 7044909 6790893 7038850 6953246 7063050 7448755 7349095
16841 7349095 7550075 7660080 7694095 8225938 8259951 8350178 8474062 8747337 8708744 9327229
16831 9327229 9414501 9582616 9395281 9975857 9767251 10066731 10301790 10600092 10820628 11177137
16821 11177137 11126831 11464667 11433708 11901110 12033237 12034344 12693400 12822254 13409830 13490133
16811 13490133 13742343 14046260 14232372 14809022 14649789 15364001 15799265 16203812 16630788
16802 16630788 16876587 17237316 17514012 18130927 18690761 18942324 19336941 19788304 20513750
16793 20513750 21117181 21242092 21831671 22624052 23203491 23956494 24571913 25224829 26108235
16784 26108235 26357179 27206099 28011971 28568558 29828496 30729020 31275430 32337784 33063154
16775 33063154 33907890 34806805 36268189 36821038 38313090 39332387 40586328 41565094 42912201
16766 42912201 43997052 45562905 46632941 47987433 49315070 51192036 52354989 53977361
16758 53977361 55334869 56913063 58526645 60034478 61443020 63097228 64930717 66533254
16750 66533254 68386481 69989223 71657484 72994460 74721483 76343714 77697289 79795223
16742 79795223 80630435 81974780 83395375 84467746 85633981 86671399 87359671 88060816
16734 88060816 88799788 89268251 89339219 89717558 89734931 89610516 89477891 89415843 88625337 87737770
16724 87737770 87248456 86349021 85422578 84609022 83361293 81790842 80696230 79292012 77912215
16715 77912215 76119877 75096060 73340554 71612090 70425676 68601742 66984840 65542067
16707 65542067 63886996 62101549 60498005 58982913 57517146 55938799 54429898 53347109
16699 53347109 51641681 50503181 48600514 47699209 46393272 44719945 43924566 42582090
16691 42582090 41573374 40553574 38977268 38202643 37727091 36680431 35610928 34736239
16683 34736239 33479908 32728343 32129170 30756610 30286953 29516590 28807275 28225365 27465025
16674 27465025 26883430 25980393 25655268 24928953 24141367 23691024 23506273 22863069 22412291
16665 22412291 21351726 20960379 20736679 20272592 19712806 19589693 18970548 18573952 17988700
16656 17988700 17630482 17398036 17078395 16371039 16271002 16099519 15616872 15195229 15326073
16647 15326073 14990048 14420985 14215512 14036567 13681590 13710317 13305099 12858101 12834284 12339522
16637 12339522 12451481 12010553 11879533 11482389 11508957 11518889 10879854 10862751 10478902 10785746
16627 10785746 10471241 10285745 10068172 10045150 9578693 9529786 9331335 9177586 8942757 9255756
16617 9255756 8771121 8695588 8598081 8785525 8759193 8249409 8043178 7837041 7932086 7684061
16607 7684061 7680844 7393658 7378941 7123425 7649482 7057594 6770292 7152511 6995250 7012794
16597 7012794 6747664 6516143 6519674 6198133 6466228 6215813 6393570 5905295 6234275 6143677
16587 6143677 6121670 5881992 5749982 5873747 5632362 5307625 5548331 5423181 5307352 5432584
16577 5432584 5196169 5478429 5162244 4999112 5233802 5171437 4912723 5251371 5070458 4594356
16567 4594356 4772472 4674605 4727665 4850352 4944272 4543476 4440247 4426657 4224101 4154083
16557 4154083 4353496 4508097 4405789 3962190 3765810 3950669 3787021 4287232 4176844
16548 4176844 4183203 4069370 3752389 3796118 3711426 3615631 3624520 3851973 3788565 3722427 3462014
16537 3462014 3579026 3565234 3732089 3358110 3408718 3372953 3474325 2945663 3438510 3215981
16527 3215981 3365116 3282716 3049341 3090363 3400408 3455264 2885958 2962572 2775080 2783230
16517 2783230 2890668 3014350 2992986 3080169 2767301 2949571 2991776 2831532 2873697 2530420
16507 2530420 2862403 2661050 2775876 2970850 2411807 2604351 2675822 2435436 2582867 2564896
16497 2564896 2814881 2532331 2617030 2586280 2623778 2174052 2534728 2285656 2379161 2535071
16487 2535071 2385131 2492454 2499174 2481955 2323859 2438333 1957339 2089286 1965928 2162274
16477 2162274 2212815 2388860 2245709 2044670 2331817 2331495 2399347 2121187 2441312 2401692
16467 2401692 2124258 1891356 2209567 2105445 2119925 1878630 2039455 2057114 1736511 2019980
16457 2019980 1805851 1929440 1727857 1522325 1699491 1956434 1954156 1968761 1621918 1651285
16447 1651285 1934891 1977422 1960640 2026848 1731853 1800825 1870678 1724814 1597816 1614425
16437 1614425 1904285 1950767 1787008 1911802 1527987 1607494 1656622 1620545 1690532 1692285 1884387
16426 1884387 1763081 1899317 1361696 1585041 1855657 1396273 1387901 1662310 1546242 1822866
16416 1822866 1609263 1518204 1533204 1621756 1675982 1884201 1668682 1700859 1197404 1828969
16406 1828969 1593537 1394636 1842601 1164387 1304583 1255901 1483188 1314932 1533744 1082140
16396 1082140 1284625 1635272 1563394 1242581 1355460 1297075 1056680 1190039 1103594 1429313
16386 1429313 1111788 1510968 1125160 1384659 1219851 1333785 1374797 1185415 1506383 1231678
16376 1231678 1405479 1414460 1267561 839645 1336139 1200348 844714 913915 1365550 1014133
16366 1014133 1173427 1326377 1190128 1492119 1261230 1282586 864028 1409894 1204182 937824
16356 937824 1350495 1102596 1038969 1229842 1077131 936648 1182857 1143549 992885 657279
16346 657279 1073322 1342442 1084501 1377050 1206339 1279673 1221834 996132 1275679 873938
16336 873938 1135574 1039639 1099947 949783 1249773 740822 1130424 1145984 831253 1225182
16326 1225182 1106263 807660 696823 1066513 1110630 1058519 1233858 874052 810890 1057517
16316 1057517 1008278 828297 823226 868288 980671 1062492 782356 582730 766776 1041248
16306 1041248 1011400 919148 765933 389273 569626 904393 912782 920961 743870 727361 796702
16295 796702 1079311 856857 736327 955863 581587 918547 655235 919791 741352 531034
16285 531034 754577 810662 974217 516224 732359 830041 522303 926495 718263 745950
16275 745950 744690 789681 864879 789287 840467 749256 793492 532391 850280 672081 816518
16264 816518 553824 679222 716846 517443 746238 887230 676349 663205 768960 705833
16254 705833 805797 697069 482027 724494 504048 886859 469046 536808 516512 601013
16244 601013 677968 434113 833973 592936 690774 912141 655711 596524 633454 589355
16234 589355 730997 816045 539470 1002544 653227 621099 538154 781310 620483 511229
16224 511229 646747 609719 831105 94279 879439 715756 656245 532575 582476 878718
16214 878718 552658 632247 467257 439621 494546 264521 106033 559078 734166 423033
16204 423033 664289 440240 612814 645147 294677 816156 697118 604455 496093 702023
16194 702023 418419 121478 511148 476661 461260 526639 316831 515097 537425 497036
16184 497036 410758 325924 296351 209703 514272 415407 364352 663020 259224 170762 573400
16173 573400 460224 397863 638258 594125 691392 278276 586237 721385 193925 402221
16163 402221 493155 506084 448159 283193 652652 613516 315312 667181 147954 307892
16153 307892 531854 404218 634776 112861 377943 437544 223715 324707 130026 441237
16143 441237 347119 134530 373681 146093 356927 763212 372766 520232 536395 131853
16132 283922 387076 255395 115593 469136 304668 281617 115161 374430 561178 491860
16122 491860 347247 429697 227406 161237 -119593 24033 397779 176525 -5417 551578
16111 279428 104807 612751 382667 485401 209764 201089 -166041 512530 581301 229491
16100 111285 315381 179243 11660 277998 192387 259211 665330 103612 48662 398068
16090 398068 120864 559700 224480 486092 480688 332693 166386 219687 422688 437155
16080 437155 382242 227104 459533 278898 291941 216496 24864 -130624 -157122 111936
16069 345467 249170 200666 312832 178799 -172896 416775 162048 228741 97595 130130
16059 130130 80796 358027 58865 454788 277227 114563 -185820 158061 288482 195430
16049 195430 277630 -36739 315116 16799 355765 114767 242783 228747 374205 91669
16038 221748 -38390 181305 397318 -5747 -75151 208538 311166 362182 81581 8326 229711
16027 229711 200180 14370 430558 58233 83691 106072 37686 307206 152759 152707 250106
16016 250106 314096 296940 -6976 183938 145243 177529 76228 133572 530035 242218 56429
16004 65209 22396 -163727 148435 -75408 -13622 567496 168545 38393 -23322 35327 -68678
15992 106001 340011 109521 418692 618725 744011 774815 1125412 669590 786265 279513
15981 473322 179179 -26227 -188198 -11475 319767 -14454 -84903 153075 -43551 307974
15970 -102776 124413 -82191 -50052 417878 217810 181795 76228 100341 306255 269096 67991
15958 162869 -122379 53792 -137106 11360 -98619 -81089 153693 -121724 304876 397668
15948 397668 236981 65745 -122119 -14316 23910 55579 -34919 -230447 77246 245219 62195
15936 149717 30658 168727 -288512 -92281 -24705 346456 97688 241360 -74841 293039
15925 -228085 127438 364966 281726 148745 -4741 222653 176383 -104575 -48648 -232986
15915 -232986 245156 -113548 -180045 49539 184869 -250536 -319744 239185 361730 97044
15904 9953 227038 -103398 -173316 119722 -54873 62412 96399 80147 171836 165003 193484
15893 193484 21952 -69183 -158612 283449 -41136 5993 93992 88879 157489 79853 137647 15884
15880 60761 -315571 20335 -39030 -199622 -80768 -193427 27894 -115369 -19009 8882 190675
15869 190675 81091 -96878 18996 152087 -13244 -152916 180965 -80976 -212398 157501
15858 33195 -129002 7625 124993 -23028 24707 -369819 333649 -51737 -42248 50147 253520
15847 253520 -329008 -251012 -27830 -107359 -50229 330566 -23467 -166496 407900 77851 26990
15835 303997 57081 -357817 -160375 6990 -246845 -20423 -422185 -131409 90660 171044 -178738
15823 -8456 -330620 33527 26229 -165948 33034 -330426 -291380 135285 111509 159084 -215508
15811 67743 -181544 270278 107586 11322 248432 26672 -131821 -44476 351379 -184629
15800 451851 311325 -80267 -73874 264698 -13855 62658 -161643 290850 94862 -22337 117454
15788 -214905 164142 2274 -17034 -94607 297486 45231 160352 149919 -231179 -9388 -173210
15777 -173210 165885 53116 -103965 150408 -153761 209116 -103280 28335 109712 77584
15767 77584 -364236 -166162 -347193 -55215 -260154 -13064 -233845 -77915 451366 -119870
15756 61089 31916 312400 -14235 96983 -84149 -142215 151294 97459 -74099 36071 270844
15745 270844 65656 31084 -218300 175741 41667 197993 -64384 105342 -172496 -263649
15735 -263649 159112 17084 71257 160689 163375 155986 5768 -202289 27215 80000 9286 88870
15723 88870 24817 -123993 -127839 -39137 142399 -211464 40016 113214 -82938 139320 101354
15712 101354 38856 214264 35561 -212790 -11694 124852 -99462 16967 87945 -255154 -284742
15701 -284742 -132898 -47399 188527 -24661 89347 -155031 -183067 293343 194054 -349848
15690 -131675 270731 6925 -138247 108377 205816 -276463 -211889 -193710 13307 154897 -158612
15678 25421 24036 -160095 -216933 54312 73572 81133 65333 253482 -292764 114916 -324713
15666 27893 -123116 115185 -102523 -72424 74597 -66901 375267 32048 15910 -182635 -238980
15655 -238980 -135185 61607 233147 -107834 -418341 74859 -15046 -195855 67888 -284424
15644 32677 124905 -223032 37428 -44167 47170 -175079 -73157 530597 -175951 115918 104838
15633 104838 -229039 -74703 -81263 -92173 271744 75626 202882 -59512 68953 -143964 -71185
15621 -113172 4653 -202028 -170291 277517 -66922 104533 2079 255604 -339153 -123533 -6613
15609 -102755 91094 -102001 -52021 -252797 511196 -40371 -31710 16619 139999 228024 -2311
15597 -37070 -65049 -425370 -46168 -244186 76901 81224 -109145 5162 394724 111753 111755 -39487
15584 101224 -33217 -39601 -37614 -107174 71549 183703 -8268 106663 -153871 -110817 -5550 -209095
15572 -209095 -343160 23481 163098 -27746 105907 176784 -474056 163467 29021 93501
15562 93501 -233329 23766 -27034 128801 -237581 -240765 -172614 -96933 21724 -252587 230837
15550 234918 130278 193279 -14939 -128495 -148929 139303 -132647 62175 32471 -319836
15539 140051 170202 49730 -70191 -54717 152557 219495 211778 53086 46872 338793 -14136
15527 56026 222374 -154385 48109 132786 34388 62473 -318243 85434 -286238 -122678 18974
15515 54185 26759 -129863 -294909 325335 -124999 -61601 -112032 -202360 -59341 -90089 -163129
15504 -163129 -62432 -146460 89029 -129879 17202 -171646 -10409 306575 53114 112155 331649
15493 331649 326216 106229 -295163 -297600 55707 -91552 15631 78508 -190808 13244 46421
15482 46421 37794 143020 94352 25280 97456 170298 -17556 82373 397283 112648 53473
15470 58082 289418 -165698 24233 254962 30105 -22169 61430 -148229 68574 12298 177015
15459 177015 108824 -114274 -328663 94649 -138309 -5373 182578 15724 -70505 184050 257786
15448 257786 -27119 235558 294711 268892 259915 426273 167593 250979 252372 177508 -126783
15436 -28808 306139 191547 119786 50922 -147718 68897 -378515 -133570 220346 -40081
15425 -88479 -112977 -244604 -48331 85446 -18059 -35212 74206 -45965 74118 -183562 268075
15413 116878 103546 -207555 -370549 -203866 148235 72448 -349243 -554780 266877 357052
15403 357052 213673 -33400 -182891 38918 92258 -213354 -296344 -201602 -58082 -119813 -1087
15391 47084 -98244 229708 311972 239461 -34635 147609 95424 -444466 -184276 -56036 -11527
15379 117395 -106379 191302 220743 20449 68168 25470 -50433 143948 280368 179877
15369 179877 184471 259003 -242725 -108627 220828 125178 272257 394475 14377 84093 231459
15358 231459 -120461 299955 236548 252801 215806 198418 9818 136206 -103221 -236024 28272
15346 -181918 231957 -252492 99059 196105 228608 433071 65740 247288 245216 132359 106026
15335 106026 -4950 132007 -18423 216391 89938 -60804 25537 50124 -3068 179972 320324
15324 320324 -4894 69570 62688 -246700 71718 406148 156619 -124551 179975 213582 218354
15313 218354 11714 46602 296841 -46071 177061 112161 290254 -165147 28341 232097
15303 232097 257842 29029 41661 -117768 -178689 138420 -65981 -59730 104405 75416 -18320
15291 73756 -171737 92435 -7572 -93233 -184167 209762 272947 45185 -78301 110992 92518
15280 92518 250048 -130857 128245 -25839 -47765 70925 138727 -72372 -19462 -184773 -180139
15269 -180139 -32196 -196410 110553 -3463 -15634 429479 -91043 -91077 149 37008 5605 166218
15257 166218 -168425 -52787 88052 54322 237342 -195904 527190 465483 294285 1186457
15247 1186457 2153327 1596317 1641075 1349808 485133 567554 -22180 294500 -46566 453074
15236 313888 176927 6643 108509 -159967 -111481 62827 -207625 187484 177223 -64775 145427
15224 -64608 -39603 114773 391208 108067 244643 204347 -88852 26513 111498 -10195 -126877
15213 -126877 -82617 52220 20741 12099 182370 204233 196109 156740 270487 202049 8251 30806
15201 30806 -72840 -442472 -47179 113035 49509 -180813 291504 31941 249770 260717 17554
15189 20980 -38721 25815 101473 164769 -140820 -308735 23485 31812 -49173 -20698 236097
15177 114564 274787 232164 -159050 -162707 -54613 86144 -121824 175113 -31066 4050 -46453
15165 183191 74572 -143472 133454 -66733 23206 161945 44083 -102108 81004 352038
15155 352038 48040 38023 -210689 -150655 127184 252763 241608 21128 -260471 70912 -235667
15143 -120244 117112 220935 -135854 -12705 200201 51879 214002 28119 220275 21038
15132 223810 -48593 188642 -125479 297280 41867 100553 -102112 254626 136941 130288
15122 130288 258455 63664 92737 193708 237266 225308 140147 178502 255320 143476 82700
15111 82700 25777 222360 -86370 278161 43313 43212 312416 211106 -5400 339026 195695
15100 195695 -42121 179602 118442 71279 421593 248414 2757 -5496 -13469 69918 89361
15089 89361 52552 401031 295202 115691 -118492 234059 250157 51611 308898 226330
15079 226330 262420 338428 -95490 36516 87530 344066 -5099 283166 117991 181113 -46729
15067 105721 -58094 85489 77127 -208622 42738 107885 86493 361767 -209033 394638 438536
15056 438536 22106 319912 68730 115041 176508 127657 256884 464975 288921 120290
15045 -114890 -75784 390057 -54172 464632 -52306 228006 9526 384603 107939 459423
15035 459423 -49615 -3434 219787 397744 84027 310345 249531 381577 461955 294362 608608
15024 608608 439042 334648 579416 422752 80852 189636 385432 309801 137397 96437
15014 96437 374603 1233 486945 119756 251576 144471 -161703 591926 500812 144776
15003 124916 189842 148493 328248 37160 301731 302817 238554 494366 181569 312066 424124
14992 424124 199827 473042 226753 245477 392721 118029 85704 193547 237224 548347
14982 548347 319316 392660 464281 633835 527670 716502 540423 539955 297689 557898
14972 557898 228585 453592 592656 419106 436864 523635 484446 -168779 255350 401803
14962 401803 441360 452180 672453 336732 543669 504166 413584 657967 494169 346731
14952 346731 345883 133899 274888 441599 296610 476907 466389 271517 560105 595825
14942 595825 466895 -36026 316937 303950 573641 405710 489754 567665 357864 412416
14932 412416 624002 791736 632482 385165 792644 1131044 831971 822932 881397 890782
14922 890782 836282 1091997 1318675 697234 944562 972646 1149615 963694 1047023 945015
14912 945015 670629 627224 526713 275243 394523 568152 645040 283511 235311 512598
14902 512598 636137 609816 -96452 168702 56065 259369 162954 324376 138947 172165
14892 172165 41298 432224 374795 453533 437748 368610 291677 552238 487585 714890 472353
14881 472353 152893 384314 651491 174525 221777 666085 483295 297686 240406 134248
14871 134248 455717 193558 391138 313658 721527 679461 384781 525587 140942 321224
14861 321224 567369 411996 427491 299757 330207 368687 228782 400207 338224 289133
14851 289133 396293 163061 304575 266094 343612 382587 383796 457550 552355 739609 441675
14840 441675 550897 529587 857905 688897 514914 619985 247960 364539 416503 344265
14830 344265 608343 287969 593516 631208 292040 258669 234144 318401 367237 612428
14820 612428 1030085 515310 712264 408463 691408 456171 436115 385254 548747 126951
14809 197190 509046 502912 351393 383290 925400 540927 531240 593437 650051 947206 332444
14797 569210 332690 430275 483887 421205 308449 616025 621221 720620 337575 597016 620897
14786 620897 633579 634017 300679 428099 669309 581789 258969 643275 243867 594525
14776 594525 -4839 447734 661951 661763 682244 458659 594441 420667 487575 889812 548232
14765 548232 670906 652231 731649 757333 681503 457301 520065 473128 421145 597180 551928
14754 551928 458402 609221 1023922 611165 562821 536955 434231 568406 859065 354845
14743 582492 772620 624986 876952 758608 688911 443367 731654 648364 978240 499487
14733 499487 705104 547256 810872 730413 838029 570196 818899 862068 697809 749275
14723 749275 977341 1074787 1223099 995747 630522 960850 985180 804102 914458 361801
14712 785087 683792 832224 909269 936114 1066076 569700 1032385 810419 1085715 1036724
14702 1036724 809438 991410 599604 1141194 1031093 1115123 937907 1267966 1179917 939361
14692 939361 997728 861802 1074831 874569 649277 473398 637971 851791 1005115 1024540
14682 1024540 692050 895989 800027 1103835 1087306 926267 930538 973928 538764 1073206
14672 1073206 908214 762178 633266 826463 891104 626301 906384 861863 939873 786500
14662 786500 773021 901787 846247 943803 1094189 972462 1193635 768235 664985 954850
14652 954850 973263 1185554 1170722 1266975 822274 1323966 1172121 1193709 858851 965749
14642 965749 1065411 986748 1122244 890013 1120739 1028711 1165610 1022430 1296534 898328
14632 898328 937561 796049 1212542 992173 1482975 1277826 1286485 1092126 1073529 1296204
14622 1296204 1005907 1173709 788907 1490424 870421 1427827 1161741 1181862 1683035 1430963
14612 1430963 1568863 1514168 1330295 1063834 1565345 1330083 1241646 1354613 1313097 1396030
14602 1396030 1480517 1271152 1693059 1178428 1285148 1428514 1624686 1344060 1692826 1510233
14592 1510233 1683292 1582714 1285069 1652918 1748329 1752328 1926016 1616509 1323557 1807343
14582 1807343 1472834 1783563 1801075 1673107 2009024 2020690 1789247 1524410 1807449 1812094
14572 1812094 2333440 2062136 1897519 1818304 2184074 2124460 2037529 2131230 2299726 2083981
14562 2083981 2591616 2252028 2699933 2337421 2397690 2796555 2858753 3060079 3529450 3666903
14552 3666903 3602933 4653394 5357059 8028493 11536995 18062568 31067968 37523889
14544 37523889 20622416 12483310 5978049 3621944 2256937 1927473 2027709 1528260
14536 1528260 1861012 1666894 1906310 1788719 1830461 2131003 1793613 1665856 2241333 2511816
14526 2511816 2185856 2141481 2103424 1831439 2291319 2002319 2212962 2191059 2572056 2401528
14516 2401528 2335842 2365581 2402097 2305345 2417137 2582875 2532513 2617958 2452311 2483282 2637682
14505 2637682 2699551 2436556 2600163 2763513 2956792 2903024 2592799 2666181 2948716 3099087
14495 3099087 2924241 3122330 2901456 3055735 2939859 3337342 3303082 2991268 3172212 3507221
14485 3507221 3299574 3568590 3354870 3258498 3722735 3571839 3651634 3624505 3885565 3524354
14475 3524354 3658393 3757993 3897911 3757071 3578048 3782121 3906053 3865320 4318143 4240354
14465 4240354 3889011 4420893 4258253 4004611 4119349 4004719 4235402 4274121 4636801 4469696
14455 4469696 4704203 4540039 4627424 4404529 4437790 4888983 4877214 5038057 5339729 5122293
14445 5122293 5093428 5246903 5117351 5273780 5400319 5373552 5385591 5478592 5579290 5714153
14435 5714153 5680387 6108374 6286658 5969011 6032139 6187082 6101170 6184170 6530946 6416686
14425 6416686 6699272 6842142 6936425 7056666 6953467 7363047 7464834 7721493 8089883 7681675
14415 7681675 8241264 7998750 7934694 7930378 7936559 8228205 8456279 8746387 8761473 8757491 8866882
14404 8866882 9302664 9324854 9629180 9598491 9651470 9743267 9890052 10125583 10138537 10314817
14394 10314817 10623780 10602477 10727549 11164272 11358393 11589808 11776212 11925590 12241026
14385 12241026 12652136 12596253 12850548 13015302 13256013 13808703 14040849 14028300 14336316 14568214
14375 14568214 15103493 15099985 15261709 15597971 16035833 16289224 16504460 16902432 17163991 17816774
14365 17816774 17868136 18760102 19116604 19439192 19442550 20055216 20141835 20829786 21305890 21726809
14355 21726809 22381091 22865047 23436880 24026841 24596966 25069722 25560923 26501092 27033624
14346 27033624 27583826 28658158 29080885 29896654 31097430 31774678 32312496 33615799 34209688
14337 34209688 35097870 36218023 37273810 38139413 39479783 40811139 41943087 43625760
14329 43625760 44904033 46084610 47683459 49357435 50770793 52556629 54582204 56271930
14321 56271930 58016141 60154109 62144492 64286211 66920920 69518802 72275018 75142033
14313 75142033 78137008 81157256 84344708 88051741 91872591 95570222 99733589 104163527
14305 104163527 108850831 113548435 119010354 124698978 130274608 136714734 143555426 150038077
14297 150038077 157558587 165034881 173285499 182012262 190690995 200427904 210247656 220766426
14289 220766426 231609150 243045974 254931688 267258131 279946544 292980640 305940497
14282 305940497 319338099 332272199 345365298 358401704 370798317 382244753 392529967
14275 392529967 401723563 408755389 412494184 413236725 414062509 414857625 415275513 412815630
14267 412815630 408724758 404124538 396340515 386422246 375079527 362360507 349043325
14260 349043325 335392566 321219021 307308314 293075680 279320490 266103242 252994559
14253 252994559 241725264 229987563 218585323 207655748 197469002 187604521 178353449
14246 178353449 169915945 161629781 154412668 147097344 140155191 133582379 127394099 121758975
14238 121758975 116563138 111838441 106610711 102004882 98014898 93806607 90308614 86837235
14230 86837235 83476504 80031235 77167439 73685040 71042199 68406857 65959416 63462444
14222 63462444 61352585 59055466 57585593 55547385 53657471 51489532 49978048 48516967
14214 48516967 47064881 45734123 44306826 42947172 41949390 40323008 38904755 38778438
14206 38778438 37600707 36506498 35210021 34466502 33545425 32622883 32070157 30916221 29845161
14197 29845161 29067742 28308475 27590961 27218499 26389355 26054406 24980588 24768896 23875958
14188 23875958 23653267 22964558 22409227 22069938 21552611 21063564 20374832 20247241 19788485
14179 19788485 19068327 18843663 18165767 17830057 17677398 17010661 17074723 16556777 16547991 15866746
14169 15866746 15744357 15095390 15282551 14992667 14292584 14252549 13714756 13716502 13495203 13424800
14159 13424800 13008078 12912973 12487302 12386601 12082353 11840900 11589545 11569781 11256782 11287276
14149 11287276 10931471 10875380 10741108 10692925 10191517 10436870 10001462 9886888 9735790 9581057
14139 9581057 9522991 9263794 9265803 8985348 8914979 8731328 8520804 8802196 8295544 8134565
14129 8134565 8095545 8095992 8169781 7878393 7738681 7515602 7617290 7308772 7243929 7273593 7267286
14118 7267286 6995733 7054934 7223733 6664523 6559733 6634145 6259967 6388627 6113155 6305849
14108 6305849 6610925 6074552 5992620 5801007 5984568 5431220 5659496 5712521 5781041 5354347
14098 5354347 5462822 5558286 5458908 5477580 5304007 5374362 4788410 4990739 5096774 5044742
14088 5044742 4881416 4956078 4924473 4921620 4686679 4790481 4377001 4201234 4541247 4406513
14078 4406513 4200437 4508792 4319226 4590652 4069725 4058939 3867217 4051195 3971602 4105781
14068 4105781 3839597 3764369 3931265 4074026 3989364 4225240 3756984 3807408 3794236 3704411
14058 3704411 3526282 3429633 3611463 3542967 3410682 3407266 3330354 3526255 3207433 3128607
14048 3128607 3134010 3222457 2866220 3111600 3087265 3182344 2944942 3061524 2876930 2918552
14038 2918552 2884136 2869111 2801622 3255173 3099012 3116852 2712183 2810814 2804564 2801093 2908940
14027 2908940 2632096 2647856 2587980 2625066 2334876 2554860 2326786 2496932 2398425 2485208
14017 2485208 2591833 2153052 2674493 2022342 2407158 2377260 2072011 1855101 2235890 2428077
14007 2428077 2233066 2206816 2022567 1946026 2047683 1965988 1920378 1929669 2019579 2412146 1909253
13996 1909253 1988594 1833091 2371809 2107396 2105415 2341221 2586879 4029450 6628904 11365625
13986 11365625 22421257 37410633 27125037 14623455 8909103 6101567 4957607
13979 4957607 4099399 3594034 3231444 2943092 2891149 2714896 2432594 2482107 2658910 1897369
13969 1897369 2163593 2183313 2238670 1964617 1948874 2176910 2207667 2175051 1798771 1939218
13959 1939218 1825153 1850129 1839529 1920810 1756338 2052130 1583577 1809034 2033797 1885996
13949 1885996 1817729 1933409 1496433 1810539 1935225 1252910 1765870 1575444 1715951 1843577
13939 1843577 1766955 1886562 1509593 1585408 1778314 1751222 1429162 1460587 1620191 1718588
13929 1718588 1592613 1633924 1402252 1873142 1462832 1680953 1429253 1352967 1350570 1415032
13919 1415032 1631263 1714723 1414905 1474451 1349963 1137760 1405033 1201678 896026 1480638
13909 1480638 1482289 1247488 1658393 1368054 1192885 1311783 1048610 1622877 1374197 1352727
13899 1352727 1091442 1416169 1086710 1129388 1535913 1361422 1300648 1257064 1055130 1039939
13889 1039939 1473838 914850 1113768 841845 1187432 945616 1257594 1077074 1144373 1212500
13879 1212500 1293337 1033732 1020714 683494 1003793 1152722 982085 1011926 1170597 1081522
13869 1081522 1029602 1011574 532928 883399 1209983 977140 927794 871358 1078074 841997
13859 841997 1066589 969868 907390 1014501 938061 872351 754862 661568 780681 767430 961547
13848 961547 899969 1004248 1047679 1056279 793620 703052 814405 1198425 803274 1183069
13838 1183069 895112 933400 848293 566003 909495 885891 776742 1103047 1014438 736614
13828 736614 526054 492225 945073 1076928 814136 670979 972542 783971 651127 1074195
13818 1074195 1142757 808906 888701 818915 693690 781217 863681 500813 528376 724880
13808 724880 951380 840612 490495 644262 281942 879472 729382 713009 731809 803963
13798 803963 643896 827268 757185 616898 802452 576588 883663 502071 826829 655171
13788 655171 631717 609243 728591 1015529 602500 448229 763884 303950 591926 585256
13778 585256 822815 511881 601752 765720 571861 508854 688393 843095 422002 661909
13768 661909 631754 541838 982197 681818 635272 565743 523429 928819 356181 625486
13758 625486 363449 739209 555188 411959 698076 746195 434315 442681 758902 432202
13748 432202 442409 863128 760542 393580 528669 633236 543229 912846 681941 446265
13738 446265 494088 691536 586834 388845 532094 568829 559237 427431 321442 569856
13728 569856 543012 550981 470185 552998 588466 373708 699927 568904 629711 588644 662729
13717 662729 614354 384009 357981 457027 642175 118653 569741 488730 609957 379224
13707 379224 463303 620039 553000 662925 230456 621034 110044 425612 295464 254266
13697 254266 426152 319383 765817 610646 461857 463115 467566 383073 330918 509844 554796
13686 554796 120057 617083 358530 478002 522578 595820 595024 453935 544645 585675 736672
13675 736672 721846 253072 320816 471486 552767 5534 414635 763766 504877 607749
13665 607749 397185 455624 508120 443535 520358 487017 362774 193292 659589 241279
13654 349637 592211 450326 427183 369204 191125 269980 644864 439600 669909 208439
13643 340507 366353 651115 252446 353975 559795 424972 610545 481498 539117 260430
13632 482702 351353 462295 371793 286094 578497 441847 255453 420235 344870 415321
13622 415321 535388 -8640 437556 455610 401310 340972 513009 272926 193044 80614 296400
13611 296400 413626 417815 424948 448208 484827 503273 565790 315995 54539 201643 346700
13600 346700 209042 411216 643219 364224 105667 208663 273324 584149 343971 376823
13590 376823 555588 140042 456223 352707 279988 470093 150205 516036 217679 181225
13580 181225 430613 292001 360918 562377 196571 111236 401405 305178 357343 398809
13570 398809 275282 159486 297929 308904 304492 34004 363060 -44130 289954 305609 162554
13559 162554 210721 328381 447079 244640 -10996 207805 458627 28222 116389 416108
13549 416108 118124 422037 232404 517813 337995 53467 357509 -15136 162873 305862
13539 305862 313623 247018 259794 120488 9640 368390 411195 279131 86859 479883 495846
13528 495846 314865 393262 278000 195366 114743 109600 333528 482803 111464 142574 435775
13517 435775 616041 435960 361291 198105 34907 75064 496734 236930 304504 144235
13506 508020 336466 376441 341935 269072 208920 371719 -145559 266732 278202 272056 329912
13495 329912 19051 375165 89106 203503 222119 136471 119197 360654 15228 56695 -31661
13483 184092 601024 393901 98841 228964 404923 42060 231111 365977 198351 20733
13472 63775 175783 141094 399390 340265 200859 207735 427020 614091 111054 489418
13462 489418 16665 175148 266426 242370 246490 186456 160889 470963 191112 71836 373066
13451 373066 157750 145968 254755 -114791 215362 546952 130668 211885 147418 -159994
13440 51014 128511 -265700 248861 114691 363810 -111021 343422 -89646 35221 232978
13430 232978 285427 301152 49039 359814 141265 394579 269501 57939 -114298 290536
13419 394470 167819 452994 132560 355414 -88904 72434 114098 112713 186282 27359 112231
13408 112231 327568 211711 174762 405030 42877 84418 375551 -47317 223403 254577
13398 254577 190306 51873 382126 87581 232196 195973 203496 -192812 84023 145333 -22943
13386 200033 382319 157755 141194 333229 30022 219372 -272138 -117081 223781 429949
13376 429949 321360 198621 40264 243540 478237 -68467 516734 190573 295997 322579
13366 322579 367250 83397 -5671 69495 78265 385660 54495 -32663 148863 38739 327672
13355 327672 40920 42525 56018 10360 86054 190697 244069 78703 50312 679197 -237375
13343 87778 171381 505902 -187868 160639 484179 438272 178819 474970 96218 381081
13333 381081 235585 185859 48015 -93407 342930 368570 -17274 222052 -28997 173123 -83756
13321 -11285 90226 153710 -10888 241073 276938 -47408 62116 270888 -178863 380080 106695
13309 110718 343440 280096 504782 123730 240444 37275 -5117 385112 4889 -242179 169843
13297 282639 4513 300665 204437 186895 11655 74450 242131 230526 136343 154242 188257
13286 188257 119119 -98900 183589 -302361 147869 125390 121920 226859 21195 405082 89115
13274 233454 154385 192524 32381 170069 222838 206914 -47253 43332 -89868 9323 -28133
13262 -48512 192112 191890 159684 399866 173064 234258 -95406 5208 -165818 114875 -67349
13250 47360 36219 41583 -34561 32472 238777 187841 214754 320342 153738 168476 237858
13239 237858 -70355 379014 164114 -102144 -143162 -95937 167871 -157396 291185 544263
13229 544263 399431 103378 -8882 -143019 -193825 230290 137379 -186533 46349 307054
13219 307054 141792 181876 -192545 -41948 -61894 -82085 110575 132753 87351 107608 197249
13208 197249 -58340 249163 152774 105995 315272 109074 -133054 -68600 84975 103573 110738
13197 110738 19872 159262 -64787 95702 260885 233097 -364672 -201873 77461 -155025
13186 -87896 -304311 -55723 -14775 316434 294978 317225 116851 -7419 -183271 375721 -111650
13174 377661 -58325 87342 -162087 134574 229427 217151 110961 353943 -313047 -108285
13163 235250 213676 19110 -8664 304580 187373 274359 103890 89273 74741 138958 77047
13152 77047 11116 -207631 4183 71868 61084 -42151 203004 172947 70673 -84232 17000
13140 30571 48970 73673 -16598 31826 38662 138654 71739 -241472 25897 25764 34319 -137592
13127 -91885 15227 228074 158085 466030 -419112 -75035 103932 -67628 159559 -13286 -60148
13116 -60148 -17901 -126170 300580 153903 71266 -119517 154495 305051 247182 279751
13106 279751 -27530 -156746 -147729 364600 64193 -72539 7552 -249812 -94666 382420 -195063
13094 576487 89469 121963 -98619 122603 -73737 8391 250251 79590 162446 196698 130466
13083 130466 33727 342700 155039 -113600 126311 90009 140474 -5691 -190175 -134559 31294
13071 524805 239725 -2729 256446 292036 -272117 -127417 -207091 63243 -86535 -45087 -3877
13059 327282 37874 -111910 166498 -377355 157301 -68137 46267 116873 85126 -98201 226906
13047 77013 82853 37685 -84766 142051 277552 98109 -226873 167087 259122 124551 120024
13036 120024 -139228 -141644 -272906 -139543 379755 66063 -134621 97105 209327 -114792
13025 59404 -46008 113371 54434 45384 12166 -74582 218875 286272 141339 -34100 -23479
13014 -23479 -18759 290339 100332 248136 261173 -209624 110945 190589 29849 -119770 -186703
13003 -186703 65062 100147 86454 358676 -594772 39412 24164 -41800 -178110 -75182 287404
12991 -162460 138759 -100860 106246 -44113 86742 252386 23815 110188 183653 173577 249778
12980 249778 -69964 159068 -122872 153000 -124152 32091 234928 -195977 -33735 170122
12969 136586 -160395 149225 236987 -164596 256801 -81694 -455937 112027 -31508 147651
12958 -167152 -120968 52359 122978 -56160 -157346 -259930 146083 -74716 174557 -459549
12947 242302 -93297 203160 84543 -521169 188153 -73814 402668 -129498 -83283 109974
12936 -166381 68852 -116959 158724 -87803 257829 -97514 -202177 53112 -65452 250810
12925 -19362 221498 -54429 151655 -108048 -102420 -77961 -21958 -134348 253112 -81383 19893
12913 25063 -176396 -148092 -35708 111605 -176870 -196910 173290 -60852 -48302 144108 -224649
12901 121985 172977 -111400 -558650 31680 353064 145320 -110078 -295672 25405 45620
12891 45620 -193341 10756 58289 45963 48975 145881 158859 -235938 134404 137840 101769
12880 101769 -127380 196508 32183 126828 89738 -166060 -297983 -155334 74251 178453
12870 178453 -62431 1780 293718 -383707 28704 2057 288931 39668 94128 -178800 -92132
12859 -92132 -91356 244482 229469 489118 -280563 67599 -9996 -213914 236454 225387 -21678
12847 169639 112152 53281 146580 123255 224676 206656 208734 39778 -196281 -152425 -66926
12835 323838 -233633 -304505 96864 164339 13340 10461 67244 16000 98291 304937 188912
12824 188912 189049 48980 206145 -78043 93669 -48324 177854 -63016 -256295 -154605 335961
12812 -22951 121581 364069 23748 498942 281898 -325630 -69577 7565 168147 -59425 55436
12800 114976 286732 -46509 78669 -122843 -27252 182448 115042 -208176 348348 397039
12790 397039 148125 -9629 -78189 14405 190326 246002 -223391 -119713 -365397 51546 -37094
12778 66623 178841 -471288 316746 -51631 -3188 97191 77118 -101577 21319 -169974 -203405
12767 -203405 105956 -46452 23709 110859 -33360 -218878 -123202 -126419 -150147 182285 -164816
12755 -3497 102551 66226 78766 -253442 -213852 -179938 -86383 -127960 -200093 17855 -114955
12743 -218279 281970 -129781 89645 -57800 -280529 -51353 -92380 110457 104864 94538 -79344
12731 -25314 -514070 237185 73255 204584 183463 192234 -127876 130738 6497 49868 -188343
12719 -4803 -26967 227374 1749 -113499 19688 -86687 -5524 423545 -27486 -146411 327596
12707 169133 -50305 -157374 168734 24044 251604 -315210 -88411 -395 -64231 214979 59151
12695 -86708 -154905 -161828 32818 -78104 27606 -19546 -362356 -2102 9128 170443 222571 129457
12683 129457 -83828 136643 -132825 178731 450769 14421 16510 402639 -61899 182797
12672 65885 -89175 -142091 -235254 -192810 164753 -13649 -53071 -105702 7434 71244 -150488
12660 -87362 184255 -129670 -115161 -268251 -9563 -46307 103929 174793 18529 47880 -39638
12648 183122 -137900 162553 -90941 61162 192457 -289616 212001 112778 208986 120720
12638 120720 -95926 23782 -60642 110745 333136 114104 38675 132251 526034 285723
12628 285723 175750 8238 -94224 146683 119509 171682 90287 105604 -82601 105548 -383576
12616 330343 -227720 -47711 86038 -218966 -65137 6025 -197353 181280 -206415 -25526 -35572
12605 -35572 -50320 54726 -195510 282059 17758 265992 -105699 18091 402204 33056 22085
12594 22085 -175525 -6380 -153018 -125111 284717 238111 254892 122344 -74468 113006 -192530
12582 168348 3502 -93436 -14583 -108519 -103126 84893 -143942 -282984 159450 72416 645520
12571 645520 -173496 43875 -92533 121648 138802 164681 -65683 -218781 -190142 125453 228926
12560 228926 494557 -185655 -45584 -125852 387663 364296 184888 20329 165079 -49022
12549 141403 16012 -77953 -67283 170228 166027 38612 -71064 1140 -304983 -59884 -114217
12538 -114217 50620 161027 -109468 111458 -169897 111465 158458 181377 -60306 -22577
12527 -26033 105825 -79556 33596 148115 -200224 196209 -53402 -5612 -37435 273704 -15800
12515 302279 252602 -32318 243929 -215201 49563 -120952 65489 -120677 48506 48865 -219130
12503 -279528 271717 346482 -95180 244594 38257 242171 -537083 90708 -127119 -28968
12492 -153747 83169 -51939 -185161 2083 -24412 149267 -89241 -266344 -113994 -153721 -373858
12481 -373858 91251 58962 197935 -92310 235628 180463 -117165 -197844 -1370 -106916 668
12469 -299048 -214922 102824 -139776 225194 30113 -7780 -303317 84813 -110909 -392311
12459 -392311 2661 -34463 -130650 -144104 -83848 16840 147861 216782 -390287 -410246 -49639
12447 -111651 213628 -20680 127501 109962 -213917 144488 -177772 -140455 327553 -77749
12436 59586 -114650 107536 -92283 -394851 331272 -135065 7256 -92975 232633 35147 -200457
12424 -215604 1742 -160282 123398 -57584 35510 140326 132788 93433 -246406 -194856 13994
12412 171933 19502 8043 -59943 178826 227781 -143939 179157 -155981 29234 116451 38417
12400 -181307 -10638 62146 -69164 -253617 11255 384889 -20949 -262965 -63788 -350583 99679
12388 119440 26767 32726 24414 -193454 -366146 -176485 109020 -177789 -42846 194416 77315
12376 -37912 -47428 423997 -17938 257907 -258841 -148644 -155094 -144862 -112959 -180305 -7295
12364 -277743 100119 -111782 -46547 -90851 -48646 128484 24424 -36340 39152 -201223 90428
12352 -127710 -53215 124321 12126 76484 -195215 85603 -110968 340681 42929 -51668 249378
12340 -95488 -35435 166037 -199296 -38517 59439 176349 192785 127441 -171252 -130265 57829
12328 90946 149035 350516 -206342 13213 17870 86054 -362358 110894 221184 185046 -5508
12316 -73617 -204064 14491 -66816 -158386 -106494 -375508 58475 1099 -66245 -68119 -177604
12305 -177604 -355445 -136332 -403242 109653 -153142 93788 111751 164904 -186288 22021
12294 55793 -83858 298260 -50222 103721 -339135 -180085 293799 -75660 -174873 72868 321370
12283 321370 194008 101464 7078 94062 -17953 193813 -734 37470 27956 209268 -13343 -266601
12271 -266601 -130004 126722 -228345 70101 -91730 247650 136056 33297 -344433 123567
12260 179023 -96456 -271341 -152651 144248 276015 152089 127700 131805 -258436 305037
12249 -63971 71476 -107246 60902 -202821 -192964 -230106 340888 -7590 55169 118713 120141 63537
12237 63537 -75152 36063 43290 5577 -262 9849 -60297 416925 19244 -185943 587452 346840
12225 346840 142902 321753 174678 -41010 165979 62021 -10913 -25774 26493 384626
12215 384626 -149294 100817 200317 67049 57820 13727 144375 210306 -71479 294206 160505
12204 160505 12157 130782 84978 91397 205853 235954 76640 125222 -30773 121617 9586
12192 478927 61186 198680 -150515 218962 259960 45257 85794 88904 157106 152446 216470
12181 216470 -120009 -254048 225230 141406 155806 -224194 79330 137302 174810 -383997
12170 111320 -49324 173601 -170338 64085 87559 130989 46108 251994 -45113 104861 109992
12159 109992 67694 174813 25674 -202030 188440 83005 -102817 368978 91697 13127
12148 215044 -232134 235313 -703 168219 121994 238870 -122937 6734 47049 326648 -164877
12136 166491 4385 130850 155267 65858 -334938 -16338 72753 79670 334545 34048 131801
12125 131801 283513 -193202 -221673 62507 -176829 98562 -80441 171397 203582 192383 119259
12114 119259 79814 236005 34477 1345 -78928 25184 176777 248114 -266522 -1334 145663
12102 38790 12630 -220933 -217873 98385 -57066 104000 -217952 25550 -90851 -153889 -2969
12090 212380 47124 -73142 44729 -8971 -25789 149932 -436857 -76944 264874 -311740 69670
12078 385331 189631 -118203 -330799 476473 -146815 -180597 346437 32393 -48619 9803
12067 60093 23177 -304223 378380 -212893 387636 154852 789906 804916 77505 241259
12057 241259 -397918 182095 -13970 -81411 42313 -336095 -128770 -295906 -57688 54464
12046 -254017 193693 219250 -177809 112364 -140739 -95874 -144986 198830 181913 205267
12036 205267 -38266 -82274 215467 324548 36720 -6344 152026 68236 13183 -207680 99710
12024 273875 -231882 100341 -297301 9410 41177 -15794 83942 107923 -317782 33323 -49617
12012 16064 78289 -44210 281766 -114418 -447757 349081 53828 237775 72459 -61240 -228366
12001 -228366 159650 157516 -273732 -168562 49891 52713 165603 18685 245982 -296949 -179
11989 24450 108604 -171250 14135 -93962 -200694 -114160 -119304 -224268 -112455 -84007 70977
11977 380115 30311 -63308 236170 25594 -118642 -28413 15383 -276283 -131124 -59178 129843
11965 -93192 -53555 -175010 -256185 -191938 -141668 -145487 20232 -87428 27026 517 -162898 61458
11952 -30725 -439297 -9689 -92041 144397 -28584 -49648 -176997 -62500 -31454 -1844 32839
11940 287987 51205 -89779 152976 286468 158914 -124548 -172550 14442 -257372 7098 26970
11929 26970 -477475 -354122 -62316 -52227 73458 -320338 146653 -96906 106487 -127656
11918 78337 24221 -224987 338229 -100864 -144734 51499 82777 -149585 -166847 93835 -37715
11906 -84510 239905 -491727 -54385 131578 24915 -645889 178415 -158052 222101 -28640
11895 100102 -169848 -27065 30147 -113131 -36186 227111 -201614 222869 -434825 -1736
11884 82090 355221 -93205 -11313 213405 -147758 69856 24639 141438 -157400 149611
11873 -78258 -273888 -81763 80808 278828 -28725 54565 -82626 -16955 -135551 126430 -193042
11861 47498 103925 106324 93594 148346 300659 259775 224320 -297844 361156 -111963 92939
11849 175931 232956 -229361 35598 -247441 8388 -194989 -63255 18134 35466 -179410 153911
11837 -233446 232831 -112986 480847 -117265 -96384 -117565 102906 -1284 153164 -206247
11826 -170288 100299 -27661 2571 -163827 -51549 84088 -2258 -418837 106430 -321525 -100112
11814 -362352 -63145 83997 -20656 -117209 -88201 44797 -127360 -7518 149066 140230 136737 -277423
11801 153850 -160659 -69841 -76172 -312585 4781 252185 -84583 265942 -81930 29799 51066
11790 51066 248857 -120475 333162 193913 85282 78601 66573 -185934 -143821 302770 -255502
11778 3568 -187216 -274889 -240023 -450695 -341078 455283 -376174 -75579 -3016 -100249 -89961
11767 -89961 -186203 -120627 -85440 -330554 38803 20624 8812 220128 -414835 -22665 -207083
11756 -207083 15472 -94458 296054 230544 -17480 -309132 -178716 77660 90371 68888 -19113
11744 25036 24339 -48453 -186872 -123122 139276 -194507 121403 -50904 11217 -130116 -208072
11733 -208072 -134956 20793 167826 242090 100853 -21625 89495 112886 379900 238858 99799
11721 -115923 -249706 -83169 -261335 -355857 32340 -297761 171641 -74771 -226706 13380
11710 -160032 78635 38692 173468 -25314 45517 45604 -533149 -275910 -91054 -260283 46421
11698 -103371 173944 -117879 -135294 211577 -426123 290610 36166 -47818 -167516 133273
11687 208494 180687 359429 243210 118659 -162466 232756 -71644 128613 3518 -11706
11676 19506 -113023 -72298 83741 91458 128780 153073 -51454 29826 186865 320657 -18538
11664 93691 -222057 -73923 -34807 -132899 299157 78927 242183 85548 52656 -8110 88097
11652 -38825 -244494 46233 -103181 -9553 -97348 54549 74700 177613 -41121 -85243 146848
11640 -164087 213447 65056 112447 98857 34799 -107355 123844 -17640 -269570 40078 -11761
11628 -155058 -58492 -53576 321335 133963 158265 -24668 157119 102465 -109951 118042 -20346
11616 191169 175973 -307 -58676 -257589 192948 193153 -78888 -11639 97595 113628 86864 3780
11603 123915 -140445 -396742 60462 -43644 37744 168967 131243 11041 344234 -26336 32740
11591 134981 -171179 66199 -229333 90852 -89099 23957 357994 -21135 37068 72154 160045
11580 160045 191036 18803 308399 -217999 -184737 -59516 143951 -172496 312350 -102201
11569 192552 -94076 -120923 392629 173184 -27461 61133 -18023 295548 63576 297364 379563
11558 379563 73984 -232532 -56083 -238224 311724 65361 -111016 154125 114543 -114718
11547 -158278 -43486 71670 12067 320509 -156150 187660 212824 35940 -118234 318517
11536 12998 -158335 -116716 195089 57444 274784 129967 56079 -53030 66221 -77647 41961
11524 191058 52535 59511 -297023 -37151 1752 -97577 288340 29338 -53376 -279863 45271
11512 211328 249093 263333 -7806 -241778 70884 48826 -48780 -26178 101329 568141 -64836
11500 -49376 -92875 27612 -45800 40784 146581 119308 68483 -72317 -609556 23904 11602
11488 30652 -26373 284708 -212195 29009 -1387 248192 85577 174014 89852 454940 282972
11477 282972 69613 460009 -2298 275998 -67622 -148604 -160655 158638 -119534 -66143 30797
11465 -377888 281996 112759 -182356 272807 96427 -127760 -125892 22374 70263 350463
11455 350463 9145 -21289 -47055 110798 -230836 182830 71466 -63228 -70843 -44144 -190972
11444 -190972 44986 -30556 -333980 107336 78250 -105889 -15833 -42310 -144917 -170760 127571
11432 -142577 -109603 83114 -18806 29997 -10384 41107 283488 -157221 542 -136365 -87993
11421 -87993 -293943 18961 101163 88018 -76801 241624 146739 193071 256255 98133 -78285
11409 -85827 -54935 23988 -219926 83406 -272645 50425 -37459 -255988 -233997 -41001 -8791
11397 21158 28754 37686 -5074 121429 69523 44379 -319268 -89144 139525 -108736 19500
11385 263337 93372 -25522 156200 127385 111655 -43185 86136 18178 159045 61839 -21402
11373 208529 146930 -415153 211327 85707 51846 -67794 -116009 -349463 -225458 8127 81500
11362 81500 98199 -254432 -6421 -25212 -157015 136405 -317558 354241 19247 -218054 -196837
11351 -196837 -78574 110451 -194673 82774 200776 -223669 114886 -295656 -55017 -159958
11341 -159958 -47015 -73244 240092 115458 -4981 -388270 -177016 199289 -239027 139324
11330 158818 -121522 -147920 103722 -147417 -34461 97537 -108706 -92836 -241761 -78974
11319 -87909 -193115 176723 321048 26258 55629 69080 -81505 -2680 101602 37699 1223
11307 -203681 -145561 -51751 244960 -169711 -103847 -314301 -157438 267223 4029 98764 160710
11296 160710 -71789 245022 -53940 -146233 89346 374006 35648 -226061 -209496 195227 282644
11285 282644 -327548 -71521 -160305 -23918 162922 5045 242329 108781 117105 277481 24488
11273 -252552 6651 -333494 -5969 59168 -151800 131265 -46883 -264131 19905 -171374 91757
11261 246638 171655 168370 -8345 39680 -61239 90674 -360787 174547 -20259 13595 232295
11250 232295 205747 -92718 -250450 131789 -467912 193623 -137317 130673 1761 -404577
11239 54620 -153214 -14112 -112871 70482 114907 -485 -45968 79021 -56631 -517666 113944
11227 -259819 -31189 249728 -64201 -231119 227978 -1436 -358231 40847 10259 27889 -219440
11215 192087 -3040 -200184 -175753 -30181 -242000 -65416 -350103 179465 148481 -332250 -129979
11203 -139645 -101646 38490 41416 -7314 -223108 8862 -452061 -112764 -155404 96421 -161939
11191 124204 95330 -203643 -475348 25911 -176205 9174 1713 -250301 16310 -169199 -276132
11180 -276132 91397 -175654 66594 -234217 -139787 104427 -406247 -368408 -68851 48664 -168431
11168 -143787 -296765 -183818 -106652 180172 -146307 -232751 -324883 -100562 -110956 -150206
11158 -150206 135179 -163102 70111 131248 133318 77340 -52920 -302681 -56652 3565 -101563
11146 -223915 -32733 72608 11214 -67145 -239426 73280 -129387 -321815 -19293 -111991 136555
11134 22542 14489 33220 -178101 41115 489599 -130542 -360249 128022 278726 -362331
11123 105217 179192 63903 104684 -203658 -105435 13867 88478 -94706 -17221 -74856 -357876
11112 -357876 -58546 95649 328228 8764 -66710 168305 -66230 144051 -91021 237558 291280
11101 291280 -176223 65135 -47623 -59254 392462 112947 -151699 226504 -249450 -58983
11090 274846 53664 -219802 166680 254250 221489 62615 365827 172103 335671 -119415
11079 182476 415593 147826 165953 155377 374399 173567 72172 236628 160124 189056
11069 189056 163239 316086 288012 254240 155645 460200 -128771 345271 595742 282719
11058 265456 153278 542035 -56578 333805 457503 135793 278315 130308 572207 571953
11048 571953 651271 176995 283425 287951 508866 294265 249428 268839 186650 189617 255144
11037 255144 265590 417212 511444 460736 143986 495054 596346 253215 487173 676668
11027 676668 145754 317824 8590 297038 299187 581729 394637 270656 543788 367637
11017 367637 411044 212596 355403 283014 337767 366249 331247 449407 29983 508887 283034
11006 283034 246248 433734 141390 659328 200305 161393 457566 231027 455855 370478
10996 370478 242375 403339 574887 554776 335009 220895 288094 344744 108413 729086
10986 729086 649625 516986 252404 492116 234894 461946 265834 576084 683693 759610
10976 759610 917909 707799 785437 988925 765846 854929 1168804 1232785 1272710 1429398
10966 1429398 1389512 1534183 1428019 1438338 1487431 1259196 1132500 599977 1093548 1155686
10956 1155686 847213 1125849 1087006 1319474 1197789 1437140 1215320 973316 919283 592138
10946 592138 998200 875052 325904 288892 233750 88544 540185 121718 117851 38102 483872
10935 483872 -60012 545171 65520 179605 -213086 16671 107642 -253922 230380 431501
10925 431501 7424 -92218 119279 427322 64379 -130282 -45116 12046 47397 87927 121279
10914 121279 77923 87186 -480652 90909 -46739 -142503 56002 -321384 -74316 -227472 117153
10902 49424 215994 -8386 23406 15627 29380 -124389 -129987 238796 9149 164283 61262 249728
10890 249728 -220754 -111267 -40708 28122 -14634 -209592 -78525 -133338 -105936 -1175 -233160
10879 -233160 157857 -218773 -97533 188918 51809 138550 111026 -71190 101260 -68538 -19109
10867 -173874 178337 -315876 -94436 -24507 224159 169452 12659 46156 -77187 204288 122014
10856 122014 65975 -140320 -196632 271523 135311 -13083 -158987 123536 8838 -90143 -176919
10845 -176919 -182326 12765 850 -113821 4997 56625 -208876 207042 -228609 -72593 202597
10833 -254714 88123 -50463 -3133 26410 -204809 -53728 -113721 198137 170653 -14213 -46872
10822 -46872 -161753 105962 -106128 218270 -253111 52371 -57457 119093 150506 -3805 -123220
10811 -123220 2808 31546 15380 6446 -322224 -60885 -59710 -152466 -191805 77812 -21488 -634549
10799 -634549 -175677 90824 -140827 -58018 142037 66777 -251846 -234318 -165281 -204121 -158209
10788 -158209 -216206 -115680 132114 -102277 -204385 12506 26151 -85071 -262233 52560
10777 10937 65681 -75296 206104 -153649 -219208 136279 169437 226464 -234266 28524 -44463
10765 194730 -53167 244340 -43443 -167969 -377555 -109592 47995 -270904 248445 -135073
10754 144459 240886 -456352 -130136 -175804 -67946 143614 119183 -4757 -155087 190057 39128
10742 -32518 -185923 -353211 -75963 -222823 122783 134614 40469 118538 -224342 41027 -220866
10730 -207366 76793 96821 -107343 -109480 -8321 205546 131964 237745 -25289 -93622 -86371
10719 -86371 -87507 -126033 35187 227602 2684 -144278 -169473 -281074 -227788 72976 39796
10708 39796 11216 -105865 122954 49448 66944 95219 -7555 -316864 -491403 60955 210085
10697 210085 -180601 196270 -98653 20232 -218298 71981 -222480 -28329 -260762 -140132
10687 -140132 -424832 -218276 164798 -30133 -74382 63637 -145124 -492231 291255 122421
10676 148246 -15813 -196729 79928 -55243 -240725 -656358 -148739 96356 -108313 -125198
10666 -125198 -270809 -257001 67482 -210596 158539 -159645 -254900 -78035 -110756 -3693 -46605
10655 -46605 -179264 -110271 9023 -267032 -212860 -268200 -340426 68427 92764 78658 125170
10644 125170 -773735 -30458 110020 1952 -65753 93340 -290977 156324 -29366 -329538 95278
10632 -184911 265869 -69014 2470 -49272 -177431 53505 71944 -74816 -140840 -259519 -282984
10621 -282984 34197 -63627 -119095 192851 -165641 207113 -20700 64318 -142526 47024 21882
10609 116011 -37777 -215682 164707 -56400 -44564 -254150 230713 152269 227156 33590 -143515
10597 -171527 48037 -62310 181088 137726 -109151 91152 -304239 -122777 -463802 83431
10586 77372 67480 -11942 165523 -4999 18207 17124 -290738 -82796 -298178 81879 131367 -116733
10573 -115971 167500 -259467 -409395 -36948 50126 33342 -168237 85137 2090 -163211 -146121
10562 -146121 127440 90779 12456 2686 19312 -100600 95330 -211307 -133939 56309 -87412
10550 -62884 -146938 -236863 -292139 -102374 -114649 11760 214937 18029 -221753 -302316 74903
10538 99119 -18196 -201279 -265015 -274604 -38587 188058 176214 -169270 21111 301829 -100256
10526 -53876 53100 222694 -77385 214396 -83586 49149 -140036 211618 -68084 -46886 268065
10514 -163920 1591 -74197 98646 -207663 17563 -288616 183235 69207 104309 61794 -444448
10502 -177055 -107647 215437 -241713 -43303 233356 385837 129520 50463 -103994 -16124
10491 -96350 -32466 -351346 108290 6965 -7515 -70621 -21728 -138783 -18805 100642 214559
10480 214559 -245577 50785 6960 -74680 67663 86137 549972 161989 -157507 73817 147802
10469 147802 -86914 234955 -222866 101165 -43472 -379336 -1365 75989 -227850 -171953 90113
10457 -141691 -295673 -29220 -84792 -142928 -144622 -208256 -294418 108563 -304417 -28314 -240568
10446 -240568 -400344 -78800 21286 -11679 -22503 -238239 -160141 111694 -347794 -314201 -155782
10434 -433890 -119940 22879 27442 -152126 120397 195514 -85297 -37002 59516 -200837 75786
10422 204094 -41652 50518 133089 -97660 36560 -242017 -62866 -313289 76836 -58340 -83407
10411 -83407 -49435 -165973 -197410 -185143 -36126 106834 44605 -54158 83314 -217832 -349756
10400 -349756 80607 83490 -79447 -31366 49784 -148080 -210397 -170519 -241633 -283352 -2856 -308107
10388 -308107 -78705 310527 -37600 166977 69326 -22219 211954 260332 -161171 135952
10377 -20185 -182781 266651 286610 290294 -164690 5294 303193 361635 -100859 138912 40635
10365 -234956 102524 -61319 114498 192904 250651 31042 -175678 -76893 176039 234407 17488
10353 8721 -193075 335339 373074 -208785 134675 58316 178274 242008 -174232 158813
10342 -304000 212850 99667 202584 134027 137978 266492 59336 93770 275896 -80405 177976
10330 -62718 209722 141497 415984 102281 444234 -67803 -39347 -203662 241295 -209765
10319 -79324 -73862 32475 400128 37127 359699 -36631 -90395 214125 99806 -319430 55572
10307 -229768 -216397 -2235 323672 -21643 -266053 123576 -125828 14287 -46436 166256 -213526
10295 69311 74669 -90753 226811 157426 64297 -139812 -17092 -204653 -267928 -39758 234138
10283 -113700 -116779 58239 96620 127512 -48579 186757 103057 220326 7892 -122864 100405
10271 166956 -74202 39435 206213 108718 -173582 -65516 -37560 -58601 19234 123755 -96597
10259 -327506 83746 -40492 -11603 71584 208867 419821 310572 351315 210048 -143728
10248 70327 91161 131855 135095 73001 -53960 -79263 129721 -157915 17477 10457 -16187 -511627
10236 -511627 -262081 13185 5358 -72929 -149374 235510 -203557 -19527 -314235 162358 52774
10224 -16848 164860 -303911 -13979 -156183 -120020 98637 -177093 -57880 -247335 -40116 5250
10212 -89921 197095 -138454 -101011 92378 36792 70863 -58583 123296 12501 -342694 315259
10200 131936 -185357 -206735 44931 -89821 -81582 -201062 46738 -193576 138429 -59300 -198088
10189 -198088 -348937 -29991 -88936 93414 -65913 5154 -106054 -232491 172618 -25270 148222
10177 80270 -363004 -64099 -133757 -361109 -167316 5898 219852 -192375 90874 -359063 -119418
10165 -245614 309999 -10270 61536 175953 -68243 59066 57146 353092 -461494 -88956 -30368
10153 66737 -205335 -117501 -246998 -116815 -81351 -20436 248863 -38253 -122187 -304768 -66344
10141 -233593 -127567 -133818 13583 412772 -43308 -114776 350024 117692 17209 -208889 -180542
10130 -180542 5799 59166 268147 -80298 -333402 -243301 -117500 -127253 36857 -53639 -233180
10119 -233180 129455 -259194 111195 35304 36167 32878 -15743 210233 -61894 -197694 -111635
10108 -111635 45578 -167967 60789 259173 33438 -241925 -142946 -46579 -43501 -134451 -66864
10096 -140779 -9136 -91021 197883 33377 -246172 -296720 -169167 -354131 -195413 73893 -325028
10084 11228 -9026 28945 -106392 -31445 -216591 -8388 4454 -35887 -450073 -63917 -22712 74197
10071 133085 -332662 292338 -89299 79030 -43383 -275950 -239573 15996 521430 146792
10060 440588 -283076 180845 -330118 28581 -7370 -212009 173446 -41091 -115546 281972
10049 -154991 -190317 -695 3915 -184107 -258679 -120529 -363256 -162126 -93874 203310 -445846
10037 -190173 -51049 129639 -94984 346175 -304199 183961 -45126 -363108 217968 16222
10026 72547 -166922 -161115 144481 -174924 -105297 -207849 -250061 -99111 -147212 11655 -95071
10014 -286866 65853 235195 -311789 -286153 -189165 -124037 -16901 165268 97376 -224406 44681
10002 -19733 -160839 -129074 -368545 -111235 -127699 8378 -41541 62903 96048 -281849 246738
9990 -79612 58269 -334981 1971 -78225 -267059 -171382 26912 -186042 183197 290684 -186879
9978 -288385 -110194 -73908 -301662 77957 -262626 -127135 -129511 -23339 -126444 -225716 -46749
9966 -2943 -336741 172391 311560 202899 272258 -422759 -131553 -15152 275719 -73460 136925
9954 -296134 -229000 301048 59422 49423 106401 -169357 152337 4848 85046 110332 -34825
9942 -114199 -314484 206158 -149098 -7496 97485 -221106 -279094 6684 -61735 -289220 62553
9930 67783 -121319 -180172 -387408 56114 -658511 -77211 -284504 -187664 76862 33078 -86371
9918 -16655 123933 52345 147184 -14568 -190637 -67761 -164777 -194843 1465 325986 -272649
9906 -157102 -247953 -3813 45415 90317 18313 -176675 25594 -161565 -249599 114602 -40225
9894 -151347 163764 -217539 -197273 -22783 262175 107840 -141519 -9618 144310 -84482 -230036
9883 -230036 -17786 109807 -61237 -94970 -346207 81671 156844 18932 101549 -77937 -111508
9872 -111508 136349 -216169 -252381 84945 -97930 -295486 55398 15325 -169232 -467049 266541
9860 -152732 -10005 -191680 -88717 -64629 169756 38195 -157417 -322012 217408 20512 -356327
9848 -271536 -316921 -324479 -76217 -84513 -124207 -126435 -389179 -163434 -375737 -74182 20179 51944
9836 51944 -235528 -3886 -150263 -90888 20286 28348 -148529 -95398 225 149665 420941 -212939
9823 83915 -144956 -64781 -319496 -219083 -13682 -20600 -26373 -97350 67591 9867 56472 -139047
9810 108081 100583 -126542 50701 -324255 -182750 -92268 185248 -7763 242799 -318933 21124
9798 -249356 -179704 -158768 -371128 -202632 64659 74956 131055 -65897 68756 -243587 -78220
9786 -42803 -61527 120116 -176029 -11784 -133157 25775 -6492 278267 350849 -123874 -198488
9775 -198488 -394361 -58480 315794 -180520 77377 86887 -198611 -112517 -167296 -8952 -367347
9764 -367347 -63240 -256908 -143819 330232 -19902 55344 150938 281339 -38675 39159 -148202
9752 21151 -14453 -95619 50402 -40931 -395403 276579 -321056 -223966 -296630 -100566 -57234
9741 -57234 12053 -324675 100443 -236509 -229716 -251163 -207800 170731 -42650 250435 109750
9729 -129027 110545 -186284 -380801 -235996 -17356 -250534 -249074 26561 91007 -287525 241786
9717 -300217 -163530 28382 -28536 158870 291822 196489 67444 -425181 -137270 -76583 -97724
9706 -97724 -168936 112228 -225990 -4077 -239280 -166119 183937 -29849 26849 87041 97893
9695 97893 -394129 23297 3183 -239873 -74657 -32642 40279 -34826 -134725 12485 -77461 -68686
9683 -68686 -149328 3216 -108968 15767 -309680 -345262 -337242 -270382 129551 171067 165808 89807
9671 89807 -46148 -70383 -211839 154677 -142810 -53275 -25627 246367 -136978 -172950 -201145
9660 -201145 61173 241238 350731 159900 64146 54377 -4209 41743 -51946 -139090 -137365 -288926
9648 -288926 -249668 -157774 -202277 -104117 300021 29872 -290647 -249718 -74042 -37314 83851
9636 -67848 -160920 -47958 -93025 -134268 -504926 -149694 -77547 -201048 -310349 -61871 325211
9624 -66092 93526 -196632 -80792 -35850 917 -209425 -59288 75856 11818 80064 87575 102848
9612 102848 -234830 -676454 145679 -101745 -182644 -154210 163494 150043 -182195 -97871
9602 -97871 119624 85113 80429 -78663 -136172 -160670 58526 7559 -312885 -258324 -182245 -263701
9590 -263701 20140 -41353 -342877 -76972 -92229 161593 -194010 9360 130058 -8202 28779
9578 -65098 67199 -171634 -28871 -337212 -135948 -330635 -69303 61817 -351216 -269440 -103872
9566 -208073 -151538 -79517 -3 45915 -11611 -304260 -137604 -122738 -56305 -10854 -102590 50281
9553 -138822 244473 -96117 -36870 -353949 -53417 -86842 -139333 -166070 -350072 -124324 -366748
9542 -366748 -269906 -112872 -109882 84933 -387887 165118 132611 -105630 32442 -362615 -315092
9531 -315092 -210173 -55649 225171 -20490 -201569 36052 26871 -85221 -267676 -143017 291680
9519 102985 -135178 -84273 -53092 -76670 13552 233711 45716 -115066 94598 -123027 -119792
9508 -119792 -235546 -335529 -289909 -35837 110255 123837 277669 203373 27187 -211749 62915
9496 -345754 -157820 -84825 -207327 3473 -43083 -263776 -178278 95427 -95823 -217263 49212
9484 -139025 -196699 119316 265988 -35841 53784 431003 -262274 -439817 138783 -196592
9473 -5969 -305681 -36379 -293089 4188 -43852 -175460 -75450 -6570 -89333 -208954 -165677 -322008
9461 -322008 -16209 290837 29457 -57098 -207089 236413 -105695 52265 -237779 -86672 101078
9449 40422 494306 -247626 27976 -185310 -117124 69997 14365 -284747 -151187 151971 9579
9437 49188 37596 123420 -83993 -195466 -51330 32410 -20861 -89419 216000 157638 -88519
9425 -1555 -134107 -160957 22597 216648 -2536 -177730 -70161 72833 -17813 -296639 -160449
9414 -160449 229343 62353 -529842 -81139 -73116 212188 35363 312375 -117302 8888 37960
9403 37960 175900 -271867 -116338 -116579 -58887 29484 334032 -259097 -306073 -82543 196019
9391 112557 11937 -167130 323222 -18171 -37046 -166677 9837 -464335 -107626 303202 -101703
9379 38983 -80565 -334424 -246875 20362 -205425 -24930 188044 125885 -11357 -203713 -286642
9368 -286642 -100544 -196640 -179204 -275200 23758 99462 71746 297488 2545 -29200 -39230
9357 -39230 -374736 112632 -219100 84068 -369212 7719 -86116 64251 65416 -261617 42729
9345 -120022 105162 -1520 13169 320383 -203394 -86010 213287 -204687 -162214 98877 1977
9333 86448 107576 463190 -71853 87561 111923 -136154 -69846 -94494 -19498 94410 34448
9321 -174890 83157 265933 -243131 -82833 -111393 222112 -255063 115762 -39252 -150307
9311 -150307 190640 12882 232664 -165940 -165648 -221804 -345704 -197482 55289 93778 104664
9300 104664 70875 -336107 -511381 -210153 28665 10491 64043 10907 191265 -184069 122284
9288 87273 -226920 -103921 -67551 104005 -178832 -134291 -451386 -269165 -161987 21996
9277 31171 -212092 97870 -458309 -199582 81848 130549 -95793 -18627 456318 -74969 -78286
9266 -78286 -99551 -214399 -447 -66469 -33091 -121529 -46834 -50903 -345897 -87298 -120775 67206
9253 288723 -180551 -136809 -255587 93721 -171713 75338 -319429 -181384 -414908 -98595
9242 -177495 52802 7784 -189633 -221183 -13070 -16526 -176059 -57404 66716 29417 -191685
9230 71980 184658 107932 133681 106106 88860 19768 12055 -168999 -291606 -72186 -237351
9219 -237351 -157610 -244393 -292411 -342436 5556 -110593 -173471 -47571 -37460 19554 343551
9208 343551 85032 226613 -33626 244452 -275030 -59300 12464 230780 -223767 -235458 -150235
9197 -150235 46550 -52606 -272511 -248741 327936 39434 -3786 -37563 27836 -26423 -415075
9186 -415075 -225855 -44861 119412 -72032 135393 -218044 252923 -326070 49509 -274745
9175 28121 2204 -168634 -159830 -132733 8212 38965 257445 224182 -187344 263244 -204217
9163 -229613 -262291 210047 -301868 108144 -263063 -190948 479321 5961 -196644 138333
9152 185331 -480793 66567 111574 -279654 126451 172816 40241 -48795 44336 91379 -167758
9140 -260814 110478 -138890 -171721 295794 -55978 -106219 48370 248908 226545 215145 -446813
9128 137996 -177949 28616 -115245 312450 -254681 -99438 -13872 69793 70084 -92924 11868
9116 -282857 -123904 80869 -144399 -164867 59217 -14226 -38968 64080 -31629 -16539 16475
9104 -77133 -203847 -111381 -97084 162640 -37478 -129030 -297557 111078 244477 200358 -262732
9092 -62537 188302 -137527 23345 -23352 -86505 -413110 178616 60124 48866 -131557 23748
9080 -239015 -1979 -81954 -87925 -581 210205 21593 -204276 -202702 -62998 -398179 -228233 66076
9067 -82292 -12398 -190889 -46071 144157 -100990 -62948 194224 -49354 96849 -100330 -75389
9056 -75389 -240013 -409563 125033 41070 54029 -78636 276452 -49751 -42648 -304986 105418
9044 103588 -361487 -420571 -151175 -760 225960 -263306 -312559 107859 32914 -149751 -53705
9032 -194186 162862 120168 77225 50515 -80769 89111 198051 34048 -225513 -212121 172554
9020 -257146 -369262 -89260 73300 -98885 5800 -141935 -92900 222472 -395911 -155100 84212
9008 254658 -104063 128407 173316 -144092 -128813 -27055 160446 -61320 -308454 -327331 -145718
8996 -115689 29701 -60374 -348961 -32232 -167833 113900 735 -131437 -451480 -294030 -8831
8984 -17275 166460 -376815 55233 280143 127331 181086 31332 -289932 272402 112411
8973 -7339 -217734 523760 -324442 -143018 139808 -140797 -151847 -338295 -225492 -45868
8962 92401 -36161 64197 30713 -142065 -255462 -245581 153462 186949 -160608 -280491 140292
8950 -126629 76845 -359820 162335 59167 -202769 -85048 -8060 14954 119605 201152 94913
8938 -18394 -11100 153075 54789 -133525 -88051 -236339 171530 -194222 206997 -175920 1170
8926 128535 95257 -225416 13482 10401 -90997 319941 119859 819863 1627267 447628 -214326
8914 154797 112423 -322012 202815 -143797 129372 -162330 -93595 101678 41063 -56219
8903 -15694 339842 -320307 -147448 73740 281965 6679 124525 56950 -102778 -193338 -141479
8892 -141479 94762 2261 -262125 -35782 85126 -435314 105524 49837 24349 -325415 -66183
8880 -42791 -93651 117692 239363 -28782 -5017 70920 -159362 -67497 136365 164144 -293160
8868 -59247 -82122 -200034 -9399 -19424 301663 201088 100343 -86276 14013 -70192 103282
8856 266626 176110 33890 145782 -300034 -116502 -280732 -19169 -75256 -124550 323437 -161973
8844 -383697 -156207 -7296 78765 68623 -396599 -75736 101504 24267 -279800 -61202 -73300
8833 -73300 65227 -144908 43836 28156 177295 54968 -536645 -54946 7879 -84017 -116759
8822 -116759 307496 -497803 334491 86267 -62487 -252270 13424 -112442 -7499 254841 -82604
8810 190180 -45321 -224352 -383272 113413 -55347 -480382 -55549 -176229 -23523 -38517 -103595
8799 -103595 -149650 -153133 -19965 -10502 107685 -72010 -139568 -266464 -96292 -246589 -21185
8787 -117477 -28018 269624 16524 -32306 134867 -212684 34699 -40746 225772 153118 135075
8776 135075 125232 -88163 -195014 1650 229882 -178833 13559 -166232 -372116 418566 83602
8764 -370516 -103774 67779 -33918 -115353 -120333 -285687 -39566 100193 -88218 -182914 228457
8752 -24593 -50464 22961 -372167 -290182 -285003 -214424 -101136 -47995 -151322 -300750 -33201
8740 222276 89074 -42642 -257597 -223202 -211312 -126153 46381 -81081 145617 -67754 67034
8728 -18322 -139407 226637 284069 -247280 -405724 -183182 -81269 29045 315899 -75015 -193359
8717 -193359 -235019 -167541 -192134 -234 -58791 409314 -32927 44018 135046 -180981 61105 -183144
8704 -189182 81772 -284410 -6973 -96918 250126 113007 -251951 7582 31140 -47971 -19694
8692 -606184 -68111 -33132 104045 159015 -313920 65527 107252 -180315 -49879 166940 -27637
8680 119766 -93660 -196650 -384278 128361 -290361 -131587 407614 -136795 88814 -230296
8669 -315916 249746 73877 -142281 -32330 214983 -375368 -67109 77982 -161467 -40517 333758
8657 75486 111923 -37958 9396 -87963 -41679 -129190 -391955 159631 -139872 -59561 -477890
8646 -477890 -219010 -210550 120356 -437389 154676 112444 -295856 31407 29854 -64209 -61240
8635 -61240 -78296 254071 334688 176708 -247088 144125 262725 -27173 217509 -278020
8624 -237186 -429393 -136182 90748 -165622 -130279 -56586 136307 22952 -234935 39349 70331
8613 70331 67977 -34185 7130 124131 -40376 135716 62662 -187292 31461 43301 -47573 127229
8600 -545052 -180243 27639 -290422 -147707 212797 -228495 289924 -242431 20066 -151443
8589 -13465 -195676 -62102 -31258 14511 248606 -122669 -111686 58102 123487 369059 -71812
8577 -63938 35476 -44393 -79789 13194 6917 -65833 -112273 84434 -14499 -186485 -10109 -20535
8565 -20535 -179737 -241193 -88035 -357573 -387344 -51765 37039 -168574 5597 369392 146681
8553 -28357 -55026 6356 233711 52367 172816 -237045 -20140 128863 13922 96893 -28763
8541 -159517 -91296 128975 94885 -214972 -102924 -350994 -40167 -79654 -239403 -99096 -161181
8530 -161181 -246773 160238 -198814 -4789 400200 -93977 294202 -15623 -212400 165194 -141383
8518 50476 -83424 -170135 -291223 -225458 -177503 116276 -140324 -44251 -44982 130982 -116737
8506 -159067 -33767 -190848 -65740 -76220 -48043 -24683 -163565 40497 -464044 -480389 -123735
8494 291758 59420 172926 -55154 -264147 -274517 -94158 133936 -298940 -20170 57767 241862
8483 241862 20513 59566 -325048 -89247 293187 -24275 -148264 -61557 -57778 -68036 100754
8471 126974 -105128 -73698 158153 -160359 -82687 109347 -61410 -195366 -5763 -72597 -3503
8459 -296338 -104405 -18632 -400764 -206451 267061 162925 -199979 -71932 -149495 141287
8448 -241525 -121904 -7967 131040 -293711 -189672 -302637 161695 -272976 111916 684 -306470
8436 -538631 -203168 208944 -368627 -29330 -28366 16689 -13552 -157202 -147078 20431 -140098
8424 205893 192238 -74658 255634 -180187 208872 -15393 -122426 -19483 -9987 -54995 84859
8412 -162657 -158448 -362388 -139694 -36894 169947 -233919 -400852 -508687 -102990 -69711
8402 -69711 -310945 -97633 -88448 -138171 -72951 -157026 31178 -25368 25674 240507 -181653
8390 37319 -18550 -114957 49726 -12129 -59163 -106066 11125 63645 -160701 -31523 -17217 -21528
8378 -21528 -2127 -24673 173194 -209697 126642 159525 135280 202624 -223447 -9398 169859
8366 -233615 -273999 -50665 -194921 -21897 -84854 175436 -39352 -276869 -16326 -55272 -235896
8355 -235896 -503137 -16885 228435 -7048 51128 128398 -208459 -84172 -151523 89298 -139827
8343 -310681 -48871 -162991 118462 180630 -129093 142410 -73241 80686 -48631 -64266 -175518
8332 -175518 -43995 179496 127111 91598 -28958 -85804 55243 -260339 226290 140530 2753
8320 -261026 -100921 45830 -35466 50373 -271764 78585 84480 -6406 111359 -100585 -106511
8309 -106511 262109 74981 104748 -222990 175277 -69062 -351293 64585 284779 271495 -147670
8297 52661 119029 -116797 194080 -143379 -211832 -119153 -140977 -143570 79195 -140261 -110510
8286 -110510 -182123 -205857 284369 -88260 70126 -117729 -447483 23042 47392 -173944 59579
8274 9647 -30777 58135 34836 222751 85867 101573 130394 -121608 238151 -38041 -129752
8263 -129752 -82351 -263242 -146517 -190705 -94198 -57970 307976 203356 -79449 16677 -324023
8251 -204015 -151777 -182443 -217393 -17013 170504 -303674 -172417 -330527 25886 -104676 83723
8239 -114999 -226383 -10028 112905 -335484 -483836 46500 39811 -53795 190333 39798 -10689
8227 -75219 -99003 14269 -87124 -80499 -67209 -454780 -170935 -26781 -288385 -247369 -102738
8215 313203 30696 -116639 -24783 -78462 134780 108016 -263131 -375475 151700 20056 -216198
8203 -133695 36370 -150291 -55210 -147097 -417935 19449 461809 -993 -28719 -92204 24912
8191 157265 3619 255421 -110898 27290 -189470 18756 -82349 -361015 -2726 -156415 -151157
8180 -151157 -512942 11543 294509 -183965 -35107 -143200 -75060 -213900 -49431 79193 -35383
8168 62784 48388 93135 -95754 -318074 -120502 -287106 -145886 10019 -227303 206497 -220052
8156 69415 -57004 53753 -103059 16535 -44588 -4260 -72180 -2275 122657 -108842 -52396 216447
8143 -197597 -24517 -93455 379805 -112591 -197713 -152192 217505 52578 113386 -171349 -93109
8132 -93109 7822 -116189 -170914 -224127 -349221 261289 55667 -36692 -134147 172325 -195491
8120 -160456 71273 17402 -456007 12094 203573 -163187 33968 -266417 -4862 -69906 62750
8108 -410550 208470 -214902 170865 -216984 -439529 92791 -310668 -37958 239396 21540
8097 57180 -39079 -181596 -17379 180961 -411193 -197454 -136407 319901 -11391 -233915 -266900
8086 -266900 -540110 -37554 143287 133975 -101519 -196145 -27514 -134910 -114166 291955 -146012
8074 -107273 122268 -193765 80599 -45502 -207811 241789 144088 84196 -399523 313724
8063 -190101 -66969 26194 -246694 142730 72415 -188389 -216492 74707 -38 118119 -339 -32669
8051 -32669 -197554 -113732 -74401 2498 -38798 222002 -39028 -195284 77090 130175 -99181
8039 -71561 -79754 105840 -183664 -218649 35180 46995 -32250 -102747 73426 55812 -269481
8027 76209 126626 33208 -249958 -253068 -138902 -151644 -90269 -84083 3055 -296002 -282377 124768
8014 255530 -180021 65329 -203930 293159 -139063 -344262 204407 -14902 -170873 -239171
8004 -239171 24001 -356852 -66553 50896 -132240 -185419 -76956 387940 15770 -217733 -73421
7992 -20022 -43293 121250 65522 76368 -86408 78235 46955 -298019 224652 -61301 -8863
7980 -51656 86238 -10573 -305389 -230290 -45957 -259652 -199611 -53194 -393513 -244537 -20381
7968 -58527 -446625 -22864 38770 30660 -118955 -155456 -15293 -55857 201132 -28324 176982
7956 -69963 -46200 -125924 207922 -42204 -141344 -156363 -314315 -175603 14974 -176661 30488
7944 28824 54573 43160 193051 181679 -156307 223859 -34329 -285196 -361063 -468407 -130042
7932 -111251 -465648 -194206 -27202 136894 -106632 -230424 -287112 -205431 91137 -95142 -185138
7921 -185138 81705 -89485 123092 -62490 -115144 37216 114924 -215940 -223532 -121370 -312511
7910 -312511 37266 -91257 -84731 -282409 71003 104947 -65741 -182624 149074 186459 -9084
7898 -166790 365790 34578 270881 -98735 -264335 99392 16143 -165387 205307 -213965
7887 -13038 -79951 -210056 -328382 72877 118213 -6355 -292760 -139339 -158286 189285 1959
7875 -164146 -184905 -247890 -314716 -52311 -96636 219000 -116062 175807 -232015 -115917 173529
7863 -144944 10954 -53532 289455 -117192 -45725 149483 324642 -134751 -55536 100083
7852 349840 -170329 -3157 95862 233264 -90674 313478 -60150 87744 -108357 174721 -96130
7840 50665 203812 -205739 21092 73175 -78567 -203308 -265653 -303967 -268048 53880 -169340
7828 121332 68440 21618 77441 -275586 283659 106671 103774 -228780 217074 56579 -72169
7816 53309 -137223 106517 -77296 54140 147285 -40483 -164358 181146 46777 -177450 -88526
7804 -83426 -319016 -227321 267108 244520 131619 -205691 -201308 125099 82927 -80951 -8786
7792 -197961 -435959 -37984 -10249 198429 -154687 -300916 414399 221635 125026 -123224
7781 -139784 -93068 -45311 175201 912 7117 -466721 -215210 -234932 -554558 -67520 -54821
7770 -54821 -71766 115996 162367 334324 -120604 139616 65264 -318772 -295435 149389 -118991
7758 37110 10219 12669 269039 22958 -34972 -125183 79055 34494 -142743 236413 -161467
7746 -308853 420364 308207 161363 282760 -130 31726 103088 312258 93914 -199884 -101195
7735 -101195 27385 -20203 -143475 22815 266200 -170000 -74857 -221305 -194180 127938 71368
7724 71368 -224910 -98690 17919 -315976 -129833 62745 121424 8334 19540 -21610 56211
7712 48687 -102168 -256100 88919 5449 129883 -68901 -97308 -161724 -122580 -127685 -92394 147068
7699 40112 -7050 -74756 43745 -142578 68077 7407 -46133 17520 -130699 -171350 -123415 -53877
7686 -251185 258136 95856 -5036 -113175 156143 -104906 190937 -99387 -29561 333894 -202535
7674 -81665 -268249 -191796 -40325 -7890 69024 -218306 102796 -50255 62849 -14266 -30913
7663 -30913 -182946 -16639 -119189 47113 -69676 33307 -147743 -217683 18606 -87737 11342
7651 -163387 -3247 177813 -53769 -85913 89115 66987 -34128 -310690 -99116 -64458 69315
7639 224941 -298669 -174879 -41939 106190 -61983 83167 8512 10952 127045 -40064 147568
7627 136919 44892 -238164 -60224 -85105 190415 -130964 131839 109193 727 -54751 -246417
7616 -246417 -269886 137990 74817 -154446 -93863 182445 266725 76282 -112677 -13006 -54815
7605 -54815 11639 -7594 -329176 -193444 -109999 117958 6066 197285 112278 -256338 -10554
7593 -270244 117900 -36793 -264554 310817 -53077 -107507 87093 -290682 156566 -171746
7582 -135616 -216553 61890 -59362 39640 21182 -84282 436603 -120110 -44556 353602 146062
7570 -75761 -54874 60399 -153774 -3001 -105447 -209903 -250145 -312889 250294 -318578 -41263
7558 -107856 -149244 -212913 -223795 74278 -7464 -159050 -355473 51199 341370 34325 52605
7547 52605 138925 168243 -67558 306720 133788 11561 -150629 315042 114550 72605 -357995
7535 45071 -33291 -18561 -16429 386468 -31484 -132953 -88115 27361 -49428 -140100 41101 219362
7523 219362 -55204 -141762 170249 154240 -146628 -154865 84089 -85571 18824 302710 -260652
7511 5390 -72720 291524 -43375 -110621 -45176 -116016 -184419 -110328 43292 -147837 74283 116914
7499 116914 -85064 -36599 -330749 104762 -230404 -81293 71759 76083 49275 -232871 -141099
7488 -141099 -152202 -285304 -6533 -74349 -18985 60045 53635 -210229 194736 -3543 101654
7476 -98614 245970 53042 425171 -18432 -18463 181106 252029 -224350 -179368 -29306 -46870 -322545
7464 -322545 324806 299250 76688 -19124 -158163 -202146 6505 -9219 -382731 -347639 81434
7452 86524 92989 23126 -297120 -402371 -161374 -55879 -4710 61227 -353175 -35987 168784
7440 -191050 -51711 -190014 86338 -48392 110563 59597 43188 2087 114252 -183112 -98803
7429 -98803 -100647 1861 -144240 25972 50671 24282 -47537 -107432 242753 -180328 194977
7417 -33434 7212 -33307 -128428 110022 356224 -276379 -204189 229876 -420392 351813 -114858
7405 -12941 80475 167549 113549 38693 -277064 -48567 -468680 131842 -143393 -194726 -63876
7393 141121 29431 17162 137232 322496 -101216 -139129 -102991 -105654 -177378 -205859 103196
7381 -397656 76828 59912 39757 -327044 8634 197306 357256 -18794 -359989 22306 -133231
7369 -183985 40609 -107650 -237570 74108 -5141 -176501 -28622 -274551 -99524 -108460 92534
7357 -63917 147435 138117 -280783 -197827 -208703 250290 -19158 -157921 117149 155908 -53748
7345 -168506 285422 -80182 -424916 -49883 84759 -28053 34744 -39798 -424467 53231 132480
7334 132480 -900 11344 -11630 -128216 7252 -229961 -88374 -302962 -159657 -35299 -94583
7323 -94583 1530 173778 197728 -245960 164435 -88247 164594 41181 275110 -185283 96433
7311 -175072 131255 127182 71910 -117841 -451358 55475 58504 -48791 -62481 -73593 -161494
7300 -161494 174975 -153873 127021 -127409 159224 145149 164760 -55822 324835 67335
7289 -46264 87912 148814 13607 276508 -94470 -84514 129124 -78663 -310670 -275395 -51297
7277 95239 472 -137239 -18640 -185792 131479 230652 62160 -248475 -290846 97501 -101109
7265 -21987 179515 56345 -60749 85018 -16993 -102466 -71229 48038 152393 150029 33624 332740
7253 332740 -137293 355592 -154159 -88366 115650 -297517 -25868 -48390 -183757 210580
7242 328571 -276968 3641 -249046 -40951 10634 -448600 44128 11819 -50511 103238 86000
7231 86000 8461 -20729 -68976 248167 -59415 -196944 -53353 96983 277410 2785 -82556 136693
7218 14205 92970 70990 67238 -77618 77688 -347145 130885 1290 -84850 -42704 -36335 -8532
7205 -217773 -283036 52014 14761 27136 92155 43171 89454 221919 192665 120036 -10516
7193 -202412 1931 -32902 231762 157278 -122284 -130294 -50686 6420 92995 -113934 -223539
7182 -223539 -269474 -12183 265088 34694 73339 -82831 87665 -114715 -163135 261830 -78158
7170 163705 170104 195713 -50667 -124883 -138701 -70065 -17023 262803 31250 -154553 -105578
7159 -105578 89146 297914 87417 29223 167483 103913 -71624 -21475 -189158 222917 -104782
7147 91952 17209 -150576 -79476 286761 71808 46076 15769 -376972 26824 7753 -234701
7135 -40021 -27637 116009 -308026 216880 -95223 -83482 234724 -237981 312912 203660
7125 203660 3781 -29953 237852 -96952 -207046 -10608 -118691 -211078 6270 60122 224352
7114 224352 -141439 209835 -84598 100603 167357 79355 -115717 58965 133369 106529 62363
7103 62363 -83600 49495 -11792 -196235 -149049 -4467 -169829 65383 21177 -102929 252138
7091 -362073 -44157 61029 95667 105368 286904 156189 125967 57246 157869 -294612 -51187
7079 70754 -71192 -63948 -361956 377799 -258189 -287123 144677 -98021 -55550 -197680 40801
7067 25130 -366750 61391 204918 72432 122923 192497 -293341 -42535 122047 -38611 -42769
7056 -42769 -367104 -246021 -108784 -194237 -172619 78607 357259 -223677 15638 -367303 69682
7044 -49148 13281 -20044 237334 -43638 -190085 -211453 107467 -353762 78789 -13358 -148673
7033 -148673 108184 70379 -337426 147815 -37046 46606 15108 -239542 -121511 96149 44030
7021 44325 -61259 -11788 185973 85552 -420835 -8260 91548 -28239 86502 101590 -167945
7009 -91925 -183424 -24440 -20082 266325 -34019 212318 -196430 -106392 68111 -25059 77299
6997 -58799 -138941 -334 -30515 -152664 -62154 -77598 -88389 100715 19797 -221469 -224084 321290
6984 12962 1747 141276 -172463 -98181 -16244 208729 -104040 142374 24740 4272 -137477
6972 117561 255283 -43442 -7586 -245564 39537 -133430 -54357 -153975 -66126 258168 96420
6960 -107566 -51272 117640 2164 -65580 220895 -170836 131424 -83420 90195 28562 337668
6949 337668 -78351 405037 -82014 135305 37846 191327 -42294 -545114 -154650 -330878
6939 -330878 -156135 -31353 47094 -99315 -179557 -46733 -267369 -15963 182366 -202307 -56247
6927 -225869 192644 -274254 -116583 -144143 -96473 109804 -46716 -479319 -23044 64384 -19145
6915 -95926 -6850 142337 69467 42320 -407273 -170154 -168958 76690 426717 181204 211899
6904 211899 -236066 103221 -130039 46091 -54847 -153992 -162256 54326 273184 290752 -532468
6892 -149801 -53950 398507 58265 169001 186698 -291262 194284 103965 -467940 55141 21664
6880 24185 -204855 11493 -1744 170345 -120246 -17091 13640 -248533 -32092 233699 -70376
6868 -354132 -181912 -44536 -435330 -127799 -111021 119004 238437 253609 202207 101432
6858 101432 26617 125222 300304 -56139 -108038 39559 -214597 -116283 192901 -209239 331356
6846 -30005 64658 -122090 322075 -163097 23775 52775 51683 93231 269282 -236299 33940
6834 63276 84044 25399 79392 -102228 -2202 -8248 86070 105376 -175453 -62932 -182724 240809
6821 -242134 176043 -215390 116090 -1581 237518 -323243 -165574 -176191 34350 -52815 351842
6809 -122395 -200796 241971 -66566 -13410 -86358 104259 65041 -117553 -193656 -54990 -252603
6798 -252603 49341 25921 226912 -251883 122276 269438 140348 403611 235410 213537
6788 213537 -270770 -15162 304086 194094 67121 28884 470953 -129386 31993 -59317 4502
6776 125832 64407 2726 -175609 -3335 12803 168396 177436 -165557 -31145 -66521 56125 -263595
6763 -163559 78520 -290997 -186918 -19112 -93762 225431 -75678 -240620 -184647 -74443 9662
6751 -179252 136737 21844 -118828 -220869 -254016 -201535 -335189 175511 -118104 -68828
6741 -68828 -125438 -356219 -53324 199503 105539 36437 -80958 135159 -72357 104397 -161791
6729 247516 -12449 -73232 -84683 23922 -398383 111016 48860 -360159 -21921 97388 93141
6718 93141 -177000 49617 5621 -57879 147282 51932 47229 76396 -6130 -123637 76141 -68908
6705 15811 -172829 -316436 58702 157886 324933 -164005 54055 -4230 -415966 68848 -141320
6693 -161724 517 38343 -24554 -9289 132316 -168182 -62220 61596 -31647 180266 -313423
6681 291652 160668 106086 -104072 -146763 -210640 -314442 270832 -278730 -554968 222504
6670 234796 144849 133754 -332870 -8586 -82375 -986 115562 228413 -86341 -207579 178906
6658 87197 60603 -29679 -70863 -179326 -108236 -310173 299899 -101657 102452 -171808 22867
6646 13775 157317 95340 -333821 25393 -138535 51859 90123 -76154 132451 148219 27189
6634 20478 2507 149144 -220502 160483 -39654 -84256 -82236 -274581 -33512 204391 118773
6623 118773 50630 -166518 173189 -106281 -119174 -4660 -185599 281543 -28442 -56413 -168914
6612 -168914 -251916 7059 102689 222125 11632 -301246 -102859 16764 -60789 -7232 -204646
6601 -204646 110962 64805 151862 72015 -118128 132934 -218961 -149559 42065 35764 -51562
6589 167438 145513 -126088 89207 232872 42964 101174 -109416 27185 -5528 319 -169456
6577 121038 3344 234757 44157 186655 -30534 111722 254361 -157863 276359 -110101
6566 78664 -103730 -169447 -52388 -97155 -207317 59197 -33921 46273 78142 -112325 42583
6554 -39384 32379 41836 -377448 -84300 173578 -125309 215529 85490 481887 42425 -27821
6542 -58391 145229 -248262 95304 64976 -269012 -74983 82648 -29779 -519565 -237112 61967
6530 -73511 -88870 42952 71748 -254942 -263378 -117063 205411 440525 69511 -122355 -85727
6519 -85727 -102006 -49885 -161862 -171581 32441 7375 98780 96994 31663 -206611 -156131 -101874
6507 -101874 212441 51990 -43750 -184936 44594 46598 155388 184759 -219276 -90308 -99890
6496 -99890 -142291 158085 174793 -71164 -177124 20835 -76508 -209792 -11347 88129 988 -45906
6483 80114 -214999 -35632 -344101 -274982 -292976 -62325 208008 348847 -187592 -261210 157884
6471 -150246 -624197 36318 -34889 166158 -397705 25592 -309938 1178 29644 -6588 66100
6459 72921 209284 89600 -183068 -123425 -32554 -151370 138820 64876 -148840 -270778 21962
6447 24414 -299223 100623 -41288 6108 -122585 -50925 459589 237891 -24662 9315 -249489
6435 -817 93524 -181002 157168 63868 -369508 31047 393285 157813 325601 -249031 -289131
6424 -289131 63449 -208928 -86267 -49489 -113644 423850 350838 150323 -2999 -75695 -150028
6413 -150028 -106966 -115349 -207491 168721 54774 93527 -20088 68506 -37199 65016 95172 -32772
6400 160378 115243 -45094 -115403 -200458 258206 219450 1173 152602 -80482 -255353 -281342
6389 -281342 189007 81591 45498 260393 -117739 -41930 95444 -388526 -51399 236506 30027
6377 -149562 -68946 -301711 39681 174241 42055 70449 -243569 80935 -38874 -290734 26200
6365 155116 -194158 211726 95661 -416141 88561 124000 -51140 -54595 106003 271587 327557
6354 327557 -24175 246239 -17365 -37083 221763 -4244 225068 14785 109933 167433 112646
6343 112646 -190672 55724 59257 -224362 85637 -122097 -1111 -101052 -25624 -259677 170940
6331 73851 151385 -21085 -121577 -29355 208846 25348 -119864 -1962 143597 -17757 312494
6319 159558 269534 -236112 82657 -551321 -2663 -207161 -18527 267969 104575 189456 -99056
6307 -349475 182562 -162680 199676 -216591 118019 53536 -14917 -262890 13915 -121502
6296 -239495 576482 -250285 25500 131391 -40093 116915 169848 80665 -96953 -121076 -90912
6285 -90912 20032 -58874 -458191 -14434 -278659 275629 -80210 -70320 -42695 -103700 -115023
6274 -115023 127178 7715 -264581 -154340 176974 -89608 26852 -312101 252731 55063 -58561
6262 -401734 -27954 121733 229485 230607 -264715 177527 112531 -32223 -95090 -156469 -68603
6250 258554 327793 -82243 102852 -242366 -33134 -265005 -24713 -17975 -21887 120497 265150
6239 265150 12303 81061 -69454 -73501 -82803 -87824 -4993 -242109 88323 -81756 79935 -69401
6226 -39693 31992 -228116 -15191 -211024 40678 -68509 153217 57831 -169289 -10419 179373
6214 -182558 -69332 -236624 -57737 22873 89547 106819 131732 5099 9988 266159 -347968
6202 63963 -12098 -190075 502766 106021 -5981 -225917 -151773 287427 7250 -100805 112198
6190 43524 -239207 -110981 -127200 231992 -32244 -79541 322288 -50644 -222835 -356194 247197
6178 -185508 -215391 -104057 -78877 99473 40143 94562 -71240 86639 -140450 -67692 35435
6166 -122835 38643 9654 -7728 157132 22904 -79391 36356 49389 -456558 281756 -208769
6154 127899 -65745 44204 -207110 51192 -126428 -151206 -5232 -171998 -85934 301735 269562
6143 269562 -235312 -194234 45250 155732 -90817 22385 -318087 87934 213742 -143348 18910
6131 -97040 -17193 96055 59501 39804 202758 78449 239495 21869 -58144 180063 98283
6120 98283 -31942 -329117 -78395 11403 50815 -106340 52080 27967 -124667 -78699 43339
6108 -54742 119534 -171519 246777 -83629 19790 7823 -186837 -85965 -38136 152594 66953
6096 -230837 -127105 138498 -301451 132006 78118 148739 -377266 -36999 -172441 35778
6085 12589 -321142 137053 -282970 113985 -64239 -24617 181575 -142469 157827 -111388
6074 -201296 128353 -176503 464 268731 83826 130255 247896 -71206 125090 -44096 -79253
6063 -79253 -45444 -56561 -44908 -16416 47032 -14910 -124525 62741 -110236 -91073 11015
6051 256540 205693 -106745 -15886 273395 42645 66221 159119 -40201 -147917 121959 -206452
6039 135769 84252 -132871 14868 -212862 166578 -303803 -65995 157 176742 -26377 -160804
6028 -160804 -88558 -102886 -53942 44019 -230689 -36197 -242218 50944 -26044 -93791 53350
6016 -199858 39956 214125 318583 -104894 -27505 -26797 -96810 73561 191137 -10634 37358
6004 -101809 212679 -117615 88091 -215763 -82808 193181 -38515 97080 -136926 -259961
5994 -259961 127424 214831 303280 -188284 -196197 105014 15207 41956 257290 47561 107367
5983 107367 72644 113413 -279656 146473 93269 3898 -154794 -123302 -163585 88954 45831
5972 45831 91181 53295 123494 -23393 -27751 139047 -54742 -10157 165339 39376 -227445
5960 -177138 3524 41246 -210087 14631 -168641 14300 -131840 -204057 12400 162863 -248855
5948 156694 -126570 -75063 -45646 92033 -9713 -210643 -204207 352202 73340 -29755 21100
5936 304418 201406 24394 77021 142615 -170014 263686 -143777 -189446 -10357 210064 160619
5925 160619 -102719 28159 101421 -7265 -255291 -7356 -90762 -224730 -18329 -222957 -66538
5913 14334 -13895 -4684 -133631 264118 35388 103953 139218 -30067 40042 206416 -128695
5901 -6195 -68861 263921 244722 -68856 330579 -153878 147043 -245613 182194 -198629 92894
5889 -184724 228187 -298464 40891 115940 -280135 -20155 152318 -97733 -238816 -126497
5879 -126497 -150813 98069 288493 138588 35843 85178 -19255 289256 163014 -77402 187347
5867 -48691 -214017 -154260 151880 -200762 90068 54186 -150287 201558 -160664 -284331
5857 -284331 -3684 -303442 -219223 -1277 -107820 -46978 -127125 219348 54807 -203296 152872
5845 -53249 48193 277020 -245073 260231 -61272 104912 329967 5977 476098 187712 213496
5834 213496 -120867 -151552 86757 -284 -82365 43472 -200181 -111616 45673 19665 -3461 99675
5821 54939 -14200 -281478 -137775 223671 216688 -241606 -143473 67449 -138852 -141143 -7092
5809 -125846 -136253 -192245 -142610 -10692 163710 -189511 -102520 27559 172103 -171236 -168483
5798 -168483 86381 37625 238051 -72743 51814 -217390 34034 117275 1174 164274 -56687
5786 -76771 -121799 -85491 -279398 -27813 -402400 -503992 37632 -78686 -115503 144900 -11482
5774 103614 253981 -39370 -77181 -32928 73509 -283697 36485 -58167 296129 -142284 -24734
5762 1963 168160 -351 -69526 -81380 142397 148314 -93072 5233 -117197 319844 -38908 27738
5749 -110030 19816 35160 -370078 -183953 51951 168950 -4820 -180895 -272459 96744 -88418
5737 -174678 203232 135968 -102353 -119775 1757 71228 -37724 75066 -381508 12953 -183039
5725 75720 -31608 57474 127863 129601 275402 -121893 -289164 387882 -238396 -89155 25369
5713 -138932 -10173 8086 80844 219719 64700 -221808 43710 248813 91057 292793 233083
5702 233083 356966 73774 -193394 -101572 218085 -143997 33604 -136215 -45894 99961 159922
5691 159922 -39928 -128268 -64391 75964 -63181 152567 -150325 -87794 139888 -171286 12356
5679 338427 -121762 -4355 -25711 -108732 -229814 38330 -238333 -125200 -324678 371499 -46279
5667 56590 211955 280733 373306 64938 87162 -111394 -59388 121452 1873 11999 -107166
5655 -17369 7226 73953 78119 46422 -140154 -187404 -88853 -143432 -234250 401610 -61255 116834
5642 250885 214217 -36601 -366621 -68500 31993 162479 -123605 -192585 35405 51312 45049
5631 45049 -182868 42397 -25824 385158 -50335 -257192 -231275 -177648 -160123 213589 -173718
5619 -309642 -77958 339750 -126738 -98743 -219679 -70364 185525 94314 70195 31935 -178492
5607 -102443 270514 400344 99895 4319 -242607 8993 -125847 13979 -170634 -299291 -68499
5595 -211249 7793 145302 -190521 -101143 201410 -12613 -403405 375316 -94541 247370 137110
5584 137110 38473 -40986 -43618 -248228 -88841 -278020 -16122 -272670 -252167 -62664 69308
5572 64109 -109006 219518 -74624 -147297 -248983 59266 22587 277931 194364 -330311 -83954
5560 -88079 19814 -176523 322083 -16649 67293 -200192 -111209 -310127 -102392 -32916 10427
5548 80087 -136475 226187 -67335 -108220 -183466 130246 -41091 -170436 -2033 -142436 47533
5536 82015 197121 -177778 67187 -69541 -183557 48306 -90302 59522 -117603 184679 -154677
5524 160308 -68530 206933 138919 116707 176248 23234 -78873 -85529 -13172 -46968 172244
5512 267915 39443 -36639 214024 37379 -49323 79409 103323 -50377 77521 232333 342522
5501 342522 58061 -198070 -2019 -86796 -58388 98416 -55611 65730 -5379 35544 -5502 364227
5488 -11141 -184150 444628 -219408 69171 328414 -152972 -116541 84811 311847 265105 150696
5477 150696 -155475 115734 -76369 59842 -49295 -7439 340377 276573 -371798 -7174 -43483
5466 -43483 -263222 196451 129333 142417 -35528 73302 110324 -23108 -106159 -285162 37515
5454 85924 -87020 -116245 90488 -58495 274239 55031 -51381 -86080 167613 -69400 -160610
5443 -160610 -140838 -111898 183661 -8726 -18467 -262182 141516 -200444 -181081 18377 -11060
5431 178903 -307006 242440 -140434 102007 111653 26203 253110 71977 -41727 -132798 -126456
5420 -126456 -226493 174849 70134 -259991 -111143 -13139 210765 85983 31930 217649
5410 217649 -98089 -240146 -52061 103267 -74290 -121975 -396121 -67522 -225972 31372 -78734
5398 -153372 299714 261714 -277303 -286602 -79535 148130 -117559 188794 -125695 269426
5387 193087 -47119 -167013 -154655 85972 205014 194089 214906 -89696 113272 71150 -46446
5375 232818 -33475 -173728 128135 -61572 162480 164672 124976 183413 -181464 -95 -29001 90517
5362 6297 29998 59554 -196493 33510 89863 215154 -73590 226887 68204 301047 -153778
5350 3545 -413505 -554 -91116 -34230 124393 148009 22071 -277577 143436 71291 36847 32257
5338 32257 -51702 -140211 -70754 117308 -91316 -14550 174440 -8875 36402 -128254 144408
5326 36843 -59118 -8985 29301 319396 -26099 376603 30664 -179688 -2687 -238871 127160
5314 -157666 59467 17051 27642 -28181 264577 -240667 -65355 45841 272365 -16937 98951
5302 218193 -153382 -125589 161079 -291630 -101239 104899 171763 -240600 35198 151668
5292 151668 60819 4582 -451067 18546 -225878 16439 32720 -247257 251041 -151587 -240501
5281 -240501 -247917 54629 316655 -166451 77484 -42538 101603 109115 -168641 114747 2684
5269 -83380 -249830 19002 479159 -123341 -142253 -137488 99175 -39057 237221 -82848 -13051
5257 -4271 25656 -96356 68578 307086 -79444 255315 -191727 2623 -368523 75140 -217103
5245 -442114 297335 223264 41157 55636 203502 -33893 -129161 -109475 90016 -118204 325048
5233 106776 66064 408594 -276814 86012 -98761 -112986 -77355 -177961 154350 39728 186966
5222 186966 -88003 122893 -90280 -2420 -48672 -249199 4866 -25496 229297 -386425 -154229
5210 256302 -202800 -174243 283334 -130475 91640 -102479 210967 -51106 25225 -50717 -303883
5199 -303883 13785 362828 -133599 146905 34850 -43090 -131859 63574 274175 -331544 -198269
5188 -198269 132412 57359 -229575 231203 208575 -187041 -207059 49777 -356161 69146 -388961
5176 -132778 -137670 -129168 -67274 69737 -36896 -134667 325732 -151066 -243330 93264 -238690
5164 179756 -1319 12347 92468 -88515 -35980 166162 77405 -42723 -263554 268102 108003
5152 62228 -165205 30992 -132315 27704 53968 -346824 -3881 174665 -136876 174559 94310
5141 94310 -332644 -247936 20312 -91230 -162399 -100330 -192141 -85560 -148022 107770 57058
5130 57058 -471066 188955 155994 209840 124009 -53384 32291 177758 -195579 -20873 -155514
5119 -155514 -127989 103330 80399 264153 82814 -105544 -89893 123923 -10703 140061 27415
5107 154848 10516 -148427 100581 22359 -24796 31905 -47097 135400 -49225 -207770 -82701
5095 248046 187596 -21840 -307231 -143597 93611 -280045 256582 -45498 -15158 -284660 -100618
5083 255463 377378 119366 41337 -151365 -124263 143228 22231 159960 -78420 33161 -247226
5071 164814 -67768 -376785 95141 23151 -42434 -57086 -54487 -34898 -70674 26875 158520
5060 158520 24302 266388 151508 -220370 -95965 -47186 89937 121339 176466 14169 26940
5049 26940 101218 -85802 -140503 56749 116855 -406739 -49311 109414 -79593 95954 91997 347729
5037 347729 -33306 -88029 21164 48265 93121 149470 -100321 -128699 -146621 85843 -105306
5025 -56182 133781 -47682 -65257 11945 51161 -162778 202873 -163403 185554 4779 -143919
5013 66255 203525 69122 59646 230986 -110332 124463 -142534 169490 190200 76654 268067
5002 268067 21411 -138909 -5664 67372 -158498 35405 391849 -201053 155998 280354 -3752
4990 -63010 -142806 -144217 70309 -150518 -105098 -90739 84458 24312 84408 140001 219283 115026
4978 115026 552 -144791 -370329 -206874 36791 -12616 53809 76765 268840 -153215 -58813
4966 6632 8782 71614 48226 95706 -44557 -255214 235396 249499 -372648 -44328 190662
4954 262390 -143598 366577 39233 95349 283066 570313 -99960 -269726 268411 -49601
4943 -117540 -16645 24306 -221319 -123197 -105059 119621 -128296 15544 -106121 187747 225427
4932 225427 -89771 -8445 202841 -85237 78049 15180 -65479 268406 -183875 -497816 225213
4920 -210722 -368657 -18733 54176 138075 12407 106838 -52085 -92196 -152018 -141577 -316631
4909 -316631 332840 189258 -165285 383222 -412531 266742 -278538 157789 4596 -60851
4898 -172620 223084 -163054 -119696 157547 -2133 -257743 -74900 40292 -186687 -143044 -298907
4887 -298907 -225024 86777 158952 -95408 -58910 3835 236042 81031 -72010 184561 -23207
4875 156355 -363693 7754 250198 -128639 -80843 -206846 340092 25495 -275198 249457
4864 78794 109628 59062 200137 84141 19760 -6707 140258 17626 -291107 -119346 170963
4852 -384736 398101 461293 -25858 -68178 134722 105782 165601 -26200 19336 -345053 163042
4840 176265 171673 -115538 -39679 -51443 -12070 -53617 155448 -167100 163653 -23540 -107846
4829 -107846 379900 13588 275372 274836 205685 112128 204099 -249209 220831 -54576 220216
4817 131305 -14441 -220810 -135474 -52462 102388 171234 -51442 -114963 -161173 322042 340525
4806 340525 -133431 -135819 295343 103067 -41868 159693 -52711 -227302 133249 -94158 -580222
4795 -580222 183332 224321 74512 151149 34560 6282 -282873 2588 -177630 -5320 -37954 -178651
4783 -178651 175861 -178167 -64152 52240 71723 241893 -74607 -189015 -65983 -274032 4916
4771 -165042 106548 65182 -223431 -18723 173380 58514 338255 153145 -70404 71894 -420207
4759 -218726 160812 -162710 -151050 43675 -75093 -43587 -81275 408290 285782 -56307 -84897
4748 -84897 -153733 -908 268878 -200103 72437 2534 46206 -229945 -64283 -51005 108315 36173
4735 84554 68621 -72775 -125169 -154380 157998 -25805 -5562 31627 255846 212356 -98338 -48836
4722 -40882 89201 -313855 109565 -108094 -218271 -200327 -69354 -19245 -192801 83005 208901
4711 208901 22033 476848 -86446 99993 225855 73240 -135388 224929 -120714 -133251 -182419
4700 -182419 -21471 91770 82634 -66552 -40682 15202 -121137 -181660 -20512 -101811 372193
4688 48377 181595 3643 -124132 135891 -314400 212260 -62095 -184721 84396 76915 -170684
4676 -26795 307329 179490 91351 -45595 185461 179391 131519 -333970 138020 42139 -324175
4664 -12002 104348 68407 -114311 -2070 212693 -174437 301448 40462 -174719 -286115 59626
4652 198867 -51721 -220799 161228 11702 86381 -108297 21332 -190141 -223359 57634 71851
4641 71851 41270 266232 320402 119697 297230 -16346 -450071 -105380 -18571 -136976 229113
4629 -62239 -59985 62114 -89366 -1730 408315 -346881 24691 185103 102756 137578 38728 145672
4617 145672 66077 -84924 -232445 -237138 -83837 258078 1552 147534 6976 286851 -62285
4605 -263187 14344 -47689 107385 20770 66863 -116658 -180980 21987 207926 -2143 298229
4593 52608 19104 -76154 91487 -30203 -162348 666343 41835 -42240 -216225 -30173 -376309
4582 -376309 -12054 4095 6655 189428 -373789 -162157 -154018 -23726 -154631 -199965 -117282
4571 -117282 8080 -29288 354450 27522 -10526 174013 150140 10093 -142705 -80411 310310
4559 -225341 -389393 -253803 -55550 122999 -269043 -170014 -79461 -20823 59217 -158181 246015
4547 -112271 -137411 -33271 113293 -136065 150902 -12949 110596 229793 206800 -253095
4536 50006 185410 336474 -61492 -123778 -383292 20313 29501 39557 -43862 17807 104425
4525 104425 108174 -42888 -49616 251934 -40362 47456 77639 43751 -139375 87859 -183156
4513 109502 16301 -34174 204797 35380 81464 113719 431321 -145627 24617 251147 33137
4501 -144169 -257935 226952 113205 1608 345979 -70397 371933 129037 50564 -257881
4490 -150620 -32271 47342 49441 50372 -68646 -29542 -148563 -64565 83011 -164275 216316 -10969
4477 2260 -11199 141575 109955 -96444 59672 253341 320131 -82004 173456 102110 182970
4466 182970 255566 72968 850 198913 122646 -74731 -191328 -73412 -141989 125801 113661
4455 113661 307266 -162637 -81331 2250 64110 324119 -11105 123922 -37887 -396008 13836
4443 -35869 -71934 210885 -162834 -42138 82096 -57304 -52330 -29156 -1929 263277 75868 -45385
4430 -158951 -102573 120297 -234277 22905 39679 -171603 271 -15421 -189278 -173281 97175
$$ [...]
##END NTUPLES=NMR SPECTRUM
##END=
