##TITLE=NES1000_872015067_9224993_pcruELpAMf
##JCAMPDX= 6.0         $$ Bruker NMR JCAMP-DX V2.0
##DATA TYPE= NMR SPECTRUM
##DATA CLASS= NTUPLES
##ORIGIN= BRUKER
##OWNER= Administrator
$$ 1.72 TOPSPIN		Version 2.1
$$ 2015-06-17 15:11:57.081 -0700  Administrator@X
$$ Compression mode = diff/dup
##.OBSERVE FREQUENCY= 400.02188249412
##.OBSERVE NUCLEUS= ^1H
##.ACQUISITION MODE= SIMULTANEOUS (DQD)
##.ACQUISITION SCHEME= undefined
##.AVERAGES= 64
##.DIGITISER RES= 22
##SPECTROMETER/DATA SYSTEM= spect
##.PULSE SEQUENCE= noesygpps1d.comp
##.SOLVENT NAME= COFFEE_meoh
##.SHIFT REFERENCE= INTERNAL, COFFEE_meoh, 1, 14.96296
##AUDIT TRAIL= $$ (NUMBER, WHEN, WHO, WHERE, PROCESS, VERSION, WHAT)
$$ ##TITLE= Audit trail, TOPSPIN		Version 2.1
$$ ##JCAMPDX= 5.01
$$ ##ORIGIN= Bruker BioSpin GmbH
$$ ##OWNER= Administrator
$$ $$ E:\/data/COFFEE/nmr/NES1000_872015067_9224993_pcruELpAMf/12/pdata/1/auditp.txt
$$ ##AUDIT TRAIL=  $$ (NUMBER, WHEN, WHO, WHERE, PROCESS, VERSION, WHAT)
(   1,<2015-06-17 15:11:51.519 -0700>,<Administrator>,<X>,<go>,<TOPSPIN 2.1>,
      <created by zg
	started at 2015-06-17 15:00:21.362 -0700,
	POWCHK enabled, PULCHK disabled,
       configuration hash MD5:
       21 0F 79 D6 B3 7B B4 F6 88 20 88 DB 03 48 BD 9F
       data hash MD5: 64K
       4B E2 17 E5 9F 3C A7 25 C2 EC F4 72 5D DF DA 65>)
(   2,<2015-06-17 15:11:55.003 -0700>,<Administrator>,<X>,<proc1d>,<TOPSPIN 2.1>,
      <Start of raw data processing
       efp LB = 0.3 FT_mod = 6 PKNL = 1 PHC0 = 0 PHC1 = 0 SI = 128K 
       data hash MD5: 128K
       BB 99 1B 92 D0 A4 93 9E 2C 5D 09 FC 0A 06 D9 5D>)
(   3,<2015-06-17 15:11:55.894 -0700>,<Administrator>,<X>,<proc1d>,<TOPSPIN 2.1>,
      <pk PHC0 = -87.46765 PHC1 = 0 
       data hash MD5: 128K
       62 F6 39 97 66 04 20 8E 66 CD 79 DD 02 C7 95 05>)
(   4,<2015-06-17 15:11:56.300 -0700>,<Administrator>,<X>,<proc1d>,<TOPSPIN 2.1>,
      <abs ABSG = 1 
       data hash MD5: 128K
       B1 C5 B4 06 20 75 72 64 0A 97 68 00 3C 5A 82 4F>)
(   5,<2015-06-17 15:11:56.394 -0700>,<Administrator>,<X>,<proc1d>,<TOPSPIN 2.1>,
      <abs ABSG = 2 
       data hash MD5: 128K
       F4 E4 1E D9 AD C1 5C BF D8 3D 9C 66 C9 95 89 72>)
(   6,<2015-06-17 15:11:56.472 -0700>,<Administrator>,<X>,<proc1d>,<TOPSPIN 2.1>,
      <abs ABSG = 3 
       data hash MD5: 128K
       AB D4 0B F2 20 EC 91 34 C6 8F 68 C5 3B A1 8F EB>)
(   7,<2015-06-17 15:11:56.550 -0700>,<Administrator>,<X>,<proc1d>,<TOPSPIN 2.1>,
      <abs ABSG = 4 
       data hash MD5: 128K
       4B 4C EB 94 E4 C7 D2 91 0A EA 50 2B DE 45 35 4D>)
(   8,<2015-06-17 15:11:56.628 -0700>,<Administrator>,<X>,<proc1d>,<TOPSPIN 2.1>,
      <abs ABSG = 5 
       data hash MD5: 128K
       6D 50 8D D8 11 97 BD 0B C0 FD 82 B7 F5 06 B9 BB>)
$$ ##END=
$$ 
$$ $$ hash MD5
$$ $$ EF 84 F9 BF D0 23 5B C5 2A 3E 80 C0 B0 58 6F A5
##$RELAX= 
##$RELAX= 
##$RELAX= 
##$RELAX= 
##$RELAX= 
##$RELAX= 
##$RELAX= 
##$RELAX= 
$$ Bruker specific parameters
$$ --------------------------
##$DU= <E:\>
##$EXPNO= 12
$$ [...]
##$TP07= 0
##$TPNAME0= <>
##$TPNAME1= <>
##$TPNAME2= <>
##$TPNAME3= <>
##$TPNAME4= <>
##$TPNAME5= <>
##$TPNAME6= <>
##$TPNAME7= <>
##$TPOAL= (0..7)
0.5 0.5 0.5 0.5 0.5 0.5 0.5 0.5
##$TPOFFS= (0..7)
0 0 0 0 0 0 0 0
##$TUNHIN= 0
##$TUNHOUT= 0
##$TUNXOUT= 0
##$USERA1= <user>
##$USERA2= <user>
##$USERA3= <user>
##$USERA4= <user>
##$USERA5= <user>
##$V9= 5
##$VALIST= <valist>
##$VCLIST= <CCCCCCCCCCCCCCC>
##$VD= 0
##$VDLIST= <DDDDDDDDDDDDDDD>
##$VPLIST= <PPPPPPPPPPPPPPP>
##$VTLIST= <TTTTTTTTTTTTTTT>
##$WBST= 2048
##$WBSW= 25
##$XGAIN= (0..3)
0 0 0 0
##$XL= 0
##$YL= 0
##$YMAX_a= 6436481
##$YMIN_a= -12593105
##$ZGOPTNS= <>
##$ZL1= 120
##$ZL2= 120
##$ZL3= 120
##$ZL4= 120
##$ABSF1= 14.96296
##$ABSF2= -5.595222
##$ABSG= 5
##$ABSL= 3
##$ALPHA= 0
##$AQORDER= 0
##$ASSFAC= 0
##$ASSFACI= 0
##$ASSFACX= 0
##$ASSWID= 0
##$AUNMP= <proc_prof1d_extract.lims>
##$AXLEFT= 0
##$AXNAME= <>
##$AXNUC= <1H>
##$AXRIGHT= 0
##$AXTYPE= 0
##$AXUNIT= <>
##$AZFE= 0.1
##$AZFW= 0.1
##$BCFW= 0
##$BC_mod= 0
##$BYTORDP= 0
##$COROFFS= 0
##$CY= 15
##$DATMOD= 1
##$DC= 0
##$DFILT= <>
##$DTYPP= 0
##$F1P= 0
##$F2P= 0
##$FCOR= 0.5
##$FTSIZE= 131072
##$FT_mod= 6
##$GAMMA= 0
##$GB= 0
##$INTBC= 1
##$INTSCL= 1
##$ISEN= 128
##$LB= 0.3
##$LEV0= 0
##$LPBIN= 0
##$MAXI= 10000
##$MC2= 0
##$MEAN= 0
##$ME_mod= 0
##$MI= 0
##$NCOEF= 0
##$NC_proc= -2
##$NLEV= 6
##$NOISF1= 0
##$NOISF2= 0
##$NSP= 0
##$NTH_PI= 0
##$NZP= 0
##$OFFSET= 14.96296
##$PC= 1
##$PHC0= -87.46765
##$PHC1= 0
##$PH_mod= 1
##$PKNL= yes
##$PPARMOD= 0
##$PPDIAG= 0
##$PPIPTYP= 0
##$PPMPNUM= 2147483647
##$PPRESOL= 1
##$PSCAL= 4
##$PSIGN= 0
##$PYNMP= <proc.py>
##$REVERSE= no
##$SF= 400.020008852462
##$SI= 131072
##$SIGF1= 0
##$SIGF2= 0
##$SINO= 400
##$SIOLD= 131072
##$SPECTYP= <>
##$SREGLST= <1H.CDCl3>
##$SSB= 0
##$STSI= 131072
##$STSR= 0
##$SW_p= 8223.68421052631
##$SYMM= 0
##$S_DEV= 0
##$TDeff= 65536
##$TDoff= 0
##$TI= <>
##$TILT= no
##$TM1= 0
##$TM2= 0
##$TOPLEV= 0
##$USERP1= <user>
##$USERP2= <user>
##$USERP3= <user>
##$USERP4= <user>
##$USERP5= <user>
##$WDW= 1
##$XDIM= 131072
##$YMAX_p= 377027634
##$YMIN_p= -10648
##$CURPLOT= <Network HP LaserJet P1505>
##$CURPRIN= <$Network HP LaserJet P1505>
##$DFORMAT= <normdp>
##$LAYOUT= <+/1D_H.xwp>
##$LFORMAT= <normlp>
##$PFORMAT= <normpl>
##$SURQMSG= 1
$$ End of Bruker specific parameters
$$ ---------------------------------
##NTUPLES= NMR SPECTRUM
##VAR_NAME=  FREQUENCY,     SPECTRUM/REAL,   SPECTRUM/IMAG
##SYMBOL=    X,             R,               I
##VAR_TYPE=  INDEPENDENT,   DEPENDENT,       DEPENDENT
##VAR_FORM=  AFFN,          ASDF,            ASDF
##VAR_DIM=   131072,        131072,          131072
##UNITS=     HZ,            ARBITRARY UNITS, ARBITRARY UNITS
##FACTOR=    0.0627417313425164, 1,          1
##FIRST=     8223.62146879497, 2227,         -45530
##LAST=      0,             4289,            -45016
##MIN=       0,             -10648,          0
##MAX=       8223.62146879497, 377027634,    0
$$ Real data points
##PAGE= N=1
##DATA TABLE= (X++(R..R)), XYDATA
$$ [...]
61055G69935O652N821M637L867L915M244M258M260M841N819O696P717R441J1577
$$ 769935 776587 782408 787045 790912 794827 799071 803329 807589 812430 818249 824945 832662 842103 853680
61041H53680J3323J4670J6351J8571K0826K2803K4632K6426K8500L1573L5722
$$ 853680 867003 881673 898024 916595 937421 960224 984856 1011282 1039782 1071355 1107077
61030A107077L9691M2586M5623N0562N6840O2169O5681O8443P1010P2846P4428
$$ 1107077 1146768 1189354 1234977 1285539 1342379 1404548 1470229 1538672 1609682 1682528 1756956
61019A756956P7547Q3033R0327R9727J12504J28135J44121J59638J76877J97883
$$ 1756956 1834503 1917536 2007863 2107590 2220094 2348229 2492350 2651988 2828865 3026748
61009C026748K23185K54791K96950L51731M17200M92404N80495O84285Q04005
$$ 3026748 3249933 3504724 3801674 4153405 4570605 5063009 5643504 6327789 7131794
61000G131794R44844J122170J352054J639627J982372K372269K766847L048522
$$ 7131794 8076638 9198808 10550862 12190489 14172861 16545130 19311977 22360499
60992B2360499L043035K626555J842149R07628R5565m06417n44209l60165M1572
$$ 22360499 25403534 28030089 29872238 30779866 30875431 30469014 29924805 29564640 29606212
60983B9606212M88632P51016O27832O7675p87057j680910k383319k778492k868788
$$ 29606212 30094844 30845860 31473692 31541367 30754310 29073400 26690081 23911589 21042801
60974B1042801k728733k456481k139018j832124j558722j322345j120620r48914
$$ 21042801 18314068 15857587 13718569 11886445 10327723 9005378 7884758 6935844
60966F935844q00287o69349n55816m61652l86141l26029k78727k42397k14038
$$ 6935844 6135557 5466208 4910392 4448740 4062599 3736570 3457843 3215446 3001408
60957C001408j90320j70024j53499j40071j27810j15629j03847r2875q2805p4125
$$ 3001408 2811088 2641064 2487565 2347494 2219684 2104055 2000208 1907333 1824528 1750403
60947A750403o7464o2665n9093n6513n4642n2365m8597m3649l8688l4193k9886
$$ 1750403 1682939 1620274 1561181 1504668 1450026 1397661 1349064 1305415 1266727 1232534 1202648
60936A202648k5823k2471j9968j8204j7301j7227j7286j6789j5807j4576j2933
$$ 1202648 1176825 1154354 1134386 1116182 1098881 1081654 1064368 1047579 1031772 1017196 1004263
60925A004263j1073j0067j0494j1342j1422j1102j1371j1979j2075j2003j2748
$$ 1004263 993190 983123 972629 961287 949865 938763 927392 915413 903338 891335 878587
60914H78587j3866j3835j2442j1147j0845j0813j0255r433q793q140p318o751
$$ 878587 864721 850886 838444 827297 816452 805639 795384 785951 777158 769018 761700 754949
60902G54949o774p210p799q379q457p526n995m931m605m194l142j945j218q91
$$ 754949 748175 740965 733166 724787 716330 708804 702809 697878 693273 689079 685937 683992 682774 681883
60888F81883p13p24q07m80L96J310J852K233K658K852K613K294K180J855O95j200
$$ 681883 681170 680446 679639 679159 679555 680865 682717 684950 687608 690460 693073 695367 697547 699402 700097 698897
60872F98897k992l905l811l220k737k471j961q83L90J237J677K276L284M278M677
$$ 698897 695905 692000 688189 684969 682232 679761 677800 676917 677307 678544 680221 682497 685781 690059 694736
60857F94736M143K638N05j473k639k989k807k028o45N02J67j942m927p877j0517
$$ 694736 698879 701517 702022 700549 697910 694921 692114 690086 689441 689943 690110 688168 683241 675364 664847
60842F64847j2650j3765j3669j2894j2088j1263r969p982n617l581k501k382k571
$$ 664847 652197 638432 624763 611869 599781 588518 578549 570567 564950 561369 558868 556486 553915
60829E53915k426j937j410r11l82L2K37N11R56J039L56m59m41L20Q90Q99Q25R42
$$ 553915 551489 549552 548142 547231 546849 546881 547118 547629 548585 549624 549980 549521 549080 549400 550290 551189 552014 552956
60811E52956R88R30J139J611J877J825J811J813J347L86m16o23m12M4P45J280
$$ 552956 553944 554874 556013 557624 559501 561326 563137 564950 566297 566683 566267 565644 565232 565276 566021 567301
60795E67301R84m0q78j055j024j247j599j959k501l087l199k804k481k506k609
$$ 567301 568285 568245 567367 566312 565288 564041 562442 560483 557982 554895 551696 548892 546411 543905 541296
60780E41296k817l512m362m345l262k125j568j041k06J19o61j665j711r57l76
$$ 541296 538479 534967 530605 526260 522998 520873 519305 518264 518058 518177 517516 515851 514140 513183 512807
60765E12807l05m67p58j025p03L69J328J471J428K125L166L446K921K543K663
$$ 512807 512502 512035 511277 510252 509549 509918 511246 512717 514145 516270 519436 522882 525803 528346 531009
60750E31009K667K148J319L07j002k403l399l874l970l520k424j332j081j493
$$ 531009 533676 535824 537143 537450 536448 534045 530646 526772 522802 519282 516858 515526 514445 512952
60736E12952j670j408j294j379j014k53k67j711l557m292l712k937k973l822m784
$$ 512952 511282 509874 508580 507201 506187 505934 505667 503956 500399 496107 492395 489458 486485 482663 477879
60721D77879n204n021m839n276o152o662o351n578m815m065l262k721k675k662
$$ 477879 472675 467654 462815 457539 451387 444725 438374 432796 427981 423916 420654 417933 415258 412596
60707D12596k031r74m38q33j341r06L66J347J424J297J891K910L123K070P47L43
$$ 412596 410565 409591 409153 408320 406979 406073 406439 407786 409210 410507 412398 415308 418431 420501 421248 421591
60691D21591Q37J385J675K200L228M189M389L948L653L926M332M212L559L004
$$ 421591 422428 423813 425488 427688 430916 435105 439494 443442 447095 451021 455353 459565 463124 466128
60677D66128K986L313L609L769L697L026J674M37K99J156J855J645R74O42P71
$$ 466128 469114 472427 476036 479805 483502 486528 488202 488639 488938 490094 491949 493594 494568 495210 495981
60662D95981J006J224J573K089K654L135L365L196K710K135J438L45j142k645
$$ 495981 496987 498211 499784 501873 504527 507662 511027 514223 516933 519068 520506 520851 519709 517064
60648E17064l901m935n647n763n383n044m976m814m287l692l366l211l048k944
$$ 517064 513163 508228 502581 496818 491435 486391 481415 476601 472314 468622 465256 462045 458997 456053
60634D56053k886k665k342k250k330k067j425j069j314j671j829k185k752k635
$$ 456053 453167 450502 448160 445910 443580 441513 440088 439019 437705 436034 434205 432020 429268 426633
60620D26633j463m95j078k629l374k694j584r64p10l72J47P48J264J315P25J9
$$ 426633 425170 424675 423597 420968 417594 414900 413316 412352 411642 411270 411417 412165 413429 414744 415469 415488
60604D15488m3N85J337J844K153K281K214K149K141J787Q98J24J76P50J061J104
$$ 415488 415445 416030 417367 419211 421364 423645 425859 428008 430149 431936 432834 432958 433134 433884 434945 436049
60588D36049J415J821J522L70q64j542j609j012L46J978L024L234K983K369J206
$$ 436049 437464 439285 440807 441177 440313 438771 437162 436150 436496 438474 441498 444732 447715 450084 451290
60573D51290n6m43K67J259J887K309K686K726K334J882J480P87j9m6J093K588
$$ 451290 451234 450791 451058 452317 454204 456513 459199 461925 464259 466141 467621 468408 468389 468343 469436 472024
60557D72024L466L687L677L531L293L452M386N722O796P517Q293R409J0866J2628
$$ 472024 475490 479177 482854 486385 489678 493130 497516 503238 510034 517551 525844 535253 546119 558747
60543E58747J4768J7432K0853K5072K9656L4130L8691M3864M9381N4245N8083
$$ 558747 573515 590947 611800 636872 666528 700658 739349 783213 832594 886839 944922
60532I44922O1506O4348O4506N9516M9009L4794J8804J949j5002l0489m2676n0627
$$ 944922 1006428 1070776 1135282 1194798 1243807 1278601 1297405 1299354 1284352 1253863 1211187 1160560
60520A160560n4565n5228n3271m9236m3791l7784l1999k6815k2032j7138j1903
$$ 1160560 1105995 1050767 997496 948260 904469 866685 834686 807871 785839 768701 756798
60509G56798o860k901j60K492O312J1245J6234K0999K6458L3118M0076M6336N2103
$$ 756798 749938 747037 746877 749369 755681 766926 783160 804159 830617 863735 903811 950147 1002250
60496A002250N7713O1940O2734N9240N1993M1480K7946J2584k411j5212k4802
$$ 1002250 1059963 1121903 1184637 1243877 1295870 1337350 1365296 1377880 1375469 1360257 1335455
60485A335455l0182l0558k6591k0159j2417l082Q032K0055L2099M4052N5636O5665
$$ 1335455 1305273 1274715 1248124 1227965 1215548 1212466 1220498 1240553 1272652 1316704 1372340 1438005
60473A438005P2931P6837P6495P0168N6620L6502J1883j4841m1046o3878q1310
$$ 1438005 1510936 1587773 1664268 1734436 1791056 1827558 1839441 1824600 1783554 1719676 1638366
60462A638366r2928r9157j00438r7580r2075q5180p7272o8666o0272n2682m5497
$$ 1638366 1545438 1446281 1345843 1248263 1156188 1071008 993736 925070 864798 812116 766619
60451G66619l8489l2575k8557k5686k2623j9322j6645j4597j2302r571p188n535
$$ 766619 728130 695555 666998 641312 618689 599367 582722 568125 555823 546252 539064 533529
60439E33529m021k134k14J036J247O30p3n2O07P78k43j664k272k146k269k872
$$ 533529 529508 527374 527160 528196 529443 530073 530000 529948 530555 531333 531090 529426 527154 525008 522739 519867
60423E19867l314l385l448l354k491j030P7N68J233K441L429L578L424L788M694
$$ 519867 516553 513168 509720 506366 503875 502845 502922 503490 504723 507164 510593 514171 517595 521383 526077
60408E26077N723O782P892Q859R655J0653J1942J2927J3201J3349J4249J5931
$$ 526077 531800 538582 546474 555333 564988 575641 587583 600510 613711 627060 641309 657240
60396F57240J7606J8591J8660J7696J5651J2882J0120Q036O883O424O056N212
$$ 657240 674846 693437 712097 729793 745444 758326 768446 776482 783365 789789 795845 801057
60384H01057L938K837K316K092J656R59L11k02p51j346j748j808j701j712j963
$$ 801057 804995 807832 810148 812240 813896 814855 815166 814964 814213 812867 811119 809311 807610 805898 803935
60369H03935k356k682k783k646k372j994j528j193j337j945k402k136j422j169
$$ 803935 801579 798897 796114 793468 791096 789102 787574 786381 785044 783099 780697 778561 777139 775970
60355G75970j766k515k474j654q71n94m44k2L23l9j123k388l547m728n869o615
$$ 775970 774204 771689 769215 767561 766690 766096 765652 765630 765953 765914 764791 762403 758856 754128 748259 741644
60339G41644o947p394q236q877q416o714m614l177k886l447m215m780n192n519
$$ 741644 734697 727303 719067 710190 701774 695060 690446 687269 684383 680936 676721 671941 666749 661230
60325F61230n433m661l695l495m309n297n586n162m540m056l885m162m597m431
$$ 661230 655797 651136 647441 643946 639637 634340 628754 623592 619052 614996 611111 606949 602352 597921
60311E97921l308j875r72n91j91L43P75J303K421M056N609O913Q438J0317J1799
$$ 597921 594613 592738 591766 591175 590984 591327 592102 593405 595826 599882 605491 612404 620842 631159 642958
60296F42958J2032J1002R362P537N270J962k525p289j0770j2007j1475j0387r291
$$ 642958 654990 665992 675354 682891 688161 690123 687598 680309 669539 657532 646057 635670 626379
60283F26379p826n730l538j934r13J6J022J782K092K313K969M061N059N665O266
$$ 626379 618553 612823 609285 607351 606438 606454 607476 609258 611350 613663 616632 620693 625752 631417 637683
60268F37683P388Q866R958J0258J0092J0006J0316J1230J2844J4762J6222J6839
$$ 637683 645071 653937 663895 674153 684245 694251 704567 715797 728641 743403 759625 776464
60256G76464J6863J6561J5946J5255J4936J4785J3924J2302J1327J2085J3674
$$ 776464 793327 809888 825834 841089 856025 870810 884734 897036 908363 920448 934122
60245I34122J4445J4384J4891J6476J8167J9399K1032K3977K7819L1492L4618
$$ 934122 948567 962951 977842 994318 1012485 1031884 1052916 1076893 1104712 1136204 1170822
60234A170822L7516M0532M3995M8305N3509N8972O3951O8233P1998P5342P8308
$$ 1170822 1208338 1248870 1292865 1341170 1394679 1453651 1517602 1585835 1657833 1733175 1811483
60223A811483Q0997Q3278Q4551Q4187Q2079P8625P4217O8948O2635N5139M6686
$$ 1811483 1892480 1975758 2060309 2144496 2226575 2305200 2379417 2448365 2511000 2566139 2612825
60212B612825L7858K9137K0620J2413M995j285o827j2162j6840j9715k0504k0172
$$ 2612825 2650683 2679820 2700440 2712853 2717848 2716563 2709736 2697574 2680734 2661019 2640515 2620343
60200B620343j9480j7962j4874j0449n469q5O142J3245K0639K7959L5517M3776
$$ 2620343 2600863 2582901 2568027 2557578 2552109 2552024 2558166 2571411 2592050 2620009 2655526 2699302
60188B699302N2581O1039O7985P2738P5486P6817P6672P4113O8375N9891M9841
$$ 2699302 2751883 2812922 2880907 2953645 3029131 3105948 3182620 3256733 3325108 3384999 3434840
60177C434840L8978K7340J4993K334j0414k3446l6749m9603o1126p1037p9437
$$ 3434840 3473818 3501158 3516151 3518485 3508071 3484625 3447876 3398273 3337147 3266110 3186673
60166C186673q5910q9334q8837q4706p8163p0421o2045n3035m3204l2527k1413
$$ 3186673 3100763 3011429 2922592 2837886 2759723 2689302 2627257 2574222 2531018 2498491 2477078
60155B477078j0576n18Q756J7269K4394K9206L1469L1852L0877K8208K3333J6611
$$ 2477078 2466502 2465984 2474740 2492009 2516403 2545609 2577078 2608930 2639807 2668015 2691348 2707959
60143B707959R195K056m544j0806j6928k2782k7772l1111l2483l2240l0709k7654
$$ 2707959 2717154 2719210 2714666 2703860 2686932 2664150 2636378 2605267 2572784 2540544 2509835 2482181
60131B482181k2767j6395r277j699O655J6040K6246L6871M7680N8757P0591Q3775
$$ 2482181 2459414 2443019 2433742 2432043 2438698 2454738 2480984 2517855 2565535 2624292 2694883 2778658
60119B778658R8362J13599J28604J43080J57007J70007J81483J91097J98542K03058
$$ 2778658 2877020 2990619 3119223 3262303 3419310 3589317 3770800 3961897 4160439 4363497
60109D363497K03829K00735J94086J83759J69274J50765J29139J05217P9331N1929
$$ 4363497 4567326 4768061 4962147 5145906 5315180 5465945 5595084 5700301 5779632 5831561
60099E831561K3893m020l1511n8268q3622j06881j27563j44993j58276j66975
$$ 5831561 5855454 5851434 5819923 5761655 5678033 5571152 5443589 5298596 5140320 4973345
60089D973345j71551j72715j70558j64677j55067j42676j28998j15050j00688
$$ 4973345 4801794 4629079 4458521 4293844 4138777 3996101 3867103 3752053 3651365
60080C651365q5058o7925n0305l3568j8118l429J0841K4258L6077M5710N2726
$$ 3651365 3566307 3498382 3448077 3414509 3396391 3392962 3403803 3428061 3464138 3509848 3562574
60069C562574N6841N7965N6050N1006M3170L3545K3006J1463j494j5327k8778
$$ 3562574 3619415 3677380 3733430 3784436 3827606 3861151 3884157 3895620 3894126 3878799 3850021
60058C850021m1223n2890o3656p2734p9807q5491r0174r3281r4317r3737r2029
$$ 3850021 3808798 3755908 3692252 3619518 3539711 3454220 3364046 3270765 3176448 3082711 2990682
60047B990682q8638q2713p4582o5487n6132m6336l6036k5671j5360m516P244J9289
$$ 2990682 2902044 2819331 2744749 2679262 2623130 2576794 2540758 2515087 2499727 2495211 2502455 2521744
60035B521744L0688M1388N2080O2845P2619Q0173Q5113Q7399Q6502Q1980P4677
$$ 2521744 2552432 2593820 2645900 2708745 2781364 2861537 2946650 3034049 3120551 3202531 3277208
60024C277208O6212N7070M6236L3153J8910M774r382k4008l8183n0367o0393o9161
$$ 3277208 3343420 3400490 3446726 3479879 3498789 3503563 3494181 3470173 3431990 3381623 3321230 3252069
60012C252069p6633q1560q3322q2639q0229p6027p0029o2722n4318m4653l4137
$$ 3252069 3175436 3093876 3010554 2927915 2847686 2771659 2701630 2638908 2584590 2539937 2505800
60001B505800k3784j3817l391P887J9223K9955M0519N1356O1939P1690Q0982R0383
$$ 2505800 2482016 2468199 2464808 2472695 2491918 2521873 2562392 2613748 2675687 2747377 2828359 2918742
59989B918742R9473J07218J12868J15842J15438J11436J04511R5323Q3684O9280
$$ 2918742 3018215 3125433 3238301 3354143 3469581 3581017 3685528 3780851 3864535 3933815
59979C933815N2745L5333J7892P03j6118l2560m8632o3820p7046q7449r4723r8487
$$ 3933815 3986560 4021893 4039785 4040488 4024370 3991810 3943178 3879358 3802312 3714863 3620140 3521653
59967C521653r8233r4353q8309q1084p2216o1042m8113l4661k1367q478L632J4867
$$ 3521653 3423420 3329067 3240758 3159674 3087458 3026416 2978303 2943642 2922275 2913797 2917429 2932296
59955B932296K5801L6758M7038N5889O3501P0273P5669P8864P9875P9075P6164
$$ 2932296 2958097 2994855 3041893 3097782 3161283 3231556 3307225 3386089 3465964 3545039 3621203
59944C621203P0741O3397N5151M6286L6830K7681J9935J3425P214J351l150n948
$$ 3621203 3691944 3755341 3810492 3856778 3893608 3921289 3941224 3954649 3961863 3963214 3960064 3954116
59932C954116p583p939n740M4R260K1185L5156N0420O6376Q3204J01463J20836
$$ 3954116 3946533 3938594 3932854 3932898 3942158 3963343 3998499 4048919 4115295 4198499 4299962 4420798
59920D420798J40004J57905J74307J88969K01089K09756K14145K12949K04472
$$ 4420798 4560802 4718707 4893014 5081983 5283072 5492828 5706973 5919922 6124394
59911F124394J87694J62912J31226R4060N3292J1099l0659p0466j06540j36805
$$ 6124394 6312088 6475000 6606226 6700286 6753578 6764677 6734018 6663552 6557012 6420207
59901F420207j59754j74885j82396j83039j78219j69442j57477j42642j25866
$$ 6420207 6260453 6085568 5903172 5720133 5541914 5372472 5214995 5072353 4946487
59892D946487j08536r1033p2407n2021l0825j0380Q888K7773M7036O6584Q5788
$$ 4946487 4837951 4746918 4674511 4622490 4591665 4581285 4590173 4617946 4664982 4731566 4817354
59881D817354J04081J21062J36167J48265J55602J56313J49166J33892J11091
$$ 4817354 4921435 5042497 5178664 5326929 5482531 5638844 5788010 5921902 6032993
59872F032993Q1987M8276J2010k4335n7976q6721j09987j28526j42931j53007
$$ 6032993 6114980 6163256 6175266 6150931 6092955 6006234 5896247 5767721 5624790 5471783
59862E471783j58869j61672j62396j60631j55496j47320j37269j25793j12553
$$ 5471783 5312914 5151242 4988846 4828215 4672719 4525399 4388130 4262337 4149784
59853D149784r7800q2595o7497n2091l6018j9644l570J1765K5852L8176M8694
$$ 4149784 4051984 3969389 3901892 3849801 3813783 3794139 3790569 3802334 3828186 3866362 3915056
59842C915056N7556O4447O8936P1446P2960P3612P2350O8032O0016M7773L1034
$$ 3915056 3972612 4037059 4105995 4177441 4250401 4324013 4396363 4464395 4524411 4572184 4603218
59831D603218J0659j1434l3369n3595p0190q1220q6411q7572q6887q5509q4030
$$ 4603218 4613877 4602443 4569074 4515479 4445289 4364069 4277658 4190086 4103199 4017690 3933660
59820C933660q3153q3111q3156q2414q0775p8458p5261p0775o5056n8552n1774
$$ 3933660 3850507 3767396 3684240 3601826 3521051 3442593 3367332 3296557 3231501 3172949 3121175
59809C121175m5275l9643l5282l2480l1513l2092l2855l2366l0718k9184k8119
$$ 3121175 3075900 3036257 3000975 2968495 2936982 2904890 2872035 2839669 2808951 2779767 2751648
59798B751648k6267k2524j7259j1319m738K861J1478K1112L2194M4937N8900P3869
$$ 2751648 2725381 2702857 2685598 2674279 2669541 2672402 2683880 2704992 2737186 2782123 2841023 2914892
59786B914892R0389J08766J28284J48125J68227J88147K05683K17484K20411K11400
$$ 2914892 3005281 3114047 3242331 3390456 3558683 3746830 3952513 4169997 4390408 4601808
59776D601808J87090J45748Q9989K6619l6512r3011j38195j69036j85049j88530
$$ 4601808 4788898 4934646 5024635 5051254 5014742 4921731 4783536 4614500 4429451 4240921
59766D240921j82947j71142j55104j36714j17841r9673q2482o6268n1400l8397
$$ 4240921 4057974 3886832 3731728 3595014 3477173 3377500 3295018 3228750 3177350 3138953
59756C138953k7255j7290p868R81Q917J5982K2589K9015L5382M1941M8775N5428
$$ 3138953 3111698 3094408 3086540 3087521 3096438 3112420 3135009 3164024 3199406 3241347 3290122 3345550
59744C345550O1613O8200P6595Q6935R7907J08653J19879J32521J46342J60665
$$ 3345550 3407163 3475363 3551958 3638893 3736800 3845453 3965332 4097853 4244195 4404860
59734D404860J75679J91980K09410K27356K45860K65452K85921L06022L24310
$$ 4404860 4580539 4772519 4981929 5209285 5455145 5720597 6006518 6312540 6636850
59725F636850L39534L50339L55348L53758L45441L30639L10069K85356K58978
$$ 6636850 6976384 7326723 7682071 8035829 8381270 8711909 9021978 9307334 9566312
59716I566312K33646K11827J95408J85203J80798J81128J85034J91075J97262
$$ 9566312 9799958 10011785 10207193 10392396 10573194 10754322 10939356 11130431 11327693
59707A1327693K01549K02442J98926J90294J76579J58743J37846J14356Q8815
$$ 11327693 11529242 11731684 11930610 12120904 12297483 12456226 12594072 12708428 12797243
59698A2797243O2767L8171J6105l223j9273l0799l6718l6695l0729j8775r69K2232
$$ 12797243 12860010 12898181 12914286 12911063 12891790 12860991 12824273 12787578 12756849 12738074 12737105 12759337
59686A2759337N0279Q2614J18464J56833J96687K36960K76591L14797L50959L83727
$$ 12759337 12809616 12892230 13010694 13167527 13364214 13601174 13877765 14192562 14543521 14927248
59676A4927248M10585M28813M36664M32887M15389L81351L29119K59528J75411
$$ 14927248 15337833 15766646 16203310 16636197 17051586 17432937 17762056 18021584 18196995
59667A8196995Q0536k0741j23441k22340l12513l89687m50546m93039n16559n22110
$$ 18196995 18277531 18256790 18133349 17911009 17598496 17208809 16758263 16265224 15748665 15226555
59657A5226555n12571m92612m67791m43674m25649m18620m25418m44863m71776
$$ 15226555 14713984 14221372 13753581 13309907 12884258 12465638 12040220 11595357 11123581
59648A1123581m99272n21202n33252n33303n21727n01005m74420m44689m13584
$$ 11123581 10624309 10103107 9569855 9036552 8514825 8013820 7539400 7094711 6681127
59639F681127l82159l50985l20474k91323k64456k40318k18365j97582j77432
$$ 6681127 6298968 5947983 5627509 5336186 5071730 4831412 4613047 4415465 4238033
59630D238033j58208j40521j24614j10092r6308q3104p1114o1163n3344m6924
$$ 4238033 4079825 3939304 3814690 3704598 3608290 3525186 3454072 3392909 3339565 3292641
59620C292641m1217l6255l2552l0418k9652k9686k9842k9661k9289k9448l0795
$$ 3292641 3251424 3215169 3182617 3152199 3122547 3092861 3063019 3033358 3004069 2974621 2943826
59609B943826l3244l6097l8740m1041m3009m4366m4726m4029m2550m0463l7684
$$ 2943826 2910582 2874485 2835745 2794704 2751695 2707329 2662603 2618574 2576024 2535561 2497877
59598B497877l4251l0554k7114k4310k2451k1761k1928k1918k0712j8214j5142
$$ 2497877 2463626 2433072 2405958 2381648 2359197 2337436 2315508 2293590 2272878 2254664 2239522
59587B239522j2109r192o229l118K32L756P052R750J2135J4858J8017K0983K3355
$$ 2239522 2227413 2218221 2211992 2208874 2209106 2212862 2219914 2229664 2241799 2256657 2274674 2295657 2319012
59574B319012K5535K8122L1197L4515L7985M1697M5722N0172N5136O0414O5606
$$ 2319012 2344547 2372669 2403866 2438381 2476366 2518063 2563785 2613957 2669093 2729507 2795113
59563B795113P0560P5467Q0476Q5605R1038R7004J03254J09272J14978J20598
$$ 2795113 2865673 2941140 3021616 3107221 3198259 3295263 3398517 3507789 3622767 3743365
59553C743365J25805J29823J32573J34684J36141J36011J34009J30903J26383
$$ 3743365 3869170 3998993 4131566 4266250 4402391 4538402 4672411 4803314 4929697
59544D929697J17757J02358Q0741N6228L1815Q844j1851k9463m4239n7610p0529
$$ 4929697 5047454 5149812 5230553 5286781 5318596 5327440 5315589 5286126 5241887 5184277 5113748
59533E113748q2501r2500j00043j04965j06965j05867j01845r5051q5479p3413
$$ 5113748 5031247 4938747 4838704 4733739 4626774 4520907 4419062 4324011 4238532 4165119
59523D165119n9537m4306k7666r546R801L0051N1049P2620R4474J16252J37188
$$ 4165119 4105582 4061276 4033610 4024064 4033865 4063916 4114965 4187585 4282059 4398311 4535499
59512D535499J55702J69866J78328J80349J75084J61702J40304J12047P8104L9369
$$ 4535499 4691201 4861067 5039395 5219744 5394828 5556530 5696834 5808881 5886985 5926354
59502E926354k507m4589q3949j18985j49036j73264j90715k01193k05189k03084
$$ 5926354 5923847 5879258 5795309 5676324 5527288 5354024 5163309 4962116 4756927 4553843
59492D553843j95112j82339j66883j50618j33887j15922r6499p6754n8129m0891
$$ 4553843 4358731 4176392 4009509 3858891 3725004 3609082 3512583 3435829 3377700 3336809
59482C336809k4070o919J0123K6104M0739N4381O6972P7703Q5812R1284R4457
$$ 3336809 3312739 3305820 3315943 3342047 3382786 3437167 3504139 3581842 3667654 3758938 3853395
59471C853395R5284R3219Q7660P8281O5042M8198K8384O537j6326l9336o1745
$$ 3853395 3948679 4041898 4129558 4207839 4272881 4321079 4349463 4356000 4339674 4300338 4238593
59460D238593q2734j01308j16618j28333j36674j42024j44628j44649j42295j37894
$$ 4238593 4155859 4054551 3937933 3809600 3672926 3530902 3386274 3241625 3099330 2961436
59450B961436j32000j25368j18507j11242j03183r4651q6704p9989p4026o7950
$$ 2961436 2829436 2704068 2585561 2474319 2371136 2276485 2189781 2109792 2035766 1967816
59440A967816o1603n5496m9993m4927l9891l4574k8984k3535j8712j4494j0403
$$ 1967816 1906213 1850717 1800724 1755797 1715906 1681332 1652348 1628813 1610101 1595607 1585204
59429A585204o229k292J191M500P897J1301J4809J8784K2750K4811K3036J7368
$$ 1585204 1578975 1576683 1577874 1582374 1590271 1601572 1616381 1635165 1657915 1682726 1705762 1723130
59417A723130R683K380k634m286k722P75N045J0078J6122K2091K5834K5979K2926
$$ 1723130 1732813 1735193 1732559 1728273 1725551 1726326 1731371 1741449 1757571 1779662 1805496 1831475 1854401
59404A854401J8235J3860J1757J3028J7055K2162K7327L2705L8550M4480N0035
$$ 1854401 1872636 1886496 1898253 1911281 1928336 1950498 1977825 2010530 2049080 2093560 2143595
59393B143595N5229O0342O5734P1958P9390Q7606R5759J03677J11832J20159J27718
$$ 2143595 2198824 2259166 2324900 2396858 2476248 2563854 2659613 2763290 2875122 2995281 3122999
59382C122999J33839J38852J43356J47532J51732J57141J65211J76704J91680
$$ 3122999 3256838 3395690 3539046 3686578 3838310 3995451 4160662 4337366 4529046
59373D529046K09965K31081K53930K77041K99150L19320L36539L49410L56245
$$ 4529046 4739011 4970092 5224022 5501063 5800213 6119533 6456072 6805482 7161727
59364G161727L55704L47560L32912L13391K90371K64994K38541K12023J85516
$$ 7161727 7517431 7864991 8197903 8511294 8801665 9066659 9305200 9517223 9702739
59355I702739J58471J30521J01352O9956L4915m358m7386r3647j42935j94324
$$ 9702739 9861210 9991731 10093083 10163039 10197954 10193596 10146210 10052563 9909628 9715304
59345I715304k45484k93481l35730l69973l94223m07491m10288m03983l89994
$$ 9715304 9469820 9176339 8840609 8470636 8076413 7668922 7258634 6854651 6464657
59336F464657l69959l46047l20411k94526k69416k46229k25963k08689j93604
$$ 6464657 6094698 5748651 5428240 5133714 4864298 4618069 4392106 4183417 3989813
59327C989813j79926j67462j56254j45996j36078j26086j16173j06776r8126r0143
$$ 3989813 3809887 3642425 3486171 3340175 3204097 3078011 2961838 2855062 2756936 2666793
59317B666793q2782p6087o9918o3931n8073n2639m7665m2661l7383l2358k8131
$$ 2666793 2584011 2507924 2438006 2374075 2316002 2263363 2215698 2173037 2135654 2103296 2075165
59306B075165k4391k0468j6271j2093p793k950K402P984J3922K0396K6886L2607
$$ 2075165 2050774 2030306 2014035 2001942 1994149 1991199 1993601 2001585 2015507 2035903 2062789 2095396
59294B095396L7437M1430M3568M2368L7943L2553K8722K7604K9162L2861L7795
$$ 2095396 2132833 2174263 2217831 2260199 2298142 2330695 2359417 2387021 2416183 2449044 2486839
59283B486839M2974M7950N2546N5908N6640N4203M9302M2675L4328K4226J2835
$$ 2486839 2529813 2577763 2630309 2686217 2742857 2797060 2846362 2889037 2923365 2947591 2960426
59272B960426O17j2191k4954l6593m6585n5142o2152o6888o9189p0019p0295o9943
$$ 2960426 2961043 2948852 2923898 2887305 2840720 2785578 2723426 2656538 2587349 2517330 2447035 2377092
59260B377092o8644o6631o4228o1313n7843n4177n0377m5915m0629l5220l0324
$$ 2377092 2308448 2241817 2177589 2116276 2058433 2004256 1953879 1907964 1867335 1832115 1801791
59249A801791k5831k1546j7661j4031r946n254q32K754O086R744J3331J6524J9987
$$ 1801791 1775960 1754414 1736753 1722722 1712776 1707522 1706690 1709444 1715530 1725274 1738605 1755129 1775116
59236A775116K4171K8180L1156L3989L8298M4177N0325N5998O1661O7882P4816
$$ 1775116 1799287 1827467 1858623 1892612 1930910 1975087 2025412 2081410 2143071 2210953 2285769
59225B285769Q2657R1560J01274J11663J23371J36996J51938J66969J81738J96668
$$ 2285769 2368426 2459986 2561260 2672923 2796294 2933290 3085228 3252197 3433935 3630603
59215C630603K11537K25136K36096K42992K43912K37125K22296K00067J70540
$$ 3630603 3842140 4067276 4303372 4546364 4790276 5027401 5249697 5449764 5620304
59206E620304J33367Q9437M1243q656n8498j06338j49468j85496k13361k32791
$$ 5620304 5753671 5843108 5884351 5875695 5817197 5710859 5561391 5375895 5162534 4929743
59196D929743k43577k46065k41763k32637k20006k04550j87104j68891j50947
$$ 4929743 4686166 4440101 4198338 3965701 3745695 3541145 3354041 3185150 3034203
59187C034203j33683j17076j01154q6193p2449n9784m7804l6415k5968j6718q532
$$ 3034203 2900520 2783444 2682290 2596097 2523648 2463864 2416060 2379645 2353677 2336959 2328427
59176B328427j436L994P218Q326P563M660p45q242j6887k6110l5682m4923n2738
$$ 2328427 2326991 2330985 2338203 2346529 2354092 2358752 2358007 2349765 2332878 2306768 2271086 2226163 2173425
59163B173425n8507o2310o4233o4172o2474o0117n7821n5319n1865m7199m1950
$$ 2173425 2114918 2052608 1988375 1924203 1861729 1801612 1743791 1688472 1636607 1589408 1547458
59152A547458l7208l3717l1256k8824k5658k1962j8408j5159j1876q519n574l341
$$ 1547458 1510250 1476533 1445277 1416453 1390795 1368833 1350425 1335266 1323390 1314871 1309297 1305956
59140A305956j495M82K749N078P083Q355Q703Q436Q244Q598R340R832R532Q443
$$ 1305956 1304461 1304943 1307692 1312770 1319853 1328208 1336911 1345347 1353591 1362189 1371529 1381361 1390893 1399336
59126A399336P102O114N655N573N836O621P929R479J1002J2387J3488J4248J5012
$$ 1399336 1406438 1412552 1418207 1423780 1429616 1436237 1444166 1453645 1464647 1477034 1490522 1504770 1519782
59113A519782J6218J7671J8644J8939J9171J9790K0402K0444J9943J9231J8451
$$ 1519782 1536000 1553671 1572315 1591254 1610425 1630215 1650617 1671061 1691004 1710235 1728686
59102A728686J7729J7248J6866J6292J5990J7103J9967K3539K6897L0409L4622
$$ 1728686 1746415 1763663 1780529 1796821 1812811 1829914 1849881 1873420 1900317 1930726 1965348
59091A965348L8939M2461M5370M8283N0865N2313N2736N2710N1728M8478M2601
$$ 1965348 2004287 2046748 2092118 2140401 2191266 2243579 2296315 2349025 2400753 2449231 2491832
59080B491832L4927K6011J5684M212p416j8641k9693m0504n0169n7924o3782o7865
$$ 2491832 2526759 2552770 2568454 2572666 2565250 2546609 2516916 2476412 2426243 2368319 2304537 2236672
59068B236672o9905o9869o8418o6334o3894o1139n8195n5132n1905m8656m5632
$$ 2236672 2166767 2096898 2028480 1962146 1898252 1837113 1778918 1723786 1671881 1623225 1577593
59057A577593m2779l9869l7071l4853l3228l1649k9700k7415k4920k2282j9772
$$ 1577593 1534814 1494945 1457874 1423021 1389793 1358144 1328444 1301029 1276109 1253827 1234055
59046A234055j7677j5843j3885j1865j0270r351r046r386j0343j1319j1542j0939
$$ 1234055 1216378 1200535 1186650 1174785 1164515 1155164 1146118 1136732 1126389 1115070 1103528 1092589
59034A092589j0002q872p341n635m321l322j930K0J824L028M044N298O540P401
$$ 1092589 1082587 1073715 1066374 1060739 1056418 1053096 1051166 1051186 1053010 1056038 1060082 1065380 1071920 1079321
59020A079321Q048Q822R745J0746J1895J3116J4084J4741J5554J7041J9301K2089
$$ 1079321 1087369 1096191 1105936 1116682 1128577 1141693 1155777 1170518 1186072 1203113 1222414 1244503
59008A244503K5006K7575K9617L1700L4702L8825M3364M7491N0854N3389N5055
$$ 1244503 1269509 1297084 1326701 1358401 1393103 1431928 1475292 1522783 1573637 1627026 1682081
58997A682081N5788N5308N2944M8042M0589L1130K0353R153j249j0028j7422k4011
$$ 1682081 1737869 1793177 1846121 1894163 1934752 1965882 1986235 1995388 1994139 1984111 1966689 1942678
58985A942678k9625l3667l6152l7492l7568l6191l4243l3095l2802l2143l0601
$$ 1942678 1913053 1879386 1843234 1805742 1768174 1731983 1697740 1664645 1631843 1599700 1569099
58974A569099k8924k7480k5457k2340j8912j5956j3068r563n671j972J552N029
$$ 1569099 1540175 1512695 1487238 1464898 1445986 1430030 1416962 1407399 1401728 1399756 1401308 1406337
58962A406337Q008J0121J1774J3316J4123J3503J1959J0603R647Q524P324P050
$$ 1406337 1414345 1424466 1436240 1449556 1463679 1477182 1489141 1499744 1509391 1517915 1525239 1532289
58950A532289Q279J0333J2084J3107J3904J5243J7425K0105K2738K5204K7835
$$ 1532289 1540568 1550901 1562985 1576092 1589996 1605239 1622664 1642769 1665507 1690711 1718546
58939A718546L0879L4291L8078M2416M7306N2513N8012O4023P0360P6133Q0212
$$ 1718546 1749425 1783716 1821794 1864210 1911516 1964029 2022041 2086064 2156424 2232557 2312769
58928B312769Q1681P9797P4297O6024N6773M8144M0953L5898L3936L5519L9957
$$ 2312769 2394450 2474247 2548544 2614568 2671341 2719485 2760438 2796336 2830272 2865791 2905748
58917B905748M6083N3140O0684O8258P5807Q4086R3895J05148J17072J29145J41418
$$ 2905748 2951831 3004971 3065655 3133913 3209720 3293806 3387701 3492849 3609921 3739066 3880484
58906C880484J54147J67533J81553J95709K09252K22043K34791K47812K59771
$$ 3880484 4034631 4202164 4383717 4579426 4788678 5010721 5245512 5493324 5753095
58897E753095K68283K71824K70680K66182K59504K51226K41543K30482K17933
$$ 5753095 6021378 6293202 6563882 6830064 7089568 7340794 7582337 7812819 8030752
58888H030752K03483J86263J65136J39361J09187P5624L9683J893l7376p7255
$$ 8030752 8234235 8420498 8585634 8724995 8834182 8909806 8949489 8951382 8914006 8836751
58878H836751j16158j52289j84307k11543k33819k51258k64173k72771k77048
$$ 8836751 8720593 8568304 8383997 8172454 7938635 7687377 7423204 7150433 6873385
58869F873385k77307k74606k70114k64033k55927k46159k35990k25904k14931
$$ 6873385 6596078 6321472 6051358 5787325 5531398 5285239 5049249 4823345 4608414
58860D608414k02420j89434j77362j65953j54020j41631j30141j20279j11450
$$ 4608414 4405994 4216560 4039198 3873245 3719225 3577594 3447453 3327174 3215724
58851C215724j02862r4249q5510p6712o8471o1380n5076m8794m2594l7055l1965
$$ 3215724 3112862 3018613 2933103 2856391 2787920 2726540 2671464 2622670 2580076 2543021 2511056
58840B511056k6649k1384j7141j3880j0384n942r73M019Q780J2701J5398J8031
$$ 2511056 2484407 2463023 2445882 2432002 2421618 2415676 2414703 2418722 2427502 2440203 2455601 2473632
58828B473632K2344K8184L3605L7781M1947M6887N1484N4757N7529O0798O3929
$$ 2473632 2495976 2524160 2557765 2595546 2637493 2684380 2735864 2790621 2848150 2908948 2972877
58817B972877O5904O7196O9097P2170P6484Q2363Q9743R7780J06204J16100J28235
$$ 2972877 3038781 3105977 3175074 3247244 3323728 3406091 3495834 3593614 3699818 3815918 3944153
58806C944153J41654J55170J69103J84183J99728K14506K28586K42632K55948
$$ 3944153 4085807 4240977 4410080 4594263 4793991 5008497 5237083 5479715 5735663
58797E735663K66826K74504K79244K80664K77453K68615K53846K32798K05292
$$ 5735663 6002489 6276993 6556237 6836901 7114354 7382969 7636815 7869613 8074905
58788H074905J72183J34881R4040M9817L415m2731q6382j26316j61850j92519
$$ 8074905 8247088 8381969 8476009 8525826 8529241 8486510 8400128 8273812 8111962 7919443
58778G919443k18355k39723k56817k69786k79128k85229k87725k86103k80684
$$ 7919443 7701088 7461365 7204548 6934762 6655634 6370405 6082680 5796577 5515893
58769E515893k72300k61265k47573k32003k16163k01370j87983j75675j63798
$$ 5515893 5243593 4982328 4734755 4502752 4286589 4085219 3897236 3721561 3557763
58760C557763j51781j39799j28791j19201j10147j00565r0764q1894p4247o7104
$$ 3557763 3405982 3266183 3137392 3018191 2908044 2807479 2716715 2634821 2560574 2493470
58750B493470o0077n3535m7672m2126l6668l1484k6619k1832j7227j3378j0593
$$ 2493470 2433393 2379858 2332186 2290060 2253392 2221908 2195289 2173457 2156230 2142852 2132259
58739B132259q396n900k463J983O934J1620J5434J7904J8272J5631R719J184r028
$$ 2132259 2123863 2117963 2115500 2117483 2124417 2136037 2151471 2169375 2187647 2203278 2212997 2214181 2205153
58726B205153j9929l0099l8057m3537m7535n0595n2122n1970n1544n2111n2971
$$ 2205153 2185224 2155125 2117068 2073531 2025996 1975401 1923279 1871309 1819765 1767654 1714683
58715A714683n2529n0534m7919m4994m1210l6465l1288k5812j9720j3161o738
$$ 1714683 1662154 1611620 1563701 1518707 1477497 1441032 1409744 1383932 1364212 1351051 1344313
58704A344313o42N211J0276J3445J3918J1281N140m253j5153k5234l3348l9598
$$ 1344313 1343671 1348882 1359158 1372603 1386521 1397802 1402942 1398689 1383536 1358302 1324954 1285356
58692A285356m3857m5453m4275m1207l7177l2546k7501k2323j7149j2089p596
$$ 1285356 1241499 1196046 1151771 1110564 1073387 1040841 1013340 991017 973868 961779 954183
58681I54183m146j658J85J289J403P47l03j764l545m811m758l665k281n46J904
$$ 954183 950037 948379 948564 949853 951256 952003 951700 949936 946391 941580 936822 933157 930876 930330 932234
58666I32234M322N189L962J320k337p249j3025j8110k1142k2021k1419j9992j8319
$$ 932234 936556 941745 945707 947027 944690 937441 924416 906306 885164 863143 841724 821732 803413
58653H03413j6882j5556j3748j1215q351n569l005r04L36Q00J203K148L459M468
$$ 803413 786531 770975 757227 746012 737661 732092 729087 728183 728519 729319 730522 732670 736129 740597
58639G40597M757M644M947O108P500Q004P398O622O515O916P350P767Q133Q196
$$ 740597 745354 749998 754945 761053 768553 776557 783955 790577 797092 804008 811358 819125 827258 835454
58625H35454Q208R034J0867J2715J3972J5430J7757K0036K1152K1722K3247K5923
$$ 835454 843662 852696 863563 876278 890250 905680 923437 943473 964625 986347 1009594 1035517
58613A035517K8812L1565L4536L7554M0127M2610M5781M9536N3284N7282O2208
$$ 1035517 1064329 1095894 1130430 1167984 1208111 1250721 1296502 1346038 1399322 1456604 1518812
58602A518812O7723P2838P7419Q1782Q5136Q6015Q4275Q1020P6529O9783O0111
$$ 1518812 1586535 1659373 1736792 1818574 1903710 1989725 2074000 2155020 2231549 2301332 2361443
58591B361443M7894L3557J7397N72j5211k9270m1882n2638o0393o5016o7608o8631
$$ 2361443 2409337 2442894 2460291 2460863 2445652 2416382 2374500 2321862 2261469 2196453 2128845 2060214
58579B060214o7398o3875n9468n5322n1144m6453m1775l7833l4464l1152k7887
$$ 2060214 1992816 1928941 1869473 1814151 1763007 1716554 1674779 1636946 1602482 1571330 1543443
58568A543443k4945k2414k0395j9050j8308j8125j9025k1599k5419k9257l2348
$$ 1543443 1518498 1496084 1475689 1456639 1438331 1420206 1401181 1379582 1354163 1324906 1292558
58557A292558l4558l5516l4811l3052l1570l0834l0238k9421k8660k7888k6587
$$ 1292558 1258000 1222484 1187673 1154621 1123051 1092217 1061979 1032558 1003898 976010 949423
58546I49423k4901k3619k2847k1767j9974j7981j6173j4353j2599j1519j1380
$$ 949423 924522 900903 878056 856289 836315 818334 802161 787808 775209 763690 752310
58535G52310j1825j2483j2984j2604j1030r352q964r542r441q073o437n298m372
$$ 752310 740485 728002 715018 702414 691384 682032 673068 663526 654085 646012 639575 634277 629905
58522F29905l434k709j880k60J670K477J867J207J510K394L394M790O544P842
$$ 629905 626471 623762 621882 621622 623292 625769 627636 628843 630353 632747 636141 640931 647475 655317
58508F55317Q329Q710R528J0533J1556J2811J3951J4167J3506J2809J2007R986
$$ 655317 663646 672356 681884 692417 703973 716784 730735 744902 758408 771217 783224 793210
58496G93210O586L194P50j305l502n183n717n572n435n372n515o416q004r190
$$ 793210 799796 802990 803740 802435 798933 793750 788033 782461 777026 771654 766139 759723 751719 742529
58482G42529r232q603q069p810p767p885p785p127o409o337o540o131n371n205
$$ 742529 733297 724694 716625 708815 701048 693163 685378 678251 671842 665505 658965 652834 647463 642258
58468F42258n356m726l588l359m041m065l079k615l319l801l069k106j897j873
$$ 642258 636902 632176 628588 625229 621188 617123 614044 611429 608110 604309 601240 599134 597237 595364
58454E95364j349p51l17O10J937K242J009k40k48J07m55j640k478k872k931k221
$$ 595364 594015 593264 592947 593557 595494 597736 598745 598505 598257 598364 597909 596269 593791 590919 587988 585767
58438E85767q12J82K68M76J526K480K291J483J067R41N18j02n23o42k26J039K564
$$ 585767 584955 585137 585405 585881 587407 589887 592178 593661 594728 595669 596187 596085 595562 594920 594694 595733 598297
58421E98297L246L212L666M622M649L492K883L838N107N383N132N115M920M222
$$ 598297 601543 604755 608421 613043 617692 621184 624067 627905 633012 638395 643527 648642 653562 657784
58407F57784L747L815L495K375J499J553J763J615J849K719L194K917K960L624
$$ 657784 661531 665346 668841 671216 672715 674268 676031 677646 679495 682214 685408 688325 691285 694909
58393F94909L575K419J849K835L917L809L482L995M459L995L646M405N238M962
$$ 694909 698484 700903 702752 705587 709504 713313 716795 720790 725249 729244 732890 737295 742533 747495
58379G47495M276M116L800K688J890K427L402L733L949M643N019M683M878O141
$$ 747495 751771 755887 759687 762375 764265 766692 770094 773827 777776 782419 787438 792121 796999 803140
58365H03140O821N846M831N401O503O579O244O555O660N550M346M393M871M579
$$ 803140 809961 815807 820638 826039 832542 839121 845365 851920 858580 864130 868476 872869 877740 882319
58351H82319M372N416O813P243P254P743P961P248O839P653Q329P747P355Q568
$$ 882319 886691 892107 898920 906163 913417 921160 929121 936369 943208 950861 959190 966937 974292 982860
58337I82860J0057J0242J0191J1274J2245J1612J0740J1504J2948J3408J3887
$$ 982860 992917 1003159 1013350 1024624 1036869 1048481 1059221 1070725 1083673 1097081 1110968
58326A110968J5981J8440J9212J9146K0238K1900K2444K2553K3827K5373K5313
$$ 1110968 1126949 1145389 1164601 1183747 1203985 1225885 1248329 1270882 1294709 1320082 1345395
58315A345395K4224K3713K3024K0495J6902J4132J1953R351P326P074P112N765
$$ 1345395 1369619 1393332 1416356 1436851 1453753 1467885 1479838 1489189 1496515 1503589 1510701 1516466
58303A516466M616N966Q659J0207J1168J3429J5993J6711J6551J7964K0364K1460
$$ 1516466 1521082 1527048 1535707 1545914 1557082 1570511 1586504 1603215 1619766 1637730 1658094 1679554
58291A679554K1702K3212K5624K7046K7861K9575L1311L1490L1401L3048L5190
$$ 1679554 1701256 1724468 1750092 1777138 1804999 1834574 1865885 1897375 1928776 1961824 1997014
58280A997014L5783L6415L9734M4368M7242M9095N2570N6503N7510N5893N4694
$$ 1997014 2032797 2069212 2108946 2153314 2200556 2249651 2302221 2358724 2416234 2472127 2526821
58269B526821N4177N2495N0530N0647N1828N1376N0351N1911N5526N8242O0419
$$ 2526821 2580998 2633493 2684023 2734670 2786498 2837874 2888225 2940136 2995662 3053904 3114323
58258C114323O4494O9428P2167P3525P6738Q1347Q4349Q6262R0104R5556J00057
$$ 3114323 3178817 3248245 3320412 3393937 3470675 3552022 3636371 3722633 3812737 3908293 4008350
58247D008350J04298J10615J17565J22335J26696J34142J43186J50302J57138
$$ 4008350 4112648 4223263 4340828 4463163 4589859 4724001 4867187 5017489 5174627
58238E174627J67408J79101J87828J95536K07391K22244K35121K47127K63360
$$ 5174627 5342035 5521136 5708964 5904500 6111891 6334135 6569256 6816383 7079743
58229G079743K82897L00704L17830L39574L65070L89274M13718M44360M80263
$$ 7079743 7362640 7663344 7981174 8320748 8685818 9075092 9488810 9933170 10413433
58220A0413433N15808N52664N97557O49725P03302P60667Q30052R11277R98246
$$ 10413433 10929241 11481905 12079462 12729187 13432489 14193156 15023208 15934485 16932731
58211A6932731J094322J210175J347502J501092J676306J887789K141958K439056
$$ 16932731 18027053 19237228 20584730 22085822 23762128 25649917 27791875 30230931
58203C0230931K791617L221422L738893M345673N054971N885882O841146P919576
$$ 30230931 33022548 36243970 39982863 44328536 49383507 55269389 62110535 70030111
58195G0030111R150554J0588269J2277830J4264103J6624440J9432771K2669442
$$ 70030111 79180665 89768934 102046764 116310867 132935307 152368078 175037520
58188A75037520K6181536K9658742L2480598L3544322L1481277K5404497J5664764
$$ 175037520 201219056 230877798 263358396 296902718 328383995 353788492 369453256
58181C69453256L916175p586365j6889852k2923777k5666400k5972564k5087517
$$ 369453256 373369431 365783066 348893214 325969437 300303037 274330473 249242956
58174B49242956k4015474k3135886k2307063k1246672j9802676j7991337j5939773
$$ 249242956 225227482 202091596 179784533 158537861 138735185 120743848 104804075
58167A04804075j3832791j1846352j0080509q555093p258904o176118n275142
$$ 104804075 90971284 79124932 69044423 60489330 53230426 47054308 41779166
58160D1779166m512907l862473l316395k861933k475401k142988j865425j638470
$$ 41779166 37266259 33403786 30087391 27225458 24750057 22607069 20741644 19103174
58152A9103174j447292j283092j147757j038682r44780q60456p88842p28447o70414
$$ 19103174 17655882 16372790 15225033 14186351 13241571 12381115 11592273 10863826 10193412
58143A0193412o11748n58387n12421m68421m24731l86587l55303l25332k94747
$$ 10193412 9581664 9023277 8510856 8042435 7617704 7231117 6875814 6550482 6255735
58134F255735k68397k48357k30996k15741k06904k04368k01500j94927j87969
$$ 6255735 5987338 5738981 5507985 5292244 5085340 4880972 4679472 4484545 4296576
58125D296576j82322j74742j64172j54134j45720j35845j24504j16182j11879
$$ 4296576 4114254 3939512 3775340 3621206 3475486 3339641 3215137 3098955 2987076
58116B987076j07031r9494r2583q8042q3040p6456p1475o9400o7039o2615n8494
$$ 2987076 2880045 2780551 2687968 2599926 2516886 2440430 2368955 2299555 2232516 2169901 2111407
58105B111407n5826n2261m7026m2849m0796l8434l4967l2877l2745l1692k8719
$$ 2111407 2055581 2003320 1956294 1913445 1872649 1834215 1799248 1766371 1733626 1701934 1673215
58094A673215k6406k5727k4387k2054k1898k4822k7307k7058k6038k5891k5233
$$ 1673215 1646809 1621082 1596695 1574641 1552743 1527921 1500614 1473556 1447518 1421627 1396394
58083A396394k3713k3943k6849k9419k9437k8505k8225k7381k5101k3057k2392
$$ 1396394 1372681 1348738 1321889 1292470 1263033 1234528 1206303 1178922 1153821 1130764 1108372
58072A108372k2007k1552k2440k4242k4000k0925j7993j7074j6346j4390j2850
$$ 1108372 1086365 1064813 1042373 1018131 994131 973206 955213 938139 921793 907403 894553
58061H94553j2921j2940j1754j0942j1467j1553j0156r237j0252j1562j1635j1740
$$ 894553 881632 868692 856938 845996 834529 822976 812820 803583 793331 781769 770134 758394
58049G58394j3080j4152j3292j1299r424p370n237m746o354p712p008n472m747
$$ 758394 745314 731162 717870 706571 697147 689777 684540 679794 673440 665728 658720 653248 648501
58036F48501m294l299k623k883k995k467k656m095n038m463l892m370m388k874
$$ 648501 644207 640908 638285 635402 632407 629940 627284 623189 618151 613688 609796 605426 601038 598164
58022E98164j440j422j274N26K504K741K261L019M466M915M707N315O614P539
$$ 598164 596724 595302 594028 594554 597058 599799 602060 605079 609545 614460 619167 624482 631096 638635
58008F38635Q385J0006J1803J2728J3442J5399J8544K1658K4226K6363K7843K8707
$$ 638635 647020 657026 668829 681557 694999 710398 728942 750600 774826 801189 829032 857739
57996H57739K9976L2340L5034L7234L9433M2108M4327M5050M4713M4121M2895
$$ 857739 887715 920055 955089 992323 1031756 1073864 1118191 1163241 1207954 1252075 1294970
57985A294970M0309L6686L2684K8296K3740K0160J8326J7700J7744J8795K0505
$$ 1294970 1335279 1371965 1404649 1432945 1456685 1476845 1495171 1512871 1530615 1549410 1569915
57974A569915K0934J8485J3467O531k911j5211k8747m1225n1658n9807o4868o6241
$$ 1569915 1590849 1609334 1622801 1629332 1626421 1611210 1582463 1541238 1489580 1429773 1364905 1298664
57962A298664o4578o0809n5077m7808m0659l5060l0721k6646k2562j8434j3936
$$ 1298664 1234086 1173277 1118200 1070392 1029733 994673 963952 937306 914744 896310 882374
57951H82374r560o820o054n424l444j198n20j297k113k419k442j979q30M30J460
$$ 882374 872814 865994 859940 854516 851072 849874 849354 848057 845944 843525 841083 839104 838274 838704 840164
57936H40164L021N589Q276J0479J3329J7901K3076K6904K9095L0403L0485K8223
$$ 840164 843185 848774 857050 867529 880858 898759 921835 948739 977834 1008237 1038722 1066945
57924A066945K3554J7212R246n65j1191k0909k9014l5646m0432m2739m2990m2230
$$ 1066945 1090499 1107711 1116957 1116392 1105201 1084292 1055278 1019632 979200 936461 893471 851241
57912H51241m0643l7719l3654k9468k5812k2703k0160j8197j6507j4908j3784
$$ 851241 810598 772879 739225 709757 683945 661242 641082 622885 606378 591470 577686
57901E77686j3377j3178j2712j2281j2210j2134j1778j1668j2130j2442j1864
$$ 577686 564309 551131 538419 526138 513928 501794 490016 478348 466218 453776 441912
57890D41912j0731r535p892n431k934j381n31M97J855L121M170N025N560O122
$$ 441912 431181 421646 413754 408323 405389 404008 403477 403974 405829 408950 413120 418145 423705 429827
57876D29827P527R662J1104J1039J0430J0208R646P890N815M719M150K774N95
$$ 429827 437354 447016 458120 469159 479589 489797 499443 507333 513148 517867 522017 524791 525386
57863E25386j329k785m366o040p277q171r008r252q385p244o996p323p104o386
$$ 525386 524057 521272 516906 510866 503589 495418 486410 477158 468773 461529 454533 447210 440106 433720
57849D33720o022n740m385j938K74J508K273K999L415L388L266L164K867K388
$$ 433720 427698 421958 417573 415635 415909 417417 419690 422689 426104 429492 432758 435922 438789 441177
57835D41177J814P91r17k560l108k644k163k199k533k874k913k106l47J527K798
$$ 441177 442991 443782 442865 440305 437197 434553 432390 430191 427658 424784 421871 419765 419418 420945 423743
57820D23743L966N780P812R140R951J1196J3077J5063J6967J8724J9494J8419
$$ 423743 427709 433489 441301 450441 460392 471588 484665 499728 516695 535419 554913 573332
57808E73332J6119J4213J3595J4240J6323K0149K5098L0025L4523L8692M1920
$$ 573332 589451 603664 617259 631499 647822 667971 693069 723094 757617 796309 838229
57797H38229M3106M1865L8391L2428K3677J2860J126j1130k3472l4093m1082m4827
$$ 838229 881335 923200 961591 994019 1017696 1030556 1031682 1020552 997080 962987 921905 877078
57785H77078m7262m8868m8403m5692m2524m0164l7837l4563l0862k7668k4869
$$ 877078 829816 780948 732545 686853 644329 604165 566328 531765 500903 473235 448366
57774D48366k1947j9102j6759j4789j2968j1510j0492r351p638n744m394l799
$$ 448366 426419 407317 390558 375769 362801 351291 340799 331448 323810 318066 313672 309873
57762C09873l652l499k964j992r88k98L40J252J969J728P03n9J65J412L559O238
$$ 309873 306221 302722 299758 297766 296778 296480 296820 298072 300041 301769 302472 302413 302578 303990 307549 313787
57746C13787Q367R012Q704Q806R532R819R289Q871R075R003P676N348K757J29
$$ 313787 322154 331166 339870 348676 358208 368027 377316 386187 395262 404265 411941 417289 420046 420175
57732D20175k326l799l791l075k881l359l591k909j653n54K22J158K588M013M556
$$ 420175 417849 414050 410259 407184 404303 400944 397353 394444 392791 392237 392459 393617 396205 400218 404774
57717D04774M143L708L943M438M551M517M919N677O384P287Q827J0576J1676J2227
$$ 404774 408917 412625 416568 421006 425557 430074 434993 440670 447054 454341 463168 473744 485420 497647
57703D97647J3141J4681J6135J7026J7632J8301J9108K0296K2214K4787K7669
$$ 497647 510788 525469 541604 558630 576262 594563 613671 633967 656181 680968 708637
57692G08637L0840L4395L8040M1634M5771N0882N6230O0949O5688P1770P9118
$$ 708637 739477 773872 811912 853546 899317 950199 1006429 1067378 1133066 1204836 1283954
57681A283954Q6451R3322J00221J06785J11744J14894J17327J19369J20107J19554
$$ 1283954 1370405 1463727 1563948 1670733 1782477 1897371 2014698 2134067 2254174 2373728
57671B373728J19477J21241J24263J27010J27369J20601R9143N7396k577p0702
$$ 2373728 2493205 2614446 2738709 2865719 2993088 3113689 3212832 3270228 3267651 3196949
57661C196949j33890j81638k09044k17194k11207j96878j78292j57894j37508
$$ 3196949 3063059 2881421 2672377 2455183 2243976 2047098 1868806 1710912 1573404
57652A573404j18517j01593q6975p4720o4426n5298m6888l9267l2393k5997k0277
$$ 1573404 1454887 1353294 1266319 1191599 1127173 1071875 1024987 985720 953327 927330 907053
57641I07053j5749j2158q516m560j075J664M576Q346J2411J6109J9722K3570K7141
$$ 907053 891304 879146 870630 866070 864995 866659 871235 879581 891992 908101 927823 951393 978534
57628I78534L0102L3214L7204M1536M5331M8742N2343N5851N8604O0777O2941
$$ 978534 1008636 1041850 1079054 1120590 1165921 1214663 1267006 1322857 1381461 1442238 1505179
57617A505179O4776O5176O3484N9646N3532M4876L3814K0780O201r147k3858l6723
$$ 1505179 1569955 1635131 1698615 1758261 1811793 1856669 1890483 1911263 1917464 1908317 1884459 1847736
57605A847736m7537n6545o3560o8270p0985p2236p2107p0584o8167o5376o2067
$$ 1847736 1800199 1743654 1680094 1611824 1540839 1468603 1396496 1325912 1257745 1192369 1130302
57594A130302n7999n3669m9757m6129m2288l8518l5595l3483l1312k8676k6148
$$ 1130302 1072303 1018634 968877 922748 880460 841942 806347 772864 741552 712876 686728
57583F86728k4324k2989k1458j9328j6761j4333j2584j1544j0728r747q657p627
$$ 686728 662404 639415 617957 598629 581868 567535 554951 543407 532679 522932 514275 506648
57571E06648o675n927n630n607n238m266l098k037q87L07R08P09N28J092J933
$$ 506648 499973 494046 488416 482809 477571 473305 470207 468170 467283 467590 468498 469207 469735 470827 472760
57556D72760K189J912J870K485L728N481P243Q011P387O379O314P354Q843J0483
$$ 472760 474949 476861 478731 481216 484944 490425 497668 505679 513066 519445 525759 533113 541956 552439
57542E52439J2222J3572J4210J4921J6748J9467K1968K3981K6215K8970L1794
$$ 552439 564661 578233 592443 607364 624112 643579 665547 689528 715743 744713 776507
57531G76507L4524L7516M0737M3755M6713N0127N3506N5416N5315N4244N3078
$$ 776507 811031 848547 889284 933039 979752 1029879 1083385 1138801 1194116 1248360 1301438
57520A301438N1107M7087M0908L3341K4662J4490K861r242k0615l0625l9207m6240
$$ 1301438 1352545 1399632 1440540 1473881 1498543 1513033 1515894 1506652 1486037 1455412 1416205 1369965
57508A369965n1251n3834n4319n3670n2555n0869m8368m5371m2352l9288l6008
$$ 1369965 1318714 1264880 1210561 1156891 1104336 1053467 1005099 959728 917376 878088 842080
57497H42080l2841l0162k7572k4332k0568j7189j4590j2276r912p876o382m836
$$ 842080 809239 779077 751505 727173 706605 689416 674826 662550 652638 644762 638380 633544
57485F33544k604O8K397M072N479P090Q943J0730J2251J3818J5990J8822K1576
$$ 633544 630940 631008 633405 637477 642956 650046 658989 669719 681970 695788 711778 730600 752176
57472G52176K3639K5503K8240L2079L6079L9412M2262M5205M8121N0227N0918
$$ 752176 775815 801318 829558 861637 897716 937128 979390 1024595 1072716 1122943 1173861
57461A173861N0252M8564M5844M1568L5192K6740J6786N898n556j6981k7434l6330
$$ 1173861 1224113 1272677 1318521 1360089 1395281 1422021 1438807 1444705 1439149 1422168 1394734 1358404
57449A358404m3870n0335n5332n8279n9356n9254n8267n6234n3291m9899m6251
$$ 1358404 1314534 1264199 1208867 1150588 1091232 1031978 973711 917477 864186 814287 768036
57438G68036m2332l8593l5699l3557l1284k8440k5561k3213k1174j8999j6865
$$ 768036 725704 687111 651412 617855 586571 558131 532570 509357 488183 469184 452319
57427D52319j5215j4001j2768j1412j0324r794r585r213q476p545o641n818n149
$$ 452319 437104 423103 410335 398923 388599 378805 369220 360007 351531 343986 337345 331527 326378
57414C26378m869m996m962m156k851j990j895j879j444j088j356j866k022k004
$$ 326378 321509 316513 311551 307395 304544 302554 300659 298780 297336 296248 294892 293026 291004 289000
57400B89000k161k033j025L24R55Q57Q65J127J038O80R16J859K567K638K839L641
$$ 289000 286839 284806 283781 284105 285060 285917 286782 287909 288947 289627 290543 292402 294969 297607 300446 304087
57384C04087M329M175L529K952K240J135K00J06N53P56N62L53K34P8M0L80R13
$$ 304087 308416 312591 316120 319072 321312 322447 322647 322753 323306 324062 324624 324977 325211 325289 325329 325709 326622
57367C26622J123P88J61k96k01L66P47M47P9P55K344L266K545J179O84J137J573
$$ 326622 327745 328533 328694 328398 328197 328563 329310 329757 329836 330591 332935 336201 338746 339925 340609 341746 343319
57350C43319J658J846K224K362K193K115K165J901J204N77N63J267K438L576M099
$$ 343319 344977 346823 349047 351409 353602 355717 357882 359783 360987 361564 362127 363394 365832 369408 373507
57335C73507L919L644L782L931L411K491K238L182M737O043O787P074P118P199
$$ 373507 377426 381070 384852 388783 392194 394685 396923 400105 404842 410885 417672 424746 431864 439063
57321D39063P537Q055Q488Q786R067R256R185R000R055R358R553R488R508J0100
$$ 439063 446600 454655 463143 471929 480996 490252 499437 508437 517492 526850 536403 545891 555399 565499
57307E65499J1439J3192J4565J4819J4111J3518J3823J4560J4841J4688J4760
$$ 565499 576938 590130 604695 619514 633625 647143 660966 675526 690367 705055 719815
57296G19815J5020J4637J3300J1606R994Q121N681L012M91j994m432o250p066
$$ 719815 734835 749472 762772 774378 784372 792493 798174 801186 801677 799683 795251 789001 781935
57283G81935p348p732q077p807o840n579m257k875j662r37n50l3Q32J901L088
$$ 781935 774587 766855 758778 750971 744131 738552 734295 731420 729758 728821 728271 728238 729070 730971 734059
57268G34059M332N268N492N238N237N802O493O929P357Q113Q953R412R626J0209
$$ 734059 738391 743659 749151 754389 759626 765428 771921 778850 786207 794320 803273 812685 822311 832520
57254H32520J1331J2410J2946J3227J3924J5076J5923J5854J5198J4877J5432
$$ 832520 843851 856261 869207 882434 896358 911434 927357 943211 958409 973286 988718
57243I88718J6657J8092J9475K0552K0875K0194J9021J8435J9078K0538K1822
$$ 988718 1005375 1023467 1042942 1063494 1084369 1104563 1123584 1142019 1161097 1181635 1203457
57232A203457K2371K2454K2649K3145K3679K4077K4578K5508K6770K7884K8609
$$ 1203457 1225828 1248282 1270931 1294076 1317755 1341832 1366410 1391918 1418688 1446572 1475181
57221A475181K9299L0405L1813L2916L3412L3716L4452L5674L6905L7814L8532
$$ 1475181 1504480 1534885 1566698 1599614 1633026 1666742 1701194 1736868 1773773 1811587 1850119
57210A850119L9218L9721L9843L9751L9737L9799L9839M0144M1196M2888M4441
$$ 1850119 1889337 1929058 1968901 2008652 2048389 2088188 2128027 2168171 2209367 2252255 2296696
57199B296696M5321M5716M5795M5005M2813L9956L8141L8370M0014M1625M2202
$$ 2296696 2342017 2387733 2433528 2478533 2521346 2561302 2599443 2637813 2677827 2719452 2761654
57188B761654M1534M0009L8426L7656L8001L9052M0324M1719M3149M4213M4710
$$ 2761654 2803188 2843197 2881623 2919279 2957280 2996332 3036656 3078375 3121524 3165737 3210447
57177C210447M5155M6122M7371M8225M8720M9647N1402N3514N5394N6879N7696
$$ 3210447 3255602 3301724 3349095 3397320 3446040 3495687 3547089 3600603 3655997 3712876 3770572
57166C770572N7212N5214N2531N0206M8361M6447M4291M2257M0418L8235L5248
$$ 3770572 3827784 3882998 3935529 3985735 4034096 4080543 4124834 4167091 4207509 4245744 4280992
57155D280992L1670K8191K5420K3569K2355K1204J9831J8563J7914J7990J8657
$$ 4280992 4312662 4340853 4366273 4389842 4412197 4433401 4453232 4471795 4489709 4507699 4526356
57144D526356K0075K2471K5427K8129L0437L3018L6099L8740L9850L9449L8454
$$ 4526356 4546431 4568902 4594329 4622458 4652895 4685913 4722012 4760752 4800602 4840051 4878505
57133D878505L7483L6429L4950L2876L0285K7663K5955K5975K7758L0695L4205
$$ 4878505 4915988 4952417 4987367 5020243 5050528 5078191 5104146 5130121 5157879 5188574 5222779
57122E222779L8008M1897M5727M9592N3726N8223O3150O8870P6072Q5447R7524
$$ 5222779 5260787 5302684 5348411 5398003 5451729 5509952 5573102 5641972 5718044 5803491 5901015
57111E901015J12412J29325J46731J63780J81685K03285K31077K66183L09077
$$ 5901015 6013427 6142752 6289483 6453263 6634948 6838233 7069310 7335493 7644570
57102G644570L60586M21875M94207N79564O81319Q03731R50494J123613J323182
$$ 7644570 8005156 8427031 8921238 9500802 10182121 10985852 11936346 13059959 14383141
57093A4383141J547561J793587K057034K333354K618124K906679L192898L467777
$$ 14383141 15930702 17724289 19781323 22114677 24732801 27639480 30832378 34300155
57085C4300155L718052L924436M059953M090783L982537L710611L268745K670962
$$ 34300155 38018207 41942643 46002596 50093379 54075916 57786527 61055272 63726234
57077F3726234J948047J142785L04837n16464j280387j959352k537755l008494
$$ 63726234 65674281 66817066 67121903 66605439 65325052 63365700 60827945 57819451
57069E7819451l371201l631338l797609l878350l879975l808103l669291l472054
$$ 57819451 54448250 50816912 47019303 43140953 39260978 35452875 31783584 28311530
57061B8311530l227571k950064k655674k359832k074811j808854j566736j350772
$$ 28311530 25083959 22133895 19478221 17118389 15043578 13234724 11667988 10317216
57053A0317216j161646r98664q59628p41219o40118n53979m81175m19910l68071
$$ 10317216 9155570 8156906 7297278 6556059 5915941 5361962 4880787 4460877 4092806
57044D092806l23840k86023k53729k26127k02485j82060j63963j47522j32763
$$ 4092806 3768966 3482943 3229214 3003087 2800602 2618542 2454579 2307057 2174294
57035B174294j20018j08980r8639q8355p8357o8872n9300m8904l7935k7253j6832
$$ 2174294 2054276 1945296 1846657 1758302 1679945 1611073 1551773 1502869 1464934 1437681 1420849
57024A420849n513P543K2183L8826N9555Q5171J10059J21546J07158O4096K031
$$ 1420849 1415336 1422879 1445062 1483888 1543443 1628614 1738673 1860219 1967377 2031473 2033504
57013B033504o2906j16460j50641j63922j60101j46290j29438j13344r8761q5733
$$ 2033504 1970598 1854138 1703497 1539575 1379474 1233184 1103746 990402 891641 805908
57003H05908p4760o5908n8217n0755m3508l6857l0753k4975j9728j5423j2062
$$ 805908 731148 665240 607023 556268 512760 475903 445150 420175 400447 385024 372962
56992C72962r330p028n113l392j519Q02L690O954R978J2015J2823J2689J1666
$$ 372962 363632 356604 351491 348099 346580 347382 351072 358026 368004 380019 392842 405531 417197
56979D17197R176M751j023o717j1059j3509j4144j3437j2139j0911r907q855p530
$$ 417197 426373 431124 430101 423384 412325 398816 384672 371235 359096 348185 338278 329423 321893
56966C21893n940m111j955N59L236N678P552Q969J0665J3423J6963J9552J9187
$$ 321893 315953 311842 309887 310446 313682 319360 326912 335881 346546 359969 376932 396484 415671
56953D15671J5251Q835J515n681j2068j6765j9015j8945j7545j5772j3883j1696
$$ 415671 430922 439757 441272 435591 423523 406758 387743 368798 351253 335481 321598 309902
56941C09902r139o345l443n34K222M770P340J0256J3538J6938K0276K3298K5100
$$ 309902 300763 294418 290975 290441 292663 297433 304773 315029 328567 345505 365781 389079 414179
56928D14179K4157J9438J1387J628q069j6338k2221k5413k6522k6489k5614k3584
$$ 414179 438336 457774 469161 470789 462720 446382 424161 398748 372226 345737 320123 296539
56916B96539k0479j7092j4101j1494r205p640p017o697n892m743l952l534k844
$$ 296539 276060 258968 244867 233373 224168 216528 209511 202814 196922 192179 188227 184693 181849
56903A81849j875j544k241k957k557j314l26K48J264K944M211M315M199N425Q068
$$ 181849 179974 178430 176189 173232 170675 169361 169035 169283 170547 173491 177702 182017 186216 191641 199709
56888A99709J0610J1909J2407J3099J4056J4363J3148J0096N447J6m874q071r340
$$ 199709 210319 222228 234635 247734 261790 276153 289301 299397 304844 304860 299986 291915 282575
56875B82575r171q053o253m139k077K9K629N818R102J2051J4736J7459K0426K3886
$$ 282575 273404 265351 259098 254959 252882 252911 255540 261358 270460 282511 297247 314706 335132 359018
56861C59018K8066L2638L6501L8387L7421L2968K4626J2919j46j1963k0796k6244
$$ 359018 387084 419722 456223 494610 532031 564999 589625 602544 602398 590435 569639 543395
56849E43395k8530k7918k4903k0393j5323j0252n340n42M275R189J4192J9371
$$ 543395 514865 486947 462044 441651 426328 416076 410736 410194 414469 423658 437850 457221
56837D57221K5092L1725L9194M6866N3799N8654N9392N3712M0549K1323m47k0898
$$ 457221 482313 514038 553232 600098 653897 712551 771943 825655 866204 887527 887080 866182
56825H66182l7324m8475n4149n4903n1873m6359l9403l1827k4518j8165j2625
$$ 866182 828858 780383 726234 671331 619458 573099 533696 501869 477351 459186 446561
56814D46561o924l14O898J3839K0131K6106L2110L7928M2675M4696M1846L2688
$$ 446561 439637 439323 446221 460060 480191 506297 538407 576335 619010 663706 705552 738240
56802G38240J7900K16j7075l1347m0890m5111m4944m2332l8752l4578k9933k5335
$$ 738240 756140 756356 739281 707934 667044 621933 576989 534657 495905 461327 431394 406059
56790D06059k1016j6453j1316o253j944K046O550J1386J5645J9105K2154K4336
$$ 406059 385043 368590 357274 351021 349077 351123 357673 369059 384704 403809 425963 450299
56778D50299K4032J9941J2258K319q124j7259k3727k7310k8656k8257k6363k3797
$$ 450299 474331 494272 506530 508849 500725 483466 459739 432429 403773 375516 349153 325356
56766C25356k1821k0683j9203j6434j3057j0543r343q712p921o994o267n814n307
$$ 325356 303535 282852 263649 247215 234158 223615 214272 205560 197639 190645 184378 178564 173257
56753A73257m312k774j308o59p87q78m55Nj25o69r29n49K87J187J649J179j47
$$ 173257 168945 166171 164863 164204 163417 162539 162084 162089 161964 161295 160366 159817 160104 161291 162940 164119 163972
56736A63972j491k022j773j312q47j30Q72J722J936J417N10k22m57n09r53j745
$$ 163972 162481 160459 158686 157374 156527 156397 157269 158991 160927 162344 162854 162632 162175 161666 160713 158968
56720A58968k096j560p32l75l01K14J251K159K489K393K127J799J590J713K070
$$ 158968 156872 155312 154580 154205 153904 154118 155369 157528 160017 162410 164537 166336 167926 169639 171709
56705A71709K422K872L710M801N634N968N994N858N517N094M832M604L932K708
$$ 171709 174131 177003 180713 185514 191148 197116 203110 208968 214485 219579 224411 229015 232947 235655
56691B35655J399N03O5j32k35l24l88k62J61P24J216J663K090K146J548O98K95
$$ 235655 237054 237557 237622 237490 237255 236931 236543 236281 236442 237166 238382 240045 242135 244281 245829 246527 246822
56674B46822L79M38M16P90J515J752R77k72j154j450j414j322j494k240l282l796
$$ 246822 247201 247639 248055 248845 250360 252112 253089 252817 251663 250213 248799 247477 245983 243743 240461 236665
56658B36665l493l116l349l822l752l144k590k287k045k008k524l307l516k804
$$ 236665 233172 230056 226707 222885 219133 215989 213399 211112 209067 207059 204535 201228 197712 194908
56644A94908j771j184j197j354j082j41J054J634J195M06L12J079J938K231J987
$$ 194908 193137 191953 190756 189402 188320 188179 189233 190867 192062 192468 192780 193859 195797 198028 200015
56629B00015J472P65Ln19p66j072j579j957j925j770j955k499k974l019k616j985
$$ 200015 201487 202252 202255 201736 200970 199898 198319 196362 194437 192667 190712 188213 185239 182220 179604 177619
56613A77619j435j185j143r00j64Q73J659J770J299Q23J009J969L074L544L270
$$ 177619 176184 174999 173856 172956 172792 173665 175324 177094 178393 179216 180225 182194 185268 188812 192082
56598A92082K808K600K569K574K727K930K599J358j25o75K1J104J673J742J786
$$ 192082 194890 197490 200059 202633 205360 208290 210889 212247 212122 211447 211468 212572 214245 215987 217773
56583B17773J839J525Q48L60M77R19J048N95r9m86k86L93J265K102K760L137L184
$$ 217773 219612 221137 221985 222345 222822 223741 224789 225384 225285 224799 224513 224906 226171 228273 231033 234170 237354
56566B37354K976K699K479K307K164K097K053J750R12l67j659k616l109l025k323
$$ 237354 240330 243029 245508 247815 249979 252076 254129 255879 256791 256424 254765 252149 249040 246015 243692
56551B43692j417j117j739k614k927k874l376m640n697n681m967m584m825n040
$$ 243692 242275 241158 239419 236805 233878 231004 227628 222988 217291 211610 206643 202059 197234 192194
56537A92194m667l848l003k294j677j138o47j47K49K53k01p53r79q36n35j80K08
$$ 192194 187527 183679 180676 178382 176705 175567 174920 174773 175022 175275 175074 174321 173342 172506 171971 171791 171999
56520A71999M04J18n34j004r31n77m78p85j177j335j243j066r38r52j138j324
$$ 171999 172403 172521 171987 170983 170052 169475 168997 168212 167035 165700 164457 163391 162453 161501 160363 159039
56504A59039j198o74j64j78o93j098r43m91l62o75r13o07J11P92J248J601J908
$$ 159039 157841 157167 157003 156825 156132 155034 154091 153600 153238 152563 151650 151043 151154 151946 153194 154795 156703
56487A56703K061J978J678J179O46N40J210K264K811K448J649R78N12K62N47J342
$$ 156703 158764 160742 162420 163599 164245 164785 165995 168259 171070 173518 175167 176145 176657 176919 177466 178808
56471A78808J771J065k70j026q76n30m21k65Jr4n77o61J6O76N56O1j7J85j4o17
$$ 178808 180579 181644 181374 180348 179472 178942 178521 178256 178257 178163 177586 176925 176941 177617 178173 178234 178217 178402 178388 177771
56451A77771r35o26M9Q15J508J791J418O37j57r69j749j947j252m75o60j531j898
$$ 177771 176836 176210 176259 177074 178582 180373 181791 182428 182271 181302 179553 177606 176354 175879 175219 173688 171790
56434A71790j441r51p28j35R98J722J395O77M36N17L71J46K42L45j38r86j303
$$ 171790 170349 169398 168670 168535 169533 171255 172650 173327 173763 174280 174651 174797 175039 175384 175246 174260 172957
56417A72957o57N37J589K034J760J183J088J846K859L170K503J392N08J96M46
$$ 172957 172300 172837 174426 176460 178220 179403 180491 182337 185196 188366 190869 192261 192769 192965 193411
56402A93411Q82R92O33J55k05o59j332j750j448o69KM25P21O46j00j106j531j162
$$ 193411 194293 195285 195918 196073 195868 195209 193877 192127 190679 190010 190012 190437 191158 191804 191704 190598 189067 187905
56384A87905n95k32J43O67R41O71K49J99L98L47O2Q2N68R63Q31N86Q76J491J571
$$ 187905 187310 187078 187221 187888 188829 189500 189749 189948 190346 190693 190755 190837 191405 192368 193199 193785 194661 196152 197723
56365A97723R75O56J318K314K533J971J533J586J626J439J540K144K606K384J919
$$ 197723 198698 199354 200672 202986 205519 207490 209023 210609 212235 213674 215214 217358 219964 222348 224267
56350B24267J926K365K640K454J909J170N07L24O99J165J382J674K426L380M042
$$ 224267 226193 228558 231198 233652 235561 236731 237238 237562 238261 239426 240808 242482 244908 248288 252330
56335B52330M438M843N055M652L832L385L729M404M638M162L471L425M374N541
$$ 252330 256768 261611 266666 271318 275150 278535 282264 286668 291306 295468 298939 302364 306738 312279
56321C12279N703M681L677L781M608N008M544L665K786K018J643J971K711L070
$$ 312279 317982 322663 326340 330121 334729 339737 344281 347946 350732 352750 354393 356364 359075 362145
56307C62145K627J632N45k26k76M67J390J701J399J248J774K738L665M377M937
$$ 362145 364772 366404 366949 366723 366447 366914 368304 370005 371404 372652 374426 377164 380829 385206 390143
56292C90143N445O021O726P380P754P920Q201Q817R787J1124J2798J4521J5890
$$ 390143 395588 401609 408335 415715 423469 431389 439590 448407 458194 469318 482116 496637 512527
56279E12527J6817J7656J8903K0771K3029K5243K7312K9784L3312L7920M3144
$$ 512527 529344 547000 565903 586674 609703 634946 662258 692042 725354 763274 806418
56268H06418M8761N4811O0959O6736P2513P9256Q6876R3809R8881J02700J06436
$$ 806418 855179 909990 970949 1037685 1110198 1189454 1276330 1370139 1469020 1571720 1678156
56257A678156J09987J12272J12585J10690J06115R8542Q8581P7250O4973N1852
$$ 1678156 1788143 1900415 2013000 2123690 2229805 2328347 2416928 2494178 2559151 2611003
56247B611003L8438K5230J1842k179j6039k8201l8036m6008n2604n8220o3715
$$ 2611003 2649441 2674671 2686513 2684334 2668295 2640094 2602058 2556050 2503446 2445226 2381511
56236B381511o9729p5506p9647q2076q3993q5888q6967q6721q5685q4276q2112
$$ 2381511 2311782 2236276 2156629 2074553 1990560 1904672 1817705 1730984 1645299 1561023 1478911
56225A478911p9059p5797p2753o9366o5112o0441n6036n1903m7707m3489l9432
$$ 1478911 1399852 1324055 1251302 1181936 1116824 1056383 1000347 948444 900737 857248 817816
56214H17816l5460l1545k7989k4957k2165j9404j6982j5325j4358j3588j2500
$$ 817816 782356 750811 722822 697865 675700 656296 639314 623989 609631 596043 583543
56203E83543j0814q702o820n775n437n127m411l391k317j368o88k19M13J389K302
$$ 583543 572729 564027 557207 551432 545995 540868 536457 533066 530749 529381 528693 528474 528887 530276 532578
56188E32578K716K818L037L339L586M082N033N895O190O477P503Q800R359R396
$$ 532578 535294 538112 541149 544488 548074 552156 557189 563084 569274 575751 583254 592054 601413 610809
56174F10809J0066J1530J2745J3306J4043J5475J6897J7550J7692J7949J8411
$$ 610809 620875 632405 645150 658456 672499 687974 704871 722421 740113 758062 776473
56163G76473J8839J9179J9671K0869K3513K7755L2758L7784M3424N0769N9883
$$ 776473 795312 814491 834162 855031 878544 906299 939057 976841 1020265 1071034 1130917
56152A130917P0252Q2437R7726J16143J36145J56209J75091J90326J98145J95824
$$ 1130917 1201169 1283606 1381332 1497475 1633620 1789829 1964920 2155246 2353391 2549215
56142B549215J83458J63416J39288J15351R5460Q1423P2618O6812O0569M9828
$$ 2549215 2732673 2896089 3035377 3150728 3246188 3327611 3400229 3467041 3527610 3577438
56132C577438L2383J0243j1676k9367m1363m7689m9907n2388o0834p8093j02436
$$ 3577438 3609821 3620064 3608388 3579021 3537658 3489969 3440062 3387674 3326840 3248747 3146311
56121C146311j29947j56743j78694j91731j94093j87156j73471j55271j35031
$$ 3146311 3016364 2859621 2680927 2489196 2295103 2107947 1934476 1779205 1644174
56112A644174j15339r7256q0409o5192n2982m3669l5175k6418j8655j2933q329
$$ 1644174 1528835 1431579 1351170 1285978 1232996 1189327 1154152 1127734 1109079 1096146 1087817
56101A087817l953n76J173K250L345L409J621q24k498l736n371o892p498p562
$$ 1087817 1083864 1083288 1084461 1086711 1090056 1093465 1095086 1094262 1091764 1088028 1082657 1075765 1068267 1060705
56087A060705p595p012n341l404k025q59L55R20P47J209L113N358O797P823Q866
$$ 1060705 1053110 1046098 1040757 1037353 1035328 1034469 1034824 1035744 1036491 1037700 1040813 1046171 1052968 1060791 1069657
56072A069657R252Q877R134J0622J1808J1569J1198J2175J3852J5074J6175J7518
$$ 1069657 1078909 1087786 1096920 1107542 1119350 1130919 1142117 1154292 1168144 1183218 1199393 1216911
56060A216911J8026J7187J6587J7455J8572J8744J9242K1403K3812K4495K4123
$$ 1216911 1234937 1252124 1268711 1286166 1304738 1323482 1342724 1364127 1387939 1412434 1436557
56049A436557K4401K4956K4588K4075K4856K6224K6614K6464K7163K8309K8762
$$ 1436557 1460958 1485914 1510502 1534577 1559433 1585657 1612271 1638735 1665898 1694207 1722969
56038A722969K9242L1264L4440L7343L9941M2729M4718M4870M4512M5758M8566
$$ 1722969 1752211 1783475 1817915 1855258 1895199 1937928 1982646 2027516 2072028 2117786 2166352
56027B166352N1619N4794N8379O1284O2626O3765O6271O9271P1250P2835P5219
$$ 2166352 2217971 2272765 2331144 2392428 2455054 2518819 2585090 2654361 2725611 2798446 2873665
56016B873665P7588P8908Q0376Q3230Q6060Q7315Q8508R1679R5744R8756J01784
$$ 2873665 2951253 3030161 3110537 3193767 3279827 3367142 3455650 3547329 3643073 3741829 3843613
56005C843613J06876J13120J18497J23782J30847J38946J46482J54537J64664
$$ 3843613 3950489 4063609 4182106 4305888 4436735 4575681 4722163 4876700 5041364
55996E041364J75257J84241J93244K04925K18373K31461K45365K62126K80247
$$ 5041364 5216621 5400862 5594106 5799031 6017404 6248865 6494230 6756356 7036603
55987G036603K97589L16027L38204L62341L85720M10433M39981M73193N07560
$$ 7036603 7334192 7650219 7988423 8350764 8736484 9146917 9586898 10060091 10567651
55978A0567651N45337N89913O39510O91619P50137Q20520R01462R89673J089156
$$ 10567651 11112988 11702901 12342411 13034030 13784167 14604687 15506149 16495822 17584978
55969A7584978J206944J343728J498466J678452J894530K150780K450636K808945
$$ 17584978 18791922 20135650 21634116 23312568 25207098 27357878 29808514 32617459
55961C2617459L245455L770943M392894N128457N995509O997449Q136640R438755
$$ 32617459 35862914 39633857 44026751 49155208 55150717 62148166 70284806 79723561
55953G9723561J0946106J2698055J4744552J7164832K0027151K3315901K6895060
$$ 79723561 90669667 103367722 118112274 135277106 155304257 178620158 205515218
55946B05515218L0450835L3308059L4271594L1883583K5204169J4594669J799507
$$ 205515218 235966053 269274112 303545706 335429289 360633458 375228127 377027634
55939C77027634j0793649k1139694k8130824l1641145l2242673l0830363k8287068
$$ 377027634 366233985 345094291 316963467 285322322 253079649 222249286 193962218
55932A93962218k5279440k2221555j9338014j6727502j4404919j2348945j0543673
$$ 193962218 168682778 146461223 127123209 110395707 95990788 83641843 73098170
55925G3098170q982170p647454o511879n552640m752216m086228l525889l051966
$$ 73098170 64116000 56468546 49956667 44404027 39651811 35565583 32039694 28987728
55917B8987728k654805k322305k039148j796513j591637j418286j266987j133729
$$ 28987728 26332923 24010618 21971470 20174957 18583320 17165034 15898047 14764318
55909A4764318j019441r21416q33476p53915o85297o26768n73859n25371m83351
$$ 14764318 13744877 12823461 11989985 11236070 10550773 9924005 9350146 8824775 8341424
55900H341424m46715m11653l78076l49172l24787l01393k78493k59005k43197
$$ 8341424 7894709 7483056 7104980 6755808 6431021 6129628 5851135 5592130 5348933
55891E348933k27950k12303j98460j86937j75625j63986j53647j44609j35083
$$ 5348933 5120983 4908680 4710220 4523283 4347658 4183672 4030025 3885416 3750333
55882C750333j25249j17047j10320j03095r5428q9065q3625p7382p1564o9699
$$ 3750333 3625084 3508037 3397717 3294622 3199194 3110129 3026504 2949122 2877558 2807859
55872B807859p2414p6692q0341q3483q5685q5424q2777p9359p5400o9985o3992
$$ 2807859 2735445 2658753 2578412 2494929 2409244 2323820 2241043 2161684 2086284 2016299 1952307
55861A952307n9460n6198n2339m8013m5029m3080l9866l5067l0673k7289k3676
$$ 1952307 1892847 1836649 1784310 1736297 1691268 1648188 1608322 1573255 1542582 1515293 1491617
55850A491617k0221j9179k0758k2326k2305k1810k1640k0718j8499j6190j4535
$$ 1491617 1471396 1452217 1431459 1409133 1386828 1365018 1343378 1322660 1304161 1287971 1273436
55839A273436j2844j1021j0195j0502j0502r645r181r937j1122j2024j3019j4239
$$ 1273436 1260592 1249571 1239376 1228874 1218372 1208727 1199546 1189609 1178487 1166463 1153444 1139205
55827A139205j5035j5276j5590j6056j6190j6281j7081j8218j8721j8883j9694
$$ 1139205 1124170 1108894 1093304 1077248 1061058 1044777 1027696 1009478 990757 971874 952180
55816I52180k0634k0247j8737j7721j7389j6336j4364j2966j2663j2071j0197
$$ 952180 931546 911299 892562 874841 857452 841116 826752 813786 801123 789052 778855
55805G78855p604m867j924O25J619J198O84L05r54k969m178m154m278n254o072
$$ 778855 771251 766384 764460 765085 766704 767902 768586 768891 767937 764968 760790 756636 752358 747104 741032
55790G41032o233o899q846j1114j2634j3516j3772j2499r401n757k839n43J611
$$ 741032 734799 727900 719054 707940 695306 681790 668018 655519 646118 640361 637522 636979 638590
55777F38590L355M301M630M377L002K60l321p154j0894j4020j6153j7814j9661
$$ 638590 641945 646246 650876 655253 658255 658515 655194 648040 637146 623126 606973 589159 569498
55764E69498k1081k0868j9267j7746j6799j5595j3923j2713j2271j1768j0867
$$ 569498 548417 527549 508282 490536 473737 458142 444219 431506 419235 407467 396600
55753C96600j0238j0010r391q289p713p949p916o930n658m778m102l585l646l954
$$ 396600 386362 376352 366961 358672 350959 343010 335094 328164 322506 317728 313626 310041 306395 302441
55739C02441l439k135j436j910k375j894j147r02p28j65J64l13j022j338j630
$$ 302441 299002 296867 295431 293521 291146 289252 288105 287203 286475 286310 286474 286161 285139 283801 282171
55724B82171k287k747k472j943j730j512r09m32o47j098r65k42N21J126J770K641
$$ 282171 279884 277137 274665 272722 270992 269480 268571 268139 267492 266394 265429 265187 265708 266834 268604 271245
55708B71245L908N583P152P910P896P817P897P658O968O405O292O227N817N098
$$ 271245 275153 280736 287888 295798 303694 311511 319408 327066 334034 340439 346731 352958 358775 363873
55694C63873M110K989K374K797L606L667L096K935L199K763J375P3p95k258m698
$$ 363873 367983 370972 373346 376143 379749 383416 386512 389447 392646 395409 396784 396857 396062 393804 389106
55679C89106o770p283o782o396o299o293o705p719q689r007q845q368p188n251
$$ 389106 382336 375053 368271 361875 355576 349283 342578 334859 326170 317163 308318 299950 292762 287511
55665B87511l366k071q57P82K502L934N449P367R320J1032J2822J4713J5895J5829
$$ 287511 284145 282074 281217 281999 284501 288435 293884 301251 310571 321603 334425 349138 365033 380862
55651C80862J4945J3687J1731Q799N362J892j702n274p963r158r193q515p130
$$ 380862 395807 409494 421225 430024 435386 437278 435576 430302 422339 413181 403988 395473 388343
55638C88343n302l754k590j056R98K430K357J307J33j267l335n934q735j1698
$$ 388343 383041 379287 376697 375641 376639 379069 381426 382733 382866 381599 378264 372330 363595 351897
55624C51897j4428j6007j6159j5753j5513j5155j4340j3456j2713j1585r926q551
$$ 351897 337469 321462 305303 289550 274037 258882 244542 231086 218373 206788 196862 188311
55612A88311p970p579o873o302o081n381l733k135j660j927k017j968k192k367
$$ 188311 180341 172762 165889 159587 153506 148125 144392 142257 140597 138670 136653 134685 132493 130126
55598A30126k060j673j741j967j955k052k500k691k187j603j453j094Q0J325J645
$$ 130126 128066 126393 124652 122685 120730 118678 116178 113487 111300 109697 108244 107150 107230 108555 110200
55583A10200J332J196J196J021J099J794K394K269K109K700L424L480L612M887
$$ 110200 111532 112728 113924 114945 116044 117838 120232 122501 124610 127310 130734 134214 137826 142713
55569A42713O547O973O254N780N729M920L106J508Q41N51K74M84J290J878J598
$$ 142713 149260 156233 162487 168267 173996 178916 182022 183530 184371 184922 185196 185680 186970 188848 190446
55554A90446N85q75k609m067m651m633m740m835m178l008k576l314m148m119l632
$$ 190446 191031 190156 187547 183480 178829 174196 169456 164621 160443 157435 154859 151545 147397 143278 139646
55539A39646l554l877l903l265k292j609j513j617j198j72O32O20L45O55J433
$$ 139646 136092 132215 128312 125047 122755 121146 119633 118016 116818 116646 117278 117898 118243 118898 120331
55524A20331J977K219K548K875K926L223M570O621Q117Q668R154J0200J1228J1428
$$ 120331 122308 124527 127075 129950 132876 136099 140669 147290 155407 164075 173229 183429 194657 206085
55510B06085J0838J0071R488Q936P811N413J650k551o044q506j0344j1836j2965
$$ 206085 216923 226994 236482 245418 253229 258642 260292 257741 251697 243191 232847 221011 208046
55497B08046j3764j4173j3806j2606j1322j0605r969q540o512m867l974l450l178
$$ 208046 194282 180109 166303 153697 142375 131770 121801 113261 106749 101882 97908 94458 91280
55484I1280l351l647l496l151l307l739l432k252j260j137j378j419j435j635
$$ 91280 87929 84282 80786 77635 74328 70589 67157 64905 63645 62508 61130 59711 58276 56641
55470E6641j703j470j335j520j646j448j210j088p19M2O74P29M83M27N11M11J03
$$ 56641 54938 53468 52133 50613 48967 47519 46309 45221 44502 44544 45218 45947 46430 46857 47368 47779 47882
55453D7882k02l54k51J24M53K64m15r63r76p22n74m47j32J42m8o19r44n72J66
$$ 47882 47680 47326 47075 47199 47652 47916 47501 46538 45562 44840 44266 43819 43687 43829 43781 43162 42218 41646 41812
55434D1812N02J85j10L32J126J067k85j934k632k228j343l36P57J626J787J213
$$ 41812 42314 42499 42389 42721 43847 44914 44629 42695 40063 37835 36492 36156 36913 38539 40326 41539
55418D1539L23n14j055j059n27R9M32N13M55J21m27o90m62j64n3K51Q53R98K71
$$ 41539 41862 41348 40293 39234 38707 38806 39238 39751 40206 40327 39900 39210 38748 38584 38531 38782 39635 40633 40904
55399D0904m71k93L61N12K21J42Q4n60j430j627j182q31o11j00K57l44j407j570
$$ 40904 40433 40140 40501 41013 41234 41376 41460 40900 39470 37843 36661 35830 35219 35119 35376 35032 33625 32055
55381C2055o89L1J07K80P81P62n3o88n02r7K8L52J185J813J625J059P47O40O04
$$ 32055 31366 31397 31504 31784 32565 33327 33274 32586 32084 31987 32015 32367 33552 35365 36990 38049 38796 39436 40040
55362D0040Q81J282R71k02j087q21j31k35j101j685j379m69M51Q91P09L61M54
$$ 40040 40921 42203 43174 42972 41885 41064 40933 40698 39597 37912 36533 36064 36515 37406 38115 38476 38930
55345C8930P75M25p25j533j100k6M82J90j87j04L45P55P36J54n93q92o66m24m27
$$ 38930 39705 40130 39405 37872 36772 36746 37228 37418 37231 37127 37472 38227 38963 39117 38524 37632 36966 36542 36115
55326C6115m33l14k92l41j12L42M89K36J30M11O51N74M46L46m5o30q10n66n55
$$ 36115 35682 35368 35076 34735 34623 34965 35454 35690 35820 36231 36882 37456 37902 38248 38203 37573 36763 36197 35642
55307C5642q24n09N79J252O30m45n98L02J356J878J606N00q55j376q26l09o37
$$ 35642 34818 34309 34888 36140 36770 36325 35727 36029 37385 39263 40869 41369 40514 39138 38312 38003 37366
55290C7366j042m68O48J080O44J81N9r2m02n54m66l60k01J83N94P47P90R79J057
$$ 37366 36324 35856 36504 37584 38228 38409 38468 38376 37974 37420 36954 36594 36393 36576 37170 37917 38707 39686 40743
55271D0743O52j0l88m52o23j061j514j614j029K21J338J228n5j182j343j240j577
$$ 40743 41395 41385 40997 40545 39922 38861 37347 35733 34704 34925 36263 37491 37436 36254 34911 33671 32094
55254C2094j585l38J358J872J086L53L24L29r3m50m30n06r85j346j101n31j22
$$ 32094 30509 30171 31529 33401 34487 34840 35164 35493 35400 34950 34520 34014 33029 31683 30582 30051 29929
55237B9929J19L98O47O41L29j84o70q08n04j33j47m44n52l30p1j3j30l21l69L9
$$ 29929 30048 30446 31093 31734 32063 31879 31209 30401 29897 29764 29617 29173 28621 28291 28220 28207 28077 27756 27387 27426
55217B7426Q08J156M57p95j461j060j17P16J168J124N35k38n78k62L35P27O83
$$ 27426 28234 29390 29847 29052 27591 26531 26414 27130 28298 29422 29957 29719 29141 28879 29214 29941 30624
55200C0624K36k88l94J2L77J83k50j91L90P71M87q1k66J23O56P21J52m64l39M45
$$ 30624 30860 30572 30178 30190 30567 30750 30500 30309 30699 31470 31957 31876 31610 31733 32389 33110 33262 32798 32459 32904
55180C2904R24N66M5J82P33R19O80N15M68J83j66J0P20J281J245P33j10j161j934
$$ 32904 33828 34394 34439 34621 35354 36273 36953 37468 37936 38119 37953 37963 38683 39964 41209 41942 41832 40671 38737
55161C8737j906j322q80o63j51O44J021O75O1m87j093j523j079J80J037O39k32
$$ 38737 36831 35509 34629 33966 33815 34459 35480 36155 36216 35729 34636 33113 32034 32214 33251 33890 33658
55144C3658k69N53J106Q17L26L80P36N46m93j666j943j066J96Q70P88N99Q50J358
$$ 33658 33389 33942 35048 35865 36191 36571 37307 37853 37360 35694 33751 32685 32881 33751 34539 35138 35988 37346
55126C7346J557J237P65O46R86J434J640J605J417Q42k51j233j146n3P49L72m88
$$ 37346 38903 40140 40905 41551 42537 43971 45611 47216 48633 49475 49224 47991 46845 46792 47541 47913 47425
55109D7425o50j13J98l7k41m3K27J55l41j214k197k537j621P4J302J453R57L54
$$ 47425 46775 46662 46860 46823 46582 46539 46766 46921 46580 45366 43169 40632 39011 39085 40387 41840 42797 43151
55091D3151k49o82n44J06N60L46j29k12K17Q28J293J363R32K58j90k66k29k17
$$ 43151 42902 42220 41676 41782 42342 42688 42559 42347 42564 43392 44685 46048 46980 47238 47048 46782 46553 46336
55073D6336q1J90L39K84K46L20K84J6l22o05q14q06m79j67l34p77p61j14M90N14
$$ 46336 46255 46445 46784 47068 47314 47634 47918 47934 47612 47007 46193 45387 44908 44741 44407 43630 42869 42755 43245 43759
55053D3759K23Q3J43K54L94L55k70j361k009j495k27Q33J345J744K398L058L138
$$ 43759 43982 44065 44208 44462 44856 45211 44941 43580 41571 40076 39849 40682 42027 43771 46169 49227 52365
55036E2365K353J100K23K30P56J050R59R65J297J519J215N67O3k0L36R27J239
$$ 52365 54718 55818 56041 56271 57027 58077 59036 60001 61298 62817 64032 64599 64662 64642 64978 65905 67144
55019F7144Q55P2l43j99j74q07j725k184j928j184l06K21n4r61j657j516q04k11
$$ 67144 67999 68071 67728 67529 67355 66548 64823 62639 60711 59527 59221 59442 59388 58427 56770 55254 54450 54239
55001E4239j33o28j473k016j547k49P70Q77O84R36J317J111M83J86L01K45j01
$$ 54239 54106 53478 52005 49989 48442 48193 48963 49840 50524 51460 52777 53888 54371 54557 54858 55103 55002
54984E5002j83K82Q83J195J245J188J051R58J113J472J744J859K008K243K398
$$ 55002 54819 55101 55984 57179 58424 59612 60663 61621 62734 64206 65950 67809 69817 72060 74458
54969G4458K492K765L274L813M312M987N926O877P612Q291R271J0767J2734J4873
$$ 74458 76950 79715 82989 86802 91114 96101 102027 108904 116516 124807 134078 144845 157579 172452
54955A72452J6676J7638J7478J6133J3583R871N300M37m181q210j1451j3820j5355
$$ 172452 189128 206766 224244 240377 253960 263831 269131 269568 265387 257177 245726 231906 216551
54942B16551j6179j6340j5799j4534j2645j0462q500p119o177n257m292l671l550
$$ 216551 200372 184032 168233 153699 141054 130592 122092 114973 108796 103539 99247 95576 92026
54929I2026l346k314m95J222J941J538P44O15J728L669N451O570P459Q680J0087
$$ 92026 88680 86366 85871 87093 89034 90572 91316 91931 93659 97328 102779 109349 116808 125488 135575
54914A35575J1176J1948J2872J4048J4925J4835J3402J0461O151J218l252o668
$$ 135575 146751 158699 171571 185619 200544 215379 228781 239242 245393 246611 243359 236691
54902B36691r300j1617j3589j4807j5033j4423j3339j2119j0936r709q219o414
$$ 236691 227391 215774 202185 187378 172345 157922 144583 132464 121528 111819 103600 97186
54890I7186m549l028k132j881k019k122j903j400q51m23k30m38j108j874k139
$$ 97186 92637 89609 87477 85596 83577 81455 79552 78152 77301 76878 76648 76210 75102 73228 71089
54875G1089j656p59JK76k8p20j264j130m58l7l31q21p34k41l41j465k716k853
$$ 71089 69433 68674 68675 68951 68923 68203 66939 65809 65351 65314 64983 64162 63428 63187 62846 61381 58665 55812
54857E5812j745m52J3l45q14r25q44r65j355j689j644j171m08M69J195J331O30
$$ 55812 54067 53615 53628 53283 52469 51544 50700 49735 48380 46691 45047 43876 43468 43937 45132 46463 47093
54840D7093n03j235j168p89p13q18n55J11O48Q43J032J363J430J046P45R39J155
$$ 47093 46590 45355 44187 43398 42685 41867 41312 41423 42071 42914 43946 45309 46739 47785 48530 49469 50624
54823E0624P87K26L84J278J963J929J759K149K989L711M002L826L312K966L467
$$ 50624 51411 51637 52021 53299 55262 57191 58950 61099 64088 67799 71801 75627 78939 81905 85372
54808H5372M851O338P358Q277R637J1203J2391J3278J4390J5619J6064J5023J2588
$$ 85372 90223 96561 103919 112196 121833 133036 145427 158705 173095 188714 204778 219801 232389
54795B32389R187N124P44l448p069r984j2038j2986j2842j2006j0867r549q136
$$ 232389 241576 246700 247444 243996 236927 226943 214905 201919 189077 177071 166204 156655 148519
54782A48519o859n867n034m130l068j856o39K25M46L71Q60K350M250N661O364
$$ 148519 141660 135793 130759 126629 123561 121705 121066 121291 121737 122108 122968 125318 129568 135229 141593
54767A41593O762P111P418P926Q991J0359J1121J0823J0152J0114J0790J1307
$$ 141593 148355 155466 162884 170810 179801 190160 201281 212104 222256 232370 243160 254467
54755B54467J0885R401P054L952K22l833p918j1794j5104j7358j8318j8232j7481
$$ 254467 265352 274753 281807 285759 285981 282148 274230 262436 247332 229974 211656 193424 175943
54742A75943j6199j4365j2195j0157q589p473o575n758n122m732m358l607k518
$$ 175943 159744 145379 133184 123027 114438 106965 100390 94632 89510 84778 80420 76813 74295
54729G4295j716j658j944j801j235j002j386j629j075k22l3n61r36n90J74P84
$$ 74295 72579 70921 68977 67176 65941 64939 63553 61924 60849 60627 60594 60033 59097 58507 58681 59465
54713E9465J000Q26M26K17N14R75Q68J29l66L1P32O22m44j408j317l57O06J129
$$ 59465 60465 61291 61717 61934 62448 63423 64291 64420 64054 64085 64817 65439 64995 63587 62270 61913 62519 63648
54695F3648J409J560J314O01k7k7L31L88J56L03R83J471J272R22J154J843K464
$$ 63648 65057 66617 67931 68532 68505 68478 68809 69197 69353 69656 70639 72110 73382 74304 75458 77301 79765
54678G9765K967L484L545K610J246P90J612K625K659J712O22J57O96K116L632
$$ 79765 82732 86216 89761 92371 93617 94407 96019 98644 101303 103015 103637 103794 104490 106606 110238
54663A10238M274L935L547L936M973O079P074Q086R055R840J0470J0927J0864
$$ 110238 114512 118447 121994 125930 130903 136982 144056 152142 161197 171037 181507 192434 203298
54650B03298R951Q269O032L154m78m410p706r703j0497j0703j0846j0981j0732
$$ 203298 213249 221518 227550 230704 230226 225816 218110 208407 197910 187207 176361 165380 154648
54637A54648r810q405p007n886n021m442m304m478m468l889k837j644n38L34Q20
$$ 154648 144838 136433 129426 123540 118519 114077 109773 105295 100827 96938 94101 92457 91919 92253 93073
54622I3073Q58N46O2l95n93n09m95r10j606k102k174j993j749j562j569j688j459
$$ 93073 93931 94477 94539 94144 93551 93042 92547 91637 90031 87929 85755 83762 82013 80451 78882 77194 75735
54605G5735p07j37m93j291j342n75j90p12j128n74J81q1j135j727j370p50n25
$$ 75735 75028 74891 74398 73107 71765 71190 71000 70288 69160 68586 68767 68686 67551 65824 64454 63704 63179
54588F3179o47q06q11m63K83J026J247R29M85J87J8PK57O51Q96P87K82m98j139
$$ 63179 62532 61726 60915 60452 60735 61761 63008 63937 64422 64609 64627 64634 64891 65542 66438 67225 67507 67009 65870
54569F5870j130n03K8m7l89m09j33K0M1K97Q37J325J577J659J515R91L10O5O26
$$ 65870 64740 64237 64265 64218 63829 63420 63287 63307 63348 63645 64482 65807 67384 69043 70558 71549 71859 71924 72550
54550G2550J763K881L492L486L158K922K977L331M064N128N967N836M722L356
$$ 72550 74313 77194 80686 84172 87330 90252 93229 96560 100624 105752 111719 117555 122277 125633
54536A25633K199R56n62j897k716l414m324n007m998m716m754m822m316l551l339
$$ 125633 127832 128788 128226 126329 123613 120199 115875 110868 105870 101154 96400 91578 87262 83711 80372
54521H0372l577l310k231j147p91r16q32k66M96Q88N14l26p29l13J22k86j012
$$ 80372 76795 73485 71254 70107 69316 68400 67568 67302 67798 68686 69200 68874 68145 67832 67954 67668 66656
54504F6656q71J07O46J68m13k63J08j66q08p92J75J300J737J433R19O26N16K61
$$ 66656 65785 65892 66538 66706 66293 66030 66138 65972 65164 64372 64547 65847 67584 69017 69936 70562 71078 71339
54486G1339k11m88p6R21J769J777R19j12m53J42Q90O79o11j834j914j041k11o
$$ 71339 71128 70640 70564 71485 73254 75031 75950 75838 75385 75527 76417 77096 76485 74651 72737 71696 71485 71479
54468G1479l80j158k005k235j485l49K88L91N29P26N44J29J49O00O47o6q61j064
$$ 71479 71099 69941 67936 65701 64216 63867 64155 64546 65075 65801 66345 66474 66623 67223 67870 67804 66943 65879
54450F5879q66p35p54q66j159j470j355p63l09l76n09m8J019K151K889L051K634
$$ 65879 65013 64278 63524 62658 61499 60029 58674 57911 57602 57226 56717 56669 57688 59839 62728 65779 68413
54433F8413J809Q90J44k08O4Q92J622J575R17M45M97O42M94J92o6k86l24J49J052
$$ 68413 70222 71112 71256 71048 71112 72004 73626 75201 76118 76563 77060 77702 78196 78388 78322 78036 77712 77861 78913
54414G8913J835K205K387K514K417K167K217K666L008K891K518J977Q89p58k051
$$ 78913 80748 82953 85340 87854 90271 92438 94655 97321 100329 103220 105738 107715 108604 107846 105795
54399A05795k104j244o22q69j585k048j977j630j387j382j471j544j618j545j039
$$ 105795 103691 102447 101825 100956 99371 97323 95346 93716 92329 90947 89476 87932 86314 84769 83730
54384H3730l21k68j275k424k489j526n63l5L75N93J58n97p26l06m61j373j745
$$ 83730 83409 83141 81866 79442 76953 75427 74864 74829 75204 75797 75955 75358 74632 74326 73865 72492 70747
54367G0747q98M0L6r9Q30K281K799K290J939K227K438K107J724J763J980J964
$$ 70747 69849 69889 69925 69826 70656 72937 75736 78026 79965 82192 84630 86737 88461 90224 92204 94168
54351I4168J713J394R97M08l59j059j283r04m77p26j477j768j210n94o85j206
$$ 94168 95881 97275 98272 98680 98321 97262 95979 95075 94598 93872 92395 90627 89417 88823 88138 86932
54335H6932j549j699j771j489q74p46j544k329k046j192j094j841k240j685q32
$$ 86932 85383 83684 81913 80424 79550 78804 77260 74931 72885 71693 70599 68758 66518 64833 64001
54320F4001l98k98k23j82k32l13m42n90m54Q0M51R2o74j098j136j252j350q74
$$ 64001 63603 63305 63082 62900 62668 62355 61913 61323 60869 60949 61400 61492 60818 59720 58584 57332 55982 55108
54302E5108Q7P70Q67P61O09J68l78l76J83M40n2o53n96J1N50O68L30l16q71r08
$$ 55108 55195 55965 56832 57593 58202 58370 57992 57616 57799 58239 58187 57534 56938 56949 57499 58167 58497 58181 57310 56402
54282E6402n29k18j04Q2K88J25l05l81nJ95L1K03J065J820J636R23O74J026J317
$$ 56402 55873 55655 55551 55633 55921 56046 55741 55360 55355 55550 55581 55784 56849 58669 60305 61228 61902 62928 64245
54263F4245J258J203J332J320R17L11j51k94j28J56K23l1k62p2M26P42O43L64
$$ 64245 65503 66706 68038 69358 70275 70586 70435 70141 70013 70169 70392 70361 70099 70027 70453 71195 71838 72202
54245G2202J87J13M9M2J69L23K43k02q29j297j434j362j287j262j202j036p13
$$ 72202 72389 72502 72551 72593 72762 73085 73328 73126 72297 71000 69566 68204 66917 65655 64453 63417 62704
54228F2704k18K78L68j73r73j311q80r2M17M10J14j70l44m16l08J26Q11J334J394
$$ 62704 62486 62764 63132 62959 61986 60675 59795 59703 60120 60530 60644 60474 60130 59714 59406 59532 60343 61677 63071
54209F3071J209J222J332R83J51l44N1P76R17M85K34M38N79K45l96j031j544j775
$$ 63071 64280 65502 66834 67817 67968 67624 67675 68451 69368 69853 70087 70525 71104 71349 70953 69922 68378 66603
54191F6603j497q58l75l11m54n53o22o42m63j53n6k86n97q88j391k087k391j813
$$ 66603 65106 64248 63873 63562 63108 62555 61933 61291 60828 60675 60619 60333 59736 58848 57457 55370 52979 51166
54173E1166o62L09P29P56N92K72o2r8K58O31N18j27p80q98n02p7O5Q7K17L47K50
$$ 51166 50504 50813 51542 52298 52890 53162 53100 53002 53260 53891 54409 54282 53502 52604 52102 52025 52090 52177 52394 52741 52991
54152E2991mq4J68N85Q32O85K24j72k05p5k11n66o73n07o49j283j688j262m58
$$ 52991 52987 52903 53071 53656 54488 55173 55397 55225 55020 54945 54734 54168 53495 52988 52339 51056 49368 48106 47648
54133D7648k3J59O05J169J336J309J698K273K118J071j1o27j179j880k128j489
$$ 47648 47625 47784 48389 49558 50894 52203 53901 56174 58292 59363 59352 58725 57546 55666 53538 52049
54117E2049n50p4j3J50M52N14K08j27o5N55J404J748J124k2p76q35o37m58j07
$$ 52049 51499 51425 51412 51562 52014 52528 52736 52609 52544 53099 54503 56251 57375 57353 56577 55742 55105 54647 54540
54098E4540L46L80j44o18n44j10L23P36J065J017O24L37J93l55j323j777j144
$$ 54540 54886 55266 55122 54504 53960 53850 54173 54909 55974 56991 57615 57952 58145 57790 56467 54690 53546
54081E3546j87R8n9K28R83J422J244Q80O12L28J30M23J207J884J946J441P86M27
$$ 53546 53359 53457 53398 53626 54609 56031 57275 58155 58767 59095 59225 59648 60855 62739 64685 66126 66912 67339
54063F7339O13J091J178M86n11j045r29m75J81J022J676J685J227R60J114J273
$$ 67339 67952 69043 70221 70707 70196 69151 68222 67747 67928 68950 70626 72311 73538 74498 75612 76885
54047G6885J161J023J090J207J205J247J541J953K178K075J710J302J190J627
$$ 76885 78046 79069 80159 81366 82571 83818 85359 87312 89490 91565 93275 94577 95767 97394
54033I7394K479L304L767L877L880M031M428M802M565L389J745O08N25J153J772
$$ 97394 99873 103177 106944 110821 114701 118732 123160 127962 132527 135916 137661 138269 138794 139947 141719
54018A41719K001J932J740J422R25L21k89r90j903k772k996k443j880k114k886
$$ 141719 143720 145652 147392 148814 149739 150060 149771 148781 146878 144106 141110 138667 136787 134673 131787
54003A31787l272l100l123l622l766k965k021k095k983l399k777j861j501j583
$$ 131787 128515 125415 122292 118670 114904 111939 109918 107823 104840 101441 98664 96803 95302 93719
53989I3719j435q21j67l4n00j028j005m22J69M71P23R47N64o92j915j933q02K82
$$ 93719 92284 91463 91296 91262 90762 89734 88729 88307 88476 88947 89670 90617 91181 90489 88574 86641 85839 86121
53971H6121M97Q2m14p70q83o39k58j90m46m86rO44R96R94R00R66J339J885K084
$$ 86121 86618 86700 86286 85516 84633 83994 83736 83546 83100 82614 82605 83249 84245 85239 86139 87105 88444 90329 92413
53952I2413J548P54O98J677K869L430L475L691M370N206N796O016O071O310O838
$$ 92413 93961 94715 95413 97090 99959 103389 106864 110555 114925 120131 125927 131943 138014 144324 151162
53937A51162P271P117O449N759N120M060K424Q44q4o32j461k605l385l222k166
$$ 151162 158433 165550 171999 177758 182878 186938 189362 190206 190122 189490 188029 185424 182039 178817 176651
53922A76651p73K91O14L39P9L80J323K643L971M871N016M558M089L979M022L910
$$ 176651 175878 176169 176783 177122 177201 177581 178904 181547 185518 190389 195405 199963 204052 208031 212053 215963
53906B15963L697L565L417L029K387J582O32k85p95q14q31j246j768j941j999
$$ 215963 219660 223225 226642 229671 232058 233640 234272 233987 233192 232378 231547 230301 228533 226592 224593
53891B24593k623l965n427o369o527n954n022m404m471m732m465l790l391l308
$$ 224593 221970 218005 212578 206209 199682 193728 188706 184302 179831 175099 170634 166844 163453 160145
53877A60145k833j847j262j678k480k853k986l452m001l935l349l014l120l070
$$ 160145 157312 155465 154203 152525 150045 147192 144206 140754 136753 132818 129469 126455 123335 120265
53863A20265k666k481k857l241l036k459k102k039j957j806j797j865j621r15
$$ 120265 117599 115118 112261 109020 105984 103525 101423 99384 97427 95621 93824 91959 90338 89423
53849H9423p5M08L04k78j008j544j712j516r86k13M58N34q2q47j111p43r9M71
$$ 89423 89348 89756 90060 89782 88774 87230 85518 84002 83016 82803 83261 83795 83713 82866 81755 81012 80913 81384
53831H1384P80O53K8p88j272j140n44J79P79J150J333J453J522J395J077Q78J035
$$ 81384 82164 82817 82845 82057 80785 79645 79101 79280 80059 81209 82542 83995 85517 86912 87989 88867 89902
53814H9902J283J132N78J92M59J265K109K579K562K231J918J907K251K811L440
$$ 89902 91185 92317 92895 93087 93546 94811 96920 99499 102061 104292 106210 108117 110368 113179 116619
53799A16619L987M282M239L986L691L398L156L114L205L007K258J356R25R45Q46
$$ 116619 120606 124888 129127 133113 136804 140202 143358 146472 149677 152684 154942 156298 157223 158168 159014
53784A59014L95m7j83k13m26q49j408k063k595k725k585k642k983l166k986k894
$$ 159014 159409 159362 159179 158966 158540 157691 156283 154220 151625 148900 146315 143673 140690 137524 134538 131644
53768A31644l209l465l033k117j576j855k546k972k846k331j726j217q58p30j051
$$ 131644 128435 124970 121937 119820 118244 116389 113843 110871 108025 105694 103968 102751 101893 101163 100112
53753A00112j878k795l167k782j939r57OO11L51p21j748j894j194l65j7j87m06
$$ 100112 98234 95439 92272 89490 87551 86594 86600 87211 87562 86841 85093 83199 82005 81640 81623 81436 81030
53736H1030q0Q21J410P45q47j982j911j280q19k43Q20J688J467N45J06L66M25
$$ 81030 80950 81771 83181 83926 83079 81097 79186 77906 77087 76844 77664 79352 80819 81364 81470 81836 82261
53719H2261j89q26p83k02L86P02O16Q4n37o11K9Q15J162J107J009J060J172J113
$$ 82261 82072 81246 80463 80261 80647 81349 81965 82049 81512 80901 80930 81745 82907 84014 85023 86083 87255 88368
53701H8368O46j56p03m14N16J301J603J822K247K471K027J256R64J396J885J603
$$ 88368 89014 88858 88155 87741 88257 89558 91161 92983 95230 97701 99728 100984 101948 103344 105229 106832
53685A06832N05n55o82N1O38L87j69K5J097K079K256K027K127K438K168J054j43
$$ 106832 107337 106782 106100 106151 106789 107176 107007 107032 108129 110208 112464 114491 116618 119056 121224 122278 122135
53668A22135n08n6L72K21j18%M40M97Q0m0N09R62M99m95j016q69n83k18O34J627
$$ 122135 121627 121571 121943 122164 122046 122046 122486 122983 123063 123023 123532 124494 124993 124498 123482 122613 122030 121812 122446 124073
53648A24073J657M67o52m74N80J137P21N1k29l16o54j132j235p75j11L25N15O84
$$ 124073 125730 126197 125545 125071 125651 126788 127509 127560 127331 127015 126361 125229 123994 123219 123108 123433 123948 124632
53630A24632Q14O57K90J73M71O89M34J34M29J166J662J762J832J838J277K26l61
$$ 124632 125446 126103 126393 126566 127037 127726 128160 128294 128723 129889 131551 133313 135145 136983 138260 138486 138125
53613A38125J32J114J513R67j5o30l45P55J909K350K176K096K302K241J676J176
$$ 138125 138257 139371 140884 141851 141836 141206 140861 141616 143525 145875 148051 150147 152449 154690 156366 157542
53597A57542J166J243J034J027J795K899L396L190K955K884K443J508Q69J166
$$ 157542 158708 159951 160985 162012 163807 166706 170102 173292 176247 179131 181574 183082 183951 185117
53583A85117J871J963J327Q84J219J713J428N39J60P08J235P83k51q00o56m40
$$ 185117 186988 188951 190278 191162 192381 194094 195522 196061 196221 196929 198164 198947 198696 197896 197240 196800
53567A96800l59r7R5n59j928k675j949n63K26K93L08M44L56J0k63l31k48Q1O13
$$ 196800 196441 196344 196439 195880 193952 191277 189328 188765 188991 189284 189592 190036 190392 190402 190139 189808 189560 189641 190254
53548A90254Q10K54o14r45o07k34k61m44l72JM02N34L81L69R84K023K594K166
$$ 190254 191064 191318 190704 189759 189152 188918 188657 188213 187841 187842 188244 188778 189159 189528 190512 192535 195129 197295
53530A97295J262P25O98P61O97N89N13O23J195K098K627K478K348K883L496L251
$$ 197295 198557 199282 199980 200741 201438 202027 202540 203163 204358 206456 209083 211561 213909 216792 220288 223539
53514B23539K434K221K940L878M696N780P070P757P616P536Q181R056R462R491
$$ 223539 225973 228194 231134 235012 239708 245488 252558 260315 267931 275467 283648 292704 302166 311657
53500C11657R496R408R311R860J1326J2812J3313J3110J3199J3772J4230J4394
$$ 311657 321153 330561 339872 349732 361058 373870 387183 400293 413492 427264 441494 455888
53488D55888J4692J5098J4987J4226J3589J3721J4366J4938J5300J5535J5514
$$ 455888 470580 485678 500665 514891 528480 542201 556567 571505 586805 602340 617854
53477F17854J5192J4908J4979J5222J5318J5315J5322J5023J4058J2755J1856
$$ 617854 633046 647954 662933 678155 693473 708788 724110 739133 753191 765946 777802
53466G77802J1600J1656J1881J2367J2739J2289J1156J0479J0791J1061J0192
$$ 777802 789402 801058 812939 825306 838045 850334 861490 871969 882760 893821 904013
53455I04013Q729P963P768O715M298J689n5j289k742m271n482o675q216r538r804
$$ 904013 912742 920705 928473 935188 939486 941175 941120 939831 937089 932818 927336 920661 912445 902907 893103
53440H93103r173q620q691r223j0015j0953j1634j1670j1362j1395j1886j2392
$$ 893103 883930 875310 866619 857396 847381 836428 824794 813124 801762 790367 778481 766089
53428G66089j2679j2792j2459j1311r807r037r362r894r647q637p466o379n176
$$ 766089 753410 740618 728159 716848 707041 698004 688642 678748 669101 660464 652998 646619 641443
53415F41443l727k219r94k96J7M94J535K850L783M141M235M300M419M932O200
$$ 641443 637716 635497 634503 634207 634224 634718 636253 639103 642886 647027 651262 655562 659981 664913 671113
53400F71113P840Q961R370R868J1070J2602J3800J4588J5218J5776J6438J7656
$$ 671113 678953 687914 697284 707152 718222 730824 744624 759212 774430 790206 806644 824300
53388H24300J9485K1198K2105K2442K2933K3797K4757K5712K6856K8256K9830
$$ 824300 843785 864983 887088 909530 932463 956260 981017 1006729 1033585 1061841 1091671
53377A091671L1506L3012L3815L3795L3699L4322L5392L5863L5263L4120L3082
$$ 1091671 1123177 1156189 1190004 1223799 1257498 1291820 1327212 1363075 1398338 1432458 1465540
53366A465540L2219L1303L0239K9028K7652K6179K4690K3001K0777J8051J5367
$$ 1465540 1497759 1529062 1559301 1588329 1615981 1642160 1666850 1689851 1710628 1728679 1744046
53355A744046J3285J1846J0584Q865O270K860r00m619q385j2486j6863k1047k4561
$$ 1744046 1757331 1769177 1779761 1788626 1794896 1797756 1796856 1792237 1783852 1771366 1754503 1733456 1708895
53342A708895k7210k8976k9943l0334l0413l0311l0058k9749k9497k9324k9167
$$ 1708895 1681685 1652709 1622766 1592432 1562019 1531708 1501650 1471901 1442404 1413080 1383913
53331A383913k8915k8355k7330k6064k5102k4703k4632k4754k5338k6365k7027
$$ 1383913 1354998 1326643 1299313 1273249 1248147 1223444 1198812 1174058 1148720 1122355 1095328
53320A095328k6593k5404k4306k3334k1892k0011j8428j7290j5807j3588j1327
$$ 1095328 1068735 1043331 1019025 995691 973799 953788 935360 918070 902263 888675 877348
53309H77348r712q500p302o613p153q662j0107j0841j0918j0541r822q954q092
$$ 877348 867636 859136 851834 845221 838068 829406 819299 808458 797540 786999 777177 768223 760131
53296G60131p142o080n183m567l851k849k140k227k475j786j36J551K888M359
$$ 760131 752989 746909 741726 737159 733308 730459 728319 726092 723617 721831 721695 723246 726134 730493
53282G30493N964O816O621O590Q030J0575J2626J3240J2910J2677J3065J3815
$$ 730493 736457 743273 749894 756484 764514 775089 787715 800955 813865 826542 839607 853422
53270H53422J4240J3901J3129J2738J3050J3447J3192J2259J1149J0201R524R148
$$ 853422 867662 881563 894692 907430 920480 933927 947119 959378 970527 980728 990252 999400
53258I99400Q773P692N581L084J085l95j973l803n467o840q314j0007j1550j2802
$$ 999400 1008173 1015865 1021446 1024530 1025615 1025220 1023247 1019444 1013977 1007137 998823 988816 977266 964464
53244I64464j4126j5687j7011j7713j8092j8632j9257j9529j9256j8569j7607
$$ 964464 950338 934651 917640 899927 881835 863203 843946 824417 805161 786592 768985
53233G68985j6528j5654j5175j4797j4077j3083j2431j2570j3281j3948j4158
$$ 768985 752457 736803 721628 706831 692754 679671 667240 654670 641389 627441 613283
53222F13283j3967j3686j3555j3583j3593j3322j2572j1414j0283r608r295q783
$$ 613283 599316 585630 572075 558492 544899 531577 519005 507591 497308 487700 478405 469622
53210D69622p806o801o330o306o206n834n460n392n778o739q155r373r730r413
$$ 469622 461816 455015 448685 442379 436173 430339 424879 419487 413709 406970 398815 389442 379712 370299
53196C70299r289r767j0321j0264r482q255o895n804n379n558n844n979o136o334
$$ 370299 361010 351243 340922 330658 321176 312921 306026 300222 294843 289285 283441 277462 271326 264992
53182B64992o225n803n642n961o092n406m338l856m207m884n456n870o066n959
$$ 264992 258767 252964 247322 241361 235269 229863 225525 221669 217462 212578 207122 201252 195186 189227
53168A89227n711n494n095m239l184k447k098j792j495j567k088k468k075r13
$$ 189227 183516 178022 172927 168688 165504 163057 160959 159167 157672 156105 154017 151549 149474 148561
53154A48561K99P31J98o15q71o19o52j229j588j123m01k47m34j84L64L04n15j153
$$ 148561 148860 149591 149789 149174 148303 147684 147032 145803 144215 143092 142691 142444 142010 141826 142190 142494 141979 140826
53136A40826r67m42l10n76q09q30p40o87p84r29o94J34Q66N01r11k120k214j565
$$ 140826 139859 139417 139107 138531 137722 136892 136152 135465 134681 133752 133058 133192 134058 134559 133648 131528 129314 127749
53118A27749r45m49J57O19M75j46o00n55k35k0j03m72q83j014p93n32m78n08m01
$$ 127749 126804 126355 126512 127131 127606 127460 126860 126305 126070 126050 125947 125475 124592 123578 122785 122253 121775 121267 120866
53099A20866j91oJ90M44N94M39kn58j078j403j367j032o66l89o6K99M20J77r2
$$ 120866 120675 120669 120859 121303 121897 122336 122334 121776 120698 119295 117928 116896 116230 115841 115775 116074 116494 116671 116579
53080A16579o1J39J95J19P4pk42l48J00R97J666J635J151Q20R14J233J588K115
$$ 116579 116518 116657 116852 116971 117045 117038 116796 116448 116548 117545 119211 120846 121997 122817 123731 124964 126552 128667
53062A28667K972L797L810K698J161K30J21J41k21o66p27o15q88j533j852j349
$$ 128667 131639 135436 139246 141944 143105 143335 143456 143597 143376 142710 141983 141368 140480 138947 137095 135746
53046A35746m12J17j46p69j080r03o12n34o03o41o73p42o81l64n3j06m80q47r92
$$ 135746 135334 135451 135305 134536 133456 132553 131941 131407 130804 130163 129490 128748 128067 127703 127650 127544 127064 126217 125225
53027A25225q25k04P44J403J321R09Q71J109R06J47m64m90k03J46O64J135J000
$$ 125225 124400 124196 124940 126343 127664 128573 129444 130553 131459 131606 131142 130652 130449 130595 131259 132394 133394
53010A33394L82K17Q00J167N45l88n81j67Q7K12P98J643J872J329P67O21N53L65
$$ 133394 133776 133993 134793 135960 136505 136117 135536 135369 135456 135668 136466 138109 139981 141310 142077 142698 143251 143616
52992A43616M80J123J789J928J637J368J293J277J169R31O74N99P44Q81Q99J091
$$ 143616 144096 145219 147008 148936 150573 151941 153234 154511 155680 156611 157285 157884 158628 159509 160408 161499
52976A61499J631J986J467K93n33m70O7N20Q18R44O97K21K28J029J856J748Q63
$$ 161499 163130 165116 166583 166876 166343 165873 165940 166460 167278 168222 168919 169140 169368 170397 172253 174001 174864
52959A74864K82N38R74P13j66p47l97N82J404J638J388Q45L5r08j542j546j141
$$ 174864 175146 175684 176658 177371 177205 176458 176061 176643 178047 179685 181073 181918 181953 181045 179503 177957 176816
52942A76816p51m35jM42M91J21j68nL88N83N13M07M17N45Q12J199J548J656J522
$$ 176816 176065 175630 175629 176071 176562 176683 176515 176510 176898 177481 177994 178401 178818 179363 180175 181374 182922 184578 186100
52923A86100J295J043P12L05Q7M11J298K188K377J824J284J434K026K235J672
$$ 186100 187395 188438 189150 189455 189542 189953 191251 193439 195816 197640 198924 200358 202384 204619 206291
52908B06291O69l92j447k328k603k158j575j529j931k170j999j768j823k135k550
$$ 206291 206960 206568 205121 202793 200190 198032 196457 194928 192997 190827 188828 187060 185237 183102 180552
52893A80552l022l370l228k536j834j698j989k003j341l10N78J124J306J009K43
$$ 180552 177530 174160 170932 168396 166562 164864 162875 160872 159531 159221 159799 160923 162229 163238 163481
52878A63481n92r72p32n1Q62J781K285K010J162M72M43R00J235R27j32j578k733
$$ 163481 162889 161917 161185 161134 161996 163777 166062 168072 169234 169706 170149 171049 172284 173211 173079 171501 168768
52861A68768l167l133l156l255k996k305j707j521j407j045p94j190k036k571
$$ 168768 165601 162468 159312 156057 153061 150756 149049 147528 146121 145076 144282 143092 141056 138485
52847A38485k401j811j261r69r48j157j484j721j618r97p1M04k66j733k675k229
$$ 138485 136084 134273 133012 132043 131095 129938 128454 126733 125115 124118 124047 124451 124185 122452 119777 117548
52831A17548j015l03m38o89m16J75N02L10j63n33o40p03j016j410j331o65k8J20
$$ 117548 116533 116230 115792 115103 114687 114862 115364 115674 115511 114978 114338 113635 112619 111209 109878 109213 109185 109305
52813A09305J52N85J146J310J385K057K993L008J803N66L98R79J356J326J289
$$ 109305 109457 110042 111188 112498 113883 115940 118933 121941 123744 124310 124708 125687 127043 128369 129658
52798A29658J314J196J155J614K298K330J474O07O43J380J870J648J129Q26P11
$$ 129658 130972 132168 133323 134937 137235 139565 141039 141646 142289 143669 145539 147187 148316 149142 149853
52783A49853M96J55j72o02j321k023k060j294l77L7M2J29L80M01l2o77j136j188
$$ 149853 150349 150504 150332 149730 148409 146386 144326 143032 142655 142692 142734 142863 143243 143644 143612 142935 141799 140611
52765A40611q84n19m59p72j091j069q47q60j297j914k303k144j432o35l91p15
$$ 140611 139727 139208 138749 137977 136886 135817 134970 134110 132813 130899 128596 126452 125020 124385 123994 123279
52749A23279p96N2J444K366K370J894J467J100N24l01j028j199p45l19o55j478
$$ 123279 122483 122535 123979 126345 128715 130609 132076 133176 133700 133399 132371 131172 130427 130108 129453 127975
52733A27975j528j48J653K361J758Q83N33P44J394K338K969K634J747J461K050
$$ 127975 126447 126299 127952 130313 132071 132954 133487 134231 135625 137963 140932 143566 145313 146774 148824
52718A48824K525K188J661J852K670L283L120K139O66n56p15J62J078J254R89
$$ 148824 151349 153537 155198 157050 159720 163003 166123 168262 168928 168372 167657 167819 168897 170151 171140
52703A71140R03R09N39j80q24j243j541j607j222n19J92P72J194J308J128J016
$$ 171140 172043 172952 173491 173311 172487 171244 169703 168096 166874 166355 166547 167319 168513 169821 170949 171965
52687A71965J132J052M10l27l32M98J466J890J547M73r51j880j706r27o82j305
$$ 171965 173097 174149 174559 174232 173900 174398 175864 177754 179301 179774 178823 176943 175237 174310 173628 172323
52671A72323j950j850j300j046j260j595j854k076k199k103j962k088k361k268
$$ 172323 170373 168523 167223 166177 164917 163322 161468 159392 157193 155090 153128 151040 148679 146411
52657A46411j628r74r23j334j439p61L44J153J336J161J131J498K033K181J697
$$ 146411 144783 143809 142886 141552 140113 139352 139696 140849 142185 143346 144477 145975 148008 150189 151886
52642A51886J093J134J785K134J682J117J229J556R98l72j164n30P07J209O72
$$ 151886 152979 154113 155898 158032 159714 160831 162060 163616 164614 164242 163078 162548 163255 164464 165136
52627A65136k69j072j552j562j138q22j207k134k809k733k213j821j680j459r98
$$ 165136 164867 163795 162243 160681 159543 158721 157514 155380 152571 149838 147625 145804 144124 142665 141667
52612A41667o67r49j589j626n71P05R30J64k69L06R46N92l21n89k2N38P47J186
$$ 141667 141000 140051 138462 136836 136265 136970 137900 138064 137795 138101 139047 139639 139318 138729 138707 139245 139992 141178
52594A41178K099K669K061O59m21o90o61r11j319j381r55l82M8L52N04J85p54
$$ 141178 143277 145946 148007 148666 148245 147555 146894 145983 144664 143283 142328 141946 141994 142346 142850 143035 142281
52577A42281j778k108j599q61m49l77m92q00j176j222q33m88n98q84q64o44o56
$$ 142281 140503 138395 136796 135935 135486 135109 134617 133817 132641 131419 130586 130098 129500 128616 127752 127108 126452
52560A26452p75l64O48J360R53j98r65q68n86q71j440j410o39J4r4n57p05o31
$$ 126452 125677 125313 125961 127321 128274 128076 127111 126243 125657 124786 123346 121936 121297 121311 121217 120660 119955 119324
52542A19324q14j122j021n52k91l50l01j06k32p01r22p54p74j082q46L12J354
$$ 119324 118510 117388 116367 115815 115524 115174 114873 114767 114535 113834 112912 112158 111384 110302 109456 109768 111122
52525A11122J149O6o82p12m91j45N79J357J410O95R9J79M88M03n1n10q70j196
$$ 111122 112271 112337 111655 110943 110452 110307 110886 112243 113653 114348 114447 114626 115114 115517 115466 114956 114086 112890
52507A12890j416j430j295j084o95m8O21Q38L06p13j498j520r83n49m69l57J32
$$ 112890 111474 110044 108749 107665 106970 106922 107543 108381 108687 107974 106476 104956 103973 103424 102955 102598 102730
52490A02730P64J104J029O13j00q52j092n26M51J211J488J279N83l30q20n57J4
$$ 102730 103494 104598 105627 106240 106140 105288 104196 103670 104121 105332 106820 108099 108682 108352 107532 106975 106989
52473A06989K60J34m4j63k02j6K48J0q41j366p14N19R73L34m12m09K79J165J760
$$ 106989 107249 107383 107339 107176 106974 106958 107206 107216 106375 105009 104295 104814 105787 106121 105709 105300 105579 106744 108504
52454A08504J522L14r81j210m44O9l85j128j249q20m16j30L82J161J756J649P43
$$ 108504 110026 110340 109359 108149 107705 107774 107389 106261 105012 104192 103776 103646 104028 105189 106945 108594 109337
52437A09337m06r18m60K68L07l19p14m18J08L84N63Q75J074Q95O29P22J048J081
$$ 109337 108931 108013 107553 107821 108128 107809 107095 106677 106785 107169 107732 108607 109681 110576 111205 111927 112975 114056
52419A14056O19O2r2J85M49L08q7k56n0J80K10K51M09L24j54m71k00J12k96j076
$$ 114056 114675 114737 114645 114830 115279 115587 115500 115244 115194 115374 115584 115835 116244 116568 116414 115943 115743 115855 115559 114483
52399A14483j213o05j78m34q13p17k76J27L49K91j03m70l22J83M94O31J090J734
$$ 114483 113270 112665 112487 112053 111240 110523 110247 110374 110723 111014 110911 110441 110119 110302 110796 111427 112517 114251
52381A14251J803J253R78J328J487Q48P1K0N29R35J094J144R20L71kJ44M27N23
$$ 114251 116054 117307 118285 119613 121100 121948 122019 122039 122568 123503 124597 125741 126661 127032 127030 127174 127601 128124
52363A28124R31K012K908K374N87q67p41O90K200K730K068Q90J17%Rj91j72M42
$$ 128124 129055 131067 133975 136349 136936 136069 135328 136018 138218 140948 143016 143906 144023 144023 144032 143841 143669 144111
52345A44111J221J565J581J662J623J135O48Q71J558J682J000M85R08J725J845
$$ 144111 145332 146897 148478 150140 151763 152898 153546 154417 155975 157657 158657 159142 160050 161775 163620
52330A63620J089L36M31J309K235K651K622K505K463K433K454K646K932L184L537
$$ 163620 164709 165045 165476 166785 169020 171671 174293 176798 179261 181694 184148 186794 189726 192910 196447
52315A96447M175M832N069N092N565O492P042O828O560O961P785Q408Q779R074
$$ 196447 200622 205454 210523 215615 221180 227672 234714 241542 248102 255063 262848 271256 280035 289109
52301B89109R073Q564P884P407O992O539O541P270Q062Q291Q522R595J1052J1666
$$ 289109 298182 306746 314630 322037 329029 335568 342109 349379 357441 365732 374254 383849 394901 406567
52287D06567J1279J0884J0885J0618R809R313R876J1014J1734J1734J1403J1111
$$ 406567 417846 428730 439615 450233 460042 469355 479231 490245 501979 513713 525116 536227
52275E36227J0901J0644J0189R516Q745P836O496M759L451L410M359N175N219
$$ 536227 547128 557772 567961 577477 586222 594058 600554 605313 608764 612174 616533 621708 626927
52262F26927M707L940K910J834J234J243J453J565J652J589J032J28l50O1R66
$$ 626927 631634 635574 638484 640318 641552 642795 644248 645813 647465 649054 650086 650214 649864 649925 650891
52247F50891J766K267K489K440K376K764L694M782N773O743P537P823P862Q426
$$ 650891 652657 654924 657413 659853 662229 664993 668687 673469 679242 685985 693522 701345 709207 717633
52233G17633R558J0233R814R081R108R808J0377J0606J0776J0656R703Q183P138
$$ 717633 727191 737424 747238 756319 765427 775235 785612 796218 806994 817650 827353 835536 842674
52220H42674P055P324P202O666N988N089L742K189J067P52R20Q60J30r89j823
$$ 842674 849729 857053 864255 870921 876909 881998 885740 887929 888996 889748 890668 891528 891658 890669 888846
52205H88846k077k199k839m051n277o073o516o891p168p065o535n992n901o214
$$ 888846 886769 884570 881731 877680 872403 866330 859814 852923 845755 838690 832155 826163 820262 814048
52191H14048o385o038n444n150n224n225m900m529m425m366l897l095k627k970
$$ 814048 807663 801625 796181 791031 785807 780582 775682 771153 766728 762362 758465 755370 752743 749773
52177G49773l745m101l700l078k914l221l515l667m009m533m600l818k778k339
$$ 749773 746028 741927 738227 735149 732235 729014 725499 721832 717823 713290 708690 704872 702094 699755
52163F99755k566k929l227l561l619k915j798j334j894k644k741k385k235k453
$$ 699755 697189 694260 691033 687472 683853 680938 679140 677806 675912 673268 670527 668142 665907 663454
52149F63454k787l040k987k370j508j374k440l871m481m075l294k539j876j588
$$ 663454 660667 657627 654640 652270 650762 649388 646948 643077 638596 634521 631227 628688 626812 625224
52135F25224j902k327k112j449j330k124l037l266k957k725k782k969l152l202
$$ 625224 623322 620995 618883 617434 616104 613980 610943 607677 604720 601995 599213 596244 593092 589890
52121E89890k942k423k042k052k209k119j676r75q8Q21J513J956K348K711K919
$$ 589890 586948 584525 582483 580431 578222 576103 574427 573452 573364 574185 575698 577654 580002 582713 585632
52106E85632L285M527O725Q739R405Q984Q805R587J0804J1709J2258J2766J3200
$$ 585632 588917 593444 600169 608908 618313 627297 636102 645689 656493 668202 680460 693226 706426
52093G06426J3218J2745J2213J2281J3289J4812J5862J5847J5301J5229J5793
$$ 706426 719644 732389 744602 756883 770172 784984 800846 816693 831994 847223 863016
52082H63016J6125J5567J4434J3328J2311J1203J0209R587R037Q129P061O300
$$ 863016 879141 894708 909142 922470 934781 945984 956193 965780 974817 982946 990007 996307
52070I96307N630M329K410Q42J94j88j145k453l284l611m281n664o912o908n595
$$ 996307 1001937 1006266 1008676 1009518 1009712 1009524 1008379 1005926 1002642 999031 994750 989086 982174 975266 969671
52055I69671m075l520m175n295n865n463m595m164m511n055m984m254l586l454
$$ 969671 965596 962076 957901 952606 946741 941278 936683 932519 928008 922953 917969 913715 910129 906675
52041I06675l494l114k381j787j364o92K52R28J150J412J941K078J257J00k73
$$ 906675 903181 900067 897686 895899 894535 893843 894095 895023 896173 897585 899526 901604 902861 902961 902688
52026I02688L69J454K661L928M650M051K437R69P7q59j979k437j966j684k491
$$ 902688 903057 904511 907172 911100 915750 919801 922238 923207 923284 922425 920446 918009 916043 914359 911868
52011I11868l733m494n245o928r140j0679j1500j2635j4365j5817j6560j7219
$$ 911868 908135 903641 898396 891468 882328 871649 860149 847514 833149 817332 800772 783553
51999G83553j8211j9012j9107j8764j8407j8064j7870j8257j9104j9435j8613
$$ 783553 765342 746330 727223 708459 690052 671988 654118 635861 616757 597322 578709
51988E78709j7255j6357j6016j5700j5345j5518j6549j8050j9219j9385j8424
$$ 578709 561454 545097 529081 513381 498036 482518 465969 447919 428700 409315 390891
51977C90891j6869j5485j4526j3730j2960j2430j2073j1350j0066q757p810o782
$$ 390891 374022 358537 344011 330281 317321 304891 292818 281468 271402 262645 254835 248053
51965B48053n247l874l703m604n328n079m299l710l347k880k363k150k356k758
$$ 248053 242806 238932 235229 230625 225297 220218 215919 212209 208862 205982 203619 201469 199113 196355
51951A96355l092l192l013k614k127j590j050p62j098j979k751k828k364j971
$$ 196355 193263 190071 187058 184444 182317 180727 179677 178915 177817 175838 173087 170259 167895 165924
51937A65924j882j801j578j578k100k723k665j737n63K05N22O52O40M19J51J12
$$ 165924 164042 162241 160663 159085 156985 154262 151597 149860 149297 149502 150024 150676 151316 151735 151886 151998
51921A51998K54K28j53o87j048j057p28k02K60M12J57m22j104j546j472j004n96
$$ 151998 152252 152480 152327 151640 150592 149535 148807 148605 148865 149277 149434 149012 147908 146362 144890 143886 143290
51904A43290m18r3O46J332J323P39L11L21L96L92O99J404J792J248K03l68j03
$$ 143290 142872 142779 143425 144757 146080 146819 147130 147451 147847 148239 148938 150342 152134 153382 153585 153217 153114
51887A53114N32J067J512J970K257K117J719J692K500L794M626M525M132M443
$$ 153114 153646 154713 156225 158195 160452 162569 164288 165980 168480 172274 176900 181425 185557 190000
51873A90000N622P020Q249R498J0757J1576J2041J3197J5805J9254K2398K5009
$$ 190000 195622 202642 210891 220389 231146 242722 254763 267960 283765 303019 325417 350426
51861C50426K7435K9059K8254K4129J7449R469O68q694j7366k3454k6123k6327
$$ 350426 377861 406920 435174 459303 476752 486221 486889 478195 460829 437375 411252 384925
51849C84925k5682k4993k4059k2497k0295j7672j4853j2131r906q404p494o841
$$ 384925 359243 334250 310191 287694 267399 249727 234874 222743 212837 204433 196939 190098
51837A90098o158n304m298l454l193l537l832l366k103o39M65R67P63o2j011j493
$$ 190098 183940 178636 174338 170884 167691 164154 160322 156956 154853 154214 154679 155646 156409 156347 155336 153843
51821A53843j513j601j878j694n90Q23J445J002K77P4L04L81J43M9M17Q47O97
$$ 153843 152330 150729 148851 147157 146567 147390 148835 149837 150114 150188 150492 150873 151016 151065 151482 152329 153026
51804A53026Rm76l44%Q4J30M92Q13M96k16m74j63n7n03q95p74n90q03r94n56K80
$$ 153026 153035 152559 152215 152215 152299 152429 152921 153734 154230 154014 153540 153377 153320 152817 151922 151148 150558 149755 148761 148205 148485
51783A48485Q79J135J278J166N71q6j42K84M17j6m36l49P4M94Q66J157J130P15
$$ 148485 149364 150499 151777 152943 153514 153428 153286 153570 153987 153971 153535 153186 153260 153754 154620 155777 156907 157622
51765A57622K60P9l3m82j207j638j407q17m06j20O25J902K743K218Q11n6J08L90
$$ 157622 157882 157961 157928 157446 156239 154601 153194 152377 151971 151851 152476 154378 157121 159339 160150 160094 160202 160592
51747A60592P5k23K24Q62O41k90q49p32p35j322j925j957j575j097m14M94J110
$$ 160592 160667 160444 160668 161530 162171 161881 161032 160300 159565 158243 156318 154361 152786 151689 151275 151769 152879
51730A52879R97M22r5m90r04j097p29n4K40q3n22n49k36NJ30M77J118J438P90
$$ 152879 153876 154298 154203 153713 152809 151712 150983 150929 151169 151086 150564 150015 149779 149784 149914 150391 151509 152947 153737
51711A53737n45j404j016J04P72M47m75j379j943j970j372n07j15n17j176j288
$$ 153737 153192 151788 150772 150876 151648 152095 151620 150241 148298 146328 144956 144449 144334 143817 142641 141353
51695A41353p16m6J93J47M05J193K012K137J413K86q88k098l094l198k268j311
$$ 141353 140637 140591 140784 140931 141336 142529 144541 146678 148091 148377 147489 145391 142297 139099 136831 135520
51679A35520j343j866j510j26Q41M57l09lJ260K156K068J546J045L04p17j184
$$ 135520 134177 132311 130801 130675 131516 131973 131664 131661 132921 135077 137145 138691 139736 140040 139323 138139
51663A38139l71J167K023J448K6j073j164m15N37J129J230J086J033J183J358
$$ 138139 137768 138935 140958 142406 142432 141359 140195 139780 140317 141446 142676 143762 144795 145978 147336
51648A47336J272P59m9p06p07N1J101J777J727J022j10j380k329k517j996j364
$$ 147336 148608 149367 149318 148612 147905 147956 149057 150834 152561 153583 153473 152093 149764 147247 145251 143887
51632A43887j144j216j141q48p01r02j135r23k09N36P74M79J93L85Q42J008Q53
$$ 143887 142743 141527 140386 139538 138837 137935 136800 135877 135668 136204 136978 137457 137650 138035 138877 139885 140738
51615A40738Q93J222J212N56l1J49O67O88L74N34J119J308J015R91J244P83n82
$$ 140738 141631 142853 144065 144621 144590 144739 145406 146094 146468 147002 148121 149429 150444 151435 152679 153462 152880
51598A52880j456p59O78J379J223J066J136R85O46O14Q65Q94N83K40j53p91j310
$$ 152880 151424 150665 151343 152722 153945 155011 156147 157132 157778 158392 159257 160151 160734 160974 160821 160030 158720
51581A58720r91K04J581K571L025K781J808P23L79Q24J311J383J310J424J734
$$ 158720 157729 157933 159514 162085 165110 167891 169699 170422 170801 171625 172936 174319 175629 177053 178787
51566A78787K197K749L049K851K539K657K925K517J289n2j000j625j845j265k7
$$ 178787 180984 183733 186782 189633 192172 194829 197754 200271 201560 201508 200508 198883 197038 195773 195746
51551A95746J009J228P76l0j003j683j484n76J30K04J12J54q7p94j290j099q24
$$ 195746 196755 197983 198759 198729 197726 196043 194559 193983 194113 194317 194429 194583 194496 193702 192412 191313 190489
51534A90489j259k147k558k208j643j433j608j819j716j347j300j997k835k695
$$ 190489 189230 187083 184525 182317 180674 179241 177633 175814 174098 172751 171451 169454 166619 163924
51520A63924j458k61P6L2L11O48M64l6l07m37q19j256j244q76o69p21o88m37p2
$$ 163924 162466 162205 162281 162313 162624 163272 163736 163700 163393 162956 162137 160881 159637 158761 158092 157371 156683 156246 156174
51501A56174M50J080J280N78n89j274j153p04m17l71n13p59r08q94r53j148j013
$$ 156174 156624 157704 158984 159562 158973 157699 156546 155842 155425 155054 154541 153782 152874 151980 151027 149879 148866
51484A48866l25J95k84j337j628o49P28J506J641J626J699J760J722J543J259
$$ 148866 148541 148736 148452 147115 145487 144838 145566 147072 148713 150339 152038 153798 155520 157063 158322
51469A58322J040R99R35N99J03k45l31o5Q80K482L780L690K424J257P27M9j443
$$ 158322 159362 160361 161296 161895 161998 161753 161422 161357 162237 164719 168499 172189 174613 175870 176597 176646 175203
51452A75203l191m334m918n478n945n797m972l924k892j801p27P9O55J227J603
$$ 175203 172012 167678 162760 157282 151337 145540 140568 136644 133752 131951 131224 131303 131958 133185 134788
51437A34788J305L78l70l14K66O67O34L89M7n18j279j918k200k200k059j693r37
$$ 134788 136093 136471 136101 135787 136053 136720 137354 137743 137790 137272 135993 134075 131875 129675 127616 125923 124986
51420A24986J85J420K348K471J531r8j568k367k705k945k978k597k075j817j682
$$ 124986 125171 126591 128939 131410 132941 132843 131275 128908 126203 123258 120280 117683 115608 113791 112109
51405A12109j341j173j898l188l626k469p33R4k03p02p54m80j48J82M29M54L30
$$ 112109 110768 109595 107697 104509 100883 98414 97681 97775 97572 96870 96116 95636 95488 95670 96099 96553 96883
51388I6883J99%l17m15P4Q68J235R21M94N58R86J144P15J19R3Q53J770J989J320
$$ 96883 97082 97082 96765 96350 96424 97292 98527 99448 99942 100500 101486 102630 103345 103464 103557 104410 106180 108169 109489
51369A09489L34l69n95k91M87J195J047M6p20m24M26P94N03Q8l02r39j688k070
$$ 109489 109823 109454 108859 108568 109055 110250 111297 111343 110623 110199 110625 111419 111922 112010 111708 110769 109081 107011
51351A07011k145k400k729k401j264j64J97M5j56m59r28j000j41J157J825J580
$$ 107011 104866 102466 99737 97336 96072 95908 96105 96150 95994 95535 94607 93607 93466 94623 96448 98028
51335I8028J271J657K370K428J554N00J5o0l06o43l96N30J256J090N04L90Q05
$$ 98028 99299 100956 103326 105754 107308 107808 107823 107763 107457 106814 106418 106948 108204 109294 109798 110188 110993
51318A10993J105R96O96K59m90j400k068k424k664k618j938r10k98k90l12q7o3
$$ 110993 112098 113094 113790 114049 113559 112159 110091 107667 105003 102385 100447 99537 99239 98949 98637 98550 98487
51301I8487m77q31p26n46p40r90p24J0O72J015J117J025Q57J018J750K623K985
$$ 98487 98010 97179 96453 95907 95167 94177 93453 93463 94135 95150 96267 97292 98149 99167 100917 103540 106525
51284A06525K838K792L176L627L678L356L055L002K969K509J441O7j134j988k611
$$ 106525 109363 112155 115331 118958 122636 125992 129047 132049 135018 137527 138968 139035 137901 135913 133302
51269A33302l001k957k422j635q27j29J67k80j297k156k379k193j903j293j67
$$ 133302 130301 127344 124922 123287 122460 122331 122498 122218 120921 118765 116386 114193 112290 110997 110830
51254A10830R00J055L02m51n23r2L18N33O48O90N95L40k2l52l49K33J152J703
$$ 110830 111730 112785 113087 112636 112113 112021 112339 112872 113520 114210 114805 115145 115123 114771 114422 114655 115807 117510
51236A17510J452Q54P84J502K249K108J102J97J81P04O98k94j447j525k77J254
$$ 117510 118962 119816 120600 122102 124351 126459 127561 127758 127939 128643 129341 129047 127600 126075 125798 127052
51220A27052J917J717J581K027K482K180J293O47M84J59q33k131l067l436l348
$$ 127052 128969 130686 132267 134294 136776 138956 140249 140896 141380 141539 140706 138575 135508 132072 128724
51205A28724k801j916j251j242j482j222m64Q6J07K6J64K38lj90R1N55N22j17
$$ 128724 125923 124007 122756 121514 120032 118810 118346 118432 118539 118565 118729 118967 118964 118774 118865 119420 119942 119825
51187A19825p10n75K26J027J306J209J196J344J271Q22L82K20po47j285j271p15
$$ 119825 119115 118540 118766 119793 121099 122308 123504 124848 126119 126941 127323 127543 127536 126889 125604 124333 123618
51170A23618k80j07K19O25M52m10j128j124r14j235j910k217j916j354q81o43
$$ 123618 123338 123231 123450 124075 124527 124117 122989 121865 120951 119716 117806 115589 113673 112319 111438 110795
51154A10795o44n22L59K040L427L283J731K04j02O68J517J804J725J834K296K679
$$ 110795 110151 109629 109988 112028 115455 118738 120469 120673 120571 121239 122756 124560 126285 128119 130415 133094
51138A33094K513J834J054L69k65o92n54Q2N69M50L9n2L45R07J253J193P83L84
$$ 133094 135607 137441 138495 138864 138599 137907 137353 137435 138004 138454 138493 138441 138786 139693 140946 142139 142922 143306
51120A43306L59O13O94M71K30Jn94j543k119j857j302j204j419j241n45Q7J92
$$ 143306 143665 144278 144972 145443 145673 145674 145080 143537 141418 139561 138259 137055 135636 134395 133850 133937 134129
51103A34129j14m06k45N54J580J993J501P87N44M64j18j010j373r59l16J43N11
$$ 134129 134015 133609 133364 133918 135498 137491 138992 139779 140323 140787 140669 139659 138286 137327 137011 137154 137665
51086A37665P91Q16P82J102J601J588R98O35R69J346R31j31r51j029o39l52n00
$$ 137665 138456 139272 140054 141156 142757 144345 145343 145978 146947 148293 149224 149093 148142 147113 146474 146122 145622
51069A45622r92j348j094l39K68K82n6l16m85p20q04l84L38O63L16r8R5O14N60
$$ 145622 144630 143282 142188 141849 142117 142399 142343 142027 141542 140822 140018 139634 139972 140635 140951 140853 140948 141562 142122
51050A42122k69r37n85L22O49K64K09J060J968J912J191Q90J274J682J795K010
$$ 142122 141853 140916 140331 140653 141302 141566 141775 142835 144803 146715 147906 148796 150070 151752 153547 155557
51034A55557K429K478J915J462J795K473K543J967J700K338L242L277K142O80
$$ 155557 157986 160464 162379 163841 165636 168109 170652 172619 174319 176657 179899 183176 185318 185998
51020A85998o5J96J050K079L138M010M215L579K649K176K276K468K423K290K350
$$ 185998 185933 186129 187179 189258 192396 196406 200621 204200 206849 209025 211301 213769 216192 218482 220832
51005B20832K750L584M859O249P270P836Q341R119J0110J1092J2058J3065J4044
$$ 220832 223582 227166 232025 238274 245544 253380 261721 270840 280950 292042 304100 317165 331209
50992C31209J4889J5654J6490J7449J8391J9100J9470J9668K0015K0692K1723
$$ 331209 346098 361752 378242 395691 414082 433182 452652 472320 492335 513027 534750
50981E34750K3306K5782K9029L2208L4540L6136L7614L9229M0811M2341M3855
$$ 534750 558056 583838 612867 645075 679615 715751 753365 792594 833405 875746 919601
50970I19601M4915M4903M3871M2415M0580L7694L3511K8789K4316K0110J5990
$$ 919601 964516 1009419 1053290 1095705 1136285 1173979 1207490 1236279 1260595 1280705 1296695
50959A296695J2333R554P284M874K484R44O08R34J303J744K592L722M311L372
$$ 1296695 1309028 1318582 1325866 1330740 1333224 1334168 1334776 1335710 1337013 1338757 1341349 1345071 1349382 1352754
50945A352754N39l564p796j1419j4538j7706k1407k5914l1159l6474m0797m3618
$$ 1352754 1353293 1349729 1341933 1330514 1315976 1298270 1276863 1250949 1219790 1183316 1142519 1098901
50933A098901m5472m7131m8557m9103m8539m7199m5205m2268l8518l4852l1985
$$ 1098901 1053429 1006298 957741 908638 860099 812900 767695 725427 686909 652057 620072
50922F20072k9571k6788k3578k0715j8715j7221j5633j3844j2100j0493q948p498
$$ 620072 590501 563713 540135 519420 500705 483484 467851 454007 441907 431414 422466 414968
50910D14968o206m965l732k790k369k079j275o6O89N31M6k0L67Q82J496K167K462
$$ 414968 408762 403797 400065 397275 394906 392827 391552 391486 392175 392706 392752 392732 393099 393981 395477 397644 400106
50893D00106K271K422L669N370O189O017O107P155Q423R109R544J0325J1240J1854
$$ 400106 402377 404799 408468 413838 420027 426044 432151 439306 447729 456838 466382 476707 487947 499801
50879D99801J2525J3920J5926J7829J9390K0951K2752K4842K7511L1115L5470
$$ 499801 512326 526246 542172 560001 579391 600342 623094 647936 675447 706562 742032
50868G42032M0043M4699M9659N4766N9487O3795O8432P4015Q0305Q6607R2443
$$ 742032 782075 826774 876433 931199 990686 1054481 1122913 1196928 1277233 1363840 1456283
50857A456283R7599J01923J05388J08163J10166J10713J08805J03737R5407Q4271
$$ 1456283 1553882 1655805 1761193 1869356 1979522 2090235 2199040 2302777 2398184 2482455
50847B482455P1184N7225M3381L0346J8589Q476J31o613j1861j5200j5873j3582
$$ 2482455 2553639 2610864 2654245 2684591 2703180 2711656 2711787 2705174 2693313 2678113 2662240 2648658
50835B648658r000l256K932R293J5098J8762J8754J4864Q087o23j1054k3137l6276
$$ 2648658 2639658 2636402 2639334 2648627 2663725 2682487 2701241 2716105 2724192 2723569 2712515 2689378 2653102
50822B653102m9685o2984p6023q8294r8914j07202j12960j16194j16889j15152
$$ 2653102 2603417 2540433 2464410 2376116 2277202 2170000 2057040 1940846 1823957 1708805
50812A708805j11346j05993r9543r2264q4298p5920o7658n9978n2796m5732l8911
$$ 1708805 1597459 1491466 1391923 1299659 1215361 1139441 1071783 1011805 959009 913277 874366
50801H74366l3111k8721k4999k0900j6450j2682j0192q415o512m425k750j854
$$ 874366 841255 812534 787535 766635 750185 737503 727311 718896 712384 707959 705209 703355
50789G03355j583j649j955k509l233l929m376m532m593m812n211n588n779n780
$$ 703355 701772 700123 698168 695659 692426 688497 684121 679589 674996 670184 664973 659385 653606 647826
50775F47826n629n345n064m966m957m546l282j255R63K809M148N207O345P724
$$ 647826 642197 636852 631788 626822 621865 617319 614037 612782 613745 616554 620702 625909 632254 639978
50761F39978R186J0408J1347J2375J3765J5154J5897J6062J6645J8451K1004K3147
$$ 639978 649164 659572 670919 683294 697059 712213 728110 744172 760817 779268 800272 823419
50749H23419K4580K6287K9239L3292L7702M2097M6414N0245N3204N5787N8969
$$ 823419 847999 874286 903525 936817 974519 1016616 1063030 1113275 1166479 1222266 1281235
50738A281235O2649O5248O5332O3051N9563N5504N0626M4541L7058K7958J7235
$$ 1281235 1343884 1409132 1474464 1537515 1597078 1652582 1703208 1747749 1784807 1812765 1830000
50727A830000N726n023j3803k0352k4894k7409k7583k5209k0531j4344p868k252
$$ 1830000 1835726 1830703 1816900 1796548 1771654 1744245 1716662 1691453 1670922 1656578 1648710 1646458
50715A646458J980M932O751P299O338L766n47o855j5130k4634l4257m3237n1438
$$ 1646458 1648438 1653370 1660121 1667420 1673758 1677524 1676977 1670122 1654992 1630358 1596101 1552864 1501426
50702A501426n8736o4428o7509o7593o5433o2289n8889n5117n0645m5603m0497
$$ 1501426 1442690 1378262 1310753 1243160 1177727 1115438 1056549 1001432 950787 905184 864687
50691H64687l5703l1274k7141k3205j9321j5397j1545p995m787j730J363M434
$$ 864687 828984 797710 770569 747364 728043 712646 701101 693106 688319 686589 687952 692386
50679F92386P257R656J1636J3283J4540J5118J4834J3990J3163J2552J1774J0504
$$ 692386 699643 709299 720935 734218 748758 763876 778710 792700 805863 818415 830189 840693
50667H40693R030P861P029O178N235M557M401M605M918N332O032P294R380J2281
$$ 840693 849723 857584 864613 870791 876026 880583 884984 889589 894507 899839 905871 913165 922545 934826
50653I34826J5431J8049J9838K1149K2344K3393K4202K4944K5754K6258K5882
$$ 934826 950257 968306 988144 1009293 1031637 1055030 1079232 1104176 1129930 1156188 1182070
50642A182070K4541K2732K0948J9150J6944J4142J1055Q197N705L163J10l302
$$ 1182070 1206611 1229343 1250291 1269441 1286385 1300527 1311582 1319779 1325484 1328647 1328757 1325455
50630A325455o349q460r756j0853j2211j3770j5063j5683j5633j5231j4640j3723
$$ 1325455 1319106 1310646 1300890 1290037 1277826 1264056 1248993 1233310 1217677 1202446 1187806 1174083
50618A174083j2484j1383j0745j0063q547o335m507l577k757j256L03N61q28k981
$$ 1174083 1161599 1150216 1139471 1129408 1120861 1114526 1110019 1106442 1103685 1102429 1102732 1103293 1102465 1099484
50604A099484n278q106j1929j6360k0619k4381k7707l0407l2071l2596l2301l1496
$$ 1099484 1094206 1086100 1074171 1057811 1037192 1012811 985104 954697 922626 890030 857729 826233
50592H26233l0178k8182k5475k2275j9042j6144j3503j0688p558m645k588j360
$$ 826233 796055 767873 742398 720123 701081 684937 671434 660746 653188 648543 645955 644595
50580F44595l70P00J543J791J572J330J267J235J062Q35R19J762L592O115Q631
$$ 644595 644225 644925 646468 648259 649831 651161 652428 653663 654725 655560 656479 658241 661833 667948 676579
50565F76579J0591J2024J3329J4749J6168J7355J8122J8309J7923J7352J7173
$$ 676579 687170 699194 712523 727272 743440 760795 778917 797226 815149 832501 849674
50554H49674J7481J7685J7226J6359J5868J6121J6791J7556J8575K0055K1812
$$ 849674 867155 884840 902066 918425 934293 950414 967205 984761 1003336 1023391 1045203
50543A045203K3684K6003K9158L2764L6008L8775M1866M5808N0127N4111N7703
$$ 1045203 1068887 1094890 1124048 1156812 1192820 1231595 1273461 1319269 1369396 1423507 1481210
50532A481210O1107O3971O5773O6696O7280O7182O5160O0553N4031M6560L8265
$$ 1481210 1542317 1606288 1672061 1738757 1806037 1873219 1938379 1998932 2052963 2099523 2137788
50521B137788K8736J7997O583m972j6259k6853l6537m5411n3380n9764o3871o5790
$$ 2137788 2166524 2184521 2191104 2186132 2169873 2143020 2106483 2061072 2007692 1947928 1884057 1818267
50509A818267o6106o5068o2574n8781n4125m8750m2580l5981k9745k4222j8927
$$ 1818267 1752161 1687093 1624519 1565738 1511613 1462863 1420283 1384302 1354557 1330335 1311408
50498A311408j3245p086o90N741J2030J7898K3011K6797K8341K6949K2960J7404
$$ 1311408 1298163 1291077 1290387 1296128 1308158 1326056 1349067 1375864 1404205 1431154 1454114 1471518
50486A471518J0696K320p945j9161l0008l9816m8238n4512n7907n8729n8130n6904
$$ 1471518 1482214 1484534 1476589 1457428 1427420 1387604 1339366 1284854 1226947 1168218 1110088 1053184
50474A053184n4999n2115m8352m4166m0106l6549l3344k9825k5566k1015j7009
$$ 1053184 998185 946070 897718 853552 813446 776897 743553 713728 688162 667147 650138
50463F50138j3866j1323r211p537n950l778q63K114M414N945P062Q038R048J0337
$$ 650138 636272 624949 615738 608201 602251 598473 597610 599724 604138 610083 617145 625183 634231 644568
50449F44568J2003J3747J5037J5499J5051J3906J2549J1571J1179J1009J0552
$$ 644568 656571 670318 685355 700854 715905 729811 742360 753931 765110 776119 786671
50438G86671R742Q942Q475Q337Q425Q838R747J1037J2304J3377J4599J6354J8358
$$ 786671 796413 805355 813830 822167 830592 839430 849177 860214 872518 885895 900494 916848 935206
50425I35206J9875K0728K1618K3235K5378K7410K9167L0949L2717L3921L4143
$$ 935206 955081 975809 997427 1020662 1046040 1073450 1102617 1133566 1166283 1200204 1234347
50414A234347L3469L2179L0471K8552K6545K4242K1260J7522J3174Q072J853n325
$$ 1234347 1267816 1299995 1330466 1359018 1385563 1409805 1431065 1448587 1461761 1469833 1471686 1466361
50402A466361j2666j9658k6588l3718m0343m5301m8238m9867n0962n1534n1011
$$ 1466361 1453695 1434037 1407449 1373731 1333388 1288087 1239849 1189982 1139020 1087486 1036475
50391A036475m8963m5526m1357l7198l3312k9301k4607j9274j4021r541n855k451
$$ 1036475 987512 941986 900629 863431 830119 800818 776211 756937 742916 733375 727520 725069
50379G25069J085M784Q503J2171J5592J8185J9245J8601J6704J3889R855M266
$$ 725069 726154 730938 739441 751612 767204 785389 804634 823235 839939 853828 863683 867949
50367H67949k293q454j3300j7076k0501k3722k6252k7701k8218k8165k7632k6448
$$ 867949 865656 857202 843902 826826 806325 782603 756351 728650 700432 672267 644635 618187
50355F18187k4586k2406k0322j8294j5977j3434j1364j0209r389p945n845m033
$$ 618187 593601 571195 550873 532579 516602 503168 491804 481595 472206 464261 458416 454383
50343D54383l058k397j347k3J054J836K699L737M704N441N925O031N744N493N713
$$ 454383 451325 448928 447581 447558 448612 450448 453147 456884 461588 467029 472954 478985 484729 490222 495935
50328D95935O107N960N252M911N625O881P554P151O160N334N025N108N178M842
$$ 495935 502042 508002 513254 518165 523790 530671 538225 545376 551536 556870 561895 567003 572181 577023
50314E77023M057L334L381M386N833P099Q095R215J0807J2887J5225J7316J8163
$$ 577023 581080 584414 587795 592181 598014 605113 613208 622423 633230 646117 661342 678658 696821
50301F96821J6492J1634M264l871j0905j5585j7513j7218j5879j4454j2964j1008
$$ 696821 713313 724947 729211 725340 714435 698850 681337 664119 648240 633786 620822 609814
50289F09814q906p706p757q030p423o231n599n815o048n744n359n413n620n400
$$ 609814 600908 593202 585445 577415 569992 563761 558162 552347 546299 540555 535196 529783 524163 518763
50275E18763m716l859k820j455NJ169K052K880L549L805L856M163M608M619M189
$$ 518763 514047 510188 507368 505913 505918 507087 509139 512019 515568 519373 523229 527392 532000 536619 540808
50260E40808M083M654N236N221N046N330N584M849L362K481K751L106K419J030
$$ 540808 544891 549545 554781 560002 565048 570378 575962 580811 584173 586654 589405 592511 594930 595960
50246E95960N9r2J17K89L58J78l95j083j494j794k496l590m457m730m661m517
$$ 595960 596019 595927 596044 596333 596691 596869 596474 595391 593897 592103 589607 586017 581560 576830 572169 567652
50230E67652m193l602k943k331j543m62P14J868L178M628N794O480P142Q234R477
$$ 567652 563459 559857 556914 554583 553040 552578 553292 555160 558338 562966 568760 575240 582382 590616 600093
50215F00093J0305J0734J1217J1865J2490J3260J4583J6270J7481J7808J7839
$$ 600093 610398 621132 632349 644214 656704 669964 684547 700817 718298 736106 753945
50204G53945J8366J9477K0773K1960K2759K2564K0802J7656J3908J0138O501L301
$$ 753945 772311 791788 812561 834521 857280 879844 900646 918302 932210 942348 948849 952150
50192I52150J231O31Q52O57q24l638p310j1295j5273j9294k3548k7845l1322l3049
$$ 952150 953381 954012 954864 955521 954697 951059 943749 932454 917181 897887 874339 846494 815172 782123
50178G82123l2964l1917l0735k9487k7751k5283k2240j9026j6193j4208j3032
$$ 782123 749159 717242 686507 657020 629269 603986 581746 562720 546527 532319 519287
50167E19287j2038j0683r143q005p433p030o489n960n701n655n593n375n013m662
$$ 519287 507249 496566 487423 479418 471985 464955 458466 452506 446805 441150 435557 430182 425169 420507
50153D20507m593m888n123m792m091l875m501n214n117m363l843l862l885l559
$$ 420507 415914 411026 405903 401111 397020 393145 388644 383430 378313 373950 370107 366245 362360 358801
50139C58801l232l238l301l097k884l057l388l355k984k649k179r87P50J903J816
$$ 358801 355569 352331 349030 345933 343049 339992 336604 333249 330265 327616 325437 324450 325200 327103 328919
50124C28919J290J449K243K797K914L180L734L980L739L685M197M645M473M307
$$ 328919 330209 331658 333901 336698 339612 342792 346526 350506 354245 357930 362127 366772 371245 375552
50110C75552N160O954Q642R598J0109J0606J1110J1493J1761J1944J2150J2700
$$ 375552 380712 387666 396308 405906 416015 426621 437731 449224 460985 472929 485079 497779
50098D97779J3866J5419J6831J7938J9013K0282K1745K3428K5459K7900L0857
$$ 497779 511645 527064 543895 561833 580846 601128 622873 646301 671760 699660 730517
50087G30517L4542L8812M2806M5570M6915M7162M6274M3981M0659L7218L4061
$$ 730517 765059 803871 846677 892247 939162 986324 1032598 1076579 1117238 1154456 1188517
50076A188517L0948K8014K5953K4812K3413K0488J5786R705K524n422j3333k0355
$$ 1188517 1219465 1247479 1273432 1298244 1321657 1342145 1357931 1367636 1370160 1364738 1351405 1331050
50064A331050k6201l0926l4527l7029l8581l9108l8337l6472l4321l2330l0085
$$ 1331050 1304849 1273923 1239396 1202367 1163786 1124678 1086341 1049869 1015548 983218 953133
50053I53133k7228k4215k1573j9046j6206j3417j1321r816q369p123o763p367
$$ 953133 925905 901690 880117 861071 844865 831448 820127 810311 801942 794819 788056 780689
50041G80689q169q493q299p868p536p671q349r085r445r639r969j0041r293q090
$$ 780689 772520 764027 755728 747860 740324 732653 724304 715219 705774 696135 686166 676125 666832 658742
50027F58742p351p118o482n059l539k556j869j135o71q63j404j676j541j231p77
$$ 658742 651391 644273 637791 632732 629193 626637 624768 623633 622962 622099 620695 619019 617478 616247 615470
50012F15470J0J142K361L317L685L342K597J993J765J641J255M86n55j584k268
$$ 615470 615480 616622 618983 622300 625985 629327 631924 633917 635682 637323 638578 639064 638509 636925 634657
49997F34657k670l525n434p798r173q985q194p976q314q438q094p727p614p475
$$ 634657 631987 628462 623028 615230 606057 597072 588878 580902 572588 564150 556056 548329 540715 533240
49983E33240o958o042m908l663k323r40L21J296K106L255N138P480R545J1028
$$ 533240 526282 520240 515332 511669 509346 508406 508727 510023 512129 515384 520522 528002 537547 548575
49969E48575J2370J4171J6587J9469K2585K5450K7328K7792K7030K5382K2825
$$ 548575 560945 575116 591703 611172 633757 659207 686535 714327 741357 766739 789564
49958G89564J9314J5392J2079J0073R243Q788P842O025L583Q24k525p116j3060
$$ 789564 808878 824270 836349 846422 855665 864453 872295 878320 881903 882727 880202 873086 860026
49945H60026j9533k5472l0291l3703l5315l4917l2998l0585k8514k6953k5505
$$ 860026 840493 815021 784730 751027 715712 680795 647797 617212 588698 561745 536240
49934E36240k3636k1200j8683j6649j4986j3062j0753q780p721p181o470n595
$$ 536240 512604 491404 472721 456072 441086 428024 417271 408491 400770 393589 387119 381524
49922C81524n030m873m857n015n557o191o187n273l941k772j968j575j650k052
$$ 381524 376494 371621 366764 361749 356192 350001 343814 338541 334600 331828 329860 328285 326635 324583
49908C24583k442k684k826k663j821n00L95K40n50j101j081p50l01K26N22R2j037
$$ 324583 322141 319457 316631 313968 312147 311647 312042 312282 311732 310631 309550 308800 308499 308725 309247 309339 308302
49891C08302k094k344j890j447j465j722j765j500j191j037r43p48n06m23n52
$$ 308302 306208 303864 301974 300527 299062 297340 295575 294075 292884 291847 290904 290156 289650 289227 288675
49876B88675p13o92n04l69m57o70o52r6Q88J783K085J812J477J511J795J870J556
$$ 288675 287962 287270 286766 286397 285940 285270 284618 284522 285410 287193 289278 291090 292567 294078 295873 297743 299299
49859B99299J161J041J186J376J603K058K748L362L590L323K610J636Q43O10O91
$$ 299299 300460 301501 302687 304063 305666 307724 310472 313834 317424 320747 323357 324993 325836 326446 327137
49844C27137L27p62j825j985j402j031j383k019k276j928j026L36J756K487K025
$$ 327137 327464 326702 324877 322892 321490 320459 319076 317057 314781 312853 311827 312163 313919 316406 318431
49829C18431O67p05j347j091l68J52J65Q4N25J430K075J974J413Q72M20n5l65
$$ 318431 319098 318393 317046 315955 315587 315739 315904 315988 316513 317943 320018 321992 323405 324277 324697 324642 324277
49812C24277k60M6K4n04j203j642j711j632j653j711j429o27J58N6j086k348k715
$$ 324277 324017 324063 324087 323583 322380 320738 319027 317395 315742 314031 312602 311975 312133 312189 311103 308755 306040
49795C06040k069j036k07J25k06j109k034k383k106j634j287j059q62o43l35K2
$$ 306040 303971 302935 302728 302853 302647 301538 299504 297121 295015 293381 292094 291035 290173 289530 289195 289217
49779B89217J31k35q17j057o68J53R98J502J443R41M81M59P29R08R89J338K118
$$ 289217 289348 289113 288296 287239 286571 286724 287722 289224 290667 291608 292089 292548 293277 294185 295174 296512 298630
49762B98630L090L886M161L582K163N73l34m05k18k38m03o05r71j471j676j326
$$ 298630 301720 305606 309767 313349 315512 316085 315751 315346 315128 314890 314487 313882 312911 311440 309764 308438
49746C08438p84n89p97j039j000n99M7O04O29J14l66l28j5M4n9L24J411K527K851
$$ 308438 307654 307065 306268 305229 304229 303630 303677 304281 304910 305024 304658 304330 304315 304359 304300 304624 306035 308562 311413
49727C11413K221J029l06j425j863j343k85M22L50l0q2J29O6l02l08M70J507J961
$$ 311413 313634 314663 314357 312932 311069 309726 309441 309863 310213 310183 310101 310230 310296 309994 309686 310156 311663 313624
49709C13624J725J434J484J546J148L56l12m62p2O55J401J870K042K274K880L662
$$ 313624 315349 316783 318267 319813 320961 321317 321005 320543 320471 321126 322527 324397 326439 328713 331593 335255
49693C35255M061L842L388L172L194L138K907K648K351J818J067M56J75L3n5K61
$$ 335255 339316 343158 346546 349718 352912 356050 358957 361605 363956 365774 366841 367297 367472 367505 367450 367711
49677C67711J181K165K444K064J781J919J931J283J86q22j536j905j686q51PK51
$$ 367711 368892 371057 373501 375565 377346 379265 381196 382479 382665 381843 380307 378402 376716 375865 375872 376123
49661C76123Q3K89J183K304L186L902M727N686O729Q020R708J1438J2213J0895
$$ 376123 376206 376495 377678 379982 383168 387070 391797 397483 404212 412232 421940 433378 445591 456486
49647D56486P040J499l928p666r313r329q167o145l965k603k379k559k251j415
$$ 456486 463526 465025 461097 453431 444118 434789 426622 420477 416512 413909 411530 408971 406720 405305
49633D05305o90n00o56p41m94P3P21J065R12N10L34O04J175J868K667L487M031
$$ 405305 404615 404115 403459 402718 402224 402297 403018 404083 404995 405505 405839 406443 407618 409486 412153 415640 419671
49616D19671M090L845L620L400K900K197J890K373L193L515L228L074L610M425
$$ 419671 423761 427606 431226 434626 437526 439723 441613 443986 447179 450694 453922 456996 460606 465031
49602D65031M688M272L895M211N017N511N229M593M416M944N545N579N233N144
$$ 465031 469719 473991 477886 482097 487114 492625 497854 502447 506863 511807 517352 522931 528164 533308
49588E33308N313N045M153L484L810M701N160M966M700M649M529M305M474N201
$$ 533308 538621 543666 547819 551303 555113 559814 564974 569940 574640 579289 583818 588123 592597 597798
49574E97798N832N731N207N144N877O818P127O525N441M491L939L605L350L418
$$ 597798 603630 609361 614568 619712 625589 632407 639534 646059 651500 655991 659930 663535 666885 670303
49560F70303M073N027N527N102L973K684J621J013J020J638K593L454L833L524
$$ 670303 674376 679403 684930 690032 694005 696689 698310 699323 700343 701981 704574 708028 711861 715385
49546G15385K695J952J865K333K698K602K432K702L217L282K647J873J738K420
$$ 715385 718080 720032 721897 724230 726928 729530 731962 734664 737881 741163 743810 745683 747421 749841
49532G49841L402M089M379M631N193O046O904P415P322O676N941N641N661N246
$$ 749841 753243 757332 761711 766342 771535 777581 784485 791900 799222 805898 811839 817480 823141 828387
49518H28387L966K389J379J013O75K0p77j612k558l384l652l515l743m598n377
$$ 828387 832353 834742 836121 837134 837809 837829 837052 835440 832882 829498 825846 822331 818588 813990 808613
49503H08613n488n360n723o479o964o985o882o751o315n634n243n503o138o593
$$ 808613 803125 797765 792042 785563 778599 771614 764732 757981 751666 746032 740789 735286 729148 722555
$$ [...]
##END NTUPLES=NMR SPECTRUM
##END=
