##TITLE=NES1000_872015067_9224993_pcruELpAMf
##JCAMPDX= 6.0         $$ Bruker NMR JCAMP-DX V2.0
##DATA TYPE= NMR SPECTRUM
##DATA CLASS= NTUPLES
##ORIGIN= BRUKER
##OWNER= Administrator
$$ 1.72 TOPSPIN		Version 2.1
$$ 2015-08-24 19:14:40.889 -0700  Administrator@X
$$ Compression mode = diff/dup
##.OBSERVE FREQUENCY= 400.02188249412
##.OBSERVE NUCLEUS= ^1H
##.ACQUISITION MODE= SIMULTANEOUS (DQD)
##.ACQUISITION SCHEME= undefined
##.AVERAGES= 8
##.DIGITISER RES= 22
##SPECTROMETER/DATA SYSTEM= spect
##.PULSE SEQUENCE= zg30
##.SOLVENT NAME= COFFEE_meoh
##.SHIFT REFERENCE= INTERNAL, COFFEE_meoh, 1, 14.98509
##AUDIT TRAIL= $$ (NUMBER, WHEN, WHO, WHERE, PROCESS, VERSION, WHAT)
$$ ##TITLE= Audit trail, TOPSPIN		Version 2.1
$$ ##JCAMPDX= 5.01
$$ ##ORIGIN= Bruker BioSpin GmbH
$$ ##OWNER= Administrator
$$ $$ E:\/data/COFFEE/nmr/NES1000_872015067_9224993_pcruELpAMf/20/pdata/1/auditp.txt
$$ ##AUDIT TRAIL=  $$ (NUMBER, WHEN, WHO, WHERE, PROCESS, VERSION, WHAT)
(   1,<2015-08-24 19:14:33.545 -0700>,<Administrator>,<X>,<go>,<TOPSPIN 2.1>,
      <created by zg
	started at 2015-08-24 19:13:27.576 -0700,
	POWCHK enabled, PULCHK disabled,
       configuration hash MD5:
       21 0F 79 D6 B3 7B B4 F6 88 20 88 DB 03 48 BD 9F
       data hash MD5: 64K
       23 65 29 E5 8B 8A 55 B7 CB 74 89 B0 BB 16 64 5B>)
(   2,<2015-08-24 19:14:36.748 -0700>,<Administrator>,<X>,<proc1d>,<TOPSPIN 2.1>,
      <Start of raw data processing
       efp LB = 0 FT_mod = 6 PKNL = 1 PHC0 = 0 PHC1 = 0 SI = 32K 
       data hash MD5: 32K
       A4 C3 61 92 8A 65 20 E8 D6 70 59 BD 90 37 16 9E>)
(   3,<2015-08-24 19:14:37.030 -0700>,<Administrator>,<X>,<proc1d>,<TOPSPIN 2.1>,
      <pk PHC0 = 92.55981 PHC1 = 0 
       data hash MD5: 32K
       28 DA E1 CD 73 53 F0 B9 D0 C1 36 4A 1E 61 A2 6B>)
(   4,<2015-08-24 19:14:37.139 -0700>,<Administrator>,<X>,<proc1d>,<TOPSPIN 2.1>,
      <abs ABSG = 1 
       data hash MD5: 32K
       7E 61 13 84 7F 39 A4 26 7F EF 69 50 D0 E7 E5 84>)
(   5,<2015-08-24 19:14:37.217 -0700>,<Administrator>,<X>,<proc1d>,<TOPSPIN 2.1>,
      <abs ABSG = 2 
       data hash MD5: 32K
       94 E2 02 77 C6 0C C6 15 5D 8F 16 08 CA 86 6D 51>)
(   6,<2015-08-24 19:14:37.264 -0700>,<Administrator>,<X>,<proc1d>,<TOPSPIN 2.1>,
      <abs ABSG = 3 
       data hash MD5: 32K
       67 E4 EF 83 BD 44 91 6E C8 E6 51 41 1A 14 54 6F>)
(   7,<2015-08-24 19:14:37.326 -0700>,<Administrator>,<X>,<proc1d>,<TOPSPIN 2.1>,
      <abs ABSG = 4 
       data hash MD5: 32K
       8E 72 2A 37 26 68 83 92 2D 82 2C 2A B6 7B C1 79>)
(   8,<2015-08-24 19:14:37.389 -0700>,<Administrator>,<X>,<proc1d>,<TOPSPIN 2.1>,
      <abs ABSG = 5 
       data hash MD5: 32K
       EF E1 87 EA 23 FB FD 30 A7 0B 8F 8B B1 05 7C C3>)
$$ ##END=
$$ 
$$ $$ hash MD5
$$ $$ 47 6C 73 BC 67 15 41 12 BD 71 72 36 41 C2 35 DE
##$RELAX= 
##$RELAX= 
##$RELAX= 
##$RELAX= 
##$RELAX= 
##$RELAX= 
##$RELAX= 
$$ Bruker specific parameters
$$ --------------------------
##$DU= <E:\>
##$EXPNO= 20
##$NAME= <NES1000_872015067_9224993_pcruELpAMf>
$$ [...]
150 150 150 150 150 150 150 150
##$TP07= 0
##$TPNAME0= <>
##$TPNAME1= <>
##$TPNAME2= <>
##$TPNAME3= <>
##$TPNAME4= <>
##$TPNAME5= <>
##$TPNAME6= <>
##$TPNAME7= <>
##$TPOAL= (0..7)
0.5 0.5 0.5 0.5 0.5 0.5 0.5 0.5
##$TPOFFS= (0..7)
0 0 0 0 0 0 0 0
##$TUNHIN= 0
##$TUNHOUT= 0
##$TUNXOUT= 0
##$USERA1= <user>
##$USERA2= <user>
##$USERA3= <user>
##$USERA4= <user>
##$USERA5= <user>
##$V9= 5
##$VALIST= <valist>
##$VCLIST= <CCCCCCCCCCCCCCC>
##$VD= 0
##$VDLIST= <DDDDDDDDDDDDDDD>
##$VPLIST= <PPPPPPPPPPPPPPP>
##$VTLIST= <TTTTTTTTTTTTTTT>
##$WBST= 2048
##$WBSW= 25
##$XGAIN= (0..3)
0 0 0 0
##$XL= 0
##$YL= 0
##$YMAX_a= 584792
##$YMIN_a= -487603
##$ZGOPTNS= <>
##$ZL1= 120
##$ZL2= 120
##$ZL3= 120
##$ZL4= 120
##$ABSF1= 14.98509
##$ABSF2= -5.573092
##$ABSG= 5
##$ABSL= 3
##$ALPHA= 0
##$AQORDER= 0
##$ASSFAC= 0
##$ASSFACI= 0
##$ASSFACX= 0
##$ASSWID= 0
##$AUNMP= <proc_prof1d_extract_pilot.lims>
##$AXLEFT= 0
##$AXNAME= <>
##$AXNUC= <1H>
##$AXRIGHT= 0
##$AXTYPE= 0
##$AXUNIT= <>
##$AZFE= 0.1
##$AZFW= 0.1
##$BCFW= 0
##$BC_mod= 0
##$BYTORDP= 0
##$COROFFS= 0
##$CY= 15
##$DATMOD= 1
##$DC= 0
##$DFILT= <>
##$DTYPP= 0
##$F1P= 0
##$F2P= 0
##$FCOR= 0.5
##$FTSIZE= 32768
##$FT_mod= 6
##$GAMMA= 0
##$GB= 0
##$INTBC= 1
##$INTSCL= 1
##$ISEN= 128
##$LB= 0
##$LEV0= 0
##$LPBIN= 0
##$MAXI= 10000
##$MC2= 0
##$MEAN= 0
##$ME_mod= 0
##$MI= 0
##$NCOEF= 0
##$NC_proc= -8
##$NLEV= 6
##$NOISF1= 0
##$NOISF2= 0
##$NSP= 0
##$NTH_PI= 0
##$NZP= 0
##$OFFSET= 14.98509
##$PC= 1
##$PHC0= 92.55981
##$PHC1= 0
##$PH_mod= 1
##$PKNL= yes
##$PPARMOD= 0
##$PPDIAG= 0
##$PPIPTYP= 0
##$PPMPNUM= 2147483647
##$PPRESOL= 1
##$PSCAL= 4
##$PSIGN= 0
##$PYNMP= <proc.py>
##$REVERSE= no
##$SF= 400.02
##$SI= 32768
##$SIGF1= 0
##$SIGF2= 0
##$SINO= 400
##$SIOLD= 32768
##$SPECTYP= <>
##$SREGLST= <1H.CDCl3>
##$SSB= 0
##$STSI= 32768
##$STSR= 0
##$SW_p= 8223.68421052631
##$SYMM= 0
##$S_DEV= 0
##$TDeff= 65536
##$TDoff= 0
##$TI= <>
##$TILT= no
##$TM1= 0
##$TM2= 0
##$TOPLEV= 0
##$USERP1= <user>
##$USERP2= <user>
##$USERP3= <user>
##$USERP4= <user>
##$USERP5= <user>
##$WDW= 1
##$XDIM= 32768
##$YMAX_p= 428085571
##$YMIN_p= -833095
##$CURPLOT= <Network HP LaserJet P1505>
##$CURPRIN= <$Network HP LaserJet P1505>
##$DFORMAT= <normdp>
##$LAYOUT= <+/1D_H.xwp>
##$LFORMAT= <normlp>
##$PFORMAT= <normpl>
##$SURQMSG= 1
$$ End of Bruker specific parameters
$$ ---------------------------------
##NTUPLES= NMR SPECTRUM
##VAR_NAME=  FREQUENCY,     SPECTRUM/REAL,   SPECTRUM/IMAG
##SYMBOL=    X,             R,               I
##VAR_TYPE=  INDEPENDENT,   DEPENDENT,       DEPENDENT
##VAR_FORM=  AFFN,          ASDF,            ASDF
##VAR_DIM=   32768,         32768,           32768
##UNITS=     HZ,            ARBITRARY UNITS, ARBITRARY UNITS
##FACTOR=    0.250966925370066, 1,           1
##FIRST=     8223.43324360094, 17499,        -62376
##LAST=      0,             60770,           -58307
##MIN=       0,             -833095,         0
##MAX=       8223.43324360094, 428085571,    0
$$ Real data points
##PAGE= N=1
##DATA TABLE= (X++(R..R)), XYDATA
$$ [...]
$$ plain form
19511 -191200 -103954 32937 42757 -106523 -230408 214881 -386064 16701 4278 -172817 108202
19499 -376631 -209993 -509610 -177826 -125043 20104 120613 -165550 201694 273913 22146
19488 -62318 -63792 -369154 -101097 -121487 -115997 26685 250205 -4445 -114571 -78611 -301702
19477 -301702 -109404 -264598 -338268 -171809 -300115 -275946 126 -69402 90914 -264427 -171027
19466 -171027 -72429 -169139 79107 75113 -118587 -137743 -136767 -7573 -92040 48851 -200600 141854
19453 -275686 -204114 11425 36208 -47980 -222606 -45315 -59719 -57452 -267959 146797 -155672
19441 111770 -318454 -292035 -103098 -320556 233961 90781 161341 -13132 -169602 253665
19430 4376 -251813 -43425 -278170 115485 -72458 -190709 -279369 -36772 -375233 -219407 188625
$$ packed form
19511a91200Q7246C2937R820a06523j23885B14881c86064A6701D278a72817A08202
19499c76631J66638k99617a77826N2783B0104J00509a65550B01694P2219B2146
19488f2318j474l05362a01097k0390N490B6685K23520d445j10126L5960k23091
19477c01702a09404j55194p3670J66459j28306K4169A26f9402I0914b64427R3400
19466a71027g2429r6710G9107l994a18587j9156R76g573q4467D8851b00600A41854
19453b75686P1572A1425K4783d7980j74626d5315j4404K267k10507A46797a55672
19441A11770c18454K6419a03098k17458B33961I0781P0560a3132j56470B53665
19430D376b51813d3425k34745A15485g2458j18251q8660c6772l38461J55826A88625
$$ plain form
19418 -338577 69397 60712 -180040 156519 -70300 87893 -133828 141417 -211297 -73770 -114585
19407 -114585 -227001 68316 57977 -135 -336832 54678 -55519 -34348 -38666 195024 26180
19395 -139508 -100652 -196536 -71928 104358 -35624 -21822 -340791 75417 22877 23474 84936
19384 84936 -176502 223084 15793 -47128 72952 -109710 -22858 -33076 -229314 -20751 233914
19372 -164707 -181405 7795 74496 -253163 -148411 179676 -82224 -2060 155191 -462295 71786
19360 -339650 53101 -82903 17954 -34446 -167194 -70079 30362 -318284 -261523 141156 -72998
19348 367322 -46485 -38773 -122843 180432 -314108 -3602 132787 -57252 2015 318067 -236933
19336 97210 -226884 -11975 -160718 128011 69976 -233553 -116314 -380071 -375969 -152270
$$ packed form
19418c38577F9397q685a80040A56519g0300H7893a33828A41417b11297g3770m0815
19407a14585j12416F8316j0339a35l36697E4678e5519K1171m318A95024B6180
19395a39508L8856r5884g1928A04358c5624J3802l18969G5417B2877N97O1462
19384H4936a76502B23084A5793d7128G2952a09710b2858j0218j96238b0751B33914
19372a64707j6698G795O6701b53163J04752A79676h2224b060A55191d62295G1786
19360c39650E3101h2903A7954c4446j32748g0079C0362c18284N6761A41156g2998
19348C67322d6485P712q4070A80432c14108c602A32787e7252B015L16052b36933
19336I7210b26884a1975j48743A28011n8035b33553a16314k63757M102a52270
$$ plain form
19325 100641 -60097 -111528 -221371 -182034 -161729 -196047 121251 -284463 -114326 152964
19314 51590 168235 -45287 130305 -732 -179764 3175 -448605 76828 -258174 24501 -2666
19302 -369211 -108839 84413 -212044 -70805 146565 -70693 84279 -165691 43393 -184591
19291 332440 -184296 -238123 -53450 173325 162151 -24686 -199336 54064 -277825 70188 -9884
19279 -120738 139030 -91709 -215522 8059 269167 -140447 -138588 -143852 127174 -363872 177193
19267 146605 -88459 -113048 -198509 165278 -214000 64890 -319777 -207865 -158808 -86843 -165968
19256 -165968 -200883 -185305 -155614 -300273 71413 117790 -11434 -55617 -178244 -275338 -11684
19244 4417 -3935 -1946 -335394 146723 -41683 18240 -120776 -126434 -151784 -303248 -33165 236209
$$ packed form
19325A00641f0097n1431j09843L9337K0305l4318A21251b84463a14326A52964
19314E1590J16645d5287A30305g32j79032C175d48605G6828b58174B4501b666
19302c69211a08839H4413b12044g0805A46565g0693H4279a65691D3393a84591
19291C32440a84296n3827e3450A73325j1174b4686j74650E4064b77825G0188i884
19279a20738A39030i1709j23813H059K61108a40447J859n264A27174c63872A77193
19267A46605h8459k4589q5461A65278b14000F4890c19777J11912M9057P1965p9125
19256a65968l4915J5578K9691j44659G1413M6377a1434m4183j22627r7094a1684
19244D417c935a946l33448A46723d1683A8240a20776n658k5350j51464c3165B36209
$$ plain form
19231 73086 85263 -46241 -230437 -181249 -104457 -537 -124460 -18225 19526 -179939 -101064
19220 -101064 124393 -11731 -264377 194128 -80937 1967 131674 -297398 -161876 -129244
19210 -129244 -58887 -288386 -13724 -11655 177797 175218 -4390 -208179 194817 44725 275353
19199 275353 -158368 -67249 46146 -242315 -110924 -149423 -69297 100150 23065 -139249
19188 2697 246524 -251899 -187828 -117176 -85680 198246 186156 128524 -76979 -48593 170335
19176 -299765 -104466 -13239 36400 -425044 256812 53711 -73228 349371 -77659 326198
19165 -67813 -111516 26557 -140277 -11503 -20151 32047 -44604 5889 -17843 -354544 -49854 19825
19152 11905 -281181 47804 7671 -122735 -84597 5203 143032 47883 -150136 -31686 -89862
$$ packed form
19231G3086J2177d6241j84196M9188P6792e37j23923a8225A9526a79939P8875
19220a01064A24393a1731k52646A94128h0937A967J29707b97398J35522L2632
19210a29244e8887k29499a3724K069A77797k579d390k03789A94817D4725K30628
19199B75353a58368f7249D6146b42315a10924l8499f9297A00150B3065a39249
19188B697K43827b51899O4071P0652L1496A98246j2090n7632g6979K8386A70335
19176b99765a04466a3239C6400d25044B56812E3711g3228C49371g7659C26198
19165f7813m3703B6557a40277a1503q648C2047d4604E889a7843l36701d9854A9825
19152A1905b81181D7804G671a22735L8138E203J37829D7883a50136c1686n8176
$$ plain form
19141 -89862 200328 -359383 80295 -181673 67882 -285033 -138090 -282984 153676 -245127
19130 -42846 -101942 -56087 62425 -304048 -188341 20677 24717 -28817 144952 -186267 -179409
19119 -179409 -45302 -182518 -56127 -14842 730 -91761 -171956 288856 59496 158243 -81262
19107 -152238 -458175 -46559 13178 -279113 -134172 139416 43388 -242789 -119482 281501
19096 -55356 75146 -33207 -403202 -186467 -164067 155010 -153795 3660 -156311 3000 38561
19085 38561 -189879 -9788 104420 -43105 220976 -247111 -292499 181194 -19620 223470 211751
19074 211751 -26313 -56795 -165295 -50864 66669 -43445 -78423 -407601 -99339 35136 -90848
19062 60326 -221164 97247 144931 -110756 -265096 34452 65753 220432 -11366 -171182 234721
$$ packed form
19141h9862B00328c59383H0295a81673F7882b85033a38090j44894A53676b45127
19130d2846n9096M5855F2425c04048J15707B0677M040b8817A44952a86267O858
19119a79409d5302j37216e6127a4842G30i1761q0195B88856E9496R8747h1262
19107a52238l05937d6559A3178b79113a34172A39416D3388b42789a19482B81501
19096e5356G5146c3207l69995a86467K2400A55010a53795C660a56311C000L5561
19085C8561a89879i788A04420d3105B20976b47111m5388A81194a9620B23470j1719
19074B11751b6313l0482j08500e0864F6669d3445l4978l29178i9339C5136i0848
19062F0326b21164I7247M7684a10756j54340C4452L1301J54679a1366j59816B34721
$$ plain form
19050 -58425 64756 -221344 -400001 56563 -141043 17648 -3564 -76178 -114965 -228898 -44377
19038 -85427 -206286 144358 19553 -94989 -178909 143584 11849 -216311 236419 285807 -16759
19026 -46393 -117235 -53491 -199508 -86122 -132675 87552 34494 165427 117734 -271731 -128707
19014 56020 313507 24648 -330003 173874 -78554 211872 264467 120094 -13073 12520 -28488
19002 -398928 24611 50602 120306 -142657 -197556 62624 -12690 -39237 102943 42634 -200419
18990 -151470 -21124 -128202 -85319 -61738 12898 98654 165347 144712 -78975 -3398 -162300
18979 -162300 17726 -112817 106056 57845 -32466 134020 77992 -103445 -42845 110106
18968 -44410 -164539 102231 -99377 235764 -198926 3956 53876 -99226 -60808 -63256 -324499
$$ packed form
19050e8425F4756b21344j78657E6563a41043A7648c564p2614l8787j13933d4377
19038h5427j20859A44358A9553i4989q3920A43584A1849b16311B36419M9388a6759
19026d6393p0842e3491j46017h6122m6553H7552C4494J30933m7693b71731a28707
19014E6020K57487B4648c30003A73874g8554B11872N2595A20094a3073A2520b8488
19002c98928B4611K5991O9704a42657n4899F2624a2690k6547A02943D2634b00419
18990a51470b1124j07078M2883K3581A2898Q5756O6693k0635g8975c398j58902
18979a62300A7726a12817A06056m8211c2466A34020n6028a03445d2845A10106
18968d4410j20129A02231i9377B35764a98926C956M9920i9226L8418k448k61243
$$ plain form
18957 -324499 -227 -129836 -51648 124443 168123 -295001 -180175 -40294 152319 -52767 -235178
18946 -235178 -102140 -82440 -237429 -151169 272666 -76173 129683 105074 39756 -111888
18935 -340653 90095 -326750 -1742 -58846 -174486 114185 81323 41692 -248689 18918 128128
18924 128128 37914 -155095 142239 -130698 292626 -153032 -102623 87395 23213 -170313
18913 38129 -158953 61465 -293658 42696 244082 391462 200918 -242794 324397 362314
18903 362314 -145332 -174968 -135507 -272938 -213574 137324 100120 -411378 131701 -34005
18892 162678 -56949 -94273 42080 -62286 207603 -82610 -45423 67827 -44755 -1930 -34033
18881 -34033 31245 -61125 -177315 -354452 140064 -332212 92934 66214 -254762 88096 26409
$$ packed form
18957c24499b27j29609e1648A24443M3680b95001J14826d0294A52319e2767j82411
18946b35178a02140J9700j54989Q6260B72666g6173A29683k4609C9756a11888
18935c40653I0095c26750a742n7104j15640A14185l2862l9631b48689A8918J09210
18924A28128C7914a55095A42239a30698B92626a53032N0409H7395B3213a70313
18913C8129a58953F1465b93658D2696K01386J47380j90544b42794C24397L7917
18903C62314a45332k9636L9461j37431N9364A37324l7204d11378A31701c4005
18892A62678e6949l7324D2080f2286B07603h2610L7187F7827d4755a930l2103
18881c4033C1245f1125j16190j77137A40064c32212I2934k6720b54762H8096B6409
$$ plain form
18869 128130 -160624 -80458 19354 86736 -85080 -177286 67423 74182 -218514 -234704 258237
18857 138380 79604 -348730 175190 154562 -96933 -204275 -28630 -121141 91677 -86796 37049
18845 -104309 -151454 41847 -33574 58485 -138504 -226062 23762 -204946 -70499 -140161 -134561
18834 -134561 -4265 60832 -282645 -25065 -70049 -76581 -12633 -189040 -15273 -10796 -398451
18823 -398451 -221821 155812 76367 -14519 40240 -227412 -102032 34633 -44239 -106369 188105
18811 -52256 -231476 -108101 -264294 249732 -374740 228561 41884 -296605 -82435 -151055
18801 -151055 323295 -168718 -151389 -141184 52964 -357281 97657 135006 -925 10129 -157418
18789 -360407 155342 -196531 115084 -217416 6185 60970 14121 28905 -250049 74768 -44358
$$ packed form
18869A28130a60624Q0166A9354O7382h5080r2206F7423O759b18514j6190B58237
18857A38380n8776c48730A75190k0628i6933j07342b8630r2511I1677h6796C7049
18845a04309m7145D1847c3574E8485a38504q7558B3762b04946g0499o9662N600
18834a34561d265F0832b82645b5065m4984o532a2633j76407a5273M477l87655
18823c98451J76630A55812G6367a4519D0240b27412a02032C4633d4239o2130A88105
18811e2256j79220a08101j56193B49732c74740B28561D1884b96605h2435o8620
18801a51055C23295a68718J7329J0205E2964c57281I7657L7349i25A0129a57418
18789c60407A55342a96531A15084b17416F185N4785A4121J4784b50049G4768d4358
$$ plain form
18777 -148471 71594 -78652 187202 4368 -69702 -127046 -32050 111212 195557 -65996 88341
18765 -117543 -119813 103356 -292825 -76393 16586 143752 -49859 -62246 61857 71818 69192
18754 69192 -91710 -362829 -289989 112853 181562 -182144 108458 -302614 123142 17662
18743 -317549 44956 -16513 -218723 133503 -207216 -257430 -194065 134267 -73298 225823
18732 -354044 -172999 171317 -53030 25381 -222948 16651 145767 -138031 161190 60766
18721 -224651 55986 263841 -84939 -167169 -20933 -62781 253229 -113108 141372 -86758 -138599
18710 -138599 -121640 -191951 125924 -158725 16775 -6342 -112685 248154 58582 -60999 63908
18698 -247361 12810 21023 58875 46438 -136046 -238808 -42860 7670 -284458 170830 298333
$$ packed form
18777a48471G1594g8652A87202D368f9702n7344c2050A11212Q4345f5996H8341
18765a17543k270A03356b92825g6393A6586J27166d9859j2387F1857R961k626
18754F9192i1710k71119P2840A12853O8709a82144A08458c02614A23142A7662
18743c17549D4956a6513k02210A33503b07216n0214O3365A34267g3298B25823
18732c54044a72999A71317e3030B5381b22948A6651J29116a38031A61190F0766
18721b24651E5986K07855h4939q2230b0933m1848B53229a13108A41372h6758n1841
18710a38599J6959p0311A25924a58725A6775f342j06343B48154E8582f0999F3908
18698b47361A2810Q213L7852j2437a36046j02762d2860G670b84458A70830J27503
$$ plain form
18687 298333 -226024 -118281 -414982 -439796 20492 -97509 -294399 -249114 -20824 -20185 -111027
18676 -111027 -22178 -278227 -57097 110081 -129603 -135633 363679 -258641 -1056 -200578 -80084
18664 28688 -271962 -22605 30529 362257 -145752 -74147 -199108 -12192 104407 108278 -4783
18652 -318629 -189198 145991 126431 -107449 -68015 -108844 69560 -256373 -66597 138619
18641 100760 -261328 -66352 -212273 -279744 -278161 -109202 244534 -140426 -92786 -273448
18631 -273448 -12679 53617 -93208 105012 -137203 -131158 -291248 -233604 -220531 -32457 -209276
18620 -209276 -334177 144143 97586 -136185 -42724 203775 -12076 -200442 150160 41257
18609 -51878 -344629 -101180 258987 277005 363580 91329 -287489 -3717 10295 122619 198110
$$ packed form
18687B98333b26024J07743k96701k4814B0492i7509j96890M5285b0824O39r0842
18676a11027b2178k56049e7097A10081a29603o030C63679b58641a056j99522h0084
18664B8688b71962b2605C0529L31728a45752P1605j24961a2192A04407L871d783
18652c18629J29431A45991j9560a07449L9434m0829F9560b56373f6597A38619
18641A00760b61328f6352j45921o7471J583a09202B44534a40426M7640j80662
18631b73448a2679E3617i3208A05012a37203O045j60090N7644J3073c2457j76819
18620b09276j24901A44143m6557a36185d2724B03775a2076j88366A50160D1257
18609e1878k92751a01180B58987J8018Q6575I1329b87489c717A0295J12324P5491
$$ plain form
18598 198110 73613 -309230 66296 71873 47978 -214729 -128829 -51666 433477 -184088 23341
18586 -225098 -132857 45526 -325527 103049 167002 -197298 15605 -78584 -301996 -410694
18576 -410694 32941 -79919 -162961 -243588 -101289 -42784 54895 -106422 226142 -26193 -288032
18565 -288032 132449 205270 115241 131136 -6402 -144406 129373 40479 -244001 -119143 -328510
18554 -328510 -118922 -25877 -88055 -194788 9887 -312574 -156211 -43390 210195 -307041
18543 -176485 -287902 133393 -360476 -176701 201033 114381 192978 39482 -178109 -79223
18532 -212584 -155268 -204103 -236580 40485 101031 -210232 126051 167312 86023 -222972 158507
18520 -142777 -121868 102805 164784 394948 -210336 -249563 -2276 -270683 113081 2437 265990
$$ packed form
18598A98110G3613c09230F6296N577k3895b14729Q5900e1666D33477a84088B3341
18586b25098R2241D5526c25527A03049O3953a97298A5605g8584k23412j08698
18576d10694C2941g9919q3042q0627a01289d2784E4895a06422B26142b6193k61839
18565b88032A32449P2821r0029J5895f402j38004A29373D0479b44001a19143k09367
18554c28510a18922b5877o2178j06733I887c12574a56211d3390B10195c07041
18543a76485j11417A33393c60476a76701B01033q6652P8597C9482a78109g9223
18532b12584N7316m8835l2477D0485O0546b10232A26051M1261q1289b22972A58507
18520a42777K0909A02805O1979K30164b10336l9227b276k68407A13081B437K63553
$$ plain form
18509 265990 -94759 -51925 -176439 241395 35613 -50948 21282 -289008 255392 -65627 13961
18497 -150364 -464062 102771 172033 -184528 -111206 -12905 -159460 47781 -66843 -217598
18487 -217598 -18243 -84888 172721 156431 -629 -206522 2195 -44069 -221456 -53679 141206
18475 13460 36913 88313 -184647 -433221 -201307 24670 -110111 -85754 -15425 -231654 -76800
18463 104584 -411498 171027 -249713 -62315 75321 59663 -108528 165174 197816 -31836
18452 27643 63826 -54806 -382667 276954 -54950 39740 33718 -149082 -213015 -310591 -36007
18440 31284 -142898 -21915 -193931 -123443 -173232 229355 -11465 -124985 -78877 -137979 -138533
18429 -138533 114208 -71263 -110646 213759 -154431 -75340 49377 -230527 -297401 4556 -21996
$$ packed form
18509B65990i4759M2834j24514B41395C5613e0948B1282b89008B55392f5627A3961
18497a50364l13698A02771O9262a84528P3322a2905j46555D7781f6843j50755
18487b17598a8243o6645A72721j6290f29k05893B195d4069j77387e3679A41206
18475A3460K3453N1400a84647k48574b01307B4670a10111K4357a5425k16229g6800
18463A04584d11498A71027b49713f2315G5321j5658a08528A65174L2642c1836
18452B7643L6183e4806l27861B76954e4950C9740o022a49082o3933r7576c6007
18440C1284a42898b1915j72016P0488m9789B29355a1465j13520M6108n9102n54
18429a38533A14208g1263l9383B13759a54431g5340D9377b30527o6874D556b1996
$$ plain form
18417 -63799 -133759 -81256 130872 103354 -218308 -314158 50299 82902 -19318 -111603 140224
18405 78580 -131277 -31469 33233 97355 -132600 241011 -39970 -11660 133095 228292 -42145
18393 89169 83456 -116855 -18999 -69877 -119252 119490 347748 -175963 195635 -57752 316820
18381 -12751 -140615 194158 -115820 37643 -7613 -290551 -160700 -142520 29408 -168970 209565
18369 -6260 -124895 124686 -38097 91581 -164497 -103196 -143552 -45965 -53340 214769 101899
18357 300591 101327 136880 -55534 71899 44046 91973 -107864 175496 -91912 17586 -9748
18345 -234593 -88052 -91002 -146898 45423 23282 -361674 -6354 -432177 -78560 172503 -308715
18333 55774 -147815 -346400 -78635 -446568 281795 92086 235016 83025 -175912 25294
$$ packed form
18417f3799o9960N2503A30872k7518b18308r5850E0299L2603a9318r2285A40224
18405G8580a31277c1469C3233O4122a32600B41011c9970a1660A33095R5197d2145
18393H9169n713a16855a8999n0878m9375A19490K28258a75963A95635e7752C16820
18381a2751j27864A94158a15820C7643g613k82938J29851J8180B9408a68970B09565
18369f260j18635A24686c8097I1581a64497O1301m0356d5965p375B14769A01899
18357C00591A01327L5553e5534G1899k7853M7927a07864A75496i1912A7586i748
18345b34593h8052k950n5896D5423k2141c61674f354m25823g8560A72503c08715
18333E5774a47815j98585g8635l67933B81795I2086J42930H3025a75912B5294
$$ plain form
18322 -211579 -225296 -167921 126545 -199412 -64473 48051 -153249 -120215 -109173 -62130 152347
18310 -90788 -22419 -234767 -64174 -6951 -258374 -343629 -109437 -258859 211182 -184789 -141927
18299 -141927 -34196 267868 -48574 52031 -43725 -128530 54187 165771 -208772 111695 47075
18287 -2175 24706 102373 194921 -4627 -55602 -23234 -18099 29662 225246 -191051 42655 -216133
18274 72495 -1418 -239704 -266387 -32920 34210 -40543 -188834 -132870 57021 -290936 -278008
18263 -278008 210335 224840 69454 -209769 302416 135696 -442032 -183188 -130212 -102769
18253 -102769 -485745 -33494 78088 7227 -333506 347424 -84505 51544 505108 -41488 58784
18241 -186631 -216986 134343 80025 -219257 -53365 -122290 30149 -9952 86004 -95167 -104708
$$ packed form
18322b11579j3717N7375A26545a99412f4473D8051a53249L3034J1042M7043A52347
18310i0788b2419k12348f4174f951k51423q5255a09437j49422B11182a84789M2862
18299a41927c4196B67868d8574E2031d3725q4805E4187J11584b08772A11695D7075
18287b175B4706P7667R2548d627n0975b3234N135B9662J95584a91051D2655b16133
18274G2495a418k38286k6683c2920C4210d0543j48291N5964E7021b90936J2928
18263b78008B10335J4505F9454b09769C02416A35696d42032a83188N2976K7443
18253a02769l82976c3494G8088G227c33506C47424h4505E1544M53564d1488E8784
18241a86631l0355A34343n4318b19257e3365o8925C0149i952H6004i5167r541
$$ plain form
18230 -104708 -287657 283223 175392 -129636 -78012 -22967 59549 65432 -226344 -200114 -51833
18218 -102974 -213343 80617 8355 81756 224666 -300208 87540 -24742 -26773 -60886 -387389
18207 -387389 71952 105163 -40131 -147767 -82686 -123734 -50125 39402 9975 -251759 114158
18195 -56795 -6764 -91546 284599 -50548 395308 -39887 224484 10912 120316 94350 -93676
18183 -84066 134448 103521 -16572 -311778 -118278 30946 -26221 155836 109273 67243 140031
18172 140031 -6158 -30349 -2702 -180500 -17276 359002 216111 287078 -292429 -38606 67905
18160 -137978 -16733 -54824 -102901 -133176 -142746 -213769 -14449 104163 -141761 -269756 84971
18148 -87988 240853 -136638 7984 180627 315833 24305 -239035 -3964 86007 76518 -87594
$$ packed form
18230a04708j82949B83223j07831a29636N1624b2967E9549N883b26344K6230e1833
18218a02974j10369H0617H355P3401J42910c00208H7540b4742k031l4113l26503
18207c87389G1952L3211d0131j07636O5081m1048e0125C9402I975b51759A14158
18195e6795f764q4782B84599e0548C95308c9887B24484A0912J09404k5966i3676
18183h4066A34448l0927a6572k95206a18278C0946b6221A55836m6563m2030P2788
18172A40031f158k4191b702j77798a7276C59002j42891P0967b92429c8606F7905
18160a37978a6733l8091m8077l0275r570p1023a4449A04163a41761j27995H4971
18148h7988B40853a36638G984J72643J35206B4305b39035c964H6007r489h7594
$$ plain form
18136 162303 147120 239830 -98917 -65971 -41057 -20561 -279457 -33631 107406 133331 -210248
18124 -98545 -5497 225127 -210357 274721 229099 150586 74960 -225147 -120456 38893 47541
18113 47541 207010 50559 -98550 -321589 -424367 6088 -260345 146000 49696 98527 99537
18102 99537 -77005 -116287 29523 127823 -160691 -66509 -79490 53778 -13748 -220838 176958
18090 -290342 251478 66439 50652 22989 -148767 -6768 222192 -93826 -85769 13337 19856
18079 19856 -80859 46623 -193908 -172553 -288762 334064 156641 -388290 64522 -221265
18068 -64938 -143784 -97830 81045 -164266 -12259 167493 63250 -113289 177890 59355 -255861
18056 262978 -198787 -162717 -52394 316922 -61138 164381 121055 80773 -137761 39826 -91349
$$ packed form
18136A62303j5183R2710i8917L2946K4914K0496k58896c3631A07406K5925b10248
18124i8545e497B25127b10357B74721m5622p8513G4960b25147J04691C8893Q648
18113D7541J59469E0559i8550k23039j02778F088b60345A46000D9696M8831J010
18102I9537g7005l9282B9523R8300a60691f6509j2981E3778a3748k07090A76958
18090b90342B51478F6439j5787B2989a48767f768B22192i3826Q057A3337O519
18079A9856h0859D6623a93908K1355j16209C34064A56641c88290F4522b21265
18068f4938p8846M5954H1045a64266a2259A67493F3250a13289A77890E9355b55861
18056B62978a98787L6070e2394C16922f1138A64381m3326m0282a37761C9826i1349
$$ plain form
18044 -131302 59402 163695 77979 -1923 -23232 59502 -37872 166111 -16770 -132105 -406423
18033 -406423 -406231 -59061 -200212 338436 119138 -273387 -330175 -225172 59431 132079 -179572
18021 -186561 270806 -102821 203336 -157636 -40643 201963 -29823 142083 104336 -140816
18010 -8221 -37061 -322639 42217 -162064 377783 118302 -193794 97078 69753 -216401 509918
17998 225269 52169 -148689 85737 182921 -22558 16941 71203 186252 -52580 -92315 59158
17986 106410 12205 211683 -241161 38675 108769 500825 66801 28080 -215201 -19127 92639
17974 -123329 -59842 -136148 -327220 156551 173959 89036 204433 -177008 223681 106090
17963 34537 -111765 230539 290836 -57645 -110622 -94797 -54256 37304 -358832 523542 -167614
$$ packed form
18044a31302E9402J04293G7979a923k1309E9502c7872A66111a6770j15335k74318
18033d06423J92e9061j41151C38436A19138b73387n6788J05003E9431P2648a79572
18021a86561B70806a02821B03336a57636d0643B01963b9823A42083l7747a40816
18010h221k8840k85578D2217a62064C77783A18302a93794I7078k7325b16401E09918
17998B25269E2169a48689H5737R7184b2558A6941N4262J15049e2580l9735E9158
17986A06410A2205J99478b41161C8675P0094L92056F6801B8080b15201a9127I2639
17974a23329e9842p6306j91072A56551J7408q4923J15397a77008B23681A06090
17963C4537a11765B30539O0297e7645n2977J5825M0541C7304c58832E23542a67614
$$ plain form
17951 -221051 -230855 36298 51624 15979 -72717 191656 274280 -7262 13480 75448 237824
17940 237824 218263 36682 -33932 -26509 -309134 125246 -66164 -380352 289739 -274068 217535
17928 -273969 -61890 88341 -62474 21078 -121998 -163544 222850 -135689 96747 193293 -110258
17916 -130145 195946 244365 12341 -13256 242012 12786 158324 51661 -7251 12886 116582
17905 116582 -201814 65041 -57002 -106965 163730 -37592 -100234 -54950 -36903 -6100 -34459
17894 -34459 242366 164624 -314302 -223450 -59690 163665 56244 25459 243297 -158551 27065
17882 -81431 -9482 352124 -158384 -263179 -170474 78986 225311 96477 50730 11194 -144440
17870 32613 406576 97887 114420 138352 -59714 3281 86268 50431 37808 222400 27498
$$ packed form
17951b21051r804C6298J5326A5979g2717A91656Q2624g262A3480O1968J62376
17940B37824j9561C6682c3932P423k82625A25246f6164l14188B89739b74068B17535
17928b73969f1890H8341f2474B1078a21998m1546B22850a35689I6747R6546a10258
17916a30145A95946M8419A2341a3256B42012A2786J45538E1661g251A2886J03696
17905A16582b01814F5041e7002m9963A63730c7592o2642M5284J8047f100k8359
17894c4459B42366p7742c14302R0852e9690A63665E6244B5459K17838a58551B7065
17882h1431i482C52124a58384j04795R2705G8986J46325I6477m5747A1194a44440
17870C2613L73963I7887J6533K3932e9714C281Q2987l5837j2623J84592B7498
$$ plain form
17858 -142513 230978 -60565 -33619 -95519 119588 30268 -222755 155232 -263224 -44051
17847 -47057 -279227 -109262 -110867 -48212 44412 219672 88940 27762 -136215 294822 118248
17835 -10882 -390026 188918 232921 -124432 -48636 -80947 -39583 -54148 -310370 260669 -261103
17823 -23799 -13998 -38495 -33204 -132273 -161156 46638 -179626 -111915 91538 258782 92776 -254926
17810 251388 -109197 -219624 -332639 114544 -31755 15411 57620 205405 166481 168299 -234524
17798 239144 296626 -219207 176560 -46603 -98183 233998 -195746 -153655 56059 -12448 147180
17786 -34816 133896 330299 -49907 69960 143833 153211 -141375 139906 -240986 -43407 24359
17774 267609 429975 -264832 136190 14411 56950 -56353 -269500 -88201 -51993 40584 122280
$$ packed form
17858a42513B30978f0565K6946o1900A19588C0268b22755A55232b63224d4051
17847d7057k32170a09262j605d8212D4412J75260H8940B7762a36215B94822A18248
17835a0882l79144A88918M4003a24432d8636l2311c9583j4565k56222B60669b61103
17823b3799R801k4497N291r9069k8883D6638a79626O7711I1538J67244I2776b54926
17810B51388a09197j10427j13015A14544c1755A5411M2209J47785l8924J818b34524
17798B39144N7482b19207A76560d6603n1580B33998a95746M2091E6059a2448A47180
17786c4816A33896J96403d9907F9960P3873R378a41375A39906b40986d3407B4359
17774B67609J62366b64832A36190A4411M2539e6353k13147h8201L6208D0584Q1696
$$ plain form
17763 122280 -43994 159554 102700 -4242 -23011 -6974 215014 82013 38732 333556 -26591
17751 195229 105785 222352 -271823 136683 -188008 -133867 165088 -200764 42217 -302084
17740 328994 51617 247179 61069 36032 -101551 -98581 -28166 -92998 -13192 -346256 -16714
17728 -16098 222172 -183486 103332 124772 285202 188205 46131 166691 -63935 162859
17717 -60397 139286 9192 -7224 112880 113834 121681 -104575 160515 181068 60318 5157 -125920
17704 4476 -44635 65623 121216 303820 114899 307899 113068 -23337 110972 109216 -5442
17692 204958 -127874 162387 204662 133810 175943 244368 -19782 -37772 14493 49388 71035
17681 71035 116736 192433 -13934 -144757 2193 106838 38326 -104886 186490 230158 261246
$$ packed form
17763A22280d3994A59554n6854d242j8769f974B15014H2013C8732K94824b6591
17751A95229q9444J16567b71823A36683a88008N4141A65088b00764D2217c02084
17740C28994E1617J95562F1069k5037a01551K970b8166o4832a3192l33064a6714
17728a6098B22172a83486A03332K1440J60430r6997D6131J20560f3935A62859
17717f0397A39286I192g224A12880R54P847a04575A60515K0553F0318E157a25920
17704D476d4635F5623N5593J82604A14899J93000A13068b3337A10972j756e442
17692B04958a27874A62387M2275p0852M2133O8425a9782j7990A4493L4895K1647
17681G1035M5701P5697a3934j30823B193J04645C8326a04886A86490M3668L1088
$$ plain form
17670 261246 -56961 131299 77463 -6621 367348 -53912 313505 138529 -78528 144212 135967
17659 135967 108967 117619 382649 -122600 236061 48409 78205 -27443 230942 37446 35989
17648 35989 -81089 181075 -240768 -155580 290977 -195232 -131867 184172 -18351 -77134 -240676
17637 -240676 71835 -225438 -24195 310844 58633 30146 329 226265 201727 307488 434145
17626 434145 316891 497502 79398 239068 122578 301746 81060 -173485 15328 422169
17616 422169 157448 390101 245748 -83010 47948 200191 143583 -191488 -83619 277773
17605 39795 199642 156342 117423 65306 143425 -45662 436545 213171 303023 234796 218703
17594 218703 -204167 138459 8639 -14284 90143 124600 292710 184260 270499 179619 -21064
$$ packed form
17670B61246e6961A31299n3836f621C67348e3912C13505A38529g8528A44212q245
17659A35967k7000Q652K65030a22600B36061D8409K9796b7443B30942C7446j457
17648C5989h1089A81075b40768Q5188B90977a95232O3365A84172a8351n8783j63542
17637b40676G1835b25438b4195C10844E8633k8487C29K25936k4538J05761J26657
17626D34145j17254J80611G9398J59670j16490J79168H1060a73485A5328M06841
17616D22169A57448K32653j44353h3010D7948J52243n6608a91488h3619B77773
17605C9795J59847m3300l8919n2117P8119d5662D36545B13171Q9852o8227j6093
17594B18703b04167A38459H639a4284I0143L4457J68110j08450Q6239r0880b1064
$$ plain form
17582 66282 291155 -69221 59592 -138285 212794 142315 -28472 293458 267409 160016 70212
17570 141716 185923 94238 452960 -353723 -141510 17138 163271 107308 151276 226964 284940
17559 284940 -10709 -215850 76757 91808 275306 160215 -60307 137554 396919 150552
17548 73315 279227 311130 29834 155529 -87778 -26576 77431 379030 415765 153128 309938
17537 309938 -91174 33550 -38237 167759 97656 226361 342104 394130 399981 -37691 117208
17525 518524 237395 409304 395996 494710 843015 738921 492008 477856 182434 461602
17515 461602 208988 21493 388213 -195947 8800 210486 326399 284403 567706 359097
17505 359097 348119 591619 489695 311009 233704 -104177 -184803 96869 -54312 267639
$$ packed form
17582F6282K24873f9221E9592a38285B12794p0479b8472B93458k6049j07393G0212
17570A41716M4207r1685L58722c53723a41510A7138J46133n5963M3968P5688N7976
17559B84940a0709k05141G6757J5051J83498j15091f0307A37554K59365A50552
17548G3315K05912L1903B9834J25695h7778b6576G7431L01599L6735A53128J56810
17537C09938i1174C3550c8237A67759p0103J28705J15743N2026N851c7691A17208
17525E18524B37395J71909j3308R8714L48305j04094k46913j4152A82434K79168
17515D61602B08988B1493L66720a95947H800K01686J15913m1996K83303k08609
17505C59097j0978K43500j01924j78686p7305a04177q0626I6869e4312B67639
$$ plain form
17494 293496 -47763 -14602 466353 181697 -9691 204582 194359 228020 -89053 345155 45702
17482 177412 224798 171041 174618 236297 329322 73005 325359 395157 78488 286639 110514
17470 385048 460926 235579 46393 10859 302853 334859 244853 -68111 27840 14448 180011
17459 180011 253252 317647 -135306 73508 164906 173470 145867 98660 264546 148027 79047
17448 79047 59319 238206 317458 240154 276690 251749 75901 213872 324593 381110 316217
17437 316217 84858 449221 251237 -41414 320533 53048 346192 197880 -12941 282770
17426 331334 99364 250112 381834 302628 -353448 462644 -26021 348063 142145 34409
17415 216395 296259 68435 374430 57823 312780 128214 41077 274907 548602 43672
$$ packed form
17494B93496d7763a4602D66353A81697i691B04582j0223L3661h9053C45155D5702
17482A77412M7386n3757L577O1679R3025G3005K52354O9798G8488K08151A10514
17470C85048P5878k25347D6393A0859K91994L2006r0006f8111B7840j3392J65563
17459A80011P3241O4395a35306G3508R1398Q564k7603m7207J65886j16519o8980
17448G9047j9728J78887P9252p7304L6536k4941G5901J37971J10721N6517o4893
17437C16217H4858L64363j97984d1414C20533E3048K93144j48312a2941B82770
17426C31334I9364J50748J31722p9206c53448D62644b6021C48063A42145C4409
17415B16395P9864F8435L05995E7823K54957A28214D1077K33830K73695D3672
$$ plain form
17404 219117 131841 131383 126852 326241 504259 74214 232587 131953 494537 225814 276655
17393 276655 235310 38671 192998 426542 108487 151189 355132 372520 377118 49918 -190857
17381 -152481 402903 259857 81740 320214 466718 120305 72430 170431 127291 -117592
17370 478109 328211 166305 133088 -161902 -160319 468354 63691 365259 284665 352744 153119
17358 -42429 -53328 -33946 281262 214429 238702 478541 -52616 235491 158180 227668 465903
17347 465903 90100 -13477 273378 138700 167748 185103 325098 162626 318592 305088
17337 305088 219384 384246 223293 203642 521967 411070 380445 134172 407204 152267
17326 -45858 -84013 178483 441666 175254 237677 22118 -125883 446216 -61399 147145
$$ packed form
17404B19117q7276m58m531J99389J78018G4214J58373j00634L62584B25814N0841
17393B76655m1345C8671J54327K33544A08487M2702K03943J7388M598D9918a90857
17381a52481D02903j43046H1740K38474J46504A20305m7875R8001m3140a17592
17370D78109j49898j61906l3217a61902J583D68354F3691L01568q0594O8079A53119
17358d2429j0899J9382B81262o6833K4273K39839e2616B35491p7311O9488K38235
17347D65903I0100a3477B73378j34678K9048J7355J39995j62472J55966j3504
17337C05088q5704J64862j60953j9651L18325j10897l0625A34172K73032A52267
17326d5858l8155A78483K63183A75254O2423B2118a25883D46216f1399A47145
$$ plain form
17315 352602 275138 199353 462717 253159 -18499 292068 174571 163541 67097 382731
17305 382731 -153707 293699 142878 116933 -36227 121849 91088 231013 -6199 257342
17294 343453 231986 114052 309677 178170 431365 325721 423630 239939 323900 291730
17284 291730 217385 -118920 175885 314741 220021 418762 219614 360453 114731 238251
17274 238251 43507 278605 137648 224435 391103 242058 587615 632458 213853 278218
17264 278218 308321 88243 399499 347633 176922 446873 446443 256239 208802 561014 422496
17253 422496 345464 420543 270217 347225 426149 65440 465640 276197 103556 215463
17243 215463 484043 688622 355188 343157 233678 323999 372833 373272 198823 -29785 308443
$$ packed form
17315C52602p7464p5785K63364k09558a8499B92068j17497j1030F7097L15634
17305C82731a53707B93699A42878k5945c6227A21849l0761J39925f199B57342
17294C43453j11467A14052J95625j31507K53195j05644R7909j83691Q3961l2170
17284B91730p4345a18920A75885J38856r4720J98741j99148J40839A14731J23520
17274B38251D3507K35098A37648Q6787J66668j49045L45557M4843B13853O4365
17264B78218L0103H8243L11256n1866j70711K69951m30j90204m7437L52212j38518
17253D22496p7032P5079j50326P7008P8924F5440M00200j89443A03556J11907
17243B15463K68580K04579l33434j2031j09479R0321M8834M39j74449b9785C08443
$$ plain form
17231 -128744 213289 286042 351600 171554 498577 327275 417167 327974 611766 304440
17220 83898 176663 237767 171857 295229 307259 503239 323312 490472 264348 469389
17210 469389 329778 242452 535482 533401 285698 267624 453444 330307 403539 202986
17200 202986 721313 363199 105160 184338 486646 434723 388621 269440 519825 503376
17190 503376 688612 516191 767441 536546 278589 465195 481538 523942 182939 351071
17180 351071 695520 437418 90043 268058 362931 333495 46761 225740 586079 343061
17170 343061 498803 718852 553468 429685 314902 519983 505745 254667 470978 509342
17160 509342 422025 280373 432789 503343 272957 306631 294675 695965 686522 286232 753769
$$ packed form
17231a28744B13289P2753O5558A71554L27023j71302Q9892q9193K83792C04440
17220H3898R2765O1104o5910J23372J2030J95980j79927J67160k26124K05041
17210D69389j39611q7326K93030k081k47703j8074J85820j23137P3232k00553
17200B02986N18327l58114A05160P9178L02308n1923m6102j19181K50385j6449
17190E03376J85236j72421K51250k30895k57957J86606J6343M2404A82939J68132
17180C51071L44449k58102I0043J78015R4873k9436D6761J78979L60339k43018
17170C43061J55742K20049j65384j23783j14783K05081j4238k51078K16311L8364
17160E09342q7317j41652J52416P0554k30386L3674j1956M01290r443B86232M67537
$$ plain form
17149 753769 601464 472118 474662 521401 626940 600169 532177 434932 439574 609223 385611
17138 385611 743549 364150 533102 586587 588796 376953 622688 642441 922111 375956
17127 588582 304957 651619 157003 914991 703602 825792 664331 708533 461316 488781
17117 488781 319043 540976 289466 552888 201854 886284 443964 668406 621593 566791
17107 566791 737327 521833 659214 677744 386176 446328 652883 654855 621892 369687
17097 369687 437538 474046 707427 506638 648253 576277 869156 781921 632550 1110981
17087 1110981 843066 514045 749703 523853 655606 803239 637066 614697 288576 807596
17077 807596 595806 1024715 649065 567193 1087228 666385 1117961 560447 630409 806817
$$ packed form
17149G53769j52305j29346K544M6739J05539k6771o7992r7245M642J69649k23612
17138C85611L57938C64150J68952N3485K209k11843K45735J9753K79670C75956
17127E88582k83625L46662A57003P57988k11389J22190j61461M4202k47217K7465
17117D88781j69738K21933k51510K63422B01854O84430m42320K24442m6813n4802
17107E66791J70536k15494J37381J8530k91568O0152K06555J972l2963k52205
17097C69687O7851L6508K33381k00789J41615p1976K92879q7235j49371M78431
17087A110981k67915l29021K35658k25850J31753J47633j66173k2369B88576N19020
17077H07596k11790M28909l75650q1872N20035m20843M51576n57514O9962J76408
$$ plain form
17067 806817 500260 890039 637292 753027 1020112 928547 696496 943993 860796 724695
17057 724695 602498 719383 769410 835775 1058730 1031942 775105 618389 724478 1065720
17047 1065720 845539 786622 794179 942351 1209960 872364 740981 1082172 972593 898714
17037 898714 954618 993084 879193 781979 1074314 827472 1129100 842466 891629 1206420
17027 1206420 857534 831412 965235 993285 947123 1066634 972897 1020253 1029647 753411 1191787
17016 1191787 1260027 1157190 1458403 1024369 1319049 1272338 1213928 1187617 1545407 1228425
17006 1228425 1181900 977157 1067347 1264599 1413242 1377440 1475996 1077819 1604259 1260831
16996 1260831 1226246 1393325 1531139 1458647 1060713 1086142 1328424 1391218 1479431 1283612
$$ packed form
17067H06817l06557L89779k52747J15735K67085r1565k32051K47497q3197j36101
17057G24695j22197J16885N0027O6365K22955k6788k56837j56716J06089L41242
17047A065720k20181n8917P557J48172K67609l37596j31383L41191j09579p3879
17037H98714N5904L8466j13891r7214K92335k46842L01628k86634M9163L14791
17027A206420l48886k6122J33823K8050m6162J19511r3737M7356R394k76236M38376
17016A191787O8240j02837L01213m34034K94680m6711n8410k6311L57790l16982
17006A228425m6525k04743R0190J97252J48643l5802R8556l98177N26440l43428
16996A260831l4585J67079J37814p2492l97934K5429K42282O2794Q8213j95819
$$ plain form
16986 1283612 1015311 1507963 1416006 1730550 1029138 1509044 1608990 1019527 1350909 1397083
16976 1397083 1458624 1714524 1409561 1497361 1624768 1759007 1465080 1626243 1595873 1643292
16966 1643292 1778926 1691316 1659834 1506304 1747115 1946551 1811618 1749777 1549681 1726629
16956 1726629 1741666 1666762 1568810 1709801 2015270 1915966 1826944 1780859 1943125 1889975 1779703
16945 1779703 1768910 1713311 1887607 1978291 2245449 2126393 1838407 1937420 2200735 2289204
16935 2289204 2005334 1948208 2169391 2263910 1968961 2495260 2400512 2242165 2531783 2236932
16925 2236932 2152215 2439586 2192342 2737427 2457576 2481086 2202213 2686259 2882213 2554006
16915 2554006 2587502 2637834 2840533 2624629 2809047 2992985 2788244 2845408 2876653 2964602
$$ packed form
16986A283612k68301M92652r1957L14544p01412M79906R9946n89463L31382M6174
16976A397083O1541K55900l04963Q7800J27407J34239k93927J61163l0370M7419
16966A643292J35634q7610l1482j53530K40811J99436j34933o1841k00096J76948
16956A726629J5037p4904r7952J40991L05469r9304q9022m6085J62266n3150j10272
16945A779703j0793n5599J74296R0684K67158j19056k87986R9013K63315Q8469
16935B289204k83870n7126K21183R4519k94949N26299r4748j58347K89618k94851
16925B236932q4717K87371k47244N45085k79851K3510k78873M84046J95954l28207
16915B554006L3496N0332K02699k15904J84418J83938k04741N7164L1245Q7949
$$ plain form
16905 2964602 2846279 3004590 2835502 2857706 2939688 2901606 3149626 3163779 3336135 3066679
16895 3066679 3411009 3396550 3527895 3574683 3295581 3226960 3744856 3394101 3755833 4080561
16885 4080561 4065024 3867868 3746139 4042598 3931728 3926429 4357165 4255135 4315169 4072222
16875 4072222 4131578 4462384 4384083 4590279 4575660 4875246 4577320 5037042 4756026 4592266
16865 4592266 4761424 5154302 4983640 5085889 5013153 5201064 5206917 5559635 5715267 5711794
16855 5711794 5744301 6052502 5978180 5801498 6145480 6365076 6055915 6298169 6433718 6768384
16845 6768384 6576328 6876439 6719563 7002582 7355074 7067071 6922080 7657059 7774964
16836 7774964 7703950 7754960 7981194 8218525 8030022 8513177 8288747 8791991 8791623 8918914
$$ packed form
16905B964602j18323J58311j69088K2204Q1982l8082K48020J4153J72356k69456
16895C066679L44330j4459J31345M6788k79102o8621N17896l50755L61732L24728
16885D080561j5537j97156j21729K96459j10870n299M30736j02030O0034k42947
16875D072222N9356L30806p8301K06196j4619K99586k97926M59722k81016j63760
16865D592266J69158L92878j70662J02249p2736J87911N853L52718J55632l473
16855E711794L2507L08201p4322j76682L43982K19596l09161K42254J35549L34666
16845F768384j92056L00111j56876K83019L52492k88003j44991P34979J17905
16836G774964p1014N1010K26234K37331j88503M83155k24430N03244l68J27291
$$ plain form
16826 8918914 9142758 9380250 9585878 9739852 9844463 10052149 10282726 10604548 10736864
16817 10736864 10827202 11012896 10946245 11463599 11895766 11930355 12053495 12612041 12460863 13020307
16807 13020307 12996202 13408918 13811853 14238744 14574048 14779826 14829291 15482515 15762713 16286001
16797 16286001 16311973 16804270 17088453 17210578 18019370 18454947 18796654 19360636 20088666
16788 20088666 20249178 20971116 21231599 21625448 22584190 23034173 23503378 24054783 25097779
16779 25097779 25493336 26295869 26985346 28084181 28786662 29223623 30200194 31047470 31979305
16770 31979305 32930642 33636703 34459951 35749837 36766315 37623895 39006854 40111504 41266486
16761 41266486 42459904 43485509 45092336 46082497 47680914 48683120 50213168 51749607
$$ packed form
16826H918914K23844K37492K05628J53974J04611K07686K30577L21822J32316
16817A0736864R0338J85694o6651N17354M32167L4589J23140N58546j51178N59444
16807A3020307k4105M12716M02935M26891L35304K05778M9465O53224K80198N23288
16797A6286001K5972M92297K84183J22125Q08792M35577L41707N63982P28030
16788B0088666J60512P21938K60483L93849R58742M49983M69205N51405J042996
16779B5097779L95557Q02533O89477J098835P02481M36961R76571Q47276R31835
16770C1979305R51337P06061Q23248J289886J016478Q57580J382959J104650J154982
16761D1266486J193418J025605J606827R90161J598417J002206J530048J536439
$$ plain form
16753 51749607 53329340 54638106 56473252 58147752 59170420 61163248 62832088 64134545
16745 64134545 65851642 68019151 69464987 71058875 72413716 73806026 75851270 77460159
16737 77460159 78851552 80219856 81546060 82549082 83565583 84915253 85799063 86664385
16729 86664385 87291710 87758055 88517077 88591488 88730352 88881909 88599079 88238641 88006390
16720 88006390 87359570 86893133 86197683 85053556 84125949 83038075 81678041 80378968 79183639
16711 79183639 77793087 76621998 74953225 73163159 71718922 70026783 68521918 66843760
16703 66843760 65232686 63549040 62118472 60672515 58991637 57411857 55878494 54352386
16695 54352386 52869065 51443366 49948991 48794483 47498658 46173871 45039766 43742325
$$ packed form
16753E1749607J579733J308766J835146J674500J022668J992828J668840J302457
16745F4134545J717097K167509J445836J593888J354841J392310K045244J608889
16737G7460159J391393J368304J326204J003022J016501J349670Q83810Q65322
16729H6664385O27325M66345P59022P4411J38864J51557k82830l60438k32251
16720H8006390o46820m66437o95450j144127r27607j087874j360034j299073j195329
16711G9183639j390552j171089j668773j790066j444237j692139j504865j678158
16703F6843760j611074j683646j430568j445957j680878j579780j533363j526108
16695E4352386j483321j425699j494375j154508j295825j324787j134105j297441
$$ plain form
16687 43742325 42719408 41387932 40257776 39098052 37830032 36712308 36041535 35221275
16679 35221275 33620120 33422918 32617587 31398334 30667047 29854643 29179529 28661886 27494332
16670 27494332 26773362 26302273 25368206 25138040 24436407 24147768 23209032 22667265 22119566
16661 22119566 21637292 21342298 21013996 20128587 19796717 19504781 18755042 18478610 18127308
16652 18127308 17886055 17392757 17263622 16732192 16513465 16111846 15483026 15511143 14966820
16643 14966820 14793830 14639592 14043328 13995494 13336121 13317109 13395873 12908339 12630000 12455907
16633 12455907 12189056 12087397 11970825 11413322 11255522 11455947 10718891 10801947 10579430
16624 10579430 10846163 10605155 10275581 9832643 9816371 9891412 9724597 9321144 9348220 8986244
$$ packed form
16687D3742325j022917j331476j130156j159724j268020j117724o70773q20260
16679C5221275j601155j97202q05331j219253p31287q12404o75114n17643j167554
16670B7494332p20970m71089r34067k30166p01633k88639r38736n41767n47699
16661B2119566m82274k94994l28302q85409l31870k91936p49739k76432l51302
16652A8127308k41253m93298j29135n31430k18727m01619o28820K8117n44323
16643A4966820j72990j54238n96264m7834o59373j9012P8764m87534k78339j74093
16633A2455907k66851j01659j16572n57503j57800K00425p37056Q3056k22517
16624A0579430K66733k41008l29574m42938j6272P5041j66815m03453K7076l61976
$$ plain form
16614 8986244 8921844 8571894 8718156 8483781 8539268 8419806 8147826 7943178 7738208 7771731
16604 7771731 7654384 7556385 7666071 7394763 7332054 7530470 7465583 7085997 6776168 6749215
16594 6749215 6628105 6828804 6550269 6376524 6551398 6466942 6129150 6256019 6419750 6134764
16584 6134764 6029777 5835252 5776897 5950207 5838263 5880556 5374537 5485793 5625172 5383211
16574 5383211 5210702 5391162 5050767 4987497 5058918 4839356 5086063 4659610 5000406 4671034
16564 4671034 4985254 4791946 4809666 4413286 4691212 4547335 4062195 4392813 4375419 4469860
16554 4469860 4225425 4357668 4133086 3966420 4166486 4119211 3990659 3794958 3715635 3965589
16544 3965589 3623843 3637507 3667519 3906870 3698758 3691016 3392259 3520177 3499599 3681667
$$ packed form
16614H986244o4400l49950J46262k34375N5487j19462k71980k04648k04970L3523
16604G771731j17347r7999J09686k71308o2709J98416o4887l79586l09829k6953
16594F749215j21110K00699k78535j73745J74874q4456l37792J26869J63731k84986
16584F134764j04987j94525n8355J73310j11944M2293n06019J11256J39379k41961
16574E383211j72509J80460l40395o3270P1421k19562K46707m26453L40796l29372
16564D671034L14220j93308J7720l96380K77926j43877m85140L30618j7394R4441
16554D469860k44435J32243k24582j66666K00066m7275j28552j95701p9323K49954
16544C965589l41746J3664L0012K39351k08112p742k98757J27918k0578J82068
$$ plain form
16534 3681667 3298413 3558767 3205925 3585822 3411728 3540531 3205254 3225560 3117995 3201097
16524 3201097 3273692 2833187 3273988 2975114 3070703 3025790 3220601 3037066 3221329 3146114
16514 3146114 3322714 2842356 2716839 3056960 2902444 2909224 2715984 2838413 2713450 2734811
16504 2734811 2991271 2673396 2554632 2862089 2572767 2580397 2651210 2686892 2607012 3022628
16494 3022628 2540136 2526401 2639066 2582755 2644395 2575868 2236120 2556931 2481240 2569715
16484 2569715 2405282 2248710 2149652 2262825 2300871 2166505 2015541 2247703 2251491 2299480
16474 2299480 2445554 2263665 1938901 2257659 2339017 2009194 2070813 2176485 2127175 1683562
16464 1683562 2017572 2129075 2161970 1871847 2267595 2273276 1901007 2178867 2005387 1775785
$$ packed form
16534C681667l83254K60354l52842L79897j74094J28803l35277K0306j07565Q3102
16524C201097P2595m40505M40801k98874R5589m4913J94811j83535J84263p5215
16514C146114J76600m80358j25517L40121j54516O780j93240J22429j24963K1361
16504B734811K56460l17875j18764L07457k89322P630P0813L5682p9880M15616
16494C022628m82492j3735J12665n6311O1640o8527l39748L20811p5691Q8475
16484B569715j64433j56572r9058J13173L8046j34366j50964K32162L788M7989
16474B299480J46074j81889l24764L18758Q1358l29823O1619J05672m9310m43613
16464A683562L34010J11503L2895k90123L95748N681l72269K77860j73480k29602
$$ plain form
16454 1775785 1840280 2117439 1816438 1880591 1743752 1922476 1920831 1924468 2158468 1816006
16444 1816006 1730357 1643104 1809474 1825392 1909274 1818684 1900255 1913197 1597058 1586275 1863260
16433 1863260 1861014 1867195 1707238 1732020 1671411 1596639 1834768 1598195 1849145 1827730 1477489
16422 1477489 1684877 1602365 1753162 1939331 1758807 1793735 1574188 1677383 1658385 1598790
16412 1598790 1675225 1412577 1451584 1552831 1206730 1490911 1586890 1746192 1201163 1398376
16402 1398376 1526554 1423797 1411428 1359783 1408030 1446978 1203825 1459478 1303737 1133632
16392 1133632 1698553 1347246 1477359 1585994 1392710 1413359 1247036 1247103 1353735 1052641
16382 1052641 1387363 1489019 1336576 1217546 1182924 1130968 1264346 1468286 1356594 1158191
$$ packed form
16454A775785O4495K77159l01001O4153j36839J78724j645L637K34000l42462
16444A816006q5649q7253J66370J5918Q3882r0590Q1571J2942l16139j0783K76985
16433A863260k246O181j59957K4782o0609p4772K38129k36573K50950k1415l50241
16422A477489K07388q2512J50797J86169j80524L4928k19547J03195j8998n9595
16412A598790P6435k62648L9007J01247l46101K84181R5979J59302n45029J97213
16402A398376J28178j02757j2369n1645M8247L8948k43153K55653j55741j70105
16392A133632N64921l51307J30113J08635j93284K0649j66323O7J06632l01094
16382A052641L34722J01656j52443j19030l4622n1956J33378K03940j11692j98403
$$ plain form
16372 1158191 1469370 1319707 1414035 1043046 1061520 1457592 1141150 1174884 1210393 1387738
16362 1387738 984464 1067738 1368699 1057226 1059190 1251603 1359801 1120333 1093522 1183107
16352 1183107 882131 1063347 1069337 1209940 1119294 1110317 980136 1126591 1092193 1201166
16342 1201166 1092081 1146179 998986 954295 981403 1031133 790753 979289 1301605 893233
16332 893233 1014653 1162027 1195273 938315 1449062 1143653 1201410 775367 1205514 1095480
16322 1095480 1231265 1121938 1152170 1011568 1098576 995400 676930 870706 1091055 1128096
16312 1128096 869657 815799 960715 922913 1053302 886763 1140281 884758 837214 863549
16302 863549 949457 934152 1005267 750844 834214 1338857 739925 1077109 860850 1044357
$$ packed form
16372A158191L11179j49663R4328l70989J8474L96072l16442L3734L5509J77345
16362A387738m03274Q3274L00961l11473J964J92413J08198k39468k6811Q9585
16352A183107l00976J81216N990J40603r0646q977j30181J46455l4398J08973
16342A201166j09085N4098j47193m4691K7108M9730k40380J88536L22316m08372
16332H93233J21420J47374L3246k56958N10747l05409N7757m26043M30147j10034
16322A095480J35785j09327L0232j40602Q7008j03176l18470J93776K20349L7041
16312A128096k58439n3858J44916l7802J30389j66539K53518k55523m7544K6335
16302H63549Q5908j5305P1115k54423Q3370N04643n98932L37184k16259J83507
$$ plain form
16292 1044357 1180006 789285 831764 822790 786978 990678 809082 918551 637167 1054298
16282 1054298 1087260 1041545 808861 793059 747789 804587 888509 730477 833193 638264
16272 638264 683830 754060 718204 716798 735938 814151 993906 788210 659274 875577 845721
16261 845721 686865 597204 525537 690951 935876 807341 761709 828375 575079 1021389
16251 1021389 325406 889471 599353 880214 672338 678789 561444 442419 347398 546718
16241 546718 793691 948636 858948 412052 795754 620565 608019 564524 507307 652406
16231 652406 811347 793164 778172 456468 414406 803777 843101 490876 451432 506620 843672
16220 843672 1020668 784908 545568 468269 512867 692043 638717 735061 470078 592276
$$ packed form
16292A044357J35649l90721M2479q974l5812K03700j81596J09469k81384M17131
16282A054298L2962m5715k32684j5802m5270N6798Q3922j58032J02716j94929
16272F38264M5566P0230l5856j406J9140P8213J79755k05696j28936K16303k9856
16261H45721j58856q9661p1667J65414K44925j28535m5632O6666k53296M46310
16251A021389C25406N64065k90118K80861k07876O451j17345j19025r5021J99320
16241E46718K46973J54945q9688D12052L83702j75189j2546m3495n7217J45099
16231F52406J58941j8183j4992l21704m2062L89371L9324l52225l9444N5188L37052
16220H43672J76996k35760k39340p7299M4598J79176n3326R6344k64983J22198
$$ plain form
16210 592276 272675 639319 763535 636692 382736 774349 553312 506235 783923 816446
16200 816446 779685 241314 657015 383283 601469 400679 616679 515434 296039 190469
16190 190469 689535 402813 568493 612426 245035 923973 455259 375444 408292 565352
16180 565352 518423 654555 433059 557599 305122 456735 622985 228988 413357 357849
16170 357849 791898 399023 166430 412418 555995 531044 668756 121101 424913 353960
16160 353960 615358 560429 895234 214738 215933 393883 -49468 450901 459209 589764 587640
16149 587640 565193 325623 324651 728179 91225 352712 226769 535685 347875 277101 549144
16138 549144 131717 233002 64242 450039 509959 139374 236759 367177 611138 668857
$$ packed form
16210E92276B72675L66644J24216j26843k53956L91613k21037m7077K77688L2523
16200H16446l6761B41314M15701k73732K18186k00790K16000j01245k19395j05570
16190A90469M99066k86722J65680M3933B45035O78938D55259p9815L2848J57060
16180E65352m6929J36132k21496J24540k52477J51613J66250B28988J84369n5508
16170C57849M34049l92875A66430K45988J43577k4951J37712A21101L03812p0953
16160C53960K61398n4929L34805B14738J195J77950d9468D50901Q308J30555k124
16149E87640k2447k39570r72M03528I1225K61487j25943L08916j87810p0774K72043
16138E49144A31717J01285F4242L85797N9920A39374R7385J30418K43961N7719
$$ plain form
16128 668857 382945 411117 80640 114871 436254 464267 540138 89584 424556 246360 68253
16116 -26391 388129 37088 303728 174547 211749 331625 407112 540837 364042 403705
16106 403705 239447 300217 359328 409332 301931 166978 238906 139203 543761 178471
16095 284019 266482 46825 79005 324907 200762 212842 139352 266680 47667 537953 467858
16084 467858 420162 347119 158932 167436 83008 41065 124189 217504 535151 397237 369897
16073 369897 244398 238336 265273 205274 -245822 20009 405819 258128 126662 441645
16063 441645 133898 201902 346545 256325 211947 52230 154531 72636 192850 -86815 94092
16051 285761 14745 378782 -2082 579003 107956 347684 114463 245376 174377 181696 237927
$$ packed form
16128F68857k85912K8172H0640L4231L21383K8013P5871H9584L34972j78196F8253
16116b6391C88129C7088K66640j29181L7202J19876P5487J33725j76795L9663
16106D03705j64258O0770N9111N0004j07401j34953P1928r9703M04558A78471
16095B84019j7537D6825L2180K45902j24145J2080p3490J27328D7667M90286p0095
16084D67858m7696p3043A58932Q504H3008D1065Q3124R3315L17647j37914k7340
16073C69897j25499o062K6937n9999b45822B0009L85810j47691A26662L14983
16063D41645A33898O8004J44643r0220m4378E2230J02301G2636J20214h6815I4092
16051B85761A4745L64037b082E79003A07956K39728A14463J30913p0999P319N6231
$$ plain form
16040 237927 57312 -101070 112000 1397 437949 50301 156273 88447 297128 310399 -27406
16028 328857 54976 121412 313357 135383 162462 291195 274042 165229 68167 215952
16018 215952 150548 56111 207699 28140 55691 435936 290063 173194 224006 128481 -31165
16006 -168577 127308 28938 139827 96779 22400 177205 -92581 2633 159927 165661 138401
15995 138401 154355 116714 288340 101323 393446 821628 391675 877880 1048723 969464
15985 969464 754890 573367 602110 411906 558395 423048 13076 260106 155019 339008
15975 339008 -11729 417599 15959 159992 196528 -164443 134723 53611 8127 -217360 144804
15963 31555 199095 93174 -43451 11500 190683 283222 223967 158420 482040 125034 -44299
$$ packed form
16040B37927E7312a01070A12000A397M36552E0301J05972o7826K08681J3271b7406
16028C28857E4976O6436J91945A35383K7079J28733j7153j08813F8167J47785
16018B15952o5404E6111J51588B8140K7551L80245j45873j16869N0812r5525c1165
16006a68577A27308B8938J10889m3048B2400J54805i2581B633J57294N734k7260
15995A38401J5954l7641J71626A01323K92123M28182C91675M86205J70843p9259
15985I69464k14574j81523K8743j90204J46489j35347A3076K47030j05087J83989
15975C39008a1729D17599A5959J44033L6536a64443A34723E3611H127b17360A44804
15963C1555J67540I3174d3451A1500J79183R2539n9255o5547L23620A25034d4299
$$ plain form
15951 188351 217197 -84516 78667 66072 16882 342655 370708 -126293 -368318 -146920 222042
15939 277724 116811 16104 -48522 232638 22395 215415 -91824 288409 117231 103265
15929 103265 114026 86048 -92409 195851 -204252 9008 332728 347697 30163 -111818 -202314
15918 -202314 99390 91732 334602 149584 48076 -114494 96555 24462 378223 -96563 361095
15906 -15971 169739 -145789 35450 -14584 51051 38702 -6502 97496 55397 63099 -49922 37625
15893 -58790 164010 183817 -54552 -108416 -151265 101481 278519 -195281 100361 33964 57801
15882 57801 226546 15709 447948 198991 -166045 9506 -84503 -175046 33736 -8574 -85464
15871 -85464 -38839 248630 -149268 35029 -188375 10892 203202 68636 -153503 3157 -47286
$$ packed form
15951A88351K8846h4516G8667j2595A6882L25773K8053a26293k42025a46920B22042
15939B77724A16811A6104d8522B32638B2395J93020i1824B88409A17231j3966
15929A03265J0761k7978i2409A95851b04252I008L23720J4969C0163a11818r0496
15918b02314I9390p658K42870A49584D8076a14494I6555B4462L53761i6563C61095
15906a5971A69739a45789C5450a4584E1051j2349f502I7496m2099P702d9922C7625
15893e8790A64010J9807e4552n3864m2849A01481J77038a95281A00361C3964K3837
15882E7801J68745A5709M32239A98991a66045I506h4503r0543C3736h574p6890
15871h5464c8839B48630a49268C5029a88375A0892J92310F8636a53503C157d7286
$$ plain form
15859 65430 -41234 97640 117229 308710 -194826 -196733 122939 -55777 -158584 -47255 82647
15847 -100694 -93894 119482 8375 -104165 387316 23673 457144 -83951 -113414 -142055 25686
15835 -77646 139004 257279 -156940 49658 143001 -9626 -120251 110722 80157 -19952 -95438
15824 -95438 97125 37799 270532 -326710 -274612 356896 145613 252591 27860 29180 34453
15813 34453 -5498 -93291 -47445 -99611 -117681 25148 48385 -70581 276903 279698 -167126 -28972
15800 294737 -120029 168870 50361 54335 -214517 95183 73998 51116 71217 103039 17699
15788 -45687 -374453 -49746 10542 139233 -135679 -102985 82505 -28716 310636 321623 -8206
15776 -250077 139969 -139720 -153524 136141 241070 -115052 25641 29260 69763 -112379
$$ packed form
15859F5430d1234I7640J9589J91481a94826j907A22939e5777j02807d7255H2647
15847a00694O800A19482H375a04165C87316B3673M33471h3951k9463k8641B5686
15835g7646A39004J18275a56940D9658R3343i626j10625A10722l0565a9952p5486
15824i5438I7125C7799K32733c26710N2098C56896A45613J06978B7860J320N273
15813C4453e498q7793M5846n2166j8070B5148K3237g0581B76903K795a67126b8972
15800B94737a20029A68870E0361L974b14517I5183k1185k2882K0101L1822A7699
15788d5687l28766d9746A0542J28691a35679L2694H2505b8716C10636J0987h206
15776b50077A39969a39720j3804A36141J04929a15052B5641L619M0503a12379
$$ plain form
15765 -89323 -83430 -76413 142608 -281931 304358 170614 64882 228632 68863 -229138 -26488
15753 112169 -128365 -100185 190034 60676 211914 -311243 171582 300118 -45170 148412
15742 442525 -86790 172022 264211 68459 -93496 59292 11216 -298106 22395 -82995 -17945
15730 -184057 -267091 21047 12272 -130732 -25453 -49260 3119 -224840 6870 -13320 221981
15718 -99992 -44675 -203325 116027 -115874 -86564 108120 -226103 -63777 -104229 -46198 -95843
15707 -95843 -53061 55685 143957 -60549 223038 -4501 -22481 -399519 -63927 -147550 -88202
15696 -88202 -6904 -18335 7559 97745 213280 -5177 -70669 -197986 -281108 -123692 68727 -159635
15683 -7689 -223959 -8241 -167761 -44941 59374 -324961 -153152 288562 -56608 -182083 108976
$$ packed form
15765h9323N893P017A42608b81931C04358j33744F4882J63750F8863b29138b6488
15753A12169a28365K8180A90034F0676J51238c11243A71582J28536d5170A48412
15742D42525h6790A72022R2189F8459i3496E9292A1216b98106B2395h2995a7945
15730a84057q3034B1047q775a30732b5453k3807C119b24840F870a3320B21981
15718i9992d4675j58650A16027a15874K9310A08120b26103f3777m0452d6198m9645
15707i5843M2782E5685Q8272f0549B23038d501j7980l77038f3927q3623N9348
15696h8202f904j1431G559R0186J15535e177o5492j27317q3122a23692F8727a59635
15683g689k16270h241j59520d4941E9374c24961a53152B88562e6608j25475A08976
$$ plain form
15671 97892 32508 322964 209319 284397 86350 -239718 -136084 159812 185090 -44761 -150713
15660 -150713 16279 -294673 -229859 26507 49688 291203 264410 450727 -150069 -60462 80222
15648 297053 -51901 24551 -81061 259127 152299 -89142 62357 -70174 -243752 284394 -97320
15636 71822 280194 -37633 5051 -45370 -22581 269344 -56226 48747 111573 67499 79956
15625 79956 -66600 127847 -26953 -128030 -337591 196944 -203366 -338215 -37590 23492
15614 190850 79696 -131184 73080 378510 118790 102974 151002 -99877 -120009 89593 8003
15602 125240 155921 -113020 -215999 -74352 -334557 -292226 140428 149197 5968 -86375 114140
15590 62137 -137044 -186575 85358 -115885 -3693 -203013 354938 457436 -50887 -326407 51829
$$ packed form
15671I7892C2508K90456j13645P5078H6350b39718J03634A59812K5278d4761j05952
15660a50713A6279b94673O4814B6507K3181K41515k6793J86317a50069f0462H0222
15648B97053e1901B4551h1061B59127j06828h9142F2357g0174j73578B84394i7320
15636G1822K08372c7633E051d5370b2581B69344e6226D8747O2826m4074J2457
15625G9956f6600A27847b6953j01077k09561A96944b03366j34849c7590B3492
15614A90850G9696a31184G3080L05430A18790j5816M8028i9877k0132H9593H003
15602A25240L0681a13020j02979g4352k60205M2331A40428Q769E968h6375A14140
15590F2137a37044m9531H5358a15885c693j99320C54938J02498e0887k75520E1829
$$ plain form
15578 -205131 209747 -110244 43371 -35308 -271628 135565 236918 162036 113460 45613
15567 -27344 354690 184165 33065 255892 -93809 30719 107741 80055 246895 -133826 250216
15555 -226117 245863 -893 29986 -366269 30487 311864 103867 130105 -67345 24433 -134301
15543 -156142 228875 -45085 50991 -135223 -137142 124642 -40555 13548 -104344 65089 35924
15532 35924 66582 58048 40763 34946 73576 -310247 -2031 15331 -100295 56058 -112931 277792
15519 -43304 229090 -147840 144115 312612 -243066 -385515 -220844 -16685 89226 41197
15508 -80693 -90795 33827 80779 37667 83869 -71958 -202608 -207420 -134291 136508 -279028
15496 -49146 6369 -53971 -190272 303455 -277253 -124291 233074 -170533 157349 268942
$$ packed form
15578b05131B09747a10244D3371c5308k36320A35565J01353p4882m8576D5613
15567b7344C54690j70525C3065K22827i3809C0719P7022k7686J66840a33826B50216
15555b26117B45863h93B9986c66269C0487K81377A03867K6238f7345B4433a34301
15543a56142B28875d5085E0991a35223j919A24642d0555A3548a04344F5089k9165
15532C5924L0658q534j7285n817L8630c10247b031A5331a00295E6058a12931B77792
15519d3304B29090a47840A44115J68497b43066j42449J64671a6685H9226D1197
15508h0693j0102C3827M6952C7667M6202g1958j30650m812P3129A36508b79028
15496d9146F369e3971j36301C03455b77253a24291B33074a70533A57349J11593
$$ plain form
15486 268942 -166928 -89100 237215 24001 61434 67312 -167647 -31248 359576 202583 -207575
15474 262939 137527 26992 322911 -206415 19116 -309839 -173571 -37849 33788 197130
15464 197130 132513 77303 27142 42945 362576 3909 299448 -259418 -129212 226440 135527
15453 135527 168335 -238204 -38764 122058 -44429 471166 73106 315179 71175 255703
15443 255703 114546 315220 568298 271814 196289 -34633 228018 9082 -38740 -72449 -47576
15432 -47576 127151 56621 -173305 18561 -65843 18956 -22477 244292 195270 131075 255866
15421 255866 3613 92451 90770 236371 18223 150395 53800 -277055 -94299 37035 -57641
15409 142682 -25235 -3209 140324 143031 -64506 117852 -219642 -30355 -13738 -187884 -204102
$$ packed form
15486B68942a66928P7828B37215B4001L7433N878a67647c1248C59576j56993b07575
15474B62939j25412B6992K95919b06415A9116c09839J36268c7849C3788J63342
15464A97130o4617n5210B7142J5803L19631C909K95539b59418a29212B26440r0913
15453A35527L2808b38204c8764A22058d4429D71166G3106K42073G1175J84528
15443B55703A14546K00674K53078B71814p5525c4633B28018I082c8740l3709K4873
15432d7576A27151E6621a73305A8561f5843A8956b2477B44292m9022o4195J24791
15421B55866C613Q8838j681J45601A8223J32172E3800b77055i4299C7035e7641
15409A42682b5235c209A40324K707f4506A17852b19642c0355a3738j74146j6218
$$ plain form
15398 -204102 149373 -142605 36258 214525 -335151 -132019 -193462 470363 74651 66757
15388 66757 -8692 -104299 141263 235889 -28004 -30021 -2378 27611 -148321 -33250 -32809 -22629
15376 -22629 83108 110236 381131 32279 -109294 23284 -79709 156173 -109425 -121140 165789
15364 -69095 66905 -103336 258701 129312 -158434 277178 251578 312761 274338 133989
15353 147633 166494 357399 394725 230288 252177 394472 80320 13219 90714 -62701 -222592
15342 -222592 51268 307508 -49197 232068 132149 -79433 328259 127279 176266 -258102
15331 -70007 62086 -124162 -57735 16533 118902 136691 30739 43953 -237674 204120 206885
15320 206885 81615 -2229 164351 -57923 425823 14068 193773 60776 184867 75454 234155
$$ packed form
15398b04102A49373a42605C6258J78267c35151a32019o1443D70363G4651p894
15388F6757h692r5607A41263R4626b8004k017b378B7611a48321c3250M41J0180
15376b2629H3108K7128K70895C2279a09294B3284g9709A56173a09425j1715A65789
15364f9095F6905a03336B58701A29312a58434B77178k5600O1183l8423A33989
15353A47633J8861J90905L7326j64437K1889J42295H0320A3219P7495f2701j59891
15342b22592E1268K56240d9197B32068r9919g9433C28259A27279M8987b58102
15331g0007F2086a24162e7735A6533J02369J7789C0739J3214b37674B04120K765
15320B06885H1615b229A64351e7923D25823A4068J79705F0776J24091G5454J58701
$$ plain form
15309 234155 380548 363903 143412 430541 343305 287399 230175 312463 89310 355097 -194616
15297 -89222 -190128 -55078 -44930 -87511 88029 -63420 -41515 69339 197676 -275360 115138
15285 -152488 129219 -85410 256450 203014 118902 102535 12254 -197409 -164943 181239 163140
15274 163140 -214056 -144288 -235207 77950 66214 -13940 53994 276421 239368 231948 95929
15262 213723 -25836 -95092 41126 -52802 153361 278304 -36073 41212 -114764 323469 420472
15251 420472 333941 683057 1146323 1496231 1153959 1482418 1358080 435487 444522 157941
15240 50662 123367 447300 44537 49689 -200374 189531 107546 11387 155503 134117 241882
15229 241882 -89486 33695 29166 101359 60900 52291 487316 -178791 -529 -208803 251796
$$ packed form
15309B34155J46393j6645A43412K87129q7236n5906n7224Q2288H9310K65787a94616
15297h9222j00906e5078J0148m2581H8029f3420K1905F9339J28337b75360A15138
15285a52488A29219h5410B56450n3436q4112j6367A2254a97409L2466A81239j8099
15274A63140b14056O9768r0919G7950j1736a3940E3994K22427l7053p420I5929
15262B13723b5836o9256D1126e2802A53361J24943c6073D1212a14764C23469R7003
15251D20472q6531L49116M63266L49908l42272L28459j24338D35487R035A57941
15240E0662P2705L23933D4537N152b00374A89531q1985A1387J44116k1386J07765
15229B41882h9486C3695m529P2193m0459q609M35025a78791e29k08274B51796
$$ plain form
15217 147081 -7195 120205 63445 436955 335570 200125 470835 -72728 207749 117247
15207 117247 77895 100610 293811 -49629 -67472 -70208 242195 164055 -79833 -11456 35544
15195 125254 166443 46335 -40638 -13268 268583 164001 -28881 145358 -1587 317991 31474
15183 38280 -86733 -72681 20407 58387 191356 214678 -116830 -10504 26492 -190802 -7141
15171 58318 65258 -110177 172186 76665 211648 -186619 167308 52199 253539 261719 44395
15159 364821 -186909 163752 47223 214349 -316139 259386 -177713 -254527 283393 -108267
15148 112751 279318 -41581 -81635 107584 -47231 -14602 243878 7154 -24316 313774 235708
15137 235708 -166302 -111118 158399 -130440 355405 429307 142443 123618 -50475 87239
$$ packed form
15217A47081g195A20205n6760L73510j01385j35445K70710g2728B07749r0502
15207A17247l9352K2715J93201d9629j7843k736B42195p8140g9833a1456C5544
15195A25254M1189D6335d0638a3268B68583j04582b8881A45358a587C17991C1474
15183C8280h6733J4052B0407L7980J32969K3322a16830a0504B6492a90802g141
15171E8318O940a10177A72186G6665J34983a86619A67308E2199K01340Q180D4395
15159C64821a86909A63752D7223J67126c16139B59386a77713p6814B83393a08267
15148A12751J66567d1581m0054A07584d7231a4602B43878G154b4316C13774p8066
15137B35708a66302N5184A58399a30440C55405P3902A42443j8825e0475H7239
$$ plain form
15126 -82781 20981 33487 165248 344171 53412 484848 -4040 -51738 462042 -98152 116688
15114 -171218 168146 -68649 106107 231384 27963 -11325 187491 -2478 -89569 388703 164297
15102 214890 243471 -105133 186224 -112468 181716 229314 120770 282305 170251 9064
15091 123911 167464 91055 55784 95083 104176 77636 306740 183585 466234 -44527 109848
15079 339208 190809 -133580 -68618 -49006 40491 202293 101165 -137775 528075 154725
15068 76869 299152 7481 297215 246827 97543 -290325 135530 331268 207996 93143 275450
15057 275450 382524 196223 262526 268039 277577 111685 427312 483472 161104 298264 211014
15046 211014 401459 462974 289162 77431 195069 140500 137627 301962 543597 510699 489163
$$ packed form
15126h2781B0981J2506J31761J78923E3412M31436d040m7698D62042i8152A16688
15114a71218A68146f8649A06107J25277B7963a1325A87491b478q7091C88703A64297
15102B14890K8581a05133A86224a12468A81716M7598j08544J61535j12054I064
15091A23911M3553p6409l5271L9299R093k6540K29104j23155K82649d4527A09848
15079C39208j48399a33580O4962J9612D0491J61802j01128a37775E28075A54725
15068G6869K22283G481K89734n0388I7543b90325A35530J95738j23272I3143J82307
15057B75450J07074j86301O6303N513R538A11685L15627N6160A61104J37160q7250
15046B11014J90445O1515j73812G7431J17638n4569k873J64335K41635l2898k1536
$$ plain form
15035 489163 69860 448882 171519 588278 395649 440255 175258 357835 416007 334760
15025 334760 350675 450000 538826 369444 320474 112802 250225 63596 414574 566321
15015 566321 375344 729976 502402 377891 453553 418730 412181 223876 206093 484098
15005 484098 179215 450328 316671 138485 408258 417101 211012 251530 -129111 230284
14994 403713 406777 438883 575712 226389 298111 470748 415137 427363 176314 317245 194859
14983 194859 431475 23823 278261 189354 391602 540236 488898 329671 509356 578139
14973 578139 450081 401332 396506 589207 314379 294461 113461 658281 205578 630152
14963 630152 813515 348187 172057 398649 98862 723158 484455 33816 273223 195911
$$ packed form
15035D89163F9860L79022A71519M16759j92629M4606A75258J82577N8172q1247
15025C34760J5915R9325Q8826j69382m8970A12802J37423F3596L50978J51747
15015E66321j90977L54632k27574j24511P5662l4823o549j88305j7783K78005
15005D84098A79215K71113j33657A38485K69773Q843k06089M0518a29111B30284
14994D03713L064L2106J36829B26389P1722J72637n5611J2226A76314J40931j22386
14983A94859K36616B3823K54438q8907K02248J48634n1338j59227J79685O8783
14973E78139j28058m8749m826J92701k74828j9918A13461N44820B05578M24574
14963F30152J83363C48187A72057K26592I8862O24296k38703C3816K39407p7312
$$ plain form
14953 195911 341356 701302 213163 363209 166586 571489 -48545 438597 282220 356449
14943 356449 611111 562244 303054 149579 314583 671288 132633 478864 409013 660616
14933 660616 912660 756599 498757 823692 777377 795391 945786 744196 689654 791563
14923 791563 777093 739524 957169 819311 848524 968705 1067668 852028 1113346 895413
14913 895413 1044832 799198 124388 836488 387395 263751 34888 283387 382431 345210
14903 345210 313493 373084 514793 518710 551717 700554 399435 391483 148860 627278 352729
14892 352729 320956 414392 548477 295141 565858 581361 569448 855157 421029 637091
14882 637091 580417 635316 333259 368364 932857 514272 483016 736196 439249 484812
$$ packed form
14953A95911J45445L59946B13163J50046A66586M04903d8545D38597j56377P4229
14943C56449K54662m8867k59190A49579J65004L56705A32633L46231o9851K51603
14933F60616K52044j56061k57842L24935m6315J8014J50395k01590n4542J01909
14923G91563j4470l7569K17645j37858K9213J20181R8963k15640K61318k17933
14913H95413J49419k45634A24388P12100C87395j23644C4888K48499R9044l7221
14903C45210l1717N9591J41709L917L3007J48837l01119p952A48860M78418k74549
14892C52729l1773R3436J34085k53336K70717J5503j1913K85709D21029K16062
14882F37091n6674N4899l02057L5105N64493m18585l1256K53180k96947M5563
$$ plain form
14872 484812 433445 365477 433690 575821 479811 283751 597094 608943 469470 428161 301662
14861 301662 403797 418959 415580 297287 131663 359435 522044 692566 552870 172904
14850 670512 398846 407936 301270 529029 266148 524790 654691 799275 718065 531785
14840 531785 584800 676763 589391 1018716 746896 732026 47742 409033 296446 412266
14830 412266 614340 381884 544686 420594 743594 454052 400388 490572 829335 363081
14819 259415 516898 342910 713780 509816 419515 558822 411769 416588 628063 557739
14809 557739 701068 758770 462402 765968 276409 541816 402918 509170 720742 551861
14799 551861 547202 538806 777961 327850 579457 523795 811458 562660 552763 444852 301329
$$ packed form
14872D84812n1367o7968O8213J42131r6010j96060L13343J1849j39473m1309j26499
14861C01662J02135J5162l379j18293A31663K27772J62609J70522j39696A72904
14850F70512k71666R090j06666K27759k62881K58642J29901J44584q1210j86280
14840E31785N3015R1963q7372M29325k71820j4870D7742L61291j12587J15820
14830D12266K02074k32456J62802j24092L23000k89542n3664R0184L38763C63081
14819B59415K57483j73988L70870k03964r0301J39307j47053M819K11475p0324
14809E57739J43329N7702k96368L03566B76409K65407j38898J06252K11572j68881
14799E51861m659q396K39155C27850K51607n5662K87663k48798r897j07911j43523
$$ plain form
14788 301329 357987 529415 829047 491189 280067 675047 397745 704146 667635 580054
14778 580054 630966 456306 414527 494982 484846 822923 740573 600420 488598 1005689
14768 1005689 772356 511146 696770 759551 678852 1117115 412678 461213 744045 925686
14758 925686 528763 804606 544110 499307 561471 730682 625683 832680 786739 757787
14748 757787 706144 736509 973519 711931 687643 636771 892250 746285 818655 690765
14738 690765 444225 1087965 661044 763175 788913 908901 559148 908776 838109 738454
14728 738454 1083145 910598 826030 1144919 1111447 1039640 1152402 994439 1048066 1021451
14718 1021451 1171421 877532 1057993 850262 839422 988529 818255 820020 817389 956200
$$ packed form
14788C01329N6658J71428K99632l37858k11122L94980k77302L06401l6511q7581
14778E80054N0912j74660m1779Q0455j0136L38077q2350j40153j11822N17091
14768A005689k33333k61210J85624O2781q0699M38263D12678M8535K82832J81641
14758I25686l96923K75843k60496m4803O2164J69211j04999K06997m5941k8952
14748G57787n1643L0365K37010k61588k4288n0872K55479j45965P2370j27890
14738F90765k46540O43740m26921J02131K5738J19988l49753L49628p0667r9655
14728G38454L44691j72547q4568L18889l3472p1807J12762j57963N3627k6615
14718A021451J49970k93889J80461k07731j0840J49107j70274J765k631J38811
$$ plain form
14708 956200 692209 954661 1134514 952707 923166 916969 948251 1253645 1097304 1083593
14698 1083593 1212687 1094991 1317901 1514590 1225209 950432 909141 724609 787769 972266
14688 972266 652023 788207 987632 737376 824038 1176451 1116217 981694 816174 1134865
14678 1134865 1104776 907953 958677 1017648 908777 1003853 816063 940994 1100629 997328
14668 997328 795733 1005369 1028646 1020506 894324 1191872 995065 922679 1220595 1259384
14658 1259384 874957 1023118 1098646 1062480 1174084 1407848 1005458 1410179 846519 1003088
14648 1003088 1613407 1315780 1013370 1055019 1143379 1200632 1303679 1495026 1173001 1064638
14638 1064638 1313948 935741 1021480 953304 1350693 1257687 1276069 998061 1358494 1239591
$$ packed form
14708I56200k63991K62452J79853j81807k9541o197L1282L05394j56341j3711
14698A083593J29094j17696K22910J96689k89381k74777m1291j84532O3160J84497
14688I72266l20243J36184J99425k50256Q6662L52413o0234j34523j65520L18691
14678A134865l0089j96823N0724N8971j08871R5076j87790J24931J59635j03301
14668I97328k01595K09636K3277q140j26182K97548j96807p2386K97916L8789
14658A259384l84427J48161P5528l6166J11604K33764m02390M04721n63660J56569
14648A003088O10319k97627l02410M1649Q8360N7253J03047J91347l22025j08363
14638A064638K49310l78207Q5739o8176L97389r3006J8382k78008L60433j18903
$$ plain form
14628 1239591 1147544 1308007 1295407 1184589 1310014 1330292 1129924 1402689 1651847 1491359
14618 1491359 1380143 1353236 1566953 1438084 1382785 1432199 1361171 1438680 1483868 1420210 1592179
14607 1592179 1613597 1535940 1655383 1647715 1672416 1817310 1528389 1514650 1671518 1445965
14597 1445965 1907953 1345979 1712906 1617399 1724244 1494819 1888542 1729375 1795582 1781788
14587 1781788 1766259 1808863 1473729 1959243 1792263 1637794 1843165 2064921 1865437 2048206
14577 2048206 1975828 2157966 1517400 1950059 2163817 2348581 2236250 2163345 2196449 2227044
14567 2227044 2069784 2491101 2331273 2352224 2302403 3119282 2850288 2878111 2745353 2935295
14557 2935295 2607071 3293198 3301241 3685557 3859137 4261747 4810083 5771040 8071573 11646401
$$ packed form
14628A239591r2047J60463j2600j10818J25425K0278k00368K72765K49158j60488
14618A491359j11216k6907K13717j28869n5299M9414p1028P7509M5188o3658J71969
14607A592179K1418p7657J19443p668K4701J44894k88921j3739J56868k25553
14597A445965M61988n61974L66927r5507J06845k29425L93723j59167O6207j3794
14587A781788j5529M2604l35134M85514j66980j54469K05371K21756j99484J82769
14577B048206p2378J82138o40566M32659K13758J84764j12331p2905L3104L0595
14567B227044j57260M21317j59828K0951m9821Q16879k68994K7823j32758J89942
14557B935295l28224O86127Q043L84316J73580M02610N48336R60957K300533L574828
$$ plain form
14547 11646401 19111645 30757328 30575552 19676778 10590326 5969743 4074828 3049085
14539 3049085 2819881 2670734 2572499 2290466 2360866 2340890 2375710 2432717 2481371 2295882
14529 2295882 2401335 2518845 2095233 2360687 2224135 2610786 2172539 2556988 2407808
14520 2407808 2688686 2443697 2274371 2568398 2836421 2683379 2816838 2661386 2722058 2790075
14510 2790075 2555932 2966488 2783832 3220894 2916851 3199761 2917621 3027804 2767427
14501 2767427 2912083 2959960 3078962 3125598 3290296 2888459 3496404 3351445 3098363 3460633
14491 3460633 3598987 3364302 3285938 3628177 3688702 3387616 3691464 3711622 3835461 3839409
14481 3839409 4072064 3598286 3880508 3980908 3799832 4053099 3889676 4417500 4230470
$$ packed form
14547A1646401P465244J1645683j81776j0898774r086452m620583j894915j025743
14539C049085k29204j49147r8235k82033P0400j9976L4820N7007M8654j85489
14529B295882J05453J17510m23612K65454j36552L86651m38247L84449j49180
14520B407808K80878k44989j69326K94027K68023j53042J33459j55452O0672O8017
14510B790075k34143M10556j82656M37062l04043K82910k82140J10183k60377
14501B767427J44656M7877J19002M6636J64698m01837O07945j44959k53082L62270
14491C460633J38354k34685p8364L42239O0525l01086L03848K0158J23839L948
14481C839409K32655m73778K82222J00400j81076K53267j63423N27824j87030
$$ plain form
14472 4230470 4147548 4049585 4049490 4018462 4246186 4376854 4291665 4533484 4489092 4773431 5011070
14461 5011070 4658200 4575155 4644925 4698178 4440983 5074151 5218391 4893080 5398267 5359879
14451 5359879 5383850 5470378 5242479 5494237 5759624 6003343 5586839 5734584 5838049 5778648
14441 5778648 5703709 5967117 5793253 6216639 6132854 6660252 6106390 6426044 6570479 6519239
14431 6519239 6592906 6931569 6810447 6750587 6826497 6938371 6974012 7099751 7505544 7548245
14421 7548245 7469567 7472549 7802146 7629631 8306225 8313599 8287872 8225268 8602508 8760499 8391023
14410 8391023 8768246 8815338 8888513 9094084 9502201 9442298 9526922 10112191 10014409 10382882
14400 10382882 10417088 10182623 10484475 10627873 10834537 10526310 11229063 11195563 11740841 11568291
$$ packed form
14472D230470q2922r7963r5l1028K27724J30668q5189K41819m4392K84339K37639
14461E011070l52870q3045O9770N3253k57195O33168J44240l25311N05187l8388
14451E359879K3971Q6528k27899K51758K65387K43719m16504J47745J03465n9401
14441E778648p4939K63408j73864M23386q3785N27398n53862L19654J44435n1240
14431F519239P3667L38663j21122n9860P5910J11874L5641J25739M05793M2701
14421G548245p8678K982L29597j72515O76594P374k5727o2604L77240J57991l69476
14410H391023L77223M7092P3175K05571M08117n9903Q4624N85269r7782L68473
14400A0382882L4206k34465L01852J43398K06664l08227P02753l3500N45278j72550
$$ plain form
14390 11568291 11699802 11994183 12254095 12142754 12271294 12635182 13267014 13479117 13414001
14381 13414001 14059809 13704974 14364963 14616401 14754596 15265016 15218304 15536143 15955993
14372 15955993 16166707 16532817 16668784 17363801 17687305 17378029 17904052 18437058 18973784
14363 18973784 19399555 19518293 20232706 20490755 20701880 21387150 21999281 22460144 22599028
14354 22599028 23339693 24004736 24242059 25026267 25289520 25709342 26392625 27282222 28039445
14345 28039445 28645782 29070918 29889763 30691413 31371906 32302254 33031594 33880273 35077139
14336 35077139 35884967 36807113 37769685 38844062 40145115 41239682 42111745 43827216 45149573
14327 45149573 46586913 48326227 49442167 51025578 53086353 54868666 56561844 58699405
$$ packed form
14390A1568291J31511K94381K59912j11341J28540L63888O31832K12103o5116
14381A3414001O45808l54835O59989K51438J38195N10420m6712L17839M19850
14372A5955993K10714L66110J35967O95017L23504l09276N26023N33006N36726
14363A8973784M25771J18738P14413K58049K11125O85270O12131M60863J38884
14354B2599028P40665O65043K37323P84208K63253M19822O83283Q89597P57223
14345B8039445O06337M25136Q18845Q01650O80493R30348P29340Q48679J196866
14336C5077139Q07828R22146R62572J074377J301053J094567Q72063J715471J322357
14327D5149573J437340J739314J115940J583411K060775J782313J693178K137561
$$ plain form
14319 58699405 60160703 62564798 64726914 67277736 69774624 72125986 75088646 78057772
14311 78057772 81513126 84766357 88085869 92032471 95923938 99653516 104383209 108597491
14303 108597491 113432815 118636434 123674597 129504605 135427611 141794154 148564223 155986588
14295 155986588 163686023 171563564 180159929 189480847 198946592 209103531 220381759 231526703
14287 231526703 243212012 255417274 267693573 281020968 294885168 309142854 323266847
14280 323266847 337981054 352939152 367053163 380958027 393987251 405490291 415842654
14273 415842654 422599726 425676112 426580080 428085571 427224841 419599228 415093748 408955752
14265 408955752 400747127 390078450 377678672 364393062 350478167 336544416 323275750
$$ packed form
14319E8699405J461298K404095K162116K550822K496888K351362K962660K969126
14311G8057772L455354L253231L319512L946602L891467L729578M729693M214282
14303A08597491M835324N203619N038163N830008N923006O366543O770069P422365
14295A55986588P699435P877541Q596365R320918R465745J0156939J1278228J1144944
14287B31526703J1685309J2205262J2276299J3327395J3864200J4257686J4123993
14280C23266847J4714207J4958098J4114011J3904864J3029224J1503040J0352363
14273D15842654O757072L076386R03968J505491q60730p625613m505480o137996
14265D08955752q208625j0668677j2399778j3285610j3914895j3933751j3268666
$$ plain form
14258 323275750 309897767 296782402 283287922 269984396 258139493 245240732 232525304
14251 232525304 220102123 208090624 197019053 186418172 176871541 167091821 158984862
14244 158984862 150956987 143460910 136475086 129439839 123547615 117869924 112561715 107208015
14236 107208015 102704183 97983168 93441689 89662243 86127965 82617140 79467570 75844476
14228 75844476 73438619 70252753 67516784 64975565 62406638 60543114 58087759 56211195
14220 56211195 54126312 52706132 50560544 48794267 47352341 46075017 44789263 43282449
14212 43282449 41828647 40486024 39187348 37899276 37477195 36399948 35208926 34260237
14204 34260237 33338147 32285679 31393208 30708820 30224483 29061664 28645784 27574846 26641206
$$ packed form
14258C23275750j3377983j3115365j3494480j3303526j1844903j2898761j2715428
14251B32525304j2423181j2011499j1071571j0600881r546631r779720q106959
14244A58984862q027875p496077o985824p035247n892224n677691n308209n353700
14236A07208015m503832m721015m541479l779446l534278l510825l149570l623094
14228G5844476k405857l185866k735969k541219k568927j863524k455355j876564
14220E6211195k084883j420180k145588j766277j441926j277324j285754j506814
14212D3282449j453802j342623j298676j288072m22081j077247j191022r48689
14204C4260237r22090j052468q92471o84388m84337j162819m15880j070938r33640
$$ plain form
14195 26641206 26135356 25585091 24948005 24455309 23733366 23102402 22445918 21716429 21316717
14186 21316717 21122469 20513785 20071158 19566460 18920961 18646126 18446233 17760311 17488560
14177 17488560 17100685 16893643 16581744 16071486 15873399 15737582 15088919 14878359 14993753
14168 14993753 14309574 14027550 14034471 13685105 13528061 12942799 12825935 12666514 12654644 12265409
14158 12265409 12218221 11497787 11280921 11510537 11136273 11227961 10785429 10412129 10325831 10259539
14148 10259539 10341600 9932014 9996010 9650553 9434205 9469429 9108784 9327203 8920313 8580287
14138 8580287 8648506 8421320 8511510 8221637 8279844 8164474 8155845 7737991 7534440 7545629
14128 7545629 7555837 7361739 7130507 7272264 7191866 6750732 6944104 6892811 6656670 6625299
$$ packed form
14195B6641206n05850n50265o37086m92696p21943o30964o56484p29489l99712
14186B1316717j94248o08684m42627n04698o45499k74835j99893o85922k71751
14177A7488560l87875k07042l11899n10258j98087j35817o48663k10560J15394
14168A4993753o84179k82024O921l49366j57044n85262j16864j59421j1870l89235
14158A2265409m7188p20434k16866K29616l74264R1688m42532l73300q6298o6292
14148A0259539Q2061m09586O3996l45457k16348L5224l60645K18419m06890l40026
14138H580287O8219k27186R0190k89873N8207j15370q629m17854k03551J1189
14128G545629J0208j94098k31232J41757q0398m41134J93372n1293k36141l1371
$$ plain form
14118 6625299 6343830 6547279 6492531 6252047 6384924 6298380 5937149 5838442 5652281 5890232
14108 5890232 5853276 5572520 5725026 5523486 5453377 5461252 5468635 5349660 5159858 5141329 5155853
14097 5155853 5144023 4755516 4911176 4736369 4858940 4902832 4303481 4595310 4505407 4331357
14087 4331357 4355209 4307105 4390470 4189052 4214689 4410154 4529684 4032779 3941093 3837080
14077 3837080 4058934 3743400 4083643 3865631 3919653 3617615 4008508 3721659 3794469 3764802
14067 3764802 4051098 3699055 3504004 3761190 3689081 3715574 3395983 4027958 3653413 3183075
14057 3183075 3559262 3348872 3207474 3340944 3536937 3097551 3135647 3203202 2836250 2994012
14047 2994012 2917833 3259756 3004440 2796332 2877376 3136059 3065058 3023222 2597249 2726843
$$ packed form
14118F625299k81469K03449n4748k40484J32877q6544l61231r8707j86161K37951
14108E890232l6956k80756J52506k01540p0109P875P383j18975j89802j8529J4524
14097E155853j1830l88507J55660j74807J22571M3892n99351K91829q9903j74050
14087D331357K3852m8104Q3365k01418K5637J95465J19530m96905r1686j04013
14077C837080K21854l15534L40243k18012N4022l02038L90893k86849P2810k9667
14067C764802K86296l52043j95051K57186p2109K6493l19591O31975l74545m70338
14057C183075L76187k10390j41398J33470J95993m39386L8096O7555l66952J57762
14047B994012p6179L41923k55316k08108Q1044K58683p1001m1836m25973J29594
$$ plain form
14037 2726843 2721374 2852012 2803031 2837767 3010780 2885011 3044191 2959617 2607821 2672287
14027 2672287 2512617 2698435 2430470 2131147 2580475 2333979 2356537 2382687 2467479 2353821
14017 2353821 2624545 2340209 2103022 2408799 2031369 2383666 2549720 2122045 2227885
14008 2227885 2240212 2168521 2008910 2508214 2137753 2130607 2176116 2198781 2061708 2186027
13998 2186027 1837263 2143978 2142621 1940395 1865569 2219720 2519365 2588349 2855451 3856642
13988 3856642 6463777 12298914 23346771 31909119 21749587 13556151 8919191 6478868
13980 6478868 5018447 4268741 3732387 3793426 3172369 2843420 2611847 2512018 2443517 2005552
13970 2005552 2242639 2223358 2105761 1969635 1941433 2224291 2096517 1804161 2123840 1823372
$$ packed form
14037B726843n469J30638m8981L4736J73013j25769J59180q4574l51796O4466
14027B672287j59670J85818k67965k99323M49328k46496K2558K6150Q4792j13658
14017B353821K70724k84336k37187L05777l77430L52297J66054m27675J05840
14008B227885J2327p1691j59611M99304l70461p146M5509K2665j37073J24319
13998B186027l48764L06715j357k02226p4826L54151K99645O8984K67102J001191
13988C856642K607135N835137J1047857Q562348j0159532q193436m636960k440323
13980F478868j460421p49706n36354O1039o21057l28949k31573r9829o8501m37965
13970B005552K37087j9281j17597j36126k8202K82858j27774k92356L19679l00468
$$ plain form
13960 1823372 2105498 2121033 1738506 1914336 1696738 1698736 1913253 1821875 1588246 1635569
13950 1635569 1831402 1913907 1602210 1359668 1551858 1657491 1623499 1726121 1543053 1605121
13940 1605121 1505323 1475225 1476253 1432936 1541718 1463989 1506249 1360406 1460083 1588381 1296974
13929 1296974 1294242 1232799 1570821 1292557 1590114 1395825 1314531 1577846 1258900 1684899
13919 1684899 1565839 1350421 1416794 1356724 1231685 1536948 1431605 1537008 1360085 1245049
13909 1245049 1127806 1290527 1215816 1434512 1084627 962232 848525 1146638 1321673 1322300
13899 1322300 1063946 1207530 985465 950531 1017712 1302180 1271578 1258124 1085998 960315
13889 960315 1232064 1025703 1067410 992993 992854 1180507 1089889 1008523 1514056 1031085 601797
$$ packed form
13960A823372K82126J5535l82527J75830k17598J998K14517r1378k33629M7323
13950A635569J95833Q2505l11697k42542J92190J05633l3992J02622j83068O2068
13940A605121r9798l0098J028m3317J08782p7729M2260j45843R9677J28298k91407
13929A296974k732o1443L38022k78264K97557j94289q1294K63315l18946M25999
13919A684899j19060k15418O6373o0070j25039L05263j05343J05403j76923j15036
13909A245049j17243J62721p4711K18696l49885j22395j13707K98113J75035O27
13899A322300k58354J43584k22065l4934O7181K84468l0602j3454j72126j25683
13889I60315K71749k06361M1707p4417j39J87653r0618q1366N05533m82971m29288
$$ plain form
13878 601797 1333445 1067444 874988 936967 787832 1017652 678374 667207 1150550 1079999
13868 1079999 826916 1069480 1084605 1072685 1177169 885648 926666 1295623 938512 976464
13858 976464 802054 853305 649980 747823 966813 946611 917860 847153 1003249 791919
13848 791919 776764 650121 860677 791500 547898 791229 862631 1111385 699957 654096
13838 654096 791645 852405 731897 927550 646210 624761 849291 534307 754571 919225
13828 919225 611016 772045 824632 987939 593664 888205 907481 569150 909452 659850
13818 659850 1070483 813810 982263 897681 674477 665837 685163 788323 555687 313812
13808 313812 728689 789862 842818 658228 953718 572926 499099 796220 702135 635052
$$ packed form
13878F01797P31648k66001j92456O1979j49135K29820l39278j1167M83343p0551
13868A079999k53083K42564J5125j1920J04484k91521M1018L68957l57111L7952
13858I76464j74410N1251k03325R7843K18990k0202k8751p0707J56096k11330
13848G91919j5155j26643K10556o9177k43602K43331P1402K48754m11428m5861
13838F54096J37549O0760j20508J95653k81340k1449K24530l14984K20264J64654
13828I19225l08209J61029N2587J63307l94275K94541J9276l38331L40302k49602
13818F59850M10633k56673J68453q4582k23204q640J9326J03160k32636k41875
13808C13812M14877O1173N2956j84590K95490l80792p3827K97121r4085o7083
$$ plain form
13798 635052 671174 694403 805134 721794 573131 1036794 842980 730085 694602 606436
13788 606436 492401 466133 637739 632682 795925 539298 709449 605712 868553 797088
13778 797088 672737 495559 674908 486109 799001 633471 696012 353924 720939 428245
13768 428245 817349 817602 642053 632537 654656 587278 652955 652805 573686 500080 671118 689336
13756 689336 593473 356060 550053 447671 450984 700522 473196 636414 571476 637427
13746 637427 421745 457554 449935 245760 431260 470459 592603 814965 174446 700504
13736 700504 329499 764738 397910 483142 795790 351650 661918 515028 610419 691543
13726 691543 610664 210447 408811 450854 644563 501894 701633 766055 457078 623309
$$ packed form
13798F35052L6122K3229J10731q3340j48663M63663j93814j12895l5483q8166
13788F06436j14035k6268J71606n057J63243k56627J70151j03737K62841p1465
13778G97088j24351j77178J79349j88799L12892j65530O2541l42088L67015k92694
13768D28245L89104K53j75549r516K2119o7378O5677j50p9119p3606J71038J8218
13756F89336r5863k37413J93993j02382L313K49538k27326J63218o4938O5951
13746F37427k15682L5809p619k04175J85500L9199J22144K22362A74446N26058
13736G00504C29499M35239l66828Q5232L12648C51650L10268j46890R5391Q1124
13726F91543q0879B10447J98364M2043J93709j42669J99739O4422l08977J66231
$$ plain form
13716 623309 313659 528497 455871 99210 664834 526317 314696 610207 587192 683638
13706 683638 847435 659031 332567 462167 597244 336474 479086 489725 565588 423208
13696 423208 764305 397430 238267 820857 374941 677817 281015 388690 406766 313281
13686 313281 594322 347408 834329 286490 600894 506778 313206 175729 529532 578223
13676 578223 536888 440737 703767 720572 490739 285722 642221 194730 294881 391649
13666 391649 496512 261583 246536 289496 199550 465456 835239 259298 471894 355353
13656 355353 560330 408129 506216 749211 531582 480575 -56154 180341 419596 247401
13646 247401 361542 276857 411051 48064 311230 220649 326600 387951 290521 498119
$$ packed form
13716F23309l09650K14838p2626I9210N65624j38517k11621K95511k3015R6446
13706F83638J63797j88404l26464J29600J35077k60770J42612J0639P5863j42380
13696D23208L41097l66875j59163N82590C74941L02876B81015J07675J8076r3485
13686C13281K81041k46914M86921B86490L14404r4116j93572j37477L53803M8691
13676E78223m1335r6151K63030J6805k29833k05017L56499A94730J00151R6768
13666C91649J04863k34929j5047M2960q9946K65906L69783B59298K12596j16541
13656C55353K04977j52201R8087K42995k17629n1007e6154A80341K39255j72195
13646B47401J14141q4685J34194D8064K63166r0581J05951O1351r7430K07598
$$ plain form
13636 498119 455910 710409 243290 572175 376730 68374 275535 276366 362069 481601 533646
13625 533646 684194 264666 214959 293610 291098 425395 259664 509574 533970 142852
13614 224984 178313 557427 84424 379000 358767 258398 54761 109771 503889 438638 294914
13603 294914 55909 316188 143045 192006 238568 264292 231045 305258 523977 207247 407887
13592 407887 -82 200137 281592 357004 369543 -202646 644801 366044 373776 297738 91974
13580 232228 236688 770011 214229 180019 433032 300823 333291 -36749 118061 -122917
13569 444317 286133 8579 161211 188151 187967 369204 60129 462138 673803 428906 184758
13557 -34549 328706 573421 92191 198361 124589 395835 168973 -138137 488769 260446
$$ packed form
13636D98119m2209K54499B43290L28885j95445F8374K07161Q31Q5703J19532N2045
13625E33646J50548B64666m9707P8651k512J34297j65731K49910K4396A42852
13614B24984m6671L79114H4424K94576k0233j00369E4761N5010L94118o5251j43724
13603B94914E5909K60279A43045M8961M6562K5724l3247P4213K18719B07247K00640
13592D07887h2B00137Q1455P5412J2539b02646F44801k78757P732p6038I1974
13580B32228M460N33323B14229l4210K53013j32209L2468c6749A18061a22917
13569D44317j58184H579J52632K6940j84J81237F0129M02009K11665k44897A84758
13557c4549C28706K44715I2191J06170p3772K71246A68973a38137D88769k28323
$$ plain form
13547 260446 161333 452320 178397 651819 191396 203624 480722 532799 362 383103 332237
13536 332237 235277 65221 298758 278360 259459 374023 265822 112803 98162 -24242 185423
13524 321524 6454 153649 357078 345900 165868 204705 50125 307572 389899 47670 78989
13513 78989 293558 390833 41430 321840 347113 360529 394245 25796 140646 368002 364907
13502 364907 30796 425972 242832 584597 -228863 187445 -27693 -161250 123367 267006
13492 267006 46613 334827 11048 368567 298989 80970 263110 311853 292389 197795 96678
13480 492008 365121 358357 211415 33599 387412 244937 575168 105295 183993 -140796
13469 101854 230442 279259 252076 144939 463122 305084 317955 264755 182397 142513 168982
$$ packed form
13547B60446r9113K90987A78397M73422A91396J2228K77098N2077C62L82741n0866
13536C32237r6960F5221K33537k0398j8901J14564j08201A12803j4641b4242A85423
13524C21524F454J47195K03429j1178A65868L8837E0125K57447Q2327D7670L1319
13513G8989K14569R7275D1430K80410K5273J3416L3716B5796J14850K27356l095
13502C64907C0796L95176j83140L41765b28863A87445b7693j33557A23367J43639
13492B67006D6613K88214A1048L57519o9578H0970J82140M8743j9464r4594I6678
13480D92008j26887o764j46942C3599L53813j42475L30231A05295P8698a40796
13469A01854J28588M8817k7183j07137L18183j58038J2871n3200q2358l9884K6469
$$ plain form
13458 168982 59438 124597 -55907 249100 428405 42830 310672 197570 408572 90773
13447 97710 35820 291193 175126 -173196 264001 390415 21116 818345 51915 416933
13437 416933 233076 102119 241885 135020 47645 345005 257063 -22449 378816 341269
13427 341269 451071 33637 -46135 45564 182525 177392 435898 -61480 203853 192910 256132
13416 256132 445217 107469 -1696 157131 70045 404757 52744 34015 434854 405144 -41981
13404 101310 385864 210058 -11274 447726 110933 559453 -163204 144617 189559 -166554
13393 274296 206524 181172 296387 272939 302362 210569 -29103 -337457 197368 249839 361498
13382 361498 198436 -146347 377305 463356 -176747 -13362 174919 236109 425735 175871
$$ packed form
13458A68982E9438O5159e5907B49100J79305D2830K67842j13102K11002I0773
13447I7710C5820K55373j16067a73196B64001J26414B1116P97229E1915L65018
13437D16933j83857A02119J39766j06865D7645K97360q7942b2449C78816l7547
13427C41269J09802C3637d6135D5564J36961n133K58506f1480B03853j0943O3222
13416B56132J89085A07469a696A57131G0045L34712E2744j8729M00839k9710d1981
13404A01310K84554j75806a1274D47726A10933M48520a63204A44617M4942a66554
13393B74296o7772k5352J15215k3448K9423r1793b9103l08354A97368N2471J11659
13382C61498j63062a46347C77305Q6051a76747a3362A74919O1190J89626A75871
$$ plain form
13371 -96081 165873 98909 -190621 412420 -5084 -20993 266230 271676 230577 -180522 180423
13359 260459 261123 185141 232643 44323 -114713 83759 -30998 143313 -203770 141941 319283
13348 319283 192075 68767 315127 227395 343588 276310 139927 468892 147060 328499
13338 328499 396525 286704 385192 -106321 477298 -48914 275091 200520 520120 266803
13328 266803 305260 96920 239787 68665 150984 45935 128245 1517 143651 392447 185191
13316 381663 276525 48382 364087 346703 257522 247029 188908 159262 323803 55906 15621
13304 -155346 263790 110862 34066 140726 259811 346261 -23316 174017 431209 315775
13294 315775 160757 203644 8047 193065 323419 -28495 38407 32923 -56017 -27559 12900
$$ packed form
13371i6081A65873o6964a90621D12420e084j5909B66230N446m1099a80522A80423
13359B60459O64p5982M7502D4323a14713H3759c0998A43313b03770A41941J77342
13348C19283j27208F8767K46360q7732J16193o7278j36383L28965A47060J81439
13338C28499O8026j09821R8488a06321D77298d8914B75091p4571L19600k53317
13328B66803L8457I6920J42867F8665Q2319D5935Q2310A517J42134K48796A85191
13316C81663j05138D8382L15705j7384q9181j0493n8121k9646J64541E5906A5621
13304a55346B63790A10862C4066J06660J19085Q6450b3316A74017K57192j15434
13294C15775j55018M2887H047J85018J30354b8495C8407n484e6017b7559A2900
$$ plain form
13282 18401 62754 279219 226894 75290 45072 275892 -173894 213381 275516 -194593 109486
13270 132892 113764 73514 -65186 262375 600729 259974 171376 -74367 -12504 -125902 463202
13258 29199 22288 341024 354987 229278 314715 54314 -71651 -46559 -78718 -73396 238333
13246 4969 24549 160930 13967 198600 60511 35771 20054 -162283 345008 -327392 248796
13234 -60235 -19466 -76755 169355 291138 61163 151940 288798 65418 239711 273614 -174943
13222 177270 277581 -94907 196237 -119579 -5409 296059 365102 125807 230140 291676
13212 291676 -134002 104443 184886 256595 244890 -126645 -25609 107339 261425 -223212
13201 30639 100803 15002 -42578 216224 116811 -48348 81964 303772 345397 -81666 32154
$$ packed form
13282A8401M4353K16465n2325G5290l0218K30820a73894B13381O2135a94593A09486
13270A32892j9128m0250f5186B62375L38354B59974q8598g4367a2504j13398D63202
13258B9199o911L18736J3963j25709Q5437E4314g1651K5092l2159N322B38333
13246D969J9580J36381A3967J84633F0511k4740j5717a62283C45008c27392B48796
13234f0235a9466n7289A69355J21783F1163R0777J36858F5418J74293L3903a74943
13222A77270J00311i4907A96237a19579e409B96059O9043A25807J04333O1536
13212B91676a34002A04443Q0443P1709j1705a26645b5609A07339J54086b23212
13201C0639P0164A5002d2578B16224r9413d8348H1964K21808M1625h1666C2154
$$ plain form
13189 152191 209330 163884 107139 60914 7971 -285459 61268 9157 94546 102500 176050 575539
13177 575539 67533 121130 -92713 -57944 80777 108665 34371 -154600 59927 64020 24767
13165 -30516 -26172 88289 313364 230236 79359 -132579 241048 150052 -95073 57415 226857
13154 226857 175790 186943 304476 598715 222776 18008 239800 121504 173992 -74991
13143 145490 127612 9157 -60114 -294744 -279808 55499 -76399 8555 77281 -73453 -194228
13132 -194228 106721 142 378308 -29387 311011 146388 118657 -32592 -53312 320196 160598
13121 160598 149329 29319 158688 87050 -16408 216606 -21058 118735 -122732 422317
13110 161358 192896 310980 51760 -154783 -163917 171277 3799 -165910 350656 37505 28348
$$ packed form
13189A52191N7139m5446n6745m6225G971b85459F1268I157Q5389P954P3550L99489
13177E75539F7533N3597i2713L4769H0777K7888C4371a54600E9927M093B4767
13165c0516M344H8289K25075q3128G9359a32579B41048r0996i5073E7415J69442
13154B26857n1067J1153J17533K94239B22776A8008K21792j18296N2488g4991
13143A45490j7878I157f0114k34630J4936E5499g6399H555O8726g3453j20775
13132a94228A06721A42L78166b9387C11011A46388k7731c2592k0720C20196j59598
13121A60598j1269B9319J29369p1638a6408B16606b1058A18735a22732D22317
13110A61358L1538J18084E1760a54783r134A71277C799a65910C50656C7505r157
$$ plain form
13099 28348 84000 -232434 208591 104218 -81226 115577 30811 163665 -172548 -177928 -208013
13088 -208013 40166 109557 -50260 111273 -208645 45751 37999 -88252 151374 -58912 343175
13076 132178 71297 163157 5950 -42012 43367 181748 51503 -55686 51689 139753 -63474
13064 157732 2056 -132386 83860 -74693 6125 175216 98312 -105556 -16247 207822 745
13052 71792 233317 -114088 -86936 124675 -320367 -129155 274427 148190 52579 250938
13042 250938 -65925 44188 56306 228813 -85742 328418 -175899 25674 139869 -226865
13031 50105 160910 -119227 238414 106385 -196703 40260 375313 5086 41429 237297
13021 237297 30810 -98085 142978 78470 207787 164781 140797 -3942 -202930 100208 29202
$$ packed form
13099B8348N5652b32434B08591A04218h1226A15577C0811J32854a72548n380l0085
13088b08013D0166O9391e0260A11273b08645D5751p752h8252A51374e8912C43175
13076A32178o0881R1860E950d2012D3367J38381E1503e5686E1689Q8064f3474
13064A57732B056a32386H3860g4693F125J69091p6904a05556a6247B07822G45
13052G1792J61525a14088K7152A24675c20367a29155B74427j26237E2579J98359
13042B50938f5925D4188J2118J72507h5742C28418a75899B5674J14195b26865
13031E0105J10805a19227B38414A06385a96703D0260L35053E086L6343J95868
13021B37297C0810i8085A42978o4508J29317m3006k3984c942j98988A00208B9202
$$ plain form
13009 71274 210932 -103258 -46996 -2323 -192594 57709 -66660 -63660 163373 153315 282068
12998 282068 103925 -32773 56830 56409 65184 27957 104777 230448 100318 53195 -71949
12986 -124346 34499 -179777 -100200 -112503 103853 -48002 177305 -43928 142752 -352220
12975 -186456 271359 110362 11211 -92984 -108517 77227 -194609 -148530 -28599 -121893 112300
12963 23405 29889 277664 329330 4342 76844 244032 181110 193668 106431 376653 102930
12951 42293 -12236 172745 17651 158220 29817 191234 249062 213418 308169 100990 -154653
12939 23295 36335 -6488 89671 41082 104455 140421 -56738 -66009 -97854 17162 196626 -212435
12926 -79074 -6371 -82650 17092 48782 1337 -147871 113869 -13640 -111814 106311 -76221
$$ packed form
13009G1274J39658a03258d6996b323j90271E7709f6660L000A63373j0058J28753
12998B82068A03925c2773E6830m21Q775B7957P6820J25671A00318m7123g1949
12986a24346C4499a79777P9577j2303A03853d8002A77305d3928A42752c52220
12975a86456B71359A10362A1211i2984j5533G7227a94609M6079b8599r3294A12300
12963B3405O484K47775N1666D342P2502J67188o2922J2558q7237K70222A02930
12951D2293a2236A72745A7651J40569B9817J61417N7828l5644R4751A00990a54653
12939B3295J3040f488H9671D1082O3373L5966e6738r271l1845A7162J79464b12435
12926g9074f371p6279A7092L1690A337a47871A13869a3640r8174A06311g6221
$$ plain form
12914 -33065 48109 -164246 282411 -81691 -25440 231269 -99158 -150503 -32315 -216266 -180479
12903 -180479 -2582 23311 121179 73855 -99938 -8982 164339 -234191 -24918 299903 302539
12892 302539 31568 232968 -25924 131515 120896 258 43907 236272 -220600 -280772 -85220
12880 172020 267082 -100908 -94535 -80653 16924 -230209 75489 279475 8090 -14723 179671
12868 -46193 -110716 29169 -36716 44789 46871 68234 -109010 -88617 -236701 -73851 -1176 -47769
12856 -47769 211741 79368 317005 44826 -248253 -43019 -328592 -131112 -166488 -30479 81018
12844 89435 11049 92305 26034 52716 -20373 42906 91171 219943 362385 -103293 -28903
12832 -198482 -156594 -84732 -31395 337889 306711 -115640 -235451 250308 -259314 73420
$$ packed form
12914c3065D8109a64246B82411h1691b5440B31269i9158n1345c2315j83951L5787
12903a80479b582B3311R7868m7324i9938h982A64339b34191b4918B99903K636
12892C02539C1568K01400b5924A31515j0619B58M3649J92365b20600o0172h5220
12880A72020R5062a00908O373J3882A6924b30209G5489K03986H090a4723A79671
12868d6193o4523B9169c6716D4789K082K1363a09010K0393j48084g3851a176m6593
12856d7769B11741G9368K37637D4826b48253d3019k85573a31112l5376c0479H1018
12844H9435A1049Q1256B6034K6682b0373D2906M8265J28772J42442a03293b8903
12832a98482M1888P1862c1395C37889l1178a15640j19811B50308b59314G3420
$$ plain form
12821 -25049 246064 -86584 -324339 -23353 7241 84862 42728 -209679 82379 -72684 224583
12809 -33738 136978 128020 -130726 10185 40547 262437 -172895 -112511 -171489 171125 -36513
12797 114870 -43094 -84154 255543 217636 -58880 -70225 124606 99977 -26525 -120149 -269376
12786 -269376 67522 -161696 -420965 -8726 -115268 -52610 -25020 -298453 32747 -307232 -289
12774 -69292 -263411 45787 11134 -37274 -20380 89702 69709 -245940 20843 -93912 245858
12762 -189172 -283293 -155057 -52382 -209472 -71272 56704 -174379 -171372 141968 33174 511331
12751 511331 22915 270576 113664 -246644 18205 -74612 266872 -302574 -151774 -21092
12740 274740 265943 -180452 -51629 176609 -20070 -203284 -56777 417927 -84088 -84658 277649
$$ packed form
12821b5049B46064h6584k37755b3353G241P7621m2134b09679H2379g2684B24583
12809c3738A36978q958a30726A0185L0362K21890a72895O0384n8978A71125c6513
12797A14870d3094m1060B55543l7907e8880j1345A24606k4629b6525r3624j49227
12786b69376F7522a61696k59269h726j06542e2610b5020k73433C2747c07232b89
12774f9292j94119D5787A1134c7274J6894H9702j9993b45940B0843i3912B45858
12762a89172r4121J28236e2382j57090g1272E6704a74379L007A41968C3174M78157
12751E11331B2915K47661A13664b46644A8205g4612B66872c02574J50800b1092
12740B74740q797a80452e1629A76609b0070j83214e6777D17927h4088n70B77649
$$ plain form
12728 -93652 124775 168394 101628 14559 -50490 147536 -183679 -4621 -137322 -314640 32185
12716 -232722 -189140 85888 -85598 93191 162137 -11689 307915 191085 183457 141884 256062
12705 256062 272258 -30760 106526 -336305 -13259 127272 -164607 -370787 -149609 197874
12694 -187093 294249 80769 -47981 -41438 -2026 92523 111342 -130894 -86765 -45836 93294
12682 -126373 80517 -85375 197182 -89445 197126 -7570 -19165 163026 505249 -395425 -45040
12670 -156673 -39523 150081 -30248 -58072 -29655 78153 28625 -68164 98007 8495 -78664
12658 282599 472617 -58696 215813 -116894 74375 158057 -95649 226045 63860 -180959
12647 -112174 211219 441052 141055 -251734 -160214 4343 -119712 -219122 330195 -87134
$$ packed form
12728i3652A24775M3619o6766A4559e0490A47536a83679d621j32701j77318C2185
12716b32722M3582H5888h5598I3191O8946a1689C07915j16830p628m1573J14178
12705B56062J6196c0760A06526c36305a3259A27272a64607k06180a49609A97874
12694a87093B94249H0769d7981O543b026I2523J8819a30894M4129M0929I3294
12682a26373H0517h5375A97182h9445A97126g570j1595A63026L42223c95425d5040
12670a56673c9523A50081c0248k7824K8417G8153B8625f8164I8007H495g8664
12658B82599J90018e8696B15813a16894G4375Q3682i5649B26045F3860a80959
12647a12174B11219K29833A41055b51734R1520D343a19712r9410C30195h7134
$$ plain form
12636 114961 -137459 47231 301086 107037 76513 194310 -6150 -53198 56544 39121 -280853
12624 -179248 -213021 61266 62061 114907 -214328 -2770 314325 25486 211093 -4915 72124 -17338
12611 -9320 165950 -14427 313417 -116252 17857 -56971 221272 123309 123159 184122 178899 -93073
12598 -84236 10711 -84520 -173436 81548 67897 13284 28712 181438 58537 -79961 -115607
12587 -115607 -179187 146244 -126699 -97664 -88832 163809 374827 -55773 106279 126126 93235
12576 93235 69281 134563 -121274 -118526 -86071 39140 195580 165987 -117547 -9908 186791
12564 188020 -36437 77297 51700 95695 -221675 129889 24899 233741 100064 363796
12554 363796 -32272 837 2593 -231658 33947 193312 85780 72223 -36643 -67445 57956 -57286
$$ packed form
12636A14961a37459D7231K53855A07037l0524J17797f150m7048E6544j7423b80853
12624a79248l3773F1266P95N2846b14328b770C14325B5486J85607d915G2124a7338
12611i320A65950a4427C13417a16252A7857e6971B21272r7963j50O0963n223i3073
12598h4236A0711h4520q8916H1548j3651A3284J5428J52726E8537g9961l5646
12587a15607o3580A46244a26699K9035Q832A63809K11018e5773A06279J9847l2891
12576I3235k3954O5282a21274K748L2455C9140J56440k9593a17547i908A86791
12564A88020c6437G7297k5597M3995b21675A29889B4899K08842A00064K63732
12554C63796c2272H37J756b31658C3947J59365H5780j3557c6643l0802E7956e7286
$$ plain form
12541 -44712 -103621 196543 -108320 -130304 -97310 175816 95416 -57508 37280 -52309 -117736
12530 -117736 25412 36349 1359 22407 -268946 106025 185103 34066 -114893 -31114 295456
12518 64944 -153868 89875 157242 97941 295042 7454 -35460 -21560 50080 -96498 -152548
12507 -152548 -118296 -194269 78059 -171824 -221500 -38048 243535 -32380 -112097 174081 -84953
12495 -180375 44707 142392 92432 99554 60503 107788 -22700 325493 504990 66407 215893
12484 215893 137770 24807 -111074 25002 -254189 422749 -113175 182033 112854 -57635
12473 -75263 -138183 229860 -188526 -29813 -177208 -224569 -132974 -89733 290975 -334284 119581
12461 206403 17328 -103369 -6223 -86956 -30996 25731 99020 -239776 20061 43164 -145955
$$ packed form
12541d4712n8909A96543a08320k1984L2994A75816q0400e7508C7280e2309o5427
12530a17736B5412J0937A359K1048b68946A06025P9078C4066a14893c1114B95456
12518F4944a53868H9875O7367n9301J97101G454c5460J3900E0080i6498n6050
12507a52548L4252p5973G8059a71824m9676c8048B43535c2380p9717A74081h4953
12495a80375D4707R7685m9960P122l9051M7285b2700C25493J79497F6407J49486
12484B15893p8123B4807a11074B5002b54189D22749a13175A82033o9179e7635
12473g5263o2920B29860a88526b9813j47395m7361R1595M3241B90975c34284A19581
12461B06403A7328a03369f223q0733c0996B5731P3289b39776B0061K3103a45955
$$ plain form
12449 -52915 -116100 197573 60577 -43260 57553 -98262 159628 -343177 -219927 92828 263472
12438 263472 135279 -29801 -126758 -68748 -237666 146860 -177924 -48936 335439 -16458
12427 -318880 -8105 138687 -29186 147078 -23360 -124926 -582 -157032 46208 -84226 69248
12415 -424916 -64219 96976 -39664 -87098 98881 203686 -62511 205054 -59056 -132537 172605
12403 157419 29469 -109759 -23523 -75177 -140495 -244234 191462 -295744 -57887 -209037
12393 -209037 291239 -376928 -307965 -120977 9686 -268097 -51158 -124966 -137960 -117684 -137935
12382 -137935 -95586 -48034 -26485 -37143 -175693 3303 85121 -63945 -273534 102007 -339809
12370 235725 -95826 -234721 -107424 -3533 -56107 -85998 138610 244205 86440 -38864 -95810
$$ packed form
12449e2915o3185A97573F0577d3260E7553i8262A59628c43177J23250I2828J70644
12438B63472j28193b9801r6957N8010j68918A46860a77924d8936C35439a6458
12427c18880h105A38687b9186A47078b3360j01566e82j56450D6208h4226F9248
12415d24916f4219I6976c9664m7434I8881J04805f2511B05054e9056p3481A72605
12403A57419B9469a09759b3523n1654o5318j03739A91462b95744e7887j51150
12393b09037B91239c76928O8963a20977I686b68097e1158p3808j2994K0276k0251
12382a37935M2349M7552K1549j0658j38550C303Q1818f3945k09589A02007c39809
12370B35725i5826j38895a07424c533n2574k9891A38610J05595H6440c8864n6946
$$ plain form
12359 -95810 37994 134871 -36621 -219296 72262 111406 -215895 426404 113654 -246992 66240
12347 -306995 -190836 356708 -112821 325203 -14361 -86768 -101399 -247166 -315803 32012
12336 100371 53098 124826 157401 122400 -116806 83736 203142 277680 -172856 59155 -59589
12324 -13170 -79387 84780 181908 -478129 -275942 -2311 -82597 -368245 74490 162093 -156114
12312 247032 -89783 174868 15269 103220 -195239 60567 -189208 266577 -177656 -182050 -89033
12300 39492 -156168 -139714 -228139 -31698 56552 -226916 -230171 -32991 -260408 169930 79307
12288 99237 -69893 51997 15140 -36473 33990 8035 38538 250744 -110443 187501 -208630
12276 118107 254843 341469 -292325 190689 280814 -190106 583471 71086 -359532 -104201
$$ packed form
12359i5810C7994R6877c6621j82675G2262L9144b15895D26404A13654b46992F6240
12347c06995J16159C56708a12821C25203a4361p2407j4631j45767o8637C2012
12336A00371m7273P1728L2575l5001a16806H3736J19406P4538a72856E9155e9589
12324a3170o6217H4780R7128d78129K02187b311q0286k85648G4490Q7603a56114
12312B47032h9783A74868A5269Q7951a95239F0567a89208B66577a77656m394h9033
12300C9492a56168J6454q8425c1698E6552b26916l255c2991k27417A69930G9307
12288I9237f9893E1997A5140c6473C3990H035L0503K12206a10443A87501b08630
12276A18107J36736Q6626b92325A90689R0125a90106E83471G1086c59532a04201
$$ plain form
12265 271676 99127 7351 191104 132666 -301126 120946 -133478 201501 84357 336789
12255 336789 161426 115786 54613 -79589 -26146 -303959 -56776 -283323 10365 90170 198644
12244 198644 105361 -25385 -127170 -106706 -311105 40174 10692 -107618 -73043 417136 263394
12233 263394 -8803 -21941 -58079 103511 71430 -139538 147281 244003 31993 -26665 137853
12221 -66158 -96696 218509 59219 -62815 10650 52871 221746 42809 282481 39062 310739
12210 310739 -35875 138817 244747 36847 -67490 285211 265053 117138 331583 225986
12200 225986 100031 42131 67805 315442 -215496 145703 145844 80972 11429 278216 153110
12189 153110 289373 267843 273730 -146061 11460 77320 -22889 89563 18901 101353 201 151192
$$ packed form
12265B71676I9127G351J83753n8438c01126A20946a33478B01501H4357K52432
12255C36789A61426m5640E4613g9589b6146k77813e6776k26547A0365P9805J08474
12244A98644r3283b5385j01785K0464k04399D0174A0692a07618L4575D17136j53742
12233B63394h803j3138l6138A03511l2081a39538A47281R6722C1993b6665A37853
12221f6158l0538B18509E9219f2815A0650M2221J68875D2809K39672C9062K71677
12210C10739c5875A38817J05930C6847f7490B85211k0158A17138K14445j05597
12200B25986A00031D2131K5674K47637b15496A45703J41o4872A1429K66787j25106
12189A53110J36263k1530N887a46061A1460O5860b2889H9563A8901Q2452B01J50991
$$ plain form
12177 151192 94987 -127232 -22359 53653 157308 -100859 199090 223467 136385 69852 271062
12166 271062 396452 138502 108883 -137626 280991 -185691 -28734 287522 -5150 181720
12155 -67826 30862 -252960 -106784 317065 91786 -220326 233 172154 73891 57275 -48472
12143 239954 -209110 25994 148965 196933 249871 176437 190528 -144039 4502 139937 -3599
12131 -50701 34015 -154873 25826 147980 -62586 230226 120688 405965 100147 -32078
12120 49773 -57812 -167850 78822 -19662 85594 118277 -189473 256154 -22448 -36200 -31747
12109 -31747 188366 -235891 120188 108960 135852 324188 52166 42301 -96968 222546 86148
12097 84997 -337998 -120600 341339 41681 -203826 67665 -7142 -3167 222320 1842 50765
$$ packed form
12177A51192n6205a27232b2359E3653J03655a00859A99090K4377q7082o6533K01210
12166B71062J25390A38502k9619a37626B80991a85691b8734B87522e150A81720
12155f7826C0862b52960a06784C17065I1786b20326B33J71921G3891j6616d8472
12143B39954b09110B5994J22971M7968N2938p3434J4091a44039D502J35435c599
12131e0701C4015a54873B5826J22154f2586B30226j09538K85277A00147c2078
12120D9773e7812j10038G8822a9662H5594L2683a89473B56154b2448j3752M453
12109c1747A88366b35891A20188j1228K6892J88336E2166r865i6968B22546H6148
12097H4997c37998a20600C41339D1681b03826F7665g142c167B22320A842M8923
$$ plain form
12086 50765 -44106 -201056 46008 -13616 182109 -114239 172587 -57741 -134556 -83028 -78035
12075 -78035 -21770 270230 -122078 -315725 -138368 -89596 77220 111002 -137999 -138329 -216000
12064 -216000 346726 408294 878165 334467 9124 113154 179394 92999 -72892 15224 -151277
12052 -168366 -375485 121809 283051 196036 -50067 10258 -20701 -163727 186792 -20350
12041 -121284 72073 -265600 285304 -135361 113236 -114378 -2988 300421 21721 -458662
12030 334009 -113503 135317 -22637 -92407 95032 14210 48460 197589 -236357 -15673 49109
12018 150980 -117367 -131894 628056 -111781 185037 -292767 22635 43010 -350378 82478
12007 152939 -89347 -188608 -92926 -90587 -228626 141597 28719 122215 196354 -110145 283727
$$ packed form
12086E0765d4106j56950D6008a3616A82109a14239A72587e7741p6815N1528M993
12075g8035b1770B70230a22078j93647a38368M8772G7220L3782a37999l30p7671
12064b16000C46726O1568M69871C34467I124J04030O6240q6395g2892A5224a51277
12052a68366k07119A21809J61242q7015e0067A0258b0701j43026A86792b0350
12041a21284G2073b65600B85304a35361A13236a14378b988C00421B1721d58662
12030C34009a13503A35317b2637o9770I5032A4210L4250J49129b36357a5673D9109
12018A50980a17367j4527F28056a11781A85037b92767B2635K0375c50378H2478
12007A52939h9347r9261i2926K339j38039A41597B8719R3496P4139a10145B83727
$$ plain form
11995 -118314 69882 -255467 154778 20412 -329501 -68277 -195271 -240906 -305519 -45604 -5139
11983 170825 27602 633 139269 290148 31434 -208962 114887 -237002 -56747 89629 -87535
11971 -69258 -28154 -131846 302946 -246140 -224232 -26172 -104990 247141 14552 195180 37390
11959 41332 -351945 -126167 95130 -271902 -280667 42473 -72888 -222777 20873 136739 -263355
11947 -86152 121813 128134 129552 -25007 117183 116604 -74194 -82816 92619 37478 -274938 65662
11934 -112663 150116 -167662 -125994 -277207 -193869 -28585 -305285 206651 -277777 -21938
11923 -64309 -221783 -98586 154140 217124 -91944 -173443 -19908 -216164 -59771 -178481 382809
11911 59772 102380 96 -35357 201565 -89999 185681 214852 -141578 118394 68114 -223932
$$ packed form
11995a18314F9882b55467A54778B0412c29501f8277j26994m5635o4613d5604e139
11983A70825B7602F33J38636J50879C1434b08962A14887b37002e6747H9629h7535
11971f9258b8154j03692C02946b46140K1908b6172p8818B47141A4552J80628C7390
11959D1332c51945a26167I5130b71902q765D2473g2888j49889B0873J15866b63355
11947h6152A21813O321J418b5007A17183n79g4194q622I2619C7478b74938F5662
11934a12663A50116a67662M1668j51213Q3338b8585k76700B06651b77777b1938
11923f4309j57474i8586A54140O2984i1944q1499a9908j96256e9771j18710C82809
11911E9772M2608I6c5357B01565h9999A85681K9171a41578A18394n0280b23932
$$ plain form
11899 -388057 190155 -128749 -64686 119219 91359 16152 -120692 -83965 -302007 -191003
11889 -191003 147628 54669 -155642 -406726 53232 -163439 -278879 17 -11352 150780 -22017
11877 -196448 136045 79382 -217348 -184887 -56274 22955 -120961 -53514 254098 -84687 19752
11865 -234799 52796 -196765 -132065 155183 6459 37176 -17642 42498 -86532 -111277 198987
11853 -363 115663 -139120 -70215 103766 36159 -87169 56863 -167943 -50343 -167793 -137212
11842 -137212 322 -305084 328000 -120007 70057 -148635 27382 -289911 338478 -138741
11831 235326 -47973 -157170 97191 -154878 42181 -196209 157349 -138354 -105821 -221949
11821 -221949 161461 -166406 -68731 -22193 308399 -201258 42005 54938 103139 -93896 -103029
$$ packed form
11899c88057A90155a28749O4063A19219k7860A6152a20692L6727k18042J11004
11889a91003A47628E4669a55642k51084E3232a63439j15440A7a1352A50780b2017
11877a96448A36045n6663b17348L2461e6274B2955a20961e3514B54098h4687A9752
11865b34799E2796a96765O4700A55183F459L0717a7642D2498h6532k4745A98987
11853c63A15663a39120O8905A03766C6159h7169E6863a67943e0343j17450L0581
11842a37212C22c05084C28000a20007G0057a48635B7382b89911C38478a38741
11831B35326d7973j09197I7191a54878D2181a96209A57349a38354L2533j16128
11821b21949A61461a66406f8731b2193C08399b01258D2005J2933M8201i3896r133
$$ plain form
11810 -103029 -178785 7717 14491 -30622 -19709 175589 -8933 -7135 91110 -267627 -45821 -103207
11798 -103207 -10264 -192043 -255018 -42094 177206 22267 7082 -16405 152516 13717 -5519
11786 -48352 -20197 159700 -79180 -337855 4169 64392 11026 243864 71902 -47998 -94933
11775 -94933 61454 101984 -86169 -88747 39393 88350 -374414 -129159 -131128 180869 133310
11764 133310 -256233 -25787 98924 -69269 8038 362211 -205871 -79282 170069 43873 -58213
11752 66005 -6213 52347 -30699 -186283 115220 20133 146902 -200338 -30775 59871 12121
11740 -259297 -209717 -168389 59103 189695 -157185 -19417 52340 -93167 32427 -260365 45198
11728 -139729 -200866 -53949 64872 210363 -96788 125974 100735 42242 343825 25828 59607
$$ packed form
11810a03029p5756G717O774c0622J0913A75589h933J798I1110b67627d5821n7386
11798a03207a0264j81779o2975d2094A77206B2267G082a6405A52516A3717e519
11786d8352b0197A59700g9180k58675D169O0223A1026K32838G1902d7998m6935
11775i4933F1454M0530h6169k578C9393M8957c74414a29159j969A80869m7559
11764A33310b56233b5787I8924f9269H038L54173b05871g9282A70069D3873e8213
11752F6005f213E2347c0699j55584A15220B0133J26769b00338c0775E9871A2121
11740b59297M9580M1328E9103J30592a57185a9417E2340i3167C2427b60365D5198
11728a39729o1137e3949F4872J45491i6788A25974k5239D2242L01583B5828L3779
$$ plain form
11717 59607 -128484 -72459 63903 -90630 -207106 177027 -320674 -76982 165121 199174 -99191
11705 81912 319831 274435 140544 332008 76021 158376 -224863 86472 -216537 -627729
11695 -627729 -87697 -243066 -65601 238997 -192039 114292 236219 -345469 38714 79832
11685 79832 -231427 19172 112176 -223720 -181514 -6515 -199300 -43591 -266926 42152 112940
11674 112940 -315856 -129140 219908 -68069 82756 -31073 -262001 100548 -216026 18011
11663 -53221 69624 22039 -84162 -147645 110559 -230568 -471821 -75351 13995 -395640 -84377
11651 163917 85250 -104167 6695 31272 384162 -12112 234527 63791 -152109 -79569 -433956
11640 -433956 -217167 -104432 257806 -362 44646 8073 22656 401506 -17459 162083 -190724
$$ packed form
11717E9607a28484N6025F3903i0630j16476A77027c20674g6982A65121L4053i9191
11705H1912K37919m5396j33891J91464G6021Q2355b24863H6472b16537m11192
11695f27729h7697j55369f5601B38997a92039A14292J21927c45469C8714M1118
11685G9832b31427A9172R3004b23720M2206f515j92785d3591k23335D2152P0788
11674A12940c15856a29140B19908f8069H2756c1073k30928A00548b16026A8011
11663e3221F9624B2039h4162o3483A10559b30568k41253g5351A3995c95640h4377
11651A63917p8667a04167F695K4577L52890a2112B34527F3791a52109P2540l54387
11640d33956K16789a04432B57806c62D4646H073J4583L78850a7459A62083a90724
$$ plain form
11628 93639 -282966 313198 216666 217219 -8220 -118012 213167 -78940 -193203 18969 -194781
11616 181524 149060 70398 -75741 -167630 -83221 16761 10843 72459 -95722 -84998 125265
11604 118575 -268561 -169855 32530 -284812 3821 -96278 -65086 -63115 -37755 21599 188647
11593 188647 -17621 113961 -5698 -60643 -120861 26603 4712 18037 -6785 -86397 105634 -41386
11580 -156472 -31863 324761 -190234 522322 226059 250592 77237 -224232 124964 122143
11570 122143 5904 170334 133461 391368 -53928 63352 -164606 -55984 520295 280291 148154
11559 148154 251617 31520 -104782 -251770 102272 -20221 26767 -377410 -42008 527570
11548 115171 29814 81641 -64630 259076 -89456 197342 -31279 161211 204202 -2940 -115563
$$ packed form
11628I3639b82966C13198r6532N53h220j09792B13167g8940j14263A8969a94781
11616A81524l2464G0398g5741r1889h3221A6761n918O1616i5722J0724A25265
11604A18575b68561R8706C2530b84812C821i6278L1192J971K5360B1599J67048
11593A88647a7621A13961e698n4945o0218B6603D712J3325f785p9612A05634d1386
11580a56472c1863C24761a90234E22322B26059K4533G7237b24232A24964k821
11570A22143E904J64430l6873K57907e3928F3352a64606e5984E20295k40004j32137
11559A48154J03463C1520a04782j46988A02272b0221B6767c77410d2008E27570
11548A15171B9814N1827f4630B59076h9456A97342c1279A61211M2991b940j12623
$$ plain form
11537 -115563 -22610 90886 -55418 36938 94508 253715 224971 102199 219719 -126527 76192
11525 100805 27324 141604 120846 -128350 -286576 -214515 8997 16591 -184533 284720 -182719
11513 2636 7716 87762 -50566 39005 86117 -125532 72370 84128 -14543 -119238 -70251 -115735
11501 -115735 542969 428286 -148445 152530 106481 -274939 -104619 216068 63814 127248
11491 127248 73006 -76205 -31382 221713 -130947 -75460 120174 30892 187791 165850 -35730
11479 130955 -79175 -99156 55930 154438 210506 98949 -9148 169143 -78876 252667 7623
11467 -2875 181986 446651 12399 -70071 47443 -23054 -28156 -65979 -156299 125451 60765
11455 -74753 138246 88393 -9378 199850 27037 -135787 -94583 140759 266121 53554 76986
$$ packed form
11537a15563b2610I0886e5418C6938N7570J59207k8744A02199J17520a26527G6192
11525A00805B7324J14280k0758a28350j58226P2061H997P594a84533B84720a82719
11513B636N080Q0046e0566C9005M7112a25532G2370J1758a4543j04695M8987m5484
11501a15735E42969j14683a48445A52530m6049b74939a04619B16068F3814O3434
11491A27248n4242g6205c1382B21713a30947N5487A20174C0892J56899k1941c5730
11479A30955g9175j9981E5930R8508N6068I8949i148A69143g8876B52667G623
11467b875A81986K64665A2399g0071D7443b3054n102l7823r0320A25451F0765
11455g4753A38246m9853i378A99850B7037a35787M1204A40759J25362E3554K3432
$$ plain form
11444 76986 -27936 -189281 57350 63663 -330952 -70551 3392 -288068 9445 -127356 -193843
11433 -193843 74957 -188538 -62686 79298 90708 -134638 65161 79503 -192798 -65528 147604
11421 9069 -74029 122520 -118155 -136636 -181333 54121 31361 208130 -14636 202394 -1895
11409 232168 -238276 149511 160850 -100362 21319 178061 177349 233183 -35737 262844 52233
11397 68885 196832 -48256 27416 31155 -127051 292048 -177575 18063 273547 84186 123568
11386 123568 152997 -34064 43717 -191202 173200 173912 12011 -186876 19144 94178 25479
11374 41665 -195765 -60292 87246 -87322 97679 -16940 79620 -174209 -123962 57383 160849
11363 160849 -15549 25263 -102504 -193941 -58556 -137817 -6111 291796 -191059 -163999 -70681
$$ packed form
11444G6986b7936j61345E7350O313c30952g0551C392b88068I445a27356o6487
11433a93843G4957a88538f2686G9298J1410a34638F5161J4342a92798f5528A47604
11421I069g4029A22520a18155j8481m4697E4121k2760J76769a4636B02394a895
11409B32168b38276A49511J1339a00362B1319J56742p12N5834c5737B62844E2233
11397F8885J27947d8256B7416L739a27051B92048a77575A8063K55484H4186L9382
11386A23568K9429c4064D3717a91202A73200P12A2011a86876A9144P5034B5479
11374D1665a95765f0292H7246h7322I7679a6940G9620a74209N0247E7383J03466
11363A60849a5549B5263a02504r1437e8556p9261f111B91796a91059K7060g0681
$$ plain form
11351 -435370 192123 -190476 -359570 -21058 -194323 -6151 235664 -71669 228223 19661
11340 182792 -51891 284246 -146006 -22750 -35803 -137567 -69899 -59779 -109488 46206 235871
11329 235871 -288395 85140 -202058 172423 -229371 27263 194557 -55398 34044 125935
11319 125935 -182219 -56188 209245 -48310 53457 138615 -66954 -146751 82280 260498 54658
11307 -143240 -2687 13302 -174104 94746 -107709 -154657 -66873 268492 -100830 188652 -90998
11295 163854 -457107 111149 -52860 -239165 -15044 -67615 304464 -13910 25475 133593
11285 133593 52883 392528 19539 -289779 267567 -222047 -233452 -206398 33754 -257559
11274 -221346 -153678 -276252 -459443 -340251 -72283 -264386 126359 255785 86423 -45958
$$ packed form
11351d35370A92123a90476j69094b1058j73265f151B35664g1669B28223A9661
11340A82792e1891B84246a46006b2750j3053j01764O7668J0120m9709D6206J89665
11329B35871b88395H5140b02058A72423b29371B7263J67294e5398C4044R1891
11319A25935a82219e6188B09245d8310E3457Q5158f6954p9797H2280J78218E4658
11307a43240b687A3302a74104I4746a07709m6948f6873B68492a00830A88652i0998
11295A63854d57107A11149e2860j86305a5044n2571C04464a3910B5475J08118
11285A33593E2883L39645A9539b89779B67567b22047j1405K7054C3754b57559
11274b21346O7668j22574j83191J19192g2283j92103A26359J29426H6423d5958
$$ plain form
11263 64999 58884 100411 -232438 -193885 115439 -305611 10688 -135163 141746 -66016 260272
11251 130247 163160 -172729 20285 -7932 62549 -25609 -14156 -174753 77910 -60085 -125641
11240 -125641 -73516 -53825 14329 21715 -184097 92799 75096 -76974 105294 -218145 -15613
11228 -21901 -119927 -47588 -221200 218665 17421 -147925 1929 317098 163733 70423 115936
11217 115936 192104 -183209 -63229 -40037 -196910 -381038 25891 -139757 -194708 47881 -241805
11205 -344368 298416 130607 -2455 3167 -425748 -182723 -720 -110475 -186430 -93165 -165726
11194 -165726 118281 -274127 -49041 -275877 76500 502599 22049 -108732 -168128 151429
11183 -179226 -481127 -167294 -324825 -103879 -129022 153670 -98217 115033 154871 14007
$$ packed form
11263F4999o115M1527b32438L8553A15439c05611A0688a35163A41746f6016B60272
11251A30247L2913a72729B0285g932F2549b5609J1453j60597G7910f0085o5556
11240a25641N2125J9691A4329P386a84097I2799j7703g6974A05294b18145a5613
11228b1901r8026d7588j73612B18665A7421a47925A929L15169j53365G0423M5513
11217A15936P6168a83209f3229K3192j56873j84128B5891a39757n4951D7881b41805
11205c44368B98416A30607b455C167d25748a82723g20j09755p5955i3165p2561
11194a65726A18281b74127d9041k26836G6500M26099B2049a08732n9396A51429
11183a79226l01901a67294j57531a03879k5143A53670i8217A15033L9838A4007
$$ plain form
11172 -89601 -82581 -40591 -223440 -52392 303598 194798 68211 -41434 -356611 -103690 -251293
11161 -251293 50976 -169509 -217412 -86513 12036 30326 65803 -16348 -324919 81816 -72268
11149 -112102 175858 19426 20618 190772 -82919 129470 -197763 -95767 -241432 -205606 -15593
11137 -149742 191709 39941 -84805 274719 -1886 105854 -1071 65722 8532 -48695 270121
11125 -71534 277126 10584 89013 27688 -35486 10210 -122248 -123508 20839 232039 6924
11113 125098 201512 108571 24575 24600 -84184 106266 140488 39445 -73448 -274694 -8070 -184700
11101 -184700 58044 -181476 -56736 193571 212372 283096 238568 404479 158418 -64620 198645
11089 210390 452128 -193019 -2225 280965 84640 113405 163700 42390 -77970 33332 173972
$$ packed form
11172h9601P020d0591j82849e2392C03598j08800F8211d1434l15177a03690j47603
11161b51293E0976a69509m7903h6513A2036J8290L5477a6348l08571H1816g2268
11149a12102A75858A9426J192J70154h2919A29470a97763i5767j45665L5826a5593
11137a49742A91709C9941h4805B74719a886A05854a071F5722H532d8695B70121
11125g1534B77126A0584P8429B7688c5486A0210a22248j260B0839K11200F924
11113A25098P6414r2941B4575K5h4184A06266L4222C9445g3448k01246h070j76630
11101a84700E8044a81476e6736A93571J8801P0724m4528J65911A58418f4620A98645
11089B10390K41738a93019b225B80965H4640K8765N0295D2390g7970C3332J40640
$$ plain form
11078 173972 77820 -270974 32468 110705 233846 144274 45284 281922 -12855 344088 -74373
11066 335015 230841 386155 44785 -14533 -5157 356541 118693 252290 306300 62814 557465
11055 557465 492926 299418 566808 62206 231233 337323 171886 405658 244946 400365
11045 400365 320220 983999 680639 282270 292704 509771 477760 368879 580435 629262
11035 629262 229451 514835 661313 456569 260778 598108 523209 592577 631517 399920
11025 399920 188361 293273 133229 540191 497000 111313 599228 383069 292378 -1867
11014 385716 584592 290755 355930 595915 748995 801819 443939 447965 179433 460177
11004 460177 95445 261237 316897 375560 247320 415573 78318 606883 570667 291442
$$ packed form
11078A73972G7820b70974C2468P8237J23141q9572D5284K36638a2855C44088g4373
11066C35015j04174J55314D4785a4533e157C56541A18693J33597N4010F2814M94651
11055E57465o4539j93508K67390F2206J69027J06090j65437K33772j60712J55419
11045D00365q0145O63779l03360B82270J0434K17067l2011j08881K11556M8827
11035F29262B29451K85384J46478k04744j95791L37330p4899O9368L8940k31597
11025C99920A88361J04912A33229M06962m3191A11313M87915k16159r0691a867
11014C85716J98876B90755O5175K39985J53080N2824l57880M026A79433K80744
11004D60177I5445J65792N5660N8663j28240J68253G8318N28565l6216k79225
$$ plain form
10994 291442 460790 403463 375191 453192 396400 403409 394923 273014 322438 355833 599311
10983 599311 872755 547075 784646 693639 826142 318801 663065 505337 623194 714524
10973 714524 747571 1256254 1186488 1245702 1182608 1648110 1553605 1353745 1693806 1181825
10963 1181825 1301047 1095731 1029358 955054 751687 1134316 1046717 1041660 1219319 1183099
10953 1183099 959032 1160569 1160047 922694 933689 824896 729649 456744 581351 294781
10943 294781 122390 444195 -45110 -68050 205202 25209 12828 347675 154866 15483
10932 69686 -36086 71779 33387 226526 66488 173522 -10285 -16640 63655 215663 45192
10920 -78573 -58117 -372925 -76793 279722 -121734 6511 41227 -32650 -292327 -81486 -13794
$$ packed form
10994B91442J69348n7327k8272P8001n6792P009q486j21909M9424L3395K43478
10983E99311K73444l25680K37571r1007J32503C18801L44264j57728J17857R1330
10973G14524L3047N08683o9766N9214o3094M65502r4505j99860L40061n11981
10963A181825J19222k05316o6373p4304k03367L82629q7599n057J77659l6220
10953A183099k24067K01537n22k37353J0995j08793r5247k72905J24607k86570
10943B94781A22390L21805d5110k2940B05202B5209j2381L34847A54866A5483
10932F9686c6086G1779C3387J93139F6488J07034a0285o355F3655J52008D5192
10920g8573K0456l14808g6793B79722a21734F511L4716c2650k59677h1486a3794
$$ plain form
10908 210280 -121358 -75819 -78176 26267 -25891 199367 -93980 -15309 -133348 67905 74921
10897 74921 -251302 190074 -144491 187063 24129 7844 -102363 170505 -42263 857 -52672
10885 -86108 -78184 97113 -150395 -104435 34409 -14305 241629 9175 -270316 143039 9964
10873 -49655 157482 38371 298460 -41731 7045 -25458 68461 328010 -294782 48482 -142312
10861 154212 -28109 43803 -101990 -21463 -21946 -206945 -53287 -227613 -445136 167550 -205229
10849 -54282 -428219 78667 54853 -403198 -136650 -21578 142616 251949 -311972 33164
10838 58638 -119391 -34389 -187015 -1506 -114237 118040 1148 213320 106454 74812 -182742
10826 -162072 -52293 -64488 -84891 154977 -215997 53441 25896 -62818 -169086 -106601 173187
$$ packed form
10908B10280a21358M5539k357B6267b5891A99367i3980a5309j18039F7905P016
10897G4921b51302A90074a44491A87063B4129G844a02363A70505d2263H57e2672
10885h6108P924I7113a50395M5960C4409a4305B41629I175b70316A43039I964
10873d9655A57482C8371K60089d1731G045b5458F8461K59549b94782D8482a42312
10861A54212b8109D3803a01990b1463m83j84999e3287j74326k17523A67550b05229
10849e4282l73937G8667k3814d03198a36650b1578A42616J09333c11972C3164
10838E8638a19391c4389j52626a506j12731A18040A148K12172A06454l1642a82742
10826a62072e2293j2195k0403A54977b15997E3441B5896f2818j06268O2485A73187
$$ plain form
10814 -187710 -93811 -207969 -178915 20115 -185990 -109540 -474 -100617 -99754 -51145 -148693 -219356
10802 -219356 -152174 -222438 55251 1980 -149478 -228896 268802 -134850 -87152 -298217 -157682
10791 -157682 -113400 -61086 88513 -195400 -208695 -238331 -32729 81883 -118720 119040 126985
10780 126985 128373 307680 167284 12116 125861 -56030 33476 178636 147223 -12998 303067
10768 -127351 -263350 120433 5241 -120952 7895 -138273 13884 95706 -20767 160057 -58508
10756 -95169 -94686 51031 50879 -166476 -225608 -11445 121249 -82954 -56970 -351521 -125606 -222397
10744 -222397 157466 -250830 -71815 -279842 -91531 168734 50238 -44435 20311 321969
10734 321969 -369392 -263220 -365456 95062 -66510 -208735 105280 78396 158200 63211
$$ packed form
10814a87710i3811j14158K9054B0115a85990P6450d74j00143Q63M8609r7548p0663
10802b19356O7182p0264E5251A980a49478p9418B68802a34850M7698k11065J40535
10791a57682M4282N2314H8513a95400j3295k9636c2729H1883a18720A19040P945
10780A26985J388J79307j40396A2116J13745e6030C3476J45160l1413a2998C03067
10768a27351j35999A20433E241a20952G895a38273A3884Q1822b0767A60057e8508
10756i5169M83E1031j52a66476n9132a1445A21249h2954K5984k94551a25606r6791
10744b22397A57466b50830g1815k08027i1531A68734E0238d4435B0311L01658
10734C21969c69392J06172j02236I5062f6510j42225A05280k6884P9804F3211
$$ plain form
10723 21127 -208958 144269 -1762 178775 16879 99333 15013 22803 276427 64276 -135461
10711 -126056 76416 -52831 66286 70736 -50994 239034 131327 177275 206397 -233402 145213
10699 -99627 -413 133317 269598 -164394 -36570 110788 116400 161681 -57589 -221130 -257652
10688 -257652 286244 -255994 -61631 77895 -102673 158031 -269143 -75967 -76284 106580 191225
10677 191225 120333 -127503 77563 463 -104331 52094 7996 130429 -122998 220455 -65084
10665 -106445 236159 225542 -368925 -9409 207020 169952 -189394 -65188 -121236 -142966 -303332
10654 -303332 -335070 -259140 -3627 -174005 -130784 74017 -81866 -411030 -45985 -176293 47166
10642 30589 -51241 -33899 135513 -170216 -3824 123045 301760 -212756 51739 -328831 -15167
$$ packed form
10723B1127b08958A44269a762A78775A6879Q2454A5013P790K53624F4276a35461
10711a26056G6416e2831F6286M450e0994B39034j07707M5948K9122b33402A45213
10699i9627d13A33317J36281a64394c6570A10788N612M5281e7589j63541l6522
10688b57652B86244b55994f1631G7895a02673A58031b69143g5967l17A06580Q4645
10677A91225p0892a27503G7563D63a04331E2094G996J22433a22998B20455f5084
10665a06445B36159j0617c68925i409B07020l7068a89394f5188n6048k1730j60366
10654c03332l1738P5930c627j70378M3221G4017h1866l29164d5985j30308D7166
10642C0589e1241J7342A35513a70216c824A23045J78715b12756E1739c28831a5167
$$ plain form
10630 348330 -162359 -52753 -126726 297639 -97153 228849 -110362 31114 -74736 119224
10619 112342 -279640 -12550 -291561 109451 43734 -61273 -93705 -72002 -61859 22770 4334
10607 -272127 -7666 52630 57864 119221 -45807 -55277 -84871 -321169 10377 -4123 109899 344523
10595 344523 -131136 -64174 -113553 -87888 -175968 -210743 -136246 -305147 -486355 494106 101532
10583 -200658 -291765 -29641 218055 154290 -56980 -148893 -202405 -290346 29340 91127 62808
10572 62808 -105797 -189551 -171713 44221 -239357 155193 87547 51685 -71787 -60205 -208287
10561 -208287 -225435 -174524 157725 78613 69682 239489 -149772 -276909 -34742 128091 -59921
10549 -121200 -265157 54602 -166110 -99088 70931 -34690 174119 -7737 -208737 -39261 66365
$$ packed form
10630C48330a62359e2753p3973B97639i7153B28849a10362C1114g4736A19224
10619A12342b79640a2550k79011A09451D3734f1273l2432K1703J0143B2770D334
10607b72127g666E2630N234O1357d5807r470k9594k36298A0377d123A09899K34624
10595C44523a31136f4174m9379K5665q8080l4775P4497j68901j81208D94106A01532
10583b00658r1107b9641B18055o3765e6980r1913n3512q7941B9340O1787k8319
10572F2808a05797q3754J7838D4221b39357A55193o7646l5862g1787J1582j48082
10561b08287j7148N0911A57725G8613q931J69807a49772j27137c4742A28091e9921
10549a21200j43957E4602a66110O7022G0931c4690A74119g737k01000c9261F6365
$$ plain form
10537 123151 137909 126780 -272286 -72067 -275265 247703 -543771 -221793 66370 178378
10527 178378 -204934 -111255 27970 21419 201094 -19689 21075 71027 -67518 70114 -35313
10515 -82636 -633 -152934 -268208 -297226 -102196 -324956 183143 -84762 -5224 -173312 -245959
10504 -245959 -33121 -30256 159043 50398 -14847 37367 -49140 -157599 126623 50508 38665
10493 38665 -51043 51331 -96881 -318093 106754 257237 226 -48024 208395 150966 14425
10481 208565 149236 -49705 278115 8399 341906 254846 154939 268710 67625 -44624 47582
10469 45049 220346 258197 -58173 -87516 182798 -218291 57220 23615 -196775 -170516 -175195
10458 -175195 184779 66723 -148821 -94655 38166 -167814 231912 384 -68184 -85859 290881
$$ packed form
10537A23151J4758j1129b72286g2067k03198B47703e43771b21793F6370J12008
10527A78378b04934R3679B7970o551J79675a9689B1075M9952f7518G0114c5313
10515h2636f33j52301j15274k9018a02196k22760A83143h4762e224j68088p2647
10504b45959c3121K865A59043E0398a4847C7367d9140j08459A26623E0508j1843
10493C8665e1043E1331i6881k21212A06754J50483B26d8024B08395n7429A4425
10481B08565n9329d9705B78115H399L33507q7060r9907J13771F7625d4624D7582
10469D5049J75297L7851e8173k9343A82798b18291E7220B3615a96775K6259m679
10458a75195A84779F6723a48821N4166C8166a67814B31912C84f8184j7675B90881
$$ plain form
10446 -219545 85026 -177411 -118972 -58031 30105 171235 -34358 78550 -132972 -229532 -309911
10435 -309911 32160 -91686 119242 -111561 -149768 -48306 -286118 -126586 247130 -14220
10424 -121619 -160448 -198513 86074 262489 -486778 -138038 -276145 -37280 -79992 187926
10413 73860 -44542 -362235 113256 -90786 301114 3442 -143608 -238008 -71288 185101 35684
10401 1385 78440 97832 245102 -44782 292432 10630 353530 -103244 -117609 237383 -12997
10389 -80081 135574 90807 58329 -144889 95445 361557 57321 -79288 108427 -95106 -67124
10378 -67124 148032 78183 -139479 278982 -76626 -12180 -83711 -76446 6941 46925 106993
10367 106993 30956 285319 26366 208359 193114 189129 218273 -71043 79654 238619 60624
$$ packed form
10446b19545H5026a77411N8439e8031C0105J41130c4358G8550a32972r6560q0379
10435c09911C2160i1686A19242a11561l8207d8306k37812a26586B47130a4220
10424a21619l8829l8065H6074J76415d86778a38038j38107c7280m2712A87926
10413G3860d4542l17693A13256i0786C01114C442a43608r4400g1288A85101C5684
10401A385P7055J9392J47270d4782B92432A0630L42900a03244j4365B37383a2997
10389h0081A35574m4767l2478a44889I5445K66112E7321g9288A08427i5106K7982
10378f7124A48032o9849a39479B78982g6626a2180p1531P265F941L9984O0068
10367A06993C0956K54363B6366J81993j5245l985K9144g1043G9654J58965F0624
$$ plain form
10355 249008 -272218 114385 -163681 -126836 43176 315368 219312 93930 263044 -243016
10344 154213 333443 52388 -152780 288436 411748 194880 -18114 240214 557131 169082
10333 3814 3128 233994 -260951 11113 98566 79314 221582 -156715 153947 34674 121708
10322 121708 500600 117725 141859 -66038 -235990 218798 -185179 -61783 -52790 133136
10311 74845 -146856 33549 -111334 44483 9931 -12109 154493 -128213 -122521 5906 62448
10300 62448 89515 -240571 268060 -210441 91056 -293588 -53848 153135 14673 -95954 -80089
10289 -80089 40070 -177567 130517 -171252 -50986 71092 -70885 -116715 -361889 156393 266804
10278 266804 170853 -135789 -262138 262379 132524 191770 -199849 -301626 19161 -111412
$$ packed form
10355B49008b72218A14385a63681L6845D3176K72192r6056I3930J69114b43016
10344A54213J79230E2388a52780B88436J23312A94880a8114B40214L16917A69082
10333C814o86K30866b60951A1113Q7453j9252J42268a56715A53947C4674Q7034
10322A21708L78892A17725K4134f6038j69952B18798a85179f1783Q993A33136
10311G4845a46856C3549a11334D4483I931a2109A54493a28213N692E906N6542
10300F2448K7067b40571B68060b10441I1056b93588e3848A53135A4673i5954J5865
10289h0089D0070a77567A30517a71252e0986G1092g0885m5830k45174A56393J10411
10278B66804r5951a35789j26349B62379j29855N9246a99849j01777A9161a11412
$$ plain form
10267 96817 -289673 139597 -327735 196425 -104419 -364536 129566 190551 -193665 247098
10256 161470 -83870 83165 294499 198538 293673 34969 67864 -17675 170067 -192130 85156
10244 502041 -97172 166756 -88605 -213904 42233 329168 1078 -410394 277674 -240028
10233 74605 20174 -26818 177041 -190892 66672 127860 -271731 -153500 55937 -71533 217020
10221 -140160 154221 90296 53292 885 66968 -125728 5864 -165686 -19576 -65146 35062
10209 -146298 -101932 -201190 -48587 192175 119647 97970 -254118 53301 -201047 209888 206272
10198 206272 -35083 -4759 -24566 -127635 216976 377374 -278844 68233 -50771 22214 -1598
10186 -104076 -162556 -52571 199036 123186 -213826 -104345 -220069 -189669 -74298 -65806 103903
$$ packed form
10267I6817b89673A39597c27735A96425a04419k60117A29566O0985a93665B47098
10256A61470h3870H3165K11334r5961R5135C4969L2895a7675A70067a92130H5156
10244E02041i7172A66756h8605j25299D2233K86935A078d10394B77674b40028
10233G4605B0174b6818A77041a90892F6672O1188b71731J18231E5937g1533B17020
10221a40160A54221o3925l7004H85O6083a25728E864a65686a9576m5570C5062
10209a46298M4366r9258d8587A92175p2528k1677b54118E3301b01047B09888l616
10198B06272c5083d759j9807j03069B16976J60398b78844F8233e0771B2214a598
10186a04076n8480e2571A99036p5850b13826a04345j15724L0400g4298Q492A03903
$$ plain form
10174 -175086 -139504 -177714 145977 69769 -49283 220208 -34753 -186295 -55703 -240896 163363
10162 -43872 -287172 48216 -196376 -131076 -343026 -49138 -334432 107142 -162337 210368
10151 -196165 -290851 479741 -135907 -67354 -255077 -76895 -185648 -157992 75262 -259737
10140 -234134 -133485 195529 154758 -310143 -101640 403761 190839 -160851 -50150 -243448
10130 -243448 28337 -92098 -125028 181957 13584 32287 -127898 146193 -15157 103721 -5172
10118 -183720 -260748 51737 -40619 -282591 72709 148208 -59777 -154424 140813 172116 187897
10107 187897 -53784 -43938 74201 238173 -84290 135460 144415 -119195 113141 -112970 -14797
10095 73567 -600242 -239636 203881 -36324 -284019 268462 211040 -364378 -31338 -253444
$$ packed form
10174a75086L5582l8210A45977F9769d9283B20208c4753j51542e5703j85193A63363
10162d3872k43300D8216a96376O5300k11950d9138k85294A07142a62337B10368
10151a96165r4686D79741a35907f7354j87723g6895j08753K7656G5262b59737
10140b34134J00649A95529m0771c10143a01640D03761A90839a60851e0150j93298
10130b43448B8337i2098l2930A81957A3584J8703a27898A46193a5157A03721e172
10118a83720p7028E1737d0619k41972G2709P5499e9777r4647A40813L1303J5781
10107A87897e3784R846G4201J63972h4290A35460Q955a19195A13141a12970a4797
10095G3567f00242b39636B03881c6324k47695B68462n7422c64378c1338k22106
$$ plain form
10085 -253444 291521 -97987 -288883 14193 -119932 58813 266389 -16948 -28664 207981
10074 198199 127319 243474 97866 72713 35343 194781 -150204 298922 40797 178677
10064 178677 -92329 328286 -51466 -164923 177551 -230846 -3779 251767 59372 18696 45231
10053 45231 -55123 -100920 -102734 -286777 366158 -262825 71527 153072 -283150 -178780 230582
10041 -80066 69639 186766 -84958 203589 -219091 178387 -62735 65992 -7557 182409 -127392
10029 -147552 115090 -103457 -64075 -105550 -254754 202764 -167907 -113544 39945 -3489 -422043
10018 -422043 83154 -231736 -52553 105763 -12983 108867 -121278 -33450 118258 -67597
10007 -47154 -44960 -253 112783 -63121 127830 304353 -215595 -211393 -8387 86301 -218527 -27368
$$ packed form
10085b53444B91521i7987j90896A4193a19932E8813K07576a6948j1716B07981
10074A98199p0880J16155I7866k5153C5343J59438a50204B98922D0797J37880
10064A78677i2329C28286e1466j13457A77551b30846c779B51767E9372A8696K6535
10053D5231e5123m5797j814j84043C66158b62825G1527Q1545b83150J04370B30582
10041h0066F9639J17127h4958B03589b19091A78387f2735F5992g557A82409a27392
10029a47552A15090a03457L9382m1475j49204B02764a67907N4363C9945c489m18554
10018d22043H3154b31736e2553A05763a2983A08867a21278c3450A18258f7597
10007d7154K194b53A12783f3121A27830J76523b15595M202h387H6301b18527b7368
$$ plain form
9994 195211 119798 61390 236741 -240211 56812 -82872 102102 -287402 -72231 -111032 70849
9982 -351934 -180348 -285355 31985 -129218 -115500 -165686 -303515 -35781 244517 82227 -23838
9970 229145 -265475 -68860 -308002 97824 -105803 198555 -152613 -267107 -1871 -14054 -21949
9959 -21949 -71987 -70657 -201639 -58193 -120229 166412 -139848 -357193 -144593 -57676 -166903
9948 -166903 85679 -30700 -419435 -189058 64022 183840 -29364 -45352 74149 -31275 32748
9936 77343 -20179 196272 123103 18193 -203396 110339 -220652 32931 213613 -114637 65048
9924 54272 282308 -148586 -226064 -73358 1703 -166807 38439 -58889 -262923 -125243 -474332
9913 -474332 -216415 -208018 -109183 179523 -149623 -178642 -223560 -163890 -69694 -145173 -211335
$$ packed form
9994A95211p5413n8408J75351b40211E6812h2872A02102b87402g2231l8801G0849
9982c51934J71586j05007C1985a29218J3718n0186j37829c5781B44517H2227b3838
9970B29145b65475f8860k39142I7824a05803A98555a52613j14494a871j2183p895
9959b1949n0038J330j30982e8193o2036A66412a39848k17345a44593e7676j09227
9948a66903H5679c0700l88735a89058F4022J19818b9364j5988G4149c1275C2748
9936G7343b0179A96272p3169A8193b03396A10339b20652C2931J80682a14637F5048
9924E4272K28036a48586p7478g3358A703a66807C8439e8889k04034a25243l49089
9913d74332b16415Q397R8835A79523a49623k9019m4918N9670f9694p5479o6162
$$ plain form
9902 -211335 -433925 301190 -243248 -174269 -133101 -153073 -237856 -62582 -139266 -337477 -43580
9890 58806 -242610 -182379 166061 -79692 -1502 -142630 -48797 -250514 -74100 -282852 120497
9878 -222880 -212089 -102184 50397 -213061 18853 -69694 -98078 -210799 7990 11575 -388174
9866 -103070 -273565 91324 -233228 -157765 -1986 -22433 30122 -63027 78216 28416 -176265
9854 32631 -5940 139526 -206114 -105147 49382 -84424 20547 166222 -27314 -198880 -295140
9843 -295140 -1955 70408 1571 -19643 -54558 136790 -132547 -83396 119195 275579 55117
9831 -407693 -34409 76075 264666 85493 -218413 -273711 161889 -280338 -42017 410150 258088
9820 258088 91622 202857 -125392 -106221 -198497 -183570 142039 38293 -41042 162082 -79267
$$ packed form
9902b11335k22590C01190b43248O8979M1168j9972q4783f2582p6684j98211d3580
9890E8806b42610O0231A66061g9692a502j41128d8797k01717g4100k08752A20497
9878b22880J0791a02184E0397b13061A8853f9694k8384j12721G990L585c88174
9866a03070j70495I1324b33228P5463a986k0447C0122f3027G8216B8416a76265
9854C2631e940A39526b06114J00967D9382h4424B0547J45675b7314j71566r6260
9843b95140a955G0408A571a9643l4915A36790a32547M9151A19195J56384E5117
9831d07693c4409G6075J88591H5493b18413n5298A61889b80338d2017D10150j52062
9820B58088I1622J11235a25392J9171r2276J4927A42039C8293d1042A62082g9267
$$ plain form
9808 -184882 -153962 -60266 -78885 -135944 -186785 -99900 -27331 -32156 237393 -10209 -121245
9797 -121245 -187725 168772 -302573 87929 87507 -130712 95361 -22513 -127851 -47383 -45938
9786 -45938 -319672 96563 176428 -7896 10387 8961 -355330 75106 -204726 57515 26605 9659
9773 103582 -60373 62130 -204467 -144641 263171 -222112 48760 -280606 -355334 -119294 -27925
9761 -107723 -275937 9518 -227216 -72274 -321472 -279540 -132546 6012 -165394 -201524 14124
9749 -147222 3611 31480 -351000 168836 -224948 -5496 -132445 -93073 -53729 -259514 -24983
9737 79964 29881 141823 -356439 81922 -149388 -50209 70159 -86153 -197854 -32536 69344
9725 -21608 55476 -34163 -152380 62097 -207652 -53807 -121392 -282353 132107 -8865 -152096
$$ packed form
9808a84882L0920f0266j8619n7059n0841Q6885b7331m825B37393a0209j11036
9797a21245o6480A68772c02573H7929m22a30712I5361b2513j05338d7383J445
9786d5938k73734I6563P9865g896A0387j426c55330G5106b04726E7515B6605I659
9773A03582f0373F2130b04467N9826B63171b22112D8760b80606p4728a19294b7925
9761a07723j68214I518b27216g2274k49198M1932a32546F012a65394l6130A4124
9749a47222C611K7869c51000A68836b24948e496j26949L9372L9344k05785b4983
9737G9964B9881J11942c56439H1922a49388e0209G0159h6153j11701c2536F9344
9725b1608E5476c4163j18217F2097b07652e3807o7585j60961A32107h865j43231
$$ plain form
9714 -152096 5696 144982 -165647 80683 -325163 146190 -46106 -101530 -210730 -112358 -46316
9702 -116678 172091 -206707 95743 124881 310148 95621 256730 46435 70866 -158588 -220528
9691 -220528 -367302 218429 -112636 -156974 -249883 -251971 -6570 -36478 -6357 -181940 -188889 11673
9678 -23578 -177199 -72768 -42494 -100077 138233 -230399 147294 120593 -68502 -147500 74170
9666 2682 -304851 -51167 -60659 -233213 -304585 -81605 25606 -243035 -299146 23342 30228 47776
9654 47776 53497 52900 -135388 -241209 67229 -181106 155257 146102 66695 117068 -230800 93854
9641 174923 198047 -303879 11844 -360211 478588 203769 -126804 -127131 -323525 -101624 -167470
9630 -167470 -91463 149533 39705 -153013 171257 -160119 -74076 281064 -154476 33116
$$ packed form
9714a52096E696J39286a65647H0683c25163A46190d6106n5424j09200R8372d6316
9702a16678A72091b06707I5743K9138J85267I5621J61109D6435K4431a58588o1940
9691b20528j46774B18429a12636m4338r2909k088f570k9908f357j75583o949A1673
9678b3578j53621g2768L0274n7583A38233b30399A47294k6701f8502p8998G4170
9666B682c04851e1167r492j72554p1372h1605B5606b43035n6111B3342O886J7548
9654D7776N721n97a35388j05821F7229a81106A55257r155F6695N0373b30800I3854
9641A74923K3124c03879A1844c60211D78588B03769a26804l27j96394a01624o5846
9630a67470P6007A49533C9705a53013A71257a60119g4076B81064a54476C3116
$$ plain form
9619 57086 53095 -1784 -215682 61640 -181936 -4579 -36489 -44050 -169995 -51687 42794 24600
9607 24600 -253311 -100990 -58142 288803 197290 158792 -21705 -164785 23489 34071 -213135
9595 -27030 139056 -167764 -106333 100589 123595 -241242 -5923 -5061 -87957 -114637 -117546 -29207
9582 137444 -334614 95316 -160781 90360 -291040 145979 -145410 -141461 46873 6661 231215
9571 231215 26879 -206864 -28522 56064 -90704 -22408 39537 -287592 82889 -47380 174115
9559 45278 -204367 68993 -16300 -153269 -32239 -133023 -121284 149367 28224 -365108 -73386
9547 134121 -117914 70318 -407392 -222027 -21984 53339 -221138 238864 -92809 -173280 18470
9535 162478 113759 -95650 -251453 -109504 -97922 182266 -70894 -204082 202969 29895 86604
$$ packed form
9619E7086l991a784k13898F1640a81936d579l1910p561j25945e1687D2794j8194
9607B4600b53311a00990M2848B88803r1513l8498b1705j43080B3489J0582b13135
9595b7030A39056a67764O1431A00589K3006b41242e923Q62q2896k6680k909b9207
9582A37444c34614I5316a60781I0360b91040A45979a45410L949D6873F661K24554
9571B31215B6879b06864b8522E6064i0704b2408C9537b87592H2889d7380A74115
9559D5278b04367F8993a6300j36969c2239j00784J1739A49367B8224c65108g3386
9547A34121a17914G0318d07392J85365b1984E3339b21138B38864i2809q0471A8470
9535A62478m8719i5650j55803a09504J1582A82266g0894j33188B02969B9895N6709
$$ plain form
9524 86604 116115 109055 -79402 72179 49722 -118051 22846 1056 -114796 -136767 -62447 -95367
9512 -95367 -228866 150504 -102607 -66353 70563 -51541 -58664 359409 -169271 -103322 -120294
9501 -120294 -247557 -105527 162659 -32355 79719 -528730 29302 -73394 -10609 -115325 -147567
9490 -147567 -162116 25766 149010 -178434 1641 135358 -338695 -53788 -121048 -308368 -126203
9478 -304911 112139 218682 -46116 -75349 -349870 30950 -239524 -244523 41733 9949 -343670
9466 -309272 21988 -2885 28118 -165192 -18736 -110378 154219 80003 -255794 -44287 -222280
9455 -222280 104345 -26767 -236070 40287 -68652 -62763 -170384 -159961 -193387 -10884 58308
9443 -330842 58051 -27015 -206270 93005 152256 154319 55417 -117755 174433 200088 -508319
$$ packed form
9524H6604K9511p060g9402G2179k2457a18051B2846A056a14796k1971f2447l2920
9512i5367j33499A50504a02607L6254G0563e1541p123C59409a69271O5949j6972
9501a20294j27263a05527A62659c2355G9719e28730B9302g3394a0609j04716l2242
9490a47567j4549B5766J23244a78434A641J33717c38695e3788o7260j87320a26203
9478c04911A12139J06543d6116k9233k74521C0950b39524m999D1733I949c43670
9466c09272B1988b885B8118a65192a8736r1642A54219p4216b55794d4287j77993
9455b22280A04345b6767k09303D0287f8652N889j07621J0423l3426a0884E8308
9443c30842E8051b7015j79255I3005N9251K063E5417a17755A74433K5655e08319
$$ plain form
9431 -105684 230309 -237998 -118025 -61321 31878 91088 -115387 -214861 -216053 -176522 -26263
9419 -105568 -105317 -13859 -104290 -27194 -96244 25324 48148 217770 -141177 213062 41677
9407 66495 -155647 -158913 108465 -90485 -56485 82872 208201 -129216 -27382 45436 -98158
9395 -236674 58611 -306555 69181 -142863 -5059 189511 -367228 -2864 -135161 -221047 -4000
9383 -71516 -228963 -225750 -62941 -115218 -153892 -238836 46040 -60798 124116 151888 125827 125670
9371 125670 27974 -84134 180984 206000 -238998 -148106 65058 86604 -8894 -120578 9735
9359 112778 98523 72321 52945 -63045 -273748 -153055 -44721 164170 296542 -24510 127181
9347 -46013 6570 -57228 -250966 25568 219146 -139987 65742 442913 -108320 81789 -120527
$$ packed form
9431a05684B30309b37998a18025N6704C1878N9210a15387r9474j192L9531b6263
9419a05568K51a3859r0431b7194o9050B5324K2824J69622a41177B13062D1677
9407F6495a55647l266A08465i0485L4000H2872J25329a29216b7382D5436i8158
9395b36674E8611c06555F9181a42863e059A89511c67228b864j32297q5886d000
9383g1516j57447L213f2941n2277l8674q4944D6040f0798A24116K7772k6061j57
9371A25670B7974h4134A80984K5016b38998R0892F5058K1546h894j11684I735
9359A12778j4255k6202j9376f3045k10703J20693d4721A64170J32372b4510A27181
9347d6013F570e7228j93738B5568J93578a39987F5742L77171a08320H1789a20527
$$ plain form
9335 -50057 -11221 85237 -217496 -101342 -90904 -29265 112874 201146 -249817 -3324 61130
9323 195912 -66963 -156220 5671 -188149 -139959 -168531 -316830 123655 -37723 151906 70222
9311 -110488 -195263 -29678 -10875 92778 -82393 -46861 -384001 -70710 -90048 164877 3569
9299 203821 96077 -94233 -46268 -139410 -147229 190045 -154643 -22396 -322712 -214786 152331
9287 -69832 123365 -85844 -205469 7674 -179980 136564 -206254 -69588 -10956 -256032 -147151
9276 -147151 -128072 12170 186049 198474 -161617 -111255 8733 -87633 -47824 103251 231150
9265 231150 -9711 -242170 -296279 52702 -75824 145384 101734 -144569 -40161 79974 204275
9254 204275 67079 -17575 -279103 -46041 -348595 79475 -198873 -113516 -35774 187964 -387751
$$ packed form
9335e0057a1221H5237b17496a01342J0438b9265A12874Q8272b49817c324F1130
9323A95912f6963q9257E671a88149M8190k8572j48299A23655c7723A51906G0222
9311a10488q4775b9678a0875I2778h2393L5532l37140g0710j9338A64877C569
9299B03821I6077i4233d6268r3142p819A90045a54643b2396l00316J07926A52331
9287f9832A23365h5844j19625G674a79980A36564b06254f9588a0956k45076J08881
9276a47151J9079A2170J73879J2425a61617N0362H733h7633L9809A03251J27899
9265B31150i711k32459n4109E2702g5824A45384m3650a44569d0161G9974J24301
9254B04275F7079a7575k61528d6041l02554G9475a98873Q5357c5774A87964c87751
$$ plain form
9242 317017 -99348 61037 -122113 131592 -44197 109085 193238 104938 -32519 164146 -168263
9230 -29176 239045 -150355 -52689 -358512 42887 -125522 -112832 -23837 -525345 -86916 36689
9218 -338083 -214020 -111686 -192856 84301 -87961 72875 -51698 73889 -86506 -65505 67840
9206 -59874 -60566 61890 113097 -329555 -330656 196512 -213889 -204506 -17025 13590 42329 292497
9194 292497 138501 -239241 -118916 -105404 -7696 -130859 -209840 -349353 -300911 -91481 -14712
9182 122614 143878 -152249 -72525 -94635 -109012 -160259 150582 -161191 148880 27611 159050
9171 159050 -118388 -68614 -146617 40755 106555 14094 -61263 77132 124814 -52248 -140062
9160 -140062 -50732 -39460 -404713 -21292 154518 76896 -136496 270720 148042 15861 86057
$$ packed form
9242C17017i9348F1037a22113A31592d4197A09085Q4153q8300c2519A64146a68263
9230b9176B39045a50355e2689l05823D2887a25522J2690b3837n01508h6916C6689
9218c38083J24063J02334q1170H4301h7961G2875e1698G3889h6506K1001F7840
9206e9874o92F1890N1207c29555j101A96512b13889R383a7025A3590K8739K50168
9194B92497A38501b39241a18916J3512g696j23163p8981j39513M8442i1481a4712
9182A22614K1264a52249g2525k2110j4377n1247A50582a61191A48880B7611J31439
9171A59050a18388M9774p8003D0755O5800A4094f1263G7132M7682e2248q7814
9160a40062e0732J1272l65253b1292A54518G6896a36496B70720j22678A5861P0196
$$ plain form
9149 86057 157458 -82598 195289 74173 -206863 -264515 -135905 238389 -72987 -54273 -47963
9138 -47963 -212843 -121726 -171303 124801 -107525 -167884 -62460 -61583 220673 -207318 -162695
9127 -162695 -167596 -95096 244636 100314 72423 129083 -97416 -263459 -127345 79505 -68252
9115 7617 61871 -187518 -153550 -233634 -80397 -11296 88602 -99410 -137521 -10202 -245771 -216961
9103 -216961 -66900 -15645 159787 -135401 -136881 152359 -123818 -101859 118628 -275393 -1941
9091 -101728 -156497 -255203 -121960 -148514 -104073 -195589 -47644 -408224 -127265 -293636 -241264
9080 -241264 45047 72857 -341290 -45752 23263 -305375 133572 -340832 79771 -91665 -61292
9069 -61292 2879 -68696 -182737 -204220 -69846 -64203 -199176 224387 -141731 93942 159429
$$ packed form
9149H6057P1401h2598A95289G4173b06863n7652J28610B38389g2987J8714O310
9138d7963j64880R1117m9577A24801a07525o0359f2460Q77B20673b07318M4623
9127a62695m901P2500B44636A00314k7891N6660i7416j66043a27345G9505f8252
9115G617N4254a87518L3968q0084h0397a1296H8602i9410l8111a0202k35569K8810
9103b16961f6900a5645A59787a35401j480A52359a23818K1959A18628b75393a941
9091a01728n4769r8706a21960k6554M4441r1516d7644l60580a27265j66371N2372
9080b41264D5047K7810c41290d5752B3263c05375A33572c40832G9771i1665L0373
9069f1292B879f8696j14041k1483f9846N643j34973B24387a41731I3942O5487
$$ plain form
9058 159429 -154406 -102851 93087 -118157 -211317 -279424 45110 -46569 43713 -25663 -393636
9047 -393636 56319 90228 49432 167495 -137079 -163971 -15271 -225624 72493 133059 -119905
9035 83784 11841 -550416 294673 -12873 34367 -47847 268313 -39201 34976 170771 32751
9023 265508 147924 -61221 -139957 -44398 -303385 19541 63103 135470 -251013 -331875 -122314
9011 -106126 -144510 -356546 -205251 64856 -30376 46078 -140786 154194 -125372 -29670 -237847
9000 -237847 -3283 -111382 -14854 159398 319410 -181644 49277 -80117 -231164 -26235 279064
8988 -209369 -23637 102397 -355584 87821 428366 109330 140995 -98402 -168050 -84266 -100446
8977 -100446 140391 -61533 -109648 -6019 2368 28964 -53861 149480 17865 120024 175131
$$ packed form
9058A59429a54406N1555I3087a18157r3160o8107D5110d6569D3713b5663l67973
9047c93636E6319L3909m0796J18063a37079k6892a5271k10353G2493O0566a19905
9035H3784A1841e50416B94673a2873C4367d7847B68313c9201C4976J35795C2751
9023B65508j17584f1221p8736d4398k58987A9541M3562P2367b51013q0862a22314
9011a06126l8384k12036J51295F4856c0376D6078a40786A54194a25372b9670k08177
9000b37847c283j08099a4854A59398J60012a81644D9277h0117j51047b6235B79064
8988b09369b3637A02397c55584H7821L40545A09330L1665i8402o9648Q3784j6180
8977a00446A40391f1533m8115f019B368K6596e3861A49480A7865J02159N5107
$$ plain form
8966 175131 -77459 35034 -39260 195339 -186825 -74602 -32853 -104727 46571 89481 335863
8955 335863 -112205 -83265 -154678 -198815 70198 -344004 -55664 73854 72687 -33157 81644
8943 58862 74446 196373 57695 106231 -112706 45431 77120 -159062 -367960 -26094 -294091
8932 -294091 169690 47534 -167386 135402 184272 1200 277385 87469 28548 230609 103098
8920 689664 1208198 4301705 1915694 1039289 179672 -83739 -158103 -83740 185352 193317
8910 193317 306138 -204526 166904 102487 -87298 -30554 57974 40208 -151610 -267394 -124559
8898 -89410 199987 -153462 -82255 -79909 -102355 -80722 40027 -154171 -133959 -182228 -300489
8887 -300489 -128078 90263 14841 -101696 -372274 -196759 -121876 -25416 -109954 -307668 72772
$$ packed form
8966A75131g7459C5034c9260A95339a86825g4602c2853p1874D6571M2910K46382
8955C35863a12205K8940p1413m4137G0198c44004e5664G3854j167c3157H1644
8943E8862J5584J21927E7695M8536a12706D5431L1689a59062k08898b6094k67997
8932b94091A69690D7534a67386A35402M8870A200K76185H7469B8548K02061A03098
8920F89664N18534L093507A915694q76405A79672h3739p4364P4363A85352P965
8910A93317J12821b04526A66904o4417h7298c0554E7974j7766a51610j15784a24559
8898h9410A99987a53462P1207K346k2446K1633D0027a54171K0212m8269j18261
8887c00489a28078I0263A4841a01696k70578J75515P4883b5416q4538j97714G2772
$$ plain form
8875 -249959 -31263 -119108 23270 -144603 234328 -89324 181425 -81293 60117 242564 -271952
8863 -60799 20588 -217002 -136744 -353319 43069 98189 231250 194414 93964 85914 -114289
8851 31227 31526 -216762 -36248 -306754 22823 -40619 -2230 -50958 -313111 -16790 -39884 -3885
8838 55171 -155245 -417011 -16636 -36770 -89206 85818 -13059 -8496 -185558 346183 -282373
8826 -186466 -38956 132673 -211996 -2839 -280600 46291 -37697 -342699 -30018 -206806 80358
$$ packed form
8875b49959c1263q7845B3270a44603B34328h9324A81425h1293F0117J82447b71952
8863f0799B0588b17002Q0258k16575D3069N5120J33061l6836I3964q050a14289
8851C1227K99b16762c6248k70506B2823d0619b230m8728k62153a6790k3094c885
8838E5171a55245k61766a6636k0134n2436H5818a3059M563j77062C46183b82373
8826a86466c8956A32673b11996b839k77761D6291c7697l05002c0018j76788H0358
$$ [...]
##END NTUPLES=NMR SPECTRUM
##END=
