##TITLE=NES1000_872015067_9224993_pcruELpAMf
##JCAMPDX= 6.0         $$ Bruker NMR JCAMP-DX V2.0
##DATA TYPE= NMR SPECTRUM
##DATA CLASS= NTUPLES
##ORIGIN= BRUKER
##OWNER= Administrator
$$ 1.72 TOPSPIN		Version 2.1
$$ 2015-08-24 19:27:45.311 -0700  Administrator@X
$$ Compression mode = diff/dup
##.OBSERVE FREQUENCY= 400.02188249412
##.OBSERVE NUCLEUS= ^1H
##.ACQUISITION MODE= SIMULTANEOUS (DQD)
##.ACQUISITION SCHEME= undefined
##.AVERAGES= 64
##.DIGITISER RES= 22
##SPECTROMETER/DATA SYSTEM= spect
##.PULSE SEQUENCE= noesygpps1d.comp
##.SOLVENT NAME= COFFEE_meoh
##.SHIFT REFERENCE= INTERNAL, COFFEE_meoh, 1, 14.96251
##AUDIT TRAIL= $$ (NUMBER, WHEN, WHO, WHERE, PROCESS, VERSION, WHAT)
$$ ##TITLE= Audit trail, TOPSPIN		Version 2.1
$$ ##JCAMPDX= 5.01
$$ ##ORIGIN= Bruker BioSpin GmbH
$$ ##OWNER= Administrator
$$ $$ E:\/data/COFFEE/nmr/NES1000_872015067_9224993_pcruELpAMf/22/pdata/1/auditp.txt
$$ ##AUDIT TRAIL=  $$ (NUMBER, WHEN, WHO, WHERE, PROCESS, VERSION, WHAT)
(   1,<2015-08-24 19:27:39.967 -0700>,<Administrator>,<X>,<go>,<TOPSPIN 2.1>,
      <created by zg
	started at 2015-08-24 19:16:09.842 -0700,
	POWCHK enabled, PULCHK disabled,
       configuration hash MD5:
       21 0F 79 D6 B3 7B B4 F6 88 20 88 DB 03 48 BD 9F
       data hash MD5: 64K
       5E 47 95 AE 37 37 6E 54 DD 88 A6 54 2D 18 72 E6>)
(   2,<2015-08-24 19:27:43.186 -0700>,<Administrator>,<X>,<proc1d>,<TOPSPIN 2.1>,
      <Start of raw data processing
       efp LB = 0.3 FT_mod = 6 PKNL = 1 PHC0 = 0 PHC1 = 0 SI = 128K 
       data hash MD5: 128K
       F9 4B BC C8 38 AE 15 63 11 D1 64 5D 15 D6 C7 43>)
(   3,<2015-08-24 19:27:44.061 -0700>,<Administrator>,<X>,<proc1d>,<TOPSPIN 2.1>,
      <pk PHC0 = -85.50659 PHC1 = 0 
       data hash MD5: 128K
       B9 80 54 9B 29 FB BA F6 63 92 BB 73 7E 9E 23 F3>)
(   4,<2015-08-24 19:27:44.467 -0700>,<Administrator>,<X>,<proc1d>,<TOPSPIN 2.1>,
      <abs ABSG = 1 
       data hash MD5: 128K
       19 69 9C 1C D4 42 27 26 0C 37 9A 46 8F 81 1B 22>)
(   5,<2015-08-24 19:27:44.561 -0700>,<Administrator>,<X>,<proc1d>,<TOPSPIN 2.1>,
      <abs ABSG = 2 
       data hash MD5: 128K
       32 52 E0 5C AF E2 75 BB DB 06 48 1D 92 D5 2D 62>)
(   6,<2015-08-24 19:27:44.639 -0700>,<Administrator>,<X>,<proc1d>,<TOPSPIN 2.1>,
      <abs ABSG = 3 
       data hash MD5: 128K
       A3 E5 6D AC 92 C2 E1 4A BC 25 F5 0D 89 F8 38 6F>)
(   7,<2015-08-24 19:27:44.733 -0700>,<Administrator>,<X>,<proc1d>,<TOPSPIN 2.1>,
      <abs ABSG = 4 
       data hash MD5: 128K
       23 32 CD 10 7F 90 87 90 5D A8 B6 F2 34 3B 01 D6>)
(   8,<2015-08-24 19:27:44.858 -0700>,<Administrator>,<X>,<proc1d>,<TOPSPIN 2.1>,
      <abs ABSG = 5 
       data hash MD5: 128K
       BF E8 33 DD 29 A0 C1 4D FC CC 35 43 40 CD 67 45>)
$$ ##END=
$$ 
$$ $$ hash MD5
$$ $$ DE 38 F1 8F E1 49 C9 33 0B B6 DF 03 2C 4B 83 63
##$RELAX= 
##$RELAX= 
##$RELAX= 
##$RELAX= 
##$RELAX= 
##$RELAX= 
##$RELAX= 
##$RELAX= 
$$ Bruker specific parameters
$$ --------------------------
##$DU= <E:\>
##$EXPNO= 22
$$ [...]
##$TP07= 0
##$TPNAME0= <>
##$TPNAME1= <>
##$TPNAME2= <>
##$TPNAME3= <>
##$TPNAME4= <>
##$TPNAME5= <>
##$TPNAME6= <>
##$TPNAME7= <>
##$TPOAL= (0..7)
0.5 0.5 0.5 0.5 0.5 0.5 0.5 0.5
##$TPOFFS= (0..7)
0 0 0 0 0 0 0 0
##$TUNHIN= 0
##$TUNHOUT= 0
##$TUNXOUT= 0
##$USERA1= <user>
##$USERA2= <user>
##$USERA3= <user>
##$USERA4= <user>
##$USERA5= <user>
##$V9= 5
##$VALIST= <valist>
##$VCLIST= <CCCCCCCCCCCCCCC>
##$VD= 0
##$VDLIST= <DDDDDDDDDDDDDDD>
##$VPLIST= <PPPPPPPPPPPPPPP>
##$VTLIST= <TTTTTTTTTTTTTTT>
##$WBST= 2048
##$WBSW= 25
##$XGAIN= (0..3)
0 0 0 0
##$XL= 0
##$YL= 0
##$YMAX_a= 7533163
##$YMIN_a= -13947955
##$ZGOPTNS= <>
##$ZL1= 120
##$ZL2= 120
##$ZL3= 120
##$ZL4= 120
##$ABSF1= 14.96251
##$ABSF2= -5.595672
##$ABSG= 5
##$ABSL= 3
##$ALPHA= 0
##$AQORDER= 0
##$ASSFAC= 0
##$ASSFACI= 0
##$ASSFACX= 0
##$ASSWID= 0
##$AUNMP= <proc_prof1d_extract.lims>
##$AXLEFT= 0
##$AXNAME= <>
##$AXNUC= <1H>
##$AXRIGHT= 0
##$AXTYPE= 0
##$AXUNIT= <>
##$AZFE= 0.1
##$AZFW= 0.1
##$BCFW= 0
##$BC_mod= 0
##$BYTORDP= 0
##$COROFFS= 0
##$CY= 15
##$DATMOD= 1
##$DC= 0
##$DFILT= <>
##$DTYPP= 0
##$F1P= 0
##$F2P= 0
##$FCOR= 0.5
##$FTSIZE= 131072
##$FT_mod= 6
##$GAMMA= 0
##$GB= 0
##$INTBC= 1
##$INTSCL= 1
##$ISEN= 128
##$LB= 0.3
##$LEV0= 0
##$LPBIN= 0
##$MAXI= 10000
##$MC2= 0
##$MEAN= 0
##$ME_mod= 0
##$MI= 0
##$NCOEF= 0
##$NC_proc= -2
##$NLEV= 6
##$NOISF1= 0
##$NOISF2= 0
##$NSP= 0
##$NTH_PI= 0
##$NZP= 0
##$OFFSET= 14.96251
##$PC= 1
##$PHC0= -85.50659
##$PHC1= 0
##$PH_mod= 1
##$PKNL= yes
##$PPARMOD= 0
##$PPDIAG= 0
##$PPIPTYP= 0
##$PPMPNUM= 2147483647
##$PPRESOL= 1
##$PSCAL= 4
##$PSIGN= 0
##$PYNMP= <proc.py>
##$REVERSE= no
##$SF= 400.020009032845
##$SI= 131072
##$SIGF1= 0
##$SIGF2= 0
##$SINO= 400
##$SIOLD= 131072
##$SPECTYP= <>
##$SREGLST= <1H.CDCl3>
##$SSB= 0
##$STSI= 131072
##$STSR= 0
##$SW_p= 8223.68421052631
##$SYMM= 0
##$S_DEV= 0
##$TDeff= 65536
##$TDoff= 0
##$TI= <>
##$TILT= no
##$TM1= 0
##$TM2= 0
##$TOPLEV= 0
##$USERP1= <user>
##$USERP2= <user>
##$USERP3= <user>
##$USERP4= <user>
##$USERP5= <user>
##$WDW= 1
##$XDIM= 131072
##$YMAX_p= 346193638
##$YMIN_p= -10018
##$CURPLOT= <Network HP LaserJet P1505>
##$CURPRIN= <$Network HP LaserJet P1505>
##$DFORMAT= <normdp>
##$LAYOUT= <+/1D_H.xwp>
##$LFORMAT= <normlp>
##$PFORMAT= <normpl>
##$SURQMSG= 1
$$ End of Bruker specific parameters
$$ ---------------------------------
##NTUPLES= NMR SPECTRUM
##VAR_NAME=  FREQUENCY,     SPECTRUM/REAL,   SPECTRUM/IMAG
##SYMBOL=    X,             R,               I
##VAR_TYPE=  INDEPENDENT,   DEPENDENT,       DEPENDENT
##VAR_FORM=  AFFN,          ASDF,            ASDF
##VAR_DIM=   131072,        131072,          131072
##UNITS=     HZ,            ARBITRARY UNITS, ARBITRARY UNITS
##FACTOR=    0.0627417313425164, 1,          1
##FIRST=     8223.62146879497, -260,         -45399
##LAST=      0,             130,             -45897
##MIN=       0,             -10018,          0
##MAX=       8223.62146879497, 346193638,    0
$$ Real data points
##PAGE= N=1
##DATA TABLE= (X++(R..R)), XYDATA
$$ [...]
63388C78733Q218Q719Q916Q939Q935R020R405J0284J1456J2330J2389J1563J0081
63375E08988Q167N951L644J654L99q0l04r20k098l438m401m620l956k671j605
63360E04710j650k823m215n139n912p118q540r420r586r674j0205j0830j0757
63347D08841r661q021o685o073n796n186m247l790m349n332n687n230m670m450
63333C29664m212l603k936k656k620k383j933j618j419q49K96J505K056J863J532
63318C12687J637K097K356K037J342P43M40J95k76q95j317j358j268j493k198
63303C14729l131l919m391m509m129l149j951j352j812k821l329k826j747q57
63289B74806m85m91o80r63j236j344j197q27l50O4K18R1m2J29N15P27O40O39J007
$$ y = [378733, 386951, 395670, 404586, 413525, 422460, 431480, 440885, 451169, 462625, 474955, 487344, 498907, 508988, 517155, 523106, 526750, 528404, 528803, 528723, 528419, 527499, 525401, 521963, 517562, 512942, 508986, 506315, 504710, 503060, 500237, 496022, 490883, 484971, 477853, 469313, 459893, 450307, 440633, 430428, 419598, 408841, 399180, 391159, 384474, 378401, 372605, 367419, 363172, 359382, 355033, 349701, 344014, 338784, 334114, 329664, 325452, 321849, 318913, 316257, 313637, 311254, 309321, 307703, 306284, 305435, 305731, 307236, 309292, 311155, 312687, 314324, 316421, 318777, 320814, 322156, 322899, 323339, 323534, 323258, 322363, 321046, 319688, 318420, 316927, 314729, 311598, 307679, 303288, 298779, 294650, 291501, 289550, 288198, 286386, 283565, 280236, 277410, 275663, 274806, 274321, 273830, 273150, 272187, 270951, 269607, 268410, 267583, 267233, 267297, 267515, 267606, 267564, 267693, 268208, 268935, 269575, 270214, 271221]
63270B71221J389J255Q22R06J778K662K751K314K273K839L204K657J575J039J733
63255C00418L333M840N376M882M142M046M745N660O195O205N886N663O216Q015
63241C75622J0501J2249J2355J1430J0834J1220J2299J3655J5118J6399J7034
63230E18716J6891J6332J5736J5209J4853J4869J5218J5588J5944J6649J7723
63219F93728J8413J7988J6853J6271J6852J7718J7371J5213J1904Q363M787Q07
63207H56268l534p482j0379j2493j4585j6767j8228j8268j7184j5873j4804j3727
63195F92944j2204j0069p398m400j443J070L022M620O068P401Q734J0384J2463
63182G11192J4470J5653J5850J5677J5797J6188J6496J6753J7328J8114J8342
$$ y = [271221, 272610, 273865, 274687, 275593, 277371, 280033, 282784, 285098, 287371, 290210, 293414, 296071, 297646, 298685, 300418, 303751, 308591, 313967, 318849, 322991, 327037, 331782, 337442, 343637, 349842, 355728, 361391, 367607, 375622, 386123, 398372, 410727, 422157, 432991, 444211, 456510, 470165, 485283, 501682, 518716, 535607, 551939, 567675, 582884, 597737, 612606, 627824, 643412, 659356, 676005, 693728, 712141, 730129, 746982, 763253, 780105, 797823, 815194, 830407, 842311, 850674, 855461, 856268, 852734, 845252, 834873, 822380, 807795, 791028, 772800, 754532, 737348, 721475, 706671, 692944, 680740, 670671, 663273, 658873, 657430, 658500, 661522, 666142, 672210, 679611, 688345, 698729, 711192, 725662, 741315, 757165, 772842, 788639, 804827, 821323, 838076, 855404, 873518, 891860]
63171H91860J7548J6324J5604J5432J4994J3781J2052J0003P258L598l82l965
63159A014107p284j0795j4061j6041j6666j7204j8587k0154k0642j9865j8611
63148H34197j7263j5473j3195j1113r713q596p167n569m455m093m159m246m233
63135G24922m175m200m458m945n443n822o216o619o531n470l821k636k440k633
63121F59513k374j616r53o59l24N48J897L146L698L385K570J840J502J409J292
63106F74874J149J196J511J817J690R08k59j139j182n42O7K41L79R87J766J924
63090F85387J328Q08J063J748K072J909J798J986K080J780J474J782K737L808
63076G11760M598N182N677N863N486M861M783N699P171Q386R101R797J0854J1931
$$ y = [891860, 909408, 925732, 941336, 956768, 971762, 985543, 997595, 1007598, 1014856, 1018454, 1018072, 1014107, 1006823, 996028, 981967, 965926, 949260, 932056, 913469, 893315, 872673, 852808, 834197, 816934, 801461, 788266, 777153, 767440, 758844, 751677, 746108, 741653, 737560, 733401, 729155, 724922, 720747, 716547, 712089, 707144, 701701, 695879, 689663, 683044, 676513, 671043, 667222, 664586, 662146, 659513, 657139, 655523, 654570, 653911, 653587, 654135, 656032, 659178, 662876, 666261, 668831, 670671, 672173, 673582, 674874, 676023, 677219, 678730, 680547, 682237, 683145, 682886, 681747, 680565, 680023, 680090, 680331, 680710, 681697, 683463, 685387, 686715, 687523, 688586, 690334, 692406, 694315, 696113, 698099, 700179, 701959, 703433, 705215, 707952, 711760, 716358, 721540, 727217, 733080, 738566, 743427, 748210, 753909, 761080, 769466, 778567, 788364, 799218, 811149]
63062H11149J2456J2525J2948J4305J6236J7882J8866J9690K1135K3422K6018
63051A006632K8176K9556L0322L0738L0877L0800L0742L0837L0754L0011K8760
63040A338205K7810K7647K7817K7635K7216K7177K7461K7170K5682K3317K0566
63029A627703J7179J2557O694K19o333j2849j9289k5461l1105l5799l8869l9975
63017A454672l9752l9344l9144l8403l6324l3035k9203k5145k0841j6479j2385
63006A124617q455m255K71M592Q263J1423J4456J7449K0236K2796K5171K7142
62994A263706K8288K8515K8243K7901K7434K6564K5382K4316K3478K2388K0475
62983A546690J7632J4051R724M401j988r166j6609k3722l0047l5620m0921m6143
$$ y = [811149, 823605, 836130, 849078, 863383, 879619, 897501, 916367, 936057, 957192, 980614, 1006632, 1034808, 1064364, 1094686, 1125424, 1156301, 1187101, 1217843, 1248680, 1279434, 1309445, 1338205, 1366015, 1393662, 1421479, 1449114, 1476330, 1503507, 1530968, 1558138, 1583820, 1607137, 1627703, 1644882, 1657439, 1664133, 1664352, 1658019, 1645170, 1625881, 1600420, 1569315, 1533516, 1494647, 1454672, 1414920, 1375576, 1336432, 1298029, 1261705, 1228670, 1199467, 1174322, 1153481, 1137002, 1124617, 1116162, 1111907, 1112178, 1116770, 1125033, 1136456, 1150912, 1168361, 1188597, 1211393, 1236564, 1263706, 1291994, 1320509, 1348752, 1376653, 1404087, 1430651, 1456033, 1480349, 1503827, 1526215, 1546690, 1564322, 1578373, 1588097, 1592498, 1590510, 1581344, 1564735, 1541013, 1510966, 1475346, 1434425, 1388282]
62971A388282n0604n3358n4260n3970n2951n1113m8549m5928m3744m1636l8944
62960H53225l5583l2067k8995k6790k5488k4381k2407j9502j7049j6238j6341
62949E88384j5566j3483j1504j0768j0640r837q232o730n891n486n302n577o407
62936D72961p272p447o738n594m609m051l836l776l766l805l987m443n103n515
62922D03019n218m378l758l828m165m113l668l298l081k641j851j025m03O2L14
62907C61968J40l75q38j091j273j267o92K97Q32L80o17j451k007k451k627k378
62891C46550k008j805j431m96N95J075R08O55M17k12j031j078J4J278J535Q42
62875C45808J80N8M9k92o51l80N47J357J313N53j26j97Q1J45k56j038k020k845
$$ y = [1388282, 1337678, 1284320, 1230060, 1176090, 1123139, 1072026, 1023477, 977549, 933805, 892169, 853225, 817642, 785575, 756580, 729790, 704302, 679921, 657514, 638012, 620963, 604725, 588384, 572818, 559335, 547831, 537063, 526423, 516586, 508354, 501624, 495733, 490247, 484945, 479368, 472961, 465689, 458242, 451504, 445910, 441301, 437250, 433414, 429638, 425872, 422067, 418080, 413637, 408534, 403019, 397801, 393423, 389665, 385837, 381672, 377559, 373891, 370593, 367512, 364871, 363020, 361995, 361592, 361654, 361968, 362108, 361733, 360895, 359804, 358531, 357264, 356572, 356869, 357701, 358081, 357464, 356013, 354006, 351555, 348928, 346550, 344542, 342737, 341306, 340810, 341405, 342480, 343388, 344043, 344460, 344248, 343217, 342139, 342153, 343431, 344966, 345808, 345988, 346046, 346095, 345803, 345152, 344772, 345319, 346676, 347989, 348542, 348416, 348219, 348300, 348445, 348189, 347151, 345131, 342286]
62857C42286k999k346j524j310j734k190k324k268k120j760j306j140j307j343
62843C16615r49l99q0n7k30n07n84j07P03J076P64N00Q90J412J228N85N07J261
62825C22628K032K228K210K448K632K263J659J712K705L846M106L319K327K131
62811C58246K912L934M377M193M032M379N083N729O253O933P925Q989R742J0102
62797D42829J0470J1414J3107J5182J7200J9203K1537K4244K6877K9086L1119
62786F62268L3554L6696M0329M3967M7211M9908N2076N3580N4007N2978N0689
62775A177263M7782M4526M0365L4550K7012J8359R261J51q571j6600k4000l1012
62763A319086l7451m2625m6042m7906m8775m9034m8833m8208m6976m4822m1894
$$ y = [342286, 339287, 336941, 335417, 334107, 332373, 330183, 327859, 325591, 323471, 321711, 320405, 319265, 317958, 316615, 315666, 315267, 315187, 315130, 314900, 314393, 313809, 313702, 314405, 315481, 316245, 316745, 317635, 319047, 320275, 320860, 321367, 322628, 324660, 326888, 329098, 331546, 334178, 336441, 338100, 339812, 342517, 346363, 350469, 353788, 356115, 358246, 361158, 365092, 369469, 373662, 377694, 382073, 387156, 392885, 399138, 406071, 413996, 422985, 432727, 442829, 453299, 464713, 477820, 493002, 510202, 529405, 550942, 575186, 602063, 631149, 662268, 695822, 732518, 772847, 816814, 864025, 913933, 966009, 1019589, 1073596, 1126574, 1177263, 1225045, 1269571, 1309936, 1344486, 1371498, 1389857, 1399118, 1399269, 1390698, 1374098, 1350098, 1319086, 1281635, 1239010, 1192968, 1145062, 1096287, 1047253, 998420, 950212, 903236, 858414, 816520]
62752H16520l9032l6986l5477l3556l0859k7999k5609k3576k1494j9409j7583
62741E04940j5862j3842j1668j0038r284q850q011o814n898n500n077m025k473
62728C97598j182o98p92p16J32J722L469M756N468O094P244R070J1126J2803J3890
62713D69984J4740J5912J7654J9683K1620K3604K6268K9921L3964L7505M0477
62702G51332M3678M7578N1539N4486N5974N6250N5613N4104N1621M7853M2298
62691A312326L4825K6108J7078P996j364j0779j9533k7315l4449m1003m6343m9944
62679A167603n2012n2965n2851n1753n0160m8340m5857m2394l8603l5364l2564
62668F64740k9490k6225k3672k2158k0942j9377j7712j6384j5244j3998j2869
$$ y = [816520, 777488, 740502, 705025, 671469, 640610, 612611, 587002, 563426, 541932, 522523, 504940, 489078, 475236, 463568, 453530, 444246, 435396, 427385, 420571, 414673, 409173, 404096, 400071, 397598, 396416, 395718, 394926, 394210, 394342, 396064, 399533, 404289, 409757, 415851, 423095, 432165, 443291, 456094, 469984, 484724, 500636, 518290, 537973, 559593, 583197, 609465, 639386, 673350, 710855, 751332, 795010, 842588, 894127, 948613, 1004587, 1060837, 1116450, 1170554, 1222175, 1270028, 1312326, 1347151, 1373259, 1390337, 1398333, 1396969, 1386190, 1366657, 1339342, 1304893, 1263890, 1217547, 1167603, 1115591, 1062626, 1009775, 958022, 907862, 859522, 813665, 771271, 732668, 697304, 664740, 635250, 609025, 585353, 563195, 542253, 522876, 505164, 488780, 473536, 459538, 446669]
62657D46669j2246j1951j1407j0370r159q249p823p656p264o404n486n222n676
62644C37756o072n693m714l838l428l288l120k796k332j865j619j700j921k009
62630B93361j856j526j140q72q13p61l89K30N75L70N0K76J107K011K559K888L389
62613B99459M188M953N321N493O188P699R255R882R826J0396J2276J4750J6954
62600D16640J9046K1511K3993K5693K6533K7093K7607K7749K7259K6053K3906
62589F93083K0683J6829J2876Q630L613j772o427r982j3115j6246j8873k0565
62577F68734k1741k2890k3672k3411k2064k0180j8325j6921j6192j5785j4889
62566D52664j3245j1562j0464r520q046o400n626n968o565o648o309n947n626
$$ y = [446669, 434423, 422472, 411065, 400695, 391536, 383287, 375464, 367808, 360544, 354140, 348654, 343432, 337756, 331684, 325991, 321277, 317439, 314011, 310723, 307603, 304807, 302475, 300610, 298991, 297291, 295370, 293361, 291505, 289979, 288839, 287967, 287154, 286393, 286004, 286234, 286809, 287179, 287229, 287505, 288612, 290623, 293182, 296070, 299459, 303647, 308600, 313921, 319414, 325602, 333301, 342556, 352438, 362264, 372660, 384936, 399686, 416640, 435686, 457197, 481190, 506883, 533416, 560509, 588116, 615865, 643124, 669177, 693083, 713766, 730595, 743471, 752101, 755714, 753942, 747515, 737533, 724418, 708172, 689299, 668734, 646993, 624103, 600431, 577020, 554956, 534776, 516451, 499530, 483338, 467553, 452664, 439419, 427857, 417393, 407873, 399827, 393427, 387801, 381833, 375268, 368620, 362311, 356364, 350738]
62553C50738n191m593l873l157k773k929l200k778j520l02m6o70j322j374q18
62538C16192J66J529L131M476N038M836M591N079O413Q025R450J0850J2586J4565
62524D06927J6378J7984J9784K1922K4006K5721K7387K9543L2164L4633L6339
62513F92788L7039L6784L5734L4000L1337K7163K1264J4409P839K054l437r081
62501I27893j4546j9284k3290k6776k9488l0953l1240l0811k9773k7940k5674
62490F38118k3902k2979k2222k0913j9178j7473j5851j4288j3133j2478j1536
62479D44165r599p357o249o479o616n483l499j792p82k58j62m96p99m74M31J331
62463C95882J972K727L913N203N874N525M572L995M438N440N856N154M018L364
$$ y = [350738, 345547, 340954, 337081, 333924, 331151, 328222, 325022, 322244, 320724, 320422, 320376, 319706, 318384, 317010, 316192, 316358, 317887, 321018, 325494, 330532, 335368, 339959, 345038, 351451, 359476, 368926, 379776, 392362, 406927, 423305, 441289, 461073, 482995, 507001, 532722, 560109, 589652, 621816, 656449, 692788, 729827, 766611, 802345, 836345, 867682, 894845, 916109, 930518, 938357, 940411, 936974, 927893, 913347, 894063, 870773, 843997, 814509, 783556, 752316, 721505, 691732, 663792, 638118, 614216, 591237, 569015, 548102, 528924, 511451, 495600, 481312, 468179, 455701, 444165, 434566, 427209, 420960, 414481, 407865, 402382, 398883, 397091, 396309, 396051, 395889, 395393, 394594, 394120, 394551, 395882, 397854, 400581, 404494, 409697, 415571, 421096, 425668, 429663, 434101, 439541, 445397, 450551, 454569, 457933]
62449D57933L147K554J169n87k162l523m958o560q087r101r244q542p567o983
62435C97489o898o779o113m992l924l147k353j130M39J706K110J773J345J356
62421C70882J862K641L455M079M414M695N314O287P089P189O618N909N627N999
62407D42060O760P298P231O917P063P692P963P241N925M804M075L404K701K260
62393E23394K250K516K789K775K259J489J204J849K969L840M472N464P084R040
62379E73394J1103J3316J5642J7904K0137K2463K4656K6345K7613K8858L0036
62368H11467L0600L0213K9011K7178K4808K2195J9573J6570J2691Q455N190L346
62356A041297J745j054n204r861j4284j8087k0899k2564k3474k4150k4614k4546
$$ y = [457933, 461080, 463634, 464803, 464216, 462054, 458531, 453573, 447013, 438926, 429825, 420581, 412039, 404472, 397489, 390591, 383812, 377699, 372707, 368783, 365636, 363283, 362153, 362592, 364298, 366408, 368181, 369526, 370882, 372744, 375385, 378840, 382919, 387333, 392028, 397342, 403629, 410718, 417907, 424525, 430434, 436061, 442060, 448820, 456118, 463349, 470266, 477329, 485021, 492984, 500225, 506150, 510954, 515029, 518433, 521134, 523394, 525644, 528160, 530949, 533724, 535983, 537472, 538676, 540525, 543494, 547334, 551806, 557270, 564354, 573394, 584497, 597813, 613455, 631359, 651496, 673959, 698615, 724960, 752573, 781431, 811467, 842067, 872280, 901291, 928469, 953277, 975472, 995045, 1011615, 1024306, 1032761, 1037951, 1041297, 1043042, 1041988, 1036784, 1026923, 1012639, 994552, 973653, 951089, 927615, 903465, 878851, 854305]
62344H54305k3843k2661k1181j9649j8382j7407j6368j5097j3888j2938j1954
62333F60937j0743r717r270r007q285p148o094n184m077k824j874j270n39N02
62319E85407J482K091K476K801K970K966L008L215L367L226K796K206J596J210
62305F20817J264J582J709J435R64N81M58Q02J764L048M027M389M343M089L533
62290F54805K723K125K106K455K747K996L553M538N665O587P180P594Q233R569
62276G22876J1774J4558J7474K0241K2655K4505K5775K6749K7653K8332K8561
62265I71153K8343K7643K6067K3342J9915J6497J3115R290N194J783n75k838o003
62252A132926r691j2788j5067j7189j9246k0445k0436j9902j9368j8287j6141
$$ y = [854305, 830462, 807801, 786620, 766971, 748589, 731182, 714814, 699717, 685829, 672891, 660937, 650194, 640477, 631207, 622200, 613915, 606767, 600673, 595489, 591412, 588588, 586714, 585444, 584905, 585407, 586889, 588980, 591456, 594257, 597227, 600193, 603201, 606416, 609783, 613009, 615805, 618011, 619607, 620817, 622081, 623663, 625372, 626807, 627771, 628352, 628810, 629612, 631376, 634424, 638451, 642840, 647183, 651272, 654805, 657528, 659653, 661759, 664214, 666961, 669957, 673510, 678048, 683713, 690300, 697480, 705074, 713307, 722876, 734650, 749208, 766682, 786923, 809578, 834083, 859858, 886607, 914260, 942592, 971153, 999496, 1027139, 1053206, 1076548, 1096463, 1112960, 1126075, 1135365, 1140559, 1142342, 1141767, 1138929, 1132926, 1123235, 1110447, 1095380, 1078191, 1058945, 1038500, 1018064, 998162, 978794, 960507, 944366]
62241I44366j3675j2077j1352j0540r317q350p907p213n647l770k582k258k205
62228H47473j960j511r73m13O3M13P10Q49M85l91j104r88k38L56M16K95M59J016
62210H44957J800K585L118L279L277L447L892M533N389O491P605Q473R275J0370
62196I18491J1570J2196J2054J1826J2141J2697J2738J2176J1700J1820J2371
62185A051780J3044J3951J5349J7067J8627J9892K1183K2637K3796K4029K3172
62174A264527K1493J9272J6739J4246J1989R688O990M277K422J595Q81n79k598
62161A370942m498o192q076j0152j1875j2816j2976j2483j1467j0171q837p495
62149A253904o150n127m843n291o063o739p003o638n875n530o134p051p059n851
$$ y = [944366, 930691, 918614, 907262, 896722, 887405, 879055, 871148, 863935, 858288, 854518, 851936, 849678, 847473, 845513, 844002, 843029, 842616, 842679, 843092, 843802, 844651, 845136, 844745, 843641, 842653, 842415, 842771, 843187, 843482, 843941, 844957, 846757, 849342, 852460, 855739, 859016, 862463, 866355, 870888, 876277, 882768, 890373, 898846, 908121, 918491, 930061, 942257, 954311, 966137, 978278, 990975, 1003713, 1015889, 1027589, 1039409, 1051780, 1064824, 1078775, 1094124, 1111191, 1129818, 1149710, 1170893, 1193530, 1217326, 1241355, 1264527, 1286020, 1305292, 1322031, 1336277, 1348266, 1357954, 1364944, 1369221, 1371643, 1373238, 1374119, 1373540, 1370942, 1366444, 1360252, 1352176, 1342024, 1330149, 1317333, 1304357, 1291874, 1280407, 1270236, 1261399, 1253904, 1247754, 1242627, 1237784, 1232493, 1226430, 1219691, 1212688, 1206050, 1200175, 1194645, 1188511, 1181460, 1174401, 1168550]
62135A168550m388l627l570l705l785l780l509k773j670n48K70O77R11J509K879
62120A143441M821O770Q325R128Q472N748J517k527m945n536m838l442k048j574
62106A163312k533m603p189r976j2587j4223j4293j3148j1659j0248q864p595
62094A046394o660n914m908l531k125r34J35J156J985K545L001L593M478N725
62080A044940P161Q236Q414P803P150O951O848O034M181J786l17j680k537l479
62066A101491m897o677q448j0028j1517j2927j4016j4717j5522j7017j8905j9940
62054I46880j9307j7733j6620j6259j5658j4239j2740j1995j1701j1186j0652
62043G88790j0609j0612r763q324p599q102q955r272r087q641p877p116p139p982
$$ y = [1168550, 1164162, 1160535, 1156965, 1153260, 1149475, 1145695, 1142186, 1139413, 1137743, 1137195, 1137465, 1138142, 1139053, 1140562, 1143441, 1148262, 1155032, 1163357, 1172485, 1180957, 1186705, 1188222, 1185695, 1180750, 1175214, 1170376, 1166934, 1164886, 1163312, 1160779, 1156176, 1148987, 1139011, 1126424, 1112201, 1097908, 1084760, 1073101, 1062853, 1053989, 1046394, 1039734, 1033820, 1028912, 1025381, 1023256, 1022322, 1022457, 1023613, 1025598, 1028143, 1031144, 1034737, 1039215, 1044940, 1052101, 1060337, 1068751, 1076554, 1083704, 1090655, 1097503, 1103537, 1107718, 1109504, 1109187, 1107507, 1104970, 1101491, 1096594, 1089917, 1081469, 1071441, 1059924, 1046997, 1032981, 1018264, 1002742, 985725, 966820, 946880, 927573, 909840, 893220, 876961, 861303, 847064, 834324, 822329, 810628, 799442, 788790, 778181, 767569, 757806, 749482, 741883, 733781, 724826, 715554, 706467, 697826, 689949, 682833, 675694, 667712]
62029F67712q522p950o838o060n557m994m763n279n880n616m731m242m310m111
62015E88859l322k597k485k686k593j986j061l13k90j036j834k007j776j765k051
62000E61057k324k710l499m264m192l320k539k331k361k367k526k754k526j740
61986E21604r66n46j31N59J217J538J795K394L319M289N008N173M794M551N205
61971E59803O518P419P380O925O671O735P227Q329R523R749Q933Q378R011J0150
61957F72751J0750J0966J1526J2380J3051J3792J5157J6833J8037J8874K0189
61946H34306K2101K3718K4511K4922K5474K6035K6352K6673K7490K9010L1029
61935A121621L3002L4265L4715L5248L7057M0423M4655M9180N4064N9483O5397
$$ y = [667712, 659190, 651240, 644402, 638342, 632785, 627791, 623028, 617749, 611869, 606253, 601522, 597280, 592970, 588859, 585537, 582940, 580455, 577769, 575176, 573190, 572129, 571816, 571526, 570490, 568656, 566649, 564873, 563108, 561057, 558733, 556023, 552524, 548260, 544068, 540748, 538209, 535878, 533517, 531150, 528624, 525870, 523344, 521604, 520638, 520092, 519961, 520520, 521737, 523275, 525070, 527464, 530783, 535072, 540080, 545253, 550047, 554598, 559803, 566321, 573740, 581120, 588045, 594716, 601451, 608678, 617007, 626530, 636279, 645212, 653590, 662601, 672751, 683501, 694467, 705993, 718373, 731424, 745216, 760373, 777206, 795243, 814117, 834306, 856407, 880125, 904636, 929558, 955032, 981067, 1007419, 1034092, 1061582, 1090592, 1121621, 1154623, 1188888, 1223603, 1258851, 1295908, 1336331, 1380986, 1430166, 1484230, 1543713, 1609110]
61924A609110P1942P9563Q8352R7816J07605J18043J29539J41855J54404J66983
61914B765212J79673J92081K03241K12345K19144K23248K23165K16545K01643
61905D636297J78368J47720J10627O7980K1833k4357o7334j05524j38610j66109
61895D660891j87136k01234k08773k10547k07625k01460j93426j84035j73198
61886B893457j61325j49564j38681j28328j17818j07163r6957q7619p9225p1847
61876A754930o5554o0063n4802m9404m4035l9166l5066l1531k8117k4569k1006
61865A301617j7632j4543j1809r507p487n381l145j206J52J273K459L341L523
61852A241655L461L885M450M037K476J000P04J359K175K901L669M490N459O796
$$ y = [1609110, 1681052, 1760615, 1848967, 1946783, 2054388, 2172431, 2301970, 2443825, 2598229, 2765212, 2944885, 3136966, 3340207, 3552552, 3771696, 3994944, 4218109, 4434654, 4636297, 4814665, 4962385, 5073012, 5140992, 5162825, 5138468, 5071134, 4965610, 4827000, 4660891, 4473755, 4272521, 4063748, 3853201, 3645576, 3444116, 3250690, 3066655, 2893457, 2732132, 2582568, 2443887, 2315559, 2197741, 2090578, 1993621, 1906002, 1826777, 1754930, 1689376, 1629313, 1574511, 1525107, 1481072, 1441906, 1406840, 1375309, 1347192, 1322623, 1301617, 1283985, 1269442, 1257633, 1248126, 1240639, 1235258, 1232113, 1230907, 1231059, 1232332, 1234791, 1238132, 1241655, 1245116, 1249001, 1253451, 1257488, 1259964, 1260964, 1261668, 1263027, 1265202, 1268103, 1271772, 1276262, 1281721, 1288517]
61838A288517Q142Q466P320N616M418L562K254N09r82k050l039l743l429k107
61824A313454p73j56J13Q27K299M391O861R357J1520J3455J5735J8695K2021K5203
61810A443002K8120L0957L3928L7185M0763M4489M8165N1968N6354O1548O7322
61799A943801P3380P9644Q6286R3771J02772J13578J25632J38135J51155J65579
61789C073733J81978K00151K19807K40914K63108K85574L07910L30299L52233
61780E455707L71704L86253L94173L94002L83500L60233L23020K72169K08800
61771H549561J35025N4720k6966j05322j76841k38691k88643l25973l51599l66834
61761F858437l72526l69752l60593l47417l31686l13920k94625k74686k54913
$$ y = [1288517, 1296659, 1305125, 1312445, 1318061, 1322479, 1326041, 1328295, 1328804, 1327822, 1325772, 1322733, 1318990, 1315561, 1313454, 1312681, 1312525, 1312638, 1313465, 1315764, 1320155, 1327016, 1336373, 1347893, 1361348, 1377083, 1395778, 1417799, 1443002, 1471122, 1502079, 1536007, 1573192, 1613955, 1658444, 1706609, 1758577, 1814931, 1876479, 1943801, 2017181, 2096825, 2183111, 2276882, 2379654, 2493232, 2618864, 2756999, 2908154, 3073733, 3255711, 3455862, 3675669, 3916583, 4179691, 4465265, 4773175, 5103474, 5455707, 5827411, 6213664, 6607837, 7001839, 7385339, 7745572, 8068592, 8340761, 8549561, 8684586, 8739306, 8712340, 8607018, 8430177, 8191486, 7902843, 7576870, 7225271, 6858437, 6485911, 6116159, 5755566, 5408149, 5076463, 4762543, 4467918, 4193232, 3938319]
61752C938319k35680k17072j99238j82513j67227j53443j40820j28996j17957
61743B395373j07856r8546q9818q2038p5919p1406o7322o2649n7681n3352m9811
61732A578975m6378m2770l9620l7523l6154l4668l2629l0269k8004k6050k4404
61721A200506k2985k1715k0543j9459j8491j7691j7104j6719j6486j6394j6454
61710I96465j6554j6441j5946j5146j4218j3236j2262j1513j1171j1052j0729
61699H48197j0052r367r006q717p899o413m896m045l813l603l136k750k808l233
61685G68459l898m984o536p964q634q897r766j1437j2767j2624j1264r927r363
61672F50398r288r104q554p640o300m477k415p11J8l07j039j424j460j891l158
$$ y = [3938319, 3702639, 3485567, 3286329, 3103816, 2936589, 2783146, 2642326, 2513330, 2395373, 2287517, 2188971, 2099153, 2017115, 1941196, 1869790, 1802468, 1739819, 1682138, 1628786, 1578975, 1532597, 1489827, 1450207, 1412684, 1376530, 1341862, 1309233, 1278964, 1250960, 1224910, 1200506, 1177521, 1155806, 1135263, 1115804, 1097313, 1079622, 1062518, 1045799, 1029313, 1012919, 996465, 979911, 963470, 947524, 932378, 918160, 904924, 892662, 881149, 869978, 858926, 848197, 838145, 828778, 819772, 811055, 803156, 796743, 791847, 787802, 783989, 780386, 777250, 774500, 771692, 768459, 764561, 759577, 753041, 745077, 736443, 727546, 717780, 706343, 693576, 680952, 669688, 659761, 650398, 641110, 632006, 623452, 615812, 609512, 605035, 602620, 601909, 601927, 601620, 600581, 599157, 597697, 595806, 592648]
61657E92648m720n669n779n526n276m950m451l988l797l806l709l269k499j684
61643E33525j215j266j638k056k476k916l145k826k032j299j053j183j245j010
61629E08165o35m10m23n36n78n18m03k62k00m93j255k119k468k135j528j002m83
61612D92717J62P39R85R35P56N26L33L02K95m3o35q05j55Q38J571K189L091L961
61594E07762M103L589L203L384L926M706N830O998P531P345P210P717Q652R600
61580E91556J0573J1651J2573J3155J3777J5003J6955J9266K1403K2928K3826
61569G72666K4700K6156K7786K8288K6889K4181K1229J8442J5645J2733R703O485
61557A014903L276P95l62m54k30n5J86N74R95J374J654J692J471J270J229J034
$$ y = [592648, 587928, 582259, 576480, 570954, 565678, 560728, 556277, 552289, 548492, 544686, 540977, 537708, 535209, 533525, 532310, 531044, 529406, 527350, 524874, 521958, 518813, 515987, 513955, 512656, 511603, 510420, 509175, 508165, 507530, 507120, 506697, 506161, 505583, 505065, 504662, 504400, 504200, 503707, 502452, 500333, 497865, 495730, 494202, 493200, 492717, 492879, 493618, 494603, 495538, 496294, 496820, 497153, 497455, 497750, 497707, 497072, 496267, 496112, 496950, 498521, 500710, 503801, 507762, 511865, 515454, 518657, 522041, 525967, 530673, 536503, 543501, 551032, 558377, 565587, 573304, 581956, 591556, 602129, 613780, 626353, 639508, 653285, 668288, 685243, 704509, 725912, 748840, 772666, 797366, 823522, 851308, 879596, 906485, 930666, 951895, 970337, 985982, 998715, 1008418, 1014903, 1018179, 1018974, 1018612, 1018158, 1017928, 1017873, 1018059, 1018633, 1019628, 1021002, 1022656, 1024348, 1025819, 1027089, 1028318, 1029352]
61541A029352L97m14r94j540k596m129n393n754n242m252l207k482k177j829o97
61526I89043J421L904O007P611R128J0894J2911J5124J7679K0763K4263K7875
61514A146623L1621L5975M1157M6510N1080N4833N8754O3618O9241P5185Q1578
61503A756175Q8753R6430J03823J10200J14961J17510J17585J15483J11353J04620
61493B836893R4704Q2111O8139N3630L8739K3877J0048j845j1435j8484k2831
61482C153546k4956k5888k6184k5559k3947k2347k2014k3246k5547k8716l3076
61471B872066l8619m4596n0034n4310n7081n8134n7466n5339n1979m7411m1736
61460B315361l5425k9112k3197j7853j3260r530o329k973R12M994Q760J2216J5856
$$ y = [1029352, 1029749, 1029335, 1028341, 1026801, 1024205, 1020076, 1014683, 1008929, 1003687, 999435, 996228, 993746, 991569, 989740, 989043, 990464, 994368, 1000375, 1007986, 1017114, 1028008, 1040919, 1056043, 1073722, 1094485, 1118748, 1146623, 1178244, 1214219, 1255376, 1301886, 1352966, 1407799, 1466553, 1530171, 1599412, 1674597, 1756175, 1844928, 1941358, 2045181, 2155381, 2270342, 2387852, 2505437, 2620920, 2732273, 2836893, 2931597, 3013708, 3081847, 3135477, 3174216, 3198093, 3208141, 3206296, 3194861, 3176377, 3153546, 3128590, 3102702, 3076518, 3050959, 3027012, 3004665, 2982651, 2959405, 2933858, 2905142, 2872066, 2833447, 2788851, 2738817, 2684507, 2627426, 2569292, 2511826, 2456487, 2404508, 2357097, 2315361, 2279936, 2250824, 2227627, 2209774, 2196514, 2186984, 2180655, 2177682, 2178594, 2183588, 2192348, 2204564, 2220420]
61447B220420K0079K4987L0545L6508M2178M6751M9960N1936N2340N0115M4458
61436B670277L5719K5192J4413M888k141o360q612j0038j1047j1391j0905r685
61424B680310p774n202k222R35M414Q272J1655J2900J0647M643m339j4862k5108
61411B674269l3412l8915m1687m2223m1022l8525l5183l1527k8234k5867k4272
61400B293402k2553k0082j7299j5037j3300j1327q711n709k449J420O031J0962
61388B195348J5876K1025K6780L3168M0127M7776N6013O4232P1873P9007Q5956
61377B737181R2563R8186J02306J04787J05539J04201J00244R3380Q3816P1994
61367C694197N8046M1696K3129L723j4544l0600m4742n7547o8897p8381q6069
$$ y = [2220420, 2240499, 2265486, 2296031, 2332539, 2374717, 2421468, 2471428, 2523364, 2575704, 2625819, 2670277, 2705996, 2731188, 2745601, 2750489, 2748348, 2741988, 2733376, 2723338, 2712291, 2700900, 2689995, 2680310, 2672536, 2667334, 2665112, 2666047, 2670461, 2678733, 2690388, 2703288, 2713935, 2718578, 2714239, 2699377, 2674269, 2640857, 2601942, 2560255, 2518032, 2477010, 2438485, 2403302, 2371775, 2343541, 2317674, 2293402, 2270849, 2250767, 2233468, 2218431, 2205131, 2193804, 2185093, 2179384, 2176935, 2178355, 2184386, 2195348, 2211224, 2232249, 2259029, 2292197, 2332324, 2380100, 2436113, 2500345, 2572218, 2651225, 2737181, 2829744, 2927930, 3030236, 3135023, 3240562, 3344763, 3445007, 3538387, 3622203, 3694197, 3752243, 3793939, 3817068, 3820791, 3806247, 3775647, 3730905, 3673358, 3604461, 3526080, 3440011]
61356C440011r2350r7181j00160j01274j01144j00349r8865r6339r2673q8209
61346B471467q3361p8285p2911o7257o1527n5898n0361m4829l9344l4031k8897
61335A854766k3839j8758j3559q146k646K503O933J0754J4350J7788K0720K2847
61323A883713K4140K4533K3708K1476J8184J4651J1574R136P150N650N099N788
61311B054802P051P643P106O318O332P113P910Q451R037R566R324P841N467K939
61297B156900P72q70k124l283m447n399o156p261r038j0820j1732j1946j2294
61284B072302j2695j2090j0010p157m141q62K305L930L035M51k308m849p624j0374
61270B009913j2137j2601j2494j2428j2217j1490j0292q845p211n398l421j000
$$ y = [3440011, 3347661, 3250480, 3150320, 3049046, 2947902, 2847553, 2748688, 2652349, 2559676, 2471467, 2388106, 2309821, 2236910, 2169653, 2108126, 2052228, 2001867, 1957038, 1917694, 1883663, 1854766, 1830927, 1812169, 1798610, 1790464, 1787818, 1790321, 1797254, 1808008, 1822358, 1840146, 1860866, 1883713, 1907853, 1932386, 1956094, 1977570, 1995754, 2010405, 2021979, 2031115, 2038265, 2043915, 2049014, 2054802, 2061853, 2069496, 2076602, 2082920, 2089252, 2096365, 2104275, 2112726, 2121763, 2131329, 2140653, 2148494, 2153961, 2156900, 2157672, 2156802, 2154678, 2151395, 2146948, 2141549, 2135393, 2128132, 2119094, 2108274, 2096542, 2084596, 2072302, 2059607, 2047517, 2037507, 2030350, 2026209, 2025347, 2027652, 2031582, 2034617, 2035068, 2032760, 2027911, 2020287, 2009913, 1997776, 1985175, 1972681, 1960253, 1948036, 1936546, 1926254, 1917409, 1910198, 1904800, 1901379, 1900379]
61258A900379K377O883J1987J6900K1269K5394K9861L5043M0984M7654N5144O3329
61246B257204P1459P8387Q3208Q5237Q3369P6158O3070M5406K5601N815j2523
61235B862391k8359m0939n0179n6591o0713o2827o3063o1481n8025n2711m5857
61224B281646l7927k9287k0478j2730p700o449q754j3592j9968k7063l3730l8499
61212B025469m0478m0179l8982l7807l6570l4882l2702l0055k6742k2916j9474
61201A664682j7149j5543j3826j2183j1616j2360j3459j4170j4812j5880j7150
61190A506534j8151j8794j9071j8779j8068j7633j7750j7719j6856j5517j4466
61179A313730j3791j3082j2247j1389j0254q666p140o322n981n309m170l236l023
$$ y = [1900379, 1902756, 1909639, 1921626, 1938526, 1959795, 1985189, 2015050, 2050093, 2091077, 2138731, 2193875, 2257204, 2328663, 2407050, 2490258, 2575495, 2658864, 2735022, 2798092, 2843498, 2869099, 2874914, 2862391, 2834032, 2793093, 2742914, 2686323, 2625610, 2562783, 2499720, 2438239, 2380214, 2327503, 2281646, 2243719, 2214432, 2193954, 2181224, 2173524, 2167075, 2158321, 2144729, 2124761, 2097698, 2063968, 2025469, 1984991, 1944812, 1905830, 1868023, 1831453, 1796571, 1763869, 1733814, 1707072, 1684156, 1664682, 1647533, 1631990, 1618164, 1605981, 1594365, 1582005, 1568546, 1554376, 1539564, 1523684, 1506534, 1488383, 1469589, 1450518, 1431739, 1413671, 1396038, 1378288, 1360569, 1343713, 1328196, 1313730, 1299939, 1286857, 1274610, 1263221, 1252967, 1244301, 1237161, 1230839, 1224858, 1219549, 1215379, 1212143, 1209120]
61166A209120l503m794p422j1586j6549k1064k4220k5849k6329k6073k5097k3305
61154I93329k1145j9563j8964j8674j7884j6699j5733j5037j4228j3356j2839
61143H09207j2583j1968j0807r600q646p585o089m465l244k459j654l89J405L371
61129G34494M965N940O653P674R124J0581J1579J1893J1395J0010P887N346K644
61116H40185K6k025k935k539j303j1O85N15k73j040j282j064q24p81p67o62p10
61099H25195j200k039k802l255l593m083m559m546l900l016k343k001k026k540
61085G83292l300l554k923k020j608j505j072l86N0M50J435K683L212L088L490
61070G81332M758N791N943O171P451R216J0320J0566J0373R803Q918Q342Q521
$$ y = [1209120, 1205617, 1200823, 1193401, 1181815, 1165266, 1144202, 1119982, 1094133, 1067804, 1041731, 1016634, 993329, 972184, 952621, 933657, 914983, 897099, 880400, 864667, 849630, 835402, 822046, 809207, 796624, 784656, 773849, 764249, 755603, 748018, 741929, 737464, 734220, 731761, 730107, 729718, 731123, 734494, 739459, 745399, 752052, 759726, 768850, 779431, 791010, 802903, 814298, 824308, 832195, 837541, 840185, 840211, 838186, 835251, 832712, 831409, 831398, 832083, 832598, 832325, 831285, 830003, 828939, 828115, 827334, 826567, 825905, 825195, 823995, 821956, 819154, 815899, 812306, 808223, 803664, 799118, 795218, 792202, 789859, 787858, 785832, 783292, 779992, 776438, 773515, 771495, 769887, 768382, 767310, 766924, 766974, 767424, 768859, 771542, 774754, 777842, 781332, 786090, 791881, 797824, 803995, 811446, 820662, 830982, 841548, 851921, 861724, 870642, 878984, 887505]
61057H87505Q961R013Q746Q459Q101P849Q331R479J0179R891R658J0504J1928
61044A008604J3031J4106J5830J7870J9688K1771K4627K7430K9208L0677L3361
61033A256203L7461M2048M6697N1476N5949N9684O3044O6219O8426O9631P1956
61022A888794P7500Q5799R5252J05905J18481J31963J44743J57473J72315J90584
61012C168809K13846K45889K90119L46249M13125M93251N90253P04325Q36326
61003G302192R94077J186353J413063J672472J971454K296635K555754K577437
60995B1969437K227124J551379P86890J98005r7363j42064k0251K17948N00652
60986B7191757O63278N12110j1474p52079j447963j915828k133057k174849k114754
$$ y = [887505, 896466, 905479, 914225, 922684, 930785, 938634, 946965, 956444, 966623, 976514, 986172, 996676, 1008604, 1021635, 1035741, 1051571, 1069441, 1089129, 1110900, 1135527, 1162957, 1192165, 1222842, 1256203, 1293664, 1335712, 1382409, 1433885, 1489834, 1549518, 1612562, 1678781, 1747207, 1816838, 1888794, 1966294, 2052093, 2147345, 2253250, 2371731, 2503694, 2648437, 2805910, 2978225, 3168809, 3382655, 3628544, 3918663, 4264912, 4678037, 5171288, 5761541, 6465866, 7302192, 8296269, 9482622, 10895685, 12568157, 14539611, 16836246, 19392000, 21969437, 24196561, 25747940, 26534830, 26732835, 26635472, 26493408, 26473157, 26691105, 27191757, 27855035, 28367145, 28355671, 27603592, 26155629, 24239801, 22106744, 19931895, 17817141]
60977A7817141j989441j819462j626502j428884j237419j060527r05811p74917
60969F974178o63292n67057m85986m19388l63964l17026k78140k46312k18887
60960C414126j94385j73634j56944j42780j30051j19231j10223j01504r2567q5093
60950B107714q0414p7571p4933p2096o9167o5649o1183n6253n1342m6369m1501
60939A411236l7374l4092l1160k8711k7435k7008k6069k4212k2549k1736k0970
60928A109920j9545j7983j6886j6035j5364j5444j6184j6312j5122j3623j3043
60917I34379j3262j3505j3575j3420j2543j0899r572r524j0268j0713j0645j0520
60905G95933j0407j0038r521r134q728p988p093o556o578o919p148o813n761m427
$$ y = [17817141, 15827700, 14008238, 12381736, 10952852, 9715433, 8654906, 7749095, 6974178, 6310886, 5743829, 5257843, 4838455, 4474491, 4157465, 3879325, 3633013, 3414126, 3219741, 3046107, 2889163, 2746383, 2616332, 2497101, 2386878, 2285374, 2192807, 2107714, 2027300, 1949729, 1874796, 1802700, 1733533, 1667884, 1606701, 1550448, 1499106, 1452737, 1411236, 1373862, 1339770, 1308610, 1279899, 1252464, 1225456, 1199387, 1175175, 1152626, 1130890, 1109920, 1090375, 1072392, 1055506, 1039471, 1024107, 1008663, 992479, 976167, 961045, 947422, 934379, 921117, 907612, 894037, 880617, 868074, 857175, 847603, 838079, 827811, 817098, 806453, 795933, 785526, 775488, 765967, 756833, 748105, 740117, 733024, 726468, 719890, 712971, 705823, 699010, 693249, 688822]
60891F88822l432k812k163j430r03m26M13J362J721J661K140L176L471K298O03
60876F94501m30r20j530k129k159j688j176o91r2M53P65J102J767K628L350L610
60860F97361K890Q78j593k902k439j235l59K62Q02N18j166l384m851n538o314
60845F72930p400q286q808r229r513r414r133q984q588p264n156l220k131j814
60831E73990j896k032j854j252o20m04m55l20N8M03N92O63N82M85Q25J712K429
60814E72906K211J344Q47J179J831K129J915J502J277J378J557J435J024O43K45
60799E93423n70j627j979j160l0K90j68n85o50p36j074j515j944k274k237j804
60783E75360j507j799k333k502k365k356k375k001j366j063j225j453j534j592
$$ y = [688822, 685390, 682578, 680415, 678985, 678082, 677656, 678069, 679431, 681152, 682813, 684953, 688129, 691600, 693898, 694501, 694071, 693151, 691621, 689492, 687333, 685645, 684469, 683778, 683686, 684139, 684904, 686006, 687773, 690401, 693751, 697361, 700251, 701129, 699536, 696634, 694195, 692960, 692601, 692863, 693665, 694183, 693017, 689633, 684782, 679244, 672930, 665530, 657244, 648436, 639207, 629694, 620280, 611147, 602163, 593575, 586311, 581155, 577935, 575804, 573990, 572094, 570062, 568208, 566956, 566336, 565932, 565477, 565157, 565215, 565618, 566210, 566873, 567455, 567940, 568765, 570477, 572906, 575117, 576461, 577308, 578487, 580318, 582447, 584362, 585864, 587141, 588519, 590076, 591511, 592535, 593178, 593423, 592853, 591226, 589247, 588087, 588057, 588347, 588179, 587594, 586944, 586208, 585134, 583619, 581675, 579401, 577164, 575360, 573853, 572054, 569721, 567219, 564854, 562498, 560123, 558122, 556756, 555693, 554468, 553015, 551481, 549889]
60769E49889j552j253j043j421k054j898m86J433K757K989K330J355P84J000J565
60754E54395J608Q76N1q9M49R40P24j95j126j399j144j133j719k341k377j993
60738E45527j670j392r49p07j211k209k808k617k120j955k319k974l378k998k096
60723E14124j874l099m842n489m791l956l824m038m086m024l839l169k108j348
60709D63637j054n79K12L12q68k213k152p45N79J021J151J684K445K852K731K327
60693D71340J888J550J421J553J874K277K716L193L656L879L605K866K108J796
60679E05722J952K274K605K898K910K385J615J238J385J575J601J869K482K721
60665E35232K089J320J513K562L295L119K645K532K489J888Q07p7l91m11o51j354
$$ y = [549889, 548337, 547084, 546041, 544620, 542566, 540668, 540182, 541615, 544372, 547361, 549691, 551046, 551830, 552830, 554395, 556003, 556879, 556930, 556841, 557290, 558230, 558954, 558759, 557633, 556234, 555090, 553957, 552238, 549897, 547520, 545527, 543857, 542465, 541516, 540809, 539598, 537389, 534581, 531964, 529844, 527889, 525570, 522596, 519218, 516220, 514124, 512250, 509151, 504309, 498820, 494029, 490073, 486249, 482211, 478125, 474101, 470262, 467093, 464985, 463637, 462583, 462004, 462216, 462528, 461660, 459447, 457295, 456550, 457129, 458150, 459301, 460985, 463430, 466282, 469013, 471340, 473228, 474778, 476199, 477752, 479626, 481903, 484619, 487812, 491468, 495347, 498952, 501818, 503926, 505722, 507674, 509948, 512553, 515451, 518361, 520746, 522361, 523599, 524984, 526559, 528160, 530029, 532511, 535232, 537321, 538641, 540154, 542716, 546011, 549130, 551775, 554307, 556796, 558684, 559491, 559414, 559023, 558612, 557961, 556607]
60649E56607k393l402m027m202m173m154m060l686l049k452k222k457k921l154
60635E10255k803k006j308j053j074j114j276j741k213k188j719j433j675k044
60621D86608k027j678j393j378j538j666j467p86j9J19m25p79l21M33P07P45J328
60604D76463K302K643K012J214R33R11P13N32P01J042J171J055Q53O10M24N04
60588D94083P14N56j16p28o26K41J448K427K561J624M13J96J191K299K691K772
60572E11746L101L244K692K055K296L235L848L702L115K263J224O63J298K670
60558E47152L478L264K818K784K929L067L707N255P186Q663R581J0569J2285J4992
60544F37730J8579K2671K6842L0818L4535L8132M2037M6674N1682N5648N7086
$$ y = [556607, 554214, 550812, 546785, 542583, 538410, 534256, 530196, 526510, 523461, 521009, 518787, 516330, 513409, 510255, 507452, 505446, 504138, 503085, 502011, 500897, 499621, 497880, 495667, 493479, 491760, 490327, 488652, 486608, 484581, 482903, 481510, 480132, 478594, 476928, 475461, 474675, 474656, 474775, 474350, 473571, 473250, 473683, 474390, 475135, 476463, 478765, 481408, 483420, 484634, 485567, 486478, 487191, 487723, 488424, 489466, 490637, 491692, 492545, 493155, 493579, 494083, 494797, 495353, 495237, 494509, 493883, 494124, 495572, 497999, 500560, 502184, 502597, 502793, 503984, 506283, 508974, 511746, 514847, 518091, 520783, 522838, 525134, 528369, 532217, 535919, 539034, 541297, 542521, 543184, 544482, 547152, 550630, 553894, 556712, 559496, 562425, 565492, 569199, 574454, 581640, 590303, 599884, 610453, 622738, 637730, 656309, 678980, 705822, 736640, 771175, 809307, 851344, 898018, 949700, 1005348, 1062434]
60533A062434N5471N0895M3187L2147J8540L995j0044k2631l2754l9436m2695
60522A119109m3568m2954m0968l7640l3484k9069k4596k0166j5906j1683p274
60511H11801l039L03K819N580R377J3888J8539K3478K9072L5061M0863M6225N0789
60498A084756N3361N2519M8002M0827L2010K1773J0278j360j1306j8193k1766
60487A290901k2365k0158j5239q294m75P633J6451K6420L6972M6964N5622O2298
60475A476730O5702O4404N8092M7431L2669J3620q533l0583m9295o3516p3703
60464A533018q0114q2468q1052p7157p2178o6772o0932n4516m7683m1088l5597
60453H33461l1563k8517k5735k2997k0508j8292j6048j3553j0953q607o786n473
$$ y = [1062434, 1117905, 1168800, 1211987, 1244134, 1262674, 1266669, 1256625, 1233994, 1201240, 1161804, 1119109, 1075541, 1032587, 991619, 953979, 920495, 891426, 866830, 846664, 830758, 819075, 811801, 808762, 809065, 811884, 817464, 826841, 840729, 859268, 882746, 911818, 946879, 987742, 1033967, 1084756, 1138117, 1190636, 1238638, 1279465, 1311475, 1333248, 1343526, 1342166, 1330860, 1312667, 1290901, 1268536, 1248378, 1233139, 1224845, 1224370, 1232003, 1248454, 1274874, 1311846, 1358810, 1414432, 1476730, 1542432, 1606836, 1664928, 1712359, 1745028, 1758648, 1750115, 1719532, 1670237, 1606721, 1533018, 1452904, 1370436, 1289384, 1212227, 1140049, 1073277, 1012345, 957829, 910146, 869058, 833461, 801898, 773381, 747646, 724649, 704141, 685849, 669801, 656248, 645295, 636688, 629902, 624429]
60441F24429m464l595k940k594k349j836r79j14L76K77m82j689k721l002k644
60426E95673k251k119k054j962k008k075j773j129o38l45M10J880L222L561L234
60411E91626L269M022N024N924O852P857Q661R129R528J0197J1217J2395J3359
60398F99060J3727J3479J3039J2812J2672J2219J1409J0583R891R013P592N763
60386H31259M122L188K974L048K995K707K269J699R94K90k76p33j103j259j204
60371H50970j305j800k294k297k080k276k736k575j478j89N34O93N16k8p67j079
60355H31809p09j69R0L42Q56J149O47m21j472k464l649m799n501n858o229o458
60339G97164o092n208m410m028l962m105m426m692m676m533m526m546m350m114
$$ y = [624429, 619965, 616370, 613430, 610836, 608487, 606651, 605672, 605558, 605934, 606211, 605729, 604040, 601319, 598317, 595673, 593422, 591303, 589249, 587287, 585279, 583204, 581431, 580302, 579664, 579319, 579729, 581609, 584831, 588392, 591626, 594895, 598917, 603941, 609865, 616717, 624574, 633235, 642364, 651892, 662089, 673306, 685701, 699060, 712787, 726266, 739305, 752117, 764789, 777008, 788417, 799000, 808891, 817904, 825496, 831259, 835381, 838569, 841543, 844591, 847586, 850293, 852562, 854261, 855255, 855545, 855269, 854536, 853433, 852174, 850970, 849665, 847865, 845571, 843274, 841194, 838918, 836182, 833607, 832129, 831940, 832474, 833167, 833683, 833655, 832888, 831809, 831100, 830931, 831021, 831363, 832219, 833368, 834015, 833594, 832122, 829658, 826009, 821210, 815709, 809851, 803622, 797164, 791072, 785864, 781454, 777426, 773464, 769359, 764933, 760241, 755565, 751032, 746506, 741960, 737610, 733496]
60325G33496m190m530m832n032n097m655l479k142j469j487j638j866k574l510
60311F86995l663k514o82R31K048K826L466M280N600P313Q829R749J0062R619
60297G44859Q026N345K358l26k836n365p421q343q216p675p065o328n527m814
60283F96672l872k094L87K394K904K294J960K709M016M946N341N739O379O910
60269G36685P035O975P089P458Q055Q974J0245J1591J2699J3451J3784J3616J3147
60256H70804J2906J3068J3157J2751J2194J2095J2417J2678J2848J3356J4281
60245A012555J5230J6124J7434J9427K1670K3594K5198K6977K9454L2883L7079
60234A277625M1374M5076M8210N1580N5889O0973O5965O9971P2499P3597P3772
$$ y = [733496, 729306, 724776, 719944, 714912, 709815, 705160, 701681, 699539, 698070, 696583, 694945, 693079, 690505, 686995, 683332, 680818, 680136, 681067, 683115, 685941, 689407, 693687, 699287, 706600, 715429, 725178, 735240, 744859, 752885, 758230, 760588, 760262, 757426, 752061, 744640, 736297, 728081, 720406, 713341, 707013, 701486, 696672, 692800, 690706, 691093, 693487, 696391, 698685, 700645, 703354, 707370, 712316, 717657, 723396, 729775, 736685, 743720, 750695, 757784, 765242, 773297, 782271, 792516, 804107, 816806, 830257, 844041, 857657, 870804, 883710, 896778, 909935, 922686, 934880, 946975, 959392, 972070, 984918, 998274, 1012555, 1027785, 1043909, 1061343, 1080770, 1102440, 1126034, 1151232, 1178209, 1207663, 1240546, 1277625, 1318999, 1364075, 1412285, 1463865, 1519754, 1580727, 1646692, 1716663, 1789162, 1862759, 1936531]
60223A936531P3545P2833P0935O7281O2122N6337N0623M5007L9062L2487K5479
60212B532242J8566J2140O252R09l644p150r661j1355j2152j1789j0295q056n414
60199B490593k377J234N565J0658J6400K2516K8859L5593M2877N0328N7071O2350
60187B821667O5867O7581O7509O5774O2523N7692N1120M2908L3476K3165J2081
60176C371363M59j1083k1948l2029m1611n0782n9101o5819p0293p2215p1594o8645
60164B806702o3774n7554n0516m2887l4673k5956j6996p951J200J0285J8645K5347
60152B561872K9704L1519L1026K8669K4818J9615J3228O235n41o681j2329j7651
60140B709484k2440k6363k9190l0601l0260k8352k5577k2253j7878j2016n055
$$ y = [1936531, 2010076, 2082909, 2153844, 2221125, 2283247, 2339584, 2390207, 2435214, 2474276, 2506763, 2532242, 2550808, 2562948, 2569200, 2570109, 2566465, 2559315, 2549654, 2538299, 2526147, 2514358, 2504063, 2496007, 2490593, 2488216, 2489450, 2495015, 2505673, 2522073, 2544589, 2573448, 2609041, 2651918, 2702246, 2759317, 2821667, 2887534, 2955115, 3022624, 3088398, 3150921, 3208613, 3259733, 3302641, 3336117, 3359282, 3371363, 3371822, 3360739, 3338791, 3306762, 3265151, 3214369, 3155268, 3089449, 3019156, 2946941, 2875347, 2806702, 2742928, 2685374, 2634858, 2591971, 2557298, 2531342, 2514346, 2506395, 2507595, 2517880, 2536525, 2561872, 2591576, 2623095, 2654121, 2682790, 2707608, 2727223, 2740451, 2746686, 2746145, 2739464, 2727135, 2709484, 2687044, 2660681, 2631491, 2600890, 2570630, 2542278, 2516701, 2494448, 2476570, 2464554, 2459499]
60129B459499K400J0487J9703K9871M0268N0647O1397P2728Q4368R6059J07791
60118C035218J19430J30595J40990J50381J58226J63839J66930J67524J65330
60109D398463J59747J50627J38559J24215J07804Q9332O9114M7764K5953M208
60099E315786j7077l7504n6440p3244q7882j00970j12772j22428j28720j31400
60089D447349j31250j29021j24880j18822j10952j01408r0429p8449o5696n1888
60079C444554l6994k2008q267L915J5166K5677L4803M2006M7271N0367N0649M7959
60067C695098M2972L6205K7438J6553M423p630j8863k9307l9297m9054n8412o6718
60055C553408p3356p8407q2336q5023q5734q4076q0389p5095o8454o1073n3721
$$ y = [2459499, 2461899, 2472386, 2492089, 2521960, 2562228, 2612875, 2674272, 2747000, 2831368, 2927427, 3035218, 3154648, 3285243, 3426233, 3576614, 3734840, 3898679, 4065609, 4233133, 4398463, 4558210, 4708837, 4847396, 4971611, 5079415, 5168747, 5237861, 5285625, 5311578, 5315786, 5298709, 5261205, 5204765, 5131521, 5043639, 4942669, 4829897, 4707469, 4578749, 4447349, 4316099, 4187078, 4062198, 3943376, 3832424, 3731016, 3640587, 3562138, 3496442, 3444554, 3407560, 3385552, 3377285, 3381200, 3396366, 3422043, 3456846, 3498852, 3546123, 3596490, 3647139, 3695098, 3738070, 3774275, 3801713, 3818266, 3822689, 3815059, 3796196, 3766889, 3727592, 3678538, 3620126, 3553408, 3480052, 3401645, 3319309, 3234286, 3148552, 3064476, 2984087, 2908992, 2840538, 2779465, 2725744]
60044B725744m6277l7719k7627j6950o711L270J3711K4564L5144M5018N4096O2099
60032B828362O8588P3215P5514P4794P0755O3911N4965M4242L2164J9801Q119
60021C414430l026j4474k6388l7882m7911n6059o2512o7586p1267p3075p2462
60010B881788o9528o4965n9228n2210m3991l5295k6743j8120q930P37J0348J9605
59998B533468K8491L7045M5578N4715O4648P4563Q3299R0339R5704R9254J00566
59987C307670R9209R4758Q6922P6221O4127N1906L9503K6123J1558l610j8689
59976C835698l3101m6167n7360o6523p3322p6929p7005p4611p1204o7002o1222
59965C131252n3786m5629l7359k8646j9167r251P50J0940K1308L1301M0358M8333
$$ y = [2725744, 2679467, 2641748, 2614121, 2597171, 2590460, 2593730, 2607441, 2632005, 2667149, 2712167, 2766263, 2828362, 2896950, 2970165, 3045679, 3120473, 3191228, 3255139, 3310104, 3354346, 3386510, 3406311, 3414430, 3411404, 3396930, 3370542, 3332660, 3284749, 3228690, 3166178, 3098592, 3027325, 2954250, 2881788, 2812260, 2747295, 2688067, 2635857, 2591866, 2556571, 2529828, 2511708, 2502778, 2503515, 2513863, 2533468, 2561959, 2599004, 2644582, 2699297, 2763945, 2838508, 2921807, 3012146, 3107850, 3207104, 3307670, 3406879, 3501637, 3588559, 3664780, 3728907, 3780813, 3820316, 3846439, 3857997, 3854387, 3835698, 3802597, 3756430, 3699070, 3632547, 3559225, 3482296, 3405291, 3330680, 3259476, 3192474, 3131252, 3077466, 3031837, 2994478, 2965832, 2946665, 2937414, 2938164, 2949104, 2970412, 3001713, 3042071, 3090404]
59953C090404N5175O0576O4222O6011O5902O3941O0478N5909N0234M3344L5803
59942C711999K8545K1732J4644P051M4m994p755q914r065q160n680r81O306J5851
59928C760623K6776L8487N1102O4907P9694R4959J10465J26194J41797J56387
59918D651391J68889J78402J84270J85943J82766J73950J58873J37478J10439
59909F132401P9097M5305J1053k2127n3294q1431j04939j22357j33549j39620
59899E610539j41676j40060j34938j26907j16736j04881r1597p7242o2173m6559
59889D567770l0491j4149K291J8738L5165N1646O8340Q5107J01044J14750J25043
59878E125254J31174J32337J27547J16194R8421P4986M7176J6970j3258m1547
$$ y = [3090404, 3145579, 3206155, 3270377, 3336388, 3402290, 3466231, 3526709, 3582618, 3632852, 3676196, 3711999, 3740544, 3762276, 3776920, 3783971, 3784015, 3779021, 3771266, 3762352, 3753287, 3745127, 3739447, 3738466, 3744772, 3760623, 3787399, 3825886, 3876988, 3941895, 4021589, 4116548, 4227013, 4353207, 4495004, 4651391, 4820280, 4998682, 5182952, 5368895, 5551661, 5725611, 5884484, 6021962, 6132401, 6211498, 6256803, 6267856, 6245729, 6192435, 6111004, 6006065, 5883708, 5750159, 5610539, 5468863, 5328803, 5193865, 5066958, 4950222, 4845341, 4753744, 4676502, 4614329, 4567770, 4537279, 4523130, 4525421, 4544159, 4579324, 4630970, 4699310, 4784417, 4885461, 5000211, 5125254, 5256428, 5388765, 5516312, 5632506, 5730927, 5805913, 5853089, 5870059, 5856801, 5815254]
59868E815254o6697q7895j04615j17102j26345j33117j37345j38635j36971j32684
59858D633848j26210j18190j09290r9496q8143p5109o1445m8189l5164k1734q318
59847C842560L742J3644K1496K7543L2126L6457M2162M9443N6545O1452O3320
59836D250490O1762N5811M4762K9647J2780m044k0090l4595m6349n4673o0045
59825D235456o3272o4633o4310o3174o2406o2551o3328o4210o4720o4259o2285
59814C536308n8842n4668n0595m7012m3879m1018l8341l5984l4277l3440l3279
59803C064973l3329l3169l2454l0764k7802k3757j9107j3984q088j199O571J5204
59791B863095K5056L6438M9296O3484P9076R6051J13984J32324J50571J67763
$$ y = [5815254, 5748557, 5660662, 5556047, 5438945, 5312600, 5179483, 5042138, 4903503, 4766532, 4633848, 4507638, 4389448, 4280158, 4180662, 4092519, 4017410, 3955965, 3907776, 3872612, 3850878, 3842560, 3846302, 3859946, 3881442, 3908985, 3941111, 3977568, 4019730, 4069173, 4125718, 4187170, 4250490, 4312252, 4368063, 4412825, 4442472, 4455252, 4451208, 4431118, 4396523, 4350174, 4295501, 4235456, 4172184, 4107551, 4043241, 3980067, 3917661, 3855110, 3791782, 3727572, 3662852, 3598593, 3536308, 3477466, 3422798, 3372203, 3325191, 3281312, 3240294, 3201953, 3165969, 3131692, 3098252, 3064973, 3031644, 2998475, 2966021, 2935257, 2907455, 2883698, 2864591, 2850607, 2842519, 2841320, 2847891, 2863095, 2888151, 2924589, 2973885, 3037369, 3116445, 3212496, 3326480, 3458804, 3609375, 3777138]
59781C777138J81787J89643J88262J75066J48472J08946O0024P798m1176q2031
59771D713929j12447j32328j42883j45722j42384j34426j23480j10862r7257q3139
59761C489001o9288n6506m4972l4410k4864j6716r826l297L518J0295J6404K1939
59749C281278K7548L3511L9555M5608N2124N9474O7436P5667Q4374R4028J04578
59738C965181J15468J26611J38767J52558J67488J82632J98048K14638K32437
59729E493828K49929K65514K78929K90420K99035L02747L00161K91381K77271
59720H049215K58878K37871K16702J97663J82055J70434J63183J60465J61865
59711I798331J66425J72746J78959J83148J84258J82299J77314J68704J56040
$$ y = [3777138, 3958925, 4148568, 4336830, 4511896, 4660368, 4769314, 4829338, 4837136, 4795960, 4713929, 4601482, 4469154, 4326271, 4180549, 4038165, 3903739, 3780259, 3669397, 3572140, 3489001, 3419713, 3363207, 3318235, 3283825, 3258961, 3242245, 3232419, 3229122, 3232640, 3242935, 3259339, 3281278, 3308826, 3342337, 3381892, 3427500, 3479624, 3539098, 3606534, 3682201, 3766575, 3860603, 3965181, 4080649, 4207260, 4346027, 4498585, 4666073, 4848705, 5046753, 5261391, 5493828, 5743757, 6009271, 6288200, 6578620, 6877655, 7180402, 7480563, 7771944, 8049215, 8308093, 8545964, 8762666, 8960329, 9142384, 9312818, 9476001, 9636466, 9798331, 9964756, 10137502, 10316461, 10499609, 10683867, 10866166, 11043480, 11212184, 11368224]
59702A1368224J40121J22453J03915Q4604O4867M5649K7841J2093m16p990r728
59691A1951633o298J216J2791K9078M9993P4555J02047J32421J65376J99784K34334
59680A2946930K68102L00062L28565L51805L68324L76580L74419L59644L31091
59671A6005522K88791K33524J66838R1412J0748p1444j51239k24354k87060l37352
59661A5725386l74603l98335m08463m06953l98168l87088l77939l74629l80740
59652A2218468l97377m21267m46176m66365m78563m81656m76008m63150m45047
59643H142859m23245l98927l73498l48218l23373k98677k74531k52004k31465
59634E218921k12122j93353j75605j59515j44836j30845j17374j04792r3315q2949
$$ y = [11368224, 11508345, 11630798, 11734713, 11819317, 11884184, 11929833, 11957674, 11969767, 11969351, 11961361, 11951633, 11945335, 11946551, 11959342, 11988420, 12038413, 12112968, 12215015, 12347436, 12512812, 12712596, 12946930, 13215032, 13515094, 13843659, 14195464, 14563788, 14940368, 15314787, 15674431, 16005522, 16294313, 16527837, 16694675, 16786087, 16796835, 16725391, 16574152, 16349798, 16062738, 15725386, 15350783, 14952448, 14543985, 14137032, 13738864, 13351776, 12973837, 12599208, 12218468, 11821091, 11399824, 10953648, 10487283, 10008720, 9527064, 9051056, 8587906, 8142859, 7719614, 7320687, 6947189, 6598971, 6275598, 5976921, 5702390, 5450386, 5218921, 5006799, 4813446, 4637841, 4478326, 4333490, 4202645, 4085271, 3980479, 3887164, 3804215]
59624C804215p3856o6244n9894n4310m9353m5313m2327m0056l8093l6435l5405
59613C262929l5183l5630l6511l7776l9416m1177m2576m3274m3337m3061m2673
59602B822315m2189m1402l9900l7458l4506l1983l0432k9503k8545k7383k6103
59591B452911k4431k1937j8723j5360j2151q957n771k907m49J963M551P110R505
59578B365354J2003J4705J7095J8666J9856K1751K4801K8277L1262L3845L7015
59567B624630M1401M6616N1884N6929O1922O6834P1458P5985Q0982Q6548R2003
59556C357192R6787J01247J06104J11334J16042J19442J21722J23737J25641J25617
59546D504865J20438J08237R0847P2506N5968M0742K5453J0500k842j4797k6833
$$ y = [3804215, 3730359, 3664115, 3604221, 3549911, 3500558, 3455245, 3412918, 3372862, 3334769, 3298334, 3262929, 3227746, 3192116, 3155605, 3117829, 3078413, 3037236, 2994660, 2951386, 2908049, 2864988, 2822315, 2780126, 2738724, 2698824, 2661366, 2626860, 2594877, 2564445, 2534942, 2506397, 2479014, 2452911, 2428480, 2406543, 2387820, 2372460, 2360309, 2351352, 2345581, 2342674, 2342225, 2344188, 2348739, 2355849, 2365354, 2377357, 2392062, 2409157, 2427823, 2447679, 2469430, 2494231, 2522508, 2553770, 2587615, 2624630, 2666031, 2712647, 2764531, 2821460, 2883382, 2950216, 3021674, 3097659, 3178641, 3265189, 3357192, 3453979, 3555226, 3661330, 3772664, 3888706, 4008148, 4129870, 4253607, 4379248, 4504865, 4625303, 4733540, 4824387, 4896893, 4952861, 4993603, 5019056, 5029556, 5026714, 5011917, 4985084]
59535D985084l9275n0780o0263o7929p4168p8608q0764q0630p8177p3170o5867
59524D235453n7027m6830l4601k0102m236J2114K9182M7479O6606Q5570J03779
59513D417387J20820J35551J46247J51600J51026J44118J30494J10262Q4340N4195
59503E646040K1454j2306m5644p7126j05254j28765j47090j60246j68218j70803
59493D652042j68179j61269j51332j39481j26512j12802r8241q2791o7215n2621
59483C491599l9157k5763j1626K750J6329K8750M0217N0632N9628O7083P3011
59472C753453P6933P7956P5484O9616O0933N0101L7485K2922O144j2366l1223
59461D187438m9105o5483q0140r2544j02228j09412j14586j17710j18448j17044
$$ y = [4985084, 4945809, 4895029, 4834766, 4766837, 4692669, 4614061, 4533297, 4452667, 4374490, 4301320, 4235453, 4178426, 4131596, 4096995, 4076893, 4072657, 4084771, 4113953, 4161432, 4228038, 4313608, 4417387, 4538207, 4673758, 4820005, 4971605, 5122631, 5266749, 5397243, 5507505, 5591845, 5646040, 5667494, 5655188, 5609544, 5532418, 5427164, 5298399, 5151309, 4991063, 4822845, 4652042, 4483863, 4322594, 4171262, 4031781, 3905269, 3792467, 3694226, 3611435, 3544220, 3491599, 3452442, 3426679, 3415053, 3417803, 3434132, 3462882, 3503099, 3553731, 3613359, 3680442, 3753453, 3830386, 3908342, 3983826, 4053442, 4114375, 4164476, 4201961, 4224883, 4231027, 4218661, 4187438, 4138333, 4072850, 3992710, 3900166, 3797938, 3688526, 3573940, 3456230, 3337782, 3220738]
59451C220738j14352j10947j06774j01733r6122r0304q4351p8223p2073o6217
59441B299642o0875n6068n1626m7281m2812l8094l3041k7680k2358j7679j3943
59430A888185j0770p454l744J6L525O996J0672J3882J5055J3033Q417L274m54
59417A940633k087j963p48R62L048O244J1286J7071K0518J9339J4620R785P292
59404B046000P285R001J1996J5793J9760K3803K8320L3089L7223M0648M4544M9816
59392B367278N5905O1768O7208P2697P8619Q5245R2721J00446J07203J12494J17159
59381C318743J22101J27197J32100J37430J44348J53459J64815J78453J94235
59372D672881K11615K30132K49492K68620K85355K97828L05488L08199L05294
$$ y = [3220738, 3106386, 2995439, 2888665, 2786932, 2690810, 2600506, 2516155, 2437932, 2365859, 2299642, 2238767, 2182699, 2131073, 2083792, 2040980, 2002886, 1969845, 1942165, 1919807, 1902128, 1888185, 1877415, 1869961, 1866217, 1866233, 1869758, 1876754, 1887426, 1901308, 1916363, 1929396, 1937813, 1941087, 1940633, 1938546, 1936583, 1935835, 1936797, 1939845, 1946089, 1957375, 1974446, 1994964, 2014303, 2028923, 2038708, 2046000, 2053285, 2062286, 2074282, 2090075, 2109835, 2133638, 2161958, 2195047, 2232270, 2272918, 2317462, 2367278, 2423183, 2484951, 2552159, 2624856, 2703475, 2788720, 2881441, 2981887, 3089090, 3201584, 3318743, 3440844, 3568041, 3700141, 3837571, 3981919, 4135378, 4300193, 4478646, 4672881, 4884496, 5114628, 5364120, 5632740, 5918095, 6215923, 6521411, 6829610, 7134904]
59363G134904K96589K83547K68085K50695K30912K09150J86817J64673J42276
59354I167648J18928R4015O6422L4827r85l9891q0676j22837j65922k08619k48638
59343H614272k83206l09928l27812l37453l39840l35348l24397l08527k89947
59334E757814k70300k50639k32191k15952k01659j88210j75190j63133j52390
59325C908150j42664j33774j25801j18377j10718j02668r4866q7722q0929p4257
59315B836374o7983o2316n7025n1979m7356m3069l8597l3673k8636k3852j9296
59304B362592j4842j0499o115j315M085R812J5168J8940J9660J6878J2231Q429
59292B435024P042P778R871J3218J7891K3452K9242L4858L9968M4163M7251M9297
$$ y = [7134904, 7431493, 7715040, 7983125, 8233820, 8464732, 8673882, 8860699, 9025372, 9167648, 9286576, 9380591, 9447013, 9481840, 9480855, 9440964, 9360288, 9237451, 9071529, 8862910, 8614272, 8331066, 8021138, 7693326, 7355873, 7016033, 6680685, 6356288, 6047761, 5757814, 5487514, 5236875, 5004684, 4788732, 4587073, 4398863, 4223673, 4060540, 3908150, 3765486, 3631712, 3505911, 3387534, 3276816, 3174148, 3079282, 2991560, 2910631, 2836374, 2768391, 2706075, 2649050, 2597071, 2549715, 2506646, 2468049, 2434376, 2405740, 2381888, 2362592, 2347750, 2337251, 2331136, 2329821, 2333906, 2343718, 2358886, 2377826, 2397486, 2414364, 2426595, 2435024, 2442066, 2449844, 2459715, 2472933, 2490824, 2514276, 2543518, 2578376, 2618344, 2662507, 2709758, 2759055]
59280B759055N0173M9456M6902M2640L6874K9794K1801J3215L884o395j7012k6800
59268C003587l5166m2371m8635n3686n7322n9693o0901o0854n9727n8005n6000
59257B411227n3849n1783m9726m6870m2550l7471l3005k9301k5271k0512j5919
59246B004970j2074q414m596j335J004L455P079J1447J5519J9180K2867K6400
59234B085502K9380L2236L5713L9704M3683M7991N3515O0211O7102P3853Q1308
59223B650198R0275J00557J11536J23023J35228J48353J62392J76834J90431K01610
59213D090437K09236K12648K10956K02944J87899J66160J38576J05842O8615K8082
59203E621395j3926n5300r3918j27811j55540j76525j90880j98854k00630j96834
$$ y = [2759055, 2809228, 2858684, 2905586, 2948226, 2985100, 3014894, 3036695, 3049910, 3053794, 3047399, 3030387, 3003587, 2968421, 2926050, 2877415, 2823729, 2766407, 2706714, 2645813, 2584959, 2525232, 2467227, 2411227, 2357378, 2305595, 2255869, 2208999, 2166449, 2128978, 2095973, 2066672, 2041401, 2020889, 2004970, 1992896, 1984482, 1979886, 1978551, 1979555, 1983010, 1990089, 2001536, 2017055, 2036235, 2059102, 2085502, 2114882, 2147118, 2182831, 2222535, 2266218, 2314209, 2367724, 2427935, 2495037, 2568890, 2650198, 2740473, 2841030, 2952566, 3075589, 3210817, 3359170, 3521562, 3698396, 3888827, 4090437, 4299673, 4512321, 4723277, 4926221, 5114120, 5280280, 5418856, 5524698, 5593313, 5621395, 5607469, 5552169, 5458251, 5330440, 5174900, 4998375, 4807495, 4608641, 4408011, 4211177]
59193D211177j88986j78980j67990j56125j43266j29919j16905j04490r2319q0174
59183B852023o8404n7442m7289l7636k8402j9961j2866p357l150J73K559L546
59171B575794K850N39l482r480j7032k4759l1571l7632m3383m8196n1037n2081
59159B260530n2495n2643n1730m9390m6469m3810m1224l8196l4767l1163k7323
59148A791320k3383j9990j7473j5230j2533r512o747m340j974L86K386L760M552
59135A691222N045N634O487P144O937O040N535O075P037P456P326P364P842Q319
59121A785463Q428Q348Q562R410J0849J2354J3247J3379J3300J3555J4041J4314
59109A925250J4291J4251J4340J4401J4257J4006J3977J4453J5345J6249J7027
$$ y = [4211177, 4022191, 3843211, 3675221, 3519096, 3375830, 3245911, 3129006, 3024516, 2932197, 2852023, 2783619, 2726177, 2678888, 2641252, 2612850, 2592889, 2580023, 2572666, 2569516, 2569689, 2572248, 2575794, 2578644, 2579183, 2575701, 2566221, 2549189, 2524430, 2492859, 2455227, 2411844, 2363648, 2312611, 2260530, 2208035, 2155392, 2103662, 2054272, 2007803, 1963993, 1922769, 1884573, 1849806, 1818643, 1791320, 1767937, 1747947, 1730474, 1715244, 1702711, 1693199, 1686452, 1682112, 1680138, 1680524, 1682910, 1686670, 1691222, 1696267, 1701901, 1708388, 1715532, 1722469, 1728509, 1734044, 1740119, 1747156, 1754612, 1761938, 1769302, 1777144, 1785463, 1793891, 1802239, 1810801, 1820211, 1831060, 1843414, 1856661, 1870040, 1883340, 1896895, 1910936, 1925250, 1939541, 1953792, 1968132, 1982533, 1996790, 2010796, 2024773, 2039226, 2054571, 2070820, 2087847]
59098B087847J8166K0157K2747K5314K7883L1009L4635L7838M0071M1878M3970
59087B431515M6107M7330M6855M4357L9905L4065K7666K0946J3245L958o428j6625
59075B732896k5647l3326l9972m5816n0691n4079n5633n5688n5026n4135n3014
59064B209869n1569m9723m7278m4278m1387l9241l7392l4834l1603k8918k7483
59053A776163k6621k5392k3648k1540j9021j6410j4519j3524j2517j0890r343
59042A582738q724q728q592q409q701r253r428r214q940q358o956n007l312k065
59028A477051q31M83J570K497L682N035N919O092O050O303O911P821R159J0906
59014A548648J2684J4018J4688J4879J5132J6058J7859K0290K3120K6325K9671
$$ y = [2087847, 2106013, 2126170, 2148917, 2174231, 2202114, 2233123, 2267758, 2305596, 2345667, 2387545, 2431515, 2477622, 2524952, 2571807, 2616164, 2656069, 2690134, 2717800, 2738746, 2751991, 2755949, 2749521, 2732896, 2707249, 2673923, 2633951, 2588135, 2537444, 2483365, 2427732, 2372044, 2317018, 2262883, 2209869, 2158300, 2108577, 2061299, 2017021, 1975634, 1936393, 1899001, 1864167, 1832564, 1803646, 1776163, 1749542, 1724150, 1700502, 1678962, 1659941, 1643531, 1629012, 1615488, 1602971, 1592081, 1582738, 1574014, 1565286, 1556694, 1548285, 1539584, 1530331, 1520903, 1511689, 1502749, 1494391, 1487435, 1482428, 1479116, 1477051, 1476220, 1476703, 1478273, 1480770, 1484452, 1489487, 1495406, 1501498, 1507548, 1513851, 1520762, 1528583, 1537742, 1548648, 1561332, 1575350, 1590038, 1604917, 1620049, 1636107, 1653966, 1674256, 1697376, 1723701, 1753372]
59003A753372L2668L5300L8244M1892M5586M8387N0144N1147N1097M9216M5231
58992B242284L9604L2778K4824J5964O994j114p889j3632j8935k3805k7420k9106
58980B240547k9421k9686l0415l0914l0517k9393k7859k5792k3208k0603j8113
58969A944626j5131j1304p272l758o38K349M803O336P407Q601R618R878R571R256
58955A974342Q899Q246P696P845Q561R334J0251J1700J3498J5202J6967J9199
58943B111740K1596K3543K5268K7718L1370L5855M0585M5232M9775N4679O0502
58932B527863O6700P1361P2900P1538O8330O3522N6977M9624M3168L8605L6146
58921C166734L6098L8617M2806M7380N2130N7659O3990P0641P7869Q6380R5922
$$ y = [1753372, 1786040, 1821340, 1859584, 1901476, 1947062, 1995449, 2045593, 2096740, 2147837, 2197053, 2242284, 2281888, 2314666, 2339490, 2355454, 2362448, 2361334, 2353445, 2339813, 2320878, 2297073, 2269653, 2240547, 2211126, 2181440, 2151025, 2120111, 2089594, 2060201, 2032342, 2006550, 1983342, 1962739, 1944626, 1929495, 1918191, 1910919, 1907161, 1906523, 1908872, 1913675, 1920011, 1927418, 1936019, 1945637, 1955515, 1965086, 1974342, 1983241, 1991487, 1999183, 2007028, 2015589, 2024923, 2035174, 2046874, 2060372, 2075574, 2092541, 2111740, 2133336, 2156879, 2182147, 2209865, 2241235, 2277090, 2317675, 2362907, 2412682, 2467361, 2527863, 2594563, 2665924, 2738824, 2810362, 2878692, 2942214, 2999191, 3048815, 3091983, 3130588, 3166734, 3202832, 3241449, 3284255, 3331635, 3383765, 3441424, 3505414, 3576055, 3653924, 3740304, 3836226]
58910C836226J05471J14822J24741J35531J46738J58317J70660J83316J95029
58901E170851K05349K14863K23450K29614K32101K31140K27568K21852K14507
58892G171295K06444J98084J88774J77502J63542J46199J24872R9798P2012M2181
58882H590703J0325k3024n6252q7784j16999j43568j66761j85963k01290k13118
58872G406269k21518k26569k28726k28529k26315k22468k17422k11214k03575
58863E419933j94624j85009j75251j65560j56261j47602j39099j29904j20090
58854D006533j10719j02462r4968q7835q1256p5260o9216o2699n6157n0174m4679
58843C171108l9295l4028k9088k4483k0153j6139j2372q673n071j679J748N534
$$ y = [3836226, 3941697, 4056519, 4181260, 4316791, 4463529, 4621846, 4792506, 4975822, 5170851, 5376200, 5591063, 5814513, 6044127, 6276228, 6507368, 6734936, 6956788, 7171295, 7377739, 7575823, 7764597, 7942099, 8105641, 8251840, 8376712, 8476510, 8548522, 8590703, 8601028, 8578004, 8521752, 8433968, 8316969, 8173401, 8006640, 7820677, 7619387, 7406269, 7184751, 6958182, 6729456, 6500927, 6274612, 6052144, 5834722, 5623508, 5419933, 5225309, 5040300, 4865049, 4699489, 4543228, 4395626, 4256527, 4126623, 4006533, 3895814, 3793352, 3698384, 3610549, 3529293, 3454033, 3384817, 3322118, 3265961, 3215787, 3171108, 3131813, 3097785, 3068697, 3044214, 3024061, 3007922, 2995550, 2986877, 2981806, 2980127, 2981875, 2987409]
58831B987409R375J2675J5702J9524K4549K9903L4617L8665M2472M6011M8899
58820C309801N0895N2077N2960N4468N7210O0724O4174O7845P3070Q0529Q9529
58809D013282R9220J09550J20653J32222J44015J56201J68698J80901J92513K03899
58799E521154K15079K25054K32616K37262K38788K36674K30387K19821K04897
58790G561732J85241J60671J31582R8634O2604K4877j2621m8468q2227j13573
58780G968452j41561j65297j84866k01056k14450k24986k32190k35569k35195
58771F133282k31883k26499k19180k09854j99318j88923j79126j69267j58908
58762D350324j48521j38652j29294j20397j12056j03956r5508q6867p8980p2267
$$ y = [2987409, 2996784, 3009459, 3025161, 3044685, 3069234, 3099137, 3133754, 3172419, 3214891, 3260902, 3309801, 3360696, 3412773, 3465733, 3520201, 3577411, 3638135, 3702309, 3770154, 3843224, 3923753, 4013282, 4112502, 4222052, 4342705, 4474927, 4618942, 4775143, 4943841, 5124742, 5317255, 5521154, 5736233, 5961287, 6193903, 6431165, 6669953, 6906627, 7137014, 7356835, 7561732, 7746973, 7907644, 8039226, 8137860, 8200464, 8225341, 8212720, 8164252, 8082025, 7968452, 7826891, 7661594, 7476728, 7275672, 7061222, 6836236, 6604046, 6368477, 6133282, 5901399, 5674900, 5455720, 5245866, 5046548, 4857625, 4678499, 4509232, 4350324, 4201803, 4063151, 3933857, 3813460, 3701404, 3597448, 3501940, 3415073, 3336093, 3263826]
58752C263826o6125o0078n4453m9519m4876m0171l5605l1299k6977k2652j8732
58741B813339j5088j1064o754l150m40K659O915J0937J2560J1097P327J911n111
58728B825138j3493k2330l0336l6290l9710m1431m3015m5115m6975m7750m7598
58717B411095m7081m6241m4803m2686l9840l6124l1724k7055k2090j6508j0614
58706B046329n211m17M216Q143R656P848L569k080q922j6674k4073k9981l4384
58693A958019l7436l8624l7726l5544l2722k8949k4206j9619j5974j2564q667
58682A665988n070k748j094J048L377M629M455L400J645p46k902l838l741l344
58668A661059k617j354m72j201l321n618p693r894j1808j2505j2228j2228j2758
$$ y = [3263826, 3197701, 3137623, 3083170, 3033651, 2988775, 2948604, 2912999, 2881700, 2854723, 2832071, 2813339, 2798251, 2787187, 2780433, 2777283, 2776843, 2779502, 2786417, 2797354, 2809914, 2821011, 2828338, 2830249, 2825138, 2811645, 2789315, 2758979, 2722689, 2682979, 2641548, 2598533, 2553418, 2506443, 2458693, 2411095, 2364014, 2317773, 2272970, 2230284, 2190444, 2154320, 2122596, 2095541, 2073451, 2056943, 2046329, 2041118, 2040701, 2044917, 2053060, 2062716, 2070564, 2074133, 2072053, 2063131, 2046457, 2022384, 1992403, 1958019, 1920583, 1881959, 1844233, 1808689, 1775967, 1747018, 1722812, 1703193, 1687219, 1674655, 1665988, 1660918, 1658170, 1657076, 1658124, 1661501, 1666130, 1670585, 1673985, 1675630, 1674884, 1671982, 1668144, 1664403, 1661059, 1658442, 1657088, 1656616, 1655415, 1652094, 1646476, 1638783, 1628889, 1617081, 1604576, 1592348, 1580120, 1567362]
58655A567362j2702j1431r726q388p139n476l666k276j295k23J264L077M824O111
58641A520316O847P232P307O929O382O444P325Q169Q185P776P772Q095Q063P669
58627A624511P634Q413R841J1634J3514J5025J5919J6602J7626J8979K0318K1672
58615A801688K3336K5362K7560K9849L2243L4794L7741M1274M5007M8299N1314
58604B198467N4921N9358O3784O7523P0665P3186P4545P4531P3265P0018O3573
58593B943836N4400M4604L4872K3467R581m362j5661k4788l3578m1559m6775m9199
58581B894838n0508n0943m9286m5925m3106m1695m0075l6942l3106k9777k6954
58570B446521k4432k2692k1741k0402j7939j5378j4177j4320j4738j5139j6471
$$ y = [1567362, 1554660, 1543229, 1533503, 1525115, 1517976, 1512500, 1508834, 1506558, 1505263, 1505040, 1506304, 1509381, 1514205, 1520316, 1527163, 1534395, 1541702, 1548631, 1555013, 1561457, 1568782, 1576951, 1585136, 1592912, 1600684, 1608779, 1616842, 1624511, 1632145, 1640558, 1650399, 1662033, 1675547, 1690572, 1706491, 1723093, 1740719, 1759698, 1780016, 1801688, 1825024, 1850386, 1877946, 1907795, 1940038, 1974832, 2012573, 2053847, 2098854, 2147153, 2198467, 2253388, 2312746, 2376530, 2444053, 2514718, 2587904, 2662449, 2736980, 2810245, 2880263, 2943836, 2998236, 3042840, 3077712, 3101179, 3110760, 3106398, 3090737, 3065949, 3032371, 2990812, 2944037, 2894838, 2844330, 2793387, 2744101, 2698176, 2655070, 2613375, 2573300, 2536358, 2503252, 2473475, 2446521, 2422089, 2399397, 2377656, 2357254, 2339315, 2323937, 2309760, 2295440, 2280702, 2265563, 2249092]
58559B249092j9565k3846k7582k9422k9570k9176k8716k7658k5920k4496k4056
58548A959085k3821k2818k1318k0039j8752j6935j5107j4079j3454j2256j0662
58537A769844r663r341q806p778o898o605o802p406q126p971o222l696j940j374
58523A677216j248j033o97K8J338K622L149L250L752M638N425O279P588Q895R648
58508A730850J0382J1808J3311J3924J4100J4848J5638J5028J3065J1096R485
58497A873535P373M596J989j87k322l954m062k985k304k608k989k918k915l228
58483A857021l449l680m492n548n810n291n092n533n767n381m895m474l608k238
58469A791763q83L76J686K468K152J587K069L160L319K432J760J558R41J03L74
$$ y = [2249092, 2229527, 2205681, 2178099, 2148677, 2119107, 2089931, 2061215, 2033557, 2007637, 1983141, 1959085, 1935264, 1912446, 1891128, 1871089, 1852337, 1835402, 1820295, 1806216, 1792762, 1780506, 1769844, 1760181, 1750840, 1742034, 1734256, 1727358, 1720753, 1713951, 1706545, 1698419, 1690448, 1684226, 1680530, 1678590, 1677216, 1675968, 1674935, 1674238, 1674266, 1675604, 1678226, 1681375, 1684625, 1688377, 1693015, 1698440, 1704719, 1712307, 1721202, 1730850, 1741232, 1753040, 1766351, 1780275, 1794375, 1809223, 1824861, 1839889, 1852954, 1864050, 1873535, 1880908, 1885504, 1887493, 1887306, 1884984, 1881030, 1876968, 1873983, 1871679, 1869071, 1866082, 1863164, 1860249, 1857021, 1853572, 1849892, 1845400, 1839852, 1834042, 1828751, 1823659, 1818126, 1812359, 1806978, 1802083, 1797609, 1794001, 1791763, 1790880, 1791256, 1792942, 1795410, 1797562, 1799149, 1801218, 1804378, 1807697, 1810129, 1811889, 1813447, 1814388, 1814491, 1814865]
58454A814865J796K857K990L255M103M561M277M284N067N700N622N483N612N366
58440A875838M580M028L878L398K594K408K895K988K478K355K749K573J712J549
58426A916023K621L760M285M956O083O659O335O318P268Q148Q106P811P970Q158
58412B004501Q074Q293Q898Q932Q108P448P501P477O934O634O998P275P072P033
58398B111178P323P073O086N446N776O420O949P796Q822R113Q768R011J0066J0760
58384B220587J0823J1456J3011J4282J4728J5261J6062J5879J4374J2936J2235
58373B371634J1248R573Q398Q168P674O551O242P311Q203P991Q004R247J0508
58360B480752J0637J0534J1203J1824J1423J0685J0527J0504J0081R846J0288
$$ y = [1814865, 1816661, 1819518, 1822508, 1825763, 1829866, 1834427, 1838704, 1842988, 1848055, 1853755, 1859377, 1864860, 1870472, 1875838, 1880418, 1884446, 1888324, 1891722, 1894316, 1896724, 1899619, 1902607, 1905085, 1907440, 1910189, 1912762, 1914474, 1916023, 1918644, 1922404, 1926689, 1931645, 1937728, 1944387, 1950722, 1957040, 1964308, 1972456, 1980562, 1988373, 1996343, 2004501, 2012575, 2020868, 2029766, 2038698, 2046806, 2054254, 2061755, 2069232, 2076166, 2082800, 2089798, 2097073, 2104145, 2111178, 2118501, 2125574, 2131660, 2137106, 2142882, 2149302, 2156251, 2164047, 2172869, 2181982, 2190750, 2199761, 2209827, 2220587, 2231410, 2242866, 2255877, 2270159, 2284887, 2300148, 2316210, 2332089, 2346463, 2359399, 2371634, 2382882, 2392455, 2400853, 2409021, 2416695, 2423246, 2429488, 2436799, 2445002, 2452993, 2460997, 2470244, 2480752, 2491389, 2501923, 2513126, 2524950, 2536373, 2547058, 2557585, 2568089, 2578170, 2588016, 2598304]
58349B598304J0891J1369J2119J2793J2414J1569J2212J4489J6175J6112J5684
58338B744131J6010J6388J6527J7435J8977J9441J8841J9502K2004K3664K2819
58327B955739K1493K1898K3314K4382K5603K7419K8628K8813K9601L1607L2816
58316C251313L1922L0336K9016K6483K2136J8354J6917J6421J5487J5343J6788
58305C490516J7883J7400J7393J9518K1919K2617K2973K4796K7020K8251K9606
58294C739892L2066L4008L4323L4989L7496L9855M0280M0596M2730M5055M5698
58283D166988M6157M8072M9607M8787M7354M7533M8059M7116M6118M6786M7596
58272D690173M6997M7011M9641N2978N4811N6769O0793O4948O7007O8807P2608
$$ y = [2598304, 2609195, 2620564, 2632683, 2645476, 2657890, 2669459, 2681671, 2696160, 2712335, 2728447, 2744131, 2760141, 2776529, 2793056, 2810491, 2829468, 2848909, 2867750, 2887252, 2909256, 2932920, 2955739, 2977232, 2999130, 3022444, 3046826, 3072429, 3099848, 3128476, 3157289, 3186890, 3218497, 3251313, 3283235, 3313571, 3342587, 3369070, 3391206, 3409560, 3426477, 3442898, 3458385, 3473728, 3490516, 3508399, 3525799, 3543192, 3562710, 3584629, 3607246, 3630219, 3655015, 3682035, 3710286, 3739892, 3771958, 3805966, 3840289, 3875278, 3912774, 3952629, 3992909, 4033505, 4076235, 4121290, 4166988, 4213145, 4261217, 4310824, 4359611, 4406965, 4454498, 4502557, 4549673, 4595791, 4642577, 4690173, 4737170, 4784181, 4833822, 4886800, 4941611, 4998380, 5059173, 5124121, 5191128, 5259935, 5332543]
58261E332543P6614P8565Q0261Q3978Q7984R0320R3190R8728J04287J07098J09677
58250F343245J15219J21672J25958J30068J37005J44660J49863J54628J62101
58241G584419J70275J76162J82195J91910K03255K12893K22985K36831K52007
58232I432932K65071K78650K96513L16193L34131L53306L77717M04377M29228
58223A2488118M55800M89155N26675N64163O05387O55660P11942P69731Q33798
58214A8100429R11047R99085J093503J199838J326226J471407J633088J820571
58206B8555194K045375K307849K607937K960298L383428L885440M478944N197773
58198E5422238O077845P133556Q375315R835889J1553557J3543137J5806746J8347285
$$ y = [5332543, 5409157, 5487722, 5567983, 5651961, 5739945, 5830265, 5923455, 6022183, 6126470, 6233568, 6343245, 6458464, 6580136, 6706094, 6836162, 6973167, 7117827, 7267690, 7422318, 7584419, 7754694, 7930856, 8113051, 8304961, 8508216, 8721109, 8944094, 9180925, 9432932, 9698003, 9976653, 10273166, 10589359, 10923490, 11276796, 11654513, 12058890, 12488118, 12943918, 13433073, 13959748, 14523911, 15129298, 15784958, 16496900, 17266631, 18100429, 19011476, 20010561, 21104064, 22303902, 23630128, 25101535, 26734623, 28555194, 30600569, 32908418, 35516355, 38476653, 41860081, 45745521, 50224465, 55422238, 61500083, 68633639, 77008954, 86844843, 98398400, 111941537, 127748283, 146095568]
58190A46095568K1132157K4046908K6859184K9093780K9847768K7919071K2527232
58183C27521668J4149162M522808m404944j1605479j7095078k1184622k3889992
58176B68013523k5066225k4814443k3542384k1702174j9606562j7453433j5382793
58169A20445509j3471944j1741990j0200931q857491p698265o690161n811528
58162E5973199n056540m411302l851870l365986k954102k608775k312655k056340
58154B9355629j840300j659591j502840j365392j248673j147728j053380r65387
58146A8572338q90142q26549p66711p09204o59416o17567n77892n39154n05422
58137A2480281m77099m51001m28282m12599m01277l87564l70802l55609l42158
$$ y = [146095568, 167227725, 191274633, 218133817, 247227597, 277075365, 304994436, 327521668, 341670830, 346193638, 341788694, 330183215, 313088137, 291903515, 268013523, 242947298, 218132855, 194590471, 172888297, 153281735, 135828302, 120445509, 106973565, 95231575, 85030644, 76173153, 68474888, 61784727, 55973199, 50916659, 46505357, 42653487, 39287501, 36333399, 33724624, 31411969, 29355629, 27515329, 25855738, 24352898, 22987506, 21738833, 20591105, 19537725, 18572338, 17682196, 16855647, 16088936, 15379732, 14720316, 14102749, 13524857, 12985703, 12480281, 12003182, 11552181, 11123899, 10711300, 10310023, 9922459, 9551657, 9196048, 8853890]
58128H853890l26266l08248k92764k80213k66472k50993k37220k25376k12362
58119F453976j98552j87389j78436j67964j56110j46492j38971j29752j18673
58110E031637j09569j03227r6466q8447q1665p6300o9754o2215n6867n4027n0662
58099D182438m6291m3899m4279m4671m3781m3302m3792m3585m2432m1803m1238
58088C703365l8722l4849l2368l1426k9572k6580k4811k4574k3564k1319j9991
58077C395589k0159j9952j8812j8219j8306j7528j6096j5946j6964j6876j5123
58066C201608j3285j1700r431p513q043r918r689p090n487o241o887n909n114
58053C095301n834o546n935n067m939m675l565k385j638q44k87r04j969j505M47
$$ y = [8853890, 8527624, 8219376, 7926612, 7646399, 7379927, 7128934, 6891714, 6666338, 6453976, 6255424, 6068035, 5889599, 5721635, 5565525, 5419033, 5280062, 5150310, 5031637, 4922068, 4818841, 4722375, 4633928, 4552263, 4475963, 4406209, 4343994, 4287127, 4233100, 4182438, 4136147, 4092248, 4047969, 4003298, 3959517, 3916215, 3872423, 3828838, 3786406, 3744603, 3703365, 3664643, 3629794, 3597426, 3566000, 3536428, 3509848, 3485037, 3460463, 3436899, 3415580, 3395589, 3375430, 3355478, 3336666, 3318447, 3300141, 3282613, 3266517, 3250571, 3233607, 3216731, 3201608, 3188323, 3176623, 3167192, 3159679, 3151636, 3141718, 3132029, 3124939, 3119452, 3113211, 3106324, 3100415, 3095301, 3089467, 3082921, 3076986, 3071919, 3066980, 3062305, 3058740, 3056355, 3054717, 3053873, 3053586, 3052682, 3050713, 3049208, 3049655]
58038C049655J746J782K223L638M345L530K540K251J799R16Q16J830K620K687
58024C082378L248M725N793N798N894O818P710P912P952Q120Q091Q397J0150J2828
58010C185814J4552J4893J5289J6351J7243J7934J9514K1753K3041K3392K4898
57999C394674K8326L1874L4151L5958L8142M0103M1544M3434M6157M8693N0513
57988C833569N2228N3623N3223N0740M7789M5321M2535L9114L6268L4460L2316
57977D321186K8826K4529J9472J2247K369q439j8554k8103l7054m3806m7114m7715
57965D177844m6701m3945l9509l4813l0978k7309k2874j8173j4134j0627p217
57954C881564m120j525Q43K711L181K386J780K081K493K626L329M785N657N313
$$ y = [3049655, 3051401, 3053183, 3055406, 3059044, 3063389, 3066919, 3069459, 3071710, 3073509, 3074425, 3075241, 3077071, 3079691, 3082378, 3085626, 3090351, 3096144, 3101942, 3107836, 3114654, 3122364, 3130276, 3138228, 3146348, 3154439, 3162836, 3172986, 3185814, 3200366, 3215259, 3230548, 3246899, 3264142, 3282076, 3301590, 3323343, 3346384, 3369776, 3394674, 3423000, 3454874, 3489025, 3524983, 3563125, 3603228, 3644772, 3688206, 3734363, 3783056, 3833569, 3885797, 3939420, 3992643, 4043383, 4091172, 4136493, 4179028, 4218142, 4254410, 4288870, 4321186, 4350012, 4374541, 4394013, 4406260, 4408629, 4400190, 4381636, 4353533, 4316479, 4272673, 4225559, 4177844, 4131143, 4087198, 4047689, 4012876, 3981898, 3954589, 3931715, 3913542, 3899408, 3888781, 3881564, 3877444, 3875919, 3876762, 3879473, 3882654, 3885040, 3886820, 3888901, 3891394, 3894020, 3897349, 3902134, 3907791, 3913104]
57940C913104N077O117P786R330J1446J4754J8322K1186K3871K6961K9572L0758
57928D118284L1135L1544L1242K8950K4616J8794J1364K362o789j4376j9990k3918
57916D233218k5928k5921k4909k3961k2817k0727j7924j5160j2472r576o838m825
57904D022160l391k149j253q79n95o2K05l95j585k692l373l409k562j143J06J174
57888D000157K724M500N167M520M424O403R494J1735J2763J3616J4766J5736J6183
57875D122188J6298J6328J6400J6466J6020J4545J2557J1290J0990J0581R517
57864D273180Q620Q424Q042O633M768L373K460J877K118L288M382M675M857N752
57850D342449P001Q067R375J1164J2433J2402J2007J2507J3525J3929J3743J3609
$$ y = [3913104, 3918181, 3924298, 3932084, 3941414, 3952860, 3967614, 3985936, 4007122, 4030993, 4057954, 4087526, 4118284, 4149419, 4180963, 4212205, 4241155, 4265771, 4284565, 4295929, 4298291, 4291502, 4277126, 4257136, 4233218, 4207290, 4181369, 4156460, 4132499, 4109682, 4088955, 4071031, 4055871, 4043399, 4033823, 4026985, 4022160, 4018769, 4016620, 4015367, 4014488, 4013893, 4013831, 4014036, 4013641, 4012056, 4009364, 4005991, 4002582, 4000020, 3998877, 3998983, 4000157, 4002881, 4007381, 4012548, 4017068, 4021492, 4027895, 4037389, 4049124, 4061887, 4075503, 4090269, 4106005, 4122188, 4138486, 4154814, 4171214, 4187680, 4203700, 4218245, 4230802, 4242092, 4253082, 4263663, 4273180, 4281800, 4290224, 4298266, 4304899, 4309667, 4313040, 4315500, 4317377, 4319495, 4322783, 4327165, 4331840, 4336697, 4342449, 4349450, 4357517, 4366892, 4378056, 4390489, 4402891, 4414898, 4427405, 4440930, 4454859, 4468602, 4482211]
57838D482211J3195J1815J0118R435R798J0012R478Q639P943P533P723Q620R623
57825D606143J0307J1280J3120J5046J5950J6328J7705K0471K3569K6015K7392
57814D803326K7174K5147K2575K1503K2609K4746K6808K8959L1746L5079L8518
57803E108190M1899M5192M8068M9851M9687M6926M1563L4192K5404J5620N643
57792E512235l317j0731j7095k2681k6689k8339k8143k7210k5871k3875k1402
57781E276882j8987j6779j4684j2786j0972q657n662k807q37O77K468M307N520
57768E197683O196O877P552P981Q527R536J0385J0256R519R267R843J0821J2059
57755E316502J3593J4863J5249J5212J5770J6971J7913J8165J8155J8277J8598
$$ y = [4482211, 4495406, 4507221, 4517339, 4526774, 4536572, 4546584, 4556062, 4564701, 4572644, 4580177, 4587900, 4596520, 4606143, 4616450, 4627730, 4640850, 4655896, 4671846, 4688174, 4705879, 4726350, 4749919, 4775934, 4803326, 4830500, 4855647, 4878222, 4899725, 4922334, 4947080, 4973888, 5002847, 5034593, 5069672, 5108190, 5150089, 5195281, 5243349, 5293200, 5342887, 5389813, 5431376, 5465568, 5490972, 5506592, 5512235, 5508918, 5498187, 5481092, 5458411, 5431722, 5403383, 5375240, 5348030, 5322159, 5298284, 5276882, 5257895, 5241116, 5226432, 5213646, 5202674, 5194017, 5188355, 5185548, 5184711, 5185388, 5187856, 5192163, 5197683, 5203879, 5210756, 5218308, 5226289, 5234816, 5244352, 5254737, 5264993, 5274512, 5283779, 5293622, 5304443, 5316502, 5330095, 5344958, 5360207, 5375419, 5391189, 5408160, 5426073, 5444238, 5462393, 5480670, 5499268]
57744E499268J9297K0454K1490K1718K1268K0659J9787J8313J6678J5663J5129
57733E709724J4307J3157J2326J1994J1781J1713J2190J3097J3976J4905J6116
57722E855286J7063J7082J6722J7075J8000J8393J8161J8298J8966J9212J8895
57711F053153J9139K0306K1191K1177K1578K3639K6427K8095K8413K8615K9283
57700F321016K9830L0008L0660L2595L5522L8513M1089M3490M6086M8961N2133
57689F749903N5894O0532O5720P0735P5491Q0819Q7318R4463J01455J08449J16036
57678G666815J23931J31141J37369J43141J48575J53186J57130J61168J64032
57669H986488J60201J41676J03264M7198j6622p5232j18947j45042j56499j58003
$$ y = [5499268, 5518565, 5539019, 5560509, 5582227, 5603495, 5624154, 5643941, 5662254, 5678932, 5694595, 5709724, 5724031, 5737188, 5749514, 5761508, 5773289, 5785002, 5797192, 5810289, 5824265, 5839170, 5855286, 5872349, 5889431, 5906153, 5923228, 5941228, 5959621, 5977782, 5996080, 6015046, 6034258, 6053153, 6072292, 6092598, 6113789, 6134966, 6156544, 6180183, 6206610, 6234705, 6263118, 6291733, 6321016, 6350846, 6380854, 6411514, 6444109, 6479631, 6518144, 6559233, 6602723, 6648809, 6697770, 6749903, 6805797, 6866329, 6932049, 7002784, 7078275, 7159094, 7246412, 7340875, 7442330, 7550779, 7666815, 7790746, 7921887, 8059256, 8202397, 8350972, 8504158, 8661288, 8822456, 8986488, 9146689, 9288365, 9391629, 9438827, 9422205, 9346973, 9228026, 9082984, 8926485, 8768482]
57659H768482j53050j43718j31509j17728j03474q9644p6836o5283n5032m6100
57649G786108l8234l0883k3858j7718j2977r158n255r59L237O988J0455J3738
57637G681484J6614J8991K1135K3426K6161K9498L3200L6704L9854M3184M7018
57626H017269N0749N3791N6668O0239O4171O7342O9524P1514P3555P4746P4201
57615H733769P1721O7166O0259N1408M1686L1531K0345P942m446j5224k3876l0765
57603I011516l6128l9864m2016m2836m2553m1423l9796l7878l5587l2841k9804
57592H590790k6700k3667k0800j8118j5465j2759j0259q269o614m796k655n00
57580H440188J371K913M250N656P419R308J0523J0717J0684J1353J2490J3236
$$ y = [8768482, 8615432, 8471714, 8340205, 8222477, 8119003, 8029359, 7952523, 7887240, 7832208, 7786108, 7747874, 7716991, 7693133, 7675415, 7662438, 7653280, 7648025, 7647066, 7650303, 7657291, 7667746, 7681484, 7698098, 7717089, 7738224, 7761650, 7787811, 7817309, 7850509, 7887213, 7927067, 7970251, 8017269, 8068018, 8121809, 8178477, 8238716, 8302887, 8370229, 8439753, 8511267, 8584822, 8659568, 8733769, 8805490, 8872656, 8932915, 8984323, 9026009, 9057540, 9077885, 9085827, 9081381, 9066157, 9042281, 9011516, 8975388, 8935524, 8893508, 8850672, 8808119, 8766696, 8726900, 8689022, 8653435, 8620594, 8590790, 8564090, 8540423, 8519623, 8501505, 8486040, 8473281, 8463022, 8454753, 8448139, 8443343, 8440688, 8440188, 8441559, 8444472, 8448722, 8454378, 8461797, 8471105, 8481628, 8492345, 8503029, 8514382, 8526872, 8540108]
57568H540108J3622J4453J5847J6993J7464J7671J7834J7561J6880J6633J7349
57557H722415J8561J9722K1034K2679K4006K4265K3733K3482K4184K5566K6885
57546H976532K7553K7524K7312K7582K8581L0066L1757L3511L5219L6827L8515
57535I320979M0457M2532M4594M6881M9690N2847N5979N9051O2101O4669O6240
57524I906020O6968O7250O6809O5096O2297N8915N4490M7927L9185K9497J9809
57513A0484263J0102N84p685j3917j8410k1730k3900k4838k4847k4221k2994k1359
57501A0291048j9616j7547j4645j1260q516o819n356l465j382P17L302O431R172
57488A0222064J0939J2483J4679J7136J8948K0176K1601K3458K5281K6734K7826
$$ y = [8540108, 8553730, 8568183, 8584030, 8601023, 8618487, 8636158, 8653992, 8671553, 8688433, 8705066, 8722415, 8740976, 8760698, 8781732, 8804411, 8828417, 8852682, 8876415, 8899897, 8924081, 8949647, 8976532, 9004085, 9031609, 9058921, 9086503, 9115084, 9145150, 9176907, 9210418, 9245637, 9282464, 9320979, 9361436, 9403968, 9448562, 9495443, 9545133, 9597980, 9653959, 9713010, 9775111, 9839780, 9906020, 9972988, 10040238, 10107047, 10172143, 10234440, 10293355, 10347845, 10395772, 10434957, 10464454, 10484263, 10494365, 10494949, 10487264, 10473347, 10454937, 10433207, 10409307, 10384469, 10359622, 10335401, 10312407, 10291048, 10271432, 10253885, 10239240, 10227980, 10219464, 10212645, 10207289, 10203824, 10202442, 10203159, 10206461, 10212892, 10222064, 10233003, 10245486, 10260165, 10277301, 10296249, 10316425, 10338026, 10361484, 10386765, 10413499, 10441325]
57477A0441325K8642K9439L0767L2974L5800L8787M1749M4570M7111M9541N2203
57466A0872908N4879N6855N7987N8880N9647N9373N7309N3705M8883M2541L4681
57455A1457648K6271J8078R669N69q363j5811k1604k6380l0130l2344l3145l3201
57443A1311257l2722l1484k9691k7798k5658k2813j9574j6835j4849j2992j0784
57432A1066057q458o441m899l762k734j353M80K162L024L127L034L101L475M355
57418A1061168N637O631O762O317N955N850N831N972O304O456O267O347P172Q125
57404A1150794Q300P900P809Q056P888P189O702O761O887O752O576O423O108O002
57390A1250147O909Q676R861R397P898O719O300N996N273M416M081M496N175N334
$$ y = [10441325, 10469967, 10499406, 10530173, 10563147, 10598947, 10637734, 10679483, 10724053, 10771164, 10820705, 10872908, 10927787, 10984642, 11042629, 11101509, 11161156, 11220529, 11277838, 11331543, 11380426, 11422967, 11457648, 11483919, 11501997, 11511666, 11512235, 11503872, 11488061, 11466457, 11440077, 11409947, 11377603, 11344458, 11311257, 11278535, 11247051, 11217360, 11189562, 11163904, 11141091, 11121517, 11104682, 11089833, 11076841, 11066057, 11057599, 11051158, 11046259, 11042497, 11039763, 11038410, 11038890, 11041052, 11044076, 11047203, 11050237, 11053338, 11056813, 11061168, 11066805, 11073436, 11080198, 11086515, 11092470, 11098320, 11104151, 11110123, 11116427, 11122883, 11129150, 11135497, 11142669, 11150794, 11159094, 11166994, 11174803, 11182859, 11190747, 11197936, 11204638, 11211399, 11218286, 11225038, 11231614, 11238037, 11244145, 11250147, 11257056, 11265732, 11275593, 11284990, 11292888, 11299607, 11305907, 11311903, 11317176, 11321592, 11325673, 11330169, 11335344, 11340678]
57376A1340678M697L721K998K582K206J899J944K284K510K436K289K213J990J456
57362A1375903Q88P68J261J951K191J783J225J115J397J608J706K011K354K096
57348A1398257J212N48M97L33n21j471j774j770k184k903l479m168n314o196n875
57333A1365192m790m215m306m193l868m455o255p930q274p625o935o384n629m754
57319A1285579m231m324m923n627n850n322m606m568n194n634n423n041n011n237
57305A1214588n470n734n977n898n446m962m645m426m495n341p007q987j0951
57292A1135249j2932j4736j6013j7116j8968k1648k4081k5545k6580k7797k8708
57281A0901125k8627k7920k7385k6926k5832k4112k2612k1853k1605k1550k1624
$$ y = [11340678, 11345375, 11349096, 11352094, 11354676, 11356882, 11358781, 11360725, 11363009, 11365519, 11367955, 11370244, 11372457, 11374447, 11375903, 11376791, 11377559, 11378820, 11380771, 11382962, 11384745, 11385970, 11387085, 11388482, 11390090, 11391796, 11393807, 11396161, 11398257, 11399469, 11400017, 11400514, 11400847, 11400326, 11398855, 11397081, 11395311, 11393127, 11390224, 11386745, 11382577, 11377263, 11371067, 11365192, 11360402, 11356187, 11351881, 11347688, 11343820, 11339365, 11333110, 11325180, 11316906, 11309281, 11302346, 11295962, 11290333, 11285579, 11281348, 11277024, 11272101, 11266474, 11260624, 11255302, 11250696, 11246128, 11240934, 11235300, 11229877, 11224836, 11219825, 11214588, 11209118, 11203384, 11197407, 11191509, 11186063, 11181101, 11176456, 11172030, 11167535, 11162194, 11155187, 11146200, 11135249, 11122317, 11107581, 11091568, 11074452, 11055484, 11033836, 11009755, 10984210, 10957630, 10929833, 10901125, 10872498, 10844578, 10817193, 10790267, 10764435, 10740323, 10717711, 10695858, 10674253, 10652703, 10631079]
57270A0631079k1627k1166k0168j9076j8287j7764j7325j6987j6889j6960j6881
57259A0427949j6409j5657j5071j5019j5454j6020j6445j6683j6774j6785j6857
57248A0250775j7051j7187j7095j6893j6799j6736j6473j6084j5852j5761j5456
57237A0069388j4655j3351j1638r749q202p480p714q948j1426j4991j8495k0642
57225I922097k1388k1660k1826k1334k0007j8648j7935j7634j7421j7669j8757
57214I707818k0195k1120k1340k1297k1275k1046k0171j8414j6166j4473j4168
57203I498153j4845j5267j4942j4612j4975j5734j6419j7263j8604j9988k0746
57192I314758k1023k1524k2363k2904k2681k2004k1586k1850k2520k2887k2612
$$ y = [10631079, 10609452, 10588286, 10568118, 10549042, 10530755, 10512991, 10495666, 10478679, 10461790, 10444830, 10427949, 10411540, 10395883, 10380812, 10365793, 10350339, 10334319, 10317874, 10301191, 10284417, 10267632, 10250775, 10233724, 10216537, 10199442, 10182549, 10165750, 10149014, 10132541, 10116457, 10100605, 10084844, 10069388, 10054733, 10041382, 10029744, 10019995, 10011793, 10004313, 9996599, 9987651, 9976225, 9961234, 9942739, 9922097, 9900709, 9879049, 9857223, 9835889, 9815882, 9797234, 9779299, 9761665, 9744244, 9726575, 9707818, 9687623, 9666503, 9645163, 9623866, 9602591, 9581545, 9561374, 9542960, 9526794, 9512321, 9498153, 9483308, 9468041, 9453099, 9438487, 9423512, 9407778, 9391359, 9374096, 9355492, 9335504, 9314758, 9293735, 9272211, 9249848, 9226944, 9204263, 9182259, 9160673, 9138823, 9116303, 9093416, 9070804]
57181I070804k2249k2499k3074k3014k2194k1648k2098k3060k3969k5177k7142
57170H814680k9332l0950l2079l3222l4252l4810l5276l6224l7162l6952l5551
57159H438870l4275l4157l4862l5474l5660l5821l6696l9120m3895n1747o3382
57148G993781p9012r7011j13201j22508j22147j13337j00180q7085p6782o9715
57138G012803o4798o0899n7797n5751n4664n4218n4522n5981n8503o1440o4375
57127F369855o7433p0709p3811p6132p7324p7462p6964p6171p4826p2242o8239
57116E558542o3528n8653n3106m6198l8410l0892k3815j6299q021L58Q656J8091
57104E246725L0127M5207O3309Q5057J11634J43984J82843K29326K84872L50619
$$ y = [9070804, 9048555, 9026056, 9002982, 8979968, 8957774, 8936126, 8914028, 8890968, 8866999, 8841822, 8814680, 8785348, 8754398, 8722319, 8689097, 8654845, 8620035, 8584759, 8548535, 8511373, 8474421, 8438870, 8404595, 8370438, 8335576, 8300102, 8264442, 8228621, 8191925, 8152805, 8108910, 8057163, 7993781, 7914769, 7817758, 7704557, 7582049, 7459902, 7346565, 7246385, 7159300, 7082518, 7012803, 6948005, 6887106, 6829309, 6773558, 6718894, 6664676, 6610154, 6554173, 6495670, 6434230, 6369855, 6302422, 6231713, 6157902, 6081770, 6004446, 5926984, 5850020, 5773849, 5699023, 5626781, 5558542, 5495014, 5436361, 5383255, 5337057, 5298647, 5267755, 5243940, 5227641, 5219620, 5219978, 5228634, 5246725, 5276852, 5322059, 5385368, 5470425, 5582059, 5726043, 5908886, 6138212, 6423084, 6773703]
57094F773703M27011N13653O09015P10319Q13951R15778J010691J091973J151611
57085A4017705J182048J179059J144691J087781J019977R48827Q73135P84036
57077B2237259O69708N19707L28108R6866j61766m27211o77017q93066j063643
57068B0628945j182654j249267j268282j249035j202566j138997j066328r89836
57060A1281980r11770q32216p51174o69976n90788n15427m45195l81409l25221
57051E858804k76818k35302j99499j68575j41880j18698r8448q0874o5955n3755
57041D419000m4341l7654l3297l0716k9567k9767l1157l3287l5480l7100l7899
57030D038735l8236l8570l8464l6569l1946k5043j6935q930m254r173k9381o3812
$$ y = [6773703, 7200714, 7714367, 8323382, 9033701, 9847652, 10763430, 11774121, 12866094, 14017705, 15199753, 16378812, 17523503, 18611284, 19631261, 20580088, 21453223, 22237259, 22906967, 23426674, 23754782, 23851648, 23689882, 23262671, 22585654, 21692588, 20628945, 19446291, 18197024, 16928742, 15679707, 14477141, 13338144, 12271816, 11281980, 10370210, 9537994, 8786820, 8116844, 7526056, 7010629, 6565434, 6184025, 5858804, 5581986, 5346684, 5147185, 4978610, 4836730, 4718032, 4619584, 4538710, 4472755, 4419000, 4374659, 4337005, 4303708, 4272992, 4243425, 4213658, 4182501, 4149214, 4113734, 4076634, 4038735, 4000499, 3961929, 3923465, 3886896, 3854950, 3829907, 3812972, 3804042, 3799788, 3790615, 3761234, 3697422]
57018C697422j03422j37529j61072j75307j83228j86213j84543j78876j70369
57009B216863j60198j49495j39208j29726j20880j12346j03837r5193q6759p9359
56999A039862p3364o8118o2850n7773n3579n0099m6424m2180l7820l3673k9540
56988D84442k5356k1410j7742j3969r975o220l290j612j501k899n021o947q510
56975C59990r937j0839j0618r771r582j0174j0106q453o165m565l505k079l98
56962B63798O51J123K274M909Q295J0870J1493R910O562K328j819n166p389q557
56948B99282r079r447r744r545q508o850n082l469j996n65J025L009N260P236
56934B51527Q691J0184J2328J4633J5653J4354J0970O419J418l667q373j2052
$$ y = [3697422, 3594000, 3456471, 3295399, 3120092, 2936864, 2750651, 2566108, 2387232, 2216863, 2056665, 1907170, 1767962, 1638236, 1517356, 1405010, 1301173, 1205980, 1119221, 1039862, 966498, 898380, 835530, 777757, 724178, 674079, 627655, 585475, 547655, 513982, 484442, 459086, 437676, 419934, 405965, 395990, 389770, 386480, 384868, 383367, 380468, 375447, 368500, 359990, 350053, 339214, 328596, 318825, 309243, 299069, 288963, 280510, 274345, 269780, 266275, 264196, 263798, 264449, 265572, 267846, 272755, 281050, 291920, 303413, 313323, 319885, 322213, 320394, 315228, 307839, 299282, 290203, 280756, 271012, 261467, 252959, 246109, 241027, 237558, 235562, 234997, 236022, 239031, 244291, 251527, 260218, 270402, 282730, 297363, 313016, 327370, 338340, 344759, 346177, 342510, 334137, 322085]
56922C22085j4240j4995j4841j4399j3983j3445j2394j0679q622o783n488m672
56910A87544m172l957l958l853l391k806k503k371j865r73m09n21n91J62J443
56895A57779K479L274M318N312N425M918N281P266R784J1352J1720J1316R932
56882B50156P077L209m23l123n040o191o141m903l432k692k551k010k95K494N671
56867B31806Q517J0727J2556J4728J7912K2032K6060K8675K9220K7800K4471J8800
56855D73304J0741J623o394j1918j4941j6062j5789j4750j3663j2530j0434o736
56843C62451k098K257O000R823J4313J9427K5017L1189L7741M3579M6858M5741
56831F42298L9176K7464J2384l452j7577k8342l5036l7830l7624l5622l2771k9456
$$ y = [322085, 307845, 292850, 278009, 263610, 249627, 236182, 223788, 213109, 204487, 197704, 192216, 187544, 183372, 179415, 175457, 171604, 168213, 165407, 162904, 160533, 158668, 157695, 157286, 156765, 156174, 156336, 157779, 160258, 163532, 167850, 173162, 178587, 183505, 188786, 196052, 205836, 217188, 228908, 240224, 250156, 257233, 260442, 260019, 256896, 251856, 245665, 239524, 234621, 231189, 228497, 225946, 223936, 223641, 226135, 231806, 240323, 251050, 263606, 278334, 296246, 318278, 344338, 373013, 402233, 430033, 454504, 473304, 484045, 485668, 479274, 467356, 452415, 436353, 420564, 405814, 392151, 379621, 369187, 362451, 360353, 362610, 368610, 378433, 392746, 412173, 437190, 468379, 506120, 549699, 596557, 642298, 681474, 708938, 721322, 717870, 700293, 671951, 636915, 599085, 561461, 525839, 493068, 463612]
56819D63612k5687k1417j6724j1782o742j657L495Q790J4379K0421K6761L2649
56807D86098L6886L8221L5617K8504J7446M558p272j6108k1863k5444k7292k7114
56795E22237k4779k1115j7572j5053j3172j0847p671m380j788L62K895N986R077
56782D24180J1835J4231J5613J4646J0682M482k653r766j5921k0028k1776k2162
56770D03363k2332k2339k1718k0614j9474j8052j5847j3312j1522j0616r600p902
56758B10035o240n541n677n771n269m347l498l036k831k383j410l69m8n68j200
56743A61847j262q15l11k4q0o53j632k350k111j053q8J14j64j92K09N30M12J52
56725A52529J34J16l71j140j463j109o14l19J40J018J755J674R53K90j5o6K46
$$ y = [463612, 437925, 416508, 399784, 388002, 381260, 379603, 383098, 391888, 406267, 426688, 453449, 486098, 522984, 561205, 596822, 625326, 642772, 647330, 640058, 623950, 602087, 576643, 549351, 522237, 497458, 476343, 458771, 443718, 430546, 419699, 412028, 407648, 405860, 406222, 409117, 415103, 424180, 436015, 450246, 465859, 480505, 491187, 495669, 493016, 483250, 467329, 447301, 425525, 403363, 381031, 358692, 336974, 316360, 296886, 278834, 262987, 249675, 238153, 227537, 217937, 210035, 203795, 198254, 192577, 186806, 181537, 177190, 173692, 170656, 167825, 165442, 164032, 163663, 163615, 163047, 161847, 160585, 159770, 159459, 159435, 159355, 158702, 157070, 154720, 152609, 151556, 151468, 151582, 151418, 151226, 151435, 151965, 152377, 152529, 152663, 152779, 152408, 151268, 149805, 148696, 148082, 147763, 147903, 148921, 150676, 152350, 153303, 153593, 153578, 153512, 153758]
56708A53758J107K140K664K612K559K826L131L210L213L296L320L170K974K821
56694A92801K569K159J774J560J432J272J148J160J294J467J565J396Q31P2m12
56679B12088k42N42J495J995J661P49l9k78j40O9L61P37Q01J75r31j974k664k981
56661B11424k849k379k115k470l102l349l090k628j998j128m83o75j480k012j900
56646A79766j559j284r27n28m55o29m96kK58J95O14J884L037K913J626L00l24
56629A84389l27j18r4n37j279j672j319o53m16q03j461k021k295k197j857j591
56613A65749j453j114m53J38M28Q81J905K978L231K662K089J943J869J533J171
56598A83557J045R72P13N13P65J345J664J472J242J580K360K766K276J287N45
$$ y = [153758, 154865, 157005, 159669, 162281, 164840, 167666, 170797, 174007, 177220, 180516, 183836, 187006, 189980, 192801, 195370, 197529, 199303, 200863, 202295, 203567, 204715, 205875, 207169, 208636, 210201, 211597, 212428, 212500, 212088, 211846, 212388, 213883, 215878, 217539, 218288, 218249, 217971, 217831, 217900, 218261, 218998, 219799, 219974, 219043, 217069, 214405, 211424, 208575, 206196, 204081, 201611, 198509, 195160, 192070, 189442, 187444, 186316, 185833, 185158, 183678, 181666, 179766, 178207, 176923, 175996, 175468, 175013, 174384, 173888, 173886, 174144, 174339, 174953, 176837, 179874, 182787, 184413, 184713, 184389, 184062, 183944, 183850, 183313, 182034, 180362, 179043, 178390, 177974, 177171, 175710, 173689, 171394, 169197, 167340, 165749, 164296, 163182, 162729, 162867, 163295, 164176, 166081, 169059, 172290, 174952, 177041, 178984, 180853, 182386, 183557, 184602, 185574, 186287, 186800, 187565, 188910, 190574, 192046, 193288, 194868, 197228, 199994, 202270, 203557, 204102]
56583B04102K38M7j05R9O96J211J240R49P84R68J457K024K280K023J679J913K696
56566B24301L247L156K844K682K297J363L85Jk4l31r07j287j516k054k823l259
56550B28075l246l200l215k991k771l351m720n625n119l899l305l510l537k854
56536A76732j957j317o38M10J382J582J135Q31R47Q58J1j120j533r57j47Pn97
56519A75629j367j666j313o60l05n61j058j129o39j68k44o16o77m05m00r71j598
56502A61852j566r17l89m32o50m39J09L67K02K83J074J999K154J577J170J365
56486A67759J621J418J093J215J641J782J546J404J566J683J506J355J630K123
56472A89342K264J931J630J711J736J042k48j227j288p67l09J1M85J016J125O71
$$ y = [204102, 204340, 204387, 204282, 204381, 205077, 206288, 207528, 208477, 209261, 210229, 211686, 213710, 215990, 218013, 219692, 221605, 224301, 227548, 230704, 233548, 236230, 238527, 239890, 240275, 240276, 240252, 239921, 239014, 237727, 236211, 234157, 231334, 228075, 224829, 221629, 218414, 215423, 212652, 209301, 204581, 198956, 193837, 189938, 186633, 183123, 179586, 176732, 174775, 173458, 172820, 173230, 174612, 176194, 177329, 178160, 179107, 179965, 179976, 178856, 177323, 176366, 176219, 176226, 175629, 174262, 172596, 171283, 170623, 170318, 169757, 168699, 167570, 166931, 166763, 166519, 165903, 165226, 164821, 164421, 163450, 161852, 160286, 159369, 158980, 158548, 157898, 157459, 157568, 157935, 158137, 158420, 159494, 161493, 163647, 165224, 166394, 167759, 169380, 170798, 171891, 173106, 174747, 176529, 178075, 179479, 181045, 182728, 184234, 185589, 187219, 189342, 191606, 193537, 195167, 196878, 198614, 199656, 199408, 198181, 196893, 196126, 195817, 195828, 196313, 197329, 198454, 199125]
56456A99125J22l9J48L13K63J51K45N62P62N47J19p7q1l45p63n32N32J280P20
56437B03052m32p67l36m48j391j907j181p2L10J29J56M65O88R09J392J867J834
56420B04268J348Q70N94M05K78K77L70N88J093J796K272K377K438K604K490J914
56404B25982J428J626K288K680K344J239l60j770k181j561q33o42n38J36J038
56389B30876J287P55J60Q6M67Q96J015P41M47O27J174J392R74M63M11P11J036
56372B43518J294J262N90l58n59K51J084J289J593K609L447L061K081J848K307
56357B65317K388J959J846K157K190J925K069K570K541J866J457J711J983J968
56343B93947K279L114L556K864J595P82P36J132J629J974K079K349L322M761N720
$$ y = [199125, 199247, 199208, 199356, 199669, 199932, 200083, 200328, 200890, 201652, 202199, 202318, 202241, 202160, 201815, 201052, 200520, 201052, 202332, 203052, 202620, 201853, 201517, 201069, 199678, 197771, 196590, 196518, 196828, 196957, 197113, 197578, 198266, 199175, 200567, 202434, 204268, 205616, 206486, 207080, 207485, 207763, 208040, 208410, 208998, 210091, 211887, 214159, 216536, 218974, 221578, 224068, 225982, 227410, 229036, 231324, 234004, 236348, 237587, 237227, 235457, 233276, 231715, 230882, 230240, 229702, 229838, 230876, 232163, 232918, 233078, 233164, 233631, 234527, 235542, 236283, 236730, 237357, 238531, 239923, 240897, 241360, 241771, 242482, 243518, 244812, 246074, 246664, 246306, 245747, 245998, 247082, 248371, 249964, 252573, 256020, 259081, 261162, 263010, 265317, 267705, 269664, 271510, 273667, 275857, 277782, 279851, 282421, 284962, 286828, 288285, 289996, 291979, 293947, 296226, 299340, 302896, 305760, 307355, 308137, 308873, 310005, 311634, 313608, 315687, 318036, 321358, 326119, 331839]
56328C31839N763N429N275N172M837M398M091L963M135M806N725O223N996N383
56314D03035M753M123L539L169K954K655K362K363K529K460K205K153K234K060
56300D42594J808K099K870L369L414L682M528N440O026O581P271P713P776Q022
56286E13193Q808R841J1055J2946J5448J7316J7646J7305J8006K0243K3023K5418
56274G10248K7655L0630L4824L9786M4517M8474N2132N6347O1291O6488P1766
56263A244158P7368Q3008Q7619R0504R2118R3224R3727R2744Q9476Q3786P6182
56252B203914O7497N8223M8095L6710K4599J3048K714o923j6467k5539l3263l9397
56240B333211m4625m9832n5358o0801o5515o9293p2341p4515p5163p4159p2432
$$ y = [331839, 337602, 343031, 348306, 353478, 358315, 362713, 366804, 370767, 374902, 379708, 385433, 391656, 397652, 403035, 407788, 411911, 415450, 418619, 421573, 424228, 426590, 428953, 431482, 433942, 436147, 438300, 440534, 442594, 444402, 446501, 449371, 452740, 456154, 459836, 464364, 469804, 475830, 482411, 489682, 497395, 505171, 513193, 522001, 531842, 542897, 555843, 571291, 588607, 606253, 623558, 641564, 661807, 684830, 710248, 737903, 768533, 803357, 843143, 887660, 936134, 988266, 1044613, 1105904, 1172392, 1244158, 1321526, 1404534, 1492153, 1582657, 1674775, 1767999, 1861726, 1954470, 2043946, 2127732, 2203914, 2271411, 2329634, 2377729, 2414439, 2439038, 2452086, 2454800, 2447877, 2431410, 2405871, 2372608, 2333211, 2288586, 2238754, 2183396, 2122595, 2057080, 1987787, 1915446, 1840931, 1765768, 1691609, 1619177]
56229A619177p0782o8712o5365o1043n6803n2941m9143m5665m2964m0362l6712
56218A028685l2407k9181k7629k6454k4496k2027j9550j6885j4199j2479j2110
56207G91268j1996j0995r306p727o462n391m619m088l395k553k119k160j964j212
56193G17281n45m65o36p08q25r16m55O29J845L144M877O545P114O972P821R999
56177G61677J1671J1659J1285J2107J3452J3813J3411J3699J5090J6767J8108
56166I12739J9059J9592J9899K0623K2082K3924K6155K9645L4794M0801M7132
56155A216445N4671O4506P6584R0477J06204J23089J38844J50956J58033J59027
56145B338836J52678J39316J22131J05230R1121Q0886P5032P2233O8441N9455
$$ y = [1619177, 1548395, 1479683, 1414318, 1353275, 1296472, 1243531, 1194388, 1148723, 1105759, 1065397, 1028685, 996278, 967097, 939468, 913014, 888518, 866491, 846941, 830056, 815857, 803378, 791268, 779272, 768277, 758971, 751244, 744782, 739391, 734772, 730684, 727289, 724736, 722617, 720457, 718493, 717281, 716736, 716271, 715635, 714927, 714102, 713186, 712731, 713360, 715205, 718349, 723226, 729771, 736885, 743857, 751678, 761677, 773348, 785007, 796292, 808399, 821851, 835664, 849075, 862774, 877864, 894631, 912739, 931798, 951390, 971289, 991912, 1013994, 1037918, 1064073, 1093718, 1128512, 1169313, 1216445, 1271116, 1335622, 1412206, 1502683, 1608887, 1731976, 1870820, 2021776, 2179809, 2338836, 2491514, 2630830, 2752961, 2858191, 2949312, 3030198, 3105230, 3177463, 3245904, 3305359]
56135C305359M4364K5519O185j0537k2047k7887l0903l5312m3854n7426p5905
56124C077556r7430j17904j33321j42408j45726j43379j35422j23664j10837r8190
56114A829275q5535p3136o1815n1600m2019l3452k6648k1242j6261j1704q144
56103A397719n302k528k11R29J426K413L787M514M322L662K585J112M8p7j97j234
56087A412968k250j794l30N59P92J621L321M984O220P325Q115Q311Q661J0011
56073A468514J1744J2694J3031J3661J4518J5103J5837J7140J8130J8077J8058
56062A636507J9189K0427K0412K0244K1781K4179K4991K4062K3432K3953K4731
56051A883908K5545K7024K8635K9182K9148L0025L1629L2517L2683L3264L4010
$$ y = [3305359, 3349723, 3375242, 3381427, 3370890, 3348843, 3320956, 3290053, 3254741, 3210887, 3153461, 3077556, 2980126, 2862222, 2728901, 2586493, 2440767, 2297388, 2161966, 2038302, 1927465, 1829275, 1743740, 1670604, 1608789, 1557189, 1515170, 1481718, 1455070, 1433828, 1417567, 1405863, 1397719, 1392417, 1389889, 1389678, 1390607, 1392033, 1394446, 1398233, 1402747, 1407069, 1410731, 1413316, 1414428, 1414476, 1414399, 1414202, 1412968, 1410718, 1408924, 1408594, 1409153, 1409945, 1411566, 1414887, 1419871, 1426091, 1433416, 1441531, 1449842, 1458503, 1468514, 1480258, 1492952, 1505983, 1519644, 1534162, 1549265, 1565102, 1582242, 1600372, 1618449, 1636507, 1655696, 1676123, 1696535, 1716779, 1738560, 1762739, 1787730, 1811792, 1835224, 1859177, 1883908, 1909453, 1936477, 1965112, 1994294, 2023442, 2053467, 2085096, 2117613, 2150296, 2183560, 2217570]
56040B217570L3658L2492L1908L1863L1300L0626L1097L2336L3190L4380L7523
56029B577943M2158M6656N1200N6732O1918O4712O6104O8695P2199P4213P4843
56018C257373P6577P9750Q2296Q3800Q5943Q8906R1329R3709R7901J03333J07645
56007D248562J10871J15018J19874J23568J26848J32342J39812J46740J53165
55998E416800J61216J70397J78437J86277J96868K09493K20981K32001K46034
55989G218504K62569K77929K92636L11059L33654L56671L79718M06250M36395
55980A0275385M66999M99159N37584N82154O28618O78059P36568Q05142Q79722
55971A6089390R61973J059326J173564J300843J444365J614861J817245K050347
$$ y = [2217570, 2251228, 2283720, 2315628, 2347491, 2378791, 2409417, 2440514, 2472850, 2506040, 2540420, 2577943, 2620101, 2666757, 2717957, 2774689, 2836607, 2901319, 2967423, 3036118, 3108317, 3182530, 3257373, 3333950, 3413700, 3495996, 3579796, 3665739, 3754645, 3845974, 3939683, 4037584, 4140917, 4248562, 4359433, 4474451, 4594325, 4717893, 4844741, 4977083, 5116895, 5263635, 5416800, 5578016, 5748413, 5926850, 6113127, 6309995, 6519488, 6740469, 6972470, 7218504, 7481073, 7759002, 8051638, 8362697, 8696351, 9053022, 9432740, 9838990, 10275385, 10742384, 11241543, 11779127, 12361281, 12989899, 13667958, 14404526, 15209668, 16089390, 17051363, 18110689, 19284253, 20585096, 22029461, 23644322, 25461567, 27511914]
55963B7511914K321928K649849L046394L517616M080926M765559N591906O569331
55955F0055423P718047R071210J0650720J2463515J4521169J6827553J9335820
55948A50643457K1931800K4399406K6253985K6564845K4165202J8392388R811999
55941C02163082J54501q602092j5211435j9433888k1641130k2331484k1927733
55934A93169821k0776380j9162075j7307513j5389934j3549038j1868924j0373670
55927H4742287r057225p909169o912259o039949n271814m601514m023569l524434
55919C7402354l092175k722734k410334k142144j907989j706038j534117j384367
55911B0502456j250955j134673j035585r48657q70467q02766p45803o94996o47618
$$ y = [27511914, 29833842, 32483691, 35530085, 39047701, 43128627, 47894186, 53486092, 60055423, 67773470, 76844680, 87495400, 99958915, 114480084, 131307637, 150643457, 172575257, 196974663, 223228648, 249793493, 273958695, 292351083, 302163082, 302317583, 293715491, 278504056, 259070168, 237429038, 215097554, 193169821, 172393441, 153231366, 135923853, 120533919, 106984881, 95115957, 84742287, 75685062, 67775893, 60863634, 54823685, 49551871, 44950357, 40926788, 37402354, 34310179, 31587445, 29177111, 27034967, 25126978, 23420940, 21886823, 20502456, 19251501, 18116828, 17081243, 16132586, 15262119, 14459353, 13713550, 13018554, 12370936]
55902A2370936o06042n71275n39588n08590m80366m55820m31966m07639l85924
55893G983726l68031l50483l31231l13069k98062k83862k68447k53546k40591
55884E276404k27942k14838k03379j94022j83804j71804j61853j56921j54865
55875C606976j52392j49153j45350j39439j31174j23301j17356j11264j03501
55866B434046r6019r0434q4979p8038p1398o6985o3529n9384n5787n4396n4084
55855A659013n3032n1660n0817m9400m6302m2704m0074l7729l4564l1227k8582
55844A192922k5903k2515j9366j7163j4954j2172j0064r360q703p069n642n581
55832A034430o099o485p771j0426j2667j3011j2557j2817j3350j3435j4025j5896
$$ y = [12370936, 11764894, 11193619, 10654031, 10145441, 9665075, 9209255, 8777289, 8369650, 7983726, 7615695, 7265212, 6933981, 6620912, 6322850, 6038988, 5770541, 5516995, 5276404, 5048462, 4833624, 4630245, 4436223, 4252419, 4080615, 3918762, 3761841, 3606976, 3454584, 3305431, 3160081, 3020642, 2889468, 2766167, 2648811, 2537547, 2434046, 2338027, 2247593, 2162614, 2084576, 2013178, 1946193, 1882664, 1823280, 1767493, 1713097, 1659013, 1605981, 1554321, 1503504, 1454104, 1407802, 1365098, 1325024, 1287295, 1252731, 1221504, 1192922, 1167019, 1144504, 1125138, 1107975, 1093021, 1080849, 1070785, 1061425, 1052722, 1045653, 1040011, 1034430, 1028331, 1021846, 1014075, 1003649, 990982, 977971, 965414, 952597, 939247, 925812, 911787, 895891]
55820H95891j7773j8381j8550j9278j9617j8539j7093j6462j5669j3482j1037
55809G10010j0142j0336r849q325o504m429k115p34j044j644r62J30k11j723k577
55794F49545k361k383l552n724q623j1745j3856j4150j3342j2356j0825q210n425
55781E36993l690k609j031R43K349K936K791J302j830n191p105p971r457j1860
55767D96570j3904j4840j5177j5436j5581j5581j5479j5070j4411j4150j4454
55756C32487j4292j2799j0661r031p785o121m124k406p77J263L146L711K864J542
55742B77017L55p60j771k471k836k776k000q19l03p69j080m08K54l95j806k399
55726B57033j961j644k021k507k519k050j311p52r99j860j915k11K157L293K815
$$ y = [895891, 878118, 859737, 841187, 821909, 802292, 783753, 766660, 750198, 734529, 721047, 710010, 699868, 689532, 679683, 671358, 664854, 660425, 658310, 657576, 656532, 654888, 653926, 654056, 653845, 652122, 649545, 647184, 644801, 641249, 635525, 626902, 615157, 601301, 587151, 573809, 561453, 550628, 542418, 536993, 533303, 530694, 529663, 530606, 532955, 535891, 538682, 539984, 538154, 532963, 525858, 517887, 508430, 496570, 482666, 467826, 452649, 437213, 421632, 406051, 390572, 375502, 361091, 346941, 332487, 318195, 305396, 294735, 285704, 277919, 271798, 267674, 265268, 264491, 265754, 268900, 272611, 275475, 277017, 277372, 276612, 274841, 272370, 269534, 266758, 264758, 263939, 263636, 262867, 261787, 261379, 261633, 261238, 259432, 257033, 255072, 253428, 251407, 248900, 246381, 244331, 243020, 242268, 241269, 239409, 237494, 237283, 239440, 242733, 245548]
55711B45548J843J302J421K405M222N999O802O805O702O451N653M702M245L957
55697C08057L065J814J160J272J472J444J397J315J103J174J838K435K160J374
55683C31080R52P84J21r63j852k710m142n741o479o478o897p946q432p577o058
55668B67662m895m355m247m280l838k305M8K169L504M548O021Q070J0309J2016
55654B90427J2499J1747J0618R721Q548O428L839J742K8k105m461n914o199o302
55640C30616o771o841n713l796k084j012l83R3N14P03K27j173l127m999o614q256
55624B81384j0021j1654j2840j3351j3032j2058j0931r906q842p867p469p472
55612A55941o818n115l492l022l158k886k594l224m241m196l031k154k198k302
$$ y = [245548, 247391, 248693, 250114, 252519, 256741, 262740, 269542, 276347, 283049, 289500, 295153, 299855, 304100, 308057, 311122, 312936, 314096, 315368, 316840, 318284, 319681, 320996, 322099, 323273, 325111, 327546, 329706, 331080, 332032, 332816, 332937, 331974, 330122, 327412, 323270, 317529, 311050, 304572, 297675, 289729, 281297, 273720, 267662, 262767, 258412, 254165, 249885, 246047, 243742, 243790, 245959, 249463, 254011, 260032, 268102, 278411, 290427, 302926, 314673, 325291, 335012, 343560, 349988, 353827, 355569, 355597, 353492, 349031, 343117, 336918, 330616, 323845, 317004, 311291, 307495, 305411, 304399, 304016, 304109, 304623, 305326, 305553, 304380, 301253, 296254, 289640, 281384, 271363, 259709, 246869, 233518, 220486, 208428, 197497, 187591, 178749, 170882, 163413, 155941, 149123, 144008, 140516, 137494, 134336, 131450, 128856, 125632, 121391, 117195, 114164, 112010, 109812, 107510]
55598A07510j836j332j277j326j152j065j295j575j710j753j491o36L49N69K9
55583I2009l08L2N05O58P78J113J423J576J799K063K049J947K313K968L003K170
55567A16098J317J053R78O87O40J415K769L930M348L790K365P52k19m68o19r19
55551A37917j013r19j280k284l179l339l041k768k519k319k576l315l728l234
55537A02403k400k147k460k600k184j388m08N95J142P67k13p36j14J148J920J746
55521I5071J363J747K953M283N428O685P938Q365P781P296P802Q491Q010O555
55507A79768N424M840L688J486q90k762m653p096r521j0976j1197j0479r214q003
55493A20415p508p633p486o462m957l686k977k881l248l480k978k103j861k387
$$ y = [107510, 105674, 104342, 103065, 101739, 100587, 99522, 98227, 96652, 94942, 93189, 91698, 91062, 91411, 91980, 92009, 91701, 91733, 92238, 92896, 93674, 94787, 96210, 97786, 99585, 101648, 103697, 105644, 107957, 110925, 113928, 116098, 117415, 118468, 119446, 120133, 120773, 122188, 124957, 128887, 133235, 137025, 139390, 140142, 139923, 139455, 138836, 137917, 136904, 135985, 134705, 132421, 129242, 125903, 122862, 120094, 117575, 115256, 112680, 109365, 105637, 102403, 100003, 97856, 95396, 92796, 90612, 89224, 88816, 89411, 90553, 91320, 91107, 90371, 90257, 91405, 93325, 95071, 96434, 98181, 101134, 105417, 110845, 117530, 125468, 133833, 141614, 148910, 156712, 165203, 173213, 179768, 185192, 190032, 193720, 195206, 194316, 191554, 186901, 179805, 170284, 159308, 148111, 137632, 128418, 120415, 112907, 105274, 97788, 91326, 86369, 82683, 79706, 76825, 73577, 70097, 67119, 65016, 63155, 60768]
55479F0768k677k187j607j560j602j213q46j058j391j148p43j136k259k960k475
55464C5906j174P3O72N13l2l08j1M08K83m34j179j467j247p07r9K85L02O0k19
55445C1625l94l73j43J27J82L0qK56O24P56M72j63r16j494j713j591j146l59M98
55426B6270Q15L50l20n09k68j6K89R19J585J701J263P44K85k31n55m18l02q47
55408C0755j628j574n88M16J016J545J802R66p41j784j340l84p4k95n36j009j852
55391B4695k250j501k16N56Q08J131J464J284O30lm60q06p55q8P16R69O99M19
55373B7292L27K64K01R0l27r98j277p71k6L17N21J122J715J348k4j387j878j497
55355B5012o84J09M10%p22j077q95o20o75r80j094o52J84P13M33j88j91N33J081
$$ y = [60768, 58091, 55904, 54297, 52737, 51135, 49922, 49076, 48018, 46627, 45479, 44736, 43600, 41341, 38381, 35906, 34732, 34805, 35477, 35990, 35958, 35650, 35639, 36047, 36330, 35896, 34717, 33250, 32003, 31296, 31197, 31482, 31784, 31844, 31625, 31231, 30858, 30715, 30842, 31024, 31054, 31046, 31302, 31926, 32682, 33154, 32991, 32075, 30581, 28868, 27277, 26131, 25772, 26270, 27085, 27435, 27115, 26606, 26338, 26322, 26611, 27530, 29115, 30816, 32079, 32823, 33108, 32877, 32322, 31904, 31602, 30755, 29127, 27553, 26965, 27381, 28397, 29942, 31744, 32710, 31969, 30185, 28845, 28461, 28387, 28092, 27556, 26547, 24695, 22445, 20944, 20728, 21284, 22092, 23223, 24687, 25971, 26601, 26598, 26138, 25332, 24577, 24489, 25205, 26174, 26873, 27292, 27619, 27883, 28084, 28174, 27847, 26849, 25572, 24801, 24775, 25092, 25613, 26735, 28450, 29798, 29774, 28387, 26509, 25012, 24328, 24437, 24847, 24847, 24125, 23048, 22153, 21533, 20858, 19878, 18784, 18132, 18316, 19029, 19462, 19274, 19083, 19616, 20697]
55336B0697R02N06L93K45k12l88K34R67P40l87j386j641j252l81Q00J692J709
55319B3238J110O33M59J66l99r01j111j060p38k05J08j58o76q32n92l56j94J51
55301A8643N78O65L51P6K15P61J404J643J075L0m89k3N85L79l22m91k2K59Rk28
55281B5098n5K21K72J87O8j45l40k75m1N3J4Kj55o26q88l09O59Q51J13m13l4M83
55259B4740K17n17q48p23p44j013j011n25K6K96M47P13R00O21j44r52j337j225
55241A8921q69m97k10q0j39k09l3L89P94J016J083R01K70o39j180q80O5J135J876
55222B1714J908J137K24J86J051J544P16p40j443j069l40K08N14L35n49j545j637
55205B2214p08L16P24P35Q24J029J161J075N35n72j730k079j439n63k05l04k98
$$ y = [20697, 21599, 22105, 22498, 22743, 22531, 22143, 22377, 23344, 24084, 23697, 22311, 20670, 19418, 19037, 19837, 21529, 23238, 24348, 24981, 25440, 25606, 25207, 24306, 23195, 22135, 21397, 21192, 21300, 21142, 20466, 19634, 19042, 18686, 18492, 18643, 19221, 19886, 20237, 20313, 20528, 21289, 22693, 24336, 25411, 25441, 24952, 24929, 25514, 25893, 25571, 25080, 25058, 25317, 25326, 25098, 25043, 25264, 25536, 25723, 25791, 25646, 25306, 25031, 24990, 25043, 25057, 25059, 24904, 24278, 23390, 23081, 23740, 24591, 24704, 24291, 24257, 24740, 24957, 24440, 23592, 22869, 22125, 21112, 20101, 19576, 19602, 19898, 20345, 21058, 21958, 22579, 22435, 21483, 20146, 18921, 18052, 17555, 17345, 17265, 17126, 16917, 16884, 17273, 18067, 19083, 20166, 21067, 21337, 20698, 19518, 18638, 18703, 19838, 21714, 23622, 24759, 24983, 25169, 26220, 27764, 28480, 27740, 26297, 25228, 24888, 25096, 25610, 25945, 25396, 23851, 22214, 21506, 21822, 22546, 23281, 24105, 25134, 26295, 27370, 27905, 27333, 25603, 23524, 22085, 21522, 21317, 21013, 20715]
55188B0715J47R26J658J920J533P17j75r64j521j579j079m66k01j52N5L53M32
55171B2319M49Q07J348J447R84N22M23M17J79k04n55q42r60p17j97K61M90N53
55153B6724M03l5m36l36J37K77k31q78j014o06j16Jl82r72j237r09l02R1J95K34
55133B0608K84L26N21R27J183R71N54L44K67J92N73J769L024L194K349J619J449
55116D0154J133K92m00l86j26k83p46r95q10k53M50P80L19m43n22R3L02l64q70
55097C7325k57Q74J300Q94M55L62L43K39Q4l20j012j344o70M76Q44J46n84m76
55079C8679Q6K90J00M6K17J70j91l80j33O2k94q54r10n85p06j388j595o91M05
55060C2328M05m50p72qR54J224R63P32O64O35O49O57M82K09J73L48K94j44n66
$$ y = [20715, 20862, 21788, 23446, 25366, 26899, 27616, 27441, 26477, 24956, 23377, 22298, 21832, 21631, 21479, 21534, 21887, 22319, 22768, 23575, 24923, 26370, 27354, 27876, 28299, 28716, 28895, 28691, 28136, 27294, 26334, 25617, 25420, 25681, 26171, 26724, 27127, 27092, 26656, 26320, 26457, 26734, 26503, 25625, 24611, 24005, 23889, 23890, 23508, 22536, 21299, 20390, 20088, 20179, 20374, 20608, 20892, 21218, 21739, 22666, 23849, 24820, 25374, 25718, 25985, 26177, 26750, 28519, 31543, 34737, 37086, 38705, 40154, 41287, 41579, 41179, 40793, 40667, 40384, 39638, 38643, 37833, 37580, 38030, 38810, 39129, 38686, 38164, 38257, 38559, 38195, 37325, 37068, 37942, 39242, 40136, 40591, 40953, 41296, 41535, 41619, 41299, 40287, 38943, 38273, 38749, 39593, 39739, 39155, 38679, 38765, 39055, 39155, 39201, 39418, 39588, 39397, 39017, 38884, 38946, 38652, 37798, 36888, 36303, 35597, 34209, 32614, 31923, 32328, 32733, 32283, 31511, 31503, 32457, 33681, 34644, 35376, 36040, 36675, 37324, 37981, 38463, 38672, 38845, 39193, 39487, 39343, 38777]
55041C8777o25m32j06N29J504K377K655K260J441O34L03N14O35Q0p61r91n72k30
55023D7992q9N29J654K213J555M53j00j87l16l54jK87j31j006j542j500j227q95
55005D7335m52l5K17N11R52J101N16m32r95r89p89o22m56l41k78j3M98P08K10
54986D6646m49l91L71R62Q53L37j11l09k17J34N16O98Q11J152J741K449L323M277
54968F2793M724M206L305L160M059N147N705O068O982Q547J0269J1817J3242J4484
54954A64508J5066J4432J2458R512N995K097j936n549q265j0167j1604j2481j2414
54941A61652j1562j0695j0192r629q609p421o432n487m350l331k794k478j889
54928G6783j069m00Q3O38J270J819K386L151L949M478M885N661P046Q827J0585
$$ y = [38777, 38152, 37720, 37614, 38143, 39647, 42024, 44679, 46939, 48380, 49014, 49317, 49831, 50466, 50546, 49785, 48794, 48222, 47992, 47903, 48432, 50086, 52299, 53854, 54307, 54207, 54020, 53704, 53350, 53349, 53636, 53505, 52499, 50957, 49457, 48230, 47335, 46883, 46848, 47065, 47576, 48528, 49629, 50145, 49713, 48718, 47729, 46940, 46318, 45862, 45521, 45243, 45230, 45728, 46436, 46646, 46197, 45806, 46177, 47139, 47992, 48329, 48218, 47909, 47692, 47826, 48342, 49040, 49851, 51003, 52744, 55193, 58516, 62793, 67517, 71723, 75028, 78188, 82247, 87394, 93099, 99167, 106149, 114696, 124965, 136782, 150024, 164508, 179574, 194006, 206464, 215976, 221971, 224068, 222132, 216583, 208318, 198151, 186547, 174066, 161652, 150090, 139395, 129203, 119574, 110965, 103544, 97112, 91625, 87275, 83944, 81150, 78672, 76783, 75714, 75314, 75397, 76035, 77305, 79124, 81510, 84661, 88610, 93088, 97973, 103634, 110680, 119507, 130092]
54913A30092J1904J2522J2600J2483J1911J0023O550K475j044l929o683r190j0879
54900A78835j1730j2134j2005j1044r775r214r303q755o825m460l157l212l659
54887G3562l514k668j689j117r08n87Q3O76O27Lo45j037j257j279r27l69j62n62
54869E8230j185j516j480j368j386j398j079l39L51L47l41r60r50o28n32n86m64
54852D4716l41n87r35p87k07J41K9q6O9J86J2k44l17j83J81P53J131P69j91q80
54832D3229p22n5M77P09Q54J001J047R28P05N34N60P79J053J407K038K815L099
54815F0458K528J691J453J847K307K785L780N310O703P552Q210R057J0044J1086
54801A34811J2264J3257J3277J1953R802P488N040K194r54l917o232p676q365
$$ y = [130092, 141996, 154518, 167118, 179601, 191512, 201535, 208085, 210560, 209516, 205587, 198904, 189714, 178835, 167105, 154971, 142966, 131922, 122147, 112933, 103630, 94875, 88050, 83590, 80433, 77221, 73562, 70048, 67380, 65691, 64574, 63666, 63079, 63162, 63838, 64465, 64468, 63823, 62786, 61529, 60250, 59323, 58954, 58792, 58230, 57045, 55529, 54049, 52681, 51295, 49897, 48818, 48479, 48830, 49177, 48836, 47876, 46926, 46298, 45766, 45180, 44716, 44375, 43788, 42853, 42066, 41859, 42000, 42029, 41943, 42012, 42198, 42210, 41966, 41649, 41466, 41647, 42400, 43531, 44300, 44109, 43229, 42507, 42452, 42929, 43638, 44492, 45493, 46540, 47468, 48173, 48707, 49267, 50046, 51099, 52506, 54544, 57359, 60458, 62986, 64677, 66130, 67977, 70284, 73069, 76849, 82159, 88862, 96414, 104624, 113681, 123725, 134811, 147075, 160332, 173609, 185562, 195364, 202852, 207892, 210086, 209132, 205215, 198983, 191307, 182942]
54788A82942q762r242r604r368q493p380o176m763l392k567k224j781j140p66
54774A07284n98J72J785L361M251M972O084O981O818N981N628O142O998P826Q614
54759A82299R102Q929Q322P793P147N658L206M63k137m793p522r795j1287j2319
54745A85066j3103j3193j2187j0551r210q521q119p592o901o217n698n406n203
54732G3165m722l654k199j001n48o45o64k93R7m4o66j100q92l28M4J73M14P72
54714E7909P44L7r14j401j238p80k81L91J366K353K822K487J489J83j066j912
54698F2189k087j571o65J87O66P29N93N78Q37J160J197R07O31O61Q75R50P75N45
54680F9157N10P94J363J999K405K400K009J380P71N89J066J832K209K106K182
$$ y = [182942, 174180, 164938, 155334, 145966, 137473, 130093, 123917, 119154, 115762, 113195, 110971, 109190, 108050, 107284, 106686, 106858, 108643, 112004, 116255, 121227, 127311, 134292, 141110, 147091, 152719, 158861, 165859, 173685, 182299, 191401, 200330, 208652, 216445, 223592, 229250, 232456, 232919, 230782, 225989, 218467, 208672, 197385, 185066, 171963, 158770, 146583, 136032, 126822, 118301, 110182, 102590, 95689, 89472, 83774, 78368, 73165, 68443, 64789, 62590, 61589, 61041, 60396, 59732, 59439, 59536, 59492, 58826, 57726, 56834, 56506, 56550, 56723, 57137, 57909, 58653, 58690, 57776, 56375, 55137, 54357, 54076, 54467, 55833, 58186, 61008, 63495, 64984, 65167, 64101, 62189, 60102, 58531, 57866, 58053, 58719, 59448, 60041, 60619, 61456, 62616, 63813, 64720, 65351, 66012, 66887, 67837, 68612, 69157, 69667, 70461, 71824, 73823, 76228, 78628, 80637, 82017, 82788, 83377, 84443, 86275, 88484, 90590, 92772]
54665I2772K825L508L606L455L874M886N728O078O509P523Q827R790J0086R652
54651A79119Q421O499M215J676j328m723p711r366r581r138q844q786q427p348
54637A24678n875m848m709m957m788m043l207k627k193j783j464j189p78l34k23
54622H1660m69n67j95L22M71J86l30j027j912k719k999k561j682r26p27r14p92
54605F4819M0R81J032J04q63j188j245j677k390k763k424j408N2J412J885J236
54589E7603K23k28j41k01o48j005q85m41LK53R9o00j453j661r59q3N5n00q64m78
54569D8089K34N78N24O01J032J437J511J482J616J603R60j16q02o46o1L01L06
54552E8649K96O70J594K954M299N110N255N021M668M210L692L343L206K909K135
$$ y = [92772, 95597, 99105, 102711, 106166, 110040, 114926, 120654, 126732, 133241, 140764, 149591, 159381, 169467, 179119, 187540, 194039, 198254, 199930, 198602, 193879, 186168, 176802, 167221, 158083, 149239, 140453, 132026, 124678, 118803, 113955, 109246, 104289, 99501, 95458, 92251, 89624, 87431, 85648, 84184, 82995, 82217, 81883, 81660, 81191, 80624, 80429, 80751, 81222, 81408, 81078, 80051, 78139, 75420, 72421, 69860, 68178, 67252, 66525, 65611, 64819, 64859, 65840, 66872, 66976, 66113, 64925, 63680, 62003, 59613, 56850, 54426, 53018, 53070, 54482, 56367, 57603, 57826, 57598, 57457, 57256, 56608, 55603, 54718, 54277, 54280, 54533, 54632, 54032, 52579, 50918, 49959, 49876, 49931, 49431, 48567, 48089, 48323, 48901, 49425, 50026, 51058, 52495, 54006, 55488, 57104, 58707, 59667, 59551, 58749, 58103, 58042, 58343, 58649, 58945, 59615, 61209, 64163, 68462, 73572, 78827, 83848, 88516, 92726, 96418, 99761, 102967, 105876, 108011]
54537A08011J116L40j02o25j591k820l816m339m639m978n052m320k942j980k172
54522G0091k894k946k139j421j389j552j259o62k90j98l0L58Q02J179J475J602
54506F0727J378P42r9p17p74m53l68p72j072o44J63M41P2j47K77R66J438J641
54488F2799J480P17l43q58o03l20m92o16k56M0k97q01p58m44n78j025j063o25
54470E5957k79j54J32N47O33L77K71L89K45k60n36k14K74L36p0n91r16q85m83
54451E4773O9M87P48J051J412J599J422Q43n7r76j335q14J88R10J076R77Q72P26
54433F3971M66J53j32k05K08J053J675J428M48n57j108j164p25J74J187J896K261
54416G1029K497K503K079J479J223J347J480J646K196K912K924J856M36m43p48
$$ y = [108011, 109127, 109467, 109365, 108740, 107149, 104329, 100513, 96174, 91535, 86557, 81505, 77185, 74243, 72263, 70091, 67197, 64251, 62112, 60691, 59302, 57750, 56491, 55829, 55539, 55341, 55311, 55669, 56471, 57650, 59125, 60727, 62105, 62847, 62748, 62031, 61257, 60804, 60436, 59664, 58592, 57948, 58111, 58552, 58624, 58477, 58754, 59720, 61158, 62799, 64279, 64996, 64653, 63795, 63192, 62872, 62380, 61764, 61508, 61548, 61251, 60450, 59692, 59248, 58670, 57645, 56582, 55957, 55678, 55524, 55656, 56203, 56836, 57213, 57484, 57873, 58118, 57858, 57322, 57108, 57382, 57718, 57648, 57057, 56141, 55256, 54773, 54842, 55329, 56077, 57128, 58540, 60139, 61561, 62404, 62347, 61371, 60036, 59222, 59410, 60320, 61396, 62373, 63245, 63971, 64437, 64590, 64458, 64253, 64461, 65514, 67189, 68617, 69065, 68508, 67400, 66236, 65511, 65685, 66872, 68768, 71029, 73526, 76029, 78108, 79587, 80810, 82157, 83637, 85283, 87479, 90391, 93315, 95171, 95607, 95164, 94416]
54401I4416r90j297j311q87m24m20q72j225r67k89M9m20j351k118k477k411j714
54384G5292l48R84J342O25l58r08j011r29p91p22q29r70r02p32p37q20n84p1J69
54365F7700j49o96j009q00J67J796L238L473K579J721J572J569J096N74O99J221
54349H4751J361R89O02L26j73q69j225j072r44j278j757j876j775k033k669k871
54333F9487j997n07M50L36l07p06o99n23k72q1l93j420k495k719k119j520j245
54316E3270p83O1O05K87m13o98n74n81p66o45m5N82P79N49J78j35l26l91l03k7
54296E0624M10P76P41K23m96j057j275j074m41M01R50Q48K41l97o71m05L85J389
54278E1172K049J911J081J90j32K15P44R58Q98R78J218J000k0j187j477p89L1
$$ y = [94416, 93426, 92129, 90818, 89931, 89507, 89087, 88215, 86990, 86023, 85734, 85783, 85363, 84012, 81894, 79417, 77006, 75292, 74944, 75928, 77270, 77895, 77537, 76629, 75618, 74689, 73898, 73176, 72347, 71377, 70475, 69743, 69006, 68186, 67602, 67531, 67700, 67551, 66855, 65846, 65046, 65213, 67009, 70247, 73720, 76299, 78020, 79592, 81161, 82257, 82831, 83530, 84751, 86112, 87101, 87703, 88029, 87856, 86987, 85762, 84690, 83746, 82468, 80711, 78835, 77060, 75027, 72358, 69487, 67490, 66983, 67433, 67769, 67462, 66756, 66057, 65534, 65262, 65181, 64788, 63368, 60873, 58154, 56035, 54515, 53270, 52487, 52548, 53153, 53440, 53027, 52329, 51755, 51174, 50408, 49763, 49718, 50300, 51079, 51628, 51806, 51671, 51345, 50954, 50651, 50624, 51034, 51810, 52551, 52774, 52278, 51221, 49946, 48872, 48431, 48832, 49782, 50630, 50871, 50474, 49803, 49398, 49783, 51172, 53221, 55132, 56213, 56403, 56271, 56486, 57230, 58188, 59086, 60064, 61282, 62282, 62262, 61075, 59598, 58809, 58840]
54261E8840M22O42R52R54K62p14j172q86k92K22O24R41J064R37O24J63m67j130
54243F1986j460j133k63N81Q47N09K1k34k83l13l61m40o39q86q44m44j37k37k99
54224E5971K08Q73P80n7o30l37L33P72J068J437J576J174N24O9k46o06p78m77
54206F1654n1j25p50j369j545j290p49n5N27O72L39j63m39l49q8k7l30o78o31
54187E4553k40Mj65n39r16j328j644j452o70J73N58M86J01p07j798k414j902o06
54169D1494N22J001J090J126J118R24M46l20j098j325p02L28R92R91O75M78M90
54152D8230N55N58O16R48J496J661Q94m27j243j117p15p62j100j242j211j176
54136D5965q42M9R60J148P15K94o5p91j687j907j180k07L61O25Q20P47K33l63
$$ y = [58840, 59262, 59904, 60856, 61810, 62072, 61358, 60186, 59300, 59008, 59230, 59854, 60795, 61859, 62796, 63420, 63583, 63116, 61986, 60526, 59393, 59130, 59711, 60558, 61067, 61088, 60854, 60571, 60258, 59897, 59457, 58818, 57932, 57088, 56644, 56507, 56270, 55971, 56179, 57052, 57832, 57775, 57145, 56808, 57141, 57913, 58981, 60418, 61994, 63168, 63692, 63761, 63515, 62909, 62131, 61654, 61603, 61478, 60728, 59359, 57814, 56524, 55775, 55720, 56247, 56919, 57258, 57095, 56656, 56307, 56219, 56192, 55862, 55184, 54553, 54313, 54317, 54152, 53613, 52697, 51369, 49725, 48273, 47603, 47776, 48334, 48820, 48921, 48214, 46416, 44002, 42100, 41494, 42016, 43017, 44107, 45233, 46351, 47275, 47721, 47401, 46303, 44978, 44276, 44604, 45596, 46587, 47262, 47740, 48230, 48785, 49343, 49959, 50907, 52403, 54064, 54958, 54531, 53288, 52171, 51456, 50694, 49594, 48352, 47141, 45965, 45123, 45172, 46132, 47280, 47995, 48289, 48224, 47433, 45746, 43839, 42659, 42452, 42813, 43438, 44258, 45005, 45238, 44875]
54118D4875n83m48k31J6L51O20N59J83j96k43J45P29J044Q50M78M78Q59R86L82
54099E0854o26j225r52m4Q92J388J342R23L36k09m80l54n0J0k98o27o36l45M6
54080D9945M12N65L00j20O3J059J926J608M06m04k35K46L37K27L74O86P40M83
54062E8618K61L23O27R56J066Q84N87L77J87n5pP59J983K800K761K256J771J273
54044G7427O98M63R38J746K197K187K149K321K624L090L833M522M513L738K910
54029A15356K651K772K712K338J929J581J147O36K41j9l55p77j011q90n50j17
54013A27644L54N28j79j753l214l601l115k743k912l096k774k105j529j264j285
53998I8956j404j242o24p0l30j315k134k329k324k391k037r52J66N09L01K66M05
$$ y = [44875, 44292, 43844, 43613, 43629, 43980, 44600, 45159, 45342, 45146, 44903, 45048, 45777, 46821, 47671, 48149, 48627, 49486, 50472, 50854, 50228, 49003, 48051, 48007, 48899, 50287, 51629, 52552, 52888, 52679, 52199, 51845, 51795, 51805, 51507, 50880, 50244, 49899, 49945, 50357, 50922, 51222, 51102, 51165, 52224, 54150, 55758, 56164, 55760, 55525, 55771, 56108, 56335, 56709, 57395, 58135, 58618, 58879, 59202, 59829, 60785, 61851, 62735, 63322, 63699, 63886, 63831, 63824, 64583, 66566, 69366, 72127, 74383, 76154, 77427, 78125, 78588, 79526, 81272, 83469, 85656, 87805, 90126, 92750, 95840, 99673, 104195, 108708, 112446, 115356, 118007, 120779, 123491, 125829, 127758, 129339, 130486, 131122, 131363, 131344, 130989, 130212, 129201, 128311, 127761, 127644, 127998, 128526, 128347, 126594, 123380, 119779, 116664, 113921, 111009, 107913, 105139, 103034, 101505, 100241, 98956, 97552, 96310, 95686, 95616, 95286, 93971, 91837, 89508, 87184, 84793, 82756, 81804, 81970, 82479, 82780, 83046, 83451]
53981H3451J11o58j239j129m97J42K49m22j369j527m74R01J523J434J267J023
53965H2786L89r6M38J606J968R99k07n53j06N96J383K059K170J729J488J903K512
53948A01064K801K970L322L672L941M598N721O333N598M247L821M652N513N220
53934A63473L861K357J369Q26K32p39j761k091j454m89j7q8p7M54J322K054K362
53917A71594K365K473K937L458L506L108K860L020L070K538J757J354J374J357
53903B06771J009L21o55j625k023j662j257j634k589l110k716k024j909k586l573
53888A80738m235m250l823l438l384l526l671l858m075m008l455k700k122j753
53874A32440j525j630k144k624k622k326k195k219k229k529l435m341m223l048
$$ y = [83451, 83562, 82904, 81665, 80536, 80039, 80181, 80430, 80008, 78639, 77112, 76638, 77539, 79062, 80496, 81763, 82786, 83175, 83079, 83517, 85123, 87091, 88090, 87883, 87330, 87224, 87820, 89203, 91262, 93432, 95161, 96649, 98552, 101064, 103865, 106835, 110157, 113829, 117770, 122368, 128089, 134422, 140020, 144267, 148088, 152740, 158253, 163473, 167334, 169691, 171060, 171886, 172118, 171379, 169618, 167527, 166073, 165584, 165567, 165479, 165402, 165856, 167178, 169232, 171594, 173959, 176432, 179369, 182827, 186333, 189441, 192301, 195321, 198391, 200929, 202686, 204040, 205414, 206771, 207780, 208101, 207446, 205821, 203798, 202136, 200879, 199245, 196656, 193546, 190830, 188806, 186897, 184311, 180738, 176503, 172253, 168430, 164992, 161608, 158082, 154411, 150553, 146478, 142470, 139015, 136315, 134193, 132440, 130915, 129285, 127141, 124517, 121895, 119569, 117374, 115155, 112926, 110397, 106962, 102621, 98398, 95350]
53860I5350j900j477j362r93n76o28j180j849k238k020j126r3K34l18r82j047
53844G7795n85j8N05R31J035P52L79J17j87n06l68L61R55O91j46p11o86l84l5
53825G9895L59O70P53Q18J114J392J206O49K59K75N08P78R58Q06L67K98J039J876
53807I4020J773J001Q57J673K333K161J991K675L606L812L602L870M317L744J949
53792A33384J80m96k24L68R79J449J504J177Q64O97L58k56p22q17r63j555k324
53775A33603k785k987l311l778l973l564k596j483q56j179k160k888k815k323
53761I6905k025j869j460q68n94p70j028j116j182j321j343j060n25Q9N59N59
53745H2951n4q64j206j009r36j466k120k020j024M9L89M9k75j23L60Q35J238J617
$$ y = [95350, 93450, 91973, 90611, 89618, 89042, 88414, 87234, 85385, 83147, 81127, 80001, 79908, 80142, 79824, 78842, 77795, 77210, 77192, 77697, 78628, 79663, 80415, 80794, 80911, 80724, 80218, 79850, 80211, 81166, 81857, 81711, 81000, 80314, 79930, 79895, 80254, 80924, 81677, 82495, 83609, 85001, 86207, 86856, 87115, 87390, 87898, 88676, 89634, 90440, 90807, 91105, 92144, 94020, 95793, 96794, 97651, 99324, 101657, 103818, 105809, 108484, 112090, 115902, 119504, 123374, 127691, 131435, 133384, 133564, 133068, 132844, 133212, 134191, 135640, 137144, 138321, 139185, 139882, 140240, 139984, 139262, 138445, 137482, 135927, 133603, 130818, 127831, 124520, 120742, 116769, 113205, 110609, 109126, 108270, 107091, 104931, 102043, 99228, 96905, 94880, 93011, 91551, 90683, 90089, 89319, 88291, 87175, 85993, 84672, 83329, 82269, 81744, 81833, 82392, 82951, 82897, 82033, 80827, 79818, 78882, 77416, 75296, 73276, 72252, 72301, 72690, 72739, 72464, 72341, 72701, 73536, 74774, 76391]
53727G6391J800J579J132Q53P62M47k64r33j069p33l75l84q93j694k130j540j47
53710G2802R02R02N36Q89J859K344J857J125R68J238J223O45q0l19J62R88J540
53693H9581J640J716K020K055J221j29r28n91N01J697K619L018K702J810P78j35
53677A09575q07q64O7J561K526K354J497P09K84J81L39N85O61N99O43O79L40k52
53659A20677n05l53m61j085j485j038j91K68K91J92j70r77j585j087L87J670J920
53642A16468J352O71L16L18M23K62k75q55j067q43l45L19R10R99M78j62m50m38
53624A18081j84P11K295L471L040J409K60M19R96Q76K16o4L36R02J074Q15M70
53607A35123M64R95J873K637K908K565J744Q89O20J149J872J976J498J308J887
$$ y = [76391, 78191, 79770, 80902, 81755, 82517, 82964, 82700, 81767, 80698, 79965, 79590, 79206, 78313, 76619, 74489, 72949, 72802, 73704, 74606, 75142, 76031, 77890, 80234, 82091, 83216, 84184, 85422, 86645, 87290, 87210, 86891, 87053, 88041, 89581, 91221, 92937, 94957, 97012, 98233, 98104, 97176, 96585, 97086, 98783, 101402, 104420, 107122, 108932, 109710, 109575, 108768, 107904, 107971, 109532, 112058, 114412, 115909, 116618, 116902, 117083, 117422, 118007, 118668, 119267, 119910, 120589, 120929, 120677, 120172, 119819, 119358, 118273, 116788, 115750, 115559, 115827, 116118, 116310, 116140, 115163, 113578, 112491, 112878, 114548, 116468, 117820, 118491, 118807, 119125, 119548, 119810, 119535, 118680, 117613, 116770, 116425, 116744, 117654, 118653, 119131, 118969, 118519, 118081, 117897, 118608, 120903, 124374, 127414, 128823, 129083, 129502, 130498, 131374, 131590, 131526, 131862, 132764, 133838, 134653, 135123, 135587, 136582, 138455, 141092, 144000, 146565, 148309, 149198, 149818, 150967, 152839, 154815, 156313, 157621, 159508]
53592A59508K641K718K165J840K252K936L031K358J580J338J428J208O65N27J084
53577A87279J573J202L16r2J86M14P0n60r97j157j154j059j021j150j198q32k30
53560A81590J25K98Q19J582J668P05l79n74j87k62r68j443j132m85k24m69p99
53543A79865p89k81N57J289J476J123O73N34O86Q31Q54R27J180J415J262P24L42
53526A92668O84J672K639L027K828K382K053K132K734L605M274M620N000N621
53512B35939O120O131N979O321P105P509P072O470O761Q146R755J0659J0723J0505
53498C45195J0574J1060J1748J2347J2693J2773J2609J2213J1719J1540J2052
53487D76523J3027J3670J3469J2890J2842J3513J4207J4280J3882J3539J3500
$$ y = [159508, 162149, 164867, 167032, 168872, 171124, 174060, 177091, 179449, 181029, 182367, 183795, 185003, 185668, 186195, 187279, 188852, 190054, 190370, 190278, 190464, 190878, 190948, 190388, 189391, 188234, 187080, 186021, 185000, 183850, 182652, 181820, 181590, 181715, 182013, 182832, 184414, 186082, 186787, 186408, 185834, 185647, 185385, 184417, 182974, 181842, 181357, 181133, 180664, 179865, 179076, 178795, 179352, 180641, 182117, 183240, 183913, 184447, 185133, 185964, 186818, 187745, 188925, 190340, 191602, 192326, 192668, 193352, 195024, 197663, 200690, 203518, 205900, 207953, 210085, 212819, 216424, 220698, 225318, 230318, 235939, 242059, 248190, 254169, 260490, 267595, 275104, 282176, 288646, 295407, 303553, 313308, 323967, 334690, 345195, 355769, 366829, 378577, 390924, 403617, 416390, 428999, 441212, 452931, 464471, 476523, 489550, 503220, 516689, 529579, 542421, 555934, 570141, 584421, 598303, 611842, 625342]
53476F25342J3670J3877J3891J3501J2858J2394J2210J1850J1064J0383J0439
53465G61479J0990J1259J1008J0660J0473J0210R660Q812P495N502L256J697J186
53452H63687R94K29j173k661l865m802n600o406p308q142q501q233p752p627p995
53437G84845q549q943r082r157r508j0209j0791j0734j0234j0066j0492j0830
53425F66250j0358r240q086p102o129n233m623m161l496k554j492k85J103K268
53411F06862K695K530K500K943L491L877M484N687P093Q007Q401Q931R969J1122
53397F88592J1873J2349J3099J4231J5169J5451J5430J5910J7222J8958K0647
53386H58931K2243K3830K5196K6074K6637K7377K8482K9620L0335L0508L0409
$$ y = [625342, 639012, 652889, 666780, 680281, 693139, 705533, 717743, 729593, 740657, 751040, 761479, 772469, 783728, 794736, 805396, 815869, 826079, 835739, 844551, 852046, 857548, 860804, 862501, 863687, 864681, 864910, 863737, 861076, 857211, 852409, 846809, 840403, 833095, 824953, 816452, 808219, 800467, 792840, 784845, 776296, 767353, 758271, 749114, 739606, 729397, 718606, 707872, 697638, 687572, 677080, 666250, 655892, 646652, 638566, 631464, 625335, 620102, 615479, 611318, 607822, 605268, 603776, 603491, 604594, 606862, 609557, 612087, 614587, 617530, 621021, 624898, 629382, 635069, 642162, 650169, 658570, 667501, 677470, 688592, 700465, 712814, 725913, 740144, 755313, 770764, 786194, 802104, 819326, 838284, 858931, 881174, 905004, 930200, 956274, 982911, 1010288, 1038770, 1068390, 1098725, 1129233, 1159642]
53375A159642L0345L0329L0040K9222K8138K7388K7205K7081K6388K5151K3882
53364A464811K2839K1833K0744J9744J8858J7666J5696J2976J0016P303M931K589
53352A640006j92l624p459j1230j4680j7817k0573k2701k4051k4769k5056k5049
53340A442805k5036k5468k6442k7291k7120k5739k3897k2549k2039k1990k1790
53329A173444k1261k0855k1216k2365k3528k3916k3543k2907k2096k0755j8985
53318I32017j7578j6979j6485j5049j2682j0484r323q994q836q666q778r268r750
53305G79145r762r275q718q533q706q738q094o687m931l420k595k515k776k724
53291F91671k036j025k28K90R89K205L765N223O342P193P990Q875R739J0299J0481
$$ y = [1159642, 1189987, 1220316, 1250356, 1279578, 1307716, 1335104, 1362309, 1389390, 1415778, 1440929, 1464811, 1487650, 1509483, 1530227, 1549971, 1568829, 1586495, 1602191, 1615167, 1625183, 1632486, 1637417, 1640006, 1639814, 1636190, 1628731, 1617501, 1602821, 1585004, 1564431, 1541730, 1517679, 1492910, 1467854, 1442805, 1417769, 1392301, 1365859, 1338568, 1311448, 1285709, 1261812, 1239263, 1217224, 1195234, 1173444, 1152183, 1131328, 1110112, 1087747, 1064219, 1040303, 1016760, 993853, 971757, 951002, 932017, 914439, 897460, 880975, 865926, 853244, 842760, 833437, 824443, 815607, 806941, 798163, 788895, 779145, 769383, 760108, 751390, 742857, 734151, 725413, 717319, 710632, 705701, 702281, 699686, 697171, 694395, 691671, 689635, 688610, 688382, 688672, 689661, 691866, 695631, 700854, 707196, 714389, 722379, 731254, 740993, 751292, 761773]
53276G61773J0646J1185J1950J2370J2154J1518J0791J0200R959J0145J0285R685
53264H92661Q353P184O823O798O115M476K501R64N8p07k059m186o409p891q695
53249I05986r625j0979j2193j2921j3678j4828j5758j5876j5703j6116j6850j6864
53237G34595j5871j4598j3559j2638j1798j1335j1248j1209j1269j1804j2615
53226E96651j3016j2906j3001j3591j3995j3621j2822j2147j1374j0001q207o753
53214D55217o105o121o374o456o151n625n273n266n476n880o610p522q193q468
53200C65697q587q577q179p570p440q019q525q146p081o129n635n358n048m694
53186B66709m428m485m981n551n591n190n193n994o829o838o224n694n273m513
$$ y = [761773, 772419, 783604, 795554, 807924, 820078, 831596, 842387, 852587, 862546, 872691, 882976, 892661, 901014, 908198, 915021, 921819, 927934, 932410, 934911, 935875, 935933, 935226, 933167, 928981, 922572, 914681, 905986, 896361, 885382, 873189, 860268, 846590, 831762, 816004, 800128, 784425, 768309, 751459, 734595, 718724, 704126, 690567, 677929, 666131, 654796, 643548, 632339, 621070, 609266, 596651, 583635, 570729, 557728, 544137, 530142, 516521, 503699, 491552, 480178, 470177, 461970, 455217, 449112, 442991, 436617, 430161, 424010, 418385, 413112, 407846, 402370, 396490, 389880, 382358, 374165, 365697, 357110, 348533, 340354, 332784, 325344, 317325, 308800, 300654, 293573, 287444, 281809, 276451, 271403, 266709, 262281, 257796, 252815, 247264, 241673, 236483, 231290, 225296, 218467, 211629, 205405, 199711, 194438, 189925]
53172A89925l557l080l284l686l879l806l390k561j667j225j212j196j125j328
53158A54929j719j721j214q68j217j892k167j818j185o67m70n97p87o81l05j79
53142A37442o82j416j550p39M18R26L30q95j842k035j786j654j729j575r00k2
53126A22291M47K97m0l0K63K00o14j714k236j885j145n48j69P1M0l42p29o38J8
53107A13537Q66J429J458J030M91J23j91p67j499j808j389o52j80q5j40k39l65
53090A11619l94l30m61r31j368j256n79K53Q21Q26J10r82j559r76L58J372J425
53073A07948P49k7l55J1Q93J752K158K114J827J413J017Q08P21N37M59J049K192
53056A25266K805K177J012M55N94P29O27M73Kj198k559k901j969p02J39O30Q69
$$ y = [189925, 186368, 183288, 180004, 176318, 172439, 168633, 165243, 162682, 161015, 159790, 158578, 157382, 156257, 154929, 153210, 151489, 150275, 149407, 148190, 146298, 144131, 142313, 141128, 140461, 139991, 139394, 138607, 137926, 137621, 137442, 136760, 135344, 133794, 133055, 133473, 134399, 134729, 133834, 131992, 129957, 128171, 126517, 124788, 123213, 122313, 122291, 122738, 123035, 122995, 122965, 123228, 123428, 122814, 121100, 118864, 116979, 115834, 115286, 115117, 115188, 115228, 114886, 114157, 113519, 113537, 114403, 115832, 117290, 118320, 118811, 118934, 118743, 117976, 116477, 114669, 113280, 112628, 112448, 112363, 112223, 111984, 111619, 111225, 110895, 110434, 109503, 108135, 106879, 106300, 106553, 107374, 108200, 108310, 107328, 105769, 104793, 105151, 106523, 107948, 108697, 108670, 108315, 108326, 109219, 110971, 113129, 115243, 117070, 118483, 119500, 120308, 121029, 121566, 122025, 123074, 125266, 128071, 130248, 131260, 131715, 132309, 133038, 133665, 134138, 134140, 132942, 130383, 127482, 125513, 124811, 124950, 125580, 126449]
53039A26449O68K64L16P63O39l69j188q05K74Q23N27M1k11l68n54o34o01n96n49
53020A24889k15M56J175J588J521J083O51N52O66N78K36Q5M18R00J008O83K30
53003A36504o8l9L89R49J098O60J65K26P78J231J265J072R34Q56O60K68j23j43
52985A46682L19Q09P43J97n2M72J294J564J156O97O97R33Q65L45k29m34l12k16
52967A55530k43n2N99J432K000K242K317K113J397L88l19m44k44j8K20M59O23
52950A68000P60R12Q17K08n71q43n48k98l72l46K9L74M05M82Q41R54K85p55j230
52931A69104q24p5L49K12k53n03j46N34Q45O58N95R35J022K85o88q63j10Q56J535
52912A73468J917K017J907J925K152J934P03q33j326n78J73m9q21j219j067q77
$$ y = [126449, 127117, 127381, 127697, 128460, 129099, 128730, 127542, 126737, 127011, 127834, 128361, 128402, 128191, 127823, 127269, 126635, 126034, 125438, 124889, 124674, 125130, 126305, 127893, 129414, 130497, 131148, 131700, 132366, 132944, 133180, 133265, 133683, 134583, 135591, 136274, 136504, 136436, 136397, 136786, 137735, 138833, 139493, 139658, 139884, 140662, 141893, 143158, 144230, 145164, 146020, 146680, 146948, 146825, 146682, 147001, 147810, 148553, 148750, 148698, 149170, 150464, 152028, 153184, 153881, 154578, 155511, 156376, 156721, 156492, 156058, 155746, 155530, 155287, 155235, 155834, 157266, 159266, 161508, 163825, 165938, 167335, 167723, 167404, 166960, 166716, 166698, 166918, 167377, 168000, 168760, 169672, 170489, 170697, 170126, 169283, 168735, 168437, 168065, 167719, 167748, 168122, 168527, 169009, 169850, 170804, 171089, 170334, 169104, 168280, 168205, 168554, 168766, 168513, 168010, 167864, 168398, 169243, 169901, 170496, 171431, 172453, 172738, 172050, 171187, 171077, 171933, 173468, 175385, 177402, 179309, 181234, 183386, 185320, 186023, 185190, 183864, 183286, 183459, 183410, 182589, 181370, 180303, 179426]
52896A79426j034j520k097k455k417k236k403k947l272k858j869q51j48J97K64
52881A53780K18K52L71L46M6l80o56n84m2Q74J608J418J69j346k137j960j378
52864A50599j001r84j153j359j503j475j210q99r31j497k249k547k093j212m64
52849A30022j88m56j128j772j845j343r53j179j533j203l05J63l02j041j253j045
52833A14639j040j383j654j610j370j008m32J88L77l2n02l61M02J132J236O82
52817A09264j99j035j466j220m46K27L51K33N21J260J816J779J466J355J448J508
52801A16862J520J572J547J312J008P78N23K64M28J227K054K197J937K173K910
52786A38312L053J993N78l0J31J52k94o53m63j2J21k61r13j454j608j403j190
$$ y = [179426, 178392, 176872, 174775, 172320, 169903, 167667, 165264, 162317, 159045, 156187, 154318, 153467, 153319, 153516, 153780, 153998, 154250, 154621, 154967, 155013, 154633, 153977, 153393, 153351, 154225, 155833, 157251, 157420, 156074, 153937, 151977, 150599, 149598, 148614, 147461, 146102, 144599, 143124, 141914, 141015, 140084, 138587, 136338, 133791, 131698, 130486, 130022, 129834, 129378, 128250, 126478, 124633, 123290, 122337, 121158, 119625, 118422, 118117, 118280, 117978, 116937, 115684, 114639, 113599, 112216, 110562, 108952, 107582, 106574, 106142, 106330, 106707, 106675, 106173, 105812, 106214, 107346, 108582, 109264, 109065, 108030, 106564, 105344, 104898, 105125, 105476, 105709, 106230, 107490, 109306, 111085, 112551, 113906, 115354, 116862, 118382, 119954, 121501, 122813, 123821, 124599, 125122, 125386, 125814, 127041, 129095, 131292, 133229, 135402, 138312, 141365, 143358, 143936, 143906, 144037, 144189, 143895, 143242, 142779, 142767, 142888, 142627, 141714, 140260, 138652, 137249, 136059]
52769A36059j245j362j053k06P31J258J241P53j23j168j932k133j992j916j962
52754A24950j813j309o31JN45R73J154J025P32M76L26K37J13j49n49q67q86o47
52736A23681l67k6M85Q78O38j48o55l35M38J194K151L523M538M155K595J259J040
52719A45044J588K286K974L437L124J904N38j77k55j40rO2j88p91j313j441j411
52702A55232j408j057j62O53P25M01M54Q09Q07N29Q41J944K861K693J759J023
52686A68104R38J186J263Q88Q8q39j525j815j818j726j701j881k209k375k126
52671A54452j640j331j351j578j881k111j979j379p60p11j189j612j664j564j534
52656A32168j483j312j038n35M12J626K521K770K662K607K614K409J805Q25k28
$$ y = [136059, 134814, 133452, 132399, 132193, 132924, 134182, 135423, 136176, 136053, 134885, 132953, 130820, 128828, 126912, 124950, 123137, 121828, 121197, 121198, 121743, 122716, 123870, 124895, 125627, 126103, 126429, 126666, 126779, 126630, 126081, 125214, 124328, 123681, 123314, 123288, 123773, 124651, 125289, 125141, 124486, 124151, 124589, 125783, 127934, 131457, 135995, 140150, 142745, 144004, 145044, 146632, 148918, 151892, 155329, 158453, 160357, 160895, 160718, 160463, 160323, 160314, 160376, 160188, 159397, 158084, 156643, 155232, 153824, 152767, 152605, 153258, 153983, 154384, 154838, 155647, 156454, 156983, 157824, 159768, 162629, 165322, 167081, 168104, 169042, 170228, 171491, 172379, 172467, 171628, 170103, 168288, 166470, 164744, 163043, 161162, 158953, 156578, 154452, 152812, 151481, 150130, 148552, 146671, 144560, 142581, 141202, 140442, 139731, 138542, 136930, 135266, 133702, 132168, 130685, 129373, 128335, 127800, 128212, 129838, 132359, 135129, 137791, 140398, 143012, 145421, 147226, 148051, 147823]
52641A47823p71l90O57J615K073K195K151J824J222P01M47K23r6k18l0l1o75j592
52623A57128k103k171k258k430k272j682j096q07o34n25q32j636k204j762n18
52608A34198N51R08Q59Q22P00K71k72n27m12j32J56L60L36Q2q9Kl0n79j239j185
52588A34780m12J13k47r74j244j022q04p47o57n15m52l63p7K41K68ml56p11j049
52569A25768j130p21k7N04N97J79o52j369j228k47M56j3j070j491j101p09o12
52552A17134l10K90N33J39k95l01k34n24r51j109r98p59m38k62n95j236j451j025
52534A07608o33p15p60k91J97ro20p23p7P27J183J232R30M02N8K67P63Q41K31
52515A10611o18j143j180r18n94l37j20J40L42K31k51q02j102j136j041q98q26
$$ y = [147823, 147052, 146662, 147319, 148934, 151007, 153202, 155353, 157177, 158399, 159100, 159547, 159770, 159674, 159456, 159426, 159395, 158720, 157128, 155025, 152854, 150596, 148166, 145894, 144212, 143116, 142309, 141675, 141150, 140318, 138682, 136478, 134716, 134198, 134749, 135657, 136516, 137338, 138038, 138309, 138037, 137510, 137098, 136966, 137122, 137482, 137818, 137900, 137811, 137813, 137783, 137204, 135965, 134780, 134368, 134481, 134234, 133260, 132016, 130994, 130190, 129443, 128786, 128271, 127819, 127456, 127379, 127620, 127888, 127884, 127528, 126817, 125768, 124638, 123917, 123890, 124394, 124991, 125170, 124518, 123149, 121921, 121674, 122130, 122117, 121047, 119556, 118455, 117746, 117134, 116824, 117114, 117647, 117786, 117491, 117190, 116956, 116432, 115481, 114372, 113374, 112615, 112177, 111915, 111320, 110084, 108633, 107608, 106975, 106260, 105500, 105209, 105406, 105397, 104777, 104054, 103977, 104704, 105887, 107119, 108049, 108451, 108509, 108776, 109539, 110380, 110611, 109993, 108850, 107670, 106752, 106158, 105821, 105701, 105841, 106183, 106414, 106163, 105361, 104259, 103123, 102082, 101184, 100358]
52498A00358r88j250j146m57M16R61J118J114R35M27k77p44o72j17N84R73P77
52481A02012J56m36p58r02q82n44ML31L30M79J075J621J411N33k30l10J16L86
52463A04392o1j187k207k202j079K95J086J230J081P68K46l88r53j284j132m36
52447I8169K19O4o43p00L39J405J429Q09M51K13n21j348j188N3J388K193K652
52430A04984K776K155R25l6k16j1Nk90p86j208r72K24J528J666O85k1K83P87O22
52411A13100J87J99M16J98k77l34M9K54j2m58p62p69m04J30K69k12p09m85L22
52392A10702R48J051Q93O57K61j37j28L39Q01R69J073J311J374Q74L1m89l62K7
52374A20195J96K56P16J598K138J702O71m6j58q9K8O52J823K639K323J268M81
$$ y = [100358, 99370, 98120, 96974, 96517, 96933, 97894, 99012, 100126, 101061, 101488, 101211, 100467, 99795, 99678, 100262, 101235, 102012, 102168, 101732, 100974, 100072, 99190, 98646, 98650, 98981, 99311, 99790, 100865, 102486, 103897, 104430, 104200, 103890, 104006, 104392, 104331, 103144, 100937, 98735, 97656, 97951, 99037, 100267, 101348, 102116, 102362, 101974, 101021, 99737, 98605, 98169, 98388, 98452, 97809, 97109, 97448, 98853, 100282, 101091, 101542, 101755, 101234, 99886, 98698, 98751, 100139, 102332, 104984, 107760, 109915, 110840, 110804, 110588, 110577, 110582, 110292, 109506, 108298, 107326, 107550, 109078, 110744, 111429, 111408, 111691, 112478, 113100, 113287, 113486, 113902, 114100, 113823, 113489, 113538, 113792, 113780, 113322, 112560, 111791, 111387, 111517, 111786, 111574, 110865, 110380, 110702, 111650, 112701, 113594, 114251, 114512, 114375, 114247, 114586, 115387, 116356, 117429, 118740, 120114, 120988, 121019, 120530, 120168, 120195, 120391, 120647, 121363, 122961, 125099, 126801, 127472, 127426, 127268, 127179, 127207, 127859, 129682, 132321, 134644, 135912, 136393]
52357A36393K74K45J82L08O72J001J174J245J073N44J72P28K044K893K425J155
52341A52528J15l25l45M3Q33J487J435J028J219K133K755K328J426J170J795K628
52325A72253L119L352L507L489L266L178L602M455N232N447N063M568M661N605
52311B30797O848P484P195O535O178O174O090N735N457N792O904Q312R212R202
52297C27915Q739Q658R192R832J0150J0280J0349J0036R225Q623Q975R888J0250
52284D52112R735R097Q868Q688Q234P975Q340Q766Q349P147O097N695N502M991
52270E59596M336M051M224M407M123L335K407J754J457J306J174J194J390J407
52256E96161R13J81j36J88P20J065J416K196L396M532N139N169M984N104N805
$$ y = [136393, 136667, 136912, 137094, 137402, 138074, 139075, 140249, 141494, 142567, 143111, 143283, 144011, 146055, 148948, 151373, 152528, 152643, 152318, 151973, 152016, 152849, 154336, 155771, 156799, 158018, 160151, 162906, 165234, 166660, 167830, 169625, 172253, 175372, 178724, 182231, 185720, 188986, 192164, 195766, 200221, 205453, 210900, 215963, 220531, 225192, 230797, 237645, 245129, 252324, 258859, 265037, 271211, 277301, 283036, 288493, 294285, 301189, 309501, 318713, 327915, 336654, 345312, 354504, 364336, 374486, 384766, 395115, 405151, 414376, 422999, 431974, 441862, 452112, 461847, 470944, 479812, 488500, 496734, 504709, 513049, 521815, 530164, 537311, 543408, 549103, 554605, 559596, 563932, 567983, 572207, 576614, 580737, 584072, 586479, 588233, 589690, 590996, 592170, 593364, 594754, 596161, 597074, 597255, 597119, 597307, 598027, 599092, 600508, 602704, 606100, 610632, 615771, 620940, 625924, 631028, 636833]
52241F36833O819P601Q001Q448R220R865R764R102Q714Q967R317R159Q590P990
52227G58390P320O323N198M502M466M745M873M598L827K658J515R30J010J309
52213H11664J291P54k21j416k542l441m283n305o375p065p218p068o715o014n110
52198G50936m615m872n366n294m522l578k886k398j977j685j626j736j847j882
52184G06652j965k247k641k745k296j606j323j661k228k683l142l766m330m499
52170F69520m241l747l193k804k758k813k452j671j209j617k536l315l786l976
52156F29402l569k443j320j070j563j990k131k463l070l320k876k195j863j950
52142E97579k214k424k391k133k036k328k567k239j772k029k849l089k374j704
$$ y = [636833, 643652, 651253, 659254, 667702, 676922, 686787, 696551, 705653, 714367, 723334, 732651, 741810, 750400, 758390, 765710, 772033, 777231, 781733, 786199, 790944, 795817, 800415, 804242, 806900, 808415, 809345, 810355, 811664, 812955, 813709, 813488, 812072, 809530, 806089, 801806, 796501, 790126, 783061, 775843, 768775, 762060, 756046, 750936, 746321, 741449, 736083, 730789, 726267, 722689, 719803, 717405, 715428, 713743, 712117, 710381, 708534, 706652, 704687, 702440, 699799, 697054, 694758, 693152, 691829, 690168, 687940, 685257, 682115, 678349, 674019, 669520, 665279, 661532, 658339, 655535, 652777, 649964, 647512, 645841, 644632, 643015, 640479, 637164, 633378, 629402, 625833, 623390, 622070, 621000, 619437, 617447, 615316, 612853, 609783, 606463, 603587, 601392, 599529, 597579, 595365, 592941, 590550, 588417, 586381, 584053, 581486, 579247, 577475, 575446, 572597, 569508, 567134, 565430]
52128E65430j906k460k574k468k732l028k504j194p3K29M0l2K82R88J974K918
52112E52890L437L527L634M201N181O011O080N468N121N958P756R419J0374J1111
52098F40168J2032J2592J2242J1582J1731J2816J3906J4342J4303J4120J3846
52087G83680J3586J3555J3528J2899J1562J0210R407Q846Q035P151O672O378N466
$$ y = [565430, 563524, 561064, 558490, 556022, 553290, 550262, 547758, 546564, 546491, 546720, 546760, 546728, 547010, 547998, 549972, 552890, 556327, 559854, 563488, 567689, 572870, 578881, 584961, 590429, 595550, 601508, 609264, 618683, 629057, 640168, 652200, 664792, 677034, 688616, 700347, 713163, 727069, 741411, 755714, 769834, 783680, 797266, 810821, 824349, 837248, 848810, 859020, 868427, 877273, 885308, 892459, 899131, 905509, 910975]
$$ [...]
##END NTUPLES=NMR SPECTRUM
##END=
