##TITLE=NES1001_50250289_9225092_mVNcrKuYP1
##JCAMPDX= 6.0         $$ Bruker NMR JCAMP-DX V2.0
##DATA TYPE= NMR SPECTRUM
##DATA CLASS= NTUPLES
##ORIGIN= BRUKER
##OWNER= Administrator
$$ 1.72 TOPSPIN		Version 2.1
$$ 2015-06-17 14:22:38.691 -0700  Administrator@X
$$ Compression mode = diff/dup
##.OBSERVE FREQUENCY= 400.02188249412
##.OBSERVE NUCLEUS= ^1H
##.ACQUISITION MODE= SIMULTANEOUS (DQD)
##.ACQUISITION SCHEME= undefined
##.AVERAGES= 8
##.DIGITISER RES= 22
##SPECTROMETER/DATA SYSTEM= spect
##.PULSE SEQUENCE= zg30
##.SOLVENT NAME= COFFEE_meoh
##.SHIFT REFERENCE= INTERNAL, COFFEE_meoh, 1, 14.98509
##AUDIT TRAIL= $$ (NUMBER, WHEN, WHO, WHERE, PROCESS, VERSION, WHAT)
$$ ##TITLE= Audit trail, TOPSPIN		Version 2.1
$$ ##JCAMPDX= 5.01
$$ ##ORIGIN= Bruker BioSpin GmbH
$$ ##OWNER= Administrator
$$ $$ E:\/data/COFFEE/nmr/NES1001_50250289_9225092_mVNcrKuYP1/10/pdata/1/auditp.txt
$$ ##AUDIT TRAIL=  $$ (NUMBER, WHEN, WHO, WHERE, PROCESS, VERSION, WHAT)
(   1,<2015-06-17 14:22:31.237 -0700>,<Administrator>,<X>,<go>,<TOPSPIN 2.1>,
      <created by zg
	started at 2015-06-17 14:21:25.378 -0700,
	POWCHK enabled, PULCHK disabled,
       configuration hash MD5:
       21 0F 79 D6 B3 7B B4 F6 88 20 88 DB 03 48 BD 9F
       data hash MD5: 64K
       45 B1 8D 51 BC E6 DA 1E 82 77 90 4F 19 11 6C C0>)
(   2,<2015-06-17 14:22:34.597 -0700>,<Administrator>,<X>,<proc1d>,<TOPSPIN 2.1>,
      <Start of raw data processing
       efp LB = 0 FT_mod = 6 PKNL = 1 PHC0 = 0 PHC1 = 0 SI = 32K 
       data hash MD5: 32K
       18 BD E5 52 10 5A 9A 8A C2 29 B2 35 C2 C6 E5 71>)
(   3,<2015-06-17 14:22:34.862 -0700>,<Administrator>,<X>,<proc1d>,<TOPSPIN 2.1>,
      <pk PHC0 = 92.08191 PHC1 = 0 
       data hash MD5: 32K
       AA 06 6B AF 29 47 7B B8 8A 6B 5D 58 D5 1A DA 11>)
(   4,<2015-06-17 14:22:34.972 -0700>,<Administrator>,<X>,<proc1d>,<TOPSPIN 2.1>,
      <abs ABSG = 1 
       data hash MD5: 32K
       BD 5B 8D BD 65 29 88 D6 23 9C F9 D4 C6 9D A5 98>)
(   5,<2015-06-17 14:22:35.034 -0700>,<Administrator>,<X>,<proc1d>,<TOPSPIN 2.1>,
      <abs ABSG = 2 
       data hash MD5: 32K
       B3 76 D5 26 B9 E2 9C B1 DF 96 ED 4A 1B 99 A2 21>)
(   6,<2015-06-17 14:22:35.097 -0700>,<Administrator>,<X>,<proc1d>,<TOPSPIN 2.1>,
      <abs ABSG = 3 
       data hash MD5: 32K
       79 EF AC 38 E6 DC C9 33 F0 85 34 9F 77 47 83 5C>)
(   7,<2015-06-17 14:22:35.159 -0700>,<Administrator>,<X>,<proc1d>,<TOPSPIN 2.1>,
      <abs ABSG = 4 
       data hash MD5: 32K
       BC B0 58 05 38 98 80 D8 73 82 65 41 C0 73 84 17>)
(   8,<2015-06-17 14:22:35.456 -0700>,<Administrator>,<X>,<proc1d>,<TOPSPIN 2.1>,
      <abs ABSG = 5 
       data hash MD5: 32K
       C3 C3 F2 A0 23 C9 9A 08 62 65 12 7A EA 15 51 A5>)
$$ ##END=
$$ 
$$ $$ hash MD5
$$ $$ 21 8F 6C 7A DC 1F 02 2A D2 65 2F 43 FB 73 5C 1C
##$RELAX= 
##$RELAX= 
##$RELAX= 
##$RELAX= 
##$RELAX= 
##$RELAX= 
##$RELAX= 
$$ Bruker specific parameters
$$ --------------------------
##$DU= <E:\>
##$EXPNO= 10
##$NAME= <NES1001_50250289_9225092_mVNcrKuYP1>
$$ [...]
150 150 150 150 150 150 150 150
##$TP07= 0
##$TPNAME0= <>
##$TPNAME1= <>
##$TPNAME2= <>
##$TPNAME3= <>
##$TPNAME4= <>
##$TPNAME5= <>
##$TPNAME6= <>
##$TPNAME7= <>
##$TPOAL= (0..7)
0.5 0.5 0.5 0.5 0.5 0.5 0.5 0.5
##$TPOFFS= (0..7)
0 0 0 0 0 0 0 0
##$TUNHIN= 0
##$TUNHOUT= 0
##$TUNXOUT= 0
##$USERA1= <user>
##$USERA2= <user>
##$USERA3= <user>
##$USERA4= <user>
##$USERA5= <user>
##$V9= 5
##$VALIST= <valist>
##$VCLIST= <CCCCCCCCCCCCCCC>
##$VD= 0
##$VDLIST= <DDDDDDDDDDDDDDD>
##$VPLIST= <PPPPPPPPPPPPPPP>
##$VTLIST= <TTTTTTTTTTTTTTT>
##$WBST= 2048
##$WBSW= 25
##$XGAIN= (0..3)
0 0 0 0
##$XL= 0
##$YL= 0
##$YMAX_a= 580132
##$YMIN_a= -487212
##$ZGOPTNS= <>
##$ZL1= 120
##$ZL2= 120
##$ZL3= 120
##$ZL4= 120
##$ABSF1= 14.98509
##$ABSF2= -5.573092
##$ABSG= 5
##$ABSL= 3
##$ALPHA= 0
##$AQORDER= 0
##$ASSFAC= 0
##$ASSFACI= 0
##$ASSFACX= 0
##$ASSWID= 0
##$AUNMP= <proc_prof1d_extract_pilot.lims>
##$AXLEFT= 0
##$AXNAME= <>
##$AXNUC= <1H>
##$AXRIGHT= 0
##$AXTYPE= 0
##$AXUNIT= <>
##$AZFE= 0.1
##$AZFW= 0.1
##$BCFW= 0
##$BC_mod= 0
##$BYTORDP= 0
##$COROFFS= 0
##$CY= 15
##$DATMOD= 1
##$DC= 0
##$DFILT= <>
##$DTYPP= 0
##$F1P= 0
##$F2P= 0
##$FCOR= 0.5
##$FTSIZE= 32768
##$FT_mod= 6
##$GAMMA= 0
##$GB= 0
##$INTBC= 1
##$INTSCL= 1
##$ISEN= 128
##$LB= 0
##$LEV0= 0
##$LPBIN= 0
##$MAXI= 10000
##$MC2= 0
##$MEAN= 0
##$ME_mod= 0
##$MI= 0
##$NCOEF= 0
##$NC_proc= -8
##$NLEV= 6
##$NOISF1= 0
##$NOISF2= 0
##$NSP= 0
##$NTH_PI= 0
##$NZP= 0
##$OFFSET= 14.98509
##$PC= 1
##$PHC0= 92.08191
##$PHC1= 0
##$PH_mod= 1
##$PKNL= yes
##$PPARMOD= 0
##$PPDIAG= 0
##$PPIPTYP= 0
##$PPMPNUM= 2147483647
##$PPRESOL= 1
##$PSCAL= 4
##$PSIGN= 0
##$PYNMP= <proc.py>
##$REVERSE= no
##$SF= 400.02
##$SI= 32768
##$SIGF1= 0
##$SIGF2= 0
##$SINO= 400
##$SIOLD= 32768
##$SPECTYP= <>
##$SREGLST= <1H.CDCl3>
##$SSB= 0
##$STSI= 32768
##$STSR= 0
##$SW_p= 8223.68421052631
##$SYMM= 0
##$S_DEV= 0
##$TDeff= 65536
##$TDoff= 0
##$TI= <>
##$TILT= no
##$TM1= 0
##$TM2= 0
##$TOPLEV= 0
##$USERP1= <user>
##$USERP2= <user>
##$USERP3= <user>
##$USERP4= <user>
##$USERP5= <user>
##$WDW= 1
##$XDIM= 32768
##$YMAX_p= 430446068
##$YMIN_p= -684079
##$CURPLOT= <Network HP LaserJet P1505>
##$CURPRIN= <$Network HP LaserJet P1505>
##$DFORMAT= <normdp>
##$LAYOUT= <+/1D_H.xwp>
##$LFORMAT= <normlp>
##$PFORMAT= <normpl>
##$SURQMSG= 1
$$ End of Bruker specific parameters
$$ ---------------------------------
##NTUPLES= NMR SPECTRUM
##VAR_NAME=  FREQUENCY,     SPECTRUM/REAL,   SPECTRUM/IMAG
##SYMBOL=    X,             R,               I
##VAR_TYPE=  INDEPENDENT,   DEPENDENT,       DEPENDENT
##VAR_FORM=  AFFN,          ASDF,            ASDF
##VAR_DIM=   32768,         32768,           32768
##UNITS=     HZ,            ARBITRARY UNITS, ARBITRARY UNITS
##FACTOR=    0.250966925370066, 1,           1
##FIRST=     8223.43324360094, -18858,       -202556
##LAST=      0,             -12580,          73541
##MIN=       0,             -684079,         0
##MAX=       8223.43324360094, 430446068,    0
$$ Real data points
##PAGE= N=1
##DATA TABLE= (X++(R..R)), XYDATA
$$ [...]
19491H1056d628E9028J90728c23048a60467e2716j29507h00C276L8040N1644B097
19478B47626a60841C6630J85734G0990a65909D9460b67044A03701c29550D0709
19467a03409K3902j97386f021o6115K8109B54768p7465A0532a76997D42938c20974
19455b68466A577K03702b80117R6776L7511j40965D3800a78532A28240b55206
19444a6094k07587b1570l42055E8939d3317p056k0252b312D5655h0919A69012
19432h6109G8023d69500C58927q1748D0204J8212b22616e0151m9023l5635J3481
19421a21328j70191D7367a93728O6668B51034a9116A93838d05223a05278A66116
19410d4814j49533c2976B1281a99128C54369I3876a60237j99956A6187a53665
$$ plain form
19491 81056 -4628 59028 249756 -323048 -160467 -52716 -182223 -800 3276 41316 92960 2097
19478 247626 -160841 36630 222364 70990 -165909 49460 -267044 103701 -329550 40709
19467 -103409 -79507 -276893 -6021 -72136 -44027 254768 177303 10532 -176997 442938 -320974
19455 -268466 1577 205279 -280117 -183341 -145830 -286795 43800 -178532 128240 -255206
19444 -16094 -223681 -21570 -363625 58939 -43317 -50373 -70625 -2312 45655 -80919 169012
19432 -86109 78023 -469500 358927 277179 40204 58416 -222616 -50151 -99174 -134809 -121328
19421 -121328 -291519 47367 -193728 -127060 251034 -19116 193838 -405223 -105278 166116
19410 -44814 -194347 -32976 21281 -199128 354369 93876 -160237 -360193 16187 -153665
19399B75134b18424K8753j94584A12314b00054j20711a07152A84340d79230D6923
19388c46697A2544g7036a2019l21909j74907g9680o3511B75096h1825J2648P333
19377f1844A59601b30115a11956r7555C5217c08017J32340l79126J17178H3344
19366G8393J05382d8794G5607c8100l19860R9075j05448J70960L9202B43854G5785
19354d1799J9419G0030J21970I3713b2953B69380D5471g4102r2932A48350J34750
19343B83100a05159M9305D51J92612c86611l2758E3995a41540f6256j53704J9576
19332b00384a1450A08153M6446J43453j29419c34316A93188a47706A67925R692
19322A77617J46517c20770e4103j6424d469k21362H5133A1757K60695C8933q131
$$ plain form
19399 275134 -218424 -189671 -384255 112314 -200054 -320765 -107152 184340 -479230 46923
19388 -346697 12544 -77036 -12019 -333928 -508835 -79680 -143191 275096 -81825 -69177 -61844
19377 -61844 159601 -230115 -111956 -209511 35217 -308017 -175677 -554803 -437625 83344
19366 78393 183775 -48794 75607 -38100 -357960 -258885 -364333 -193373 -154171 243854 75785
19354 -41799 -22380 70030 192000 93713 -22953 269380 45471 -74102 -167034 148350 283100
19343 283100 -105159 -55854 451 193063 -386611 -419369 53995 -141540 -66256 -219960 -200384
19332 -200384 -11450 108153 154599 298052 168633 -334316 193188 -147706 167925 177617
19322 177617 324134 -320770 -54103 -70527 -4469 -225831 85133 11757 272452 38933 30802
19311C0802j4966a59017A32754b76014k8782f6419B58262E0823L4065c4611j52982
19300a87593l3987F2464Q657J87418p1415c11743J47752C1884d79685i8894H5080
19288f4935j6820d0539n8945M2168k2718j69355F4891J60787i0767a751k25279
19277b27030F743b82985a02862B7754K42083a90916Q200d6330j26745A00190D7638
19265a47700n8366G1580b0570l8439j46851g9676o880l639I5932c44351B2724
19253B06731b49353L0172M2732b7423j23276g1027B07970a50250A73514k7819
19243A45695b13351N7690F5443L3534a14884B9880a87049j72413g2726C712a4788
19231a2578I3790J8629P3139b15980a364j3776j02792m8578q5770G6968a84465
$$ plain form
19311 30802 15836 -159017 132754 -276014 -304796 -66419 258262 50823 84888 -34611 -187593
19300 -187593 -221580 62464 71121 258539 187124 -311743 -163991 31884 -479685 -98894 85080
19288 -64935 -81755 -40539 -99484 -57316 -80034 -249389 64891 225678 -90767 -1751 -227030
19277 -227030 6743 -282985 -102862 27754 269837 -190916 -182716 -46330 -173075 100190 47638
19265 -147700 -206066 71580 -20570 -59009 -205860 -79676 -86556 -90195 95932 -344351 22724
19253 206731 -249353 -219181 -176449 -27423 -150699 -71027 207970 -150250 173514 145695
19243 145695 -213351 -155661 65443 98977 -114884 29880 -187049 -359462 -72726 3712 -14788
19231 -12578 93790 112419 185558 -215980 -1364 -15140 -117932 -166510 -252280 76968 -184465
19219d7415A41933B3430Q9800P0355m4568b29035R8283j7677m7025E9874B2228
19207a7133A31686a82329D6622a55611A90953g4661c867B69243a718j38059G8969
19195i7575B40951A07199e6907J8720B15544a03400a9446o286k36519a2448E8907
19183b64865B62561o7338f0882j64078R7180r2956C5109P9666c6995j67954A86526
19171b17680B9629e297B22804b17930G3051a50100J893j9440m3515J36R2336b9910
19158H4390a63780j08360A5632e6076j30977A17750a12056c3479G0878C2244d9064
19146I29c09087E3798b60105C2266P5213B1240b20581H6802o564K51977b05922
19134b63945h3718O523j7706I5563a79652b5989l07332J35154K2288J0745A40527
$$ plain form
19219 -47415 141933 23430 113230 183585 139017 -229035 -130752 -148429 -195454 59874 22228
19207 -17133 131686 -182329 46622 -155611 190953 -74661 -3867 269243 -1718 -139777 78969
19195 -97575 240951 107199 -56907 -38187 215544 -103400 -19446 -25732 -262251 -12448 58907
19183 -264865 262561 195223 -60882 -224960 -127780 -220736 35109 114775 -36995 -204949 186526
19171 -217680 29629 -5297 222804 -217930 73051 -150100 -148207 -167647 -211162 -211026 -118690 -29910
19158 84390 -163780 -272140 15632 -56076 -187053 117750 -112056 -33479 70878 32244 -49064
19146 929 -309087 53798 -260105 32266 107479 21240 -220581 86802 80238 332215 -205922
19134 -263945 -83718 -77195 -94901 95563 -179652 -25989 -333321 -198167 -175879 -165134 140527
19122f1119F4925a41144A3821a57078L2192a531k66427j9192a15761j68490P4696
19111b09555F9244L63578c49819C5764c64239B1093J19449c05424p4664A07379
19100d9301p4387c0233o6680i344C72867E7719N7209M9651e1846p2325k9101A29598
19087i0175j37725G6466b31878A98114b93014A24171i5674A01394g2524D9958
19076A95138a57037A56704a6691E9866b52616o2208B298P4812b95813F0797K5067
19065H5864J04797q227o649b12777G5266a81898c3818I7346J3608d19964E4035
19053a84697j79413f9481A17116b66008f7381m7811B05402n8758a92333E4349
19042b19997A26920D4873b15443h6129A36390g2430A35699a52033f9664c2085
$$ plain form
19122 -61119 64925 -141144 13821 -157078 -124886 -1531 -267958 -287150 -115761 -284251 -209555
19111 -209555 69244 432822 -349819 35764 -364239 21093 140542 -305424 -380088 107379
19100 -49301 -123688 -30233 -96913 -9344 372867 57719 114928 164579 -51846 -124171 -153272 129598
19087 -90175 -227900 76466 -231878 198114 -293014 124171 -95674 101394 -72524 49958
19076 195138 -157037 156704 -16691 59866 -252616 -314824 2298 77110 -295813 60797 85864
19065 85864 190661 182434 175785 -212777 75266 -181898 -33818 97346 110954 -419964 54035
19053 -184697 -364110 -69481 117116 -266008 -67381 -115192 205402 146644 -192333 54349
19042 -219997 126920 44873 -215443 -86129 136390 -72430 135699 -152033 -69664 -32085
19031A41514E8200i4830A25273n0896J38377a64219l008e6759A5886i5252d2387
19019H782L690J37845n4014j9051b6842j80494h4249a2385p7993L3606q8291I8185
19006A21331J33729a14849E81352C9883b7025j1578m6558r9061A10621b64266
18995a06132B19472J39970d5225k28301A67452G0687A1898K48024a79915b2397
18984i3864A14926k6909d126B5884J8329d920k46106f6643K6499l3150G4053e7722
18971B1933a03385K8525r7151N7522J8820j3662M444A5470J10456N2653c9380
18959a57461r028M6505j8885c3101j03238C03551A07393a84331g8274k8050M4603
18948f1721C58402a26121F4282a63460p8183K6177j4087E1304h5885n8174j06502
$$ plain form
19031 141514 58200 -94830 125273 74377 212754 -164219 -167227 -56759 15886 -95252 -42387
19019 8782 12472 150317 96303 77252 -26842 -207336 -84249 -12385 -90378 -56772 -145063 98185
19006 121331 255060 -114849 581352 39883 -27025 -38603 -85161 -184222 110621 -264266
18995 -106132 219472 359442 -45225 -273526 167452 70687 11898 259922 -179915 -22397
18984 -93864 114926 88017 -4126 25884 44213 -4920 -251026 -66643 -40144 -73294 74053 -57722
18971 21933 -103385 -74860 -172011 -114489 -95669 -109331 -104887 15470 125926 178579 -39380
18959 -157461 -166489 -119984 -138869 -33101 -136339 303551 107393 -184331 -78274 -106324 -61721
18948 -61721 358402 -126121 64282 -163460 -241643 -215466 -229553 51304 -85885 -144059 -250561
18937b50561j14647J19421A47713b72706e45A53510a11209j0571C22426b6020
18926a61670K762I7777P3580h0613j37043q9709G7011b59070O9488B0311K8871
18915D9182a26875B20900r7031L93613j03625C996J74528c95773E1575Q1808c46970
18903a73524j1430o2860N0413h1487p3620A76688b61232a8380G2842d0803b065
18891c18664d4103j27966k7067d6343m6350I528C229h9617k47727b0081n7333
18880g7414r6826j10517A26682b10123N3613d2287r9137A88095A6826J06917k8281
18869I5462L9063P358e1916D7342b8156l34445h6297A1461J40451j2154a87007
18857b57575B92317A36380a50014A27302b099F2399B6396h6466b1788j44609q878
$$ plain form
18937 -250561 -365208 -245787 147713 -272706 -545 153510 -111209 -121780 322426 -26020
18926 -161670 -158908 97777 171357 -80613 -217656 -307365 77011 -259070 -189582 20311 49182
18915 49182 -126875 220900 123869 517482 413857 3996 178524 -395773 51575 133383 -346970
18903 -173524 -184954 -247814 -197401 -81487 -155107 176688 -261232 -18380 72842 -40803 -2065
18891 -318664 -44103 -172069 -199136 -46343 -92693 9528 3229 -89617 -337344 -20081 -77414
18880 -77414 -174240 -284757 126682 -210123 -156510 -42287 -141424 188095 16826 123743 95462
18869 95462 134525 141883 -51916 47342 -28156 -362601 -86297 11461 151912 139758 -187007
18857 -257575 292317 136380 -150014 127302 -2099 62399 26396 -86466 -21788 -166397 -175275
18846a75275j06165A22511J704a21275A55986E5473B3062e0484q8074A46779Q1182
18835B27961a44360A74580d3354j77110g00j16730H1499c79594J52249A4552d7523
18823A83481m8661b40260E05967g4359B82605a75422B64908B6261i9306D25472
18812B22202r7799h4223j66441a2478C1395K24555H272J42351a1690j97554g3077
18800d55868B36608b39354f1820B10412J28a75435l4055Q5958A66521m2409C5353
18788D7398J23992H5198a83135c8406j97451i1410A0459c34438A10867c48304
18777c18164g96l66915F8207L6533a21407k28713a67432D7413m781P1154a90267
18765f877j46049K0078M694H4254c58347d5641C8205O948b47672E5715j8608b07501
$$ plain form
18846 -175275 -281440 122511 124215 -121275 155986 55473 23062 -50484 -138558 146779 227961
18835 227961 -144360 174580 -43354 -220464 -700 -117430 81499 -379594 -227345 14552 -47523
18823 183481 134820 -240260 505967 -74359 282605 -175422 264908 26261 -99306 425472
18812 222202 124403 -84223 -250664 -12478 31395 255950 8272 150623 -11690 -209244 -73077
18800 -455868 236608 -239354 -61820 210412 210540 -175435 -209490 -123532 166521 124112 35353
18788 47398 171390 85198 -183135 -38406 -235857 -91410 10459 -334438 110867 -348304
18777 -318164 -796 -367711 68207 104740 -121407 -350120 -167432 47413 42632 113786 -190267
18765 -6877 -152926 -132848 -128154 84254 -358347 -45641 38205 45153 -247672 55715 37107 -207501
18752a43336j00221a18964l12320B74165b77111B98418B2261J29366a10589e2061
18741d4602g647G5682b07485a3180B1294h0022c2289C17977g5196m5973A00484
18729h8226B18223a00935K2533a4867o1961J7373p1829A77116e5369j7861q6971
18718a60201A20462a89049a0834o641A06489c6848j65762h6559B33029g0369j10381
18707a80750E16R6452b7024j42899B75641d3151O949j45689F0536b18615l3875
18696b52490B81820a38335j2049b0971j81744A02481c8211E357b24448B3840K49713
18685B73553E52K66199A16544k2379e8280C7187b57292A3773K08580a97715J0488
18674a87227c6326j3915A20528K05098A1843a64052B7715c1130a4298n4869D1638
$$ plain form
18752 -143336 -243557 -118964 -431284 274165 -277111 298418 22261 151627 -110589 -52061
18741 -44602 -7647 75682 -207485 -13180 21294 -80022 -32289 317977 -75196 -121169 100484
18729 -88226 218223 -100935 -78402 -14867 -76828 -59455 -131284 177116 -55369 -73230 -160201
18718 -160201 120462 -189049 -10834 -17475 106489 -36848 -202610 -86559 233029 -70369 -180750
18707 -180750 516 96968 -27024 -169923 275641 -43151 -36202 -181891 60536 -218615 -252490
18696 -252490 281820 -138335 -150384 -20971 -202715 102481 -38211 5357 -224448 23840 273553
18685 273553 552 266751 116544 94165 -58280 37187 -257292 13773 222353 -197715 -187227
18674 -187227 -36326 -50241 120528 325626 11843 -164052 27715 -31130 -14298 -69167 41638
18662c7917m0185G6238g3094D25978k07308C283a9340l9287k12538a7503C31215
18650B2133a26892L3292A49073p929b49956I4432O5507F8888a22726k5527l2599
18639a80852I7917a06019b2649k84459e5040j97212C52200a38506A29976n8733
18629G1243L7999J6855J01652h2277A96900B5873b10929c9461k06687d9186G8533
18617b03199b2053A32900B2807e1544q0819q931p7110G6728a91377A62068Q1865
18606B43933a83828B6801a39096e2731A44190m0878A0532J00242i8925j94987
18596b93912A50320b5550j66188R1393K1209a8846n2700F2065a72828j00521d0738
18584E4242i3783k31917f9101K3465A00783a0259k68429J18237J8331D7888k2008
$$ plain form
18662 -37917 -78102 76238 -73094 425978 218670 3283 -19340 -58627 -271165 -17503 331215
18650 22133 -126892 -93600 149073 141144 -249956 94432 159939 68888 -122726 -148253 -180852
18639 -180852 97917 -106019 -22649 -307108 -55040 -252252 352200 -138506 129976 71243
18629 71243 109242 126097 227749 -82277 196900 25873 -210929 -39461 -246148 -49186 78533
18617 -203199 -22053 132900 22807 -51544 -132363 -141294 -218404 76728 -191377 162068 243933
18606 243933 -183828 26801 -139096 -52731 144190 103312 10532 110774 -98925 -293912
18596 -293912 150320 -25550 -191738 -100345 -79136 -18846 -71546 62065 -172828 -273349 -40738
18584 54242 -93783 -325700 -69101 -45636 100783 -10259 -278688 -160451 -142120 47888 25880
18573B5880b02941A0059a72740G0318g4244j5939c1950j22296j51932d5065j60292
18562b05357A28623F2562O1204h2155K8040a3447j50742A2616a89034b2773j9486
18551d2259I0618c69771e7810j31785A27424a99438d8642j75502R4878A74087
18540A07959a51613k35823O5356B5638c53507A02163B4611b88898B6860J34821
18530A61681J37330l3463a84973O3101m1995B84216f2845A5293K84719i4624D688
18518g6279j17935f9291A06767a37697A3464g7507D2589M1495h3376K4102A29134
18506b9293k09430H2794b89672H5094D1969b76247G6860a5828j29132G2241d5869
18494h8683m2944j66401J02448B10838P2075a7033l4025k8250j9066C24265C99
$$ plain form
18573 25880 -202941 10059 -172740 70318 -74244 -90183 -31950 -154246 -306178 -45065 -205357
18562 -205357 128623 62562 123766 -82155 -54115 -13447 -164189 12616 -189034 -22773 -42259
18551 -42259 90618 -369771 -57810 -189595 127424 -199438 -48642 -224144 -129266 174087
18540 107959 -151613 -387436 -322080 25638 -353507 102163 24611 -288898 26860 161681
18530 161681 299011 265548 -184973 -121872 -163867 284216 -62845 15293 300012 -94624 4688
18518 -76279 -194214 -69291 106767 -137697 13464 -77507 42589 84084 -83376 -59274 129134
18506 -29293 -238723 82794 -289672 85094 41969 -276247 76860 -15828 -144960 72241 -45869
18494 -88683 -131627 -298028 -195580 210838 282913 -17033 -51058 -79308 -98374 324265 399
18482H6920K8525n3391a37049k5701B2065b837G055c41794B14689F2192a47448
18470F437K03027D4601f28q8870l2048b5057A57501k1934D1095b43039L6501A7681
18457D597O3896k4394a04710A82492f3039j25428E6186d5079p6761q4398k4723
18446b30961J2308B10994i3973L0740A38093a08756j00446K4539q3455A90706
18435a4449E5621a84961M4630A42567d1835o9606B67323a5684k33216F0667J03699
18424A64366F2149K5935e4983l15468A45700m6180N5945Q0768G169c50415B36387
18412B59180a35379e6742B75906A8324a87921B93975c8684a6331k21540j0225
18402b48096J01893k57395a8338j03253P76j24948A05269g83H4027d0692J9975
$$ plain form
18482 86920 115445 62054 -137049 -162750 22065 -2837 7055 -341794 214689 62192 -147448
18470 6437 209464 44601 -628 -89498 -121546 -25057 157501 135567 41095 -243039 -206538 17681
18457 4597 68493 44099 -104710 182492 -63039 -188467 56186 -45079 -121840 -206238 -230961
18446 -230961 -218653 210994 -93973 -63233 138093 -108756 -209202 -184663 -268118 190706
18435 -14449 55621 -184961 -140331 142567 -41835 -111441 267323 -15684 -248900 60667 164366
18424 164366 62149 88084 -54983 -370451 145700 99520 155465 236233 7169 -350415 236387
18412 259180 -135379 -56742 275906 18324 -187921 293975 -38684 -16331 -237871 -248096
18402 -248096 -146203 -403598 -18338 -121591 -120815 -245763 105269 -783 84027 -40692 -20717
18391b0717j99966a07698j46336g5j76125A67664c9994k22665I444Q1105J9988
18380A10537b22892d3400j59006i7309n9545b0551n0770L2808f258l35380J51886
18369a89752A02016l1406B66c15018I0247d2710C2848K1978h9852a7451A31481
18357I8519L4644b6793k56400e2222q3202A68239i89j27514A3152O7344a2155
18345D0283J91103A07349C3199J08530b0123A74127L393E9824J033d17433a96991
18333B64666n2007b53472B83721O2296I9502k429b03456F4375P0228a09041B25745
18321b13767A26834a41875C3101p841h1575j48885a08537j53489h3336j76157
18311b59493h3254B87813A6918J93616a47836N8489B94096F5318J0421R4199a03282
$$ plain form
18391 -20717 -220683 -107698 -254034 -75 -176200 167664 -39994 -262659 9444 90549 110537
18380 110537 -222892 -43400 -202406 -97309 -156854 -20551 -71321 -38513 -6258 -341638 -189752
18369 -189752 102016 70610 266 -315018 90247 -42710 32848 54826 -89852 -17451 131481
18357 98519 133163 -26793 -283193 -52222 -135424 168239 -989 -128503 13152 80496 -12155
18345 40283 231386 107349 33199 141729 -20123 174127 177520 59824 60857 -417433 -196991
18333 264666 212659 -253472 283721 346017 99502 97073 -203456 64375 134603 -109041 225745
18321 -213767 126834 -141875 33101 25260 -81575 -230460 -108537 -262026 -83336 -259493
18311 -259493 -83254 287813 16918 210534 -147836 -89347 294096 65318 75739 169938 -103282
18299f2301j42040A62073j7241a86284G9572a20787F5845e5607K7160j05088B10482
18287a3654j78384j577Q4530l63571F7772a8778n3935j82664i3632m0350C1419
18275B66276l8479j06289E354N2843a36825A0119J2554a8598j9122j20833j21911
18264b80464B15282c36o3825K392b7927A06859H511b2844A09369c51674Q1069
18253b70605B2967b23438A31107f0018K7486r6178L2777j93684J1699F6208M9994
18242A16202c9323B5396K99215d642k8653o6197A84366d3168l3919A50888j8897
18231A31991a94520A0329J8352B726e1848n3497d6612b2128j75406H4373A2831
18219a80359K1671I5852O5737L4368q9169C5560J43933q7840d3622D4602f36817
$$ plain form
18299 -62301 -204341 162073 144832 -186284 79572 -120787 65845 -55607 -28447 -133535 210482
18287 -13654 -192038 -193615 -109085 -472656 67772 -18778 -72713 -255377 -93632 -133982 31419
18275 266276 227797 121508 5354 58197 -136825 10119 22673 -18598 -37720 -158553 -280464
18264 -280464 215282 -336 -64161 -61769 -27927 106859 8511 -22844 109369 -351674 -270605
18253 -270605 22967 -223438 131107 -60018 -32532 -128710 -95933 -289617 -277918 66208 116202
18242 116202 -39323 25396 324611 -4642 -33295 -99492 184366 -43168 -77087 150888 131991
18231 131991 -194520 10329 28681 2726 -51848 -105345 -46612 -22128 -197534 84373 12831
18219 -180359 -158688 95852 161589 195957 106788 35560 179493 91653 -43622 44602 -636817
18207c82846B54424a3799E7515a18683I3793f1651A05200a69470G2870a48171
18196b64256J23177D25274a64662L4101c7767I737J10944f2995A52677J02182
18186B54859D6391M5079a4430D61037B3062a24113A86972A8770c8433A30674J06753
18175B37427g6947E4143c26963A26410c932l8459B373K14404c7212A63007h7319
18163a26706B51708h8552j04958J7289M4829A6830e3345o3803B38153f3572m21784
18152d85356a57244A58340c595A96652a26013J4127p0788B23037q823h760A19131
18140c9498r0094B2868g7335h299H0349g0430m3077e1016D3611b43948d549E500
18127c3201a610j00656A7211i3311r1650F1682H666i5712j00603B03672a10053
$$ plain form
18207 -382846 254424 -13799 57515 -118683 93793 -61651 105200 -169470 72870 -148171
18196 -264256 -141079 425274 -164662 -130561 -37767 9737 120681 -62995 152677 254859
18186 254859 46391 91470 -14430 461037 23062 -124113 186972 18770 -38433 130674 237427
18175 237427 -76947 54143 -326963 126410 -3932 -42391 2373 216777 -37212 163007 -87319
18163 -126706 251708 -88552 -193510 -176221 -131392 16830 -53345 -117148 238153 -63572 -485356
18152 -485356 -157244 158340 -3595 196652 -126013 -111886 -182674 223037 214214 -8760 119131
18140 -39498 -129592 22868 -77335 -8299 80349 -70430 -113507 -51016 43611 -243948 -4549 5500
18127 -33201 -1610 -102266 17211 -93311 -184961 61682 8666 -95712 -196315 203672 -110053
18115d0724j95535c4069l448j1065R973B60355h3436C1518O7820f2320j75980
18104b38300i5627l0364j7605E2036b29596A40181b07581B6361J72733k5941D1787
18092A54841G7390b59932M8691B57121G0861B9150b28169H3537A2213b9925B3093
18080B01750p8084a74875Q0621m2219B76128Q0793e2305f313F7317B47R9838e0635
18067B05743g5816F3706K5376a9578I9520D2912P1201j4240a94998o9878C9711
18055a40334A89297H9335K3682b63595E2431J37697c27413a54178Q352r0442G1658
18043A24975b07894A82414a57445A51638j6740N1127L9252a45282d0186j3360
18033e3546G9661L8587h2933G0486O4247a61233G7029a64903J1310j96666J03044
$$ plain form
18115 -40724 -236259 -34069 -37517 -48582 -38609 260355 -83436 31518 99338 -62320 -238300
18104 -238300 -95627 -125991 -143596 52036 -229596 140181 -207581 26361 199094 173153 41787
18092 154841 77390 -259932 -211241 257121 70861 29150 -228169 83537 12213 -29925 23093
18080 201750 123666 -174875 -94254 -136473 276128 356921 -52305 -6313 67317 247 100085 -50635
18067 205743 -75816 63706 89082 -19578 99520 42912 114113 99873 -194998 -264876 39711
18055 -140334 189297 89335 113017 -263595 52431 190128 -327413 -154178 -145826 -236268 71658
18043 124975 -207894 182414 -157445 151638 134898 186025 225277 -145282 -40186 -53546
18033 -53546 79661 118248 -82933 70486 134733 -161233 77029 -164903 -153593 -350259 -247215
18022b47215G5209d1466j93645A36885j4798i2874q4358k20381J3484f5507P399
18011e8108j10247j8668o3276C98195j95559A00282b11100a02427F0992c11988
18000H2495K79362d2079B36488a14964J3250I4394i4879a6683c272r8358m1054
17989a42684b5865k36903f0267B4192i4992m3566L450M947N1646B27714g5114
17977i125A71685b38171c4499J3519A12846l1230c16325O7151A07577a79783a1783
17965b9769A39097l7751D5012h6392r9685A69058o6555g2672n3135J1806l0086
17954a44087M1321D11192G3592j0048f732B47083g719A86042H9502N4503f2497
17942D7153A5950c6526B59071B2511L65848C5802f3636k7067B53013j25219f0012
$$ plain form
18022 -247215 75209 -41466 -235111 136885 122087 -92874 -177232 -397613 -384129 -65507 -58108
18011 -58108 -168355 -187023 -250299 398195 202636 100282 -211100 -102427 60992 -311988
18000 82495 361857 -42079 236488 -114964 -101714 94394 -94879 -16683 -3272 -101630 -142684
17989 -142684 -25865 -262768 -60267 24192 -94992 -138558 -135108 -130161 -78515 227714 -75114
17977 -9125 171685 -238171 -34499 -20980 112846 81616 -316325 -249174 107577 -179783 -11783
17965 -29769 139097 101346 45012 -86392 -186077 169058 102503 -72672 -125807 -114001 -144087
17954 -144087 -102766 411192 73592 63544 -6732 247083 -7719 186042 89502 144005 -62497
17942 47153 15950 -36526 259071 22511 388359 35802 -63636 -90703 253013 127794 -60012
17930b7575j66142n3641B26773F7587d5229j13948i255A58247f0432A66719a21511
17918e8473o9803l452L6995A76736f1131k49135a00677a3107H6953I120a58189
17906B3395K60033J683a5138A86094a98953f5932j4125l3982A70818A6540N2204
17895F8744K54377g5409j59998B20664P2869f5355g716q9886A72241h8022H9532
17883A70274b41393A39327l838n6052J7166a9478q7031B7780c05597A05122a24949
17871i5755L7046B52122i6089E1753K37279E9395a80099g758j67677o7035P4340
17860a68130A48251H538a08535k61006e0705j79083a11031J2416A62576J4778
17850A77354a05525B80365j11420k1643l3857H505a88960N4912B79960a17541
$$ plain form
17930 -27575 -193717 -247358 226773 67587 -45229 -159177 -9255 158247 -60432 166719 -121511
17918 -58473 -128276 -131728 -94733 176736 -61131 -310266 -100677 -13107 86953 9120 -158189
17906 23395 283428 285111 -15138 186094 -198953 -65932 -80057 -114039 170818 16540 68744
17895 68744 323121 -75409 -235407 220664 293533 -65355 -7716 -97602 172241 -88022 89532
17883 170274 -241393 139327 135489 79437 96603 -19478 -106509 27780 -305597 105122 -124949
17871 -95755 -58709 252122 -96089 51753 289032 59395 -180099 -7758 -175435 -242470 -168130
17860 -168130 148251 8538 -108535 -369541 -50705 -229788 -111031 -98615 162576 177354
17850 177354 -105525 280365 168945 147302 113445 8505 -188960 -134048 279960 -117541
17839D26225H9517J79810b33094A28731J01118H8391M9949b9658B38669b96932
17828A24336P042a18196j66634A32870Q7862B2682I567a18933d9889A1982J99429
17817B11411a32039A77820a10400A21341b357B05418J33855A38388P4222c80709
17806G3080J3609a3852A64694J0897l1320D0319J27337a8586r3609a6362m0871
17795e7233A32458b78686A16462k8772c3305d758j54376r9143c2499A28633n5588
17784G3045d8979A48053E9713b61170A19237b74567B58375A3799J67310n9831
17774A21278D8334K7128J45646K0755i3173B9052d19400F0236c4920A88046J02999
17763B91045a31357A71299q1892b34716m4043c3739k22768P497e7722C04592b7485
$$ plain form
17839 426225 89517 269327 -233094 128731 229849 88391 138340 -29658 238669 -296932
17828 124336 131378 -118196 -284830 132870 220732 22682 9567 -118933 -49889 11982 211411
17817 211411 -132039 177820 -110400 121341 -2357 205418 339273 138388 212610 -380709
17806 73080 86689 -13852 164694 175591 144271 40319 167656 -18586 -112195 -16362 -57233
17795 -57233 132458 -278686 116462 87690 -33305 -4758 -159134 -258277 -32499 128633 73045
17784 73045 -48979 148053 59713 -261170 119237 -274567 258375 13799 181109 121278
17774 121278 48334 75462 221108 241863 -93173 29052 -419400 60236 -34920 188046 291045
17763 291045 -131357 171299 89407 -234716 -278759 -33739 -256507 -249010 -57722 304592 -27485
17751B39923A08521c0340m0676o2406B6793O1246b3317B24891Q4395f5039C6157
17739B72981m0261L8813h7A55872e7527F3537d8583B4996J35986R6143P0623C7425
17726a40859q4422R4911K5872A41525b67190C0763A770a60121F6863i6164o4559
17715a60723P6523A2705b6747m5413B45536h3637A50278b25256A24562g6365j14075
17704a90440D7640A3939J93049E3731L8747j1712a06152A17330g7364b0698B54497
17692A47461M3635q0874a009k31258b7460j77265B29056a43191b923l15717a49373
17680a0597H3509C1689J13042j2218L3247m3407c6515j55817b5459h373B15667
17668A99792J49112j30550r9417a09610k30762G7369M7254b4063C71313A67120
$$ plain form
17751 239923 108521 -30340 -71016 -133422 26793 88039 -23317 224891 309286 -65039 36157
17739 272981 232720 271533 -87 155872 -57527 63537 -48583 24996 160982 257125 327748 37425
17726 -140859 -225281 -130370 -104498 141525 -267190 30763 1770 -160121 66863 -96164 -160723
17715 -160723 -84200 12705 -26747 -72160 245536 -83637 150278 -225256 124562 -76365 -190440
17704 -190440 47640 13939 206988 53731 92478 80766 -106152 117330 -77364 -20698 254497
17692 147461 191096 110222 -1009 -232267 -27460 -204725 229056 -143191 -2923 -318640 -149373
17680 -10597 83509 31689 144731 132513 165760 122353 -36515 -192332 -25459 -8373 215667
17668 199792 348904 218354 118937 -109610 -340372 77369 124623 -24063 371313 167120
17657A98081j4287L0169d7529j06257O3235C9644L31201A07629J9408E6093k6040
17646C0053b58833B00164D5929K47648O5086C4112J04211h6684D01910j72864
17636B29046G15K62512a16561D53349k00454g2208j07990B06676p2407h6749A31113
17624C56206A35692a22647E5088g2126j22610B1466Q7329a5099A990J15923J7972
17613A35885a89506A50908m4859C6699J1271L60544j98165n538n7351E778J45337
17602A51115a50690r3744a11848A3794K51464K6885j43699J49439A44498l7267
17592A07231a44068F9964J19869j1430l3234o0733l0362i4472D14399j93457e5792
17580B54212J11053A17798O7702o3961K2555D6078K19835M3711L4677H6303C7840
$$ plain form
17657 198081 183794 213963 -47529 -153786 -90551 39644 370845 107629 127037 56093 30053
17646 30053 -258833 200164 45929 293577 358663 34112 138323 -86684 401910 229046
17636 229046 715 263227 -116561 453349 252895 -72208 -180198 206676 134269 -86749 131113
17624 356206 135692 -122647 55088 -72126 -194736 21466 108795 -15099 1990 117913 135885
17613 135885 -189506 150908 106049 36699 47970 408514 210349 204811 147460 5778 151115
17602 151115 -150690 -244434 -111848 13794 265258 292143 148444 297883 144498 107231
17592 107231 -144068 69964 189833 178403 145169 84436 54074 -94472 414399 220942 -55792
17580 254212 365265 117798 185500 121539 144094 46078 265913 309624 344301 86303 37840
17568c4331j14274D2807c0759C2384K31189a15888G59J84111i3208D4806K29710
17557B74516q614j02686J04595q1063n7730a42333C9490b04644e0217j53368F1677
17545A19347m7576R4422c9586B99631p5277o4424a13760E5326g8782E63034B58124
17533B68983A24314B0726K1441J35606Q2605J11557C6395K66170a16752G9584
17522B25509J42141j4310J05153H8649J63194A10199J67045a47409A86331K83394
17512D69725A40234Q2300I8013l1748M9960P1169J01142K23305j92223R0288a561
17500i6607B32121g2908A44148N3266l4500K15054c68660a57786B9188K60410
17490B89598d3281J753A20358h0022C2253J50570N1656r7511L0995a80074A69120
$$ plain form
17568 -34331 -148605 42807 -30759 32384 263573 -115888 759 184870 -93208 44806 274516
17557 274516 265902 163216 267811 186748 129018 -142333 39490 -204644 -50217 -203585 61677
17545 119347 71771 166193 -39586 299631 224354 159930 -113760 55326 -78782 563034 258124
17533 268983 124314 20726 42167 177773 260378 371935 36395 302565 -116752 79584
17522 225509 367650 353340 458493 88649 251843 110199 277244 -147409 186331 469725
17512 469725 140234 222534 98013 66265 116225 187394 288536 511841 319618 409906 -1561
17500 -96607 232121 -72908 144148 197414 162914 377968 -368660 -157786 29188 289598
17490 289598 -43281 -41528 120358 -80022 32253 182823 234479 136968 167963 -180074 169120
17478B01381F9995j6448R4528C1615a85582A51697J22441C5891b2120B91630B7760
17466A45589A5304J40092a06572b4849I1678L4001n8285i9596D7557j8204a70174
17454B67726F5094L04851d2946A70596P8787G1978M37487A73807e7437A52404
17443D4438K02991j19263J35416o1939K31191j33135K04926A77226c7178A69619
17432A56035P783m9337J43813J07236a89991A47950l7724K90897j69677K10433
17422D41879F90L18332r2797J21239b1159B41132B5693K52239j38021K99014k04842
17411B34083L9663m4293M8329G5253B5240L52073r6807J80958D3479P4242a4478
17399B53721D1492P5902J4454L09129j19448b52154A0759N47046A18038K54422
$$ plain form
17478 201381 69995 53547 148075 31615 -185582 151697 274138 35891 -22120 291630 27760
17466 145589 15304 155396 -106572 -24849 91678 125679 67394 -99596 47557 29353 -170174
17454 267726 65094 369945 -42946 170596 249383 71978 509465 173807 -57437 152404
17443 44438 247429 128166 263582 201643 432834 299699 504625 177226 -37178 169619
17432 156035 163818 114481 258294 365530 -189991 147950 110226 401123 231446 441879
17422 441879 690 319022 226225 347464 -21159 241132 25693 277932 139911 438925 234083
17411 234083 273746 229453 277782 75253 25240 377313 280506 461464 43479 117721 -14478
17399 253721 41492 117394 131848 440977 321529 -252154 10759 557805 118038 372460
17389C72460q5457L8937b9084B10747l6487L7740C1542L84312b28658B84628A18342
17377B51573J96111A99227Q6952A6897K89383A3030j944K39257N0152F2536M00112
17366D62648b7454A59196a04587B67803A31129K78148o9494M894j55810h1209
17355B58946O7434E0598J32024N7015B9332K72184A20295J27626h7292c4969j07412
17344a42381E10615B3830e972B15960N7895G5928K53376A43305K24943j74526
17334A93722A9280L21997N5534H3130J59796h6776a2798A31469J19605j10104
17324A40970a07475E3893N717a5558C69356D2322K3031O633L80920D3939h9516
17312A32603K35121n3784A16402K03367A0450K45636E8343J00562F3125Q001J15223
$$ plain form
17389 372460 287003 325940 -29084 210747 174260 212000 31542 415854 -228658 284628 118342
17377 251573 447684 199227 286179 16897 306280 13030 11086 250343 300495 62536 462648
17366 462648 -27454 159196 -104587 267803 131129 409277 339783 344677 188867 -81209
17355 258946 326380 50598 182622 239637 29332 301516 120295 247921 -87292 -34969 -142381
17344 -142381 510615 23830 -5972 215960 273855 75928 329304 143305 368248 193722
17334 193722 19280 341277 396811 83130 242926 -86776 -12798 131469 251074 140970
17324 140970 -107475 53893 59610 -15558 369356 42322 65353 71986 452906 43939 -89516
17312 132603 367724 313940 116402 319769 10450 256086 58343 158905 63125 71126 186349
17301A86349m3983J20518J3157I693L8031d9378j53548C15268C7958J96464j8144
17290B16278b3055C94630A51481e5074B916K23391H215K83403B9140K13925p5147
17279A67918J55721G8807K60127I9932J58460J17657A03092J48026G9031J5221
17269I4252L20211j30090J230j21064K81962k7381h9533C00937r0931R5563H6317
17257c01373I1481J58177e3977B03972j3177q5681J54178r0069K9963C0575a7411
17245a32821C44364N3403A10948A7809L80554j63774K16950b6360C41492F184
17234D65141B27222J25189G7154a69998F8941P5580L58222a0944B00955l2317
17224A68638L01013A14870i4565C9295M73373A56773N7280F9843K70244j46166
$$ plain form
17301 186349 142366 262884 276041 9693 47724 -49378 -202926 315268 37958 234422 216278
17290 216278 -23055 394630 151481 -55074 2916 226307 8215 291618 29140 243065 167918
17279 167918 323639 78807 338934 99932 258392 376049 103092 251118 79031 94252
17269 94252 414463 284373 285603 164539 446501 419120 -89533 300937 210006 305569 86317
17257 -301373 91481 249658 -53977 203972 190795 105114 259292 169223 199186 30575 -17411
17245 -132821 344364 397767 110948 17809 398363 234589 451539 -26360 341492 6184
17234 465141 227222 352411 77154 -169998 68941 144521 502743 -10944 200955 168638
17224 168638 469651 114870 -94565 39295 512668 156773 214053 69843 340087 193921
17214A93921J91891G1568J82926O1353p5476r1771j7071M21765P0308A29192K22473
17203C51665R3481A21219a0714F4628K18622K59419B52913j00665L16477H7697
17192C12111A09961J0683J88864K85770j78630p9247A05890K7592J56732L1180
17182C21394r2586K30426J68006H6023L86115j80941k4705C5733J72059K77049
17172D84841j54238L4278K243j19087R1617o6993J59139E7089L8914K30207q8829
17161B37381K99888B33865j2064m441R3132K41560J252B59403J19564j70218K14660
17150D23409m547j16092j20179L09171K03261B20733L40884J40563j25721A71581
17139D60143L7087p8201j09080L30558B26035L56268A25673M41018B33771N4282
$$ plain form
17214 193921 385812 71568 254494 315847 240371 148600 131529 553294 623602 129192 351665
17203 351665 445146 121219 -10714 64628 283250 542669 252913 152248 468725 87697
17192 312111 109961 120644 309508 595278 416648 337401 105890 133482 290214 321394
17182 321394 228808 459234 627240 86023 472138 291197 266492 35733 207792 484841
17172 484841 330603 364881 367124 248037 339654 272661 431800 57089 96003 326210 237381
17161 237381 537269 233865 221801 217360 310492 552052 553304 259403 378967 208749 423409
17150 423409 418862 302770 182591 491762 695023 220733 561617 702180 576459 171581
17139 460143 497230 419029 309949 640507 226035 582303 125673 566691 233771 288053
17129B88053J36898j9328N351J7781p6446J15569J85306k9067B34411K57439k45117
17118B46733J67612p7519J29168B17400K46083L37125l4716k01528k08713j09799
17108B45852N0005J49976L50063B74653K37765j65855M62316j84523j13306n3068
17098D57982n2095J02071j39276J94426j38716j15860N5790L54243j49536j6398
17088E52631j6920M707j59453K15300J9843j85532P2314J58094l5522m6043K81267
17077H60686l98758J23670N1389j70163N62275o7300l05171l7215k7647j13656
17067D78110L23567k44155P061P4067k32118N26544l29669J14101Q5676p1500
17057G31684L4411p8482k34458n0272K63750j8865j11462K61612o1151k34693
$$ plain form
17129 288053 424951 405623 410974 428755 352309 467878 653184 624117 234411 491850 246733
17118 246733 414345 336826 465994 217400 463483 800608 765892 564364 355651 245852
17108 245852 295857 445833 795896 274653 512418 346563 808879 624356 511050 457982
17098 457982 405887 507958 368682 563108 424392 308532 364322 718565 569029 552631
17088 552631 535711 540418 380965 596265 616108 430576 502890 660984 625462 579419 860686
17077 860686 461928 585598 636987 466824 1029099 961799 656628 619413 591766 478110
17067 478110 801677 557522 564583 638650 406532 933076 603407 717508 803184 731684
17057 731684 766095 687613 453155 402883 666633 647768 536306 797918 736767 502074
17047E02074M8594J93408C21074L67706M9439j75921N7283j52895j36832L33857
17037F63711J30278j689j42589J31195C38039N28859k02545K90099l8811j15585
17027H00056J52385k04097j21809J75919l58325J96408m9958O16407j90563r8417
17017I18006J5160j30034n781K21041k56944R6102K93578m27934O6428q4521K78857
17006I83958k22064M30295r0283l20829R4735k0479Q5755J33223k97536M3312
16996H20087J95052N6008k14365L75128j45057R3452j8422q2906j66382J16230
16986A028825L1339o3492O1836J1428j66114L01489m8145q6292m7659K16361m31800
16975H07776N37190j61578l01621K44487p8251K37097j319l31929L4008K70930
$$ plain form
17047 502074 550668 744076 321074 688780 738219 562298 619581 466686 329854 663711
17037 663711 793989 792300 649711 780906 338039 866898 664353 954452 915641 800056
17027 800056 952441 748344 626535 802454 444129 640537 590579 1206986 1016423 918006
17017 918006 933166 803132 797351 1018392 761448 857550 1151128 723194 789622 705101 983958
17006 983958 761894 1192189 1101906 781077 875812 855333 941088 1074311 776775 820087
16996 820087 1015139 1071147 856782 1231910 1086853 1180305 1161883 1078977 912595 1028825
16986 1028825 1060164 996672 1058508 1069936 903822 1205311 1157166 1070874 1023215 1239576 807776
16975 807776 1344966 1183388 881767 1126254 1048003 1285100 1283781 951852 985860 1256790
16965A256790J82025j95950j48504K45110M4330k43560J06003K76923j37221j98705
16955A187241J63878j7732P0525m09245M99601K89568l49536J9559l4555j53931
16945A265373M21572n02779K76967J42957J93848j25139L2693k49686N89721n99034
16935A446493M96296k23280l54291N90917k55549K24065P9949l66075M42541p8273
16925B002793k11132L75560l03576j10684K43757J97103L27711j20842j74156
16916B226534l98235M96116K6889k79622K44459J12269o6662J56905j73186k5785
16906B319682N257n4388L50489k66463K28967L12628m37304J65871J23239L8692
16896B786670j44639j71309O38027k73058j7768M76014m45832o1453M99647p0011
$$ plain form
16965 1256790 1438815 1242865 1094361 1339471 1383801 1140241 1246244 1523167 1385946 1187241
16955 1187241 1351119 1333387 1403912 994667 1494268 1783836 1434300 1453859 1419304 1265373
16945 1265373 1686945 1184166 1461133 1604090 1797938 1672799 1705492 1455806 2045527 1446493
16935 1446493 1942789 1719509 1365218 1956135 1700586 1924651 2004600 1638525 2081066 2002793
16925 2002793 1791661 2167221 1863645 1752961 1996718 2193821 2521532 2400690 2226534
16916 2226534 1828299 2324415 2351304 2071682 2316141 2428410 2361748 2518653 2345467 2319682
16906 2319682 2324939 2270551 2621040 2354577 2583544 2896172 2458868 2624739 2747978 2786670
16896 2786670 2642031 2470722 3108749 2835691 2817923 3293937 2848105 2786652 3286299 3216288
16886C216288q052K07434j66286j647l004K61397K4627j28800N84311k70877M6292
16875C761683J16265j59156m12k6322L61856N3640N3587J07369J15959j78818
16865D205651Q5078K17753j63343O6156L66908J36799j04887M58426n2779j92134
16855E023628K64927K39381j47165K56664J48973L3652J33071K09013p9874J22046
16845F204316q2465L57451Q9761K52533J9127M0631K62153L31700r7929M00398
16835G777676J3780L15987k13338M6164M36528M750L47840J23673K76058J90424
16825I319542M92183Q3957L27644r4782L60708l8877K30703P83694j05242M39503
16815A1799033M42043K49893M57838J01588J53557N09332N31535M75090M0711
$$ plain form
16886 3216288 3208236 3415670 3249384 3247737 3244733 3506130 3530757 3401957 3986268 3715391 3761683
16875 3761683 3877948 3718792 3718380 3692058 4053914 4107554 4161141 4268510 4384469 4205651
16865 4205651 4290729 4508482 4345139 4411295 4778203 4915002 4810115 5268541 5215762 5023628
16855 5023628 5288555 5527936 5380771 5637435 5786408 5820060 5953131 6162144 6082270 6204316
16845 6204316 6121851 6479302 6569063 6821596 6840723 6881354 7143507 7475207 7377278 7777676
16835 7777676 7791456 8107443 7894105 7940269 8376797 8381547 8729387 8853060 9129118 9319542
16825 9319542 9811725 9895682 10223326 10128544 10489252 10450375 10681078 11464772 11359530 11799033
16815 11799033 12241076 12490969 12948807 13050395 13203952 13713284 14244819 14719909 14760620
16806A4760620M37548N19328N51226P9324P69757M66065M23964N65687J45319
16797A8718838R80508P04216J16121R68460M30901P66769Q75913N60424Q62403
16788B4984553O11417J214199L50767J401628N84404J369271R21951J124228J067664
16779C3630082J081471Q65911J282121J138780J578014J202818J704871J309312
16771D3793380J612658J836693J491422J690388J985746J884716J580097K243488
16763E8118588J831683J987445K323610K201094K040509K103962K337183K211080
16755G5155154K509686K027836K434259J882736K474377J962888J980225J708695
16747I2135856K179880J333516J595341J274238J084070R38111R95543J04976
$$ plain form
16806 14760620 15198168 15717496 16268722 16348046 17117803 17583868 18007832 18573519 18718838
16797 18718838 19699346 20403562 20519683 21488143 21919044 22685813 23561726 24122150 24984553
16788 24984553 25595970 26810169 27160936 28562564 29146968 30516239 31438190 32562418 33630082
16779 33630082 34711553 35577464 36859585 37998365 39576379 40779197 42484068 43793380
16771 43793380 45406038 47242731 48734153 50424541 52410287 54295003 55875100 58118588
16763 58118588 59950271 61937716 64261326 66462420 68502929 70606891 72944074 75155154
16755 75155154 77664840 79692676 82126935 84009671 86484048 88446936 90427161 92135856
16747 92135856 94315736 95649252 97244593 98518831 99602901 100541012 101536555 101641531
16739A01641531O12405O87j70012k61935p60729l87908r12908j387056j424482
16730I6949593j731550r60716j804988k082828j761545j774653k656335j713972
16722H2463006k393770j862882k211212k172567k029682k222381j929783k137219
16714F5503510j954603j936256k225484j613328j934891j686951j664362j306268
16706E1181367j908847j237347k059347j002914j534533j334589j319858j094784
16698C9689148j519579r30286j312104j061826q98436q89246j311959n97105q20209
16689C0348398q17734r69818o57089r16727p59789q57001m84755r78952m39578
16680B3466955l74718o22518m53795q63198l59555m77647o18180m90104l32895
$$ plain form
16739 101641531 102253936 102254623 102084611 101822676 101061947 100674039 99761131 98374075 96949593
16730 96949593 95218043 94257327 92452339 90369511 88607966 86833313 84176978 82463006
16722 82463006 80069236 78206354 75995142 73822575 71792893 69570512 67640729 65503510
16714 65503510 63548907 61612651 59387167 57773839 55838948 54151997 52487635 51181367
16706 51181367 49272520 48035173 45975826 44972912 43438379 42103790 40783932 39689148
16698 39689148 38169569 37239283 35927179 34865353 33966917 33077671 31765712 31168607 30348398
16689 30348398 29530664 28560846 27903757 26987030 26227241 25370240 24885485 23906533 23466955
16680 23466955 23092237 22469719 22015924 21152726 20793171 20315524 19697344 19207240 18874345
16671A8874345l27080o92928m34540j07800n79115m46467q61957j56329K7966
16662A5296095l80415l74075q9162n86898j33320j98010l91292l86227m7936j37345
16652A2571415k33529k81033n68302J57666m20014k56123l00555l27643j38030
16643A0203852j18842J38737l89450k79898j66857m21345o435k4732j1142l76005
16633H547883j01394L731J96439j98240l83831N9613k69849k26270r0609J13553
16623G651026l33937j11118N0627r1489k90345l30549M73391l06724k79052J04333
16613F536163l39152J31508J69565l47707m2442N1937k53692q5526l19633j59892
16603E341129N2994Q0347m3058L959P47k04556m8711l5438j2859q8775k38219
$$ plain form
16671 18874345 18547265 17854337 17419797 17311997 16732882 16286415 15424458 15268129 15296095
16662 15296095 14915680 14541605 14452443 13865545 13732225 13534215 13142923 12756696 12708760 12571415
16652 12571415 12337886 12056853 11488551 11646217 11226203 10970080 10669525 10341882 10203852
16643 10203852 10085010 10223747 9834297 9554399 9387542 8966197 8959762 8935030 8923888 8547883
16633 8547883 8446489 8450220 8646659 8448419 8064588 8124201 7854352 7628082 7537473 7651026
16623 7651026 7317089 7205971 7256598 7165109 6874764 6544215 7017606 6710882 6431830 6536163
16613 6536163 6197011 6328519 6498084 6150377 6107935 6159872 5906180 5820654 5501021 5341129
16603 5341129 5394123 5474470 5431412 5435371 5436118 5231562 5182851 5147413 5134554 5045779 4807560
16592D807560k3615q1583P4473j95411J25057n9863k87740l32886L92642K27564
16582D646198j49247n6703j84247m293J61614m89883k18347L24055p7424L64663
16572D316386o16984L61857m56302J71644k03295J65188q5135j19550J5926L93005
16562C942740j72127k53434j65807K40214j19096k6694Q3818K38213j73424m65371
16552C129032j1790L66369n46430N2257K42024l4594J81596l63176O6402J4635
16542C096325j70244K28003l66236J53025j7559l28283J88599k7527K79040l47897
16532B687246j92528L39751J61693k99916L91682n33186K10105j26082j73070
16523B465695K01379k3636J7627n3378l0237p2571K3159j51847O4764K18091j23880
$$ plain form
16592 4807560 4783945 4702362 4776835 4581424 4706481 4646618 4358878 4025992 4418634 4646198
16582 4646198 4496951 4440248 4256001 4251708 4413322 3923439 3705092 4029147 3951723 4316386
16572 4316386 3699402 4061259 3604957 3776601 3573306 3738494 3653359 3533809 3549735 3942740
16562 3942740 3770613 3517179 3351372 3591586 3472490 3445796 3529614 3767827 3594403 3129032
16552 3129032 3117242 3483611 2937181 2989438 3231462 3196868 3378464 3015288 3081690 3096325
16542 3096325 2926081 3154084 2787848 2940873 2923314 2595031 2783630 2756103 3035143 2687246
16532 2687246 2494718 2834469 2996162 2696246 3087928 2554742 2764847 2638765 2465695
16523 2465695 2667074 2643438 2661065 2607687 2577450 2504879 2528038 2376191 2440955 2659046 2535166
16512B535166j79456K34469q7830m2573K9230k45606P1872L57450k02140k54617
16502B215965M9960o9000J56419P2383j65545J25705k9626r0808j7121m29191
16492A819141N59962j07766j34462k06102L44191k05796J67700m4231r5364l9108
16482B058165J85553j01056k68580K43535l9209J3365j3513l2494N9834K64179
16472B369779n68373M7539K47997j8940N1822n1673M3030k82573L11930J5812
16462B166350l35722Q0310j59424K69011j19385j41853m676M38891o7415k87755
16452A838332k2566J13525j09872J01674m22243N76080j82183O8235j13243J2940
16442A860679N5293j43497Q1178m3760l4227R942q7451K32045k71200J04906O6164
$$ plain form
16512 2535166 2355710 2590179 2502349 2459776 2489006 2243400 2315272 2672722 2470582 2215965
16502 2215965 2265925 2196925 2353344 2425727 2260182 2385887 2356261 2265453 2248332 1819141
16492 1819141 2379103 2271337 2136875 1930773 2274964 2069168 2236868 2192637 2097273 2058165
16482 2058165 2243718 2142662 1874082 2117617 2078408 2091773 2078260 2045766 2105600 2369779
16472 2369779 1801406 1848945 2096942 2078002 2129824 2078151 2121181 1838608 2150538 2166350
16462 2166350 1830628 1910938 1751514 2020525 1901140 1759287 1754611 2193502 2126087 1838332
16452 1838332 1815766 1929291 1819419 1921093 1498850 2074930 1892747 1960982 1847739 1860679
16442 1860679 1915972 1772475 1853653 1809893 1775666 1785608 1698157 1930202 1659002 1763908 1830072
16431A830072P8396j31571Q6768j98784J37871O9289j1199q7164l4927j02285
16421A636466P8102J80829M4203m43226L46610k63608M78701k62137k17839J4374
16411A592475K45266m49495L53741j26605o1561L08482l50542K48911J28879j97569
16401A691982j53652L81482o38925N48627k07171j05772l53835L68958R1304m17903
16391A205095K63893L8883J95418M7533l9793k46663j0951j73179N78588l37895
16381A520929M9435p6671N9148p4449J92516j11275p7627L62206m70795K05842
16371A579259J50565k29881r5442J45193K86138k36896J03913L5853o0622k03573
16361A474507K55684k96059K46649j17501j80146P6191K84536m30992K25420j27725
$$ plain form
16431 1830072 1908468 1776897 1863665 1664881 1802752 1872041 1860842 1773678 1738751 1636466
16421 1636466 1714568 1895397 1939600 1496374 1842984 1579376 2058077 1795940 1578101 1592475
16411 1592475 1837741 1388246 1741987 1615382 1553821 1862303 1511761 1760672 1889551 1691982
16401 1691982 1538330 1919812 1280887 1829514 1622343 1516571 1162736 1531694 1622998 1205095
16391 1205095 1468988 1507871 1703289 1750822 1711029 1464366 1453415 1280236 1858824 1520929
16381 1520929 1570364 1493693 1552841 1478392 1670908 1559633 1482006 1844212 1373417 1579259
16371 1579259 1729824 1499943 1404501 1549694 1835832 1598936 1702849 1738702 1678080 1474507
16361 1474507 1730191 1434132 1680781 1563280 1383134 1459325 1743861 1312869 1538289 1410564
16351A410564j39246L63265j91009J24114L38364m03244K71377l16183j12179
16342A345823M55584j92320j17394R8811j9231l4941L9971m4664r1110M6841j07098
16331A380272J98176O9027n02296L37497j7590K79950m75623J28758k73554j6971
16321A107646O52275m44013J32066N8808k83670K21699J09024m4119J0850k0878
16311A499688k9125O0420k12938J52380J1114K4399j96611J86162q0180K56405
16301A671714l01776K20837k81023k21423Q75056m85874l77212K52406r3946J93333
16291A452092k07528J15745j23503m1337Q6246r80O6418J01753j88414j49913
16281A110579J07360M01660n33720L6223k37682K85393N2287J7655K03766k1605
$$ plain form
16351 1410564 1271318 1634583 1443574 1567688 1906052 1502808 1774185 1458002 1345823
16342 1345823 1801407 1609087 1491693 1590504 1571273 1536332 1576303 1531639 1440529 1487370 1380272
16331 1380272 1578448 1647475 1145179 1482676 1465086 1745036 1269413 1398171 1124617 1107646
16321 1107646 1759921 1315908 1447974 1506782 1223112 1444811 1553835 1509716 1520566 1499688
16311 1499688 1470563 1530983 1318045 1470425 1481539 1505938 1309327 1495489 1415309 1671714
16301 1671714 1369938 1590775 1309752 1088329 1963385 1477511 1100299 1352705 1258759 1452092
16291 1452092 1244564 1360309 1236806 1195469 1281715 1280735 1347153 1448906 1260492 1110579
16281 1110579 1217939 1619599 1085879 1122102 884420 1169813 1222100 1239755 1443521 1421916
16271A421916j29044J54226j61995n3673o1781K58577K3789m09081J89380p5837
16261A156477J22521k42315L29030l02430K75580R7192j27969k57598K88312k15724
16251A123076R1716j00928J23519N2878J01062k03540p8871m6361l98202O28874
16241A293223j48666K396J51458l26054k6382Q1844P8266K13563k53351k9919
16231A036378o7081l3535q2972K01876m8143J6434L1238l9889m5673K0311o4827
16220I24117M1444j16102Q3267L24099m26217L0290J25275p5678j14587k9936
16210G65972L04943j73836K4585J49805j47424j90318J53940M99185m13972o9858
16200I03022J09423K28448n74846J03426n1816J15368K9496l4117K11266j97654
$$ plain form
16271 1421916 1292872 1447098 1285103 1231430 1169649 1428226 1452015 1042934 1232314 1156477
16261 1156477 1278998 1036683 1365713 1063283 1338863 1436055 1308086 1050488 1338800 1123076
16251 1123076 1214792 1113864 1237383 1290261 1391323 1187783 1108912 1062551 664349 1293223
16241 1293223 1144557 1146953 1298411 972357 945975 1027819 1106085 1319648 1066297 1036378
16231 1036378 969297 935762 852790 1054666 1006523 1022957 1054195 1014306 968633 988944 924117
16220 924117 965561 849459 932726 1256825 830608 860898 986173 910495 795908 765972
16210 765972 1070915 897079 921664 1071469 924045 733727 887667 1386852 972880 903022
16200 903022 1012445 1240893 666047 769473 717657 833025 862521 828404 1039670 842016
16190H42016j30179L8429m8835J44651k5377j43962r5621L29428j48505m5238
16180G16807K19448l0990M1706l31637J04178P2308O8569K40422D89800J71526
16170F61326J70387j34301L05980m08429j98182K91698N9559Q7650l26067J8609
16160E28230L61780k82657B22986O27710m08482Q4279k32746J76282J49525n0973
16150E68581K39122k23269j43868K38182j92500L17873j56834J63075A62824L95250
16140E58074J41233k18254Q681j15763J38282j94967m0252L03635B09534N34064
16130G43598m1932j84391J05724m0133j34051L1532O8240q5503K521K61959j18706
16119F08858j29575J45340j85497O38292C57426N09504l25284A73337l8215J41335
$$ plain form
16190 842016 711837 750266 701431 846082 820705 676743 581122 910550 762045 716807
16180 716807 936255 905265 946971 615334 719512 791820 860389 1100811 489800 661326
16170 661326 831713 697412 1003392 594963 396781 688479 748038 835688 509621 528230
16160 528230 890010 607353 222986 850696 442214 526493 293747 470029 619554 568581
16150 568581 807703 584434 440566 678748 486248 804121 647287 810362 162824 558074
16140 558074 699307 481053 489734 373971 512253 317286 277034 580669 209534 743598
16130 743598 701666 517275 622999 582866 448815 480347 548587 463084 465605 727564 608858
16119 608858 479283 624623 439126 1077418 357426 866930 541646 173337 135122 276457
16109B76457m3620K40939j28387K65783k77092M7212A59927K66149J57013j44442
16099D38647m6963J02214j94325j8507Q7624I7087J69846p5406E3359J18398f4076
16087D53050M7832j85187M0290J34901L0963j85332P8218A61651O273p4916L54220
16076D47228j31571J64871j67728K5793J17062k5481p3160l3924K07877j90234
16066C40733A46806N4160J19379o5997J71482D5134K65702j7165A38035l206M4029
16055A78858L8159J70308J8359F2592K27622J52594L53912F0622G338J00184J07531
16044B15053J1575K12566J43220k68880C6225b7999A87865e8463B45863Q3454
16034C29317C4584K67479K3668a32782G8387M8881K79901H2762L78645r9728A08751
$$ plain form
16109 276457 232837 473776 345389 611172 334080 381292 159927 426076 583089 438647
16099 438647 391684 493898 299573 281066 368690 97087 266933 191527 53359 171757 -64076
16087 453050 500882 315695 355985 490886 521849 336517 414735 161651 167924 93008 447228
16076 447228 315657 480528 312800 338593 455655 430174 357014 323090 530967 340733
16066 340733 146806 200966 320345 254348 425830 45134 310836 293671 138035 134829 178858
16055 178858 217017 387325 405684 62592 290214 442808 796720 60622 7338 107522 215053
16044 215053 226628 439194 582414 313534 36225 -27999 187865 -58463 245863 329317
16034 329317 34584 302063 325731 -132782 78387 127268 407169 82762 461407 361679 108751
16022I9531a5742p741B40867J09294l1677j25702D2214R0348O1562K5099c6700
16010A44683o7219g9204A97575Q0897J28496K39348f9034E4028d00B65658K9219
15999B94877K04074p3748A81828k8955E8362a77455C17499i2215d0364B5691N28452
15988E54143A12495M6278K35269K22481J08307k64546J0449j58835A51187L2596
15978A83783h4076j6375A5759M82384A58665J40143a16446I1135b38442I4023
15967B23815b27716H2679K19469c23216A14558N913l1367P971J40999A332g8385
15955a48853M0502A10800L2811e1679B8682a35605A79927K49734q2706b07944
15944H4997e892r6426D28984k07101d6475B58159p9660m4687R2713g7158C18253
$$ plain form
16022 99531 -15742 -23483 240867 350161 318484 192782 42214 132562 194124 219223 -36700
16010 144683 77464 -79204 197575 278472 406968 646316 -69034 54028 -400 265658 294877
15999 294877 498951 425203 181828 152873 58362 -177455 317499 -92215 -40364 25691 554143
15988 554143 112495 158773 394042 616523 724830 460284 470733 311898 151187 183783
15978 183783 -84076 -100451 15759 498143 158665 298808 -116446 91135 -238442 94023
15967 223815 -227716 82679 302148 -323216 114558 120471 89104 97075 238074 1332 -78385
15955 -148853 -108351 110800 143611 -51679 28682 -135605 179927 429661 346955 -207944
15944 84997 -5892 -102318 428984 221883 -46475 258159 178499 133812 226525 -77158 318253
15932H286K79122o2303f897A87748a47089c8104j27623g135A97045a8019I8706
15920A33972P4022o3040h4214A21538N388m3687b83743D3820a21268K3404B3718
15908a67696A21773K3018J34204a04306M1471C33308A43998L9196a42499C35984
15897a53788A3281R4119a6099o9664A29888O3295m8792d2883j55551a5450B02988
15885b68329F4541a68922G1746J4998b38924n8138J27375g106k02160C5807K33749
15874B69556C1791a161B42969g0448I8904K77924A0533a84059i1521a3010p3237
15863h6247A59323F2499J10692M9077A02736Q1143b44462b0741B70204M0343A9592
15851A72246K23902a69755B28805a6280A22171E8602c1000l0872C800a17731B3674
$$ plain form
15932 8286 287408 225105 -6897 187748 -147089 -38104 -165727 -7135 197045 -18019 98706
15920 133972 207994 144954 -84214 121538 126926 83239 -283743 43820 -121268 -97864 23718
15908 -167696 121773 144791 278995 -104306 -62835 333308 143998 183194 -142499 335984
15897 -153788 13281 107400 -16099 -85763 129888 193183 144391 -42883 -198434 -15450 202988
15885 -268329 64541 -168922 71746 86744 -238924 -297062 -169687 -7106 -209266 35807 269556
15874 269556 31791 -1161 242969 -70448 98904 376828 10533 -184059 -91521 -13010 -86247
15863 -86247 159323 62499 173191 222268 102736 183879 -244462 -20741 270204 310547 19592
15851 172246 396148 -169755 228805 -16280 122171 58602 -31000 -61872 3800 -117731 23674
15839b491E6715g4098A61386N9128o0592f5066k03668c8353j77493C1034i2928
15827A07871a90525f2203k54320h3096m5228A11957G468P7549f2802C556a91576
15815E1315R4680a07587o939A60400C6365M4764C6683a05146e0893B43750D3584
15803c9821j1936j30902D3037K61331A6528E159g1906a2017G8200J06369b68478
15791A30435e8843c996C07884a10679C202e9909j60652B40364E2397J91526f0531
15779a25022G4165q883b52479d4487A5260K55917C6845a41949C49353d0074j70035
15768b10109h8299D6563a13565l3804F3920b30019B21947M9662h5714J2487k2346
15757i5573K1971a7730j37249B1112J67747c7325E9193M9990D0142a51503b9048
$$ plain form
15839 -2491 56715 -74098 161386 220514 159922 -65066 -268734 -38353 -215846 31034 -92928
15827 107871 -190525 -62203 -316523 -83096 -128324 111957 7468 85017 -62802 3556 -191576
15815 51315 145995 -107587 -114526 160400 36365 81129 36683 -105146 -50893 243750 43584
15803 -39821 -51757 -182659 43037 304368 16528 5159 -71906 -12017 78200 184569 -268478
15791 130435 -58843 -3996 307884 -110679 3202 -59909 -220561 240364 52397 243923 -60531
15779 -125022 74165 65282 -252479 -44487 15260 271177 36845 -141949 349353 -40074 -210109
15768 -210109 -88299 46563 -113565 -147369 63920 -230019 221947 271609 -85714 -73227 -95573
15757 -95573 -73602 -17730 -154979 21112 188859 -37325 59193 109183 40142 -151503 -29048
15745c08557B2159R3906j8899A7822b27900n7478Q8564f6126A40055o757E4641
15733b06652H2441e9846B25234E5709n773g4703q3584N6682n372I7601d1423G4512
15720A68138g3670J473r2087f6391j43107f3009k95623C38354b86346j3654F6318
15708A60564b9117B1924b74092F8913b36525I3075A2700i7687B08688a30001o3525
15697a93526B49060a69935A8014G000J77646a24195C29120F1816i7679k05381
15687c03060G4509L2557a32926C57902j20322d1191K787k1424j05002L8927O0567
15676f5336g371j54986o6369B43048O9127B7245a85349M1129I81h5349j29561
15665b14910i1391q7588B8601J93589a07846A17667e8064n4313L2074A95324a47859
$$ plain form
15745 -308557 22159 116065 97166 17822 -227900 -285378 -196814 -66126 140055 133298 54641
15733 -206652 82441 -59846 225234 55709 49936 -74703 -158287 -101605 -106977 97601 -41423 74512
15720 168138 -73670 -72197 -164284 -66391 -209498 -63009 -358632 338354 -286346 -300000 66318
15708 160564 -29117 21924 -274092 68913 -236525 93075 12700 -97687 208688 -130001 -193526
15697 -193526 249060 -169935 18014 7000 184646 -124195 329120 61816 -97679 -303060
15687 -303060 74509 107066 -132926 357902 237580 -41191 -38404 -59828 -164830 -125903 -65336
15676 -65336 -7371 -162357 -228726 243048 312175 27245 -185349 -144220 981 -85349 -214910
15665 -214910 -91391 -178979 28601 222190 -107846 117667 -58064 -112377 -80303 195324 -147859
15653b13813O3509E3573K3061C441P6660J0118g3351a2492B58838c5775m0011
15642g5786A3600b48544a2619j87014A6201J77447D6400J86630P6173G1980B056
15630b5911B21999c03620a33427G0022b46012k9936Q0023C08881c64233a73126
15619A63111F5326d52953A40393K3373n9747c0223j77442G4905g38j23739q8179
15608b12656c9414l2486e381j60809d656j21063r7513D7395O7966c03037g7988
15596b47487l3162G8127a40812j04278A51773a62492g9002m4261A57189b91848
15585d5832A39244D3803a16470A3166b46793J2562D34075C0411c3656d38p9213
15574g9651J341j04426A71512a24277A07540e3650F3064a40302o099E2881J10692
$$ plain form
15653 -213813 -150304 53573 76634 3441 80101 90219 -73351 -12492 258838 -35775 -75786
15642 -75786 13600 -248544 -12619 -199633 16201 193648 46400 233030 309203 71980 2056
15630 -25911 221999 -303620 -133427 70022 -246012 -275948 -195925 308881 -364233 -173126
15619 163111 65326 -452953 140393 163766 104019 -30223 -207665 74905 -738 -124477 -212656
15608 -212656 -39414 -71900 -5381 -166190 -4656 -125719 -223232 47395 115361 -303037 -77988
15596 -247487 -280649 78127 -140812 -245090 151773 -162492 -79002 -123263 157189 -291848
15585 -45832 139244 43803 -116470 13166 -246793 -234231 434075 30411 -33656 -438 -79651
15574 -79651 -78310 -182736 171512 -124277 107540 -53650 63064 -140302 -146401 52881 163573
15563A63573L85333D6143J46319g5974A36347a29185C7787J54986a2074m8496
15553f0570A47903n439K07788F9563a3389A16541j5275J07260H3603N7156K4417
15542A65176L148H2476c0341D4269J49804I6524d6133J0557A64748c43903A84694
15530F6222d9980j4919A82245d1877o855C19670D8276K61576G090J3931M2593
15519F3614M5630b20158l7007B99341a60682p1117h9929k075A94428a55669e8340
15507b13708B34290a16414K0926A41151g6422A61558b02794Q6783c2421j07604
15497a40025k64365h6240C2631a59887P3435k0518A0263N2473e1446A4086O0700
15486G4786J03405b26961O2520B64436b71935i839A75652a84241h1135D09754
$$ plain form
15563 163573 548906 46143 192462 -75974 136347 -129185 37787 192773 -12074 -60570
15553 -60570 147903 142464 350252 69563 -13389 116541 101266 208526 83603 140759 165176
15542 165176 168324 82476 -30341 44269 194073 96524 -46133 -35576 164748 -343903 184694
15530 66222 -49980 -64899 182245 -41877 -48732 319670 48276 309852 7090 21021 63614
15519 63614 109244 -220158 -257165 299341 -160682 -231799 -89929 -92004 194428 -155669 -58340
15507 -213708 234290 -116414 -95488 141151 -76422 161558 -202794 -116011 -32421 -140025
15497 -140025 -404390 -86240 32631 -159887 -86452 -106970 10263 62736 -51446 14086 74786
15486 74786 178191 -226961 -164441 264436 -271935 -9839 175652 -184241 -81135 409754
15475D06930h274l55513C68241A6090a5583j97130A10396J0984c24281i3112C62964
15463c50997D2923h9591l41887a03858j10460B83260b05285B43454c07883D5847
15452c2600B19431A9697J15547M5952a24120q6035A45123P6522F4249J75925g1648
15440f7602A64184b5921A08517a1233j13051j26691d5827j41651A60654J01375
15430B62029m2323E1942J84307g228B25731A02459J49490b47596A08384N7977
15420A66361i4763k43600E026L6351K64437C1186c14228J48523A37524m7106K14933
15409C05351a51959K6344e6645A46748a35886j72332C0266J8600h7502A94339
15398a69664b1564F9611J42601a47162A83176j0985m9170h8655k4258I8392K91754
$$ plain form
15475 406930 -8274 -363787 368241 16090 -15583 -212713 110396 121380 -324281 -93112 362964
15463 -350997 42923 -89591 -431478 -103858 -214318 283260 -205285 243454 -307883 45847
15452 -32600 219431 19697 135244 181196 -124120 -210155 145123 221645 64249 240174 -71648
15440 -67602 164184 -25921 108517 -11233 -124284 -250975 -45827 -187478 160654 262029
15430 262029 219706 51942 236249 -7228 225731 102459 251949 -247596 108384 166361
15420 166361 -94763 -338363 5026 41377 305814 31186 -314228 -165705 137524 90418 305351
15409 305351 -151959 -125615 -56645 146748 -135886 -308218 30266 48866 -87502 194339
15398 -169664 -21564 69611 212212 -147162 183176 172191 123021 -88655 -112913 98392 390146
15387C90146H5899a402j07327j24491l0245i2568C86406I1433a14034B0634h9460
15375a69931B9497a97430H5769J7643A6044J87815H4681R6506R5923A25712L1766
15364A57478L42611e25A5773J06276J59679c37022D203K21967c43127E7600K45845
15353C03445a28214K5941A73184J20017E0579K29012b18333F3326K76261j46067
15343A93520o3350o1612K59952A04449K1809a2956B47843c94644b1489m2675G8905
15331a47417A10669h0639j72169A42069B2292K50969j15302M058C0391g46A79033
15319A47220K50987m4202j76436J87724b42984B27473a04206C59875i75D9849
15308A33311M365A171N2657k6022K20458D3327c32844B50470j23672b1134h94
$$ plain form
15387 390146 85899 -1402 -108729 -233220 -263465 -92568 386406 91433 -114034 20634 -89460
15375 -169931 29497 -197430 85769 103412 16044 203859 84681 181187 277110 125712 157478
15364 157478 500089 -525 15773 122049 281728 -337022 4203 226170 -343127 57600 303445
15353 303445 -128214 -102273 173184 293201 50579 279591 -218333 63326 339587 193520
15343 193520 130170 68558 328510 104449 126258 -12956 247843 -394644 -21489 -64164 78905
15331 -147417 110669 -80639 -252808 142069 22292 273261 157959 162017 30391 -746 179033
15319 147220 398207 354005 177569 365293 -242984 227473 -104206 359875 -975 49849
15308 133311 137676 1171 53828 27806 248264 43327 -332844 250470 126798 -21134 -894
15296a6407H2100b77251D2914O2285M4854k8258h8927A37619H616h6122j78555
15285b64677J25418b7119A54835b23436A15396j1354J39010a68112m4440c4082
15274G3693K03329C370e1984H328b25638E2312a23300m9281D16718a00104n6788
15263a56892q6207f0432k3863m5487j3937A98468n2970p0428P7846L623J92427
15252C48966j68381O7158j17296N3568b14923j42385D8890b6084D89301j84252
15242C05049D7584J03636J90246g6466K6405B69247H5475J28828M8150A980J43756
15231A45736b34584A62017R726f427A84550m4387d2066q2971B43126H5568C0125
15219C99794j15279j32797e6365B88477a5813j43300p2886E9754J21759A257J73792
$$ plain form
15296 -16407 82100 -277251 42914 105199 150053 121795 -88927 137619 8616 -86122 -264677
15285 -264677 -139259 -27119 154835 -223436 115396 104042 243052 -168112 -212552 -34082
15274 73693 277022 3370 -51984 8328 -225638 52312 -123300 -172581 416718 -100104 -156892
15263 -156892 -243099 -60432 -84295 -129782 -143719 198468 145498 75070 152916 156539 348966
15252 348966 180585 247743 130447 184015 -214923 -357308 48890 -26084 489301 305049
15242 305049 47584 151220 341466 -76466 -50061 269247 85475 214303 262453 1980 145736
15231 145736 -234584 162017 171743 -6427 184550 140163 -42066 -125037 243126 85568 30125
15219 399794 284515 151718 -56365 288477 -15813 -159113 -231999 59754 181513 1257 175049
15208A75049J17473b7509A1657a64230H8965k1944J3269a54913A02329B0240b14537
15196A15926a52337A28085e7545J0926A25216J42642C6421c0393B87636A38995
15185A44850m023D3868N0912J40642N675F8319M14510A87201g1893A69254a23478
15173B61112a34111A84135j5894R1209A26954c15650D3260j6291a43142A3233
15162a30984q8175A10190J70549D3286J93642h1989A97051d3049B48950A09615
15151A16059J95021q6537d8116o6272A40139b36852H108c7694H2891N0125n2788
15140H0228a5890j32941I1760K95053A18687L7679N715f3239A48195E7239i561
15128H0205q750L17615A03778l031K22704I0987k6682P5147L4640J04482j02249
$$ plain form
15208 175049 292522 -27509 11657 -164230 88965 67021 80290 -154913 102329 20240 -214537
15196 115926 -152337 128085 -57545 -46619 125216 267858 36421 -30393 287636 138995
15185 144850 140827 43868 94780 235422 241097 68319 482829 187201 -71893 169254 -123478
15173 261112 -134111 184135 168241 259450 126954 -315650 43260 26969 -143142 13233
15162 -130984 -219159 110190 280739 43286 236928 -81989 197051 -43049 248950 109615
15151 116059 311080 224543 -48116 -114388 140139 -236852 8108 -37694 82891 133016 80228
15140 80228 -15890 -148831 91760 386813 118687 156366 162081 -63239 148195 57239 -9561
15128 80205 71455 389070 103778 100747 323451 90987 64305 139452 174092 278574 176325
15117A76325H5007J618K64299g9500B78588e4078A07156N383O9470a22731B02711
15105a73686f9042D4551L96947A53669B8505a89876A1884J23104E8765K90273
15095C49038J58170H6486g1541H5118j1787A4686J14040a64392I3248O8919J25382
15084B87549D1228d2818j15123E68439B09036N399f7887j00981M8176B72527o6977
15073B05550l3884b5016F1360L68250A26944p423C8366h1776j28258C98353A22653
15061A05413J79591A18599a7018G0997k2011N32642A24548j8806g9186n0811C14985
15049A32132K0891K24714j62406H4240J68871a32568A85463i1820A14508M93262
15039F07770k24415e0206A76017E2397O5265l1183A1316J10770N02090k25715
$$ plain form
15117 176325 85007 86625 350924 -79500 278588 -54078 107156 112539 182009 -122731 202711
15105 -173686 -69042 44551 441498 153669 28505 -189876 11884 134988 58765 349038
15095 349038 507208 86486 -71541 85118 73331 14686 128726 -164392 93248 162167 287549
15084 287549 41228 -42818 -157941 568439 209036 214435 -67887 -168868 -120692 272527 205550
15073 205550 171666 -25016 61360 429610 126944 119521 38366 -81776 -210034 398353 122653
15061 105413 285004 118599 -17018 70997 48986 581628 124548 105742 -79186 -129997 314985
15049 132132 153023 377737 215331 84240 253111 -132568 185463 -91820 114508 607770
15039 607770 383355 -50206 176017 52397 117662 86479 11316 122086 624176 398461
15029C98461A39483k7536k7777K33825J27277I9017J58601D194J92840J84293
15019C81327I648L4047L2425K14783r5534p9747J59526K1327j10220J33999l2696
15008B87558p9072N5345Q4241J50325C6095J62921J78862q8587r0519a79317B1665
14996E41821k37582c3923C31139K34635k33872k2452J11966j91877A03012c8024
14985A99124o5403L20346A59468K41541A52737O685E9540R1719J71641l2067O8635
14974C59468j8420D09M79323K7591D2658O4320Q1997J04385Q0205A70917J43486
14963C14403j13993K35720R2882A39630L9982N0700J31040A41810J13385P2923
14953C28118N9258j76461B7880K70626p9260L2065J28009p7614J29319j29328
$$ plain form
15029 398461 139483 111947 84170 317995 445272 99017 257618 4194 197034 381327
15019 381327 9648 43695 76120 290903 195369 115622 275148 296475 186255 320254 287558
15008 287558 208486 263831 348072 498397 36095 199016 377878 289291 198772 -179317 21665
14996 541821 304239 -33923 331139 565774 331902 309450 421416 229539 103012 -38024
14985 199124 133721 454067 159468 401009 152737 159422 59540 151259 322900 290833 359468
14974 359468 341048 409 479732 507323 42658 106978 188975 293360 373565 170917 314403
14963 314403 200410 436130 529012 139630 179612 230312 361352 141810 255195 328118
14953 328118 387376 210915 27880 298506 219246 251311 379320 301706 431025 301697
14943C01697J01869J1062J17116A10631K16019j08773b31332C40232j16502p0170
14933A53560K19945K29069k46325m6332L07713B74146J18203k3595J47892K53521
14923G70167j34257B37087L94332j27788k8828K12009j49523L10354J04070k51975
14913F99738j65665j40876J67344k0450R6737k53863N7996Q4600k31375n078N13993
14902H03101C04296N1240R6040j15208K16232B18967l9194K52897J10643j4937
14892E28376B29623K61574A03137d0345B05020g958C27018K91375Q2848k39797
14882D61444a1415E73917j27556j14596L54113B98068K68672A99349H7083J94735
14872B81818m7913m2257K4241M39064j0882j72209j6416j47874o7862L12514k632
$$ plain form
14943 301697 403566 414628 531744 110631 326650 217877 -231332 340232 223730 153560
14933 153560 373505 602574 356249 309917 617630 274146 392349 368754 516646 770167
14923 770167 635910 237087 631419 503631 474803 686812 537289 847643 951713 699738
14913 699738 534073 393197 560541 540091 636828 382965 440961 525561 294186 289108 803101
14902 803101 304296 355536 451576 336368 552600 218967 179773 432670 543313 528376
14892 528376 229623 491197 103137 -40345 205020 -7958 327018 618393 701241 461444
14882 461444 -11415 573917 446361 331765 685878 298068 566740 199349 87083 281818
14872 281818 233905 191648 215889 654953 644071 471862 455446 307572 239710 552224 549592
14861E49592m1909a6397F00308A29893O4250J33314K47268A83041J23442J34503
14851D40986Q7796k06101j41890K20645O7774Q1660j92248K8048L13682B06754
14840A87436L9457J0490J34457K06238J5415j24091M10064l83326K33268r9951
14830F29457J48190B28941P6770K68458j58133N7895J43070j13942B48724M12466
14820F61190j18237k36652K43933J867B2257M77397J09460k78327M0145L77587
14810G48519k02188j20579N4293j24147M8539R8097B36427K65357q8549K23845
14800F37080k67066A78028J35710H4823L46488N9086J7046j52966M2750j09186
14790B88041O30819m57308J63293B36723K01799L31292q9723j47156j34527N9355
$$ plain form
14861 549592 507683 -16397 600308 129893 194143 327457 574725 183041 306483 440986
14851 440986 528782 322681 180791 401436 469210 550870 358622 386670 700352 206754
14840 187436 226893 237383 371840 578078 593493 469402 879466 496140 729408 629457
14830 629457 777647 228941 305711 574169 416036 473931 617001 503059 248724 661190
14820 661190 542953 306301 550234 552101 22257 499654 609114 330787 370932 748519
14810 748519 546331 425752 480045 355898 404437 502534 236427 501784 413235 637080
14800 637080 370014 178028 313738 84823 431311 490397 507443 354477 397227 288041
14790 288041 918860 461552 624845 236723 438522 769814 680091 532935 398408 457763
14780D57763L21616l326C40751J04080k8766m7422M6634N1486R4299j45873j40942
14769B74247L94215k34665J2165K07314R0524l19939J14501N693j21949O6306
14759D88412K10405j90794J29773C13140O4356R1146j35756K83935k0942k57911
14749C37968N9609p5540K20643L83649k04970K589n9912q4789O567j86906Q0575
14738D79483L59995j67529J08015Q4036L08139k08521k14833k48810M42732m424
14728I38283j15993j34896o4491J59846l1292J59995l40558M79454m94216Q3694
14718F39826M61590l87924l10866O39959l00562o7122l9141J18658L3908r9590
14708F88736J4486j25070Q2784J84701r3372M7412l9240J45115j56242J32255
$$ plain form
14780 457763 779379 776053 340751 444831 416065 368643 415277 466763 561062 415189 274247
14769 274247 668462 433797 445962 653276 743800 423861 538362 544055 422106 488412
14759 488412 698817 508023 637796 313140 377496 468642 332886 616821 595879 337968
14749 337968 397577 322037 542680 926329 721359 723948 664036 579247 585814 398908 479483
14738 479483 839478 671949 779964 864000 1172139 963618 748785 499975 942707 938283
14728 938283 822290 687394 622903 782749 751457 911452 570894 1050348 556132 639826
14718 639826 1101416 713492 402626 1042585 742023 674901 635760 754418 788326 688736
14708 688736 703222 578152 660936 845637 752265 799677 760437 905552 749310 881565
14698H81565l15675K78593o5940L63380l47763K781J36025K4858m25840K08389
14688G40373M8867J10904k36757L25239q1909J21726k33333J32399j58008k00569
14678E68932N4654K13754P0167P3445r3316j34175k3134K2973o8726K46042R9147
14667A029763l84215L03563J66415q3559j77187L33716l61990o8601K99349j79493
14657H77761p1131K6210J65739J86144r3359r9528J32148m81509M36543k11919
14647H67099J85088p4706M20301n72456K38160r1381j82263N34015l23413k14828
14637G85616M74548m98121M84097j17960j41817o3186J35581l21684L61061J22860
14627A220995q1004J72393k20117j79948J55400J26114P2516k32353q0757J0302
$$ plain form
14698 881565 565890 844483 778543 1141923 794160 796941 932966 957824 531984 740373
14688 740373 789240 900144 663387 988626 906717 1028443 795110 927509 769501 568932
14678 568932 623586 837340 907507 980952 887636 753461 730327 753300 684574 930616 1029763
14667 1029763 645548 949111 1115526 1031967 854780 1188496 826506 757905 1057254 877761
14657 877761 806630 832840 998579 1184723 1091364 991836 1123984 642475 1079018 867099
14647 867099 1052187 977481 1397782 825326 1063486 972105 789842 1323857 1000444 785616
14637 785616 1260164 762043 1246140 1128180 986363 923177 1058758 737074 1098135 1220995
14627 1220995 1139991 1312384 1092267 912319 1067719 1193833 1266349 1033996 953239 963541
14617I63541J75663J69051J1734N8191p2227J18044m75005M06945Q154j18744
14607A245347j75598K58113r1638K26028k0479M8329m11878M16968K6337L7359
14597A558888K386p1199k8532K11546j72893J58653l56468J31383N6836j04740
14587A385860O1702p4120K47623J74036m35848m708M16101K21948k74874j8782
14577A698938k70370L24806k28407N57496l57976K25525m36480L06298k65974
14568A553856N02468L67925l05662O2290k2798l8042j61405J37856q4829N18363
14558B530022k5253K95138j50097M89098O1095K78974M17425M74338J502657J997177
14548G870574L647740N847480J0010699K366274j2048372q037859m134751j646264
$$ plain form
14617 963541 1139204 1308255 1319989 1378180 1305953 1423997 948992 1355937 1364091 1245347
14607 1245347 1069749 1327862 1236224 1462252 1441773 1490102 1078224 1495192 1521529 1558888
14597 1558888 1561274 1490075 1461543 1673089 1500196 1658849 1302381 1433764 1490600 1385860
14587 1385860 1447562 1373442 1621065 1795101 1359253 1354545 1770646 1992594 1717720 1698938
14577 1698938 1428568 1753374 1524967 2082463 1724487 1950012 1513532 1819830 1553856
14568 1553856 2056324 2424249 2118587 2180877 2158079 2120037 1958632 2096488 2011659 2530022
14558 2530022 2504769 2799907 2649810 3138908 3200003 3478977 3896402 4370740 5873397 7870574
14548 7870574 11518314 17365794 27376493 29742767 17694395 9656536 5521785 3875521
14540C875521p59308m05781k33299m25760K09206j03944k33088J0437j21845r2226
14530A719913M45272k56808M63J18412l3799R641K53719m00015M12727j39884
14520B129641M7749n1486M91560k57593j24455J7874J27351m9579l15251L0437
14510B046248M52582k62700J53574P8222J66270j90230L01244j28479o7425R9124
14500B648430n0860K32775l00934Q9424K00001J8099j24192K3769k74420M83777
14490B945869M4472J0581M63534o21396M62294n9052j51909P1241q4449q0998
14480C000187R1813L52776k39048n8632Q7977J97249j16614o170K15948J70758
14470C696244k93329K19116J89227j06433J52457J91418r9985J26307K37104m23655
$$ plain form
14540 3875521 3116213 2710432 2477133 2051373 2260579 2156635 1923547 1933984 1812139 1719913
14530 1719913 2165185 1908377 1908840 2027252 1993453 2003094 2256813 1856798 2269525 2129641
14520 2129641 2177390 2125904 2617464 2359871 2235416 2253290 2380641 2331062 2015811 2046248
14510 2046248 2498830 2236130 2389704 2467926 2634196 2443966 2745210 2616731 2549306 2648430
14500 2648430 2597570 2830345 2529411 2618835 2818836 2836935 2712743 2736512 2462092 2945869
14490 2945869 2990341 3000922 3464456 2843060 3305354 3246302 3094393 3165634 3081185 3000187
14480 3000187 3092000 3444776 3205728 3147096 3235073 3432322 3315708 3309538 3525486 3696244
14470 3696244 3402915 3622031 3811258 3704825 3857282 4048700 3948715 4075022 4312126 3888471
14460C888471L03314L73649n67062l4385L30955r639J0418K68409q4902j8P1909
14449D551119N8881K99167k72420p2330L14302j6323J34471L0700K10867k23549
14439E014885O20226k96211r3702L39224r2927J98761j41713p7208m5689J69724
14429E595370Q2854K86625M8906l8699M63800j03778k14731L22141J06905o7361
14419F482032K11470L03214j75172M80159q0416L6429J17466J98962l4952Q8203
14409G627395J66679k70068M47547R9916J87569L42804j07408K16958K80590j05583
14399H886399N68510k02452n2055L29932J60236K31039O1230K00404J66690K16661
14389A0566594J6558L97307L2106L89074j6118K78130j23216O12636j88157N06916
$$ plain form
14460 3888471 4191785 4565434 3998372 3963987 4294942 4285303 4295721 4564130 4479228 4479210 4551119
14449 4551119 4610000 4909167 4636747 4564417 4878719 4862396 4996867 5027567 5238434 5014885
14439 5014885 5635111 5338900 5245198 5584422 5491495 5690256 5548543 5471335 5425646 5595370
14429 5595370 5678224 5964849 6013755 5975056 6438856 6335078 6120347 6442488 6549393 6482032
14419 6482032 6693502 6996716 6821544 7301703 7221287 7257716 7375182 7574144 7539192 7627395
14409 7627395 7794074 7524006 7971553 8071469 8259038 8601842 8494434 8711392 8991982 8886399
14399 8886399 9454909 9252457 9200402 9530334 9690570 9921609 9982839 10183243 10349933 10566594
14389 10566594 10583152 10980459 11012565 11401639 11385521 11663651 11540435 12153071 11964914 12471830
14379A2471830N98015l17932N25786K20661o6770R23114L3953K82882K85501K94031
14369A5251071K42088N54439K97971L5194M51220J60625J18966Q07829N25494
14360A8444897J64617N89815N46686Q7981N73880P98181K40026N11481O65205
14351B2622769L63787O56600N09254N99957L13532Q13070J125610L97393L52088
14342B7754060J016665O81677J065515O30799R37393J093425Q17677N61734J512833
14333C6071778R03942J204737Q40788J515577J324622J253839J483779J213081
14325D5812143J845646J255779J709051J845384J770163K121647K164633K087607
14317F0612053J947862K658006K676377K544526K635110L015803L179593L335366
$$ plain form
14379 12471830 13069845 12751913 13277699 13498360 13431590 14354704 14388657 14671539 14957040 15251071
14369 15251071 15493159 16047598 16345569 16380763 16831983 16992608 17111574 17919403 18444897
14360 18444897 18609514 19199329 19746015 19833996 20407876 21206057 21446083 21957564 22622769
14351 22622769 22986556 23643156 24152410 24752367 25065899 25878969 27004579 27401972 27754060
14342 27754060 28770725 29452402 30517917 31148716 32086109 33179534 33997211 34558945 36071778
14333 36071778 36975720 38180457 39021245 40536822 41861444 43115283 44599062 45812143
14325 45812143 47657789 48913568 50622619 52468003 54238166 56359813 58524446 60612053
14317 60612053 62559915 65217921 67894298 70438824 73073934 76089737 79269330 82604696
14309H2604696L418339L586281L997703M288844M268635M732290N043500N119804
14301A17060092N826007N703688O749116O503384O949733P684023Q002506Q356746
14293A72835295R023854R753586J0214794J0478464J1075064J1854731J2434945
14286B47670733J2634964J3039349J3995058J3901602J4556371J4575479J4483514
14279C44857070J4452808J3790896J3230286J2328891J0787963Q672499O082649
14272D24203062L030015J942367J270624m19126l479478n181983o376928q535776
14264D06452777j0331624j1639984j2361535j3176383j3396336j4665066j4559979
14257C16321870j4354863j4293401j4189051j3652445j2653867j2654739j1870080
$$ plain form
14309 82604696 86023035 89609316 93607019 97895863 102164498 106896788 111940288 117060092
14301 117060092 122886099 128589787 135338903 141842287 148792020 156476043 164478549 172835295
14293 172835295 181859149 191612735 201827529 212305993 223381057 235235788 247670733
14286 247670733 260305697 273345046 287340104 301241706 315798077 330373556 344857070
14279 344857070 359309878 373100774 386331060 398659951 409447914 418120413 424203062
14272 424203062 427233077 429175444 430446068 430026942 426547464 421365481 414988553 406452777
14264 406452777 396121153 384481169 372119634 358943251 345546915 330881849 316321870
14257 316321870 301967007 287673606 273484555 259832110 247178243 234523504 222653424
14250B22653424j1428566j1058703j0009259r707326q781578q844638p734981
14243A55088373p324930p224168p017945o101886o070446n384733m870504n235679
14235A05858082m590607m485316l921603m081595l162791l355052l563810l027291
14227G5670017l211762k829561k458650k572479k274944k538157j751915k159611
14219E5872938j744026j841896j914899j483290j762579j357023j329134j780858
14211D2659233j049259j318935j277444j050787j109136q06498j183454r16864
14203C3946856j163152q75679n53597n08594j481812m45096q88199n27840p85027
14194B6717860m16353o78768q30641m20770q18237q43273q25896N3432q05203
$$ plain form
14250 222653424 211224858 200166155 190156896 180449570 171667992 162823354 155088373
14243 155088373 147763443 140539275 133521330 127419444 121348998 115964265 111093761 105858082
14235 105858082 101267475 96782159 92860556 88778961 85616170 82261118 78697308 75670017
14227 75670017 72458255 69628694 67170044 64597565 62322621 59784464 58032549 55872938
14219 55872938 54128912 52287016 50372117 48888827 47126248 45769225 44440091 42659233
14211 42659233 41609974 40291039 39013595 37962808 36853672 36047174 34863720 33946856
14203 33946856 32783704 31908025 31354428 30845834 29364022 28918926 28030727 27502887 26717860
14194 26717860 26301507 25622739 24792098 24371328 23553091 22709818 21883922 21937354 21132151
14185B1132151o5111m50819n56821p48082j04755o20903j56978n47656l53427
14176A7527599l25698n60469j20884n84673j73904n28944m96511J39345n01805
14167A4374056J55397o97540J30086m74117k71735o24348M9962L4341k13842j84765
14157A2277495q5070m02028l80201o7022j20100l22058J5146m07682j34698l65436
14147A0008346K614j14208M4445m64432j39849j61259j53916L2855o9955m35861
14137H548780r9936L30802r2661n66897K33632k18199m22070k34263K23608k11153
14127G491643Q736l3451k65187k41743k16107L73809j44506l51144L39009n04143
14117F456916M5112j58175j2062k88412K88595l18166J62592n9683m78367Q6898
$$ plain form
14185 21132151 21067040 20616221 20059400 19311318 19206563 18585660 18428682 17881026 17527599
14176 17527599 17201901 16641432 16520548 15935875 15761971 15233027 14736516 14875861 14374056
14167 14374056 14529453 13831913 13961999 13487882 13216147 12591799 12641761 12676102 12462260 12277495
14157 12277495 12192425 11790397 11410196 11343174 11223074 10901016 10916162 10508480 10373782 10008346
14147 10008346 10010960 9896752 9941197 9476765 9336916 9175657 9021741 9054596 8984641 8548780
14137 8548780 8448844 8779646 8686985 8120088 8353720 8135521 7713451 7479188 7702796 7491643
14127 7491643 7500379 7466928 7201741 6959998 6743891 7117700 6973194 6622050 6961059 6456916
14117 6456916 6502028 6343853 6331791 6043379 6331974 6013808 6176400 6116717 5638350 5725248
14107E725248r2589L24671k03156m33771K30839k58648j2598j80217J70397j74149
14097E096027J40309m24141M3318J66699j12201l80535P3766K54399l10066J32964
14087D680539l2496j2646k74947p1053j45975J61693L3994k23676k8400L02155
14077D389188k88422R1469n98951J30807L02913j66974l7733k00212R7426k0670
14067C698841L0537M2697k03089j30701O04372o86841O8832M43287m40727J69383
14057C596591m75927j74451L67617J65743l37478k5245M2560n2907k42041K05257
14047C069719m1751J0171J8454k4163k5506q1748K8698L46405o80238R4824J44127
14036B858992k29781L61470m23181Q3810J0863j64840K63987j32447K9443l45285
$$ plain form
14107 5725248 5632659 5957330 5754174 5320403 5551242 5292594 5279996 5099779 5270176 5096027
14097 5096027 5236336 4812195 4855513 5022212 4910011 4529476 4603242 4857641 4547575 4680539
14087 4680539 4648043 4635397 4360450 4289397 4143422 4305115 4339109 4115433 4087033 4389188
14077 4389188 4100766 4192235 3593284 3724091 4027004 3860030 3822297 3622085 3719511 3698841
14067 3698841 3729378 3772075 3568986 3438285 4042657 3355816 3424648 3867935 3427208 3596591
14057 3596591 3120664 2946213 3313830 3479573 3142095 3116850 3159410 3106503 2864462 3069719
14047 3069719 3027968 3038139 3056593 3032430 3006924 2925176 2953874 3300279 2620041 2714865 2858992
14036 2858992 2629211 2990681 2567500 2651310 2662173 2497333 2761320 2628873 2658316 2313031
14026B313031K9907m5118L33462l16150J00037l61150J12569m7692M42238l33244
14016B227890j1325k20012L9355M18778q97622N77502Q2719r1452J01656j59190
14006B068299j13664l5349n2843J49812j70126J35686j65136k62857K62766L28364
13996B144952j61480l58298L26925k2401M00437L70941L80311J426535K492667
13987G000589M769581R892860R248149p878932q952643m809203k512937j730729
13979E026735p04922k73806q16032k81207l50714J47548m23177J05940l10743
13970B119622L30548l29262J87389j79354j06881k55976M90133j21253q6574l95676
13960A652716L6292Q2141r3210k33038K54642K04546n0429k30566P9104M3527
$$ plain form
14026 2313031 2342938 2297820 2631282 2315132 2415169 2054019 2166588 2118896 2561134 2227890
14016 2227890 2216565 1996553 2035908 2454686 1557064 2134566 2217285 2125833 2227489 2068299
14006 2068299 1954635 1919286 1866443 2016255 1846129 1981815 1816679 1553822 1816588 2144952
13996 2144952 1983472 1625174 1952099 1929698 2330135 2701076 3081387 4507922 7000589
13987 7000589 11770170 21663030 30911179 23032247 14079604 9270401 6757464 5026735
13979 5026735 4321813 4048007 3231975 2950768 2600054 2747602 2324425 2430365 2119622
13970 2119622 2450170 2120908 2308297 2128943 2022062 1766086 2256219 2134966 2048392 1652716
13960 1652716 1689008 1771149 1677939 1444901 1699543 1904089 1853660 1623094 1702198 1745725
13950A745725N6044o6535j59327r6417L599Q9813j41799K902j07568K40114l88693
13939A177858O24575j63562l34451J14435K41842m34286J96167K42827m23446
13930A241959L24244p79j0422l90264M44648j47309k61338J16381k19844K8992
13920A126268K88364k79037j5031j06549Q9900J16351J15137k0972j89771R8527
13910A223187k44120j08727J89849J22022J12240Q0551j20474j3008j1514j66130
13900A063876j29202J35571k1324K08917j97496k0574k16673J38599R0078P6847
13890A128619J27562n26544L42529O5982j52757K8994K04945J3603l23581q874
13880I00478p239K6889l6129K0897J31235j16074j88490K00339q4389q9953J78140
$$ plain form
13950 1745725 1801769 1735234 1575907 1479490 1483089 1572902 1431103 1434005 1326437 1566551 1177858
13939 1177858 1802433 1638871 1304420 1418855 1660697 1226411 1422578 1665405 1241959
13930 1241959 1566203 1565424 1555002 1164738 1609386 1462077 1200739 1317120 1097276 1126268
13920 1126268 1414632 1135595 1120564 1014015 1103915 1220266 1335403 1314431 1124660 1223187
13910 1223187 979067 870340 1060189 1182211 1294451 1375002 1254528 1241520 1230006 1063876
13900 1063876 934674 1070245 1048921 1257838 1060342 1039768 823095 961694 1051772 1128619
13890 1128619 1256181 729637 1072166 1138148 985391 1014385 1219330 1232933 909352 900478
13880 900478 893239 920128 883999 904896 1036131 920057 731567 931906 847517 757564 935704
13869I35704J52749j65993R4751m59386O73753l33872J36303K59112k72612l03951
13859G16558j10284M6975M79309m24033J72167j1025j45828L0659K40175l35219
13849F59454K20653K34411l91885J51115K12970k00010J16902p3225k12452K3848
13839G41781j11865M64237m96100R8003L48000j97886q9607J9187m7238K68698
13829I97210k69462M24103j96785j30891J05034l3720j42858L42152D61232K22200
13819F83432r0053M1476J67357l67224M13172k97217L25465j98671m5902K19198
13809H51033j73609j81522Q9813L37841m29313J4964K25720j16520O8231k00366
13799D86272J18868J9848M29661k91250R0591k68268K44026l66997K74612j69911
$$ plain form
13869 935704 1088453 922460 1017211 557825 1231578 897706 1034009 1293121 1020509 716558
13859 716558 606274 653249 1132558 708525 880692 869667 723839 754498 994673 659454
13849 659454 880107 1114518 722633 873748 1086718 886708 1003610 930385 717933 741781
13839 741781 629916 1094153 598053 696056 1044056 846170 756563 775750 728512 997210
13829 997210 727748 1151851 955066 824175 929209 895489 752631 1094783 461232 683432
13819 683432 593379 634855 802212 434988 848160 550943 876408 677737 631835 851033
13809 851033 677424 495902 585715 923556 494243 509207 734927 618407 686638 486272
13799 486272 605140 624988 1054649 763399 853990 585722 829748 462751 737363 567452
13789E67452K14153k28487J39101k17850J43036M4640A88919L19520j24814K21487
13779F05112J01021j05118J30300k19699o0521K42627K2525B32546M1377N52545
13769H26468k65344N6707N2089L7889j46105R9601k46342r1646L54079k51856
13759D25540q5810J73958L38270j44557l07669R1444J4600q4879J89248j58758
13749D51387o7305J46986J20997l5972L35561m34768j59862L3187J42374l0196
13739E02389r4344M8792p7433J51444L5737A85334L13922o5353J03753j03813
13729D33843r5462J84047k1050J74753B95205L30781J20421p9938J09266C31515
13718B56319K90218J48192k85057K57603k71069j51556J64690R4614N1427k30941
$$ plain form
13789 567452 781605 553118 692219 474369 617405 662045 188919 508439 383625 605112
13779 605112 706133 601015 731315 511616 451095 693722 716247 232546 273923 826468
13769 826468 561124 617831 669920 707809 561704 661305 414963 323317 677396 425540
13759 425540 339730 513688 851958 707401 399732 491176 505776 420897 610145 451387
13749 451387 384082 531068 652065 616093 951654 516886 357024 390211 532585 502389
13739 502389 408045 456837 379404 530848 566585 185334 499256 433903 537656 433843
13729 433843 338381 522428 501378 676131 295205 625986 746407 666469 775735 331515
13718 256319 546537 694729 409672 667275 396206 244650 409340 503954 555381 324440
13708C24440J13066J19021j73757J22239k26984k9975N00656j91760j23807n1663
13698C81476r6393j3757J22555K50323p621k17468J70393C5824L33779K57586
13688F27189k88409M1504L21219k38947l1533J22495I9539J68535K75713o956
13678E36831j40188J53495p0524R180j25049K914J57632j70544A43658L93599
13668E37257j16562N9284j23469J22393n0234k01516j08065J35347M5335k109
13658B97661j26824K11905J88839Q3996A70969K4397J77728j8240K01118m6207
13648E09765A84897k03J02985K52878k35898m5428R9231j07637K37281o1274C9843
13636A46281P0907n3561K83614A57921J10376l7501K69703k21234L84999a4163
$$ plain form
13708 324440 437506 556527 382770 505009 278025 248050 748706 556946 433139 381476
13698 381476 285083 271326 393881 644204 636583 419115 589508 35824 369603 627189
13688 627189 338780 380284 701503 462556 431023 553518 99539 268074 543787 536831
13678 536831 396643 550138 479614 488794 363745 366659 524291 353747 143658 537257
13668 537257 420695 479979 356510 478903 428669 227153 119088 254435 299770 297661
13658 297661 170837 382742 571581 655577 170969 195366 373094 354854 555972 509765
13648 509765 184897 184694 287679 540557 304659 259231 358462 250825 488106 426832 39843
13636 146281 217188 163627 447241 157921 268297 230796 500499 279265 664264 -14163
13625B83239l4545H5782K74031j69766K10248A50701K05751q8010j24628J99694
13615C43508I4762K82193A51842L36389l0951j14952c6783C22026J11447O2628
13605D96101B24852J90382j61070H2841Q9897K57060o8280f9343n0180F41492
13594C12983j38293G7712K83109A79162J83381j31543J07457C7745M44538B16010
13583B81135k2972A09327c5071E88576k32724j9978R3251l5311A39355J22361
13573B61716J19119A04549J64303L7076E9406K2938k9935K05587m1077J55334
13563C72253L499A50490J75440I7103e049D99626B08280J83025o8575D8282K53241
13552C01523L042B8334M78060j23966r6482M2280A42430P7755l2617J50613J4821
$$ plain form
13625 283239 248694 85782 359813 190047 400295 150701 356452 268442 143814 343508
13615 343508 94762 376955 151842 488231 457280 342328 -36783 322026 433473 496101
13605 496101 224852 415234 254164 82841 172738 429798 361518 -69343 -119523 641492
13594 312983 174690 77712 360821 179162 362543 231000 338457 37745 482283 216010
13583 281135 258163 109327 -35071 588576 355852 335874 429125 393814 139355 261716
13573 261716 380835 104549 268852 305928 59406 82344 52409 257996 216919 372253
13563 372253 375752 150490 325930 97103 -5049 499626 208280 391305 322730 48282 301523
13552 301523 304565 28334 506394 382428 285946 328226 142430 220185 187568 338181 353002
13541C53002H7201K11544k9213R6008o8554O6248A30001N86235C51863J7897j82915
13530A86845I416O60703k29353j2420j60263J33811A18478J94433A52769K15474
13520C68243f4158C58289p8747p9966L29166B59072e8381D71206B17921f4965
13509D26118p1726j59613D2186L1159C0909L51971A3636K27557D5964K86147N1061
13498C83172G9867J63419K38570A42522I868a04990H6609J29907H6844J81196
13488B68040l607L0477L56268A76913N5223R7127A42556O8585I1240L58922j39776
13477C10386c0272A13729K47392j58356L4340a53720C10494j32281D8687a42075
13466B17799q8756a39D0037J82967C7462M32327A42698c45872A03222M7364K35816
$$ plain form
13541 353002 87201 298745 269532 365540 296986 363234 130001 716236 351863 369760 186845
13530 186845 9416 670119 440766 428346 268083 401894 118478 312911 152769 368243
13520 368243 -64158 358289 279542 199576 528742 259072 -58381 471206 217921 -64965
13509 426118 354392 194779 42186 73345 30909 382880 13636 241193 45964 332111 383172
13498 383172 79867 243286 481856 142522 9868 -104990 86609 216516 86844 268040
13488 268040 264433 294910 651178 176913 232136 329263 142556 211141 91240 450162 310386
13477 310386 -30272 113729 361121 202765 237105 -153720 310494 178213 48687 -142075
13466 217799 129043 -139 40037 223004 37462 469789 142698 -345872 103222 150586 386402
13455C86402D7828R7677L06024f5844J5073A81398a67556r756B03836J28269b25870
13443C63841I8278g4130A44947J43183P498a34431A09024D9414J46483o2639L0372
13432A63630l7400k8286C9153J21322J54974A02017a2237A75928n6654O5565J63328
13421C48167J32328F0462B8824N8761J25078j6244c9016B22083J55568e8400O178
13410e2222G4564K46337b56331C12368J7113o2940E8111O2995B2257J61634m008
13399A79883a04377C58354A48847K38161F5868c66E9329J09014F7138b91036B23090
13387h732l1570A8288L83498F738K83738D3965e6717j45072B22092K81422b73812
13375A41431a92285c3453D07200j19968M0660j52945E6719K13000m8069C5509
$$ plain form
13455 386402 47828 145505 451529 -65844 -50771 181398 -167556 -177312 203836 332105 -225870
13443 363841 98278 -74130 144947 288130 295628 -134431 109024 49414 195897 133258 163630
13432 163630 126230 97944 39153 160475 315449 102017 -12237 175928 119274 184839 348167
13421 348167 480495 60462 28824 87585 212663 196419 -39016 222083 377651 -58400 -52222
13410 -52222 74564 320901 -256331 312368 329481 266541 58111 121106 22257 183891 179883
13399 179883 -104377 358354 148847 387008 65868 -366 59329 168343 67138 -291036 223090
13387 -8732 -40302 18288 401786 6738 290476 43965 -56717 -201789 222092 503514 -273812
13375 141431 -192285 -33453 407200 287232 327892 174947 56719 269719 221650 35509
13364B81102j8470C3741M57133g2875A51963m0130n0213R5205G3305j9517K4268
13353G8056J01895J8553a32306b7119C46033A3528b2484A47435J04439J04311
13343C56185a66777D95269F5056J30011N7813E8167j672J63170b5112B10161J65127
13332C75288j37800i0907A71416L4554J68738o9477j41640E6031a77964A71131
13321c0551A77946E0275J06704d5128A72301m1115a52055B65717C2482K43746
13311B76228I1770h7151d680F7339A1044L45244C8013K18011Q3607F1171N1425
13300A12596l1131L70818A38352L1553K23181C5005K54761r4890b48182C79830
13289D12474A578a19866c8037C5396a79126C1172J40639m1631L1120G5391J70401
$$ plain form
13364 281102 262632 33741 490874 -72875 151963 111833 61620 156825 73305 53788 78056
13353 78056 179951 198504 -132306 -27119 346033 13528 -22484 147435 251874 356185
13343 356185 -166777 495269 65056 195067 252880 58167 56495 219665 -25112 210161 375288
13332 375288 237488 -90907 171416 205970 374708 305231 163591 56031 -177964 171131
13321 -30551 177946 50275 156979 -45128 172301 131186 -152055 265717 32482 276228
13311 276228 91770 -87151 -4680 67339 11044 356288 38013 256024 339631 61171 112596
13300 112596 81465 452283 138352 169905 393086 35005 289766 194876 -248182 379830
13289 412474 1578 -119866 -38037 35396 -179126 31172 171811 130180 161300 75391 245792
13278B45792q2617f0885A63917C3969b48237A34054a8511C85501a5698B69659
13267C03542f3790A68870a214A15648D7389M3016J80811B5250J00656F1235L5805
13256I7040d2087C45532e9696n5011G1649e7149l159B26812M1440J6564A03180
13244A13168m0254a29457j4622e9899A68387J1010C5003K96579e8539k1430l9653
13233a19622H0398a14469C75329j76619K12517A77576b62932E83496a14232C4233
13222B32776f4361j26721g2267g769C2283J85233J01732j38700J92029i023j85854
13211a94877B99219b70179A34696L0527E7547b06373e8537B19539a18140E0586
13200f0978A17966C0220C67c8717j52038A77241i8796J3469A50892n8978c54443
$$ plain form
13278 245792 163175 -60885 163917 33969 -248237 134054 -18511 385501 -15698 269659
13267 303542 -63790 168870 -1214 115648 47389 90405 271216 25250 125906 61235 97040
13256 97040 -42087 345532 -59696 -114707 71649 -57149 -60308 226812 268252 284816 103180
13244 113168 72914 -129457 -144079 -59899 168387 179397 35003 331582 -58539 -79969 -119622
13233 -119622 80398 -114469 375329 198710 411227 177576 -262932 583496 -114232 34233
13222 232776 -64361 -191082 -72267 -7769 32283 217516 319248 180548 372577 -9023 -194877
13211 -194877 299219 -270179 134696 165223 57547 -206373 -58537 219539 -118140 50586
13200 -60978 117966 30220 367 -38717 -190755 177241 -98796 -85327 150892 91914 -354443
13188C2064R4010j5565a6038F8890B2102a09955D07669A27847C0477R9491L3708
13177A63676d9253D68538i5705H8346e5801B89299A15680c0907k0627n8888B7631
13165B37964n6264b26203G7426Q3912b30856h3099c9995A99818h503j8942D54470
13153a07070r2887N8111A19402l6615K06236B3744J02328m0839J7800j5478e0598
13141D2948Q7127F3418a5654C67939b84980H4721a26930B35616q643F1490R4319
13130A55809J336M3629P9109B9175b21449A51350d6929C83281E2873N4798K26413
13119C34084H0264i6028A79270a06752A90640g8867A80252k3962Q368k9765d7654
13107g0138J7035k04820c1514j03145J8964F3110P3408L8374o615J66650D0034
$$ plain form
13188 32064 126074 110509 -16038 68890 22102 -109955 407669 127847 30477 129968 163676
13177 163676 -49253 468538 -95705 88346 -55801 289299 115680 -30907 -51534 -110422 27631
13165 237964 181700 -226203 77426 161338 -230856 -83099 -39995 199818 -8503 -27445 454470
13153 -107070 -199957 -141846 119402 82787 289023 23744 126072 85233 103033 87555 -50598
13141 42948 130075 63418 -15654 367939 -284980 84721 -126930 235616 226973 61490 155809
13130 155809 157145 200774 279883 29175 -221449 151350 -46929 383281 52873 107671 334084
13119 334084 80264 -96028 179270 -106752 190640 -78867 180252 156290 164658 134893 -47654
13107 -70138 -53103 -257923 -31514 -134659 -115695 63110 136518 174892 168277 334927 40034
13095E126K49091F5528A5579L8205b68865A03125f5529A88014N9245B525Q3353
13084H5878e6220k93212A84895I0734j5812a98455B47145H3988n314K16792d4629
13072b3373B92360b2186K056B03334f1866j66829A09245L96772b65594a10737
13061c2817A73428b25206F3346k5105J89372e4609D25603A75541j2260B2790Q0728
13050A03518K57282b6013A75212a85940A60324k789f0110C85892j30930G8131
13039a17943A60432a2854I2234a17553c8918B01685n3681E4321a49636a5626j46558
13028a62184B18156c9611A14198j8603N5407f5981G372a23300A23685M3245P1482
13017B38412l2282N3888J20655E7184A498J39615b00813g0724j77741b1327B33810
$$ plain form
13095 5126 254217 65528 15579 53784 -268865 103125 -65529 188014 247259 2525 85878
13084 85878 -56220 -349432 184895 90734 74922 -198455 247145 83988 78674 295466 -44629
13072 -23373 292360 -22186 -20130 203334 -61866 -228695 109245 506017 -265594 -110737
13061 -32817 173428 -225206 63346 38241 227613 -54609 425603 175541 163281 22790 103518
13050 103518 360800 -26013 175212 -185940 160324 157535 -60110 385892 254962 78131
13039 -117943 160432 -12854 92234 -117553 -38918 201685 148004 54321 -149636 -15626 -162184
13028 -162184 218156 -39611 114198 95595 151002 -65981 7372 -123300 123685 166930 238412
13017 238412 206130 260018 380673 57184 1498 141113 -200813 -70724 -248465 -21327 233810
13005e18066B36066o4326d1504J6670k05185F0135O4777f7968B25408a75389C5340
12993I3171J041l373K4927j779g3265C9421f524A07432A967h8437r830A10322
12980A69836a10466k16746J19876D8324J32711G5052k6051a75746f6609r3514
12970a60123A18560c00270B38085F2586K20254a10651A54951c8087j92204b1289
12959D5223b35332n7669h3222o573D07360c72891a09833J2581j03150B50570a06767
12947a32203N1789B15142b96616a4819j55564J7836j46819A17685N3962i9913
12936A12749a22689e7906j84896M0784I1034a9095g058A45639K27274A28183e5559
12924a43254m9890B00883a30115D30577a82132k8474D09641A03661a18919a728
$$ plain form
13005 -518066 236066 171740 -41504 -24834 -230019 60135 124912 -67968 225408 -175389 35340
12993 93171 94212 90839 115766 113987 -73265 39421 -6524 107432 1967 -88437 -98267 110322
12980 169836 -110466 -327212 -207336 48324 181035 75052 49001 -175746 -66609 -160123
12970 -160123 118560 -300270 238085 62586 282840 -110651 154951 -38087 -230291 -21289
12959 45223 -235332 -293001 -83222 -89795 407360 -372891 -109833 -97252 -200402 250570 -106767
12947 -132203 -80414 215142 -296616 -14819 -170383 -152547 -299366 117685 171647 -99913
12936 112749 -122689 -57906 -242802 -202018 91034 -19095 -7058 145639 372913 128183 -55559
12924 -143254 -193144 200883 -130115 430577 -182132 -210606 409641 103661 -118919 -1728
12913c4479j22207A49193a01978A16042c17976g3105c3114G3873i3914l7751a6228
12901A46797a53648j32639J33184B46186b08443D0018a01393p1118P4141H6108
12890C01314m3682d7101A38629a97042A59032j0249D0276b03048B30451b33529
12879D1565c58191C5029K27073F8592h8177B64790j26710a28401c7896a4271B72564
12867A29232J685K09090B3510a63812l24629f7008n6761D9823b74269A81282A3143
12855a87450l9595R9231A60512b8462A40681J34607A5780J15331n9370a651D05515
12843G740l603b63574a5627j30111B2612J91341q7434J86716J02287A95179a14821
12831f2569a5322H7616N1562P7853r0407c33448H757K48282L8104e1909F0542
$$ plain form
12913 -34479 -156686 149193 -101978 116042 -317976 -73105 -33114 73873 -93914 -131665 -16228
12901 146797 -153648 -286287 -153103 246186 -208443 40018 -101393 -172511 -98370 86108
12890 301314 257632 -47101 138629 -197042 159032 148783 40276 -203048 230451 -233529
12879 41565 -358191 35029 262102 68592 -88177 264790 138080 -128401 -37896 -14271 272564
12867 129232 130917 340007 23510 -163812 -488441 -67008 -123769 49823 -274269 181282 13143
12855 -187450 -227045 -127814 160512 -28462 140681 275288 15780 131111 71741 -1651 405515
12843 7740 4137 -263574 -15627 -145738 22612 213953 126519 313235 415522 195179 -114821
12831 -62569 -15322 87616 139178 217031 126624 -333448 8757 257039 295143 -51909 60542
12819A78712D9874c12672A31209A9438e7679j35050A2378b58347K9253b3010D13629
12807h2181n0866j51275G0059J07279p8095c6460j42410g2125A9625K505b55579
12795a00485K3861B37689C3511J90258b95099d789n8312B31066A2840R0966a57320
12783A17080R9885A3371a04530A1122O437a01452K1516F115R9836a1194p7733
12772h8927b2342m92631A8110b01089A27214i5171d1869A55257K18915j44381
12762B29791A369M28046a11477k3045D8872a5255f884k83883d984C30730f3565
12750D46772C8612N1697a36603f2669J2114n1570q4959A66266L50210F4889i5209
12738I9074L6804J3341N2532A6225R9447L9188a69367F8379b19931a06260A12225
$$ plain form
12819 178712 49874 -312672 131209 19438 -57679 -192729 12378 -258347 -229094 -23010 413629
12807 -82181 -133047 -284322 70059 177338 99243 -36460 -178870 -72125 19625 22130 -255579
12795 -100485 -76624 237689 33511 223769 -295099 -4789 -63101 231066 12840 103806 -157320
12783 117080 216965 13371 -104530 11122 17559 -101452 -79936 6115 105951 -11194 -88927
12772 -88927 -22342 -514973 18110 -201089 127214 -95171 -41869 155257 374172 229791
12762 229791 1369 429415 -111477 -134522 48872 -15255 -6884 -290767 -4984 330730 -63565
12750 446772 38612 90309 -136603 -62669 -50555 -102125 -187084 166266 516476 64889 -95209
12738 99074 135878 149219 201751 16225 115672 154860 -169367 68379 -219931 -106260 112225
12726B61801b08723C04143j1996a78178A80013n9627a84965h2200b589j39713
12716a42302k60b5362D51033b1998A10065a24341A35524L16132B3183h819D9936
12704g858G5430j3974A5424N2147b3674B677h9352o0932L9361j03823R8848D6731
12691g3300H3530a66681P3072D8033J70009J99051H1029L01510e1711H1887J90639
12680B72526f0779A55646J2070J18213j4774B8245N4194f5380G8836e6372C9522
12668A51790G1235j6854J0558a63452A08177a87484j92513p6987b8131p1505A56323
12656d0254I4170d5118o7620A19741H493K51115q210a88478a3952A9464P534J29229
12644A56227b28506B6220O4054J52297c8130k52927G4005C0032J9265K29200I9078
$$ plain form
12726 261801 -208723 304143 292147 -178178 180013 120386 -184965 -82200 -2589 -142302
12716 -142302 -142562 -25362 451033 -21998 110065 -124341 135524 451656 23183 -8819 49936
12704 -7858 75430 61456 15424 67571 -23674 2677 -89352 -150284 -110923 -214746 -115898 46731
12691 -73300 83530 -166681 -93609 48033 218042 417093 81029 382539 -51711 81887 272526
12680 272526 -60779 155646 167716 285929 271155 28245 82439 -65380 78836 -56372 39522
12668 151790 71235 54381 64939 -163452 108177 -187484 -379997 -456984 -28131 -99636 156323
12656 -40254 94170 -45118 -112738 119741 8493 259608 251398 -188478 -13952 19464 26998 156227
12644 156227 -228506 26220 90274 242571 -38130 -291057 74005 30032 49297 278497 99078
12632a28883B6578a23413l2572A90135k5452a70179A78175p8260K48107F6523
12621A30291J8309R6032a33711k5789D06586I731b25577P9058B7792k864K5338
12610E0266J41030a08015p8760a196j47889B9086K29845A14156J99987p7574l823
12599B32746K8330f6365l16140B2028J58229B8837O3462a33069r9056B65534a19598
12587A69660P6645d06078A34216e4424m7828A44354b09408i8936A09445a33592
12576i5509o8407k41156a05517D4609J75243K0819E4610Q2893o28J36035b14893
12564b01216B0302h7616A1609e2255j40063h4233E2304J10096m8098c994j8674
12553b2668A13829a78896c6444B66569P8753e17136a47608P044A47537B3848J18536
$$ plain form
12632 -128883 26578 -123413 -155985 190135 164683 -170179 178175 99915 348022 66523
12621 130291 148600 244632 -133711 -159500 406586 9731 -225577 -146519 27792 24928 50266
12610 50266 191296 -108015 -186775 -1196 -149085 29086 258931 114156 314143 236569 232746
12599 232746 261076 -66365 -382505 22028 180257 28837 92299 -133069 -232125 265534 -119598
12587 169660 246305 -406078 134216 -54424 -102252 144354 -209408 -98936 109445 -133592
12576 -95509 -163916 -405072 -105517 44609 219852 240671 54610 137503 136875 272910 -214893
12564 -201216 20302 -87616 11609 -52255 -192318 -84233 52304 162400 114302 -3994 -22668
12553 -22668 113829 -178896 -36444 266569 345322 -517136 -147608 -140564 147537 23848 142384
12542A42384a96544g5882b9061B4603P7233O8336a59354J9314A60159j3840B0071
12530C4812L1354g6738A10429C9840J6588J09952c5999LB44042j19661h9470b7228
12517A49843a28338j1445b0962A89330P8448A09073n1198c3286j48538h1450c2611
12505B20037n366G0405J81949H5742i204B3059a48591F42466a52315m2369R4281
12494a00403i552B77415F3074J04255K15386b63359h3789k714A32095m5895O9666
12483A55866a0614A59670a65346K3130D3374a03252M5671A96195D086b52867A91168
12471c29360B6136a81253e6684k04205B19702c4226k59866J24128M436G7345a2105
12459b84999R5967Q2752o7536Q3439A36848J25865B565J89763J1989a32113D2751
$$ plain form
12542 142384 -196544 -75882 -29061 24603 101836 170172 -159354 -140040 160159 146319 20071
12530 34812 66166 -76738 110429 39840 56428 166380 -35999 -35996 244042 124381 -89470 -27228
12517 149843 -128338 -139783 -20962 189330 267778 109073 57875 -33286 -181824 -81450 -32611
12505 220037 214671 70405 252354 85742 -9204 23059 -148591 642466 -152315 -194684 -100403
12494 -100403 -9552 277415 63074 167329 382715 -263359 -83789 -86503 132095 86200 155866
12483 155866 -10614 159670 -165346 -142216 43374 -103252 -57581 196195 4086 -252867 191168
12471 -329360 26136 -181253 -56684 -260889 219702 -34226 -294092 -169964 -165528 77345 -12105
12459 -284999 -189032 -106280 -173816 -90377 136848 262713 2565 192328 204317 -132113 42751
12447b3601A00382L5732a99258A22600b26058N2122A08544m389a94344B66113
12436e12868H7534i6139A65621c45322J15735E2476J58873c74192a60121j4727
12426a74848H80J74518k5743c8165A00924f6859k74671b3675j67735R53n1086
12415b41543A21867C9318a21470B23838a35865p8623A55597P2251a32435B33312
12404c04818G0043e0095I2899J26452E955J04604G982b0126K224k90144A77810
12392i1153q3029n6647k7654b5099A36859a63902l9063o0664D7357J12459L5794
12381A95610G4043L17087c5938A72728i5156H5333j7527g7467B8322b4583D1753
12369b10613e8848B02941H104a48918d2111j00046B7776L82916c58658Q2338J03398
$$ plain form
12447 -23601 100382 136114 -199258 122600 -226058 -173936 108544 104155 -194344 266113
12436 -512868 87534 -96139 165621 -345322 -229587 52476 211349 -374192 -160121 -174848
12426 -174848 880 175398 149655 -38165 100924 -66859 -341530 -23675 -191410 -190457 -241543
12415 -241543 121867 39318 -121470 223838 -135865 -214488 155597 227848 -132435 233312
12404 -304818 70043 -50095 92899 219351 5955 110559 7982 -20126 -17902 -308046 177810
12392 -91153 -174182 -230829 -258483 -25099 136859 -163902 -202965 -263629 47357 159816 195610
12381 195610 74043 391130 -35938 172728 -95156 85333 67806 -77467 28322 -24583 41753
12369 -210613 -58848 202941 8104 -148918 -42111 -142157 27776 410692 -358658 -276320 -172922
12358a72922m5758P570R5147L1229n7702j19418p96f3887B17867b80443I5188
12346B9306K2355a86673l50158b42315A71544m8498R0278J12959a22455m5555
12336a68010g0581K7220A25700E756R0813R8363a42412c1052A51769i7857A14302
12324C77213c5283a4263l9865C1574K06210k2947a77406g7779D11009B04047M6791
12313B50838a62144I8548h4963k24153B423b38022l1846A70030c2037k5947A08825
12301A52464b59655h9288K904K8446H0654a39395I2076d6641j09115A33730a74866
12289e7172j29005B8430g4974c1225B98944i4792J0617A61184f3010k9493E5391
12277B34305J09385A50952g8700j00730A054a16656A32127a9360l9808I4077a64817
$$ plain form
12358 -172922 -218680 -211110 -115963 -84734 -142436 -261854 -262650 -63887 217867 -280443 95188
12346 29306 51661 -186673 -536831 -242315 171544 123046 213324 326283 -122455 -168010
12336 -168010 -70581 -43361 125700 5756 96569 194932 -142412 -31052 151769 -97857 114302
12324 377213 -35283 -14263 -54128 31574 237784 214837 -177406 -77779 411009 204047 250838
12313 250838 -162144 98548 -84963 -309116 2423 -238022 -269868 170030 -32037 -57984 108825
12301 152464 -259655 -89288 -86384 -57938 80654 -139395 92076 -46641 -155756 133730 -174866
12289 -57172 -186177 28430 -74974 -31225 298944 -94792 -84175 161184 -63010 -92503 55391
12277 234305 343690 150952 -78700 -179430 1054 -116656 132127 -19360 -59168 94077 -164817
12265A41474J29925r3461n8081M9294Q360f9044C6323f8929D49196b54545E5080
12253H296e7055C42576k5032A50114m4412a694k0576g585k1720j32822F7919l1422
12241C6497K02455b20058B73177N9765c6399A54192H051e6845j13682A91103G8602
12229B8415f677C9322i7084A38856N0083e5871e622B8433M0024R4560k615a49825
12216B6387K50383a71540f0522r7437e8230B2976R8401a0954C58800h6846D73855
12204e192A30707j7589g5847k15554B09520E4181M9641R2525j3481C6536c63569
12192b11953B42730a1544r3381B96919k1945o6552C9213a34384B55090c1713A41111
12180D09375h1831E0627K32742l8551G4476M9839E6675a81872E2290J32487O5965
$$ plain form
12265 141474 271399 177938 119857 169151 177511 -69044 36323 -68929 449196 -254545 55080
12253 8296 -57055 342576 317544 150114 105702 -1694 -22270 -7585 -29305 -162127 67919 36497
12241 36497 238952 -220058 273177 332942 -36399 154192 8051 -56845 -170527 191103 78602
12229 28415 -6677 39322 -97084 138856 188939 -55871 -5622 28433 68457 163017 160402 -149825
12216 26387 276770 -171540 -60522 -157959 -58230 22976 121377 -10954 358800 -86846 473855
12204 -5192 130707 113118 -75847 -291401 209520 54181 103822 196347 182866 36536 -363569
12192 -211953 242730 -11544 -104925 296919 274974 208422 39213 -134384 255090 -31713 141111
12180 409375 -81831 50627 283369 244818 74476 124315 56675 -181872 52290 184777 250742
12169B50742q0336a60715A10269J01159i9299a4493j30658A34595e9586A26327
12158B4942J81897n6445b8236j0908r2430A9594J22282K9963K54337B3908b64936
12146c35952D49045b43100C8212J71094N7625M356E2828I975P3477l5562a78977
12134a09295N2081D877h6832H0752b61090j12700i5247L6236G4988l0251h771
12122C50992r3723j26275A2105J5282d3031B8868N2814J00210a28791B24609B125
12110a805C14397a31727C02760H8733M7905e2390A68376j6572F9337K4487K2948
12099A16772c84934C24926e6110G6869H326g0632D77442H411a11417I3753c3322
12087F2249g9187L1103C3739a48853B11521g4739G3290g8917C47681D8048b67911
$$ plain form
12169 250742 170406 -160715 110269 211428 -99299 -14493 -145151 134595 -59586 126327
12158 24942 206839 150394 -28236 -39144 -131574 19594 141876 171839 426176 23908 -264936
12146 -335952 449045 -243100 38212 209306 266931 271287 52828 9975 83452 47890 -178977
12134 -109295 -57214 4877 -86832 80752 -261090 -373790 -95247 -59011 74988 44737 -8771
12122 350992 257269 130994 12105 27387 -43031 28868 81682 181892 -128791 224609 2125
12110 -1805 314397 -131727 302760 88733 136638 -52390 168376 151804 69337 93824 116772
12099 116772 -384934 324926 -56110 76869 8326 -70632 477442 8411 -111417 93753 -33322
12087 62249 -79187 -48084 33739 -148853 211521 -74739 73290 -78917 347681 48048 -267911
12075A02204l3044l2514a10769d8052k47819D1226L9731K8743i1046A4316c2614
12063A28113Q3959F4724J38509J09688j01545D0662c3974C49550K87048F2520
12052c75792B77394r8008a50159N2099j16139A91340I0083a73710e9890k9811
12042h9701A16498l6289J44354d2902m5721L0986H4058g4060F5973K9250J2250
12031A07473d7094n7210d5725A71743K5472b07196A22553a79023O5289A87588
12020B2553b454q0468D00364C6201e3665A065P9284c9592E2453f6244c0103A14946
12007D0364J06919E2406a3450A306a01433A0309K70814g2255A59870c8462o8254
11996a06716k20249K0244a3102q3946E1192J40422c70763F7470j511g0165C51698
$$ plain form
12075 102204 69160 36646 -110769 -48052 -295871 41226 80957 109700 -91046 14316 -32614
12063 128113 212072 64724 203233 312921 211376 40662 -33974 349550 636598 62520
12052 -375792 277394 179386 -150159 -98060 -214199 191340 90083 -173710 -59890 -89701
12042 -89701 116498 80209 224563 -42902 -88623 -57637 84058 -74060 65973 95223 107473
12031 107473 -47094 -104304 -45725 171743 197215 -207196 122553 -179023 -113734 187588
12020 22553 -2454 -82922 400364 36201 -53665 1065 80349 -39592 52453 -66244 -30103 114946
12007 40364 147283 52406 -13450 1306 -101433 10309 281123 -72255 159870 -38462 -106716
11996 -106716 -326965 -306721 -13102 -97048 51192 191614 -370763 67470 65959 -70165 351698
11984A61183M0544a17562j53227A72508J5822g8906A48805g3451b4457A70510
11973b20890E8099b40344G3177k9120d99761G2799a17376A21946a67245b1031
11962b45967k2984B2010K76659a19894j22578O4772H6584j1920c0487n9570F3502
11950b06528C1697h5897A09001c2274i160H121J46563a91012I8589e3877B0809
11938B48763m3102b26885B54559d7146A94593q8314k4722a76831h1912I2842k6014
11927F6828a8137j07267A2129P5929N9378a2433A63101E9272e9500l18551J07631
11916b70420a16883B02397M4331a86046d3278A72369H512a42759A00115Q3591
11906A83706d8437B6122d77339d7041r361A42787c02069m8093e715A02067k0631
$$ plain form
11984 161183 201727 -117562 -270789 172508 188330 -78906 148805 -73451 -24457 170510
11973 -220890 58099 -240344 73177 44057 -499761 72799 -117376 121946 -167245 -21031
11962 -245967 -268951 22010 298669 -119894 -242472 -177700 86584 74664 -30487 -90057 63502
11950 -206528 31697 -85897 109001 -32274 -9160 8121 154684 -191012 98589 -53877 20809
11938 248763 205661 -226885 254559 -47146 194593 106279 81557 -176831 -81912 92842 66828
11927 66828 -18137 -125404 12129 88058 147436 -12433 163101 59272 -59500 -378051 -270420
11916 -270420 -116883 202397 246728 -186046 -43278 172369 8512 -142759 100115 183706
11906 183706 -48437 26122 -477339 -47041 -56402 142787 -302069 -350162 -5715 102067 81436
11895H1436a64399r0256p0463a6759j67286A09653b11053g5732A97937j9762n8765
11884A19410a18748R657j33436i4293k89097J39350H7763J60122B6228b50572
11873a75764a5517A21023K8627a81319j30411H8788a71213I3243a95535h4528
11862b51330E2157b65185d3313r5995D5583a43516E2433b9650q8397C01996b17936
11850I467K81816I1402h2938m2223B04972a47568B79626A02586b02070F766f2558
11838a0220B17875J13319e7157A57024N8243b5418E1342g4939n4372G14e4915
11826a86304j15973f2916b1862j5923J4218q3715c7225p7056A74047k9934Q798
11815A52911a57189P2276B73483a31589j23950a0757k65012j5398A33897d3648
$$ plain form
11895 81436 -164399 -254655 -325118 -16759 -184045 109653 -211053 -75732 197937 178175 119410
11884 119410 -118748 -109091 -242527 -94293 -383390 -244040 87763 247885 26228 -250572
11873 -175764 -15517 121023 149650 -181319 -311730 88788 -171213 93243 -195535 -84528
11862 -251330 52157 -265185 -43313 -139308 45583 -143516 52433 -29650 -118047 301996 -217936
11850 9467 291283 91402 -82938 -125161 204972 -147568 279626 102586 -202070 6766 -62558
11838 -10220 217875 331194 -57157 157024 215267 -25418 51342 -74939 -129311 714 -54915
11826 -186304 -302277 -62916 -21862 -37785 -23567 -107282 -37225 -114281 174047 144113 152911
11815 152911 -157189 -84913 273483 -131589 -255539 -10757 -275769 -291167 133897 -43648
11804a01897d7700A4240N4742e0421A76013a57298B00353a96463r783c2126r8332
11793a30458K280p516C0181K77093j44385F9929Q3199a79490A732b00388J8391
11782a81997B08884A424a07376q9410R3896B39717a34180E3388a24156p8188Q8896
11771a13448F680d3786H8002J9785M4508M8733a58774d6695D5969J65983d3706
11759a78257A7228b87134a11759r2319N3929r9209B94705A19903e826k5200k87668
11748c18694I2812b29884P0828C55054a99550A62723m392b57949a11791A310J14198
11737A15508J29332b6514B78741E6264Q9434k2362f0448J9391B21101G0844B6936
11725a50199H7676k979i8426B70743a03006A38367n5912b8888j75852h243D0601
$$ plain form
11804 -101897 -47700 14240 68982 -50421 176013 -157298 200353 -196463 -206246 -32126 -130458
11793 -130458 -128178 -135694 30181 307274 162889 69929 153128 -179490 1732 -200388 -181997
11782 -181997 208884 1424 -107376 -196786 -102890 239717 -134180 53388 -124156 -202344 -113448
11771 -113448 6680 -43786 88002 107787 152295 201028 -158774 -46695 45969 211952 -43706
11759 -178257 17228 -287134 -111759 -204078 -150149 -249358 294705 119903 -5826 -31026 -318694
11748 -318694 92812 -229884 -159056 355054 -199550 162723 158331 -257949 -111791 1310 115508
11737 115508 244840 -26514 278741 56264 145698 123336 -60448 -41057 221101 70844 26936
11725 -150199 87676 84697 -98426 270743 -103006 138367 82455 -28888 -204740 -8243 40601
11713d9597C1800g690k63000B88614j22279b93742C4923L2903a2469A34023A4698
11701G1926a02796A5130d83358B67591b04255A85861b63824d3993k7686D1379
11690A43657g0237A3289a33314B2367b8839A98342b5419H1637c14177D6957i3747
11678h0228A20629J08681a60990c5602A95721B1967c0760l25586J26609J00605
11668a29132A06461K58208h5478G1882f4995A13444h8611A10974C0265K5510f5702
11656e7820j42875B166K46494B5502g072C26467c6839j89129a00900q0615A8843
11644A1356K16137d953A53906A2440J20024a89719D7989j6004L517a71975L5960
11633a36015f6621I92O1920b35367B5603K23516I4131a23295b1013A83122J7968
$$ plain form
11713 -49597 31800 -7690 -270690 288614 166335 -293742 34923 67826 -12469 134023 14698
11701 71926 -102796 15130 -483358 267591 -204255 185861 -263824 -43993 -71679 41379
11690 143657 -70237 13289 -133314 22367 -28839 198342 -25419 81637 -314177 46957 -93747
11678 -80228 120629 229310 -160990 -35602 195721 21967 -30760 -356346 -229737 -129132
11668 -129132 106461 364669 -85478 71882 -64995 113444 -88611 110974 30265 55775 -65702
11656 -57820 -200695 2166 248660 25502 -7072 326467 -36839 -225968 -100900 -181515 18843
11644 11356 227493 -4953 153906 12440 132464 -189719 47989 31985 35502 -171975 -136015
11633 -136015 -66621 992 62912 -235367 25603 249119 94131 -123295 -21013 183122 201090
11622B01090a08467r0830A36469m3685J55130c91654A05075a71667E7851d3488
11611a19889h750l47654a522B01602a5349j1769k84922C08123j00000l1733K2261
11600A98651c7286k3890A70215G2169p254J65490D921a62470P0424F8584c52421
11588A71806l8917k0580J70773A25055d82806A22745k7216D5424a51654A26710
11577E67828a64347b0940K601D1382c29508C87791h826B44662q2628h8644A60725
11565e4850C36425h5917n9309g1142B06467h4050L8162k85869c8575l07794c6207
11553C23024a6124p865A29493b13570g3121c046A69623b82184p2276a59378A88345
11541H9562L5601O1736Q2580A09943b117B35878q6900a21815B1826J65282e8234
$$ plain form
11622 201090 -108467 -199297 136469 92784 247914 -391654 105075 -171667 57851 -43488
11611 -119889 -8750 -356404 -1522 201602 -15349 -27118 -312040 308123 208123 176390 198651
11600 198651 -37286 -61176 170215 72169 64915 230405 4921 -162470 -92046 68584 -352421
11588 171806 132889 112309 283082 125055 -482806 122745 95529 45424 -151654 126710
11577 567828 -164347 -20940 -18339 41382 -329508 387791 -8826 244662 162034 -88644 160725
11565 -54850 336425 -85917 -145226 -71142 206467 -84050 -45888 -331757 -38575 -346369 -36207
11553 323024 -16124 -23989 129493 -213570 -73121 -3046 169623 -282184 -354460 -159378 188345
11541 89562 125163 186899 269479 109943 -2117 235878 148978 -121815 21826 187108 -58234
11529a93212e628C2152O4741B1507K48798e2175a2469m7181C23020l8284E3404
11517f4127E7641J0463k2465L7318i4617B49143I1459a71369A17443e6823B44056
11505B71463j23681Q0679h2203A40348F6051a13537B31350J18520A66315B6556
11494B62003N7143D7119J27348f5817K1011D38688A89250a03663d4137q0774A083
11482A98594E1206J82195r3712K6757B7938b23294F0307h0864j93962D24114p3939
11471C50175j7267j34981d2429n747k846O188r9091B8644O6274b45326A37360
11459a13527K6375A79969L2471E4710a70424c0133o1515l6256M8968m7154j50498
11448b76588A15179L44747j20084j08298f6198B029b2531r9506b8569d345l00842
$$ plain form
11529 -193212 -5628 32152 96893 21507 270305 -52175 -12469 -59650 323020 284736 53404
11517 -64127 57641 68104 45639 82957 -94617 249143 91459 -171369 117443 -56823 244056
11505 271463 147782 228461 -82203 140348 66051 -113537 231350 349870 166315 26556
11494 262003 319146 47119 174467 -65817 -44806 438688 189250 -103663 -44137 -124911 1083
11482 198594 51206 233401 139689 166446 27938 -223294 60307 -80864 -274826 424114 350175
11471 350175 332908 197927 -42429 -48176 -51022 -44834 -143925 28644 94918 -245326 137360
11459 -113527 -87152 179969 212440 54710 -170424 -30133 -91648 -127904 -78936 -126090 -276588
11448 -276588 115179 459926 339842 231544 -66198 2029 -22531 -122037 -28569 -4345 -305187
11437c05187a06457A17636b40562K3228A0155a14878D6862b28594D5176L623K56260
11426C05059E8529K3614h6508m1750B1943e7354J8774k8059B71120D447a3200
11414C5590d24796B19917a9117D7501i957D7208b04969a8244B7178J26185a31798
11402C7876J18557a31575A77679q8074b71228B9588a2134k13120M2101j7195m9035
11391b49383A86831i1394j1124l1634e1056o6661A55956D0492a19878b4237E5807
11379B1176J52269k5108a00495K306o2533L3289B27197b3512I4109R4308K16507
11368D04924A60689a66265D4981L10878b421B95713b74147A11729b07074E2492
11357I0544a80434c6042j51379D7298c65540b6590o2693F508J67319K1319b33112
$$ plain form
11437 -305187 -106457 117636 -240562 -217334 10155 -114878 46862 -228594 45176 48799 305059
11426 305059 58529 82143 -86508 -128258 21943 -57354 -38580 -66639 271120 4447 -13200
11414 35590 -424796 219917 -19117 47501 -9957 47208 -204969 -18244 27178 153363 -131798
11402 37876 156433 -131575 177679 89605 -271228 29588 -12134 -225254 -183153 -200348 -249383
11391 -249383 186831 -91394 -102518 -134152 -51056 -117717 155956 40492 -119878 -24237 55807
11379 21176 173445 148337 -100495 -98189 -160722 -127433 227197 -23512 94109 188417 404924
11368 404924 160689 -166265 44981 355859 -2421 295713 -274147 111729 -207074 52492
11357 90544 -180434 -36042 -187421 47298 -365540 -26590 -89283 6508 173827 195146 -233112
11345C0526J29288C1194O8573a3617j04498j49145O5422C0518N4606J0481c72129
11333C1275h2570a6924k8142m5418c4469H676b18671R4173j07050B50266a84855
11321B356d01733a05956D39831A21961g0179K043A44396m2756J81118b06907F7169
11309B26007c8154j43782j26280a39999p020a6303k11010M2753I1879A0869L78347
11298C89216j78252a50566A5406c11443a50131k68631B71536i618M744j56035
11288a60909r9254a22763A30067b42344j00684j22313J50610A95237B4044h9269
11277B9704O1356J1434M6008a86253D6769K0096a08127A50931R2107M4452j40054
11266A47436b75233A8478M6177O8862a83210a3271B58605D6727D441L5943f1193
$$ plain form
11345 30526 159814 31194 99767 -13617 -118115 -267260 -201838 30518 85124 95605 -372129
11333 31275 -82570 -16924 -45066 -90484 -34469 8676 -218671 -124498 -231548 250266 -184855
11321 2356 -401733 -105956 439831 121961 -70179 -68136 144396 101640 282758 -206907 67169
11309 226007 -38154 -181936 -308216 -139999 -147019 -16303 -227313 -184560 91879 10869 389216
11298 389216 210964 -150566 15406 -311443 -150131 -418762 271536 -9618 -4874 -160909
11288 -160909 -260163 -122763 130067 -242344 -343028 -465341 -314731 195237 24044 -89269
11277 29704 91060 102494 148502 -186253 46769 66865 -108127 150931 243038 287490 147436
11266 147436 -275233 18478 64655 133517 -183210 -13271 258605 46727 4441 40384 -61193
11254B5870a55532h389A0471O4644d3533F2138d5273p3577j09505a8579A16057
11242h8209A13762i7999k16974J22057j75635f0583j73285H3280a23390G7250
11231a02206D7147m831a59455f9587n5142L0441j85497a11229o2622l2489B19227
11219A02722b93268g0315l051o0092A43609A6534c2111a2092A0946a14826A61601
11207A06685g1135J6231r2384C2372K9080M6074J4345a52860o8803B08220a54326
11195A38573H704d76319J89845J19322I9313k5372C4234i1561A58138h9171A42403
11183d8025l01353B68193q9713b74438A20024P078c820k39097A24687a43500I4265
11171A42602B2868d16699i4987j67056C3969f1155a7683C51526d3444r1736C1124
$$ plain form
11254 25870 -155532 -8389 10471 75115 -43533 62138 -45273 -118850 -228355 -18579 116057
11242 -88209 113762 -97999 -314973 -192916 -368551 -60583 -233868 83280 -123390 77250
11231 -102206 47147 42316 -159455 -69587 -124729 -94288 -279785 -111229 -173851 -206340 219227
11219 102722 -293268 -70315 -73366 -133458 143609 16534 -32111 -12092 10946 -114826 161601
11207 106685 -71135 -54904 -147288 32372 61452 107526 121871 -152860 -221663 208220 -154326
11195 138573 8704 -476319 -286474 -167152 99313 73941 34234 -91561 158138 -89171 142403
11183 -48025 -349378 268193 178480 -274438 120024 127102 -3820 -242917 124687 -143500 94265
11171 142602 22868 -416699 -94987 -262043 33969 -61155 -17683 351526 -43444 -135180 31124
11159D05117a08008C3330b3030E1926a18760A90385D3865c52664a51552K7324
11149a24228A63998a32198N611E6766c91989E5097K86996a13223H0495K91254
11139C71749b42983b9239B2310J14834b8750E3960a57251O0478B99709c34313
11128a09266C9743c26378A33849a2902A29308E640a48033c5895A5635a82216B19011
11116a13297B37293c8609a1369C19791j54022e1452C4673J92035J02680H5350
11105a55960D8982g9545A11755J1610c97252a51248C44957B3006K53464J07691
11095C84161f7958B08082o5963m9483a31824A18164J47319J37054j48191n2159
11085B02187K19394A74201a0552j75134H0509N2448K20398A34349O09h5621K8564
$$ plain form
11159 405117 -108008 33330 -23030 51926 -118760 190385 43865 -352664 -151552 -124228
11149 -124228 163998 -132198 -126587 56766 -391989 55097 342093 -113223 80495 371749
11139 371749 -242983 -29239 22310 137144 -28750 53960 -157251 -96773 299709 -334313
11128 -109266 39743 -326378 133849 -12902 129308 5640 -148033 -35895 15635 -182216 219011
11116 -113297 237293 -38609 -11369 319791 165769 -51452 34673 226708 329388 85350
11105 -155960 48982 -79545 111755 123365 -397252 -151248 344957 23006 276470 384161
11095 384161 -67958 208082 142119 92636 -131824 118164 265483 402537 254346 202187
11085 202187 421581 174201 -10552 -185686 80509 132957 353355 134349 134958 -85621 -57057
11074e7057A13796J19039i9512F7514d5254F5420L83731I7413J94078h9440D2289
11062C87546p5994m2173R0818R3266j04737A11768M82262A17479J50079j10396
11052A57162L83390j61156m9144J66497A80807L15159k1504j67303J77800j07251
11042C77708K93133Q9843l27200O0652O4258j24529j01118J82273k39233J02774
11032C78561o6950J76153P9167j56685I9455L30684j36557M07706B79576O8073
11022C47649K09371p2402k4991j69973K11902k48289J90491p4406I3967L7225
11012A31192J52076O9820J54263J78k1565r3605M0017A56561L19093J85933k69782
11001C91805p8698M4156K2527n7349R9345A89573K10331K35493k73168L8499O3267
$$ plain form
11074 -57057 113796 232835 -99512 67514 -45254 65420 449151 97413 291491 -89440 42289
11062 387546 311552 269379 360197 453463 348726 111768 594030 117479 267558 157162
11052 157162 540552 379396 330252 496749 180807 495966 474462 307159 484959 377708
11042 377708 670841 760684 433484 494136 558394 433865 332747 515020 275787 378561
11032 378561 311611 487764 566931 410246 99455 430139 293582 701288 279576 347649
11022 347649 557020 484618 459627 289654 501556 253267 443758 369352 93967 131192
11012 131192 283268 353088 507351 507529 485964 392359 432376 156561 475654 661587 391805
11001 391805 313107 357263 379790 322441 421786 189573 399904 635397 362229 400728 463995
10990D63995B22756r9170M58772A38403Q38931j53532l74532O7101K14951k31080
10980E00242j21831P2611N37565j29372K8504J27738J26832j19087N87378J02907
10970A713487j40385J93320J0355j50349j58545L20041j20424n82943L68259l39120
10960A113696k64267P5320K94937j42644J91691Q8180m04150R4167L9410o9833
10950A016507k44835r8400r1169J73201l32878R5420j77656K63092C01141j25064
10940A76077j8764R4209I8995J71230j16148a82373C26085K2966a42182G2788
10929B10942C8409d4259F2073n789a38541c1794e035k42225C6536J4747J96624
10918B47907m9556a9602o1466F0741d7785a2453j36068G0380d487j76546I9895
$$ plain form
10990 463995 222756 123586 582358 138403 977334 823802 449270 516371 731322 500242
10980 500242 378411 451022 988587 859215 887719 1015457 1142289 1023202 1610580 1713487
10970 1713487 1573102 1766422 1776777 1626428 1467883 1787924 1667500 1084557 1452816 1113696
10960 1113696 849429 924749 1219686 1077042 1268733 1356913 952763 1046930 1086340 1016507
10950 1016507 771672 673272 582103 755304 422426 517846 340190 603282 301141 176077
10940 176077 157313 251522 98995 270225 154077 -182373 326085 349051 -142182 72788
10929 210942 38409 -44259 62073 56284 -138541 -31794 -5035 -247260 36536 51283 247907
10918 247907 198351 -19602 -81068 60741 -47785 -12453 -148521 70380 -4487 -181033 99895
10906H9864f6082A55670K7297Q6812j4560A25469b27679j07365g9614H522N0103
10895E8625b83649A55707C0051c06329C08625A8281b40036b3542k01781H1095
10884h9121j02751Q3440A4287L3560O1393d39673d5690B5687O0815a38508f6186
10872A7546a95838k24720P2692R1015m712A76794a54230B8491J12946l9927D3333
10860A88542a43772D9030K02874A21334c35637h3930K3855j23418A41923b31117
10849c6355j21870N8833n90A33458b23130g8872K2389A89638i3826J276I475a21273
10836a5593l19404R4271a02540C4046R4335a61480b2607l8594q1475o1286i8846
10824a08832m2805c9982I8443h9477o2139H8521a49633F0900f3970j70132e4853
$$ plain form
10906 89864 -66082 155670 182967 269779 255219 125469 -227679 -335044 -79614 8522 58625
10895 58625 -283649 155707 30051 -306329 308625 18281 -240036 -23542 -225323 81095
10884 -89121 -191872 -108432 14287 47847 109240 -439673 -45690 25687 86502 -138508 -66186
10872 17546 -195838 -420558 -347866 -256851 -261563 176794 -154230 28491 141437 101510 43333
10860 188542 -143772 49030 251904 121334 -335637 -83930 -60075 -183493 141923 -231117
10849 -36355 -158225 -99392 -99982 133458 -223130 -78872 -56483 189638 -93826 -92550 9475 -121273
10836 -15593 -334997 -240726 -102540 34046 128381 -161480 -22607 -61201 -142676 -203962 -98846
10824 -108832 -151637 -39982 98443 -89477 -151616 88521 -149633 60900 -63970 -234102 -54853
10812a46765k47340P7481A00459h706q031E9910Q6914E1311J56462a77827e9374
10800A03304b16340B28067n3128n7913d8531l0441k01446P2619p4562J00279A36754
10788a59326f474C63912a49510f5135E7439b25k5982C42144A15373b40291a14438
10776A07185C8721a32566K369A59172a30694A95866M4379A7794f4457A06976f182
10764e4841j71351Q6095N5459j47771N797j26898c2916F5080b98351A3120a47374
10752b25941o3235J15765F980h6236j52368a02125b9951E490N8867n232b1724
10740b7309k91318J57077A37412c49736H4404c03132R7934j43528f8317A40459
10729f5452k9652A86294p2391g8404n9627m4650E9692b67581F1753b76443J25987
$$ plain form
10812 -146765 -394105 -316624 100459 -8706 -16737 59910 146824 51311 207773 -177827 -59374
10800 103304 -216340 228067 174939 117026 -48531 -78972 -280418 -207799 -282361 -182082 136754
10788 -159326 -6474 363912 -149510 -65135 57439 -225 -26207 342144 115373 -240291 -114438
10776 107185 38721 -132566 -130197 159172 -130694 195866 240245 17794 -64457 106976 -6182
10764 -54841 -226192 -140097 -84638 -232409 -226612 -353510 -32916 65080 -298351 13120 -147374
10752 -225941 -289176 -173411 6980 -86236 -238604 -102125 -29951 5490 64357 59125 -21724
10740 -27309 -318627 -161550 137412 -349736 84404 -303132 -205198 -348726 -68317 140459
10729 -65452 -95104 186294 113903 -78404 -138031 -182681 59692 -267581 61753 -276443 -150456
10718a50456D0001d1745C5798b8742j67799B82305A14077a7493I1811J56934a58242
10706a01601o7628e5121E7601R8142j6525a95390B21196g5542j21325e0840j1456
10695f2296b994k49459C113a45031d3115H1216J09543a23110j95436a11930B9317
10683b90321C77310D4403b15012l1055A23253Q816a41847C70134f7324B31680
10672a55928I5890b49876J17447H4827A5073P9014b31295B65182a56766k28341
10662c85107A72797a08229l87509J95696a0839j82143A7062g0872D369c7548A28823
10650c55761a32263j17218J13638M110m1044F3690B1618L07030H2216d84611a22664
10638A82081q0142K35997G3703c9976n3555B14920m2219D8542d2158A35688e3962
$$ plain form
10718 -150456 40001 -41745 35798 -28742 -196541 282305 114077 -17493 91811 248745 -158242
10706 -101601 -169229 -55121 57601 155743 139218 -195390 221196 -75542 -196867 -50840 -62296
10695 -62296 -2994 -252453 3113 -145031 -43115 81216 190759 -123110 -318546 -111930 29317
10683 -290321 377310 44403 -215012 -246067 123253 132069 -141847 370134 -67324 231680
10672 -155928 95890 -249876 -132429 84827 15073 94087 -231295 265182 -156766 -385107
10662 -385107 172797 -108229 -495738 -300042 -10839 -192982 17062 -70872 4369 -37548 128823
10650 -355761 -132263 -249481 -135843 -131733 -172777 63690 21618 328648 82216 -484611 -122664
10638 182081 101939 337936 73703 -39976 -93531 214920 172701 48542 -42158 135688 -53962
10626B92694E7532j7049J5821a2456j49582B58847a28694B3873P5197g557j95260
10615b02817k1510D2291b54122G4630P8027F3442c4719C8339a20714A36090f3254
10603b72435H3006J19237I3279c77821E2473b74762B29076c749q9390A80375D5098
10591H3411c95655B03463a22503r1455G3063d08643A26830a15835a8569k61112
10581b79681a26629j9559F2161a03414L0453a2866F4962J89400H762a09213m4262
10570a53475B83309q3637d09079q3544K30729A30832a22718l0340K6911k87287
10560d13434J26463a09924n6434O4831k50907A947i1888G1781M4900C1970h9516
10548b57669B15949a55985j50295A5627g4220o5883C23103a70717f2316m2943
$$ plain form
10626 292694 57532 40483 56304 -12456 -162038 258847 -128694 23873 99070 -7557 -202817
10615 -202817 -224327 42291 -254122 74630 152657 63442 -34719 38339 -120714 136090 -63254
10603 -272435 83006 202243 93279 -377821 52473 -274762 229076 -3749 -93139 180375 45098
10591 83411 -395655 203463 -122503 -213958 73063 -408643 126830 -115835 -18569 -279681
10581 -279681 -126629 -146188 62161 -103414 -72961 -12866 64962 254362 8762 -109213 -153475
10570 -153475 283309 199672 -409079 -492623 -261894 130832 -122718 -153058 -126147 -413434
10560 -413434 -286971 -109924 -166358 -101527 -352434 1947 -91888 71781 116681 31970 -89516
10548 -257669 215949 -155985 -306280 15627 -74220 -140103 323103 -170717 -62316 -105259
10538a05259j28762i2583L9406B16350h6270E1026j2854A3061i0115G2195B0622
10526E9215K815a17460K8520c8445k04335F2783d1685D1741J59673i7727r1797
10515a89524F0655a9804D4072a77337a8246A78704a45712D4235c59712A62489
10504B18580d1747F6752a10374A38604g7288B13400a88452q0072A42329n3438
10494H8891c0521p6936b6569A59727J9721a47247l0060G8008k5906a30109J8137
10483a11972q093E42621A53504L05703A61680A1702L68248j85751J8706l8259
10473A74646J6663k2530o9495a27407A22245b24457b9542B17885h7587C1128b5887
10461e3201k35777B3754J1336K4682J34453A8621f4664l56471g0306G432a3272
$$ plain form
10538 -105259 -234021 -92583 -53177 216350 -86270 51026 38172 13061 -90115 72195 20622
10526 59215 62030 -117460 -88940 -38445 -242780 62783 -41685 41741 201414 -97727 -189524
10515 -189524 60655 -19804 44072 -177337 -18246 178704 -145712 44235 -359712 162489
10504 218580 -41747 66752 -110374 138604 -77288 213400 -188452 -268524 142329 88891
10494 88891 -30521 -107457 -26569 159727 179448 -147247 -177307 78008 52102 -130109 -111972
10483 -111972 -120065 542621 153504 459207 161680 11702 379950 194199 212905 174646
10473 174646 191309 168779 99284 -127407 122245 -224457 -29542 217885 -87587 31128 -25887
10461 -53201 -288978 23754 35090 59772 194225 18621 -64664 -421135 -70306 7432 -13272
10449a48809r8592A21802n1038a7857A60063D4113j7630b26292i3780l11740a11694
10437b70216G735N3508D410b31536b9526o6782I43h7737j12055m8650Q5212m4726
10425b07956I4396a59655J4454p51C09728m5117A23009a32248m688j16547D1112
10413C94803b94104J06366H9210a73014B0523f0829I9199D3770c21642B9370e4498
10401d7165B28727a72982M8193A92847E2951b37406f2116I0040l0133L6439J89193
10390B85539I5609c8029A11761N8687c8005A74896a22420D8080L8968q490O0298
10379A38856E0302B4299a2139B14706r0799a56337j3491I1852J54298b5274k4270
10368d9544f721E93090B45735A09798P8741n1516Q7894K00124k11865K3741a4563
$$ plain form
10449 -148809 -247401 121802 70764 -17857 160063 44113 26483 -226292 -93780 -405520 -111694
10437 -270216 7735 61243 4410 -231536 -29526 -96308 943 -87737 -199792 -248442 -163230 -207956
10425 -207956 94396 -159655 -145201 -145952 309728 264611 123009 -132248 -136936 -253483 41112
10413 394803 -294104 -187738 89210 -173014 20523 -60829 99199 43770 -321642 29370 -54498
10401 -47165 228727 -172982 -124789 192847 52951 -237406 -62116 90040 59907 96346 285539
10390 285539 95609 -38029 111761 170448 -38005 174896 -122420 48080 87048 78558 138856
10379 138856 50302 24299 -12139 214706 123907 -156337 -169828 91852 246150 -25274 -49544
10368 -49544 -6721 593090 245735 109798 188539 137023 224917 425041 213176 236917 -14563
10356a54189A57637p6979O6536b04249d3744B65205c3969B21106J28898a30494
10345B04055J6991K42289A7479K22938L06968A82300J6854g5278B51456A17557
10334A73283H6602J0449C9494K13040j22613D8542J75570a57410D24817n5875
10324C68942A55610K291A1943k051c9902m0447A38856b57732E4447a00525A69636
10312b7311j93690A83429m1475h5003K8460k735l8626c2677A4234l290J11650
10301A22594M000J11424C9585H363a64444q2043D260J40987a7310q9730N1401
10290e5639j44373N9093A07444a276j12394M5407a7245F4250b26095A20032b83939
10278A7959K5514a25996j0680G0638b3023C8768K338i4264E8111c0156B49225
$$ plain form
10356 -154189 157637 80658 147194 -204249 -43744 265205 -33969 221106 350004 -130494
10345 204055 221046 463335 17479 240417 547385 182300 199154 -75278 251456 117557
10334 173283 86602 97051 39494 252534 129921 48542 224112 -157410 424817 368942
10324 368942 155610 157901 11943 9892 -39902 -80349 138856 -257732 54447 -100525 169636
10312 -27311 -221001 183429 141954 -85003 -56543 -59278 -97904 -32677 14234 10944 122594
10301 122594 126594 238018 39585 8363 -164444 -246487 4260 145247 -17310 -107040 -55639
10290 -55639 -200012 -140919 107444 -1276 -113670 -68263 -17245 64250 -226095 120032 -283939
10278 17959 43473 -125996 -136676 70638 -23023 38768 41106 -94264 58111 -30156 249225
10266A69196d56854I818Q5805d0420H0233b03709B01226Q8649L3117n6277o5217
10255B01498a22248C49696H0357J16460F4130h5550p2672F5913a83390l8945A36893
10243d0745k54072O2800e4573j43081p0472g7813B33879c26812J47799C1515R384
10232D0899i6451j11935j33077A78941b23401O9964K1429o8875A51801H894b46539
10220a11486l13595B7177J83553b49461K1108j41589J29581M2159A7399L7557
10210E4956b31475c251j362k6099R245H3833b75542M8766J7167C20667d8599j11112
10198a59711n0917K3542A20146J11995r2825l5845c3837k8001J8832k8964o8132
10187a40102n3328P7615b1333f061b023k77472f3780A48236G0014A7408b94792
$$ plain form
10266 169196 -456854 9818 95623 -40420 80233 -203709 201226 289875 322992 266715 201498
10255 201498 -122248 349696 80357 196817 64130 -85550 -158222 65913 -183390 -222335 136893
10243 -40745 -294817 -232017 -54573 -197654 -268126 -77813 233879 -326812 -179013 31515 40899
10232 40899 -96451 -208386 -341463 178941 -223401 -153437 -132008 -200883 151801 8894 -246539
10220 -111486 -425081 27177 210730 -249461 -228353 -369942 -240361 -198202 17399 54956
10210 54956 -231475 -3251 -4613 -30712 -21467 83833 -275542 -226776 -209609 320667 -48599 -159711
10198 -159711 -210628 -187086 120146 232141 139316 103471 -33837 -61838 -43006 -71970 -140102
10187 -140102 -193430 -115815 -21333 -6061 -2023 -279495 -63780 148236 70014 17408 -294792
10175e6464C5861e0739j5193j010a4755j82015B1694K2254a48898G8236a28795
10163A13077b73037a05440H8409a59682B16074a34166c2707j14469j00807D7845
10152c0325m66502K25139a2610j2032q6970j67482G8695f4543k6401l05878A7079
10140b13634D8413f8099a3792A23079O554a01088G2794P6268D0459D552d01365
10128f0337m6635k42864J14966Q9434A29699d9280A17794b77260J05636a8949
10117H7402J05781b509l08436C07794G5795a9694k22306J3748B2120L3747j7734
10106C8133a91321M151C42697j10138H5855b29856N2977j52202J46530A04474
10095b0584A67367E0746g5588C9611h5903A09404J00621a7920B70329A3424b5992
$$ plain form
10175 -56464 35861 -50739 -65932 -66942 -14755 -196770 21694 43948 -148898 78236 -128795
10163 113077 -273037 -105440 88409 -159682 216074 -134166 -32707 -147176 -247983 47845
10152 -30325 -496827 -271688 -12610 -24642 -111612 -279094 78695 -64543 -90944 -396822 17079
10140 -213634 48413 -68099 -13792 123079 129633 -101088 72794 149062 40459 4552 -401365
10128 -60337 -106972 -349836 -234870 -145436 129699 -49280 117794 -277260 -171624 -18949
10117 87402 193183 -2509 -310945 307794 75795 -19694 -242000 -228252 22120 55867 38133
10106 38133 -191321 -187170 342697 232559 85855 -229856 -176879 -329081 -182551 104474
10095 -20584 167367 50746 -75588 39611 -85903 109404 210025 -17920 270329 13424 -25992
10083f7038j92445B42338J35626a38770d3933A7947g1121k6563B09467B4973a63651
10071h7240L5514O760l5787A81397j8239b0196A63438B1967c5891l1436C070e296
10058i2954M2014k4364H7611a62254k5304A08399a15943r2949p2087a33417e6148
10046a11032H2086i9040G0995J32059n9033b42865D0840J02893a09676k212d5754
10034B58770a54202K8758M700r9943R7621K1970A65183p7885f5036l6904A0325
10022f3638F9392a8941B221K08860e6653B15371b210k6593G3842a75825f1292
10010a31481f537j15152k0520M2389L6334G1657C3550R5445c89822C37374A15013
9998A41295a0050j06670B03807a68226A00358C4212G33O5615b83562a05888k28526
$$ plain form
10083 -67038 -259483 242338 377964 -138770 -43933 17947 -71121 -97684 209467 24973 -163651
10071 -87240 -51726 -44966 -80753 181397 163158 -20196 163438 21967 -35891 -67327 3070 -5296
10058 -92954 -50940 -75304 87611 -162254 -187558 108399 -115943 -208892 -280979 -133417 -56148
10046 -111032 82086 -99040 70995 203054 144021 -242865 40840 143733 -109676 -111888 -45754
10034 258770 -154202 -125444 -120744 -220687 -123066 -101096 165183 87298 -65036 -101940 10325
10022 -63638 69392 -18941 2221 211081 -56653 215371 -2210 -28803 73842 -175825 -61292
10010 -131481 -6537 -121689 -142209 -99820 -63486 71657 33550 128995 -389822 337374 115013
9998 141295 -10050 -116720 203807 -168226 100358 34212 733 66348 -283562 -105888 -334414
9987c34414h7129K6411b8417p4282q9357P3633c6836m718C44438C2522J44870
9976A77392b59012a14025H1179J58428C0945b78702a07067l829r0177E4125m366
9965D9759R3802k6836M0531E8866M4490b78875J24234j51041a01029k3970G6031
9953a75305C947a13428A24695a66003N7091c96l58985R1824A36771a29419A95511
9941b18478r4134J7307H9860J20494a89952A27638a16217G3728b23693O2624k4615
9930a85684I0578e4919k30589A23397d5821A19047c00055N1942A74477L2515h3975
9918A9130L8959c81945F1928b66725a6659A77117B7451M7745b44885h253m58646
9907d66899E7532J07488o5034j8665a2845n00322h5960a3496B17662E3704a93290
$$ plain form
9987 -334414 -87129 -60718 -28417 -102699 -192056 -118423 -36836 -41554 344438 32522 177392
9976 177392 -259012 -114025 81179 239607 30945 -278702 -107067 -110896 -201073 54125 49759
9965 49759 143561 116725 157256 58866 103356 -278875 -154641 -305682 -101029 -124999 76031
9953 -175305 3947 -113428 124695 -166003 -108912 -396 -359381 -267557 136771 -129419 195511
9941 -218478 -312612 -295305 89860 210354 -189952 127638 -116217 73728 -223693 -161069 -185684
9930 -185684 90578 -54919 -285508 123397 -45821 119047 -300055 -248113 174477 206992 -83975
9918 19130 58089 -381945 61928 -266725 -16659 177117 27451 75196 -244885 -8253 -466899
9907 -466899 57532 165020 99986 81321 -12845 -513167 -85960 -13496 217662 53704 -193290
9895b18149E8738d8819o4262k00192C6646d26056c0865e68k485A8972K6314a90691
9882A89136f7902j33236a7731k2440k53741a16733P4A8932P5213B3626e9596j24352
9870a83948H1489C2965e8869B54796B5241n117c78449h4516E3820a94002N6919
9859a37083f8494l23018a08689E4078J80940M7462D2506a8819j86232M4427j08482
9848b69106I0103b30015C2189J20126a23166l4667j41291E3504b93829A11919
9837c03438g6662m5732L0287C25154j26027a30083A83635b71814e8387l9670b2842
9825A04675n1101J70099a52603D0117P9581d4017A153b41668B32362q8303e4364
9813f8236L2169l4393q4897M5235r860j29555P2723j27459f8486k04971C2041
$$ plain form
9895 -218149 58738 -48819 -113081 -313273 36646 -426056 -30865 -568 -3053 18972 45286 -190691
9882 189136 -67902 -201138 -17731 -40171 -293912 -116733 -116659 18932 94145 23626 -59596 -183948
9870 -183948 81489 32965 -58869 254796 25241 20124 -378449 -84516 53820 -194002 -137083
9859 -137083 -68494 -391512 -108689 54078 235018 282480 42506 -18819 -205051 -160624 -269106
9848 -269106 90103 -230015 32189 152315 -123166 -157833 -299124 53504 -293829 111919
9837 -303438 -76662 -122394 -92107 325154 199127 -130083 183635 -271814 -58387 -98057 -22842
9825 104675 53574 223673 -152603 40117 119698 -44017 1153 -241668 232362 144059 -54364
9813 -68236 -36067 -70460 -155357 -110122 -119982 -249537 -176814 -304273 -68486 -273457 32041
9801I7786p715b61111i3201j99785B65274o9814d5541n627j26771k23822d8281
9789A02183D006d0484l28971N8251a1911k20606J7452D7102d5034H2648f7188
9777b7877H7769J6581J47153a43978A05883f6368A98849a36185n9226J8384L9571
9766a37456o0264Q6376L4638l47746a69907g7538k9937n5682k22545A66586a36412
9754b04595B37401j02434b91950h954A8993J46980b54530O2358F3685a48863H5077
9742b23359F3526h4384j08484A35461N4433c29873A8237K76449b50072P3313h6507
9730A28778J64767A34761h2555j33612o4971I3264g6944D4725g7733J4490C02822
9718b43104i5288A16373b93853B50895C6978d5522j00362c4313j09381k7300B19941
$$ plain form
9801 97786 90071 -261111 -93201 -292986 265274 195460 -45541 -51168 -177939 -401761 -48281
9789 102183 4006 -40484 -369455 -311204 -11911 -232517 -215065 47102 -45034 82648 -67188
9777 -27877 87769 104350 251503 -143978 105883 -66368 198849 -136185 -195411 -177027 -137456
9766 -137456 -197720 -111344 -76706 -424452 -169907 -77538 -107475 -163157 -385702 166586 -136412
9754 -204595 237401 134967 -291950 -8954 18993 165973 -254530 -192172 63685 -148863 85077
9742 -223359 63526 -84384 -192868 135461 189894 -329873 18237 294686 -250072 -176759 -86507
9730 128778 293545 134761 -82555 -216167 -281138 93264 -76944 44725 -77733 -63243 302822
9718 -243104 -95288 116373 -293853 250895 36978 -45522 -145884 -34313 -143694 -170994 219941
9706I9338a87400b9796B12139h4731L3541l83628H4361b45319g3097k22095h1899
9694e11432A07440b55633D5243a93740l8466n9472B96508a46022L7875a8184a839
9682A26484d3505j801k97880A97877d8350j14744l5426B0260a98723N3087C8256
9670i8220K1509j22228R0725J6944B89552a46342j38891i8830K420B21902d40464
9658e25869h7210m35125A65125j9748C4179g3793m0430N2922k7574j2297A55500
9646b47228M6566C32611k1161c96837A29120b93883A62816l0204m2596a93418
9635b99965R7898A80610H1805a28466j00172h5455B0620a93462a9459B499c18996
9623E6251a14272q8076J00672r1605c6503p6760F7051c09741e1754C6419P7532
$$ plain form
9706 99338 -187400 -29796 212139 -84731 -51190 -434818 84361 -245319 -73097 -295192 -81899
9694 -511432 107440 -255633 45243 -193740 -232206 -291678 296508 -146022 -108147 -18184 -1839
9682 126484 -43505 -45306 -343186 197877 -48350 -163094 -198520 20260 -198723 -145636 38256
9670 -98220 -76711 -198939 -108214 -91270 289552 -146342 -285233 -98830 -96410 221902 -440464
9658 -525869 -87210 -522335 165125 145377 34179 -73793 -114223 -61301 -88875 -101172 155500
9646 -247228 -200662 332611 311450 -396837 129120 -293883 162816 132612 90016 -193418
9635 -299965 -202067 180610 81805 -128466 -228638 -85455 20620 -193462 -19459 2499 -318996
9623 56251 -114272 -202348 -101676 -193281 -36503 -113263 67051 -309741 -51754 36419 113951
9612A13951a42175D1485e18333E1523f8042Q941p3499b2878C3684a5238k00563
9601b15801g1208b5333H8559L8898a62122H8852J6866b46261h0870B44170a0854
9589b00305C3711a48705o8794a6952k909C52527a8210k31679e3676n5463C05874
9577A88697G2307L76667j80920b01362h3584c0580j0589j21307g793j24208d5281
9565d00391a95859b6292O703B50215a83245n7973B58545j09092k7405o0351a5945
9553E4098a50947k31810Q4036a28304A25020a98865A04505a79017m6979j32307
9543c58303I2758p947e2394P904j12364G9205M1651e9687A05306a73529g2291
9531f6756G3830b0737C8839O5746b72951f1097A40912A9278a40744A17530a63558
$$ plain form
9612 113951 -142175 41485 -518333 51523 -68042 -59101 -132600 -22878 33684 -15238 -215801
9601 -215801 -71208 -25333 88559 127457 -162122 88852 105718 -246261 -80870 244170 -10854
9589 -200305 33711 -148705 -217499 -16952 -19861 352527 -18210 -249889 -53676 -109139 305874
9577 188697 72307 448974 268054 -201362 -83584 -30580 -41169 -162476 -7793 -132001 -45281
9565 -400391 -195859 -26292 -19589 250215 -183245 -241218 258545 149453 122048 61697 -15945
9553 54098 -150947 -382757 -298721 -128304 125020 -198865 104505 -179017 -225996 -358303
9543 -358303 92758 84811 -52394 -44490 -156854 79205 120856 -59687 105306 -173529 -72291
9531 -66756 73830 -20737 38839 104585 -272951 -61097 140912 19278 -140744 117530 -163558
9519h2738c9809F8544l3196e9431B8812b63402K8677B89373b64055a09086j6075
9508a25161p1036H641R2508a13232H122J02544D8985e8164C0165a83560q8780
9497b72340d8514A09085C0340a31037I0352K30894j30511r1545k9995P3668J01965
9486B44828a11428A03324d2721B9916c6378j02348B18660a23114o7133F8083j2055
9475E6028a29145o8086A86163d7168k42943d9595j71636o1778N7316O113R0673
9464a28907n9373g194G3160a62698N4253A30852h3969L9911n56596F9834L6236
9453A06070a12000m3570A25317c9014C46614c1329n147k68098B47693b92714F4603
9441b17028g1899k73761d9184A71174i0555p8125k539A61787F5433j2087N2729
$$ plain form
9519 -82738 -39809 68544 35348 -59431 28812 -263402 -234725 289373 -264055 -109086 -125161
9508 -125161 -196197 8641 101149 -113232 8122 110666 48985 -58164 30165 -183560 -272340
9497 -272340 -48514 109085 30340 -131037 90352 321246 190735 99190 69195 142863 244828
9486 244828 -111428 103324 -42721 29916 -36378 -138726 218660 -123114 -190247 68083 56028
9475 56028 -129145 -197231 186163 -47168 -290111 -49595 -221231 -283009 -225693 -219580 -128907
9464 -128907 -188280 -7194 73160 -162698 -108445 130852 -83969 -44058 -600654 69834 106070
9453 106070 -112000 -155570 125317 -39014 346614 -31329 -36476 -304574 247693 -292714 64603
9441 -217028 -71899 -345660 -49184 171174 -90555 -168680 -171219 161787 65433 53346 106075
9430A06075l5903j2472c17064A01170a72384j05228B79881h2486p607M3572p6109
9419a22630A94112b35591B15807d27638a13643l03772C45515i1798K0364K3479
9409d7955H720c8052D1526g6255B1877K61550i6836C04587c36274d1408H4877
9397a53132M2521c5113e329A55024a2402k45881g6471l14373i2520j88195O9709
9386b11006e1102j80678E0632a31734A95012a07976K6555k71483E1517a98567
9375a94257j07081a26995k83664A23045a19851N7022j61627A4002M01838K4736
9365D40576A1261b8964j56286F6930a2602A66508g9458q132C10b29847c0656j83718
9353b14374C9891a04503j74104L853e569j38034j09236B835N3889A1568M1843
$$ plain form
9430 106075 70172 57700 -317064 101170 -172384 -277612 279881 -82486 -90093 -46521 -122630
9419 -122630 194112 -235591 215807 -427638 -113643 -417415 345515 -91798 -71434 -47955
9409 -47955 8720 -38052 41526 -76255 21877 283427 -96836 304587 -336274 -41408 84877
9397 -153132 -110611 -35113 -5329 155024 -12402 -258283 -76471 -390844 -92520 -280715 -211006
9386 -211006 -51102 -231780 50632 -131734 195012 -107976 -81421 -352904 51517 -198567
9375 -194257 -301338 -126995 -410659 123045 -119851 -62829 -224456 14002 415840 440576
9365 440576 11261 -28964 -185250 66930 -12602 166508 -79458 -87590 310 -229847 -30656 -214374
9353 -214374 39891 -104503 -278607 -274754 -5569 -143603 -252839 2835 56724 11568 53411
9342E3411a51900j31199E9771A2431c1637I0827b82878E5148c719k04774Q5034
9331a23459h466k25575i6537B17193b99402A08669a25252p9600n8812j64812A95794
9319g153k4735A5582F863b34505k2974b6728C6852E118g2632p9302C43492b81971
9306e6143A80377D0288J57511I3034b95147A55809b22759a6238F9658j0753N7562
9295A16467b50627a0198o8589C35953g6105b6453l77858H7676a68908A16847a16011
9283c76297A10165k446g6722q3065j54859d5511l09607A27025C8505b53729i9153
9271A86009a94735B46125j00993b67106B43046a4973G2574b43081H5577B7432
9260e8647E2327J10291b29170E7912J29399a21222M9183ho8171p6943o3825d9557
$$ plain form
9342 53411 -151900 -283099 59771 12431 -31637 90827 -282878 55148 -3719 -208493 -123459
9331 -123459 -8466 -234041 -96537 217193 -299402 108669 -125252 -204852 -263664 -428476 195794
9319 -7153 -31888 15582 6863 -234505 -257479 -26728 36852 5118 -72632 -151934 343492 -281971
9306 -56143 180377 40288 197799 93034 -295147 155809 -222759 -16238 69658 58905 116467
9295 116467 -250627 -10198 -78787 335953 -76105 -26453 -404311 87676 -168908 116847 -116011
9283 -376297 110165 107719 -76722 -159787 -314646 -45511 -355118 127025 38505 -253729 -99153
9271 186009 -194735 246125 145132 -267106 243046 -14973 72574 -243081 85577 27432
9260 -58647 52327 162618 -229170 57912 187311 -121222 -72039 -8 -68179 -145122 -208947 -49557
9247b07763j937D1040A9624o485K43383a15239A20414c6187k05569p7212a025
9235c28238a7904j70414r0901R2152A67517J04337p5519a65255A875O7360b77632
9223b23456f0352a7675k36006g8152b9374A07443a05457A04362b6271q0283r7028
9212b03582Q3370A09924i3250M0798A15919J42316b21377a1960j12398d5062j92616
9201b37678M1424g9145F0545J09620a20646I4969b63303d1333E4977K06835f1966
9189A4642a20406F825f7211l05078a74393d3849k14631i8282k02005B89269H4117
9177c4640E451f4513o4096A49759F6305j1092a25195j22724j54849a3192l3338
9166d6530j15174O3691o3203j42037J21437j6653b5878A53258g8312B8653c68121
$$ plain form
9247 -207763 -209700 41040 19624 13139 256522 -115239 120414 -36187 -241756 -318968 -1025
9235 -328238 -17904 -188318 -279219 -187067 167517 271854 196335 -165255 1875 69235 -277632
9223 -223456 -60352 -17675 -253681 -78152 -29374 107443 -105457 104362 -26271 -106554 -203582
9212 -203582 -120212 109924 -93250 -52452 115919 258235 -221377 -11960 -124358 -45062 -237678
9201 -237678 -196254 -79145 60545 170165 -120646 94969 -263303 -41333 54977 261812 -61966
9189 14642 -120406 6825 -67211 -372289 -174393 -43849 -258480 -98282 -300287 289269 84117
9177 -34640 5451 -64513 -128609 149759 66305 55213 -125195 -247919 -402768 -13192 -46530
9166 -46530 -161704 -98013 -161216 -303253 -181816 -198469 -25878 153258 -78312 28653 -368121
9154a49352r7320i9897B36790A4508N8044b8729p4303l8201f4323L001A8265e1644
9141b09773F7838a74675k8570Q7413K6834D4649f104j6800j61368e4481A69301
9129a81696p0037Q3561b8581R143j90252R9588G393b92516D171g5103K0596G7860
9116a0251j17258o3406K2747I6521b6139C8483b5634H220a65269B23406F2159
9104c7394A36492A4135h5446n8054d2383j2445j07555K3258M2336B65584f8563
9092c26508D25026k00655c04234g6859H3789c50626F8863N6476m673A7071R9175
9081A16246N656O5899J28861H488a82438f6218A28624a23624k1445C5835b34586
9069b1186C0872a96497B12460A5755h2352D2995O5656b11090A40106a06568l48415
$$ plain form
9154 -149352 -246672 -99897 236790 14508 72552 -28729 -103032 -141233 -64323 -61322 18265 -51644
9141 -209773 67838 -174675 -203245 -115832 -88998 44649 -6104 -22904 -184272 -54481 169301
9129 -181696 -251733 -168172 -28581 -19438 -209690 -110102 7393 -292516 4171 -75103 -54507 77860
9116 -10251 -127509 -190915 -168168 96521 -26139 38483 -25634 8220 -165269 223406 62159
9104 -37394 136492 14135 -85446 -143500 -42383 -54828 -162383 -139125 -96789 265584 -68563
9092 -326508 425026 224371 -304234 -76859 83789 -350626 68863 125339 120666 17071 116246
9081 116246 121902 187801 316662 8488 -182438 -66218 128624 -123624 -145069 35835 -234586
9069 -21186 30872 -196497 212460 15755 -82352 42995 108651 -211090 140106 -106568 -454983
9058d54983J57755i5052j21898A71798B6831a42059p8045Q7086l2692M7858j5905
9047a33757K1400L9863G1829L89829e9184j4127B12810O8400I4453P036g3163
9035A97782D484b32325E720a6031k63938a35161A22027A3371a4360j96507a5561
9023C8058e5275A11089R9740B785M1075e9583P875l57343a09979m1250K0322E8929
9010d3580q3712K6258n1343A42814h4211B38502L6129q6661e2994J5963A61049
8998C9928E07P0422b1140A23765h5720j16541D4846c03810P6723G4213J8087a73235
8985B1711a57881o9387O0583m1614C2046M1034K02e8919k1868j24492a4888j94563
8973b09451P2520l2765H4002K6372A5738K17203m0038l2175J30032d19533l8895
$$ plain form
9058 -454983 -297228 -95052 -216950 171798 26831 -142059 -220104 -133018 -165710 -117852 -133757
9047 -133757 -112357 -72494 71829 461658 -59184 -73311 212810 281210 94453 101489 -73163
9035 197782 4484 -232325 5720 -16031 -279969 -135161 122027 13371 -14360 -210867 -15561
9023 38058 -55275 111089 210829 2785 43860 -59583 -51708 -409051 -109979 -151229 -130907 58929
9010 -43580 -127292 -101034 -152377 142814 -84211 238502 274631 187970 -52994 -37031 161049
8998 39928 507 70929 -21140 123765 -85720 -202261 44846 -303810 -227087 74213 92300 -173235
8985 21711 -157881 -227268 -166685 -208299 32046 73080 73282 -58919 -80787 -205279 -14888 -209451
8973 -209451 -136931 -169696 84002 110374 15738 232941 192903 160728 290760 -419533 -458428
8962d58428J79399G1898a51916N919A6824J18450a81143M3846m507E077a28565
8950i89I077a96112B34838A5825K6139L17079j63041a49562P2267H7067O4230
8939A51297D4131b01319A85793B2332a12087I933K4625h594o0917b7395D99965
8927A88932b50808g5396L4726A91343L27872F2169d7622A119001m30473B95251
8916B78140a17740H4348A5129M9199a90513A7135a78234j8182A39796b64096i9247
8904b44206D9016a21567n3926E8118M7445B3772a98844f9470j51178b2855l982
8893b6837k49526c5589E5041J23468a51377j95009J32290G7210c72168A33499
8882B91926N1298a3927A24830a16265A14776a75997g5550m2661p4029F6721g8943
$$ plain form
8962 -458428 -279029 71898 -151916 -145997 16824 135274 -181143 -137297 -141804 5077 -128565
8950 -989 9077 -196112 234838 15825 41964 359043 196002 -149562 -77295 87067 151297
8939 151297 44131 -201319 185793 22332 -112087 9933 34558 -8594 -69511 -27395 499965
8927 188932 -250808 -75396 -40670 191343 519215 62169 -47622 1119001 688528 295251
8916 278140 -117740 84348 15129 64328 -190513 17135 -178234 -196416 139796 -264096 -99247
8904 -244206 49016 -121567 -175493 58118 105563 23772 -198844 -69470 -220648 -22855 -26837
8893 -26837 -276363 -35589 55041 178509 -151377 -346386 -214096 77210 -372168 133499
8882 291926 343224 -13927 124830 -116265 114776 -175997 -75550 -118211 -192240 66721 -78943
8870b97959R1350i2474m07124a18441j08169a5216o0803C53478A01657c65629
8859a849H2468C1711j0775b54763f97A08460a73451R311c0516O528k63228g160
8846a45949q7054E7280a11640L0574k3520j79150c8205B4981b50004A53763a65798
8834A90543F7721g6899p3445A70448E2195c92995A46741b98027C6995b17113j44631
$$ plain form
8870 -297959 -206609 -92474 -499598 -118441 -226610 -15216 -76019 353478 101657 -365629
8859 -1849 82468 31711 20936 -254763 -697 108460 -173451 -164140 -30516 -23988 -287216 -7160
8846 -145949 -233003 57280 -111640 -81066 -104586 -283736 -38205 24981 -250004 153763 -165798
8834 190543 67721 -76899 -150344 170448 52195 -392995 146741 -298027 36995 -217113 -361744
$$ [...]
##END NTUPLES=NMR SPECTRUM
##END=
