##TITLE=NES1001_50250289_9225092_mVNcrKuYP1
##JCAMPDX= 6.0         $$ Bruker NMR JCAMP-DX V2.0
##DATA TYPE= NMR SPECTRUM
##DATA CLASS= NTUPLES
##ORIGIN= BRUKER
##OWNER= Administrator
$$ 1.72 TOPSPIN		Version 2.1
$$ 2015-06-17 14:35:42.956 -0700  Administrator@X
$$ Compression mode = diff/dup
##.OBSERVE FREQUENCY= 400.02188249412
##.OBSERVE NUCLEUS= ^1H
##.ACQUISITION MODE= SIMULTANEOUS (DQD)
##.ACQUISITION SCHEME= undefined
##.AVERAGES= 64
##.DIGITISER RES= 22
##SPECTROMETER/DATA SYSTEM= spect
##.PULSE SEQUENCE= noesygpps1d.comp
##.SOLVENT NAME= COFFEE_meoh
##.SHIFT REFERENCE= INTERNAL, COFFEE_meoh, 1, 14.9621
##AUDIT TRAIL= $$ (NUMBER, WHEN, WHO, WHERE, PROCESS, VERSION, WHAT)
$$ ##TITLE= Audit trail, TOPSPIN		Version 2.1
$$ ##JCAMPDX= 5.01
$$ ##ORIGIN= Bruker BioSpin GmbH
$$ ##OWNER= Administrator
$$ $$ E:\/data/COFFEE/nmr/NES1001_50250289_9225092_mVNcrKuYP1/12/pdata/1/auditp.txt
$$ ##AUDIT TRAIL=  $$ (NUMBER, WHEN, WHO, WHERE, PROCESS, VERSION, WHAT)
(   1,<2015-06-17 14:35:36.534 -0700>,<Administrator>,<X>,<go>,<TOPSPIN 2.1>,
      <created by zg
	started at 2015-06-17 14:24:06.425 -0700,
	POWCHK enabled, PULCHK disabled,
       configuration hash MD5:
       21 0F 79 D6 B3 7B B4 F6 88 20 88 DB 03 48 BD 9F
       data hash MD5: 64K
       74 FF F1 1B DD 38 97 EF DC 4D 61 5C 20 CC D6 BC>)
(   2,<2015-06-17 14:35:39.659 -0700>,<Administrator>,<X>,<proc1d>,<TOPSPIN 2.1>,
      <Start of raw data processing
       efp LB = 0.3 FT_mod = 6 PKNL = 1 PHC0 = 0 PHC1 = 0 SI = 128K 
       data hash MD5: 128K
       B7 32 D8 E7 D0 61 A4 F3 EF A6 0A 1A EF 6D 9B 29>)
(   3,<2015-06-17 14:35:40.612 -0700>,<Administrator>,<X>,<proc1d>,<TOPSPIN 2.1>,
      <pk PHC0 = -85.94604 PHC1 = 0 
       data hash MD5: 128K
       E1 B3 F5 7B 0B E4 EB 66 7C AA BE 82 48 02 D3 CE>)
(   4,<2015-06-17 14:35:41.253 -0700>,<Administrator>,<X>,<proc1d>,<TOPSPIN 2.1>,
      <abs ABSG = 1 
       data hash MD5: 128K
       30 63 04 9A F3 CE C7 2E 23 1C 38 5E 17 2C 6E 93>)
(   5,<2015-06-17 14:35:41.706 -0700>,<Administrator>,<X>,<proc1d>,<TOPSPIN 2.1>,
      <abs ABSG = 2 
       data hash MD5: 128K
       D6 FB 69 66 E6 29 E0 2B F4 1A 2F 0A 21 06 53 F7>)
(   6,<2015-06-17 14:35:41.800 -0700>,<Administrator>,<X>,<proc1d>,<TOPSPIN 2.1>,
      <abs ABSG = 3 
       data hash MD5: 128K
       84 C9 12 FC F8 9D B8 84 B0 BC 99 53 D4 C6 B0 31>)
(   7,<2015-06-17 14:35:42.097 -0700>,<Administrator>,<X>,<proc1d>,<TOPSPIN 2.1>,
      <abs ABSG = 4 
       data hash MD5: 128K
       32 2C C5 E7 21 C1 59 A9 ED 10 CF 6B 84 BF 6D C8>)
(   8,<2015-06-17 14:35:42.347 -0700>,<Administrator>,<X>,<proc1d>,<TOPSPIN 2.1>,
      <abs ABSG = 5 
       data hash MD5: 128K
       E2 9D 95 C3 07 92 82 FD 4F A5 E7 6C 45 9A DC 52>)
$$ ##END=
$$ 
$$ $$ hash MD5
$$ $$ 62 69 9F 62 A1 45 67 99 FB 7E FA 00 60 4C EF D6
##$RELAX= 
##$RELAX= 
##$RELAX= 
##$RELAX= 
##$RELAX= 
##$RELAX= 
##$RELAX= 
##$RELAX= 
$$ Bruker specific parameters
$$ --------------------------
##$DU= <E:\>
##$EXPNO= 12
$$ [...]
150 150 150 150 150 150 150 150
##$TP07= 0
##$TPNAME0= <>
##$TPNAME1= <>
##$TPNAME2= <>
##$TPNAME3= <>
##$TPNAME4= <>
##$TPNAME5= <>
##$TPNAME6= <>
##$TPNAME7= <>
##$TPOAL= (0..7)
0.5 0.5 0.5 0.5 0.5 0.5 0.5 0.5
##$TPOFFS= (0..7)
0 0 0 0 0 0 0 0
##$TUNHIN= 0
##$TUNHOUT= 0
##$TUNXOUT= 0
##$USERA1= <user>
##$USERA2= <user>
##$USERA3= <user>
##$USERA4= <user>
##$USERA5= <user>
##$V9= 5
##$VALIST= <valist>
##$VCLIST= <CCCCCCCCCCCCCCC>
##$VD= 0
##$VDLIST= <DDDDDDDDDDDDDDD>
##$VPLIST= <PPPPPPPPPPPPPPP>
##$VTLIST= <TTTTTTTTTTTTTTT>
##$WBST= 2048
##$WBSW= 25
##$XGAIN= (0..3)
0 0 0 0
##$XL= 0
##$YL= 0
##$YMAX_a= 5429230
##$YMIN_a= -9750725
##$ZGOPTNS= <>
##$ZL1= 120
##$ZL2= 120
##$ZL3= 120
##$ZL4= 120
##$ABSF1= 14.9621
##$ABSF2= -5.596082
##$ABSG= 5
##$ABSL= 3
##$ALPHA= 0
##$AQORDER= 0
##$ASSFAC= 0
##$ASSFACI= 0
##$ASSFACX= 0
##$ASSWID= 0
##$AUNMP= <proc_prof1d_extract.lims>
##$AXLEFT= 0
##$AXNAME= <>
##$AXNUC= <1H>
##$AXRIGHT= 0
##$AXTYPE= 0
##$AXUNIT= <>
##$AZFE= 0.1
##$AZFW= 0.1
##$BCFW= 0
##$BC_mod= 0
##$BYTORDP= 0
##$COROFFS= 0
##$CY= 15
##$DATMOD= 1
##$DC= 0
##$DFILT= <>
##$DTYPP= 0
##$F1P= 0
##$F2P= 0
##$FCOR= 0.5
##$FTSIZE= 131072
##$FT_mod= 6
##$GAMMA= 0
##$GB= 0
##$INTBC= 1
##$INTSCL= 1
##$ISEN= 128
##$LB= 0.3
##$LEV0= 0
##$LPBIN= 0
##$MAXI= 10000
##$MC2= 0
##$MEAN= 0
##$ME_mod= 0
##$MI= 0
##$NCOEF= 0
##$NC_proc= -2
##$NLEV= 6
##$NOISF1= 0
##$NOISF2= 0
##$NSP= 0
##$NTH_PI= 0
##$NZP= 0
##$OFFSET= 14.9621
##$PC= 1
##$PHC0= -85.94604
##$PHC1= 0
##$PH_mod= 1
##$PKNL= yes
##$PPARMOD= 0
##$PPDIAG= 0
##$PPIPTYP= 0
##$PPMPNUM= 2147483647
##$PPRESOL= 1
##$PSCAL= 4
##$PSIGN= 0
##$PYNMP= <proc.py>
##$REVERSE= no
##$SF= 400.020009197052
##$SI= 131072
##$SIGF1= 0
##$SIGF2= 0
##$SINO= 400
##$SIOLD= 131072
##$SPECTYP= <>
##$SREGLST= <1H.CDCl3>
##$SSB= 0
##$STSI= 131072
##$STSR= 0
##$SW_p= 8223.68421052631
##$SYMM= 0
##$S_DEV= 0
##$TDeff= 65536
##$TDoff= 0
##$TI= <>
##$TILT= no
##$TM1= 0
##$TM2= 0
##$TOPLEV= 0
##$USERP1= <user>
##$USERP2= <user>
##$USERP3= <user>
##$USERP4= <user>
##$USERP5= <user>
##$WDW= 1
##$XDIM= 131072
##$YMAX_p= 306600572
##$YMIN_p= -11001
##$CURPLOT= <Network HP LaserJet P1505>
##$CURPRIN= <$Network HP LaserJet P1505>
##$DFORMAT= <normdp>
##$LAYOUT= <+/1D_H.xwp>
##$LFORMAT= <normlp>
##$PFORMAT= <normpl>
##$SURQMSG= 1
$$ End of Bruker specific parameters
$$ ---------------------------------
##NTUPLES= NMR SPECTRUM
##VAR_NAME=  FREQUENCY,     SPECTRUM/REAL,   SPECTRUM/IMAG
##SYMBOL=    X,             R,               I
##VAR_TYPE=  INDEPENDENT,   DEPENDENT,       DEPENDENT
##VAR_FORM=  AFFN,          ASDF,            ASDF
##VAR_DIM=   131072,        131072,          131072
##UNITS=     HZ,            ARBITRARY UNITS, ARBITRARY UNITS
##FACTOR=    0.0627417313425164, 1,          1
##FIRST=     8223.62146879497, -673,         -37244
##LAST=      0,             714,             -37849
##MIN=       0,             -11001,          0
##MAX=       8223.62146879497, 306600572,    0
$$ Real data points
##PAGE= N=1
##DATA TABLE= (X++(R..R)), XYDATA
$$ [...]
67887 42701 42708 42195 41616 41291 41162 40965 40498 39726 38804 38065 37907 38430 39209 39548 39118 38295 37784 37915 38423 38876
67867 38876 39119 39243 39391 39834 40968 42788 44475 45024 44407 43635 43494 43728 43729 43507 43472 43701 44080 44906 46583
67848 46583 48744 50355 50847 50631 50359 50229 50210 50455 51116 51998 52639 52570 51466 49431 47197 45565 44476
67831 44476 43090 41061 39200 38487 38833 39293 39222 38715 38132 37687 37490 37549 37699 37768 37797 37955 38339 38974 39755
67812 39755 40232 39782 38362 36817 36063 36178 36647 37194 37841 38403 38550 38381 38385 38767 39310 39922 40837 42123 43438
67793 43438 44424 44980 45075 44701 44161 43957 44151 44214 43734 42967 42388 42058 41752 41504 41633 42251 43043 43547 43553 43292
67773 43292 43290 43903 44944 45890 46542 47206 48114 48965 49356 49459 49889 50867 51825 51987 51139 49716 48229 46842
67755 46842 45535 44499 44082 44295 44610 44469 43877 43284 43006 43048 43454 44379 45723 46986 47718 47882 47638 47060
67737 47060 46357 46078 46668 47826 48666 48662 48176 47902 47923 47551 46152 44039 42374 42065 42817 43453 43155 42181 41311
67718 41311 40900 40723 40567 40588 41025 41825 42704 43425 43911 44187 44312 44341 44264 44085 44032 44585 46053 48064 49691
67699 49691 50253 49963 49605 49652 49911 50046 50087 50240 50486 50693 51023 51772 52745 53161 52503 51253 50503 50804 51617
67680 51617 51962 51508 50884 50895 51590 52253 52298 51895 51556 51323 50727 49563 48238 47207 46389 45513 44835 45064 46444
67661 46444 48206 49192 48980 48258 48123 49093 50799 52481 53651 54298 54659 54983 55526 56598 58394 60680 62724
67644 62724 63706 63381 62348 61563 61537 62001 62348 62308 62137 62269 62838 63577 64134 64489 65008 66011 67360 68612
67626 68612 69472 69928 69972 69551 68835 68166 67582 66737 65514 64325 63463 62564 61251 60015 59739 60439 61127 61065
67608 61065 60483 59873 59245 58469 57854 57804 58214 58660 58986 59237 59188 58490 57304 56303 55906 55860 55753 55644 55974
67589 55974 57010 58528 59953 60700 60520 59668 58685 57976 57648 57782 58631 60293 62300 63838 64455 64321 63775
67572 63775 62885 61670 60480 59763 59547 59464 59269 59009 58700 58254 57768 57463 57209 56595 55744 55508 56433 57950
67554 57950 59140 59943 60970 62341 63438 63824 63763 63778 64202 65147 66307 66770 65730 63594 61751 61021 60989
67537 60989 61088 61544 62703 64069 64757 64574 64052 63634 63375 63223 63073 62716 62188 62050 62821 64296 65811 66986
67519 66986 67788 68150 68116 68191 68868 69812 70154 69622 68809 68220 67692 66986 66387 66362 66964 67862 68624 68790 68041 66613
67499 66613 65228 64344 63760 63210 62948 63335 64149 64857 65434 66379 67876 69430 70528 71270 72078 73037 73863 74368
67481 74368 74657 74878 75052 75188 75370 75687 76237 77252 78928 80968 82583 83213 83073 82684 82116 81130 79914
67464 79914 79098 78939 79105 79381 80004 80984 81734 81966 82408 83929 86171 87753 87773 86498 84735 83161 82277
67447 82277 82215 82391 81949 80816 79818 79516 79513 79234 78850 78904 79435 80057 80593 81095 81373 81107 80436 79945 79979 80306
67427 80306 80566 80780 81336 82602 84525 86365 86990 85859 83781 82330 82316 83112 83617 83493 83218 83261 83673 84345
67409 84345 85199 86036 86544 86604 86397 86143 85990 86212 87179 88845 90487 91292 91219 91012 91376 92311 93250 93615 93260
67390 93260 92591 92345 92987 94237 95366 96015 96525 97347 98428 99418 100222 100973 101510 101291 100017 98175 96778
67373 96778 96503 97204 98313 99618 101382 103605 105550 106472 106651 107078 108052 108783 108707 108527 109239 110518 110950
67356 110950 109840 108042 106850 106670 107060 107570 108054 108413 108486 108253 107957 107983 108541 109399 110010 110114 110125 110616 111508
67337 111508 112149 112228 112106 112093 111920 111311 110696 110831 111861 113304 114867 116729 118838 120442 120731 119805 118650
67320 118650 118147 118344 118794 119337 120311 122055 124419 126810 128584 129366 129251 128861 129023 130168 132027 134034
67304 134034 135894 137582 138916 139526 139330 138845 138848 139760 141398 143202 144658 145595 146156 146557 146948 147511 148468
67287 148468 149853 151390 152756 153849 154703 155319 155814 156514 157600 158789 159637 160043 160151 159986 159633 159609 160416
67270 160416 161656 162268 161899 161535 162325 164176 165979 167011 167613 168509 169896 171366 172541 173582 175005 177033
67254 177033 179234 180913 181789 182179 182588 183340 184484 185739 186562 186630 186314 186402 187243 188455 189553 190548 191802
67237 191802 193604 195996 198771 201482 203687 205338 206732 208013 209023 209731 210499 211741 213551 215754 218072
67222 218072 220180 221938 223611 225503 227316 228362 228513 228444 228744 229423 230518 232433 235111 237515 238734
67207 238734 239197 240071 241738 243619 245320 247078 249045 250922 252554 254321 256636 259414 262212 264646 266602
67192 266602 268335 270394 273122 276210 278997 281181 282921 284301 285165 285542 285872 286623 287993 290023 292693
67177 292693 295802 298988 302026 304946 307898 311018 314328 317548 320160 321965 323451 325213 327154 328745
67163 328745 329995 331610 334113 337326 340858 344583 348449 352300 356116 360070 364077 367691 370715 373557
67149 373557 376688 380113 383638 387283 390991 394274 396652 398334 400050 402261 404868 407654 410639 413958
67135 413958 417658 421676 425843 429883 433601 437123 440799 444807 448924 452746 456177 459688 464019 469501
67121 469501 475640 481501 486542 490979 495429 500377 505959 511940 517804 523088 527775 532207 536616 541031
67107 541031 545654 550891 556756 562612 567874 572698 577646 582904 588262 593695 599440 605507 611632 617817
67093 617817 624409 631459 638379 644657 650708 657609 665901 674852 683005 689461 694639 699846 706136 713547
67079 713547 721419 729238 737006 744868 752765 760645 768776 777435 786340 794696 802026 808796 816026 824313
67065 824313 833362 842442 851099 859403 867683 876210 885098 894369 904057 914256 925012 936099 947023
67052 947023 957398 967363 977450 987938 998514 1008728 1018684 1028963 1039843 1050925 1061742 1072495
67040 1072495 1083810 1095902 1108443 1121255 1134601 1148462 1162064 1174633 1186384 1198217 1210555
67029 1210555 1223039 1235313 1247461 1259596 1271621 1283681 1296255 1309446 1322669 1335479 1348311
67018 1348311 1361893 1376233 1390745 1405127 1419545 1434063 1448391 1462271 1475722 1488904 1502036
67007 1502036 1515373 1528966 1542557 1556011 1569636 1583686 1597780 1611403 1624816 1638746 1653139
66996 1653139 1666986 1679652 1691765 1704385 1717750 1731234 1744234 1756657 1768715 1780626 1792535
66985 1792535 1804530 1816655 1828915 1841222 1853451 1865644 1877939 1890020 1900937 1910016 1917853 1925798
66973 1925798 1934411 1943020 1950979 1958631 1966616 1974779 1982332 1988782 1994261 1999138 2003774 2008553 2013738 2019183
66959 2019183 2024295 2028293 2030576 2031147 2030790 2030628 2031324 2032836 2034792 2036703 2037883 2037854 2037018 2036346 2036042 2035050
66943 2035050 2032316 2028051 2023289 2018666 2014205 2009882 2005691 2001289 1996246 1990584 1984551 1978007 1970575 1962379
66929 1962379 1954117 1946303 1938826 1931174 1922749 1913058 1902141 1890885 1880458 1871204 1862368 1852888 1842244
66916 1842244 1830563 1818321 1806056 1794016 1781968 1769477 1756456 1743254 1730286 1717773 1705811
66905 1705811 1694376 1683240 1672034 1660433 1648153 1634989 1621089 1607004 1593213 1579758 1566646
66894 1566646 1554302 1543079 1532419 1521101 1508428 1494768 1480884 1467177 1453677 1440330 1427085
66883 1427085 1413982 1401287 1389224 1377469 1365253 1352209 1338888 1326232 1314655 1303719 1292553
66872 1292553 1280547 1267738 1254586 1241389 1228155 1215187 1203332 1193065 1183497 1172949 1160707
66861 1160707 1147685 1135297 1124118 1113794 1103686 1093286 1082449 1071584 1061358 1051926 1042745 1033331
66849 1033331 1023849 1014622 1005485 996038 986308 976627 966951 956847 946234 935748 926108 917292 908586
66836 908586 899414 889937 880746 872123 863825 855622 847679 840182 832885 825424 817974 811120 805087 799490
66822 799490 793872 788103 782132 775832 769238 762630 756152 749667 743110 736626 730159 723275 715684 707660
66808 707660 699733 692269 685544 679853 675170 670926 666487 661715 656822 651883 646777 641394 635662 629526
66794 629526 623126 616820 610781 604795 598627 592349 586079 579805 573793 568733 564932 561639 557800 553322
66780 553322 548996 545246 541646 537798 533963 530501 527158 523396 519188 515127 511734 508883 505907 502162
66766 502162 497541 492423 487168 481860 476651 472064 468523 465705 462830 459604 456423 453481 450274 446372
66752 446372 442303 439071 436838 434525 430886 425809 420446 416179 413491 411744 409930 407617 405136 402953
66738 402953 401064 399127 396999 394843 392717 390297 387181 383382 379353 375585 372288 369454 367048 365070
66724 365070 363530 362496 362067 362127 362154 361392 359315 355946 351831 347807 344662 342718 341573 340355 338376 335563
66708 335563 332366 329350 326822 324645 322360 319703 317030 315014 313824 312848 311347 309176 306672 304064
66694 304064 301282 298286 295272 292516 290248 288712 288164 288623 289659 290514 290572 289751 288435 286950 285206 282960
66678 282960 280362 277958 276138 274839 273851 273081 272332 271138 269195 266841 264795 263437 262473 261262 259291
66663 259291 256510 253427 250818 249113 248060 247094 245925 244571 242955 240853 238297 235800 233956 232862
66649 232862 232020 230867 229339 227803 226388 224657 222264 219723 217991 217276 216890 216408 216265 216767 217188 216552
66633 216552 214891 213008 211335 209826 208749 208611 209202 209585 209218 208436 207604 206568 205239 204026 203172 202270
66617 202270 200921 199441 198377 197701 197045 196411 196088 195987 195662 194924 194010 193162 192361 191481 190399 188986 187288
66600 187288 185688 184610 184043 183560 182782 181654 180380 179289 178655 178438 178341 178293 178645 179473 179949 178973 176485
66583 176485 173698 171851 171104 170772 170287 169594 168873 168200 167517 166757 165937 165139 164354 163451 162442 161702 161659 162213
66565 162213 162753 162873 162811 162957 163178 162933 161989 160719 159649 158917 158287 157539 156728 156100 155821 155779 155617 155027 154086
66546 154086 153302 153232 153944 154851 155119 154312 152643 150620 148606 146779 145387 144767 145007 145709 146208 146028 145116
66529 145116 143770 142450 141599 141402 141648 141895 141846 141529 141039 140213 138751 136702 134652 133335 133071 133651 134609
66512 134609 135417 135551 134690 133022 131249 130076 129670 129618 129348 128625 127728 127182 127162 127106 126137 124012 121515 119721
66494 119721 118991 118894 118941 119078 119435 120005 120687 121393 121964 122189 122104 122081 122377 122773 122922 122952 123282 123879 124070 123319
66474 123319 121935 120713 120039 119616 118989 118046 116951 115855 114880 114227 114066 114274 114400 114050 113305 112708 112750 113391
66456 113391 114130 114546 114607 114420 113912 112960 111723 110582 109757 109220 108959 109003 109157 109013 108448 107823 107435 106992 105962
66437 105962 104325 102605 101202 100054 99034 98398 98573 99667 101305 102912 104035 104505 104437 104092 103706 103378
66421 103378 103021 102423 101461 100348 99562 99361 99517 99665 99781 100016 100191 99835 98846 97754 97226 97505 98397 99470
66403 99470 100099 99681 98167 96214 94476 92906 91083 89145 87943 88097 89181 90100 90184 89760 89643 90267 91385
66386 91385 92511 93414 94085 94446 94384 94100 94127 94811 95875 96650 96743 96416 96308 96729 97167 96623 94665 92078 90168
66367 90168 89425 89253 89030 88924 89370 90188 90698 90471 89550 88166 86701 85772 85809 86570 87538 88671 90155 91424
66349 91424 91249 89191 86394 84486 84012 84374 84868 85155 84969 84095 82751 81548 80904 80804 81143 81892 82839
66332 82839 83567 83950 84377 85230 86353 87282 87759 87739 87104 85820 84337 83362 83087 82986 82612 82291 82698 83888
66314 83888 85135 85745 85741 85631 85733 85936 86026 86009 85986 85785 84873 82822 79985 77544 76676 77536 79154 80352 80702
66295 80702 80619 80680 80944 80927 80209 79061 78317 78467 78991 78899 77940 76881 76521 76814 77276 77825 78752 80021 81105
66276 81105 81526 81172 80131 78634 77240 76577 76666 76839 76567 76077 75873 75976 76016 75890 75848 75917 75724 75050 74266
66257 74266 73953 74245 74761 75107 75161 74917 74314 73416 72588 72238 72406 72799 73230 73779 74412 74776 74609 74185 73967
66238 73967 73956 73758 73313 73085 73403 73990 74398 74561 74629 74549 74254 74065 74444 75312 75975 75768 74603 72937 71520
66219 71520 71082 71795 72940 73491 73140 72413 71686 70674 69191 67882 67577 68212 68991 69476 69809 69915 69278 67867
66201 67867 66622 66469 67244 68116 68823 69784 71054 71845 71439 70219 69336 69433 69959 69817 68552 66788 65510
66184 65510 65085 65108 65112 65155 65622 66705 68306 70168 71830 72647 72295 71215 70230 69744 69672 70007 70915 72223 73402
66165 73402 74232 74948 75472 75164 73788 72208 71418 71228 70624 69270 67935 67469 68026 69298 70794 71709 71273
66148 71273 69715 68421 68668 70410 72564 74162 74911 74961 74597 74075 73436 72575 71654 71195 71500 72205 72741 72987
66130 72987 73085 72815 71705 69782 67754 66402 66058 66679 67954 69251 69883 69731 69346 69241 69324 69200 68788 68308
66112 68308 67859 67356 66856 66632 66852 67366 67906 68385 68893 69473 69923 69875 69142 68050 67342 67589 68618 69655
66094 69655 70106 70138 70395 71163 71898 71724 70375 68617 67615 67875 68819 69365 68893 67645 66328 65454 65056 64882
66076 64882 64744 64679 64860 65376 66035 66421 66187 65382 64397 63573 62961 62598 62865 64230 66486 68480 68908 67450
66058 67450 65044 63099 62499 63210 64522 65579 65878 65499 64906 64525 64494 64739 65088 65310 65224 64908 64702 64875
66040 64875 65359 65884 66337 66843 67527 68365 69257 70187 71275 72675 74322 75711 76088 75151 73519 72274 71957
66023 71957 72230 72533 72732 72853 72537 71323 69460 67958 67553 67887 67981 67327 66261 65381 64977 65052 65527 66182
66005 66182 66638 66692 66653 67028 67815 68378 68206 67624 67415 67782 68057 67585 66572 65776 65567 65699 65895 66221 66774
65986 66774 67396 67899 68274 68444 68084 67030 65707 64823 64711 65211 66037 66869 67159 66348 64482 62331 60717
65969 60717 59918 59798 60213 60990 61711 61899 61509 61067 61177 61911 62729 63057 62934 62956 63504 64199 64340 63760 62952
65950 62952 62403 62184 62211 62476 62806 62716 61831 60279 58491 56851 55748 55608 56411 57383 57660 57310 57256 58064 59178
65931 59178 59549 58843 57763 57282 57710 58519 58974 58815 58315 57827 57533 57597 58182 59092 59748 59864 59909 60453 61251
65912 61251 61484 60923 60275 60230 60632 60871 60704 60331 59940 59563 59274 59214 59428 59818 60208 60347 60036 59368 58678 58047
65892 58047 57108 55642 54231 53913 55138 57313 59362 60509 60558 59819 58925 58514 58756 59213 59244 58544 57287
65875 57287 55907 54843 54327 54259 54261 53976 53352 52626 52097 51989 52409 53247 54115 54605 54689 54755 55085 55450 55417 55038
65855 55038 54992 55920 57704 59462 60189 59432 57606 55755 54780 54640 54432 53417 51866 50613 49965 49462 48738
65838 48738 48117 48100 48580 48990 49080 49179 49665 50449 51155 51643 52152 52902 53719 54182 54111 53704 53169 52451 51582 51111
65818 51111 51745 53534 55700 57411 58434 58901 58844 58283 57560 57233 57680 58932 60676 62185 62589 61727 60673
65801 60673 60886 62712 65116 66945 67957 68379 68047 66654 64699 63437 63582 64401 64449 63094 61017 59351
65785 59351 58711 59125 60418 62266 64005 64890 64662 63654 62299 60799 59340 58259 57722 57516 57427 57658 58540
65768 58540 59946 61326 62248 62610 62418 61769 61076 60897 61336 61839 61773 61072 60185 59590 59438 59543 59571 59365 59093
65749 59093 58974 58874 58435 57657 57037 56966 57252 57497 57698 58108 58675 59004 58936 58794 58910 59129 59051 58611 58174 58078
65729 58078 58284 58548 58732 58764 58490 57886 57385 57589 58496 59362 59598 59507 59734 60255 60444 60035 59419 58919 58364 57612
65709 57612 56954 56614 56281 55588 54757 54324 54378 54498 54380 54154 54110 54397 54940 55496 55847 56086 56507 57062 57278 57013
65689 57013 56863 57301 57731 57102 55318 53316 51805 50726 50044 50172 51147 52179 52632 52941 53864 55203 56061
65672 56061 56162 56169 56633 57288 57572 57347 56819 56133 55382 54759 54413 54226 53988 53755 53874 54618 55877 57243 58400
65653 58400 59388 60441 61532 62250 62235 61651 61038 60727 60528 60021 58988 57543 56011 54757 53990 53609 53285
65636 53285 52739 51905 50810 49412 47699 45911 44573 44160 44708 45774 46875 47951 49299 51049 52892
65621 52892 54415 55508 56239 56447 55790 54259 52443 51158 50881 51551 52713 53779 54290 54094 53360 52430 51706
65604 51706 51568 52226 53576 55269 56909 58115 58546 58162 57454 57065 57018 56605 55252 53284 51536 50397 49589
65587 49589 48830 48337 48536 49525 50996 52512 53734 54468 54695 54595 54493 54704 55336 56130 56555 56245 55374 54462
65569 54462 53759 53039 52098 51274 51181 51989 53165 54029 54424 54789 55674 57231 59076 60563 61251 61202 60826 60446
65551 60446 60058 59566 59090 58881 58968 59094 59086 59139 59544 60233 60787 60922 60789 60749 60953 61221 61181 60486 59110 57635
65531 57635 57026 57753 59122 59833 59327 58350 58015 58587 59395 59761 59653 59446 59366 59281 58909 58165 57350 56903 56870 56791
65511 56791 56334 55882 56040 56664 56903 56366 55742 55914 56868 57944 58822 59688 60567 61124 61213 61094 60924 60523 59847
65492 59847 59306 59264 59525 59606 59299 58649 57696 56655 56194 56939 58602 60068 60529 60266 60073 60159 59961 58988 57558
65473 57558 56578 56696 57695 58744 59147 58860 58350 58053 58032 58098 58131 58255 58670 59332 59870 59961 59764 59779 60164 60451
65453 60451 60138 59385 58776 58520 58284 57884 57700 58180 59175 60060 60378 60145 59627 59081 58691 58534 58591 58880 59496
65434 59496 60270 60501 59444 57296 55395 55031 56113 57278 57385 56571 55743 55406 55366 55417 55779 56692 57888 58780
65416 58780 59074 59071 59413 60607 62618 64776 66214 66558 66134 65414 64519 63485 62680 62571 63168 64136 65379 67033
65398 67033 68828 70019 70210 69908 69977 70805 72229 73903 75423 76332 76459 76219 76289 77001 78188 79489 80623
65381 80623 81525 82434 83724 85474 87371 89205 91205 93630 96309 98996 101856 105092 108298 110795 112556
65366 112556 114140 115675 116604 116632 116260 116004 115643 114720 113363 112091 111097 110199 109275 108267 106873 104790 102225
65349 102225 99785 97843 96298 94871 93314 91451 89420 87788 86934 86362 85130 83073 81044 79811 79210
65334 79210 78668 78043 77517 77060 76501 75893 75310 74481 73188 71958 71740 72783 74326 75595 76632 77836 79102
65317 79102 79966 80409 81008 82145 83419 84063 83793 83063 82475 82056 81216 79445 77016 74873 73814 73848 74356
65300 74356 74621 74174 72905 71184 69691 68761 67894 66257 63695 60896 58551 56811 55698 55534 56485 58056
65284 58056 59515 60646 61651 62479 62844 62831 62861 62931 62454 61083 59215 57429 55943 54923 54745 55337 55720
65267 55720 54991 53636 53054 53751 54765 55115 55078 55511 56458 57116 57023 56603 56433 56487 56320 55713 54858 53999 53154
65248 53154 52230 51264 50445 49894 49482 48977 48353 47921 48100 49069 50621 52258 53490 54141 54431 54649 54815 54784
65230 54784 54641 54707 55088 55514 55821 56284 57135 57970 58087 57361 56400 55794 55679 56068 57078 58454 59286 58809 57386
65211 57386 56287 56399 57488 58733 59601 60032 60122 59947 59627 59335 59216 59397 59995 60990 62173 63365 64636
65194 64636 66147 67831 69408 70751 72022 73329 74438 75048 75304 75800 76945 78386 79197 78646 76758 74171
65178 74171 71518 68986 66414 63701 61104 59150 58248 58291 58659 58710 58411 58345 59006 60159 61106 61498 61637 61915
65160 61915 62261 62291 61786 60783 59394 57863 56665 56152 56097 55917 55381 54696 53911 52766 51405 50659 51084 52034
65142 52034 52328 51691 50911 50666 50884 51386 52355 53748 54832 54919 54205 53371 52656 51954 51567 52109 53575 55161
65124 55161 56120 56294 55727 54472 53104 52723 53790 55366 56157 56063 56033 56512 56809 56175 54874 53803 53466 53669
65106 53669 53986 54157 54189 54388 55192 56723 58530 59944 60642 60762 60656 60785 61683 63701 66692 70152 73693
65089 73693 77216 80615 83626 86001 87633 88408 88246 87451 86784 86882 87671 88574 89177 89386 89052 87840 85654
65072 85654 82902 80129 77588 75349 73571 72311 71187 69663 67752 66118 65312 65145 64977 64401 63418 62169
65056 62169 60852 59823 59372 59268 58846 57731 56351 55507 55532 56001 56234 55953 55448 55177 55239 55252 54821 54054 53418
65037 53418 53084 52685 51922 51162 51068 51663 52139 51715 50463 49177 48618 48984 49927 50889 51507 51820 52035 52102 51703
65018 51703 50798 49943 49814 50434 51150 51331 50963 50549 50632 51411 52624 53738 54349 54431 54117 53377 52135 50666
65000 50666 49580 49353 50069 51617 53765 55942 57336 57515 56775 55679 54487 53317 52496 52279 52356 52157 51648
64983 51648 51349 51496 51679 51472 51040 50835 51074 51707 52591 53386 53614 53233 52949 53521 54825 55985 56352 55950
64965 55950 54989 53479 51542 49719 48597 48251 48296 48437 48776 49563 50776 52021 52854 53224 53535 54185 55088
64948 55088 55805 56096 56154 56211 56207 55979 55614 55326 55087 54643 53929 53193 52641 52177 51697 51433 51707 52373 52884 53017
64928 53017 53179 53708 54184 53885 52860 51984 51869 52257 52746 53563 55061 56807 57880 58019 57880 58029 58282 58226
64910 58226 57911 57632 57382 56915 56181 55397 54802 54599 54922 55545 55743 54840 52968 51012 49773 49383 49481 49707
64892 49707 49872 49877 49678 49338 49052 49040 49310 49483 49026 47842 46527 45855 46038 46699 47517 48544 49814 50974
64874 50974 51579 51609 51378 51049 50538 49966 49858 50603 51853 52740 52701 51888 50816 49907 49473 49715 50440 51046 51179
64855 51179 51201 51516 51638 50701 48956 47925 48617 50223 51222 51244 51035 50933 50434 49363 48539 48794 49948 51254
64837 51254 52418 53665 55053 56260 56992 57181 56822 55960 54855 53870 53066 52105 50674 48901 47292 46314
64821 46314 46080 46369 46838 47173 47103 46492 45566 44910 44947 45463 45908 46157 46591 47307 47677 47114 45978 45279 45518
64802 45518 46235 46737 46888 47031 47412 47939 48415 48842 49471 50560 51994 53154 53321 52384 51065 50349 50673 51639
64784 51639 52453 52597 52167 51666 51474 51486 51254 50526 49630 49278 49922 51257 52334 52308 51196 49943 49646 50576
64766 50576 51929 52592 52215 51493 51384 52122 53065 53438 52994 51963 50732 49841 49952 51259 52915 53639 53115
64749 53115 52345 52337 52870 53066 52767 52632 52978 53263 52944 52228 51670 51503 51740 52522 53819 55044 55521 55288 54992
64730 54992 54963 54825 54086 52740 51208 50008 49550 49902 50565 50807 50391 49720 49092 48240 46922 45579 44914 44987
64712 44987 45232 45259 45140 44981 44787 44849 45677 47286 48999 50188 50811 50929 50237 48550 46443 44815 43959 43513
64694 43513 43189 43096 43412 44188 45355 46503 46824 45889 44478 43982 44863 46323 47583 48715 49875 50530 50117
64677 50117 48991 48000 47433 47031 46804 47105 47952 48926 49767 50527 51102 51234 51060 51083 51390 51431 50872 50184 50004
64658 50004 50235 50222 49593 48575 47615 47029 46951 47280 47707 48036 48461 49290 50432 51402 51904 52146 52414 52563 52172
64639 52172 51262 50517 50595 51295 51758 51510 50985 50836 51050 51132 50946 50859 51124 51579 52048 52555 53042 53322 53555 54300
64619 54300 55785 57483 58777 59688 60531 61205 61398 61302 61526 62278 63193 63970 64642 65039 64583 63048 61246 60460
64601 60460 61128 62344 62733 61782 60290 59487 59743 60263 60109 59220 58217 57431 56667 55914 55692 56379 57544 58328
64583 58328 58312 57771 57207 56959 57160 57775 58580 59329 59984 60674 61427 62041 62304 62294 62418 63061 64097 64797 64405
64564 64405 62890 61099 60103 60436 61842 63498 64463 64212 62959 61375 59933 58756 58131 58692 60661 63109
64548 63109 64565 64432 63461 62760 62640 62580 62010 60867 59535 58490 58028 58155 58707 59506 60366 60929 60719 59532
64530 59532 57739 56065 55039 54725 54901 55309 55671 55732 55536 55594 56369 57524 58034 57348 56143 55471 55369 54883
64512 54883 53540 52124 51703 52353 53319 54031 54449 54636 54608 54558 54765 55169 55400 55257 54857 54313 53555 52556 51487
64493 51487 50643 50400 51041 52285 53185 53052 52384 52302 53016 53524 52991 51764 50701 50153 50017 50197 50424 50094
64475 50094 49027 48025 47988 48597 48634 47656 46665 46918 48528 50560 52142 53199 54145 55078 55461 54738 53269
64458 53269 52303 52744 54252 55803 56799 57207 57005 56239 55518 55687 56803 58014 58564 58428 57877 57098 56551 57031
64440 57031 58799 60964 62212 62049 61012 59948 59455 59813 60974 62548 64025 65040 65428 65251 64995 65466
64424 65466 67171 69801 72476 74424 75347 75360 74819 74068 73199 72197 71410 71576 73102 75520 77810 79078
64408 79078 78782 76857 74046 71752 70883 70938 70742 69917 69027 68356 67388 65733 63906 62742 62496 62886 63593
64391 63593 64266 64423 63944 63514 64010 65401 66741 67224 66857 65977 64691 63136 61878 61541 62068 62777 63177
64374 63177 63413 63856 64587 65493 66545 67668 68515 68761 68632 68826 69779 71193 72365 72772 72317 71291 70262
64357 70262 69799 70071 70803 71733 72923 74486 76225 77844 79355 80965 82589 83771 84184 84037 83948 84461 85691
64340 85691 87303 88859 90262 91823 93805 96030 98064 99677 100955 102131 103544 105618 108527 111868
64326 111868 114986 117688 120407 123659 127611 132197 137350 142998 149159 156176 164570 174399 184999 195684
64312 195684 206626 218781 232919 248936 266019 283297 300206 316397 331481 344911 356024
64301 356024 364116 368524 368797 364952 357550 347417 335291 321726 307211 292233 277275 262864 249502
64288 249502 237382 226240 215692 205642 196129 186892 177450 167707 158232 149854 143101 137985 133965
64275 133965 130115 125739 121047 116946 114004 111915 110135 108613 107507 106537 105224 103649 102444 101923 101703
64260 101703 101349 100964 100812 100649 99868 98323 96682 95807 95960 96758 97811 99176 101145 103772 106737 109538
64244 109538 111695 112922 113395 113836 114997 116914 118796 119776 119675 118945 118037 116974 115469 113354 110924 108835
64228 108835 107518 106758 106062 105495 105724 107097 109008 110526 111441 112337 113756 115651 117654 119520 121259 123019
64212 123019 124893 126678 127945 128637 129536 131742 135536 140032 144028 147000 149149 150910 152757 155227 158683
64197 158683 163010 167866 173275 179628 187060 195166 203664 213009 223924 236419 249751 263407 277627
64184 277627 292739 308454 324206 339712 354552 367403 376557 381327 382358 380284 374762 365234 352137
64171 352137 336824 320615 304400 288760 273818 259106 244277 229966 217435 207238 198754 191099
64159 191099 183993 177552 171738 166371 161430 156965 152844 148777 144584 140372 136593 133812 132042 130300
64145 130300 127336 123110 119118 116826 116090 115555 114366 112804 111327 109767 107868 106076 105127 104934 104499
64130 104499 103163 101579 101060 102099 103931 105568 106841 108179 109698 111003 111875 112699 114035 116020 118365
64115 118365 120755 123043 125191 127262 129485 132179 135604 139898 145080 150915 156829 162138 166524 170239
64101 170239 173801 177475 181128 184540 187732 190816 193624 195681 196618 196410 195151 192901 189967 187040 184670
64086 184670 182674 180489 178031 175847 174393 173654 173571 174376 176219 178879 182201 186512 192164 198820 205602
64071 205602 211891 217613 222806 227283 230796 233194 234278 233687 231136 226804 221494 216384 212408 209694
64057 209694 207742 206280 205756 206758 209140 212082 214909 217446 219654 221461 223104 225067 227312 228891
64043 228891 228768 226817 223660 219704 214840 209083 202990 197237 192075 187435 183344 179936 177143 174680
64029 174680 172351 170165 168152 166351 165080 164978 166437 169026 171712 173737 175181 176711 178934 182027
64015 182027 185712 189437 192715 195490 198129 200986 204101 207409 210990 214844 218570 221682 224283 227061
64001 227061 230462 234181 237714 241213 245462 251018 257646 264673 271730 279059 287186 296439 306754 317857
63987 317857 329597 342125 355773 370706 386653 403063 419683 436947 455629 476028 497742
63976 497742 520398 544374 570570 599605 631635 666888 705973 749607 798442 853348 915524
63965 915524 986203 1066631 1158653 1264946 1388278 1530750 1694214 1881050 2093699 2333188
63955 2333188 2598555 2887719 3198374 3527864 3872955 4230337 4596845 4968244 5337504
63946 5337504 5694518 6027676 6325881 6579970 6783620 6933781 7030075 7073177 7063302 6999702
63936 6999702 6881204 6707430 6480486 6206319 5894448 5555885 5200909 4838239 4475142
63927 4475142 4117255 3768342 3431160 3109089 2806535 2527440 2273793 2045931 1843686
63918 1843686 1666453 1512336 1378265 1261417 1160102 1072927 997616 931279 871745 818132
63908 818132 770193 727518 689401 655018 623491 594027 566178 539836 514850 490802 467243
63897 467243 444027 421343 399547 379002 359824 341700 324255 307717 292886 280140 268775
63886 268775 257769 247001 237209 228798 221263 213956 206930 200688 195418 190850 186740 183106 179984 177162
63872 177162 174256 170996 167506 164372 162281 161490 161720 162587 163909 165428 166536 166739 166375 166486 167789 169957
63856 169957 171974 173006 172909 172105 171121 170056 168379 165382 160964 155824 150783 146104 141615 137205 132856
63841 132856 128422 123837 119569 116326 114201 112510 110722 109093 107947 106754 104601 101528 98684 96993
63827 96993 96212 95599 94969 94534 94081 93024 91273 89452 88025 86647 84699 82216 79912 78380 77587 77193
63811 77193 77047 77178 77459 77529 77137 76414 75705 75176 74714 74171 73581 73155 73178 73845 74989 76032 76492 76590 77044
63792 77044 78093 79033 78998 77935 76578 75668 75471 75802 76114 75752 74547 73109 72201 71945 71958 71975 71862 71290
63774 71290 70098 68857 68380 68668 69045 69297 69772 70233 69725 68090 66624 66462 67033 67026 66291 65823 66208 67085
63756 67085 68033 69047 70106 71003 71759 72603 73461 74016 74310 74761 75501 76222 76730 77196 77786 78551 79708 81551
63738 81551 83997 86645 89294 91954 94401 96312 97932 99952 102554 105084 106845 107665 107528 106348 104402
63723 104402 102437 100884 99409 97641 95889 94681 93977 93379 92916 93103 94258 96130 98227 100296 102503
63708 102503 105178 108348 111545 114265 116536 118657 120494 121532 121614 121052 119903 117883 115239 112937 111469
63693 111469 110142 108200 106110 104970 104940 105106 104759 104150 104002 104870 106946 109954 113183 116038 118619 121382
63677 121382 124305 126766 128235 128672 128256 127158 125615 123868 121903 119567 116991 114619 112719 111095 109396
63662 109396 107597 106096 105375 105500 105931 105979 105514 105029 105006 105585 106879 109078 111896 114467 116283 117859 119968
63645 119968 122607 125365 128477 132801 138843 146419 155119 164479 173840 182751 191498 200688 210473 220825
63631 220825 232321 245672 260460 275233 288926 301252 311549 318446 321299 321052 319016 315578 310843
63618 310843 305810 301839 299305 297613 296326 295417 294550 292985 290347 286847 282628 277412 270916 263141 254156
63603 254156 244121 233774 224407 216904 210960 205558 200122 194967 190680 187403 184902 183140 182530 183502
63589 183502 186033 189672 193959 198659 203774 209531 216272 224062 232455 240873 249146 257382 265417 272895
63575 272895 279967 287390 295644 304349 312877 321230 329935 339211 348505 356716 362646 365508 365352 363040
63561 363040 359568 355465 350865 345940 340997 336335 332230 328997 326795 325415 324345 322983 320738 317178
63547 317178 312258 306245 299317 291452 282855 274216 266235 259063 252376 245767 238842 231254 223081 215010
63533 215010 207770 201387 195254 188829 182024 175118 168662 163324 159400 156402 153491 150309 147152 144374
63519 144374 141953 139691 137483 135357 133485 132170 131499 131026 130145 128835 127699 127185 127125 127226 127593 128406
63503 128406 129303 129549 128833 127653 126839 126878 127723 129059 130687 132708 135421 138989 143099 147061 150331 152949
63487 152949 155358 157776 159951 161541 162480 162806 162379 161135 159433 157758 156083 154018 151666 149862 149355
63472 149355 150059 151351 152710 153893 154941 156403 159124 163324 168146 172599 176672 181032 185891 190807
63458 190807 195469 199991 204424 208617 212689 217075 221946 227104 232593 238808 245763 252831 259660 266900
63444 266900 275579 286123 298446 312653 328995 347168 366163 384882 402548 418471 431795 441677
63432 441677 447598 449484 447743 443274 437304 431057 425516 421363 418928 418112 418431 419126 419211 417523 413021
63417 413021 405247 394532 381698 367521 352547 337410 323084 310455 299538 289443 279439 269896
63405 269896 261793 255401 249983 244891 240437 237307 235560 234711 234602 235562 237683 240426 243166 245900 249263
63390 249263 253974 260263 267612 275076 282214 289777 299153 310893 324098 337486 350780 364679 379674
63377 379674 395296 410454 424041 435115 442918 447005 447282 443966 437766 430102 422720 416779 412402
63364 412402 409143 406627 404639 403061 401992 401518 400881 398226 391853 381757 369524 356767 344181 331986
63350 331986 320462 309601 298867 287920 277422 268619 262177 257719 254416 251701 249415 247575 246151
63337 246151 244986 243861 242626 241207 239448 237112 234096 230591 226956 223527 220500 217808 215091 211977
63323 211977 208468 204908 201617 198764 196475 194662 192782 190299 187543 185581 184986 185263 185774 186598 187974
63308 187974 189428 190180 190163 189985 190083 190509 191360 192633 193781 194081 193555 192864 192271 191380 190029 188702 187779 187027
63290 187027 186182 185468 185081 184634 183651 182304 181151 180310 179399 178181 176922 176050 175753 175942 176440 177170 178225
63273 178225 179729 181639 183740 185833 187772 189348 190363 190872 191185 191609 192378 193768 195930 198584 201236
63258 201236 203816 206745 210248 214007 217703 221592 226212 231735 237884 244318 250884 257637 264831 272761
63244 272761 281550 291243 302146 314661 328635 343284 358093 373470 390149 408221 427095 446101
63232 446101 464747 482632 499664 516254 532770 548882 563983 578314 593086 609280 626724
63221 626724 644604 662540 680735 699237 717337 733726 747076 756500 761612 762238 758177 749323 735965
63208 735965 718810 698631 676013 651511 625947 600336 575473 551695 529171 508355 490024
63197 490024 474794 462743 453576 447021 442952 441295 442088 445487 451393 459133 467929 477726 489098 502139
63183 502139 515899 529243 541956 554601 567604 580956 594648 608817 623373 637955 652363
63172 652363 666717 681000 694708 707097 717535 725422 730032 730819 727853 721687 712650 700411 684465
63159 684465 665078 643577 621538 599774 578271 557019 536528 517435 500019 484419 471000
63148 471000 459941 450538 441572 432613 424560 418490 414317 411001 407888 405236 403384 402045 400820 399962
63134 399962 400017 400828 401503 401483 401194 401422 402427 403895 405402 406597 407254 407510 407860 408583 409364 409833 410149 410621
63116 410621 411097 411378 411991 413678 416129 418087 418990 419734 421430 424030 426665 428794 430520 432158 434049
63101 434049 436463 439216 441615 443206 444310 445495 446869 448332 450137 452586 455370 457815 459708 461398
63087 461398 463200 465262 467891 471453 475865 480691 485800 491504 497955 504805 511578 518118 524520 530884
63073 530884 537272 543883 551258 560245 571375 584055 596836 608995 621571 636290 653683 672947
63061 672947 693511 715868 740644 767590 796020 825857 857711 891998 928277 965504 1002902
63050 1002902 1040546 1078961 1118089 1156981 1194725 1231331 1267280 1302566 1336874 1370551 1404623
63039 1404623 1439790 1476027 1513164 1551017 1588640 1624146 1655637 1681818 1701428 1712862 1714986
63028 1714986 1707873 1692093 1667557 1633664 1590560 1539847 1484141 1426237 1368448 1312202 1258147
63017 1258147 1206784 1158978 1115726 1077636 1044848 1017307 994920 977582 965230 957733 954652 955412
63005 955412 959873 968371 980843 996221 1013062 1030591 1048777 1067679 1087222 1107529 1128840 1150937
62993 1150937 1173013 1194309 1214692 1234448 1253684 1272036 1288788 1303061 1313907 1320427 1321953 1318152
62981 1318152 1308808 1293447 1271327 1242064 1206265 1165306 1120567 1073182 1024447 975893 928672
62970 928672 883238 839899 799331 762171 728392 697451 668877 642281 617031 592482 568625
62959 568625 546176 525929 508199 492825 479318 466939 454981 443154 431634 420654 410216
62948 410216 400171 390434 381086 372420 364880 358741 353807 349575 345667 341910 338041 333680 328803 324062
62934 324062 320315 317816 316004 314171 312213 310579 309517 308591 307113 304962 302735 301064 299970 298916
62920 298916 297296 294778 291402 287563 283806 280442 277435 274677 272235 270151 268184 266016 263698 261678
62906 261678 260350 259735 259621 259807 260075 260091 259605 258830 258398 258695 259275 259239 258259 256863 255587 254270 252633 251102
62888 251102 250331 250043 249201 247477 245756 244894 244672 244454 244223 244246 244231 243672 242844 242621 243239 243930 243974 243515 243099
62869 243099 242826 242354 241556 240803 240548 240756 240866 240357 239322 238307 237595 236965 236254 235746 235699 235862 235884 235966 236548
62850 236548 237441 237843 237283 236124 235050 234416 234189 234133 233914 233296 232399 231578 231065 230924 231256 232063 232957 233448
62832 233448 233672 234406 236125 238342 240131 241154 241941 243327 245736 248927 252312 255599 259065 263094 267553
62817 267553 271893 275821 279555 283425 287587 292150 297240 302739 308354 314134 320647 328428 337399 347000
62803 347000 356700 366304 376105 386968 400036 416022 434791 455730 478463 503172 530468 561059
62791 561059 595400 633524 675332 721067 771279 826305 886022 950092 1018071 1089077 1161730
62780 1161730 1234611 1306442 1375551 1439520 1495766 1542386 1578196 1602279 1613886 1612715 1598980
62769 1598980 1573359 1537053 1491648 1438615 1379189 1315036 1248625 1182223 1116621 1051482 986984
62758 986984 924471 865330 809921 758026 709838 665898 626271 590380 557660 527944 501124
62747 501124 476843 454752 434845 417212 401496 386908 372935 359906 348632 339506 332154 325992
62735 325992 320910 317170 314763 313136 311609 309918 308270 307065 306630 307160 308725 311295 314757 318962 323823
62720 323823 329418 335963 343744 353085 364366 377854 393407 410570 429210 450036 474214 502382
62708 502382 534186 568820 605913 645830 689217 736306 786510 838595 891236 943393 994142
62697 994142 1042261 1086181 1124285 1155032 1176955 1188989 1190992 1183611 1167411 1142485 1109269 1069369
62685 1069369 1025061 977983 928828 878276 827612 778159 730552 684991 641895 601841 564944
62674 564944 530727 498765 469261 442885 420118 400669 383484 367444 352162 338003 325282
62663 325282 313731 302921 292872 283827 275613 267805 260509 254389 249767 246103 242598 238937 235220
62650 235220 231591 228282 225680 223913 222486 220719 218477 216156 214105 212418 211191 210512 210104 209363 207948
62635 207948 206171 204662 203813 203669 204182 205351 207029 208741 209877 210226 210312 210997 212666 214890 216969 218686
62619 218686 220521 223255 227471 233158 239677 246328 253118 260844 270251 281353 293820 307714 323487
62606 323487 341411 361444 383613 408175 435370 465203 497414 531474 566761 602949 639938
62595 639938 677050 712531 744375 771468 793425 809504 818495 819810 814078 802410 785620 764335
62583 764335 739261 710945 679701 646134 611444 576917 543378 511378 481489 454075 429095
62572 429095 406456 386322 368741 353301 339503 327244 316564 307209 298849 291531 285420 280230
62560 280230 275352 270486 265723 261012 255986 250464 244844 239825 235838 232721 229892 226904 223943 221606
62546 221606 220075 218760 217054 215188 213890 213348 213072 212868 213389 215384 218734 222674 226868 231862 238329
62531 238329 246162 254620 263319 272743 283665 296384 310774 326802 344542 363804 384327 406418
62519 406418 430815 457684 486152 515122 543976 572047 597899 619901 637424 650859 660378 665187
62507 665187 664231 657354 645576 630326 612455 592022 569079 544541 519891 495965 472590 449672
62495 449672 427997 408352 390347 373002 356340 341523 329313 319180 310108 301658 293916 286980
62483 286980 280858 275492 270603 265831 261221 257196 253871 250842 247846 245124 242813 240539 238134 236301
62469 236301 235877 236577 237140 236781 235979 235696 236254 237278 238479 240122 242723 246480 251178 256570 262641 269381
62453 269381 276470 283497 290425 297496 304630 311237 316740 320915 323601 324487 323503 321099 317777 313600 308479
62438 308479 302669 296489 289798 282332 274502 267200 260707 254385 247713 241183 235834 232207 230012 228513
62424 228513 226853 224346 220996 217733 215727 215315 215816 216365 216688 217092 217995 219572 221642 223849 226136 228999
62408 228999 232942 237680 242290 246347 250478 255479 261227 266914 272077 276871 281402 285414 288751 291653
62394 291653 294388 296886 298962 300687 302390 304490 307319 310807 314298 317088 319314 321957 325729 330370
62380 330370 335327 340769 347462 355878 365827 376922 389118 402924 419305 439103 462259 487759
62368 487759 514686 543022 573024 604036 634506 663010 688716 710940 729025 742884 753087
62357 753087 760084 763740 763991 761611 757845 753255 747200 738491 726511 711673 694898 676795 657552
62344 657552 637616 618030 599766 582976 567289 552620 539212 527025 515661 504921 494871
62333 494871 485269 475453 465017 454197 443438 432943 422819 413232 404182 395473 387145 379622 373213
62320 373213 367770 362986 358703 354724 350721 346661 343033 340368 338736 337949 337957 338749 340006 341140 341677 341555
62304 341555 341246 341552 342937 344911 346351 346556 345740 344576 343675 343532 344304 345397 345828 345343 344674 344461 344568
62287 344568 344854 345801 347715 349935 351735 353577 356545 360786 365459 370210 375788 383101 392401 403561
62273 403561 416477 431015 447152 465384 486517 510812 537723 566491 596492 626954 656927
62262 656927 685773 713120 738044 758835 774102 783935 789665 792624 793262 791140 785461 775769 762388
62249 762388 746108 727382 706096 682281 656788 631042 606266 583143 562034 543177 526609
62238 526609 512046 499011 487201 476740 467995 461062 455552 450981 447110 443784 440743 437945 435800
62225 435800 434627 434057 433466 432913 433078 434290 436205 438490 441186 444215 447131 449667 452054 454468 456615
62210 456615 458212 459507 460961 462756 464916 467573 470722 473978 476975 479816 482783 485838 488769 491702
62196 491702 495072 499162 503898 508979 514030 518760 523212 527654 532039 535798 538407 540005 541239 542824
62182 542824 545445 549761 556101 564411 574797 587747 603410 620993 639385 658035 676539 693629
62170 693629 707535 717484 724167 728542 730847 731110 729946 728269 726432 724036 720330 714550 706125 695029
62156 695029 681906 667656 653010 638568 624982 612771 602134 593226 586466 582188 580082 579330 579322
62143 579322 579855 580617 580938 580389 579381 578752 578782 578970 578850 578664 578953 579743 580565 581229 582107 583496 585079 586379
62125 586379 587514 589045 591172 593481 595608 597724 600116 602588 604632 606075 607181 608161 608935 609506 610241
62110 610241 611448 612868 613888 614273 614362 614510 614731 615020 615662 616841 618185 619199 620076 621634 624435 628423
62094 628423 633450 639559 646466 653288 659304 664775 670643 677576 685655 694733 704634 715100 725989 737508
62080 737508 749878 762781 775539 787913 800367 813472 827338 841651 855832 868968 879856
62069 879856 887404 890995 890597 886823 880839 873805 866184 857766 848308 837795 826006 812353 796506
62056 796506 778883 760231 740980 721298 701532 682219 663790 646579 630994 617325 605439
62045 605439 595010 586021 578750 573233 569050 565694 562838 560155 557149 553484 549443 545886 543623 542746
62031 542746 542493 541776 539955 537182 534023 530879 527829 524923 522318 520072 518039 516131 514620 513978 514357
62016 514357 515305 516081 516222 515764 514972 514085 513384 513327 514220 515689 516765 516729 515846 515087 515197 516108 517132 517490
61998 517490 516705 514686 511592 507520 502329 495855 488308 480344 472677 465641 459117 452804 446552 440551
61984 440551 435218 430764 426821 422683 418094 413672 410297 408102 406336 404336 402302 400818 399898 399025 398139
61969 398139 397995 399221 401410 403595 405427 407424 410188 413818 418065 422588 427007 431203 435723 441415
61955 441415 448481 456330 464651 474070 485303 498103 511674 525802 540874 556873 573150 589395
61943 589395 606146 624041 642970 662355 681886 701619 721538 741401 760904 779750 797660
61932 797660 814637 831165 847939 865318 883194 901423 920337 940901 964355 991531 1022409
61921 1022409 1056482 1093692 1134818 1180759 1231654 1287040 1346677 1410700 1478872 1550222 1623794
61910 1623794 1699445 1777426 1857264 1937576 2017115 2095580 2173050 2248772 2320778 2386569 2443843
61899 2443843 2490606 2525035 2545538 2550911 2540413 2514042 2472919 2419158 2354978 2281938 2201197
61888 2201197 2114305 2023408 1930706 1838091 1747364 1660336 1578323 1501589 1429522 1361452 1297351
61877 1297351 1237777 1183165 1133177 1086825 1043366 1002961 966347 934008 905936 882005 861997
61866 861997 845195 830457 817136 805705 797220 792283 790728 792052 795774 801414 808440 816364 824852
61853 824852 833808 843282 853039 862112 869148 873488 875654 876501 876172 874303 871005 867034 863049 859307 856160
61838 856160 854281 854125 855616 858621 863282 869423 875957 881417 885017 886796 886757 884363 879089 871164 861531
61823 861531 851238 841036 831377 822419 814020 806019 798715 792880 789166 787636 788070 790534 795253 801985
61809 801985 810012 818976 829335 841797 856668 874077 894332 917462 942673 969073 996957 1027691
61797 1027691 1062101 1099628 1139379 1181541 1227273 1277582 1332795 1392919 1458045 1528405 1604396
61786 1604396 1686549 1775227 1870407 1971941 2079921 2194628 2316250 2444849 2580378 2722383
61776 2722383 2869801 3021201 3174968 3328819 3479343 3622533 3754727 3872597 3972347 4049725
61766 4049725 4101212 4124944 4120441 4088066 4029136 3946139 3842306 3721065 3586079 3441356 3290674
61755 3290674 3136932 2982414 2829507 2680590 2537225 2399994 2269316 2145962 2030517
61746 2030517 1922756 1822018 1728030 1640976 1560811 1486878 1418272 1354409 1295123 1240365 1189848
61735 1189848 1142968 1099116 1058136 1020352 985960 954520 925316 898106 873068 849937 827757
61724 827757 805903 785021 766418 750567 736729 724048 712422 702038 692531 683129 673501 663998
61712 663998 655035 646535 638084 629353 620273 610955 601639 592622 584123 576206 568867 562126 555988 550307
61698 550307 544793 539193 533498 527957 522886 518437 514546 511012 507496 503522 498736 493316 487992 483411
61684 483411 479522 475711 471531 467120 462894 459024 455327 451521 447432 442944 437929 432382 426629 421151
61670 421151 416041 410783 404902 398837 393742 390217 387635 385081 382572 380832 380051 379625 379115 378719 378507
61655 378507 377928 376618 375231 374799 375496 376568 377285 377318 376300 373869 370406 367159 365129 364103 363070 361363
61639 361363 359167 357123 355784 355252 355063 354514 353415 352406 352261 352960 353788 354260 354587 355137 355845 356391 356704
61622 356704 356983 357298 357455 357303 356923 356438 355691 354303 352024 349002 345617 342136 338663 335402 332751 330978
61606 330978 329894 328977 327835 326397 324718 322812 320774 318905 317554 316821 316402 315763 314510 312705 310848
61591 310848 309458 308749 308695 309307 310600 312393 314380 316444 318705 321267 324163 327519 331478 335878 340334
61576 340334 344765 349546 355023 361137 367700 374667 381977 389557 397821 407690 419580 432616 445428
61563 445428 457531 469437 481622 494018 506359 518250 528840 537250 543565 548734 553241 556549
61551 556549 558214 558863 559478 560259 560893 561556 562861 564912 567087 568825 570179 571539 573193 575167 577184
61536 577184 578739 579470 579416 578671 576970 573988 569989 565767 561970 558775 556222 554473 553669 553852 555003 556959
61520 556959 559389 562261 566291 572389 580558 589809 599398 609743 621911 636505 653392 672227 692850
61507 692850 715290 739696 766313 795395 827096 861489 898560 938142 980028 1024229 1070943
61496 1070943 1120113 1171113 1223039 1275180 1327084 1378200 1427642 1474266 1516930 1554716 1587051
61485 1587051 1613734 1634903 1650945 1662262 1668999 1671089 1668723 1662715 1654214 1644128 1632971 1621150
61473 1621150 1609021 1596608 1583527 1569307 1553608 1536075 1516260 1493888 1469108 1442398 1414281
61462 1414281 1385207 1355646 1326292 1298142 1272186 1248800 1227661 1208565 1192195 1179666 1171339
61451 1171339 1166540 1164476 1164978 1168218 1174189 1182795 1194170 1208587 1226285 1247538 1272646 1301552 1333547
61438 1333547 1367284 1400672 1430746 1454294 1469238 1475408 1474021 1466909 1456407 1445169 1435162 1426909
61426 1426909 1420183 1415205 1412597 1412467 1414314 1417952 1423900 1432754 1444649 1459363 1476115 1492820 1506001
61413 1506001 1512105 1509065 1496694 1476146 1449448 1419167 1387769 1356950 1327627 1300443 1275886 1253925
61401 1253925 1234028 1215919 1200044 1186847 1175743 1165405 1155244 1146105 1139128 1134324 1130802 1128093
61389 1128093 1126572 1126643 1128281 1131592 1137127 1145271 1155817 1168549 1183769 1201839 1222659 1246174 1273047
61376 1273047 1304179 1339687 1378822 1420720 1464740 1510345 1557302 1605841 1655828 1705755 1753264
61365 1753264 1796925 1836845 1873192 1904709 1929209 1945228 1952711 1952242 1944132 1928464 1905727 1877071
61353 1877071 1843737 1806396 1765423 1721860 1677548 1633863 1590678 1547179 1503439 1460517 1419104
61342 1419104 1378969 1339888 1302397 1267254 1234795 1205178 1178640 1154981 1133284 1112750 1093544
61331 1093544 1076370 1061555 1049039 1038924 1031284 1025626 1021250 1018234 1017434 1019355 1023552 1029387 1036832
61318 1036832 1046079 1056687 1067586 1077849 1087037 1094765 1100415 1103610 1104824 1105241 1105983 1107681 1110680 1115179
61304 1115179 1120858 1126702 1131732 1135992 1140410 1145644 1151358 1156707 1161103 1164289 1166081 1166519 1166084 1165312 1164136
61289 1164136 1161913 1158166 1153148 1147653 1142397 1137611 1133087 1128604 1124316 1120649 1117766 1115360 1113257 1112072
61275 1112072 1112831 1115803 1119989 1123974 1127058 1129256 1130357 1129502 1125982 1120196 1113397 1106535 1099674 1092632
61261 1092632 1085792 1079997 1075870 1073651 1073553 1075847 1080535 1087405 1096647 1109159 1125913 1147133 1172232
61248 1172232 1200452 1231384 1265055 1301883 1342684 1388436 1439450 1494302 1549404 1599876 1641235
61237 1641235 1670562 1686558 1689266 1680249 1662653 1640181 1615472 1589541 1562665 1535382 1508484 1482546
61225 1482546 1457878 1434870 1414109 1396192 1381550 1370350 1362318 1356411 1350481 1341289 1325462 1301177
61213 1301177 1269201 1232161 1192901 1153685 1116473 1082942 1053896 1029136 1008092 990101 974007
61202 974007 958331 942367 926659 911961 898338 885762 875008 867058 861910 858635 856387 854596
61190 854596 852381 848707 843342 837051 830688 824563 818757 813398 808345 803096 797352 791446 786006 781433
61176 781433 777771 774797 772131 769546 767286 765791 765059 764529 763674 762368 760623 758373 755746 753209 751194
61161 751194 749676 748128 745588 740749 732479 720665 706371 690990 675420 660115 645496 631963
61149 631963 619692 608709 598937 589905 580723 570784 560380 550229 540471 530558 520171 509778 500067
61136 500067 491131 482500 473836 465344 457499 450529 444235 438247 432480 427350 423522 421383 420802 421414 423041
61121 423041 425716 429355 433609 438107 442649 447034 450792 453329 454324 453875 452286 449852 446815 443273 439145
61106 439145 434430 429559 425200 421603 418372 415084 411862 409137 407011 405094 402851 399952 396420 392625
61092 392625 389000 385537 381730 377276 372712 369112 367198 366874 367476 368220 368590 368625 368827 369593 370866 372483
61076 372483 374625 377507 380774 383660 385736 387173 388280 389106 389504 389269 388198 386319 384019 381702 379351
61061 379351 376742 373950 371265 368714 366114 363508 361040 358417 355095 351115 347230 344002 341263 338576
61047 338576 335749 332652 329077 325132 321372 318225 315631 313495 312066 311548 311682 312081 312700 313691 315149
61032 315149 317263 320406 324742 330155 336888 345785 357470 371631 387630 405479 425773 449098 476177
61019 476177 508345 547426 595643 656223 732547 823593 918831 999597 1048906 1061963 1047800
61008 1047800 1021654 996750 982311 985205 1008423 1045887 1080842 1093209 1071246 1017305 943518
60997 943518 863202 785730 716335 657289 608442 568117 534749 507687 486464 470122 457774
60986 457774 449313 444918 444043 445370 447731 450647 453986 457463 460658 463313 465392 466933 468011 468798 469467
60971 469467 469970 470133 470106 470493 471698 473229 474092 473934 473393 473140 473001 472327 470870 468867 466487 463627 460159
60954 460159 456020 451209 446027 441090 436617 431830 425620 417867 409574 401610 393788 385418 376343 367120
60940 367120 358469 350860 344511 339480 335756 333363 332369 332816 334696 337921 342115 346434 349864 351830 352523
60925 352523 352671 353077 354181 355823 357471 358962 360904 364039 368296 372762 376535 379243 380816 381296 381031
60910 381031 380685 380822 381654 383148 384987 386455 386842 386112 384760 382995 380553 377391 373979 370646 367259
60895 367259 363861 360964 358751 356627 354152 351866 350412 349274 347306 344335 341297 338764 336229 333045
60881 333045 329318 325501 321690 317796 314069 311046 309129 308350 308330 308467 308447 308604 309378 310443 310956 310796 310911
60864 310911 312048 313756 315204 316497 318491 321536 325081 328485 331613 334660 337931 341856 346685 352002
60850 352002 356955 361093 364598 367612 369833 370977 371139 370390 368506 365511 362127 359116 356374 353230 349540
60835 349540 345879 342615 339362 335585 331285 326767 322042 316879 311393 306262 302266 299665 297996 296367
60821 296367 294015 290713 286729 282517 278533 275169 272563 270422 268340 266359 264987 264486 264384 263920 262755
60806 262755 261117 259409 257973 257057 256688 256614 256580 256639 256966 257466 257863 258209 259006 260701 263153 265723 267848
60789 267848 269629 271834 275214 279683 284337 288453 292194 296044 299804 302735 304663 306362 308610 311312
60775 311312 313818 315774 317262 318325 318794 318631 318171 317908 318088 318554 318994 319367 319974 321013 322187 323003 323400
60758 323400 323726 324096 324172 323756 323154 322663 322021 320796 319087 317370 315661 313212 309190 303419 296492 289373
60742 289373 282919 277522 273004 268928 265060 261538 258614 256331 254487 252885 251679 251412 252554 254842
60728 254842 257283 258992 260009 261140 263042 265593 268101 270054 271678 273808 277039 280959 284418 286660
60714 286660 287952 288891 289447 289074 287573 285335 282767 279907 276645 272966 268858 264336 259690 255467 252031
60699 252031 249275 246775 244022 240636 236794 233423 231456 230704 229910 228188 226009 224501 224244 225148 226997
60684 226997 229452 231710 232890 232879 232436 232480 233608 236141 239967 244251 247909 250617 252917 255190 257089
60669 257089 258350 259582 261614 264346 266926 269002 271123 273787 276652 279060 280995 283132 286033 289619
60655 289619 293426 297197 301071 305230 309456 313151 315871 317717 319005 319693 319456 318418 317412 317207 317670
60640 317670 318016 317810 317374 317150 317030 316605 315816 315002 314267 313209 311510 309530 307956 306893 305719 303988
60624 303988 302124 300874 300297 299742 298769 297645 296773 296006 294813 292926 290600 288335 286468 284953 283400
60609 283400 281452 279197 277038 275122 273237 271419 270197 269872 269868 269265 267806 265878 263744 261461 259487
60594 259487 258544 258616 258727 258182 257527 257778 259029 260364 260951 260773 260349 260229 260739 261834 263085 264082 264908 266068
60576 266068 267952 270530 273529 276665 279743 282730 285761 288885 291876 294519 297057 300120 304220 309528
60562 309528 316078 323878 332771 342559 353426 366031 381071 398937 419880 444249 472347 504309
60550 504309 540406 581454 628620 682507 742075 804092 863601 915297 954878 979412 986956 976654
60538 976654 949664 909644 861736 810836 760658 713792 671860 635440 604269 577809 555522
60527 555522 536699 520538 506630 495180 486506 480597 477396 477257 480663 487491 497016 508807 523432
60514 523432 542103 565799 594967 630017 671760 721042 777723 839893 903954 965431 1019826
60503 1019826 1063131 1092252 1105646 1103879 1089587 1066852 1040511 1015578 996578 986812 988081 1000931
60491 1000931 1024738 1057221 1094115 1129888 1159029 1176802 1179311 1163906 1130219 1080723 1019907
60480 1019907 952756 883754 816609 754001 697259 646516 601468 561952 527787 498330 472542
60469 472542 449537 428947 410691 394552 380169 367366 356231 346735 338483 331057 324469 318922
60457 318922 314170 309586 305032 301186 298576 296601 294057 290587 287053 284324 282238 280069 277649 275536
60443 275536 274181 273371 272568 271497 270253 269041 268061 267631 268185 269933 272550 275394 278119 280951 284056
60428 284056 286828 288186 287706 286097 284306 282520 280422 278192 276633 276264 276752 277464 278217 279234 280696
60413 280696 282666 285272 288542 292072 295179 297484 299242 301131 303805 307559 312201 317281 322615 328491
60399 328491 335195 342470 349779 356981 364350 371864 379019 385545 391908 398754 406155 413657 420755 426921
60385 426921 431497 434136 435330 436088 437065 438281 439529 440605 441257 441409 441429 441686 441823 441121 439708 438715 438915
60368 438915 439797 440429 440662 440876 441022 440712 440073 439714 439812 439921 439758 439551 439335 438497 436403 433123 429180 424835
60350 424835 420013 414757 409387 404258 399657 395873 393053 390888 388728 386217 383711 381790 380385 378693
60336 378693 376186 373453 371620 370921 370309 368700 366192 363684 361631 359721 357596 355294 352898 350276 347379
60321 347379 344425 341619 339029 336893 335627 335274 335275 335108 334903 335152 336138 338103 341705 347624 355505 363714
60305 363714 370460 375099 378207 380478 381691 380751 376723 369760 361031 351800 342764 334202 326452 319933
60291 319933 314852 311103 308477 306796 305897 305586 305572 305450 304875 303917 303067 302733 302876 303325 304279 306132 308853
60274 308853 311909 314848 317658 320532 323571 326869 330603 334828 339323 343822 348224 352455 356298 359610
60260 359610 362645 365944 369896 374494 379458 384452 389178 393434 397158 400403 403326 406221 409465 413293
60246 413293 417669 422540 428127 434769 442451 450705 459058 467447 476079 485069 494395 504193 514888 526994
60232 526994 540854 556557 573997 592990 613458 635548 659507 685467 713448 743649 776535
60221 776535 812478 851350 892672 936075 981394 1028194 1075388 1121558 1165611 1206961 1245167
60210 1245167 1279677 1310113 1336587 1359346 1378053 1391704 1399475 1401600 1399234 1393569 1385319 1375042
60198 1375042 1363609 1352096 1341364 1332002 1324623 1319958 1318582 1320734 1326529 1336180 1349841 1367266 1387933
60185 1387933 1411591 1438558 1469244 1503444 1540298 1578903 1618663 1658890 1698412 1735908 1770463
60174 1770463 1801450 1827979 1848952 1863676 1871970 1873553 1867831 1854546 1834207 1807484 1774623 1735995
60162 1735995 1693006 1647879 1602573 1558327 1516113 1476985 1441901 1411703 1387295 1369349 1357728
60151 1357728 1351678 1350698 1354778 1363630 1376284 1391700 1409236 1428068 1446583 1462910 1475853 1485000
60139 1485000 1490256 1491769 1490022 1485345 1477399 1465638 1450305 1432533 1413523 1394132 1375273 1358115
60127 1358115 1343670 1332548 1325395 1323112 1326314 1334795 1347946 1365662 1388625 1417770 1453675 1496494
60115 1496494 1546280 1603210 1667488 1739116 1817882 1903512 1995647 2093487 2195608 2300233 2405491
60104 2405491 2509198 2608632 2700989 2784117 2856458 2916421 2962377 2993493 3010038 3012488 3000693
60093 3000693 2974346 2934055 2881447 2818308 2746179 2666858 2582780 2496496 2409936 2324414 2241185
60082 2241185 2161622 2086819 2017374 1953822 1897166 1848648 1808878 1777338 1752863 1734516 1721915
60071 1721915 1714915 1713240 1716405 1723661 1733931 1746053 1759298 1773487 1788455 1803492 1817445 1829189
60059 1829189 1837796 1842412 1842351 1837426 1827988 1814503 1797143 1775840 1750548 1721401 1688725 1653109 1615423
60046 1615423 1576645 1537593 1498857 1461018 1424861 1391359 1361395 1335459 1313515 1295307 1280932
60035 1280932 1271185 1267193 1269587 1278081 1291995 1311089 1335754 1366435 1403100 1445233 1492001 1542174
60023 1542174 1594124 1646190 1696997 1745214 1789118 1826831 1857055 1879353 1893606 1899504 1896799 1885802
60011 1885802 1867310 1842030 1810330 1772606 1729783 1683459 1635680 1588535 1543709 1502211 1464478
60000 1464478 1430779 1401546 1377392 1358909 1346408 1339745 1338363 1341683 1349646 1362835 1381937 1407065
59988 1407065 1437797 1473960 1516171 1565262 1621078 1682085 1746257 1812004 1877908 1941798 2000805
59977 2000805 2052676 2096676 2132904 2161092 2180567 2191061 2192700 2185050 2166955 2137892 2099066 2052672
59965 2052672 2000571 1944438 1886887 1831179 1779373 1731583 1687675 1649083 1618152 1596023 1581980
59954 1581980 1574817 1574034 1579668 1591745 1610294 1635302 1666214 1701827 1741078 1783588 1829095 1876641
59942 1876641 1924766 1972212 2017955 2060717 2098990 2131624 2158185 2178822 2194058 2204552 2210655
59931 2210655 2212289 2209653 2203985 2197203 2190813 2185659 2182749 2183727 2190267 2203430 2223890 2252352 2289332
59918 2289332 2334747 2388105 2448944 2516807 2590889 2669960 2752492 2836575 2919810 2999507 3072973
59907 3072973 3137503 3190402 3229461 3253495 3262255 3255916 3234929 3200311 3153814 3097705 3034524 2966916
59895 2966916 2897343 2827793 2759851 2694972 2634461 2579176 2529537 2485961 2449125 2419723 2398132
59884 2398132 2384377 2378268 2379541 2388006 2403595 2426106 2454945 2489440 2529498 2575562 2627654 2684581
59872 2684581 2744217 2804205 2862061 2914935 2959888 2994526 3017103 3026080 3020073 2998495 2962081 2912848
59860 2912848 2853783 2788460 2720212 2651137 2581970 2513121 2445616 2380871 2319880 2262950 2209975
59849 2209975 2160610 2114438 2071511 2032686 1998961 1970449 1946388 1926108 1909559 1896798 1887525
59838 1887525 1881404 1878520 1879232 1883740 1891913 1903262 1917009 1932565 1950049 1969864 1991419 2012613
59826 2012613 2030959 2044938 2054073 2058212 2057390 2052128 2043221 2031198 2016423 1999619 1981723 1963170
59814 1963170 1943840 1923816 1903772 1884505 1866432 1849598 1833766 1818288 1802306 1785372 1767711
59803 1767711 1749678 1731209 1711958 1691789 1670956 1649902 1629048 1608672 1588904 1569897 1551957
59792 1551957 1535430 1520586 1507882 1498182 1492420 1491046 1494134 1502003 1515351 1534836 1561032 1594833
59780 1594833 1637337 1689117 1750140 1820622 1901461 1993347 2095835 2207602 2326911 2450579
59770 2450579 2571994 2680540 2763747 2811127 2817557 2784522 2718896 2630236 2528324 2421741 2317195
59759 2317195 2219249 2130662 2053108 1987384 1933037 1888542 1852447 1824210 1803652 1790006 1781885
59748 1781885 1778005 1777561 1780220 1786109 1795568 1808574 1824693 1843905 1866950 1894295 1925324 1959388
59736 1959388 1997308 2040839 2090759 2146573 2208199 2276741 2353175 2437279 2528633 2627974 2736722
59725 2736722 2855620 2984651 3124035 3274388 3435728 3606867 3785863 3970586 4158566
59716 4158566 4346528 4530289 4705205 4867050 5012995 5142030 5254515 5351481 5434585 5506524
59706 5506524 5570850 5630895 5688728 5745025 5799589 5851785 5900745 5945749 5986757 6024405 6059235
59695 6059235 6090914 6118385 6140788 6158097 6170956 6180302 6187271 6193126 6198989 6205866 6215188 6229112
59683 6229112 6249909 6279129 6317684 6366618 6427344 6501100 6588548 6689924 6805189 6933811 7074593
59672 7074593 7225769 7385076 7549758 7716686 7882301 8041978 8189466 8317616 8420012
59663 8420012 8491749 8528824 8527738 8486397 8405243 8287118 8136331 7958292 7759716 7548337
59653 7548337 7331864 7117038 6909370 6713272 6531947 6366667 6215527 6072482 5927885
59644 5927885 5770843 5592353 5387865 5158549 4910782 4653722 4396125 4144588 3903921
59635 3903921 3677928 3469056 3277741 3103041 2944048 2800307 2671085 2554964 2450358
59626 2450358 2356054 2271218 2195277 2127810 2068122 2014918 1966868 1923486 1884852 1850388 1818592
59615 1818592 1788317 1759643 1733006 1708014 1683838 1660450 1638645 1618827 1600418 1582623 1565220
59604 1565220 1548301 1531655 1514805 1497539 1480113 1462938 1446249 1430161 1414889 1400825 1388221
59593 1388221 1376851 1366063 1355268 1344264 1333025 1321385 1309193 1296694 1284518 1273292 1263482
59582 1263482 1255516 1249695 1245871 1243539 1242414 1242728 1244819 1248683 1254158 1261336 1270483 1281644 1294545 1308792
59568 1308792 1324037 1340091 1357210 1376151 1397704 1422185 1449462 1479274 1511183 1544530 1578922
59557 1578922 1614725 1652657 1692945 1735334 1779802 1826651 1876096 1928757 1986564 2051541 2122278
59546 2122278 2192200 2252882 2299731 2334275 2361390 2385121 2406877 2426128 2441772 2453005 2459457
59535 2459457 2460786 2456438 2446187 2430706 2410976 2387134 2358550 2325148 2287914 2247815 2204974 2159516
59523 2159516 2112716 2066584 2022505 1980894 1942086 1906943 1876473 1851250 1831431 1817181 1808937
59512 1808937 1807306 1812680 1825084 1844583 1871718 1907112 1950568 2001112 2058216 2122480 2194554 2273615
59500 2273615 2357354 2443200 2528933 2612226 2690261 2760026 2818656 2863435 2892059 2903355 2897643
59489 2897643 2876178 2840278 2791093 2730195 2660211 2584782 2507734 2432153 2360172 2293332 2232809
59478 2232809 2179289 2133105 2094729 2064761 2043146 2028857 2020768 2018470 2021709 2029392 2039896 2052206
59466 2052206 2065835 2079514 2090844 2097702 2099387 2095874 2086524 2070193 2046398 2015712 1979076 1937244
59454 1937244 1890997 1841329 1789152 1735050 1679539 1623339 1567153 1511339 1456111 1402036 1350013
59443 1350013 1300647 1253978 1209994 1169168 1132082 1098623 1067964 1039376 1012738 988252 966087
59432 966087 946472 929629 915408 903359 893392 885984 881589 880597 884296 894714 911916 931521 946267
59419 946267 950884 945282 933349 919754 908001 899987 896042 895709 899289 908227 922920 940069 953216
59406 953216 956651 949080 933854 916187 900198 887760 879154 874149 872447 873482 876445 880786 886635
59393 886635 894543 904907 917731 932810 949985 969315 991060 1015413 1042248 1071346 1102909 1137558
59381 1137558 1175600 1216502 1259266 1303129 1347740 1392881 1438385 1484262 1530682 1577879 1626272
59370 1626272 1676711 1730576 1789597 1855447 1929211 2011192 2101543 2201209 2311839 2434471 2568617
59359 2568617 2712972 2866722 3029651 3201015 3378689 3559347 3739082 3913891 4080055
59350 4080055 4234362 4374027 4496621 4600498 4685314 4751797 4800863 4833091 4848837 4848375 4831630
59339 4831630 4798085 4747236 4679084 4594015 4492375 4374427 4240896 4093526 3935074 3768815
59329 3768815 3597990 3425614 3254504 3087196 2925679 2771259 2624669 2486254 2356205
59320 2356205 2234848 2122662 2019710 1925155 1837862 1757629 1685285 1621276 1564667 1514013 1468729
59309 1468729 1428897 1394053 1363002 1334885 1309683 1287604 1268576 1252514 1239426 1228934 1220195
59298 1220195 1212677 1206658 1202692 1200964 1201416 1204093 1208944 1215542 1223342 1232004 1241251 1250838 1261051 1272828
59284 1272828 1286793 1302410 1318636 1335271 1352989 1372091 1391909 1411659 1431237 1450731 1469528
59273 1469528 1486389 1500282 1510735 1517412 1519678 1516830 1508711 1495971 1479602 1460165 1437547 1411556
59261 1411556 1382603 1351652 1319559 1286714 1253307 1219649 1186116 1152982 1120475 1088876 1058472
59250 1058472 1029513 1002239 976760 952910 930431 909380 890120 872782 857066 842755 830138
59239 830138 819590 811020 804108 798882 795559 793911 793371 793797 795615 799055 803763 809438 816406 825119
59225 825119 835444 846897 859431 873553 889798 908491 929982 954694 982825 1014268 1048937
59214 1048937 1087058 1129238 1176407 1229516 1289021 1354767 1426719 1505628 1592490 1687353 1789190
59203 1789190 1896925 2009897 2126937 2245439 2361816 2472569 2574615 2664923 2740438 2798387
59193 2798387 2836389 2852503 2845690 2816433 2766711 2699253 2616910 2522613 2419662 2311809 2202901
59182 2202901 2096151 1993554 1896058 1804348 1719277 1641495 1571024 1507492 1450660 1400474 1356762
59171 1356762 1319200 1287482 1261259 1239951 1222785 1208996 1197846 1188687 1181178 1175161 1170013 1164484
59159 1164484 1157632 1149709 1141558 1133223 1123771 1112462 1099470 1085364 1070600 1055836 1042115 1030137
59147 1030137 1019637 1009941 1000924 992985 986222 980193 974606 969933 967131 966826 968831 972381 976808 981947
59133 981947 987919 994632 1001636 1008500 1015157 1021825 1028691 1035657 1042325 1048257 1053371 1057978 1062280 1065984
59119 1065984 1068746 1070889 1073279 1076418 1080017 1083479 1086391 1088496 1089674 1090210 1090638 1091022 1090676 1088890 1085615
59104 1085615 1081232 1076040 1070393 1064958 1060269 1056145 1052047 1047928 1044335 1041629 1039540 1037632 1035989 1035360
59090 1035360 1036683 1040356 1045818 1052047 1058637 1066242 1075747 1087269 1100207 1113878 1127657 1140810 1152868
59077 1152868 1164135 1175223 1186037 1195730 1203679 1209878 1214201 1215923 1214367 1209646 1202355 1192844 1181155
59064 1181155 1167466 1152228 1135932 1118934 1101382 1083192 1064252 1044783 1025289 1006047 986936
59053 986936 967908 949274 931278 913731 896483 879956 864767 850964 838087 825923 814776
59042 814776 804995 796657 789699 783975 779132 774833 771216 768742 767422 766515 765179 763092 760233 756458
59028 756458 751693 746308 740864 735524 730098 724619 719480 714967 711027 707641 705025 703201 701640 699760
59014 699760 697700 696248 695916 696399 697037 697545 698050 698620 699166 699809 701014 703189 706374 710449 715451 721444
58998 721444 728279 735904 744838 755910 769321 784325 800185 817198 836345 858026 881587 906218
58986 906218 931860 958895 987137 1015471 1042465 1067120 1088974 1107725 1122940 1134129 1141065 1143986
58974 1143986 1143435 1139878 1133535 1124649 1113786 1101749 1089183 1076425 1063728 1051490 1040122 1029795
58962 1029795 1020465 1012170 1005180 999756 995834 993046 991037 989631 988668 987856 986956 986070 985551 985606 986067 986544
58946 986544 986667 986283 985766 986193 988868 994329 1001902 1010478 1019626 1029721 1041106 1053577 1066802 1080973
58932 1080973 1096728 1114544 1134459 1156500 1181168 1209283 1241344 1277260 1316810 1359973 1406336
58921 1406336 1454202 1500777 1543438 1580611 1611512 1635851 1654328 1668984 1682327 1696124 1711446
58910 1711446 1729548 1751950 1779478 1811805 1848170 1888299 1932624 1982046 2037606 2099949 2168937
58899 2168937 2244012 2324992 2412225 2506065 2606702 2714445 2829422 2950550 3075178 3199924
58889 3199924 3321316 3435470 3538068 3625710 3697490 3755060 3801379 3839509 3871899 3899939 3924046
58878 3924046 3944394 3961328 3974816 3983862 3986919 3982686 3970211 3948640 3917524 3877261 3828721 3772474
58866 3772474 3708794 3638240 3561747 3480249 3394663 3306113 3215610 3123546 3029967 2935401 2841003
58855 2841003 2747938 2657059 2569095 2484604 2403694 2326236 2252397 2182563 2116738 2054534 1995791
58844 1995791 1940719 1889418 1841752 1797758 1757654 1721310 1688257 1658349 1631929 1609121 1589484
58833 1589484 1572572 1558397 1547056 1538336 1531959 1527880 1526098 1526493 1529076 1534029 1541290 1550455 1561285
58820 1561285 1573924 1588439 1604572 1622151 1641234 1661613 1682726 1704477 1727605 1752662 1779089
58809 1779089 1805961 1833434 1862844 1895481 1931845 1972033 2016294 2065013 2118524 2177046 2240586
58798 2240586 2308886 2381717 2459275 2542148 2630797 2725100 2824342 2927669 3034576 3144867 3257953
58787 3257953 3372374 3486505 3599729 3712356 3824232 3933903 4039322 4138643 4229748 4309299
58777 4309299 4372609 4414153 4428228 4410365 4359445 4278548 4173276 4049446 3912591 3768534
58767 3768534 3622716 3478547 3337182 3199116 3065386 2937227 2815425 2700332 2591937
58758 2591937 2489594 2392215 2299115 2210466 2126829 2048593 1975881 1908581 1846343 1788910 1736517
58747 1736517 1689517 1647588 1609800 1575530 1544757 1517397 1492954 1471059 1451750 1434934 1420142
58736 1420142 1407132 1396168 1387266 1379637 1372357 1365256 1358769 1353370 1349624 1348434 1350512 1355592 1362373
58723 1362373 1368953 1372974 1371848 1363651 1347926 1325389 1297133 1264536 1229556 1194174 1159345 1124969
58711 1124969 1090954 1057763 1025828 995088 965475 937451 911673 888362 867424 849094 834128
58700 834128 823331 817017 814961 816728 821999 830546 841819 854467 866310 874844 877921 874287 863913
58687 863913 848018 828651 808049 788209 770781 756897 746899 740511 737619 738867 745316 757548
58675 757548 775394 798529 826995 860940 900084 943885 992205 1045351 1102946 1162565 1219462
58664 1219462 1267674 1301670 1317591 1313830 1291127 1252366 1202011 1145132 1086256 1028561 973777
58653 973777 922650 875491 832594 794455 761672 734510 712568 695051 681266 670566 661873 653798
58641 653798 645476 636933 628373 619542 610203 600890 592644 586078 581142 577542 574870 572427 569618 566639
58627 566639 564204 562484 560858 558892 557032 556031 556182 557401 559644 562821 566561 570473 574483 578709
58613 578709 583315 588680 595392 603716 613327 623864 635445 648338 662467 677628 693901 711417
58601 711417 729998 749561 770644 793985 819632 846932 875272 904312 933611 962678 991471
58590 991471 1020281 1048990 1076875 1103259 1127773 1149834 1168418 1182711 1192596 1198218 1199511 1196546
58578 1196546 1190016 1180891 1169787 1157074 1143459 1130021 1117645 1106657 1097014 1088664 1081794 1076880
58566 1076880 1074348 1074004 1074999 1076571 1078632 1081362 1084569 1087970 1091852 1096696 1102070 1106506 1108625 1107736 1103053
58551 1103053 1093083 1076518 1053375 1024653 991262 954115 915114 876908 841263 808270 777510
58540 777510 749367 724689 703697 685941 671038 658726 648338 638982 630414 623146 617439 612606
58528 612606 607510 601382 593942 585222 575621 565807 556167 546593 537249 529176 523400 519439 515478 510399
58514 510399 505081 501132 498728 496500 493511 490454 488496 487634 486996 486452 486929 488995 492039 495334 499283
58499 499283 504827 511969 519665 527163 534789 543276 552850 563143 573513 583178 591464 598244 603941 608909
58485 608909 613045 616200 618600 620538 621807 621781 620047 616792 612661 608304 603919 599081 593156 585959 577897
58470 577897 569439 560791 552199 544188 537103 530679 524449 518477 513282 509016 505082 500772 496069 491586
58456 491586 487776 484455 481292 478602 477218 477355 478041 478140 477756 477958 479151 480462 480974 480910 481068 481615 482065
58439 482065 482200 482384 482969 483849 484695 485423 486370 488052 490599 493352 495368 496469 497428 498903 500635 502075
58423 502075 503358 505112 507600 510593 513875 517385 521052 524983 529629 535233 541287 547018 552187 556804
58409 556804 560387 562397 563316 564341 565874 567211 567983 568991 571076 573894 576490 578560 580419 582100 583303
58394 583303 584186 585474 587606 590213 592737 595231 598257 602115 606535 611272 616720 623538 631668 640186
58380 640186 648394 656674 665813 675779 685669 694704 702686 709557 715238 720128 725161 731001 737473 744023
58366 744023 750372 756506 762386 768035 773697 779621 785853 792342 799081 805984 812896 819828 826951 834198
58352 834198 841164 847590 853766 860243 867315 874869 882540 889912 896842 903691 911027 918986 927135 935021
58338 935021 942571 949955 957517 965960 976107 988086 1001026 1013830 1026109 1038216 1050690 1063901
58326 1063901 1077902 1092317 1106537 1120301 1133920 1147815 1162072 1176688 1191950 1208305 1226034
58315 1226034 1245232 1265844 1287421 1309128 1330337 1351175 1372186 1393534 1414785 1435424 1455389
58304 1455389 1475074 1494875 1514742 1534235 1553136 1571908 1591301 1611579 1632443 1653714 1675735
58293 1675735 1699065 1724067 1750772 1778727 1807090 1835430 1864412 1895087 1927447 1960385 1993229
58282 1993229 2026505 2060912 2096421 2132842 2170360 2208792 2247123 2284738 2322597 2362299 2404480
58271 2404480 2449129 2497094 2549925 2608071 2670246 2734812 2800955 2868269 2936129 3004102 3072446
58260 3072446 3141596 3211486 3281889 3353285 3426913 3503921 3584694 3669055 3756926 3848653 3944767
58249 3944767 4045623 4151428 4262519 4379369 4502348 4631776 4768268 4912717 5065800
58240 5065800 5227805 5399024 5579982 5771099 5972468 6184262 6407213 6642503 6891461
58231 6891461 7155510 7436134 7734621 8052027 8389560 8748875 9132004 9541410 9980256
58222 9980256 10452266 10961178 11510668 12104971 12749388 13450150 14214026 15048215 15960853
58213 15960853 16962107 18065097 19285687 20642383 22158221 23861421 25778181 27920279
58205 27920279 30283948 32870983 35717155 38900609 42524482 46695679 51518714 57099917
58197 57099917 63550437 70989322 79551724 89396792 100708808 113695320 128583302 145598981
58189 145598981 164915007 186555326 210238088 235143398 259686468 281511987 297911458
58182 297911458 306600572 306475082 297917254 282522906 262483149 239978254 216801106
58175 216801106 194227820 173051314 153687885 136293897 120860077 107278529 95390262
58168 95390262 85017620 75982370 68114343 61257070 55271468 50035733 45443362 41402592
58160 41402592 37836173 34678813 31873868 29372450 27133882 25124340 23314319 21677958
58152 21677958 20193977 18845314 17617215 16496254 15470871 14531477 13669502 12876836
58144 12876836 12146295 11471954 10848764 10272260 9738691 9244912 8787812 8363983 7969997
58135 7969997 7602851 7260122 6939784 6639914 6358555 6093955 5844887 5610509 5389917
58126 5389917 5182063 4985997 4800840 4625564 4459216 4301346 4151711 4009608 3874088
58117 3874088 3744861 3622339 3506602 3397009 3293019 3194590 3101394 3012469 2927314 2846683
58107 2846683 2771525 2701570 2635722 2573459 2514940 2459837 2406942 2355056 2303721 2252945 2202716
58096 2202716 2152977 2103675 2054683 2005967 1957935 1911338 1866698 1824063 1783415 1745041 1709244
58085 1709244 1675767 1643668 1611855 1579691 1547071 1514049 1480660 1447297 1414985 1384768 1356750
58074 1356750 1330036 1303765 1277831 1252511 1227813 1203612 1180125 1157831 1136969 1117413 1098984
58063 1098984 1081594 1065110 1049286 1033869 1018630 1003393 988200 973344 959034 945024 930774
58052 930774 916005 900999 886323 872390 859252 846745 834707 823041 811652 800559 790139
58041 790139 780986 773209 766046 758561 750740 743472 737405 732221 727201 722056 716868 711550 705790 699456
58027 699456 692824 686374 680419 674765 668746 661870 654540 647838 642481 638303 634880 632081 629663 626818
58013 626818 622876 618345 614677 612887 612775 613557 614850 616887 620045 624391 629637 635491 642050 649766 658876
57998 658876 668998 679478 690080 701056 712522 724058 735075 745559 756303 768354 782154
57987 782154 797232 812796 828598 845091 862794 881726 901479 921581 941628 961334 980626
57976 980626 999520 1017714 1034410 1048609 1059345 1065579 1066297 1060995 1049787 1032820 1010034 981937
57964 981937 950302 917417 884723 852668 821712 792669 765972 741299 718411 697839 680215
57953 680215 665241 651889 639659 629119 621080 615561 611847 609336 607987 607831 608360 608706 608399 607671
57939 607671 606925 606108 604781 602642 599715 596093 591740 586653 581119 575638 570590 566060 562129 559317 558506
57924 558506 560162 563763 568379 573812 580792 589875 600498 611353 621382 630048 636857 641040 641734 638353
57910 638353 630877 619972 606689 591874 575996 559588 543448 528055 513136 498285 483771 470201
57898 470201 457598 445458 433745 423188 414363 406994 400381 394127 388143 382303 376437 370545 364740
57885 364740 359086 353614 348465 343948 340561 338779 338497 338749 338445 337536 337055 337891 339975 342887 346647 351368
57869 351368 356491 361053 364635 367534 370010 371931 373291 374518 375909 376994 376797 374663 370691 365460
57855 365460 359544 353180 346320 339010 331764 325364 320189 315914 312089 308834 306626 305468 304717 303880 303252
57840 303252 303485 304775 306772 309137 311823 314894 318372 322243 326235 329630 331676 332387 332519 332527 331927 330017
57824 330017 326946 323612 320660 318065 315642 313454 311545 309700 307805 306220 305444 305467 305758 306018 306755 308953
57808 308953 313228 319427 326971 335365 344281 353504 363141 373782 386085 400205 415874 432934 451233
57795 451233 469879 487088 501127 511129 516810 517972 514784 508250 499760 490163 479619 468169 455947
57782 455947 442889 428729 413443 397442 381340 365765 351328 338347 326581 315512 304876
57771 304876 294799 285551 277474 270880 265582 260734 255592 250376 245872 242292 239128 236066 233357 231246
57757 231246 229712 228881 229002 229742 230178 229825 229151 228735 228503 228164 227887 228061 228804 230146 232248 234988 237685
57740 237685 239764 241400 243095 244947 246866 249232 252747 257670 263525 269456 274662 278801 282261 285741
57726 285741 289301 292251 294286 296059 298060 299572 299605 298465 297392 296851 296162 294796 293108 291701 290944
57711 290944 291211 292696 294738 296224 297052 298415 301181 304737 307932 310454 312650 314613 316301 318239 321228
57696 321228 325382 330049 334745 339736 345682 353054 361884 371785 382223 393041 404724 418056 433601
57683 433601 451662 472471 496134 522588 551911 584595 621274 662403 708534 760814 820918
57672 820918 890567 971500 1065929 1176529 1304913 1448344 1596087 1728723 1823533 1864378
57662 1864378 1849326 1790002 1703898 1606465 1507920 1413950 1327223 1248521 1177704 1114275 1057224
57651 1057224 1004961 956076 910195 867743 828959 793478 760832 730961 704068 680174 658916
57640 658916 639758 622414 607100 594260 583885 575277 567689 561059 555856 552279 550001 548720 548550
57627 548550 549635 551579 553629 555420 557447 560776 566328 574262 583913 594417 605534 617881 632233
57614 632233 648676 666583 685351 704915 725433 746632 767697 787863 807003 825529 843690
57603 843690 860942 876024 887643 895143 898599 898377 894598 886980 875172 859237 839832 817850 793986
57590 793986 768716 742646 716616 691300 666815 642855 619101 595444 572027 549301 527902
57579 527902 508128 489618 471841 454891 439419 425740 413431 401991 391456 381978 373184 364426
57567 364426 355561 347067 339460 332935 327499 322998 319006 315146 311653 309208 307997 307257 306072 304378
57553 304378 302901 302225 302211 302270 302029 301674 301775 302749 304466 306446 308382 310287 312169 313921 315681 317974
57537 317974 321251 325480 330436 336089 342401 349048 355782 362825 370457 378382 386217 394555 404738 417282
57523 417282 431216 445453 460273 476730 494952 513799 532185 550063 567945 586045 604231
57512 604231 622352 640156 657014 672140 685020 695441 703159 707851 709389 707899 703477 696077 685806
57499 685806 673187 658926 643469 626917 609323 590928 572142 553467 535477 518644 503051
57488 503051 488401 474476 461483 449759 439270 429674 420860 413044 406262 400116 394310 389158 385212
57475 385212 382511 380555 379010 378062 378031 378996 380982 384217 388885 394731 401214 408090 415745 424860 435750
57460 435750 447995 460740 473435 486325 500131 515318 531760 549008 566522 583608 599479
57449 599479 613705 626362 637494 646585 652861 656014 656265 653797 648452 640045 628694 614784 598857
57436 598857 581576 563472 544619 524846 504394 484094 464727 446444 428996 412313 396559
57425 396559 381784 367852 354718 342522 331360 321095 311422 302073 293024 284555 276963 270154 263614
57412 263614 256928 250168 243659 237574 232002 227243 223627 221080 219131 217357 215542 213471 210941 208117
57398 208117 205509 203430 201654 199815 197971 196576 195963 196027 196336 196486 196392 196262 196178 195831 194932 193872 193571
57381 193571 194445 195818 196587 196335 195578 195124 195403 196199 196774 196454 195392 194568 194724 195524 196126 196351 196676 197247
57363 197247 197631 197666 197787 198189 198293 197589 196512 195868 195720 195476 194868 194093 193027 191104 188264 185414 183442
57346 183442 182139 180631 178704 177177 176867 177566 178331 178603 178746 179435 180771 182232 183432 184630 186352 188688
57330 188688 191147 193119 194329 194955 195511 196514 198035 199678 201179 202884 205331 208439 211532 214151 216467
57315 216467 218878 221620 224812 228321 231444 233340 234167 235276 237852 241758 246159 250715 255440 259869
57301 259869 263401 266412 270102 274988 280363 285491 290588 296138 301918 307350 312382 317385 322396 327036
57287 327036 331040 334376 336919 338514 339393 340037 340499 340146 338278 334825 330378 325675 321144 316845 312787
57272 312787 309208 306426 304427 302844 301424 300237 299282 298275 297157 296392 296297 296318 295645 294372 293373 292989
57256 292989 292652 292059 291927 292995 294835 296444 297764 299741 302788 305863 307480 307263 306137 305273 305232 306046
57240 306046 307595 309647 311818 313874 316047 318735 321823 324670 326955 329223 332215 335828 339285 342288
57226 342288 345468 349422 353824 357872 361359 364828 368846 373547 378837 384560 390389 395937 401206 406697
57212 406697 412924 419943 427465 435223 443092 451012 458968 466942 474757 482152 489167 496350 504289 512999
57198 512999 521956 530754 539488 548480 557881 567685 577895 588448 599086 609567 620034 630927 642428
57185 642428 654198 665788 677247 689146 702048 716031 730625 745075 758788 771832 785042
57174 785042 799339 814766 830407 845464 860187 875426 891424 907532 923119 938205 952954
57163 952954 967039 980082 992560 1005736 1020694 1037902 1057757 1080935 1107791 1137703 1169462
57152 1169462 1202204 1235598 1269222 1302218 1333730 1363462 1391638 1418556 1444307 1468867 1492395
57141 1492395 1515386 1538481 1562013 1585811 1609544 1633231 1657286 1682146 1708082 1735329 1764119
57130 1764119 1794505 1826355 1859679 1894780 1932042 1971723 2014026 2059121 2106962 2157303 2210207
57119 2210207 2266395 2326848 2392082 2462066 2536919 2617525 2705373 2801860 2907855 3024026 3151607
57108 3151607 3292760 3450135 3626277 3823753 4045766 4296370 4580101 4901960 5268091
57099 5268091 5686283 6165642 6716046 7348005 8072467 8900088 9840618 10902994 12095333
57090 12095333 13423718 14890400 16492697 18222384 20064331 21994484 23978521 25971595
57082 25971595 27918498 29754658 31409775 32814510 33908022 34643827 34993403 34947876 34517675
57073 34517675 33730139 32626034 31255876 29675997 27944342 26116968 24246057 22378648
57065 22378648 20555100 18807671 17160266 15629135 14223511 12946162 11794615 10762944
57057 10762944 9843088 9025509 8299936 7656495 7086300 6581129 6132924 5733907 5376968
57048 5376968 5055688 4764237 4497706 4252600 4026701 3818260 3625376 3446171 3279342
57039 3279342 3124267 2980552 2847568 2724434 2610291 2504432 2406231 2314961 2229675 2149250
57029 2149250 2072715 1999724 1930603 1865714 1804739 1746724 1690837 1636875 1584960 1535006 1486725
57018 1486725 1440082 1395502 1353406 1313536 1274796 1236043 1197224 1159618 1124673 1092580 1062163
57007 1062163 1032099 1001961 972091 942944 914807 887808 861822 836450 811351 786485 761929
56996 761929 737721 714104 691690 671003 651963 634247 618068 604216 593238 584979 579072 575529
56984 575529 574566 576022 579244 583453 587920 591704 593529 592252 587558 580113 570955 560856 550293 539788
56970 539788 529911 520944 512802 505389 498793 493029 487841 482933 478293 474150 470775 468435 467379 467650
56956 467650 468921 470546 471604 470958 467599 461190 452110 440950 428230 414650 401071 387908 374911
56943 374911 361969 349819 339487 331333 325147 320973 319162 319655 321862 325416 330588 337782 346959 357577
56929 357577 368644 378637 385735 388394 385713 377499 364494 348521 331724 315341 299412 283774
56917 283774 268830 255137 242727 231272 220628 210845 201884 193684 186433 180439 175651 171509 167344
56904 167344 162997 159106 156650 155956 156245 156454 156470 157102 158839 161189 163435 165543 167985 171105 175135 180488
56888 180488 187502 195912 204983 214111 223037 231524 239049 244820 248041 248336 246134 242504 238429 234264
56874 234264 229942 225515 221418 218424 217360 218492 221184 224609 229009 235747 245863 259063 274505
56861 274505 291954 311525 332728 354375 375084 393123 406088 411840 410091 402587 391659 379033
56849 379033 365889 353171 341468 331090 322600 316966 314993 316877 322395 331174 342842 357387 375464
56836 375464 397879 424723 455431 489492 526066 562482 593983 615842 625716 623849 611801 591671
56824 591671 565980 537244 507441 478237 451439 428548 409894 394811 382820 374274 369838 369816
56812 369816 374111 382530 394978 411543 432317 456803 483421 509745 533105 550767 560052 559225
56800 559225 548570 530138 506270 478819 449759 421512 395942 373425 353582 336588 323057
56789 323057 312861 305008 298923 295216 294785 297613 302869 309884 318579 328966 340433 351470 359922
56776 359922 363741 361929 354890 343820 329812 313655 296278 278990 263063 249133 236951 225698
56764 225698 214671 203905 194139 185974 179126 172647 165827 158696 151756 145575 140617 137032 134380 131797
56750 131797 128603 124650 120172 115690 112098 110248 110065 110471 110563 110536 110997 111743 111900 111150 110177 109807 110206
56733 110206 111027 111833 112239 112095 111760 111788 112164 112241 111618 110715 110175 110117 110317 110785 111693 112906 114032 114898 115619
56714 115619 116195 116369 115920 114938 113843 113255 113670 114973 116365 117058 117053 117005 117429 118301 119415 120727 122295 124140
56696 124140 126316 128932 132030 135577 139544 143746 147634 150614 152710 154604 156818 159127 161069 162786
56682 162786 164933 167780 170716 172784 173537 173264 172572 171930 171551 171581 172238 173684 175742 177871 179596 180990
56666 180990 182559 184559 186574 187884 188187 187802 187241 186775 186375 185853 184976 183643 182135 181063 180840 181217
56650 181217 181431 180809 179152 176684 173863 171176 168882 166824 164655 162238 159702 157143 154551 152079 150131
56635 150131 148975 148424 148104 147879 147857 148112 148633 149508 150898 152731 154555 155789 156198 156136 156300 157146 158475
56618 158475 159666 160295 160383 160037 159122 157460 155199 152785 150583 148665 146920 145264 143820 142925 142807 143189
56602 143189 143451 143377 143468 144211 145277 145842 145677 145478 146042 147392 148840 149679 149769 149666 150269 152101 154751 157150
56584 157150 158488 158840 158981 159769 161664 164515 167653 170349 172282 173544 174315 174786 175294 176150 177268 178331
56568 178331 179337 180566 181861 182524 182306 182073 182950 185041 187561 190023 192710 195921 199427 202903 206442
56553 206442 210273 214239 217827 220570 222135 222192 220571 217550 213727 209547 205135 200583 196159 192052 188069
56538 188069 183827 179293 174920 171157 167960 164942 161921 159100 156635 154243 151463 148247 145124 142727
56524 142727 141260 140428 139754 138847 137500 135756 133959 132560 131656 130765 129262 127131 125101 123872 123321 122745
56508 122745 121841 121166 121554 123288 125902 128565 130463 131107 130654 129921 129769 130360 131172 131780 132381 133349 134482
56491 134482 135001 134373 132938 131527 130596 129957 129334 128832 128620 128429 127807 126925 126665 127663 129479 131008 131611
56474 131611 131655 132043 133408 135743 138536 141220 143577 145649 147273 148011 147862 147751 148731 150629 152031 151890
56458 151890 150753 150049 150476 151546 152476 152932 152888 152309 151267 150117 149223 148673 148375 148306 148492 148880 149405 150016
56440 150016 150476 150358 149543 148564 148096 148102 147924 147232 146413 145837 145212 144079 142594 141360 140628 140172 139854 139796 139942
56421 139942 139961 139779 139775 140185 140661 140753 140554 140496 140664 140679 140238 139522 139016 139105 139830 140826 141553 141740 141656 141870 142741
56400 142741 144131 145467 146073 145688 144891 144815 146179 148649 151338 153714 155799 157746 159672 161814 164329
56385 164329 166867 168831 170185 171603 173577 175765 177517 178725 179809 181028 182190 182955 183120 182636 181660
56370 181660 180610 179965 179959 180547 181578 182796 183739 183942 183344 182355 181452 180832 180511 180555 181031 181832 182683 183314 183570
56351 183570 183403 182921 182452 182456 183310 185167 187975 191516 195365 198950 201771 203608 204481 204577 204289 204172 204571
56334 204571 205306 206020 206847 208431 211133 214493 217666 220117 221721 222595 223297 224829 227781 231489 234720
56319 234720 237229 239946 243415 246821 249184 250910 253331 256930 260858 264281 267397 270824 274592 278246
56305 278246 281594 284780 287753 290231 292281 294492 297336 300622 303860 306963 310206 313576 316605 319048
56291 319048 321379 324240 327614 330970 334206 337971 342803 348367 353920 359328 365120 371528 377982 383913
56277 383913 389762 396751 405562 415697 426383 437875 451352 467533 485899 505591 526713 550226
56265 550226 576718 605869 637323 671614 709937 753330 802357 857312 918289 985204 1058118
56254 1058118 1137451 1223476 1315588 1412440 1512761 1615555 1719229 1821023 1917780 2007189
56244 2007189 2087864 2158263 2216076 2258954 2285615 2296022 2290784 2270802 2237508 2192920 2139100
56233 2139100 2077594 2009516 1936040 1858587 1778604 1697331 1615801 1534941 1455661 1378866 1305220
56222 1305220 1234804 1167221 1102299 1040632 983141 930196 881462 836581 795593 758683 725821
56211 725821 696849 671592 649713 630669 614007 599479 586783 575433 565056 555595 547072 539393
56199 539393 532536 526635 521603 516905 512028 507027 502379 498412 495135 492438 490247 488601 487800 488204 489602
56184 489602 490979 491391 490987 490823 491711 493589 495957 498519 501333 504651 508778 513885 519902 526714 534387
56169 534387 542965 552090 561119 569675 577928 586443 595947 607126 620237 634843 650203 666024 682753
56156 682753 701208 722210 746445 774348 806083 841959 882916 930358 985568 1049716 1124472
56145 1124472 1211996 1313672 1428507 1552412 1678633 1799119 1906596 1996691 2069032 2126917
56135 2126917 2176030 2222567 2270761 2320640 2367678 2405050 2426972 2431067 2419032 2395957 2368480
56124 2368480 2341956 2317809 2292735 2260308 2213920 2149340 2065851 1966124 1855448 1740696 1628863
56113 1628863 1525382 1433101 1352688 1283848 1226024 1178179 1138597 1105435 1077569 1054828 1037387
56102 1037387 1024933 1016365 1010372 1006343 1004542 1005244 1007891 1011405 1015215 1019640 1025321 1032628 1041628 1052239
56088 1052239 1064162 1076851 1089695 1102195 1114157 1125896 1138077 1150955 1163789 1175383 1185186
56077 1185186 1193573 1201170 1208431 1215906 1224251 1233683 1243764 1253959 1264130 1274482 1285523 1298170
56065 1298170 1313192 1330158 1347433 1363785 1379722 1396784 1415784 1436250 1457409 1479080 1501516
56054 1501516 1524787 1548617 1572671 1596848 1621308 1646342 1672287 1699547 1728501 1759209 1791321
56043 1791321 1824409 1858301 1892882 1927819 1962798 1997797 2032639 2066484 2098392 2128409 2157539
56032 2157539 2186745 2216733 2248712 2284395 2324770 2369549 2418266 2471268 2529068 2591327 2657212
56021 2657212 2726419 2799171 2875422 2954672 3036510 3120902 3207970 3297816 3390551 3486300 3585300
56010 3585300 3688047 3795064 3906385 4021590 4140545 4263820 4392226 4526326 4666552
56001 4666552 4813396 4967299 5128676 5298241 5476848 5664905 5862459 6070029 6288820
55992 6288820 6519942 6764072 7022163 7295901 7587127 7897322 8227889 8580458 8956803
55983 8956803 9359189 9790943 10255962 10757515 11298379 11882275 12514231 13199498 13943476
55974 13943476 14753172 15637591 16606406 17669755 18840042 20132762 21565336 23157244
55966 23157244 24932822 26923151 29165271 31702244 34586025 37879467 41655071 45993775
55958 45993775 50986006 56732051 63341254 70935000 79654212 89664203 101153962 114335042
55950 114335042 129437675 146687717 166249281 188122090 211970693 236880990 261148389
55943 261148389 282327224 297717113 305168312 303792604 294179288 278048596 257616074
55936 257616074 235015353 211962048 189653349 168816433 149820523 132792519 117706355
55929 117706355 104445048 92845510 82729777 73921930 66255132 59575812 53746939
55922 53746939 48648875 44178370 40247154 36779764 33710775 30983616 28551170 26375059
55914 26375059 24422463 22663809 21073435 19630666 18318778 17123266 16031460 15032596
55906 15032596 14117170 13276604 12503771 11792894 11138369 10534347 9975793 9458949 8980387
55897 8980387 8536526 8124452 7742089 7386965 7055816 6746022 6456529 6186754 5935538
55888 5935538 5701826 5485394 5285803 5101051 4927807 4762551 4602276 4445143 4291236
55879 4291236 4141979 3998113 3858790 3723166 3592036 3467114 3349231 3237955 3132525
55870 3132525 3032481 2937767 2848787 2765924 2688557 2615078 2544431 2477138 2414243 2355674 2300215
55859 2300215 2246618 2194207 2142700 2091983 2041795 1991451 1940290 1888602 1837440 1787220 1737354
55848 1737354 1687723 1639659 1594622 1552595 1512589 1474238 1438029 1404316 1372951 1343628 1315965
55837 1315965 1289518 1264285 1240877 1219556 1199538 1179957 1161121 1144075 1129174 1115882 1103732
55826 1103732 1092674 1082587 1073206 1064503 1056513 1048798 1040635 1031657 1021743 1010435 997135 981941 965690
55813 965690 949094 932298 915340 898553 882365 866982 852350 838293 824746 811960 800288
55802 800288 789688 779852 771011 764091 759766 757895 758236 760814 764644 766787 764008 755473 743017 728969
55788 728969 714645 700774 687995 676365 665271 654345 643928 634194 624478 614033 603054 592460
55776 592460 582892 574357 566666 559822 554055 549730 547239 546775 548209 551170 555154 559520 563513 566382
55762 566382 567504 566483 563158 557460 549297 538794 526601 513564 499978 485630 470807 456685
55750 456685 444278 433521 423971 415875 409687 404833 399949 394400 388686 383238 377690 371685 365604 359940
55736 359940 354437 348394 341581 334425 327501 321176 315579 310602 305936 301326 296768 292434 288482 284986
55722 284986 281897 278978 275886 272458 268872 265542 262801 260586 258392 255732 252693 249793 247246 244803
55708 244803 242489 240936 240511 240605 240445 240273 240943 242456 243685 243572 241966 239299 236200 233575 232319 232521
55692 232521 233363 234009 234246 234202 234019 234012 234552 235467 236075 236154 236505 238172 241428 245752 250463 255072 259395 263624
55674 263624 268063 272496 276049 277952 278224 277456 276166 274501 272214 268752 263691 257349 250680 244395 238562
55659 238562 233245 228951 226013 223979 222222 220933 220927 222594 225576 229523 234572 240867 247979 255202 262266
55644 262266 269448 276973 284591 291919 299021 306194 313111 318636 321825 322857 322512 321013 318010 313658
55630 313658 309004 305039 301864 299051 296491 294518 293445 293156 293045 292301 290517 288012 285207 281731 276642
55615 276642 269553 260973 251383 240659 228821 216764 205684 196027 187380 179179 171217 163684 156987
55602 156987 151303 146175 140917 135553 130880 127320 124285 121056 117764 114952 112647 110449 108176 105868
55588 105868 103452 100976 98950 97892 97747 98163 99042 100299 101465 102182 102805 103905 105452 107134 109089
55573 109089 111418 113285 113582 112450 111072 109854 107941 104853 101444 98583 95843 92399 88621 85797
55559 85797 84545 84291 84239 84190 84385 85045 86189 87551 88608 88936 88620 88138 87850 87728 87535 87121 86604 86327
55541 86327 86546 87041 87195 86628 85654 84921 84708 84682 84229 82916 80771 78368 76590 76072 76764 78038 79152
55524 79152 79632 79365 78557 77545 76562 75730 75305 75764 77430 80069 83033 85855 88548 91367 94426 97671
55508 97671 101143 105075 109643 114697 119888 125139 130881 137646 145406 153446 160885 167258 172519 176563
55494 176563 178903 178920 176466 172114 166673 160484 153394 145449 137300 129604 122218 114451 106181 98365 92132
55479 92132 87604 83870 80074 76141 72373 68713 64830 60855 57515 55291 53778 52259 50642 49334
55465 49334 48274 46796 44654 42585 41425 41079 40868 40541 40379 40458 40434 40065 39448 38663 37607 36336 35177
55448 35177 34338 33619 32666 31325 29799 28604 28295 28897 29679 29875 29564 29447 29789 30098 29947 29574 29425 29552
55430 29552 29777 30042 30253 30035 29034 27313 25242 23154 21334 20078 19498 19413 19597 19994 20564 21169 21853
55413 21853 22879 24250 25383 25584 24697 23079 21218 19639 18865 19063 19834 20665 21426 22146 22616 22644 22527
55396 22527 22755 23314 23751 23850 23753 23412 22502 21029 19570 18677 18385 18488 18921 19642 20419 20992 21286 21285 20933 20319
55376 20319 19787 19621 19772 19999 20129 20032 19528 18529 17139 15510 13761 12181 11288 11416 12357 13571 14634
55359 14634 15345 15563 15242 14554 13759 13017 12535 12738 13926 15746 17346 18183 18452 18661 19041 19548 20168 20912
55341 20912 21613 22019 22098 22046 21966 21692 21021 19948 18614 17125 15593 14244 13349 13010 13091 13421 13994 14933 16230
55322 16230 17508 18078 17417 15744 14075 13449 14018 14979 15489 15474 15502 16049 17104 18320 19277 19657 19455 19062
55304 19062 18925 19105 19347 19546 19862 20347 20857 21378 22061 22729 22814 22176 21545 21580 21755 20886 18730 16375 14945
55285 14945 14541 14680 15103 15711 16226 16507 16886 17627 18262 18076 17127 16244 15974 16044 15880 15218 14083 12692 11536
55266 11536 11126 11430 11894 12176 12440 12749 12657 11819 10594 9574 8822 8129 7728 8094 9094 9969 10303 10435
55248 10435 10701 10775 10146 8910 7716 7044 6836 6723 6412 5944 5781 6514 8254 10375 12065 13102 13893
55231 13893 14777 15574 15874 15575 15029 14708 14843 15280 15610 15446 14687 13612 12728 12488 13004 13959 14836 15338 15544
55212 15544 15666 15694 15390 14600 13447 12277 11501 11449 12157 13247 14148 14561 14631 14606 14503 14217 13827 13593 13722
55193 13722 14279 15220 16236 16693 16145 15022 14403 14831 15632 15744 14961 13965 13307 12883 12453 12089 11895 11741
55175 11741 11585 11718 12287 12831 12747 12134 11753 12175 13294 14654 15860 16548 16366 15271 13674 12127 10932
55158 10932 10118 9535 8856 7777 6505 5830 6365 7765 9029 9604 9826 10199 10582 10467 9895 9709 10742
55141 10742 12902 15152 16362 16169 15124 14141 13744 13811 13959 14078 14361 14843 15208 15207 15144 15659 17008 18733
55123 18733 20049 20409 19684 18092 16196 14803 14580 15593 17262 18813 19792 20201 20284 20311 20568 21307 22431
55106 22431 23288 23172 22283 21867 22987 25293 27446 28647 29203 29544 29378 28243 26471 25021 24507 24807 25481
55089 25481 26188 26715 27020 27315 27888 28763 29684 30369 30622 30264 29225 27709 26117 24768 23774 23100 22604 22172
55071 22172 21924 22105 22646 23087 23180 23257 23653 24062 23979 23573 23512 23934 24187 23748 22922 22404 22459 22751 22728 22051 20907
55050 20907 19988 19992 21055 22790 24680 26133 26430 25269 23350 21818 21021 20405 19701 19515 20386 21896 23201
55033 23201 23984 24442 24692 24752 24761 24738 24308 23145 21545 20230 19723 20162 21431 23049 24206 24368 23817 23278
55015 23278 23185 23600 24511 25758 26876 27561 28152 29211 30655 31828 32352 32476 32546 32651 32833 33216 33688 33791
54997 33791 33118 31658 29761 27963 26736 26135 25718 25089 24475 24399 24883 25345 25329 24985 24766 25005 25802 27004
54979 27004 28235 29221 30092 31110 32144 32822 33133 33447 33844 33909 33294 32200 31215 31001 32061 34282 36672
54962 36672 38140 38685 39273 40417 41599 42461 43712 46174 49491 52673 55617 59211 63930 69179 74284
54947 74284 79574 86079 94468 104458 115044 125098 133927 141372 147368 151427 152740 150791 145732 138202
54933 138202 128991 118899 108670 98935 90230 82941 77105 72348 68250 64722 61781 59108 56235 53227
54919 53227 50796 49558 49436 49892 50473 50949 51248 51548 52228 53402 54699 55851 57332 60007 64188 69538
54903 69538 75949 83921 93691 104421 114764 124043 132255 138989 143015 143277 139848 133545 124998 114640
54889 114640 103436 92898 84099 77002 70940 65486 60590 56192 52099 48266 44847 41938 39416 37140
54875 37140 35185 33830 33367 33903 35178 36528 37206 36930 36101 35431 35314 35578 35762 35587 35197 34970 35103 35350
54857 35350 35326 35049 34948 35197 35244 34364 32607 30809 29592 28762 27819 26662 25517 24554 23961 24060 24817 25430
54839 25430 25016 23711 22541 22150 22202 22148 21995 22058 22429 23020 23690 24060 23666 22727 22334 23302 25112 26480 26758
54820 26758 26296 25688 25252 25139 25349 25646 25949 26710 28384 30636 32646 34140 35381 36141 35639 33908 32445
54803 32445 32784 34877 37469 39783 42154 45109 48556 52072 55617 59705 64988 71844 80258 89932 100428
54788 100428 111200 121675 131405 139998 146737 150474 150318 146473 140092 132320 123854 115363 107691 101254
54774 101254 95654 90238 84849 79778 75274 71463 68504 66434 64944 63664 62580 61929 61776 61939 62265
54759 62265 62747 63430 64383 65741 67678 70393 74190 79357 85903 93619 102514 112934 125055 138556
54745 138556 152974 168027 183199 197287 208818 216853 221066 221221 217128 209107 198130 185332 171586
54732 171586 157508 143614 130351 118130 107296 97941 89868 82915 77145 72463 68257 63843 59217
54719 59217 55030 51767 49277 47093 44899 42620 40365 38394 36909 35780 34638 33320 32027 31061 30500
54704 30500 30178 29887 29613 29612 30109 30851 31279 31331 31724 33014 34668 35572 35372 34731 34336 34228 34214 34323 34606 34934
54684 34934 35233 35592 35929 35942 35614 35489 36126 37546 39412 41457 43480 45168 46266 46821 47117 47441 47963
54667 47963 48586 48811 48107 46602 45124 44335 44098 43931 43716 43635 43712 43893 44413 45604 47375 49248 50924 52539
54649 52539 54316 56238 58128 59861 61521 63470 66167 69720 73802 78273 83730 90990 100040 109975
54635 109975 120201 131220 143840 157849 171922 184835 196381 206879 216033 222592 225071 222674
54623 222674 215613 204978 192410 179584 167514 156307 145676 135610 126310 117713 109498 101641
54611 101641 94522 88395 83069 78300 74155 70737 67791 64870 61725 58366 54984 52023 50053 49236
54597 49236 49075 48931 48637 48336 47979 47379 46593 45885 45378 45080 45099 45378 45380 44568 43237 42299 42118 42073 41514 40669
54577 40669 40275 40652 41498 42314 42681 42314 41286 40148 39514 39510 39810 40152 40601 41285 42095 42698 42791 42366 41776
54558 41776 41463 41528 41663 41570 41332 41232 41335 41434 41350 41105 40887 40930 41402 42222 43059 43684 44263 45111 46190 47098
54538 47098 47615 48035 48846 50215 51900 53557 55023 56385 57907 59881 62411 65325 68404 71804 76171
54523 76171 82121 89467 97102 103879 109585 114836 120020 124650 127871 129194 128434 125321 119767 112502 104864
54508 104864 97820 91505 85804 80827 76543 72433 68032 63621 59917 57182 55067 53280 51933 51118
54494 51118 50547 49884 49230 49067 49773 51267 53025 54401 55085 55338 55711 56498 57499 58214 58114 56826 54440
54477 54440 51697 49583 48540 48265 48328 48633 49127 49453 49268 48696 48055 47333 46354 45362 44947 45344 46188 47063
54459 47063 47831 48300 48054 46991 45749 45158 45350 45711 45625 44985 44080 43304 42984 43183 43551 43635 43392 43174 43143
54440 43143 43012 42561 42108 42143 42669 43289 43826 44465 45246 45875 46163 46253 46184 45693 44817 44335 45013 46476 47429 47108
54420 47108 46086 45489 45838 46845 47935 48665 48913 48990 49402 50276 51230 52031 53063 54806 57070 59179 60792
54403 60792 62088 63211 63952 64095 63766 63296 62978 62937 63026 62812 61903 60317 58353 56224 54043 52089 50686
54386 50686 49842 49355 49241 49656 50397 50934 51037 50947 50808 50419 49735 49114 48768 48394 47709 46984 46623 46551 46467 46445
54366 46445 46817 47616 48599 49620 50599 51265 51467 51635 52361 53501 54257 54300 54303 55137 56891 58995 60936 62511
54348 62511 63555 63834 63280 62159 60980 60228 60066 60181 59990 59128 57758 56357 55237 54340 53523 52961 53098
54331 53098 54050 55158 55364 54171 52016 49661 47511 45795 44997 45519 46939 48180 48671 48900 49513 50165
54315 50165 49787 47949 45540 43859 43269 43052 42501 41710 41071 40407 39165 37445 36184 36033 36605 37220 37939
54298 37939 39146 40435 40795 39976 38934 38608 38840 38901 38561 38166 37928 37678 37211 36510 35697 35001 34718 34924
54280 34924 35289 35381 35114 34750 34565 34661 34976 35267 35246 34949 34828 35218 35844 36202 36284 36576 37355 38417 39557 40892
54260 40892 42481 43977 44951 45377 45545 45649 45751 45990 46503 47107 47338 46881 45795 44307 42647 41200 40485
54243 40485 40659 41170 41179 40396 39253 38309 37727 37399 37295 37429 37667 37725 37360 36463 35170 33898 33061 32570 31913
54224 31913 30976 30458 31027 32333 33387 33834 34151 34571 34536 33657 32626 32584 33833 35662 37250 38242 38579 38283
54206 38283 37509 36457 35108 33343 31425 30084 29876 30513 31032 30736 29923 29535 29989 30535 30145 28954 28316
54189 28316 29232 31162 32784 33519 33826 34307 35158 36363 37719 38543 38003 36063 33728 32098 31507 31742 32617
54172 32617 33864 34815 34755 33648 32144 30848 29869 29165 28962 29525 30581 31310 31103 30236 29566 29618 30225 31115
54154 31115 32433 34314 36227 37248 37085 36401 36057 36296 36764 36998 36732 35978 35004 34168 33693 33681 34207 35131
54136 35131 35921 36104 35905 35986 36416 36429 35428 33798 32390 31667 31666 32333 33349 33965 33677 32910 32487 32550 32551 32225
54116 32225 31944 32058 32472 33063 33960 35132 36101 36407 36140 35783 35693 35890 36169 36260 36038 35660 35385 35222 34995
54097 34995 34733 34740 35237 36223 37714 39766 42093 44086 45394 46191 46623 46398 45250 43547 42035 41136 40833
54080 40833 41082 41870 42887 43564 43588 43176 42805 42843 43503 44870 46838 49095 51278 53166 54738 56109 57317
54063 57317 58180 58464 58260 58070 58367 59227 60534 62375 64940 68075 71262 74130 76803 79661 82908 86445
54047 86445 90065 93689 97380 101221 105211 109330 113629 118090 122418 126199 129284 131819 133848 135167
54033 135167 135718 135835 135839 135637 134994 133946 132610 130836 128479 125832 123241 120435 116865 112766 109215 106839
54017 106839 105016 102687 99567 96150 92932 90122 87863 86164 84645 82835 80774 78911 77321 75427
54003 75427 72759 69700 67181 65746 65240 65351 65961 66779 67011 65937 63863 61966 61023 60643 60055 59251 58841
53986 58841 59020 59306 59346 59377 59721 60280 60789 61194 61527 61690 61622 61372 60854 59864 58616 57847 58023 58737 59332 59781
53966 59781 60496 61498 62416 63202 64224 65591 66926 67962 68897 69929 70927 71864 73217 75496 78487 81365
53950 81365 83553 85255 87090 89389 91971 94585 97365 100706 104725 109103 113557 118221 123327 128779
53936 128779 134422 140570 147797 156157 165048 173912 182679 191338 199627 207437 215149 223074 230757 237275
53922 237275 242193 245818 248511 250117 250227 248795 246321 243561 241117 239167 237434 235359 232428 228457
53908 228457 223682 218575 213424 208081 202255 196027 189843 183905 177888 171467 164895 158678 152844 146986
53894 146986 141019 135444 130741 126881 123659 121095 119165 117378 115103 112225 109111 106044 103085 100453
53880 100453 98483 97017 95349 93165 91102 89869 89070 87522 84733 81475 78795 77026 76000 75657 75891
53865 75891 76163 75872 75050 74235 73659 73027 72154 71317 70762 70212 69239 67956 66980 66733 66965 67028 66513 65637 65080
53846 65080 65425 66708 68476 70273 71934 73405 74493 74958 74846 74538 74407 74524 74716 74824 74780 74523 74054
53829 74054 73618 73649 74307 75200 75772 75935 76082 76510 77215 78306 80109 82617 85247 87585 90031 93176 96840
53812 96840 100361 103701 107526 112127 117002 121695 126295 130723 134244 136345 137680 139388 141657 143596
53798 143596 144467 144464 144170 143794 143121 141902 140063 137683 134876 131651 127954 123982 120254 117171 114594 112123
53782 112123 109673 107406 105211 102656 99538 96111 92719 89515 86619 84175 82092 80020 77792 75648
53768 75648 73889 72545 71547 70962 70785 70675 70189 69256 68231 67508 67137 66799 66108 64972 63662 62444 61275
53751 61275 60024 58895 58239 57962 57532 56724 55930 55544 55395 55198 55165 55704 56671 57412 57536 57266 57068 57292 58188
53732 58188 59797 61718 63249 63928 63851 63514 63533 64381 65951 67391 67771 67079 66204 65848 65809 65559 65094 64812
53714 64812 64764 64488 63637 62555 62108 62943 64864 66966 68553 69880 71729 74250 76647 78127 78780 79282
53698 79282 80085 81177 82291 83024 83120 83059 83966 86412 89523 91963 93511 94967 96626 97786 97984 97878 98402
53681 98402 99622 100915 101850 102389 102518 102230 101712 101218 100837 100608 100634 100900 101194 101455 101891 102517 102924 102853 102658
53662 102658 102764 102925 102513 101404 100164 99454 99603 100540 101744 102500 102659 102977 104192 105988 107425 108196 108768
53645 108768 109358 109581 109235 108672 108128 107330 106126 104900 104001 103245 102400 101716 101595 102047 102871 104051 105543
53628 105543 106917 107616 107477 106770 105977 105714 106498 108217 110077 111402 112274 113075 113797 114239 114613 115454 117020
53611 117020 119178 121722 124400 126757 128429 129589 130799 132474 134701 137374 140106 142278 143650 144790
53597 144790 146391 148243 149463 149729 149725 150292 151626 153413 155228 156629 157305 157438 157617 158212 159149 160312 161694
53580 161694 162927 163224 162239 160677 159563 159075 158497 157227 155470 153906 152945 152415 151799 150733 149317 147948
53564 147948 146936 146361 146249 146600 147124 147325 147026 146632 146677 147254 148080 148904 149519 149558 148684 147072 145386 144211
53546 144211 143689 143790 144676 146556 149306 152428 155424 158033 160173 161857 163272 164770 166564 168481 170211
53531 170211 171777 173603 176069 179156 182562 185954 189087 191929 194824 198298 202499 207069 211733 216743
53517 216743 222470 228807 235385 242175 249444 257210 265201 273263 281408 289479 297317 305294 314167 324262
53503 324262 335244 346814 359109 372163 385537 398898 412609 427201 442466 457487 471520
53492 471520 484580 497268 510273 523944 538147 552569 567194 582230 597528 612497 626872
53481 626872 641134 655814 670621 684729 697701 709685 720889 731397 741438 751382 761464 771913
53469 771913 783196 795539 808100 819254 828053 835073 841534 847879 853556 857929 860913 862638 862830
53456 862830 860848 856415 850170 843314 836600 829818 822392 814270 805963 797834 789729 781332 772489 763028
53442 763028 752660 741335 729508 717773 706275 694717 682884 670979 659411 648431 638028
53431 638028 628114 618802 610522 603778 598732 595019 592028 589385 587128 585483 584549 584252 584581 585817 588417
53416 588417 592583 597929 603703 609371 614995 621026 627844 635577 644272 654052 665013 677012 689714
53403 689714 702815 716223 730075 744658 760275 777027 794622 812611 830971 850367 871641
53392 871641 895031 920072 946221 973351 1001564 1030776 1060690 1091096 1122035 1153633 1185802
53381 1185802 1218185 1250493 1282913 1315901 1349357 1382230 1413397 1442819 1471324 1499286 1526119
53370 1526119 1551228 1574761 1596971 1617386 1635275 1650667 1664298 1676707 1687876 1697603 1705525 1710742
53358 1710742 1711973 1708327 1699632 1686010 1667550 1644513 1617546 1587602 1555859 1523583 1491607 1459887
53346 1459887 1427946 1395795 1363991 1332830 1302079 1271730 1242477 1215083 1189551 1165154 1140980
53335 1140980 1116312 1090902 1065225 1040112 1015886 992179 968820 946372 925388 905608 886513
53324 886513 868432 852390 838941 827685 817956 809460 802065 795355 788587 780995 772181 762417 752452
53311 752452 742751 733044 722982 713010 704106 696603 689839 683071 676283 669935 664399 659935 656876 655389
53297 655389 655192 655745 656683 657964 659808 662673 667089 673267 680849 689147 697577 705960 714690 724658 736664
53282 736664 750594 765389 779965 794064 808112 822584 837680 853170 868181 881507 892697
53271 892697 902671 912700 922869 932113 939706 945947 951218 955091 956882 956592 954682 951200 945733 938136
53257 938136 928831 918321 906859 894623 881722 867855 852355 834947 816289 797457 778951 760474
53245 760474 741668 722773 704447 687097 670627 654855 639924 626132 613388 601033 588292
53234 588292 574775 560484 545530 530123 514773 500170 486672 474077 462045 450584 439975
53223 439975 430301 421340 412976 405498 399333 394505 390468 386435 381798 376321 370149 363725 357525 351608
53209 351608 345417 338179 329578 319991 310092 300375 291117 282479 274410 266557 258574 250582 243164 236862
53195 236862 231758 227500 223537 219318 214510 209148 203550 197994 192551 187191 181932 176843 172038 167699
53181 167699 163982 160832 158027 155466 153256 151478 150058 148932 148098 147343 146159 144226 141867 139785 138380
53166 138380 137600 137440 138213 140116 142696 144976 146133 145991 144917 143413 141859 140513 139580 139189 139315 139742
53150 139742 140132 140214 140033 139956 140263 140662 140477 139462 138221 137570 137619 137815 137720 137306 136504 135093 133263 131846
53132 131846 131570 132323 133382 134051 133786 132129 129123 125709 123128 121822 121239 120701 120104 119719 119678 119802 119712
53115 119712 119014 117649 116069 114842 113936 112676 110557 107913 105650 104386 103938 103489 102270 100231 98163
53100 98163 97014 96989 97400 97374 96560 95174 93607 92156 90999 90292 90261 91092 92610 94108 94783 94461 93772 93523
53082 93523 93921 94408 94170 92898 91171 89979 89741 89933 89853 89459 89068 88548 87415 85795 84561 84328 84761
53065 84761 85170 85265 85038 84423 83569 83039 83224 83762 84036 84050 84294 84857 85272 85191 84738 84075 83132 81937 80906
53046 80906 80558 81102 82307 83571 84140 83637 82541 81809 81873 82208 82109 81585 81221 81320 81548 81431 81023 80983 82049
53027 82049 84372 87266 89689 91111 91941 93015 94718 96745 98670 100478 102359 104179 105487 106071 106247
53012 106247 106452 106759 107017 107276 107738 108310 108570 108301 107778 107353 107086 106973 107203 107738 107861 106689 104272 101702
52994 101702 99980 99106 98522 98066 98055 98541 98995 98871 98208 97486 97027 96765 96540 96442 96688 97286 97929 98333 98559
52975 98559 98859 99221 99286 98838 98231 98104 98645 99349 99549 99023 98074 97237 97056 97939 99919 102539 105181 107467
52957 107467 109226 110182 110050 109062 108041 107673 107805 107696 106885 105649 104618 104093 103797 103256 102369 101598 101493
52940 101493 102102 102956 103564 103687 103234 102310 101486 101551 102594 103600 103390 101871 100092 99207 99653 101114 102835
52923 102835 103954 103952 102919 101338 99707 98486 98086 98532 99338 100104 100966 102042 102730 102288 100967 99822 99318
52906 99318 98905 98083 97121 96436 95970 95588 95515 95876 96320 96509 96564 96636 96488 95993 95616 95804 96254 96331 96044 96028 96620
52885 96620 97404 97644 96916 95444 94038 93477 93754 94198 94482 95063 96278 97597 98348 98789 99851 102033 105089
52868 105089 108563 112065 115217 117870 120148 121871 122290 121044 119020 117410 116208 114474 111945 109341
52854 109341 107045 104559 101607 98858 97057 96026 95018 93555 91586 89310 87210 85853 85266 84844 84123
52839 84123 83314 82823 82671 82658 82649 82384 81401 79576 77499 75907 74913 74076 73080 72055 71309 70947 70730 70274 69495
52820 69495 68844 68824 69343 69815 69846 69471 68768 67758 66703 65961 65401 64474 63068 61834 61403 61759 62565 63650
52802 63650 64884 66020 66961 67823 68576 69057 69449 70145 70905 70850 69761 68680 68635 69269 69415 68632 67483 66642
52784 66642 66394 66851 67940 69197 70076 70449 70521 70463 70479 70919 71812 72526 72450 71829 71413 71444 71543 71433 71239 71116
52764 71116 71126 71375 71820 72026 71636 70953 70588 70607 70612 70541 70786 71540 72642 74091 76108 78594 81086 83387 85716
52745 85716 88136 90363 92288 94139 95958 97455 98596 99851 101536 103284 104392 104383 103130 100908 98480
52730 98480 96587 95074 92988 89948 86931 85271 85175 85740 86149 86286 86265 85945 85079 83682 82133 81068 81170
52713 81170 82816 85718 88878 91064 91540 90568 89147 88168 87856 88108 89026 90714 92632 93700 93265 91697
52697 91697 89989 89004 89138 90230 91592 92442 92545 92298 92174 92374 93032 94235 95656 96610 96790 96549 96185
52680 96185 95426 94073 92725 92222 92574 92951 92703 91864 90729 89470 88264 87332 86661 86020 85373 85003 85050 85222
52662 85222 85142 84778 84327 83864 83333 82801 82480 82491 82808 83428 84410 85619 86619 87025 86943 86832 86899 86890 86626 86526
52642 86526 87305 89148 91425 93225 94019 93838 93057 92095 91153 90121 88822 87336 86033 85406 85859 87440
52626 87440 89468 90673 90202 88443 86504 84963 83633 82458 81863 81971 82166 81952 81702 82014 82735 83226 83279
52609 83279 83176 83078 83049 83592 85370 88259 91252 93544 95243 96804 98206 99075 99352 99479 100024 101287 103161
52592 103161 105177 106789 107795 108445 109120 109949 110767 111288 111245 110530 109335 108051 106917 105826 104583 103303
52576 103303 102405 102187 102464 102694 102426 101656 100692 99740 98672 97251 95511 93781 92319 91003 89471 87633
52560 87633 85953 85109 85276 85883 86217 86145 86046 86108 86073 85734 85303 85079 85003 84901 84932 85425 86312 87056 87257 87126 87242
52539 87242 87886 88649 88710 87620 85839 84327 83544 83018 82043 80548 79095 78260 78297 79170 80495 81535 81739
52522 81739 81318 80998 81148 81416 81268 80572 79593 78723 78293 78418 78896 79368 79645 79688 79359 78509 77326 76277 75614
52503 75614 75165 74687 74142 73533 72828 72229 72208 72984 74171 75139 75629 75811 75899 75932 75906 75908 76147 76859 78076 79418
52483 79418 80299 80442 80129 79890 80078 80754 81739 82673 83253 83540 83906 84594 85541 86645 87858 88848 88976 87952
52465 87952 86303 84790 83568 82292 80934 80002 79916 80526 81333 81954 82266 82379 82542 82893 83187 82971 82123 81102
52447 81102 80551 80734 81381 81962 82106 81841 81514 81410 81476 81493 81427 81402 81385 81139 80563 79851 79219 78668 78146 77773 77744
52426 77744 78132 78942 80199 81774 83239 84192 84744 85397 86342 87125 87209 86626 85829 84989 83944 82854 82435 83124
52408 83124 84319 84920 84638 84332 84970 86586 88420 89731 90264 90169 89856 89764 90010 90292 90324 90233 90345 90714 91170
52389 91170 91768 92815 94378 96053 97361 98207 98894 99814 101187 102932 104657 105894 106445 106548 106718 107459
52373 107459 109049 111435 114328 117398 120306 122561 123629 123454 122688 122075 121718 121208 120444 119939 120312 121833
52357 121833 124422 127709 130979 133546 135426 137301 139592 141917 143752 145281 147174 149742 152770 156105
52343 156105 159899 164159 168445 172310 175981 180372 186329 193820 201917 209643 216791 223847 231311 239424
52329 239424 248517 259065 271167 284281 297817 311723 326217 341173 356148 370881 385464 400154
52317 400154 415276 431103 447475 463683 479024 493340 506769 519256 530728 541393 551278 559712
52305 559712 566009 570598 574654 578525 581321 582289 581791 580516 578522 575701 572607 569935 567425 563970 558797
52290 558797 552102 544672 537413 531125 526158 522191 518726 515892 514410 514714 516468 519060 522313 526591
52276 526591 532344 539622 547968 556837 566167 576356 587491 598935 610018 620939 632438 644643
52264 644643 656788 668131 678637 688563 697840 706219 713646 720091 725221 728669 730603 731602 731883 730874
52250 730874 727692 721945 713935 704276 693611 682672 672182 662231 651938 640314 627610 615318
52238 615318 604558 594959 585583 576445 568387 561678 555643 549741 544201 539338 534991 531063 527981 525984
52224 525984 524431 522525 520501 519427 519833 521125 522459 523692 525232 527294 529618 531870 534062 536476
52210 536476 539210 541920 544209 546260 548783 552160 555848 558858 560696 561593 562032 562331 562620 562840 562732 562098
52194 562098 561076 559958 558721 557066 554970 552824 550908 548970 546624 543952 541408 539190 537012 534591
52180 534591 532114 529999 528292 526543 524329 521725 519140 516887 515059 513709 512860 512421 512299 512514 512905
52165 512905 512799 511514 509288 507180 505773 504468 502507 500229 498688 498298 498555 498980 499579 500283 500691 500721
52149 500721 500932 501723 502640 502986 502851 503076 504310 506493 509196 512067 515001 518261 522443 528001 534690 541786
52133 541786 548969 556701 565637 575925 587332 599765 613238 627436 641812 656254 671268 687205
52121 687205 703567 719446 734446 748794 762607 775582 787525 798669 809182 818751 827066 834401
52109 834401 841259 847587 852858 856750 859215 859857 857952 853343 846911 839800 832479 824814 816724 808320
52095 808320 799655 790746 781855 773347 765328 757631 750235 743376 737273 732005 727783 725038 724013 724359
52081 724359 725439 727121 730098 735226 742577 751342 760718 770618 781332 792751 804423 816275 828745
52068 828745 841934 855040 867023 877582 887117 895890 903620 909872 914469 917508 919299 920312 920835
52055 920835 920529 918537 914171 907374 898524 888045 876334 863763 850451 836095 820226 802678 783783
52042 783783 764211 744735 725993 708266 691417 675125 659179 643563 628359 613675 599632
52031 599632 586354 573963 562595 552330 543026 534322 525896 517672 509671 501723 493514 484933 476257
52018 476257 467887 459936 452136 444133 435852 427585 419651 411993 404139 395611 386310 376423 366083 355294
52004 355294 344145 332840 321462 309949 298456 287522 277619 268661 260192 252014 244274 236943 229606
51991 229606 221985 214381 207295 200827 194791 189307 184788 181249 178042 174550 170919 167761 165295 163124
51977 163124 160885 158713 156903 155351 153643 151590 149394 147207 144778 141723 138078 134419 131448 129492
51963 129492 128344 127412 126018 123778 120864 117842 115095 112454 109554 106597 104523 104169 105258 106425 106419
51948 106419 105256 104096 103961 104738 105471 105395 104513 103270 102064 101151 100703 100643 100529 99890 98731 97514 96639
51931 96639 96052 95433 94623 93789 93205 92972 92986 93164 93617 94445 95359 95670 94867 93147 91253 89803 88877 88189
51913 88189 87497 86815 86336 86157 86082 85728 84890 83686 82364 81118 80202 79925 80298 80911 81436 81990 82631 82834
51895 82834 82102 80947 80493 81026 81731 82083 82653 83988 85457 86075 85983 86198 87072 87910 88142 87995 87816 87484
51877 87484 86885 86371 86290 86453 86438 86136 85649 84994 84318 84145 84998 86831 89141 91525 93862 96165 98593 101468
51859 101468 104942 108808 112980 118028 124708 133041 142383 152446 163661 176390 190485 206122 224460
51846 224460 246674 272254 298610 322184 339567 348045 346243 334893 316635 294643 271447 248900
51834 248900 228418 210665 195337 181836 170036 160056 151617 144314 138388 134459 132347 130790 128654
51821 128654 125917 123116 120339 117300 114083 111202 108972 107262 105913 105005 104684 104983 105768 106656 106996 106293
51805 106293 104757 103214 102415 102557 103399 104530 105520 106093 106322 106508 106796 107066 107175 107145 107067 107042 107221 107649 108048
51786 108048 108011 107504 106913 106506 106131 105566 104879 104284 103816 103394 102972 102480 101841 101240 101117 101592 102137 102143 101654 101158
51766 101158 100814 100372 99821 99587 99927 100531 101007 101430 102059 102768 103155 103150 103096 103149 103001 102490 102225 103122 105246 107508
51746 107508 108821 109257 109679 110385 110737 110243 109379 108936 109010 109177 109369 109904 110716 111199 110945 110045 108587 106508
51728 106508 104260 102942 103191 104243 104672 103866 102283 100521 98846 97603 97303 97969 98831 99002 98233 96801
51712 96801 95011 93091 91347 90004 88949 87861 86587 85251 84119 83522 83789 84979 86647 88079 88864
51697 88864 89191 89586 90365 91344 91982 91902 91311 90827 90842 91125 91096 90378 89004 87306 85803 85042 85233 85972 86524
51678 86524 86470 85982 85494 85233 85196 85403 86006 87004 87922 87988 86867 85143 83812 83263 83083 82921 83062 83873 85095
51659 85095 86213 87221 88375 89340 89368 88391 87241 86504 85892 85178 85042 86242 88307 89913 90490 90729 91426
51642 91426 92589 93935 95649 98064 100889 103304 104803 105595 106198 107004 108324 110444 113292 116148 118058
51627 118058 118689 118582 118447 118375 117993 117266 116753 116973 117761 118451 118495 117745 116334 114572 112862 111424 110080 108511
51609 108511 106734 105060 103549 101843 99709 97530 95924 94991 94269 93474 92870 92726 92700 92195 91214 90445 90436
51592 90436 91090 92074 93278 94516 95218 94951 94094 93453 93312 93326 93260 93167 92872 91992 90790 90291 91114 92661 93900
51573 93900 94566 95078 95647 96089 96294 96369 96397 96462 96807 97598 98661 99784 101059 102521 103784 104578 105414 107033
51555 107033 109313 111410 112944 114338 115932 117472 118687 119752 120896 122052 123146 124266 125349 126197
51541 126197 127055 128642 131256 134265 136801 138597 139835 140604 140907 140943 140953 140958 140887 140730 140416 139863 139303 139186
51523 139186 139532 139848 139941 140305 141267 142257 142488 142013 141505 141245 140915 140276 139394 138237 136572 134364 131972 129881
51505 129881 128444 127741 127439 126978 126118 125096 123983 122317 119787 116894 114358 112195 110019 107955 106458
51490 106458 105385 104036 102195 100337 98742 97147 95481 94184 93495 93051 92598 92513 93129 93963 94109 93220
51474 93220 91747 90359 89381 88657 87852 87047 86930 87967 89424 89854 88787 87317 86705 86947 87220 87230 87402
51457 87402 88007 88738 89161 89106 88596 87779 86949 86423 86362 86754 87416 87918 87828 87285 87003 87408 88038 88207 87987 88102
51437 88102 89057 90790 93049 95547 97808 99303 99828 99482 98374 96730 95162 94388 94607 95501 96743 98045
51421 98045 98783 98253 96569 94833 94088 94338 94867 95175 95317 95503 95764 95968 95956 95608 94900 93856 92455 90619
51403 90619 88336 85751 83132 80851 79280 78509 78150 77605 76578 75236 73928 72916 72306 71983 71590 70839
51387 70839 69884 69191 68968 68945 68703 68032 66945 65649 64546 64006 64032 64350 64781 65248 65482 65204 64705 64720 65473
51368 65473 66287 66403 65830 65037 64253 63543 63241 63707 64774 65924 66924 67848 68566 68768 68539 68360 68434 68385 67819
51349 67819 66825 65785 64967 64474 64261 64026 63427 62613 62285 62945 64218 65206 65432 65237 65325 66123 67525 69120
51331 69120 70617 72080 73711 75401 76651 77023 76592 75886 75440 75400 75384 74737 73143 71147 69845 69871 70804
51314 70804 71719 72220 72662 73452 74366 74710 74018 72517 70967 70089 70112 70779 71598 72096 72050 71685 71502 71656 71610
51295 71610 70748 69294 68181 67962 68281 68601 68952 69616 70546 71535 72631 73824 74550 74127 72734 71459 71248
51278 71248 72166 73673 75228 76499 77384 77998 78471 78718 78679 78725 79471 81105 83216 85272 86955 88018 88355
51261 88355 88365 88740 89628 90398 90499 90181 90066 90378 90914 91398 91458 90653 89039 87480 86856 87087 87419 87472 87420 87227
51241 87227 86401 84708 82635 80885 79778 79301 79347 79609 79539 78797 77648 76696 76338 76603 77333 78264 78987 79136
51223 79136 78757 78469 79080 80888 83254 85034 85593 85337 85132 85330 85651 85782 85684 85275 84389 83288 82817 83671
51205 83671 85683 88087 90297 92090 93222 93349 92401 90760 88961 87376 86197 85521 85284 85206 84912 84166
51189 84166 83067 82019 81394 81148 80902 80507 80353 80879 81907 82810 83330 83872 84868 86136 87128 87580 87669 87711
51171 87711 88003 88813 90096 91167 91118 89820 88224 87406 87495 87855 88090 88391 88894 89218 88872 87808 86342 84813
51153 84813 83554 82923 82970 83200 83027 82447 81996 82073 82659 83646 85022 86657 88222 89568 90894 92312 93473
51136 93473 93874 93456 92688 92136 92081 92480 93099 93701 94209 94680 95115 95426 95647 95986 96530 97063 97314 97300 97198 97050
51116 97050 96836 96751 97119 98049 99474 101446 103995 106564 108060 107885 106709 105854 106024 106963 108260 109854 111575
51099 111575 112656 112272 110476 108261 106709 106252 106633 107213 107334 106843 106388 106892 108510 110372 111514 111736
51083 111736 111363 110613 109696 109224 109896 111706 113892 115713 116930 117539 117579 117326 117237 117421 117520 117254 116776 116273
51065 116273 115640 114879 114419 114557 114798 114344 113255 112637 113521 115816 118454 120339 121012 120651 119716 118668 117880
51048 117880 117640 118048 118927 119998 121214 122794 124784 126737 128000 128268 127806 127191 126973 127446 128570 130105
51032 130105 131795 133426 134759 135674 136455 137607 139211 140688 141460 141695 142123 143244 144968 146873 148552
51017 148552 149810 150860 152313 154700 157923 161398 164731 168095 171903 176259 180694 184483 187423 190415
51003 190415 194922 201504 209138 216370 222942 229868 238075 247554 257740 268133 278429 288637 299356
50990 299356 311563 325936 342720 362232 384946 410841 439227 469573 502106 537278 575132
50979 575132 615600 658997 705589 754851 805723 857467 909822 962412 1014475 1065163 1113604
50968 1113604 1158608 1198721 1232831 1260627 1282516 1299233 1311275 1318326 1319387 1314003 1303360 1289718
50956 1289718 1274697 1258643 1241791 1225356 1210892 1198935 1188804 1179644 1171114 1162988 1154537 1144630
50944 1144630 1132319 1117119 1098781 1077009 1051579 1022655 990761 956273 919106 879165 837140
50933 837140 794559 752956 713113 675190 639309 605760 574734 546117 519614 494970 472199
50922 472199 451688 433988 419282 407029 396313 386578 377978 370966 365627 361409 357552 353800 350677
50909 350677 348896 348441 348442 348123 347665 347845 349004 350699 352309 353525 354287 354702 355241 356568 358855 361593 364400
50892 364400 367677 372079 377592 383652 389992 396831 404264 412143 420637 430335 441465 453453 465591
50879 465591 477880 490943 505467 522076 541327 563378 587871 614672 644650 679273 719501
50868 719501 765548 817665 876583 942975 1016913 1098140 1186554 1282100 1384372 1492623 1606152
50857 1606152 1724556 1847542 1974379 2103185 2230623 2352470 2464628 2563646 2646579 2711085
50847 2711085 2756127 2782369 2791483 2785040 2764279 2730834 2687425 2637775 2585907 2535387 2488978 2448804
50835 2448804 2416593 2393418 2379075 2371936 2369505 2368905 2366848 2359807 2344940 2320902 2287478 2244622
50823 2244622 2192239 2130694 2060842 1983402 1898863 1808251 1713574 1617266 1521465 1428011 1338602
50812 1338602 1254467 1176134 1103954 1038631 980725 929826 884886 845425 811789 784055 761289
50801 761289 742320 726847 715195 707209 701929 698381 696148 694994 694329 693378 691694 689265 686188 682480
50787 682480 678138 673180 667536 661005 653380 644647 635092 625235 615568 606223 596825 586762 575749 564276
50773 564276 553460 544221 536487 529360 522267 515775 511009 508386 507389 507608 509477 513702 520324 528756
50759 528756 538546 549767 562877 578540 597405 619659 644889 672762 703679 738330 776816 818867
50747 818867 864871 915901 972418 1033612 1098355 1166220 1237022 1309856 1383289 1456234 1527915
50736 1527915 1597015 1661510 1719418 1769223 1809436 1838280 1854172 1856402 1845320 1822279 1789673
50725 1789673 1750782 1709223 1668360 1631001 1599200 1574035 1555740 1544329 1539944 1542354 1550117 1560554
50713 1560554 1570643 1577918 1580494 1576562 1564224 1542056 1509812 1468590 1420295 1366914 1310117 1251398
50701 1251398 1192391 1134857 1080165 1028735 980260 934613 892401 854453 821008 791775 766645
50690 766645 745847 729316 716460 706860 700825 698978 701554 708366 719121 733324 750087 768424
50678 768424 787585 806734 824577 839979 852894 864192 874462 883463 890764 896305 900112 901998
50666 901998 902013 900869 899508 898364 897320 896172 894893 893696 893213 894475 898276 904553 912687 922507 934711
50651 934711 950187 969041 990480 1013510 1037530 1062142 1086563 1109523 1129863 1147152 1161621
50640 1161621 1173707 1183782 1192027 1198163 1201423 1201226 1197859 1192108 1184264 1174061 1161718 1148415 1135442
50627 1135442 1123369 1112382 1102822 1094755 1087500 1080335 1073544 1068030 1063987 1060689 1057713 1055692 1055564 1057590
50613 1057590 1061391 1066481 1072338 1078208 1083182 1086342 1086703 1083240 1075190 1062182 1044075 1021033 993912
50600 993912 964124 932724 899812 865150 829199 793284 758945 727349 699076 674006 651512
50589 651512 631144 613097 597813 585335 575413 568037 563351 561080 560535 561236 563110 566016 569598 573728
50575 573728 578621 584285 590321 596530 603268 610863 619155 628080 638325 650757 665372 681400 698384
50562 698384 716571 736195 756944 778213 799390 819652 838091 854438 869442 884178 899208
50551 899208 914680 930958 948674 968185 989371 1012030 1036233 1062196 1090059 1119961 1152372
50540 1152372 1188271 1228909 1275209 1327182 1383954 1444302 1507175 1571730 1637219 1702985 1768262
50529 1768262 1831599 1890592 1942608 1985912 2019809 2043641 2056068 2055757 2042717 2018597 1985527 1944737
50517 1944737 1896444 1840972 1779847 1715695 1651210 1588308 1528109 1471371 1418701 1370531 1327233
50506 1327233 1289381 1257729 1232773 1214329 1201591 1193722 1190488 1192432 1200311 1214316 1233788 1257575
50494 1257575 1284405 1312724 1340245 1363873 1380219 1386375 1380623 1362798 1334062 1296206 1251097 1200622
50482 1200622 1146776 1091451 1036165 982138 930458 881835 836302 793502 753381 716336 682758
50471 682758 652735 626306 603614 584614 568898 556079 546150 539205 534938 532688 531959 532733 535238
50458 535238 539527 545279 551993 559450 567940 577852 588976 600444 611463 621844 631561 640160 647118
50445 647118 652708 657988 663693 669526 674792 679528 684603 690764 697958 705689 713801 722627 732479 743313
50431 743313 755064 768065 782780 799127 816419 834249 853282 874793 899374 926388 954892
50420 954892 984870 1017200 1052390 1089595 1127021 1163036 1196738 1227717 1255705 1280457 1301536
50409 1301536 1317964 1328326 1331450 1326885 1314561 1294290 1266025 1230525 1189336 1143958 1095312 1044165
50397 1044165 991836 940224 891091 845414 803391 765066 730862 701393 676783 656502 640090
50386 640090 627729 619702 615558 614443 616225 621696 631438 644982 661258 679201 697469 714126 727424
50373 727424 736800 742527 744416 741384 732450 717825 698945 677705 655690 633715 611861 589971
50361 589971 568086 546331 524642 503059 482286 463526 447506 433918 421971 411219 401632 393129
50349 393129 385446 378555 372873 368893 366620 365571 365368 366240 368761 373111 378782 385120 391958 399478 407573
50334 407573 415612 422946 429548 436113 443623 452683 463062 473781 483765 492479 499926 506211 511335 515342
50320 515342 518385 520498 521497 521348 520603 520267 521030 522657 524336 525707 527291 529596 531990 533043 532093 529934
50304 529934 527618 525097 521670 517367 513157 509749 506891 504045 501192 498702 496829 495666 495356 495965 497284
50289 497284 498920 500475 501530 501700 500972 499901 499253 499437 500298 501336 502026 502057 501378 500045 498108 495726
50273 495726 493204 490658 487664 483594 478323 472342 466215 460294 454919 450410 446665 443260 440247 438433
50259 438433 438457 439823 441265 441955 442091 442443 443629 445689 448083 450146 451708 453118 454553 455653 456078 456119
50243 456119 456334 456803 457154 457202 457083 456836 456290 455345 453973 451875 448572 443949 438423 432513 426522 420650
50227 420650 415040 409569 403877 397794 391600 385744 380429 375503 370623 365589 360728 356910 354889 354580
50213 354580 355232 356250 357572 359263 361220 363371 365758 368209 370263 371657 372635 373578 374661 376074 378208
50198 378208 381301 385254 390208 396990 406412 418232 431419 445560 461540 480634 503314 529092
50186 529092 557183 586840 617100 646548 673500 696523 714905 728894 739586 748510 757115 766309
50174 766309 776190 786046 794650 800576 802313 798275 787139 768356 742396 710476 674158 635238 595730
50161 595730 557516 521820 489073 459382 432990 410187 390903 374656 360863 348999 338460
50150 338460 328661 319496 311498 305174 300297 296146 292364 289182 286768 284816 283013 281552 280851 280950 281439
50135 281439 281892 282143 282290 282666 283661 285307 287167 288926 290937 293759 297278 300796 304071 307691 312198
50120 312198 317282 322219 326719 330887 334631 337713 340355 343270 346907 351026 355141 359077 362938 366845
50106 366845 370961 375605 381047 387295 394194 401611 409357 417157 425000 433395 442903 453420 464253 474964
50092 474964 485819 497331 509673 522748 536506 550864 565472 579884 593968 607975 622350
50081 622350 637692 654744 674032 695480 718716 743794 771315 801806 835399 872358 913507
50070 913507 959659 1010609 1064898 1120321 1174444 1224883 1269793 1308546 1342001 1372055 1400852
50059 1400852 1430032 1460163 1490590 1519810 1545866 1566293 1578074 1578499 1566536 1543200 1510462 1469981
50047 1469981 1422967 1370740 1314885 1256944 1198356 1140584 1084896 1032007 982231 935945 893484
50036 893484 854561 818312 784215 752616 723992 697977 673590 650330 628595 608949 591306
50025 591306 575003 559423 544308 529601 515206 500972 486862 473152 460349 448745 438007
50014 438007 427435 416750 406464 397289 389348 382234 375662 369668 364168 358814 353567 349035 345809
50001 345809 343584 341346 338472 335284 332451 330203 328269 326237 323652 320070 315449 310460 306004 302319
49987 302319 298844 295070 291178 287653 284542 281436 278093 274762 271804 269256 266889 264564 262390 260574
49973 260574 259263 258514 258286 258409 258666 259016 259702 261061 263237 266162 269787 274200 279487 285701 293052 301912
49957 301912 312431 324406 337874 353720 373222 396936 424390 454988 488663 525287 563791
49946 563791 602390 639457 673764 704088 729359 749509 765769 779862 793109 806322 819953
49935 819953 833716 846168 855069 858236 853900 840576 817293 784394 743955 699136 653019 607873
49923 607873 565075 525296 488725 455379 425353 398750 375437 355006 337053 321368 307774
49912 307774 295924 285404 275993 267636 260184 253332 246877 240940 235853 231864 228929 226669 224512 222037
49898 222037 219270 216587 214300 212428 210878 209602 208434 207029 205176 203030 200891 198866 196997 195506
49884 195506 194562 193896 193034 191966 191270 191477 192591 194280 196229 198163 199800 201019 201906 202553 202968 203306
49868 203306 203916 204946 206090 206934 207421 207820 208359 209105 210058 211171 212308 213409 214610 216033 217514 218676
49852 218676 219225 219091 218363 217282 216209 215417 214887 214410 213818 213016 211888 210315 208333 206195 204285 202970
49836 202970 202419 202522 203030 203733 204397 204659 204345 203873 203900 204447 204849 204797 204879 205649 206702 207389 208079 209786 212537
49817 212537 215018 216101 216002 215562 215040 214147 212827 211305 209596 207562 205448 203811 202826 202060 201059 199843
49801 199843 198678 197699 197019 196946 197666 198730 199265 198856 197956 197246 196841 196352 195531 194473 193358 192474 192377 193361
49783 193361 194635 194742 193244 191460 190999 191965 193191 193783 193705 193127 192193 191428 191494 192214 192513 191675 190207 189159
49765 189159 189030 189540 190086 190198 189927 189919 190768 192237 193669 195103 197202 199852 201813 202371 202531 203793 206293
49748 206293 208976 211130 212806 213992 214394 214073 213525 213050 212664 212667 213582 215358 217232 218588 219556 220625 222104
49731 222104 224027 226131 227825 228577 228457 227957 227332 226563 225912 225832 226221 226379 225912 225156 224509 223966 223587 223727
49713 223727 224309 224410 223169 220792 218230 216154 214739 214082 214209 214828 215617 216629 217958 219155 219541 219072
49697 219072 218391 217984 217811 217796 218150 218956 219854 220483 221030 222027 223698 225632 226986 226976 225373 222749 220236
49680 220236 218892 219128 220537 222092 222691 221892 220246 218700 217583 216410 214786 213136 212168 211863 211449 210383
49664 210383 208903 207501 206300 205283 204819 205396 206920 208715 210302 211734 213055 213996 214476 214983 215899 216819
49648 216819 217123 217036 217401 218395 219226 219281 218905 218688 218609 218341 217898 217358 216367 214629 212677 211441 211046 210671 209705
49629 209705 208417 207340 206525 205700 204755 203744 202727 201917 201697 202177 202883 203231 203192 203191 203458 203786 204007 204396
49611 204396 205381 206932 208446 209346 209735 210310 211599 213428 215180 216430 217169 217649 218285 219636 222029 225106
49595 225106 228039 230284 231976 233583 235520 238132 241578 245501 249164 252262 255334 259031 263249 267336
49581 267336 270969 274401 278007 282034 286690 292000 297537 302758 307685 312791 318144 323147 327355 331088
49567 331088 334902 338816 342490 345881 349241 352596 355670 358321 360673 362851 364968 367345 370300 373575
49553 373575 376332 377995 378853 379655 380817 382206 383432 384082 383858 382832 381534 380522 379884 379453 379405 380252
49537 380252 382096 384194 385530 385704 385132 384572 384627 385562 387277 389447 391849 394593 397960 402065 406848 412231
49521 412231 418046 423834 429143 434176 439838 446783 454546 461973 468476 474551 480926 487489 493306 497492
49507 497492 499824 500503 499727 497698 494889 491942 489108 485940 481743 476335 470249 464141 458210 452314 446464
49492 446464 440867 435495 429955 423980 417859 412139 406991 402122 397253 392426 387786 383277 378715 373982
49478 373982 369036 363862 358599 353622 349259 345452 341834 338206 334742 331700 329128 326977 325329 324259
49464 324259 323500 322457 320669 318167 315390 312848 310885 309585 308746 308019 307256 306657 306506 306794 307276 307820
49448 307820 308513 309448 310623 312142 314290 317344 321506 327104 334447 343002 350859 355528 355587 351530 345134
49433 345134 338303 332421 328193 325553 323790 322173 320578 319428 319082 319441 320183 321200 322670 324717 327138
49418 327138 329543 331800 334196 337095 340494 344124 347928 352186 357128 362645 368540 374842 381716 389200
49404 389200 397195 405539 413933 421989 429601 437185 445252 453777 462115 469469 475308 479547 482586 485050
49390 485050 487168 488515 488635 487803 486725 485618 484095 482022 479889 478122 476562 474947 473433 472206 470949
49375 470949 469235 467267 465715 464883 464483 464178 463849 463310 462227 460555 458705 457037 455481 453866 452330
49360 452330 451166 450449 450135 450405 451549 453517 455921 458564 461662 465292 468841 471360 472518 472951 473642
49345 473642 475180 477749 481491 486480 492414 498765 505339 512380 519964 527605 534774 541611 548749 556447
49331 556447 564227 571497 578266 585101 592477 600370 608418 616305 623867 630930 637259 642855 648199 654002
49317 654002 660626 667787 674870 681360 686981 691689 695785 699889 704547 709777 715066 719716 723142 725103
49303 725103 725919 726386 727119 727995 728485 728521 728633 729188 729946 730633 731625 733614 736651 739973 742832 745256 747848
49286 747848 751066 754970 759531 764905 771265 778516 786398 794811 803798 813124 822185 830562 838518 846561
49272 846561 854534 861569 867120 871679 876103 880439 883841 885569 885669 884576 882571 879922 877278 875387
49258 875387 874306 873172 870881 866946 861720 856011 850647 846216 842932 840566 838577 836440 833977 831395
49244 831395 828954 826517 823477 819273 813985 808347 803166 798900 795654 793195 790762 787291 782292 776384
49230 776384 770549 764967 759108 752961 747532 743849 741925 741131 741164 742049 743391 744328 744455 744375 745106 747127
49214 747127 750146 753542 756811 759776 762678 766042 770169 774682 778785 782141 785373 789454 794600 800051
49200 800051 805003 809436 813811 818342 823066 828335 834524 841182 847203 852164 856883 862271 868265 874435
49186 874435 881057 888684 896968 904897 912181 919532 927388 935254 942627 949834 957409 965207 972773 980204
49172 980204 988003 996223 1004309 1011780 1018660 1025346 1032467 1040847 1051125 1063167 1076053 1088849 1101338
49159 1101338 1113972 1127164 1140720 1153957 1166429 1178495 1191045 1204663 1219264 1234500 1250195
49148 1250195 1266190 1282145 1297875 1313723 1330131 1346854 1362979 1377880 1391879 1405842 1420243
49137 1420243 1434813 1448977 1462464 1475433 1488106 1500413 1512094 1523024 1533227 1542576 1550734 1557581
49125 1557581 1563524 1569200 1575036 1581215 1587882 1594910 1601442 1606158 1608425 1609197 1610458 1613471 1617487 1620246
49111 1620246 1619859 1616321 1611315 1606722 1603340 1600706 1597782 1593871 1589326 1585531 1583980 1585169 1588496 1593167
49097 1593167 1598834 1605295 1612101 1618852 1625575 1632426 1639230 1645714 1651982 1658326 1664631 1670326 1674912 1678212
49083 1678212 1680232 1681208 1681736 1682409 1683196 1683540 1683035 1681640 1679185 1675229 1669594 1662699 1655100 1646998 1638374
49068 1638374 1629255 1619607 1609327 1598612 1587990 1577569 1566590 1554298 1541168 1528741 1518124 1509007
49056 1509007 1500232 1490960 1481119 1471109 1461424 1452469 1444428 1437274 1430981 1425612 1421106 1417075 1413064 1409039
49042 1409039 1405408 1402469 1400035 1397771 1395772 1394517 1394211 1394389 1394379 1394053 1393913 1394417 1395416 1396350 1396915 1397310 1397862
49025 1397862 1398527 1398956 1398957 1398738 1398721 1399300 1400796 1403333 1406484 1409315 1411209 1412691 1415021 1418844 1423538 1427987
49009 1427987 1431695 1434938 1438234 1442022 1446617 1451983 1457564 1462700 1467254 1471601 1476062 1480671 1485477 1490644
48995 1490644 1496077 1501254 1505703 1509563 1513482 1518003 1523159 1528559 1533706 1538182 1541727 1544344 1546465 1548904
48981 1548904 1552358 1556907 1562122 1567688 1573641 1579899 1585963 1591398 1596386 1601400 1606483 1611246 1615500 1619459
48967 1619459 1623294 1626913 1630260 1633495 1636757 1640035 1643327 1646591 1649418 1651112 1651299 1650322 1648999 1648162 1648409
48952 1648409 1649917 1652422 1655641 1659808 1665508 1672889 1681445 1690649 1700412 1710836 1722009 1734348 1748684
48939 1748684 1765574 1784866 1806293 1830227 1857301 1887496 1919981 1953779 1988291 2023405 2059484
48928 2059484 2097140 2136497 2176717 2216624 2255809 2294783 2334088 2373657 2412960 2451356 2488195
48917 2488195 2523090 2556363 2588974 2621727 2654616 2687020 2718356 2748460 2777502 2805731 2833280
48906 2833280 2860151 2886415 2912299 2937929 2963068 2987343 3010703 3033393 3055459 3076653 3096981
48895 3096981 3116988 3137138 3156996 3175349 3191244 3204746 3216594 3227224 3236294 3243179 3247773 3250653
48883 3250653 3252421 3253000 3251586 3247185 3239183 3227542 3212634 3194888 3174495 3151414 3125585 3097118
48871 3097118 3066332 3033753 2999991 2965390 2929820 2893060 2855340 2817151 2778512 2738960 2698528
48860 2698528 2658199 2618991 2581003 2543849 2507673 2473064 2440176 2408667 2378532 2350354 2324591
48849 2324591 2301118 2279612 2259930 2242008 2225838 2211690 2199863 2190090 2181703 2174554 2169288 2166418
48837 2166418 2165641 2166358 2168327 2171382 2174976 2178576 2182262 2186513 2191656 2197955 2205884 2215741 2227150 2239454
48823 2239454 2252501 2266542 2281567 2297340 2313961 2331762 2350561 2369661 2388728 2408146 2428356
48812 2428356 2449387 2471223 2494067 2517873 2542082 2566240 2590528 2615333 2640634 2666277 2692481
48801 2692481 2719498 2746903 2773873 2800242 2826780 2854125 2881856 2908873 2934527 2959085 2983055
48790 2983055 3006288 3027865 3046957 3063722 3079139 3093846 3107391 3118834 3127885 3135035 3140669 3144563
48778 3144563 3146416 3146384 3144793 3141670 3136984 3131137 3124717 3117737 3109559 3099625 3087993 3075068 3061156 3046420
48764 3046420 3031004 3014901 2997874 2979795 2960962 2941826 2922444 2902440 2881549 2860005 2838346
48753 2838346 2816987 2796074 2775607 2755650 2736444 2718349 2701588 2686078 2671651 2658396 2646607
48742 2646607 2636282 2626887 2617788 2608870 2600544 2593184 2586703 2580780 2575403 2571018 2567995 2565990 2564082 2561751
48728 2561751 2559570 2558622 2559205 2560529 2561817 2563215 2565229 2567634 2569577 2570756 2571875 2573772 2576585 2579971
48714 2579971 2583724 2587798 2592022 2596151 2599982 2603091 2604720 2604339 2602224 2599063 2595123 2590265 2584724 2579281
48700 2579281 2574534 2570418 2566638 2563197 2560263 2557874 2555962 2554380 2552676 2550225 2546848 2543067 2539502 2536348
48686 2536348 2533661 2531771 2530975 2531190 2532342 2534766 2538581 2542949 2546571 2548805 2549577 2548343 2544055 2536379 2526194
48671 2526194 2514560 2501887 2488520 2475376 2463323 2452298 2441575 2430543 2418674 2405178 2389502
48660 2389502 2372087 2354041 2336083 2318314 2300780 2283378 2265067 2243977 2218875 2190305 2160020
48649 2160020 2129544 2099419 2069469 2039376 2009123 1979134 1950026 1922157 1895512 1869999 1845568
48638 1845568 1821983 1798791 1775756 1753137 1731292 1710190 1689573 1669442 1650068 1631466 1613153
48627 1613153 1594647 1576149 1558569 1542805 1528967 1516349 1504137 1492033 1480176 1468700 1457628
48616 1457628 1447153 1437710 1429646 1422885 1416967 1411313 1405548 1399826 1394854 1391351 1389293 1387856 1386199 1384152
48602 1384152 1382042 1380070 1378073 1375775 1373040 1369957 1366922 1364598 1363529 1363657 1364320 1364798 1364883 1365031 1366048
48587 1366048 1368561 1372583 1377533 1382761 1388067 1393599 1399252 1404399 1408308 1410679 1411611 1411183 1409334 1406175
48573 1406175 1402126 1397591 1392651 1387324 1382017 1377410 1373746 1370404 1366404 1361416 1356156 1351711 1348437 1345601
48559 1345601 1342196 1338018 1333713 1329755 1325767 1321116 1315892 1310773 1305949 1300682 1294135 1286262 1277701 1269101
48545 1269101 1260769 1252689 1244650 1236512 1228566 1221351 1214954 1208824 1202535 1196391 1190909 1186047 1181394 1176824
48531 1176824 1172438 1168101 1163743 1159970 1157662 1156817 1156408 1155561 1154277 1152863 1151335 1149791 1148802 1148816 1149428 1149786
48515 1149786 1149588 1149291 1149391 1149862 1150321 1150460 1150234 1149815 1149462 1149396 1149691 1150204 1150572 1150477 1150049 1149792 1149862 1149638 1148474
48496 1148474 1146740 1145549 1145404 1145679 1145566 1144911 1143931 1142776 1141738 1141212 1140890 1139593 1136623 1132853 1129690 1127204
48480 1127204 1124200 1120041 1115497 1111572 1108309 1105104 1101593 1097784 1093809 1090080 1087394 1086278 1086189 1085761 1084023
48465 1084023 1081262 1078666 1077175 1076763 1076770 1076791 1076993 1077538 1078053 1078075 1077833 1078113 1079333 1081155 1083150 1085369 1087991
48448 1087991 1090797 1093421 1095946 1098838 1102309 1105993 1109280 1111811 1113690 1115428 1117578 1120253 1123058 1125701
48434 1125701 1128455 1131672 1134975 1137466 1138806 1139508 1140000 1139971 1139133 1138055 1137537 1137384 1136587 1134694 1132196 1129364
48418 1129364 1125457 1119636 1112138 1104027 1096002 1087987 1079648 1070841 1061575 1051942 1042069 1031894 1021134
48405 1021134 1009775 998406 987659 977439 967104 956379 945620 935175 924922 914603 904266
48394 904266 894228 884809 876202 868455 861499 855191 849197 842830 835477 827507 820326 814952 810802 806499
48380 806499 801585 796686 792220 787901 783626 779902 777082 774953 773436 772926 773460 774224 774385 773928 773186 772101
48364 772101 770508 768738 767354 766535 766129 765955 765611 764401 762004 759004 756301 754168 752287 750396 748417
48349 748417 746212 743745 741373 739517 738072 736538 734699 732915 731754 731467 731750 731956 731689 731166 730702 729999
48333 729999 728511 726499 724993 724461 724208 723404 722026 720399 718581 716715 715260 714171 712479 709439 705627
48318 705627 702241 699806 698234 697547 697626 697665 696806 695162 693512 692216 691151 690382 690078 689904 689265 688160 687248
48301 687248 687129 687895 689147 690109 690177 689745 689961 691265 692933 694584 697162 701480 706712 711543 716142 721743
$$ [...]
##END NTUPLES=NMR SPECTRUM
##END=
