##TITLE=NES1001_50250289_9225092_mVNcrKuYP1
##JCAMPDX= 6.0         $$ Bruker NMR JCAMP-DX V2.0
##DATA TYPE= NMR SPECTRUM
##DATA CLASS= NTUPLES
##ORIGIN= BRUKER
##OWNER= Administrator
$$ 1.72 TOPSPIN		Version 2.1
$$ 2015-07-02 03:27:19.102 -0700  Administrator@X
$$ Compression mode = diff/dup
##.OBSERVE FREQUENCY= 400.02188249412
##.OBSERVE NUCLEUS= ^1H
##.ACQUISITION MODE= SIMULTANEOUS (DQD)
##.ACQUISITION SCHEME= undefined
##.AVERAGES= 8
##.DIGITISER RES= 22
##SPECTROMETER/DATA SYSTEM= spect
##.PULSE SEQUENCE= zg30
##.SOLVENT NAME= COFFEE_meoh
##.SHIFT REFERENCE= INTERNAL, COFFEE_meoh, 1, 14.98509
##AUDIT TRAIL= $$ (NUMBER, WHEN, WHO, WHERE, PROCESS, VERSION, WHAT)
$$ ##TITLE= Audit trail, TOPSPIN		Version 2.1
$$ ##JCAMPDX= 5.01
$$ ##ORIGIN= Bruker BioSpin GmbH
$$ ##OWNER= Administrator
$$ $$ E:\/data/COFFEE/nmr/NES1001_50250289_9225092_mVNcrKuYP1/20/pdata/1/auditp.txt
$$ ##AUDIT TRAIL=  $$ (NUMBER, WHEN, WHO, WHERE, PROCESS, VERSION, WHAT)
(   1,<2015-07-02 03:27:11.867 -0700>,<Administrator>,<X>,<go>,<TOPSPIN 2.1>,
      <created by zg
	started at 2015-07-02 03:26:05.867 -0700,
	POWCHK enabled, PULCHK disabled,
       configuration hash MD5:
       21 0F 79 D6 B3 7B B4 F6 88 20 88 DB 03 48 BD 9F
       data hash MD5: 64K
       DE DB 68 57 E7 16 3D BB 7D 65 59 83 2C 56 6B 0C>)
(   2,<2015-07-02 03:27:14.992 -0700>,<Administrator>,<X>,<proc1d>,<TOPSPIN 2.1>,
      <Start of raw data processing
       efp LB = 0 FT_mod = 6 PKNL = 1 PHC0 = 0 PHC1 = 0 SI = 32K 
       data hash MD5: 32K
       1B 75 7C 26 A2 E9 FB C9 68 52 49 5C 49 2D 40 7D>)
(   3,<2015-07-02 03:27:15.289 -0700>,<Administrator>,<X>,<proc1d>,<TOPSPIN 2.1>,
      <pk PHC0 = 89.93958 PHC1 = 0 
       data hash MD5: 32K
       90 21 C5 29 44 DD 84 F6 DC 7A CF AB DE 8C 3B BD>)
(   4,<2015-07-02 03:27:15.383 -0700>,<Administrator>,<X>,<proc1d>,<TOPSPIN 2.1>,
      <abs ABSG = 1 
       data hash MD5: 32K
       C2 EC 7D 32 94 57 54 52 21 FB C3 C2 CF 14 13 58>)
(   5,<2015-07-02 03:27:15.445 -0700>,<Administrator>,<X>,<proc1d>,<TOPSPIN 2.1>,
      <abs ABSG = 2 
       data hash MD5: 32K
       7D 7A 90 AC 5B 3D 2B 71 0A 8D 6D B2 E1 E3 58 33>)
(   6,<2015-07-02 03:27:15.508 -0700>,<Administrator>,<X>,<proc1d>,<TOPSPIN 2.1>,
      <abs ABSG = 3 
       data hash MD5: 32K
       B3 73 9E 0D C3 C6 FD 8F FB C8 FB EF 21 FD 2C 50>)
(   7,<2015-07-02 03:27:15.570 -0700>,<Administrator>,<X>,<proc1d>,<TOPSPIN 2.1>,
      <abs ABSG = 4 
       data hash MD5: 32K
       F8 26 5F 29 54 57 2A EE BF E8 C3 00 76 A5 7F 98>)
(   8,<2015-07-02 03:27:15.633 -0700>,<Administrator>,<X>,<proc1d>,<TOPSPIN 2.1>,
      <abs ABSG = 5 
       data hash MD5: 32K
       B7 1E 94 09 90 B2 C8 25 47 C6 C4 36 EA ED AF B3>)
$$ ##END=
$$ 
$$ $$ hash MD5
$$ $$ 22 5C 79 0B C2 DB 8A D7 E7 CE AB 10 B0 3D 87 C7
##$RELAX= 
##$RELAX= 
##$RELAX= 
##$RELAX= 
##$RELAX= 
##$RELAX= 
##$RELAX= 
$$ Bruker specific parameters
$$ --------------------------
##$DU= <E:\>
##$EXPNO= 20
##$NAME= <NES1001_50250289_9225092_mVNcrKuYP1>
$$ [...]
150 150 150 150 150 150 150 150
##$TP07= 0
##$TPNAME0= <>
##$TPNAME1= <>
##$TPNAME2= <>
##$TPNAME3= <>
##$TPNAME4= <>
##$TPNAME5= <>
##$TPNAME6= <>
##$TPNAME7= <>
##$TPOAL= (0..7)
0.5 0.5 0.5 0.5 0.5 0.5 0.5 0.5
##$TPOFFS= (0..7)
0 0 0 0 0 0 0 0
##$TUNHIN= 0
##$TUNHOUT= 0
##$TUNXOUT= 0
##$USERA1= <user>
##$USERA2= <user>
##$USERA3= <user>
##$USERA4= <user>
##$USERA5= <user>
##$V9= 5
##$VALIST= <valist>
##$VCLIST= <CCCCCCCCCCCCCCC>
##$VD= 0
##$VDLIST= <DDDDDDDDDDDDDDD>
##$VPLIST= <PPPPPPPPPPPPPPP>
##$VTLIST= <TTTTTTTTTTTTTTT>
##$WBST= 2048
##$WBSW= 25
##$XGAIN= (0..3)
0 0 0 0
##$XL= 0
##$YL= 0
##$YMAX_a= 620227
##$YMIN_a= -521829
##$ZGOPTNS= <>
##$ZL1= 120
##$ZL2= 120
##$ZL3= 120
##$ZL4= 120
##$ABSF1= 14.98509
##$ABSF2= -5.573092
##$ABSG= 5
##$ABSL= 3
##$ALPHA= 0
##$AQORDER= 0
##$ASSFAC= 0
##$ASSFACI= 0
##$ASSFACX= 0
##$ASSWID= 0
##$AUNMP= <proc_prof1d_extract_pilot.lims>
##$AXLEFT= 0
##$AXNAME= <>
##$AXNUC= <1H>
##$AXRIGHT= 0
##$AXTYPE= 0
##$AXUNIT= <>
##$AZFE= 0.1
##$AZFW= 0.1
##$BCFW= 0
##$BC_mod= 0
##$BYTORDP= 0
##$COROFFS= 0
##$CY= 15
##$DATMOD= 1
##$DC= 0
##$DFILT= <>
##$DTYPP= 0
##$F1P= 0
##$F2P= 0
##$FCOR= 0.5
##$FTSIZE= 32768
##$FT_mod= 6
##$GAMMA= 0
##$GB= 0
##$INTBC= 1
##$INTSCL= 1
##$ISEN= 128
##$LB= 0
##$LEV0= 0
##$LPBIN= 0
##$MAXI= 10000
##$MC2= 0
##$MEAN= 0
##$ME_mod= 0
##$MI= 0
##$NCOEF= 0
##$NC_proc= -8
##$NLEV= 6
##$NOISF1= 0
##$NOISF2= 0
##$NSP= 0
##$NTH_PI= 0
##$NZP= 0
##$OFFSET= 14.98509
##$PC= 1
##$PHC0= 89.93958
##$PHC1= 0
##$PH_mod= 1
##$PKNL= yes
##$PPARMOD= 0
##$PPDIAG= 0
##$PPIPTYP= 0
##$PPMPNUM= 2147483647
##$PPRESOL= 1
##$PSCAL= 4
##$PSIGN= 0
##$PYNMP= <proc.py>
##$REVERSE= no
##$SF= 400.02
##$SI= 32768
##$SIGF1= 0
##$SIGF2= 0
##$SINO= 400
##$SIOLD= 32768
##$SPECTYP= <>
##$SREGLST= <1H.CDCl3>
##$SSB= 0
##$STSI= 32768
##$STSR= 0
##$SW_p= 8223.68421052631
##$SYMM= 0
##$S_DEV= 0
##$TDeff= 65536
##$TDoff= 0
##$TI= <>
##$TILT= no
##$TM1= 0
##$TM2= 0
##$TOPLEV= 0
##$USERP1= <user>
##$USERP2= <user>
##$USERP3= <user>
##$USERP4= <user>
##$USERP5= <user>
##$WDW= 1
##$XDIM= 32768
##$YMAX_p= 446444112
##$YMIN_p= -680427
##$CURPLOT= <Network HP LaserJet P1505>
##$CURPRIN= <$Network HP LaserJet P1505>
##$DFORMAT= <normdp>
##$LAYOUT= <+/1D_H.xwp>
##$LFORMAT= <normlp>
##$PFORMAT= <normpl>
##$SURQMSG= 1
$$ End of Bruker specific parameters
$$ ---------------------------------
##NTUPLES= NMR SPECTRUM
##VAR_NAME=  FREQUENCY,     SPECTRUM/REAL,   SPECTRUM/IMAG
##SYMBOL=    X,             R,               I
##VAR_TYPE=  INDEPENDENT,   DEPENDENT,       DEPENDENT
##VAR_FORM=  AFFN,          ASDF,            ASDF
##VAR_DIM=   32768,         32768,           32768
##UNITS=     HZ,            ARBITRARY UNITS, ARBITRARY UNITS
##FACTOR=    0.250966925370066, 1,           1
##FIRST=     8223.43324360094, -220071,      -157034
##LAST=      0,             -93582,          -225839
##MIN=       0,             -680427,         0
##MAX=       8223.43324360094, 446444112,    0
$$ Real data points
##PAGE= N=1
##DATA TABLE= (X++(R..R)), XYDATA
$$ [...]
23789 -178437 15746 -55163 -301140 -120670 -299698 287202 -73637 102453 30367 -200387
23778 -213846 -69602 77845 -104098 -18618 -62006 -258769 312845 -54036 24154 -1908 312009
23766 -64879 78132 214157 88033 -33683 -167436 290040 118825 1758 147781 -504615 17947
23754 -137918 -98336 -245523 123710 14272 75314 -39115 105568 -167085 1460 -17300 -191257
23743 -191257 101003 188801 250867 -107814 368096 10141 -191541 -147232 -9987 -146599 -151426
23732 -151426 -213861 146835 -39486 230420 -381447 117815 -12034 -20350 -120620 -380929
23722 -380929 -48811 -291666 123867 148655 -67735 -127007 -151636 65991 3775 -146279 71523
23710 -263334 5190 135403 -52217 -415255 -50197 -258195 160726 128706 -134784 36891 246279
23699 246279 -54370 49303 153764 184804 152478 138793 132327 -6890 -11745 -70792 -504757 -52016
23686 -68223 453383 263733 -255811 -165508 -241665 342831 -3741 -574 121222 174902 -221770
23674 -366439 -66004 -664803 98125 -154518 -185764 7469 2068 -24638 -257874 -63837 182065
23662 49519 -17098 -190528 -180280 -169320 -93246 -113504 -218058 25430 -156053 -133786 -105577
23651 -105577 -91261 -191645 83709 349146 129037 6677 173825 80500 89595 -66063 -42037
23640 -42037 129980 -66872 -33435 -214338 -19049 -1610 -12202 32716 166184 15671 55935
23629 55935 130012 138624 356653 -13035 -229274 234642 980 -113047 -54993 64923 -107856
23617 140069 -343836 -130202 62338 149128 -141939 -136624 33632 -20294 -205057 202458 -181656
23605 229697 139932 -117194 -177205 391276 130310 184282 -120635 263543 902 -277033 -167659
23594 -167659 66079 137008 18061 78298 -29311 -233743 92919 -425579 22138 -13645 -76405
23583 -76405 -4547 479086 41106 -135345 415897 -34014 190315 49680 -188639 99367 -161642
23571 286784 -65462 -52620 254286 -261747 -236389 -16580 -317800 -305998 150743 -127671
23560 707 375646 208774 -273014 107335 -246001 -348004 -380098 -340455 -50217 -84694 -74676
23549 -74676 -57643 45733 -143591 -90241 301760 -151778 -34470 462343 18235 -213996 -141135
23538 -141135 38982 194331 -334261 -166084 94169 -59596 124195 190638 -140345 111541
23527 13724 76648 97314 27985 -10887 -237247 120679 -13906 -90953 -132312 -160254 -166248
23516 -166248 -68296 56383 -129584 206211 -165190 -110827 -232098 239672 54359 -101614
23505 55751 -166826 26783 158103 89545 -133982 -174321 -183904 -451449 -265509 -121472 158146
23493 41758 48212 24172 -93850 83463 222935 -314911 -116492 -126800 53926 -256558 358204
23481 -223513 175225 525962 30864 103976 122998 135050 64060 -2114 -75004 -191890 129233
23469 2545 11437 339199 357502 188895 259504 -23861 388407 -99998 406458 6496 -150545
23457 -64615 371388 138797 -63276 270108 209329 164952 299261 -109347 -408205 -287705
23447 -287705 -150250 -148297 -356221 8604 444558 162181 -209865 -1076 217922 62325 -13060
23435 -73817 25566 47577 -46412 217655 24997 -353070 38272 -98618 207371 365195 -182115
23423 -286870 33937 -71479 6320 -250912 -34712 -103983 -172380 72785 -216044 -6783 -6404 -92166
23411 -92166 221514 -92586 -48202 51862 -237371 33251 -104700 101152 -162303 53637 171112
23400 171112 127320 -41457 447387 317352 -188348 -198172 -55668 216046 143299 112988 -360928
23388 102088 110141 150179 -357047 140265 53444 34866 210170 112412 -220295 -98165 90506
23376 -640 50198 117651 -88224 -298111 -54091 -130670 241641 -45552 50075 -98452 86050 -241610
23363 -26936 -153801 228470 -107743 -89418 -196409 -68729 -82979 231869 -146502 -146128 135169
23351 -117286 114657 37073 268226 -203227 64734 12885 168482 -132297 104598 -93961
23340 -48110 -59848 -280082 211470 126519 85966 -303436 149183 -246700 41557 -270448
23329 395552 235498 -156269 -410704 156991 -177080 30940 -96887 -40895 123576 125465
23319 125465 216242 17809 -99000 146752 -104584 13255 202464 210964 97156 68352 -102397
23307 50204 -171925 -140607 -112466 -144584 -6039 63772 179207 -159740 -178398 211620 -237927
23295 -157511 -23256 -12032 -105906 45454 -13227 115839 -116525 133519 5430 131559 -94319
23283 -216519 -302975 224322 -129099 337051 -6587 -22184 69976 -315115 217914 158408 -33248
23271 3060 -299538 -103372 131584 -63031 -126287 -312393 194499 -47105 -44032 -168172 -63818
23259 103170 -78411 -15583 -90984 -13330 -2574 -84802 -110676 -208946 218814 -132333 -167911
23248 -167911 -261891 -209737 1214 35712 123347 276043 -58981 -24277 -54420 -75330 236413
23236 -87692 -38675 -140116 58759 -169995 -205799 -363028 11667 189641 97906 132394 -29554
23224 -243335 49370 88593 -173968 48039 -28874 -163813 65367 142756 -159596 38268 21276
23213 21276 131911 -120893 -38613 42421 -236046 -137991 -213623 107189 14670 -281131 -162858
23202 -162858 242313 -159479 -280440 -107407 103389 -228699 -364227 1822 -84736 -191949
23192 -191949 -63852 266876 -252991 -81830 426980 33441 -322104 51734 -5433 451463 765
23180 231402 -148336 -380413 -157300 -487250 38818 43115 -64652 -61092 -47357 -244122 -22734
23168 95687 274833 -161773 -61908 -34961 -180393 65577 85487 -267944 -157854 -154872 -93152
23157 -93152 178503 23224 95889 53148 -123352 64546 -299232 145268 161622 -242833 28335
23145 -55442 -74225 -130132 254055 -219989 -228807 129101 4806 177521 5822 128610 219730
23134 219730 23121 -22492 -7169 427254 188625 -17746 -312518 -1347 8408 369164 21035
23122 213929 182406 -211119 -217222 13097 -303421 -41612 -57815 144406 -138674 -156715 7284
23110 -2721 -126826 7744 22646 115471 -304535 -83240 -48967 -74996 65575 -38228 42139 -76016
23097 -17277 266426 -264143 -55840 204437 -193133 -68106 -89386 -115515 317502 9144 28597
23086 28597 -146174 52276 11025 -89103 -98014 61906 -6049 -105223 -172435 256433 26941 -229706
23073 134685 131463 148923 -2862 -198759 45613 -243716 -99732 -63693 114245 -26956 -155742
23062 -155742 -30481 -368699 -38562 173315 -119739 -212820 -106068 51496 -63028 -261796
23052 -261796 -91081 109992 -293642 32893 298701 -42405 -194244 203704 -229351 -202650
23042 -202650 -26177 80133 -130764 21312 130938 -38779 79666 292291 179188 -61713 -287202
23031 -287202 -42430 -238242 32317 98163 -91097 111926 -186202 308772 -60999 -182425
23021 -182425 -61141 80800 12255 -41924 -35582 108509 -173987 143317 -6773 211283 -233203
23009 -51380 -94496 -33337 -69756 -154860 -288213 -284173 11574 -135632 -277911 51090 158140
22998 158140 -4160 -208611 -160174 -93987 239608 -135298 113171 97547 -61841 -33115 106782
22986 -225369 6548 155296 40617 173230 -151462 -55141 -135645 -258503 -166057 -60916 -40401
22975 -40401 -297516 -108150 164577 -488760 -36 -280179 64729 182657 295866 102354 234186
22964 234186 -83050 -95976 139041 -62703 -107138 -63184 -218257 96132 209318 -160164 -205547
22953 -205547 344987 193599 121630 -124550 3113 193270 174409 58744 314245 -251493
22942 -193049 53949 -301020 -301023 97939 -69299 190827 -155374 16609 -74208 -61575 85453 -7281
22929 49403 -96795 -34119 -220846 102895 128764 42071 22584 123797 72411 -115155 141306
22917 44164 5870 131993 -37824 88390 111725 -366699 -198698 -378352 -42378 -131081 -41144
22905 267326 -15711 -212743 -131777 -35294 -9143 -314067 65351 192454 -120620 70506 115576
22894 115576 258534 -198177 -117979 222696 -459009 -217822 186404 -44500 142962 -232882
22883 124511 174073 -181447 -202806 -23970 -52451 124718 -148482 -98236 -72494 196161 175764
22872 175764 -376298 15370 163033 133550 -236754 224126 101054 -231467 -80556 -176741
22862 -176741 17687 180118 101073 196662 190801 -103711 -91613 -75479 20663 -309454 -153188
22850 -48058 -32344 -291732 -203657 11835 -178204 -66952 -229200 -215083 75462 15442 44808
22839 44808 52236 -205444 -232659 86612 -187169 -170894 -330263 -284938 135569 358811 -266441
22827 -216552 9070 141754 76189 232221 -413369 16250 -73364 1912 160319 -231553 -33662
22815 274617 44379 -47951 87925 -66703 264943 -24263 330471 157190 -145101 -169318 -198445
22804 -198445 89253 -227928 -128680 -127195 -284273 -246017 106733 -50024 153535 188586 244042
22793 244042 -124244 -262473 -152911 28493 74560 -189773 -149720 -243258 108070 104483 -236374
22781 -12385 126655 -56336 -330769 -81327 -15056 378539 2920 42627 -447016 -71812 -59076
22770 -59076 125404 23686 -127049 -75867 215137 13597 -209977 26598 162167 -91029 -35597
22758 -154306 212768 -123310 71535 -165894 -63473 59176 -46804 53068 103281 70595 -300242
22746 -27076 29387 237446 -94317 -396229 222445 -157840 -198702 157623 159955 257314 -5155
22734 -62408 -247733 -168581 -62851 -18550 -233571 28973 -266425 89606 -93847 -183802 -151042
22723 -151042 -126220 -305939 -60322 105656 74082 60864 55831 -34464 169004 -119042 -153415
22712 -153415 151231 45001 -248300 61561 4575 294520 -116755 326666 60661 43174 -258601
22700 -11048 49833 -117194 137309 -47293 80296 -244483 230502 33778 -170403 63992 -125719
22688 156539 145737 -245192 -131857 278295 -189282 -375110 114185 -221365 -140447 -17571
22677 71441 -61283 -34900 -229755 342599 -62649 -236900 110808 -56572 283639 -42312 -177854
22666 -177854 116388 -118726 31452 -30557 -122365 250968 -166970 4016 -14896 75143 -117174
22654 -163032 11030 117590 183029 183685 42567 199644 -184617 281201 -9929 -353474 -10738
22642 -236828 186081 86665 -94769 11786 -113959 -184391 85616 145516 91123 51157 -145020
22630 -328743 86109 -179770 -176837 -105806 6432 70885 59530 -257051 125257 -263313 112154
22618 -82494 -482499 -321158 -55101 230929 -91036 175750 74140 151186 35973 -12363 155353
22606 -249983 52638 255011 -36473 86222 332376 39111 -256569 1619 -341507 -126170 320836
22594 149558 -17412 -60956 -169817 127087 141983 -166023 -103217 7662 39583 -57775 18021
22582 80437 -253404 -249642 149193 -201963 339403 185047 221499 631423 -110150 115489
22571 46666 113190 -247387 -186857 -371295 54396 216245 129640 -19742 8885 -82400 42920
22559 94836 148163 187986 -129024 87624 -316641 -257069 -219990 -100331 -125843 -318907 50818
22547 28739 158633 112386 129169 -61617 -29532 -5119 165956 55856 -29624 -141125 30787
22535 59469 -46139 29867 -143173 -223211 -183571 -79165 69658 -210787 -59335 -149018 128414
22523 75969 -122639 -109137 -322531 67325 138918 8426 79271 -146803 -155294 254086 -48742
22511 -172098 -101200 100031 -42278 -56382 -201812 39297 -250548 -308672 -67425 -101387 -133428
22500 -133428 56996 89844 -103659 12950 6652 132405 -138902 287478 -66426 9210 -308796
22488 -134902 -21491 -212198 -129687 192445 56358 175924 36804 28581 -301556 135591 -165556
22476 68218 252468 185583 128133 39545 153875 -243836 -44519 -289160 55414 -44828 38296
22464 87808 187461 164956 -233135 -45946 -25456 521 237597 -87479 96358 -61307 147155
22452 20595 -135129 -357653 -65086 28637 -203418 85089 -89219 118277 -127753 -334885
22442 -334885 145710 -141470 109358 -106686 -224634 428557 -333873 93947 -241118 109630
22431 -48534 -192939 -114136 -35979 21858 -6061 -117057 75515 -137039 -267813 43953 -11575
22419 23288 -146988 12287 -108436 271243 -46995 223871 133147 222305 -25234 -4992 51851
22407 43882 155768 179899 -102995 -119667 -64937 8331 -315433 -394149 220812 85426 -69487
22395 -11764 87356 118384 -278861 9026 -140289 -244615 -182063 -310970 -71613 -8662 132442
22383 -270838 -74421 -41457 14111 -86574 -6759 130747 181854 -38608 57444 7586 277908
22372 277908 -235565 59809 7870 188026 -152935 -234011 17269 56705 -199251 -14476 67915
22360 -60649 -182121 -10935 57329 -247568 -297359 -127782 122957 -13359 42202 -227654 -171788
22349 -171788 -254188 152524 -368981 85315 -82789 -105895 -4901 72453 -145410 81715 -416805
22337 -297347 -66387 -23709 -208091 -171320 154265 -259945 -132121 28720 87167 -62752 84049
22325 383741 161765 -182527 338418 101361 -99657 -27083 70704 449720 -216028 -81989
22314 -15388 -45668 166514 135234 -209446 -51549 -283004 52498 -142610 -475466 -48717 53829
22302 -337779 574 -319897 185473 287550 -252904 -9530 98755 -390066 68445 -91463 77139
22290 107118 3277 -23861 -386958 71384 -85971 -2355 -74809 -21971 -4300 -377671 -81765 4850
22277 105634 -355918 -251703 189126 -87961 -118707 -77487 -59563 -35857 73699 94118 -142135
22265 147104 161251 24948 113660 -140878 -81947 164182 100361 -14888 79630 -13885 -73946
22254 -73946 42488 100133 -89774 105486 89099 -66323 148816 -66487 92461 -74698 -189399
22243 -189399 102582 -27235 30700 -119164 -198355 168071 -191638 -105211 52821 346687
22233 346687 -207163 -21009 -31540 77111 119657 109076 -142211 54339 -109390 215464 -301060
22221 21080 22007 125624 8452 -43491 -260775 -465320 -91108 -188412 114083 71823 287326
22210 287326 66855 -29280 -40574 -96519 -45488 -70130 -309290 187719 -319050 -240862 -327894
22199 -327894 218724 150286 264278 -82895 81472 -125453 70196 -140623 115030 167806
22189 167806 -236586 -186146 -26887 205147 -211661 164679 180851 245003 -342366 -18868
22178 -178404 16549 97797 -251635 -5864 -164864 -228178 -74085 -127567 -203537 77677 -429639
22166 -200005 -290866 -31809 -152148 -343419 -37983 -66501 -131205 -287167 248043 -84728 263675
22154 107263 138909 -342789 -113316 -25305 29034 -95034 -176731 -110803 70987 415649 39342
22142 107416 -7867 -54153 175292 -295129 55712 42330 35412 52586 70132 -318920 -89225
22130 160442 399 196940 -62103 177904 285164 -74788 -11265 -36888 -52644 -64338 -6964
22118 176826 25168 17993 286208 87084 -261603 -207075 16197 -20333 -291191 -27508 -188666
22107 -188666 302666 -292693 66719 176886 -60789 -69873 -162711 -44744 404173 45889 -46004
22095 -232652 -86951 270510 -234053 -363442 107662 50030 -36410 5814 114663 -211317
22084 -4926 -255136 29605 -169080 8696 -84513 102548 203213 12492 -229750 30080 -186470
22072 -121353 125542 169810 70038 -218563 75208 46239 -64347 -75752 190136 40022 17579
22060 170581 154461 -101005 -208874 178385 -12949 53076 -147265 85577 -65575 -41376 78992
22048 -104890 -135888 -203738 2103 -63382 -143587 231385 -121149 -123441 -257163 -145709 -342952
22037 -342952 -116490 -258769 58499 324083 175651 -95084 -81567 -200074 -370240 44704
22026 -54355 -257712 58868 -375453 122326 87340 -12678 49401 -65032 -101139 -68516 182941
22014 49570 13598 91369 255562 -107411 -214717 -210638 -18305 -41088 -89826 -191090 130584
22002 -238886 -46012 173853 -285170 -167237 306178 -287027 -40297 40727 -183035 -11924
21991 -183981 -37264 -60830 -9078 353077 144711 -55588 418167 103063 -33934 -290487 -198633
21980 -198633 -98144 -88562 -89794 -177919 -282165 64149 4645 -73746 111718 -130462 124031
21968 -7434 -46629 -49947 -140362 162859 108897 -206341 207924 35198 153208 303871 -128007
21956 -141611 385417 136871 -81329 -262988 -174241 -216715 64539 93395 -84234 290212 26065
21944 -67706 -199498 -182381 -67029 315459 -37314 -203491 -96839 -642867 -234055 -331220 -146704
21932 109797 -88148 159872 219930 150169 -16737 -208395 -10036 -14168 -93101 98471 7279
21920 34770 -207139 289838 -557061 -128182 194181 -220752 13754 -88981 -204182 -117937
21910 -117937 52498 -160407 74860 215089 213463 152533 151047 -38427 -80591 43702 -254844
21898 -219199 -363008 -104537 -36012 224216 -18587 37715 -109998 -325474 7738 10470 -139490
21886 55459 -179358 206982 -54421 -324282 -85857 -180144 32457 251344 -96702 -99340 -25113
21874 -157370 167720 176067 -282587 -72274 117953 -441498 -210169 5553 357394 186593
21864 186593 -110677 128429 -70190 31689 -233642 58232 -6148 69365 -250235 -123185 220925
21852 116453 -424046 -92220 136635 -75784 159826 278627 -26964 -24225 9852 -234986 331518
21840 298651 130638 53229 -41038 -28543 149118 -281426 -22296 83987 -4860 92550 -27872
21828 -82148 -55151 -87375 -314869 -21953 -32345 51243 177541 214856 -152464 185931 75003
21816 -175830 -106441 77360 -18293 -373498 -106754 -204890 -121188 -11459 -419465 178760 84282
21804 -112821 -112646 -50198 -37015 -127821 85298 16230 -360011 129651 74186 77643 178656
21793 178656 -12947 -74349 216891 -40006 51835 -109967 -10239 -40100 59256 -167889 204612
21781 -202511 -137327 3624 -51669 -51439 -109408 106704 123109 66723 -252426 -124310 371507
21769 -93427 42063 16711 -160308 174016 65698 -296318 233791 -77879 28348 72896 -46179
21757 192275 -73019 -213345 85829 -336754 -170981 -126524 -165272 -107393 61967 55103 -438594
21745 -176982 37447 102097 -171598 25865 -213794 75706 -219478 -15660 -157103 -118458 -48417
21733 -108196 35615 -65906 29101 60250 -130110 55373 -190820 7550 148690 199463 -8832
21721 28833 -32315 -272209 -193195 76255 -53574 -107902 11015 -136358 -27160 144821 116351
21710 116351 -80335 -104354 -67818 96289 -217084 -27629 -213547 -99378 -44472 -33666 7347
21698 -232404 -220610 -35557 -3564 -137863 -270611 158399 -199946 216325 -26423 124477
21687 74270 11106 -138854 -289956 138230 152536 -172008 -96574 212183 -374844 222382
21676 193485 36308 177935 131612 -139610 -486709 -269284 -39450 -75353 -11631 -44928 -272429
21665 -272429 59918 -63980 -56607 205174 346095 39187 -34408 212078 61251 -249224 53257
21653 38421 55103 -14160 -24333 180130 61464 -17687 195659 -228222 78420 -154545 -223594
21642 -223594 -30862 19261 17939 -251499 -126920 176319 -251075 -6711 -210653 269937 -149125
21630 -47885 -321100 -95067 -10597 -245682 179525 -154343 -152943 5107 -98957 -269311 438304
21618 -105883 -264220 26292 -83040 43511 -127742 -153124 172711 -106037 337740 -96512
21607 -51234 -215287 -101080 -81317 -166272 -43938 -54906 -127608 -414941 -181795 -37684 -194557
21596 -194557 -330465 236848 -240195 -198230 70229 -405317 -203105 182643 48209 -67700
21585 17192 293412 -113882 227287 -374922 -84399 -181119 -260017 -200983 -233414 -165722 -42136
21573 -77306 20856 -138167 -1886 20939 -64989 271560 -180779 -349320 60458 -243415 -36463
21561 -73160 64237 -173338 379913 -50357 302332 222884 -495 -83334 936 -107988 -141721 -387930
21549 -387930 139149 -209026 -186557 -240458 -167244 239801 -158163 69738 86827 97251 -72005
21537 263803 65949 -61780 15819 -51237 230101 -23342 -178782 -33713 226476 -386467 -185206
21525 10079 -167872 57165 384180 -160144 -40837 31528 -11216 31470 157405 -66625 82301
21513 91020 113445 12725 -56583 100848 5459 50913 -73249 27059 -99200 -108122 67822 -222332
21500 -149172 -342156 177345 -129118 -11417 90058 -149786 176648 -377511 -170122 -207015
21490 -207015 -192701 -27699 -123288 -33828 50047 195679 15939 -242501 3592 213470 -14240
21478 -117112 -203014 -77768 100921 74919 -45059 -198259 -167742 -16054 22377 111828 -68998
21466 290743 -39441 122820 -25990 135279 -26177 -28448 -16964 38511 -131460 22002 -88536
21454 -177658 -204976 227816 70889 -156244 174539 -113308 31374 -94229 68655 -219212
21443 -138418 69456 180314 -69555 -178166 586 -381845 16022 -407776 -100142 -238782 185702
21431 -326583 295471 -181940 17420 -321717 36539 -74954 99354 217307 -398827 37531
21420 -114271 -112049 -13879 -216247 -84000 -38742 -195473 -106499 -273170 -66588 330247 -15093
21408 52242 319106 -60259 18786 -289535 157568 -50444 192409 268462 6740 -497948 66935
21396 -301050 101926 -269887 -91542 191239 -262185 203845 191482 -58584 23786 209734
21386 209734 -8240 -254453 -184155 -2290 -180244 -3027 250658 16150 -162581 -136398 -16544
21374 39293 -312606 85924 -151183 -196515 244441 -83681 -39621 266902 93871 131462 -18466
21362 -41051 24809 173029 -170626 11252 -275174 59808 -39550 118213 -300834 151058
21351 188132 18569 -169754 -287577 121191 -465919 171834 7212 -198519 -199070 -194434 -121972
21340 -121972 -103462 65087 404688 -84554 -203989 -12082 110729 -68799 315187 -495432
21329 228979 -350406 -6021 -361204 -149023 81333 -106927 266994 -497467 -119794 -20816
21318 8462 11973 191064 53210 204412 115251 -3975 33505 -316587 229734 -305863 304393
21306 -23977 -265118 234947 -189554 -142045 -19101 -90648 -271460 -4324 -279687 -132448 190399
21294 -285489 -151106 5539 -275361 36259 -37473 -159949 -240817 -160294 264852 -190750 -164266
21283 -164266 29027 -271103 -32595 -180428 -266384 -29566 12321 -182513 -48743 -150395 -7507
21271 -253760 101624 137371 -107822 -174508 175535 44257 -17974 204749 35332 168774
21261 168774 15235 -91780 -307706 71437 88582 44243 1376 -360576 77377 -301274 318589
21249 -114177 -25305 -103165 -232061 -72792 -182468 115887 -7040 80585 -496949 -292709 -312431
21238 -312431 197044 -58053 -118658 -119973 62995 249730 -259346 101038 -32054 -128660 -177836
21227 -177836 -80325 -107693 -80459 -342397 58500 -246974 99964 -7297 86278 18900 -206821
21215 40566 -322673 30953 -102793 -260735 -139459 -35784 -193907 89767 -217190 -254632
21205 -254632 -337375 70967 -3417 -37526 -188475 -319034 -63386 -78152 39625 -192078 -400454
21194 -400454 241795 -45494 -226152 50302 -361554 -15970 14460 -29298 -17568 368164 -184522
21182 -231633 243767 -112398 -264098 28341 102926 28521 17376 193859 37194 -222365
21171 103746 -30359 -115868 -83843 -80191 341521 65593 -183235 -142070 -118163 100454 -37623
21159 -22762 153225 -182696 81695 -72134 48545 295946 112495 -66705 302546 140083
21148 -111825 -282855 -51526 -1213 343787 222215 -77676 9579 -221401 22545 109620 -163871
21136 -90504 -131975 272895 -120701 11943 184454 -167548 51955 -339213 354007 -147409
21125 -64912 -102651 -235957 -119870 -85351 229192 75713 -251064 -253845 115665 -14116 -125156
21114 -125156 -98350 -206107 220266 221577 -171471 442943 -10324 52130 156060 63413 122955
21103 122955 49399 76142 -342349 -4855 119328 -72515 -216597 2761 -238077 61265 -279393
21091 14944 96289 53736 -2071 12537 24997 -6515 -206607 117843 -118637 -238547 -164419
21080 -164419 24619 -57487 284234 18787 -86622 -198969 -298513 -104844 -93951 71726 -21407
21068 118562 -89384 -48169 -208021 -221703 -31334 -122279 11050 -165918 -309798 -298064 17962
21056 75863 -218503 -303513 55701 -116088 14657 -104842 156575 -361168 23936 -92260 173861
21044 -147352 73883 -73782 321477 86033 338249 129346 -59284 43820 -149358 -308478
21034 -308478 -44336 -94677 -64517 230502 -36113 110934 -103833 -101906 -225128 206449 -79152
21022 -240126 -176477 -68546 -189085 78405 -232590 9122 -405932 -78424 -11480 136516 -130555
21010 -59778 -129777 -12159 -127843 -89670 203327 -20461 -293864 -177812 -118674 288481 -194848
20998 76484 216940 129424 319695 1925 -181926 153675 311762 -175177 43895 263213
20988 263213 -196302 -100358 -15092 -59336 -258824 -263080 -130022 -70731 -78308 14001 108412
20977 108412 -135841 8992 262068 102701 -327253 67593 11199 62990 -353066 -61626 -74429
20966 -74429 64074 -2157 -147548 -364667 570093 -38725 182662 -171660 -46989 -16368 -134152
20955 -134152 -32949 -65809 35541 -56383 -104492 -493743 45521 92160 209209 190820 169619
20944 169619 12234 262927 -212595 -135890 -296244 -117124 -102530 34727 -173172 -126443
20934 -126443 29450 -152010 -29888 170213 -125113 -264131 -172671 167139 -50062 -346036
20924 -346036 -204617 92929 -219745 71094 67529 403716 5200 50191 233732 125750 -223720
20912 -38341 -21482 -289360 -42891 -537580 87824 105272 -84006 -273417 125573 -208233 3685
20900 -95383 174878 -277958 -290655 -154102 -161755 34768 115229 326443 -363027 60363 -272948
20888 165672 -467279 109669 -204425 3075 315219 -314373 -16000 81675 100250 -139753
20877 214399 -58094 -146761 -102695 -205270 109960 -107243 306984 -230014 -43257 -168359
20867 -168359 67981 -46054 -27998 228037 -207322 -152489 -168335 -96253 207381 -104114 -60394
20856 -60394 91444 -39815 67431 -215042 -45502 -81610 -140519 124153 -60335 72135 -128275
20844 54615 9318 284118 -262544 -80557 547305 -182234 -331637 -25098 248557 523906
20834 523906 8001 -85038 108032 82995 -216068 -220289 -81817 -96210 -44293 32126 -65262
20822 -260782 -194393 -385178 176931 -414298 -192314 38280 -38711 -5467 -251347 38392 -144620
20810 98790 -84466 -321658 3534 -273174 -155117 -189847 83528 35347 239606 -54537 339297
20798 5321 -13753 -112427 264967 25402 131819 -233842 -214444 104211 -48375 -471941 -25632
20786 -158280 -112649 -36592 -141414 -50873 101983 45693 -160405 -283157 -406238 -41253
20775 20373 18399 159580 51781 -94742 261239 -63156 6642 254598 -108560 -90037 -465683
20764 -465683 108168 79250 93792 -160712 -144311 -85250 270449 -299346 29655 -233962
20753 62928 12749 -44763 -4000 -39181 51461 -222814 -124259 -57076 65423 -48580 -158182
20742 -158182 -234448 -35285 -204636 9262 -35768 -145407 -389456 -37090 -132068 69198 124135
20731 124135 -184751 -43335 134970 36894 -22919 445177 118721 -6630 -12892 -74614 -168455
20720 -168455 8378 243465 157725 122360 -213373 -183017 13626 8546 279637 -178302 109842
20708 -188379 266532 -238761 -109673 -178450 181756 -310477 -42969 -409706 42421 -140158
20697 -72479 -249276 -183594 20806 -90977 -313061 -252266 -192620 -244449 -250813 152992 -501781
20685 143743 46605 -309936 79930 234959 125186 -225298 -82370 -25319 80422 -348044
20674 -197738 -222617 -103790 -429859 -24213 62169 -182650 -50705 25787 -141989 22984 -258931
20662 -129783 118520 128608 -329152 81105 -69318 -473503 -256890 -249108 -116436 250103
20651 52734 -66014 39273 -292358 51430 -35050 -260964 49297 81601 84205 25387 -164251
20639 78901 -306843 21840 139860 -99591 11878 281103 -97399 201883 249807 -99205 178811
20627 -320760 -142425 -59294 -390618 -209890 -68218 48440 -25040 -295887 -211741 87383 35508
20615 -124582 91662 -200730 -12684 192001 -313467 -207207 50245 -250378 -69335 48148
20604 -39002 -331045 -145906 -284956 15014 -247489 -91912 -95360 130928 27328 -168808 -332596
20593 -332596 317100 9205 205363 204560 168170 -84244 -25829 -119645 26012 5586 111561 -130181
20580 49942 -141293 123195 48765 -95268 -116094 -157363 153766 -7067 -38484 -18582 113307
20568 -185764 126656 87525 -697 -104783 -110588 156555 50449 32951 242230 -47032 202540
20556 -127483 -103850 26298 -190818 -169058 -103292 -12553 -418430 -43142 -241009 -77112 -352685
20545 -352685 1793 15514 -97034 -125300 -100806 -67513 139286 -314428 -169122 -160135 -273375
20534 -273375 -265259 -75838 -169918 -22685 74611 -93919 295236 -216330 -81591 -197998 -22554
20522 -212279 62547 13970 -205628 124059 -116133 -133559 -224525 -103436 73145 113199 -36370
20510 -431362 78019 -135857 314411 131829 -24178 -261224 -196440 -24354 -125332 28719
20499 -220757 -45474 -194722 87775 32044 -49134 389734 -357901 187980 110798 407213
20489 407213 -258860 72779 -121660 -72090 136121 -391433 -300367 -192269 118160 -198819
20478 -81149 214 150607 71869 -100349 -76572 -81911 -166818 -284074 51202 -282888 190685
20466 -124934 -231715 -410154 150045 276137 121751 -389910 23399 133403 -168764 6489
20455 -387023 243224 -239461 -392733 -122365 -302526 -127060 91143 -259853 104957 198922
20445 198922 -51467 -75205 -194484 -269679 -70569 -230334 -89866 -104332 -146111 -240719 -135356
20434 -135356 26633 71967 -124216 -7204 -219724 -73976 -192761 286032 -50691 -324378 97478
20422 -64128 -164918 -34665 7432 -183789 -244653 19341 -38392 -96767 106105 -33117 -363123
20411 -363123 184816 -360969 -5678 -68007 298004 14046 -252160 -83238 898 -146846 -155193
20400 -155193 -159131 -259066 230268 -210886 -214710 -46064 -212201 212576 -168555 -174932 -239092
20389 -239092 55834 -350333 -219751 160822 875 59122 -262410 -45402 -24550 -36354 -23269
20378 -23269 82630 202712 11918 -263495 -68471 -396373 25033 46375 -84968 88084 -110309
20366 -230348 -67761 221732 -257324 27282 55053 -42418 20891 -254342 -115376 171038
20355 -286632 130920 -191992 -286171 -263077 359118 132957 125608 -72094 -42671 -62039 -90305
20344 -90305 174678 -411224 -162447 -5352 -168947 -8684 -230027 243782 -7033 56556 -199412
20332 61835 -251121 54783 -13071 -142977 162005 -222519 -181158 -149700 -266123 -352697 37604
20320 -20050 -214986 -95436 254568 60440 -155748 147562 -72860 16956 26741 159219 78314
20308 110258 -249026 -288820 -148203 267920 -193982 -58831 -146316 190339 -56677 -281120
20298 -281120 -344074 -5817 -106333 234423 -482232 -126506 40279 -198379 199211 10929
20287 45959 -9121 123407 5824 -80020 125279 106484 -7366 235003 60113 68201 -114077 -238697
20275 -238697 -99515 137332 -105635 -24905 -5134 116380 -180639 -387627 -124605 168588
20264 -272014 90757 -235288 -235110 -140738 -180615 -194323 -333172 -241582 52507 311601 54498
20252 -177474 155627 -137898 -140325 -159364 -168763 -514785 -382642 219976 -225169 -95566 -46812
20240 77647 215019 -4340 68902 -188503 -181289 14837 -338370 -252633 266921 -250209 -96572
20228 -134793 -85500 139638 -350112 40813 165816 -129149 -61504 -160329 -349722 -98829
20217 250043 -288733 -120747 43475 -206104 -145378 -86520 -216199 342161 -116947 -156381
20207 -156381 -138547 -15184 -289562 25790 -482883 -272490 -227444 -54021 64522 -117837 17156
20195 -5254 -235839 5096 359837 -128868 -182059 -40236 -439060 51843 10133 -5172 -46970
20184 -46970 268004 -249896 -362366 -191407 101852 -258165 17645 -433083 299089 -320409
20173 -76980 -127232 -83016 -127460 105930 18941 130165 -7643 132425 -119265 -156766 90312
20161 -168742 -60597 114066 -80839 120967 -42722 137835 -69063 62534 169482 -225667
20150 105927 273148 140692 -264818 -2129 -155919 -340030 -102490 -53445 -76872 162668
20139 -51498 -73638 181779 -129536 -228861 63395 126680 -126948 10856 -172408 -66885 -171033
20128 -171033 -83757 -307437 -3986 6310 -296928 -318779 79942 -316519 141870 -91062 -24273
20116 -65104 113729 131504 119226 -48906 233497 75382 -126064 -160426 -162834 -22819 34768
20104 -75514 -92479 -138898 -404097 -13730 -55549 288198 -16559 -129290 96123 30455 -193435
20092 -392466 -630 -49249 106694 -140365 13271 -750 57628 -80378 -282676 -303589 -10439 -59414
20080 -59414 -465661 208227 -57901 91094 -1423 -79532 -69803 164897 143398 -331946 113947
20068 -231536 -255386 13573 89111 232969 -146004 132924 -204382 80240 -163094 -258793
20058 -258793 64628 -14798 -103742 -162821 184130 -72364 -138370 -68336 219332 148579 -167506
20046 -178796 -296962 94045 -178234 79931 142806 -185441 -86076 16260 139667 -14284 -434233
20035 -434233 8115 -352957 66131 13671 -59188 -365252 -169307 22930 -209058 245166 -307102
20023 224939 -29867 -6602 -288315 -129038 -234107 -194855 -196083 -187180 258255 -138516 -66967
20011 80407 126741 -41763 229068 84546 259410 -13784 -120747 -52133 104101 -111764 85183
19999 81092 -91310 -61971 47949 -342680 -73638 -288365 -259728 20954 116183 -111519 -157535
19988 -157535 -131439 -133822 -62429 -116067 -322995 235250 -138789 -19781 42389 -219030 -71200
19976 -13079 383011 108539 91965 289700 -39201 -171979 6415 38548 6596 -100920 -115011
19965 -115011 30509 51971 -30073 -290043 -182788 -178972 -142490 -117020 220202 -22468 -65950
19954 -65950 -60712 -108393 11519 -91093 -210317 134061 -18128 -112441 -239697 192263 -16724
19942 -22161 -386723 -106103 -90916 51740 -152580 178736 -182470 -47612 -142662 115801
19931 -196681 -89929 119950 -143857 139237 -199227 -121560 -353225 -237198 337443 -28281
19920 -77904 -179015 -49492 31209 443507 -44132 18476 -74696 -291481 -97049 82267 211691
19909 211691 -114280 257623 -322201 -19851 -117888 57219 -230289 -41754 -353181 -86267
19898 313371 522 -148970 -240742 61762 52635 -55262 -86901 -266919 -3753 -107361 113562
19886 6430 1581 115373 47373 -204010 5099 -150608 153610 -194472 235075 -18248 -218384
19875 -218384 258133 -38473 -87244 -15915 -17724 232458 -185086 -140337 -113276 -217747 104900
19863 -359192 145588 -20075 -38884 -328049 -124498 -192688 9817 85161 -147595 218286 -190663
19851 61395 141826 -322715 -324461 -22655 122480 144559 -195659 -92781 -134597 -124988 169744
19839 -32242 -193375 -179061 -332547 161858 -30141 126421 -18288 -160453 217292 177151
19829 177151 -55853 -145963 -75401 157546 182493 92457 -299912 -153724 96571 -132984 39290
19817 124986 -159507 -113226 -233481 196949 -99793 31152 -209695 -306405 50770 -12833 -367132
19806 -367132 -239752 32250 59979 -129784 219235 23250 231813 -222323 125567 -30902
19795 -121575 -270177 -39126 -92306 -68425 110645 -86214 -83128 53471 162522 -67642 48064
19783 106897 -295880 14883 -57802 116009 -69039 -66103 -224005 -59046 -95591 -150901 -213647
19772 -213647 -131235 -164782 183743 31915 -276191 75646 -77820 -90324 -76595 -180759 179689
19760 92295 -254762 183605 -166015 21250 53751 -67216 60523 7822 176363 -416521 -317673
19749 -317673 719 -53407 -111141 323899 -265431 13862 52105 -219327 -137263 63958 6211
19737 -4696 73280 337522 105621 -211554 -141120 324862 -72740 14052 -106664 -175034 186071
19725 -63248 -185422 136674 63634 -210712 -77817 -55450 -34398 -158453 -120175 -59735 21531
19713 -33881 62607 187131 -308602 347895 -223709 196423 -101520 3106 90585 -152138
19702 -131257 163981 115127 -15194 12439 -90022 -107656 -300516 4480 45493 182167 -79549
19690 57148 -247078 -146548 -121005 102668 -226239 -282627 -158259 -83048 -170795 166625
19679 -59658 85367 -147733 8665 -245630 32861 93955 -164120 -112125 110584 -392965 -32646
19667 -30248 -245766 -51153 -224760 138850 -200067 -113114 -127274 -148476 -80370 186995 -20809
19655 84533 -7618 1408 89616 -296094 59420 -138067 -73303 -35188 -287348 122684 -176578
19643 46857 -409858 -56723 -116488 -139580 279449 -143540 -184497 -317615 113870 -138425
19632 39178 -49010 216621 86601 303180 231850 76096 -94139 -42660 -88263 -64947 -119812
19621 -119812 -1870 -34578 344467 44690 122354 25589 85713 -39816 197544 49282 -1800
19609 -136829 -86060 -270753 -161835 45546 -463500 -144996 -174966 -214263 196068 38378
19598 -13083 -381788 -268638 22453 -249916 94125 252539 -208085 -29288 -192122 -158732
19588 -158732 -15015 35089 -291406 -137110 49707 210823 14290 143086 44178 -104808
19577 -128565 107154 -113994 154455 49363 9212 -67797 125364 -117036 137864 -421756
19566 -42454 -172300 67608 26172 51016 -104459 137451 -333729 189480 189138 83250 -376734
19554 -247915 -129281 -199477 287029 -210833 5587 -246157 -309452 -137858 -156097 100907
19543 -37192 135464 -134852 2979 185077 -64458 145688 3133 -24637 -280733 240934 386
19531 -11684 30080 -114228 -44908 -97502 133256 -6293 -98750 39379 -353406 39824 12084
19519 -17235 -43359 69301 22176 -76664 92927 225586 -134731 94601 -70084 -186193 77262
19507 -225644 10342 -51091 -227349 -499176 -331516 -392862 -130179 115235 -146631 -109728
19497 -109728 -164828 -345640 -138909 44573 -253529 65460 -137062 -405348 -71870 -192229
19487 -192229 -190151 -252404 70775 -197998 146737 183466 -191658 -36623 15304 -408551 -214791
19476 -214791 -288178 5009 -33897 39424 291728 -70196 -333224 145447 -21519 -272029 -51074
19464 -139940 -95812 -168209 112140 -276758 -145391 94411 -361047 251033 121294 193189
19454 193189 -169941 -142351 -182422 328866 97321 -117243 -45947 197569 -86394 -5599 125135
19442 -203883 -185351 -421388 -280783 -36269 107800 -97021 -108446 -64688 -224421 17250 -144579
19430 -243239 48127 -164377 5292 -402295 -214446 157752 70345 -180597 67000 -87664 -163186
19419 -163186 -349306 117041 -148897 -235740 -165005 -59479 83982 40364 -29729 -267345 -130281
19407 -276298 40706 82982 17426 -170304 54105 -183293 528704 -292986 -239932 -108398
19396 182926 -211633 -63074 -54595 178169 -51922 244394 -287166 -270974 272824 -195283
19385 -671 -170203 -144278 -114778 38089 -11991 131268 -136459 276944 460899 -63291 -64638
19374 -64638 60711 -56228 1206 -54948 18077 -159823 -79784 62582 122319 36273 28515 24869
19362 24869 -125151 -91831 8007 399408 88689 209873 -41891 -231949 -78014 101596 -86343
19350 62322 -456811 -3268 174047 -160207 -30646 -141061 -102254 -42945 -27690 155221 5131
19338 -30341 204216 275270 -111683 88995 82962 -16249 -15808 -219625 -44101 746 -184176 -95885
19326 -95885 35026 -148803 -267528 -250565 -309273 253475 -2708 -61522 -398094 19221 62718
19315 62718 -288501 312838 120577 121891 -98603 -194933 50137 144828 -251421 -117359 -287375
19304 -287375 -219307 -119739 -36248 -289208 -30730 -342756 44206 -85563 94532 81840 -86262
19292 187373 172811 -85640 -110424 -110819 -103554 2393 124151 -248773 -83136 249328 143144
19281 143144 -15147 -4545 65765 193910 -234877 254497 226403 56054 -247840 -258886 -127895
19269 144880 -184493 162872 -154344 -21929 -83208 -118967 -11473 -444685 64592 -62510 -224159
19258 -224159 -223178 -213293 -155964 98079 -74705 184296 155056 57725 243484 -142291 -262349
19247 -262349 74697 85286 133495 148689 152019 -114199 -391577 62126 215043 -107682 -135726
19236 -135726 165960 84325 -84685 -80341 -154979 -9759 58031 -210191 140252 -70616 -94186
19225 -94186 -386812 -220040 -306877 -139652 -129966 -5357 9819 -462910 -77647 -122191 -107984
19214 -107984 -186204 -29766 1181 74239 83803 36000 -49193 46095 -106160 -22504 -65229 259115
19201 -10441 -157816 -7322 -280044 -130165 -7170 310710 -236415 -184775 46198 146054 -55624
19189 97292 -206946 57531 -39698 -34064 -244670 -41086 136038 -82498 -176147 -85785 -160839
19178 -160839 190147 -287817 -78157 -117503 -247785 -680427 -193631 -3094 43227 21668 -107915
19166 58363 -75046 -200483 -117282 92044 -33064 151793 241927 -212165 228834 -73128 -390552
19155 -390552 -113026 70593 -79727 -199203 -181726 153280 -207671 82686 115851 -86255 -5018
19143 334282 28842 102147 -10787 -117491 216990 -304380 -251143 -39180 8999 76227 29670
19131 54150 47362 -223073 46209 -163252 -118346 164072 104921 43459 -190427 -186311 73869
19119 -157440 249679 56627 -48091 27530 107565 77588 20097 -109769 175842 -232061 -167629
19108 -167629 -60733 316667 -12673 32070 -234203 144043 197930 -389492 -116575 -286676
19098 -286676 -174111 -39281 43567 -403736 204415 54995 -456366 116261 -237755 114261
19087 -230343 -104194 -28871 -21116 -40483 -173731 -81441 -260604 -5890 255537 54836 -191307
19075 -109669 -104830 12008 183716 -33405 -177537 -84591 109790 -19043 160986 -310422 -159530
19064 -159530 15853 227125 126027 -439302 -266910 -339396 111455 209815 72646 -256864
19053 -253405 -190779 -287734 -322439 240673 148051 -211328 -228796 119373 84435 288087 -187262
19041 -92394 -152040 216731 -344032 -486019 -40237 -83714 -48772 -18489 -210258 -242388 -153672
19030 -153672 86927 39230 -355906 8696 4469 299005 -125393 63263 -59667 -53552 315736
19018 -54059 287012 165006 -95526 -200115 79209 113688 249707 -265013 -179264 -134536 -32832
19006 331014 -251238 -162192 103924 -18800 -89111 16798 56948 -112874 -170295 -33557 188657
18994 -170491 286676 4365 -338896 83414 6063 228251 51675 181682 -84091 -27831 -24806
18983 -24806 99153 -1871 -180704 -30277 58715 -285374 -156908 81429 33398 84865 162644
18972 162644 -120634 -61123 193394 -64826 -130993 -44612 2058 253295 -320802 -105817 -89010
18961 -89010 -153567 120108 -145008 122309 252257 73587 95752 -70257 -30005 -194795 -6806
18949 -219621 -189402 56671 57375 115128 -195400 96342 -185046 426224 -119794 49995 -290349
18937 -73884 -350555 223296 143078 -17027 -11719 90040 30651 69846 -145665 -105902 146744
18925 62856 158887 237860 -153782 -171031 -172120 130308 42803 36630 -185853 42260 -113353
18913 41156 531199 -140807 11950 -121232 529522 -20138 66275 -28059 235969 -139398
18902 5965 -127850 -142486 -154602 -100622 -155608 -34744 -453831 34312 -283960 -316366 -299483
18891 -299483 100293 -90365 -476924 326964 -76048 -93879 -121618 -232126 119900 -206289
18880 132096 -67126 -371561 -237793 -14879 116085 -139802 -279507 155680 -81946 -27801
18869 -134061 -197990 -189405 -136687 94666 81616 -94570 140248 76266 242440 -178291 -98773
18858 -98773 276784 291710 285794 40308 218981 108411 -240426 120792 57196 -85444 103392
18846 -360805 -104652 -30954 -171306 -160918 43723 240848 67169 -289949 158364 -184092
18835 -422372 -68720 149670 127636 -184337 -148228 138546 262624 -449196 92350 -260262
18824 41924 241023 -40842 44816 270932 10535 -270070 -20856 37942 -226111 112704 -238210
18812 -129142 50801 226550 254291 153387 -232833 65483 23269 192255 222678 85150 -133734
18800 -65489 132200 12828 -88496 -160915 -329605 -36076 91731 -190508 -229451 83986 -94453
18788 32532 -48911 -59594 228237 218689 -67521 121042 194305 -182286 -58762 130955 75434
18777 75434 117284 -32490 101124 -236152 96811 -171794 -84470 -375234 -28430 -1368 68665
18765 -396853 -407371 -119481 -219831 -10597 -431642 -192240 -94294 107611 202387 1055 25244
18754 25244 -109304 -136456 385727 164378 -253393 -7788 -164493 -171216 -494927 3429 -80340
18742 -164045 -27610 -204076 -63419 -241392 -30980 11510 -23932 -222365 -128120 -106557 -211544
18731 -211544 -211988 -61463 -174161 -363304 5992 208374 -214871 -45938 303591 151496 -132730
18719 -85385 -83850 -71518 -156657 -255543 18483 -274900 22495 -240782 131456 -126867 -263410
18708 -263410 -60732 -99878 213564 -171925 -209235 -232531 -154083 96151 77998 94175 8113
18696 75010 -309356 136528 -27159 15438 -15754 196343 -84402 186231 235231 -42834 -90832
18685 -90832 326946 -174501 239891 -179467 -69416 230120 115706 42379 -112616 -101915
18675 -101915 -40385 116711 -208373 -247926 -49692 -262840 -409260 -246039 -295398 -60901
18664 -264434 48345 295036 -31755 -195157 -90385 -111814 69108 65593 160144 71579 -20264
18652 -296318 169109 16923 -133848 -34911 402139 -247011 182422 37832 125000 -210543
18641 51562 308433 -268050 -291478 28602 -145549 148921 -482662 -296171 265210 342213
18631 342213 281253 -99832 91491 62235 -455020 292111 -163413 -42895 -317620 8802 197415
18620 197415 -92777 7190 130195 16826 64831 -105665 97145 -270775 -77823 -76710 -53805
18609 -53805 -93073 -215862 -526386 -62021 233966 -195377 -216631 -250937 -18309 60582 -207475
18597 -63893 8806 -173826 -35659 77465 -167580 218808 -7349 -34973 -1896 -100049 67466 16046
18584 -310650 -101452 157377 -199161 2332 -50050 -111973 -101368 -272244 36942 -19962 -87845
18573 -87845 203282 297821 384392 178837 -233311 -97414 122867 177678 -178511 -526593
18563 -526593 -177046 151502 -83975 73775 75053 -2901 191337 -72367 -354558 254811 -120996
18551 42820 49627 -240567 -42167 50206 -64137 312249 -254264 -176084 -101215 480 -34080 -73001
18539 -73001 -122229 119815 -448800 -95770 -180382 171214 -285813 -212044 13665 -13055 -103103
18528 -103103 135520 -69450 -181004 50734 -414381 -400448 -255573 -28922 269715 -56758
18517 4577 140486 -51664 -183408 -230995 19849 7678 -161274 231739 -271058 165869 -22682
18505 124832 -52122 -91186 -227177 -202949 -208821 -56394 -52269 199622 -143571 93529 -32307
18493 288993 -108395 -163224 -149829 -3441 187254 128251 -33214 -77319 -265674 -135639 -119609
18482 -119609 -204168 -271935 -106511 -192484 -157736 -218955 213654 16484 406925 6480 -102747
18470 47806 103150 -233661 -109792 27891 166588 147180 139846 -195866 103973 -108721 -275588
18459 -275588 -181080 226427 -224669 -20245 -186439 -173050 59956 -193108 -26874 115785
18448 -401926 97103 -6850 126040 5137 218649 -85145 23942 -217326 277652 -208864 -94554
18436 -345782 -117551 -92668 -236940 -85061 -34371 -319277 -81445 -10398 -263791 -248777 -201712
18425 -201712 -65676 -520641 98785 -246293 -275178 144629 43009 -174048 19502 -203013
18414 175737 123463 -138174 -145596 -27418 -45568 54811 -127605 -96905 -3575 -165966 199068
18402 -59692 -83008 -66867 -162019 -119125 139570 82322 123022 -409035 -196302 -78850 -262740
18391 -262740 80962 -155543 -404139 284536 178153 28530 -217173 -96769 -38531 65472
18380 139182 107766 -154343 -222459 -8332 243220 129396 201170 -1028 -50811 344679 -45785
18368 147221 -187449 -154728 -93510 -98650 -230883 -217583 368244 -115422 415073 -232104
18357 60460 -126822 -106698 16074 79854 200309 -316240 -92550 113190 221430 217392 -169065
18345 -226854 -57508 67399 -218478 -131290 75627 -92853 -202496 53655 -81332 -7890 24113
18333 -89788 -160599 142444 203188 -153432 4541 -89283 -40917 45750 -293800 -68417 -245591
18322 -245591 55319 -89131 197311 -149234 -267707 -159438 -368470 -126660 -133663 -209560
18312 -209560 -113913 28769 138135 -156777 31665 86460 -334014 148379 343795 28295
18301 40180 209830 250037 -385695 -356866 -53681 -38195 -86449 -3352 147108 -481871 154656
18289 -187132 87378 133812 270767 -33228 -393858 -206556 -79552 76471 111597 1562 -403427
18277 68203 46854 -128523 -160742 242188 137789 -10711 64951 51800 23968 455634 -161105
18265 -52307 -43461 -59198 150067 -111923 -2989 161445 25361 -155323 92649 122506 28720
18253 73228 97841 -31712 107315 -112721 85419 -35313 82987 -42386 -113250 -78242 154645
18241 63459 -3205 21231 45064 -301079 -73016 -298568 -157605 -9866 204260 -142772 -181270
18230 -181270 -82827 -19572 15328 28468 -337461 -34093 -231916 -84437 161943 191923 75516
18218 -34529 13628 -356723 272319 221963 -79744 -44292 -169569 -38910 -81561 -144995 -198968
18207 -198968 67110 -57532 -162739 300241 65174 -204866 78270 -241141 -21953 154819
18196 103315 -116873 90204 -120270 -6980 2973 -355626 -142343 313218 10690 284009 47720
18184 -149183 -117959 -157674 217037 -70129 178352 -30462 2716 -130327 -268501 -11089 18479
18172 -73332 148909 254647 -40416 -63593 -383285 -52507 -22300 29763 -23612 20084 -378932
18160 55884 217077 -222156 73143 -174697 -31817 -365894 -7340 49537 -30308 181357 -74842
18148 -190510 33605 118577 -100569 36365 47992 64720 -102247 -221195 90266 -28389 43627
18136 -98335 2070 -199764 61723 -76619 233454 30543 89035 -262994 -30948 -151754 -63215
18124 -15 52111 -313758 -183308 -44087 -34052 165527 103401 -32734 66778 348273 96270
18112 -14876 -66846 24313 -224111 103992 248185 204600 -4272 -39154 157735 85170 37875
18100 -31444 74172 -44323 -8974 292115 -271067 -126594 156592 -24892 5660 -312027 -149473
18088 177525 201383 -174477 25070 76520 -215480 -139055 -256980 -349734 72425 -58901 52989
18076 -28728 398684 -23692 -79962 -294948 21393 -91902 78167 -65269 10627 -47046 -278692
18065 -278692 26509 3167 -35225 192295 98793 36231 -57869 71409 -21220 6518 -292641
18053 65350 -179100 335097 263552 -162682 -139883 -108756 345487 206743 -249531 103495
18042 -53076 -29862 71333 -188249 79712 -154180 -259788 -33486 174794 72612 -246707 70684
18030 -106807 86584 208892 -250043 -257218 -138758 48536 24594 261671 56499 -49816 -111670
18019 -111670 -224612 -140655 -59025 471043 -187050 -103883 -169430 -277375 -56928 217594
18008 110822 91199 153143 -76458 -271839 142944 137646 31059 -53942 230472 -169214 -65409
17996 55531 -116117 -177863 -89366 170407 -144769 -7156 -15977 150573 296740 -77802 -12006
17984 82672 -39624 -227953 48868 69211 -180985 62679 -43650 351156 -21001 -100898 218644
17972 322487 -263287 107701 -55110 7782 -30664 -69969 162209 -410330 -73055 270175 -295302
17960 -335558 34884 194887 -165533 -125969 260347 -96183 288400 -124763 -9549 -104320 88686
17948 -87802 305743 246985 -112300 -86404 286887 277130 -61837 -12371 249963 250659 -127268
17936 -169085 131112 -55897 59760 86596 45459 -141345 377322 250977 35265 -66185 -299336
17925 -299336 -94199 96700 -133100 4767 263017 -22412 74226 29387 -176128 -104201 160725
17913 216950 4053 34250 53305 53322 68196 -78271 105042 28771 150694 -17252 49525 -56368
17900 252940 51954 -8210 -6074 -142623 60685 -6337 -108600 -112095 227247 161374 255181 187456
17888 187456 160901 -47475 -26357 51638 250952 50410 81278 163328 133464 214519 18136
17876 -372841 70316 -144587 -7046 240469 -82753 183582 -248481 222581 146383 60386 145382
17865 145382 -25518 128218 -97631 -151796 -413031 187327 -70960 -205016 -86400 -136895 227698
17853 -94224 -182311 -87935 -679627 137100 -36775 186109 306874 -315679 -306916 -191436 -353156
17842 -353156 -18036 202357 -124862 -151317 104229 68350 210502 199117 147927 -369834
17831 -40207 -61970 -169217 118676 80221 303544 48387 -183799 129013 10816 -327028
17820 -82103 227432 -104042 -134622 29608 1906 -145283 -133273 -356044 43512 94107 -202160
17808 40357 -172670 -144828 -137656 8231 -205238 113608 -180923 336008 -57463 -250590 -153568
17797 -153568 -113672 -102256 94221 -185642 160041 31282 -139216 115299 139476 -152229
17786 28869 -1683 308933 -15315 158895 330010 -60709 26564 -302560 47761 -70004 -109089
17775 -109089 -19827 120594 -68868 56308 276268 -52334 -84936 139183 -138731 -238548 81723
17763 68981 37519 276782 18385 183829 -79594 29040 201000 90228 -50618 -186223 322534
17751 114433 439307 127882 -146846 -202503 -129787 381539 -155548 -88745 -122390 -302596
17741 -302596 -144942 -25623 69318 167715 70266 35885 132446 74110 -77651 229060 94353
17729 286844 -272292 -147256 59537 -148015 -333880 296088 -268182 -307576 -19217 104305
17718 322772 -90592 389406 -10005 -178656 -14592 -117681 160495 -40614 -39780 92810 126813
17707 126813 61806 264923 62051 -238430 -12889 153341 307882 -146528 -144513 -42134 -85919
17696 -85919 225293 121123 75986 40216 217041 -56328 186219 94263 26880 66332 -494
17684 -79242 168858 198561 -267234 397430 251250 -51207 101102 -143147 198538 100825
17674 100825 13403 -77125 -255739 -134031 341473 123631 -252415 193745 -89188 122249
17663 258120 329604 -92825 114863 6832 -275963 155739 -350560 56260 186767 -148871
17652 115216 333720 174105 -56093 -268147 -14606 224799 16001 246187 285864 -2564 471286
17640 75096 207521 -182275 -41479 151225 151966 -4445 193978 217803 -91313 -59936 -130598
17629 -130598 -104481 -36240 243546 -378068 75346 227756 293211 164124 -267123 136416
17618 -625 -67876 349384 -89992 135373 153842 -12202 233600 190955 275631 72573 147109
17607 147109 -122009 234105 28635 108112 188753 19579 176574 -69484 122094 124088 81776
17596 81776 -62386 65678 -198057 -99828 99220 -183312 148720 127004 419531 117347 -162043
17584 119802 199084 277476 -35146 77885 112075 33397 73040 27927 176683 219196 357990
17573 357990 281855 -74341 35634 197623 -21345 219188 91677 29716 18109 250971 22223
17561 184921 373557 207605 274677 15071 -147488 97490 -2513 211890 -225674 250686
17550 215646 -26259 287372 316171 -177526 116067 5527 -204753 25584 -194799 191229
17539 189963 23104 -72321 -237360 183391 107005 -316446 194035 144648 -171152 348405
17528 111606 153972 58598 298465 138249 420910 -62194 256416 712578 340643 220098
17518 220098 123190 144712 449933 108768 -22584 7577 169598 372400 478825 59860 231332
17507 231332 749734 241724 152390 363692 287678 195647 150131 104035 -58772 131291 77845
17496 77845 286797 -260651 115847 -37292 409586 145679 92461 36258 242791 59093
17485 145568 102703 132045 248665 492823 122343 163033 -90832 89879 247896 509879
17475 509879 144005 -215815 -42552 33974 -22421 231147 345834 -120068 70154 -16547
17464 246328 118332 542659 58121 9217 305754 127666 142682 -102156 275665 -134940
17453 202672 149524 34048 -5525 297528 332773 -71876 273331 240757 186907 64747 218706
17442 218706 357292 -88448 256347 652651 142771 476847 173102 384652 541190 497337
17432 497337 143769 366371 -884 286661 550596 166234 342247 312713 105896 161486
17422 161486 407016 258063 493549 282833 121344 580337 219560 341473 229337 183203
17412 183203 76833 574336 215315 93860 -42823 63370 139925 133454 488186 255086 -72164
17400 171743 243267 199981 15532 -9359 287735 421542 145981 24750 149852 167449 361236
17389 361236 440746 105974 58673 97448 357730 156134 300929 160264 407755 130632
17378 129248 231386 464054 273328 244009 30727 216854 292083 330231 184228 635836
17368 635836 90476 17399 -138080 198185 -79879 235500 85067 79663 -151248 164842 148624
17357 148624 346493 165101 242699 27481 210210 112068 -128318 -171274 135949 -264890
17346 209692 92696 175581 -3568 -30131 377543 199744 123977 262364 57390 77363 83401
17335 83401 317699 486661 192566 112503 239874 34747 423033 245782 -20913 455479
17324 233785 411649 160876 376196 253214 23929 151532 238943 351541 256915 -88132
17313 144077 44111 -602 286404 275959 313914 -33281 43370 -119932 534975 524749 -20630
17301 187675 309090 66640 413357 119930 86151 131135 13506 171217 142431 147472 187840
17290 187840 423954 346476 240429 431296 209389 112448 23525 30262 258477 86475 181530
17279 181530 294582 285716 451234 -13889 324102 88517 420491 349946 358977 63563 24004
17267 31592 336089 71311 -65495 527478 78645 450543 140261 183175 367893 122532
17256 108214 338576 291947 -92604 127596 171239 124882 55725 536416 483982 135317 139161
17245 139161 43785 228678 197482 258911 294150 252913 524366 302388 282208 629402 278754
17233 553460 -41435 587723 253116 -45365 251150 215028 269397 175006 -117488 278 -19370
17221 66401 291621 181637 326261 372215 74014 289771 168777 335090 -12389 269326
17210 64205 169473 389773 414135 171012 317973 444089 138042 272537 201447 217234
17200 217234 191965 112556 250967 157126 377550 297277 159862 343822 298511 237161 512466
17189 512466 630879 294436 115417 300739 367242 294871 593753 472454 82938 245359
17179 245359 467616 237850 539224 409804 -8467 416450 473050 17997 507201 500675 519638
17168 519638 268927 194563 357910 249971 13565 170841 274814 369372 308311 230884
17158 230884 275451 523881 573936 240144 530078 464670 381136 316184 230728 590901 481264
17147 481264 424800 584196 669189 326575 471464 549126 550086 711399 527821 806021 460381
17136 460381 475297 429558 711295 383655 535483 439511 766609 414414 534794 544769
17126 544769 154098 612932 196532 636914 262424 350004 543484 528385 349029 569027
17116 569027 603876 493357 320575 394762 550122 388855 362051 458613 404360 490446 428591
17105 428591 352947 450000 532854 676325 417584 540802 154262 667036 695550 400915
17095 400915 353650 518469 687040 467589 943574 729139 548132 419806 637320 1049512
17085 1049512 640800 370311 418331 737516 493017 529387 735632 551310 764692 705241
17075 705241 544576 790059 985590 375917 884684 613018 717144 794600 771170 743427
17065 743427 777089 635630 695351 738020 439210 968755 710516 390560 856873 528503
17055 528503 378267 594717 626799 676829 734317 567606 447925 586459 472000 869715
17045 869715 649559 834923 686733 635483 822632 624245 519424 586833 654117 1144899
17035 1144899 642508 935630 655580 877692 954123 732493 644071 836136 493220 865639
17025 865639 1202581 906173 551282 660399 775474 677739 713669 1185783 646484 895713
17015 895713 1119089 852290 782296 885062 1185036 989350 1064981 727629 852028 1028299
17005 1028299 922230 1142772 1055389 1086701 1080736 1112914 1022609 1045052 1193537 879727 1260071
16994 1260071 1448260 978986 1129036 646055 1091864 1239192 982614 1287438 878944
16985 878944 1095007 1359157 1179531 978112 1070368 1304783 1311577 1254551 1426867 1031654
16975 1031654 1675966 1311583 1521838 1589701 1102775 1367250 1384514 1581626 1303310 1566200
16965 1566200 1272042 1634223 1249032 1250848 1476489 1696025 1552779 1578274 1524530 1558514
16955 1558514 1435535 1737982 1852474 1551826 1730840 1873227 1456909 1547543 1651364 1713378
16945 1713378 1631934 1726534 1679946 1602090 1962209 1856026 1781467 1922996 1845986 1937928 1938641
16934 1938641 2030292 2109297 1993936 2282608 2043027 2024660 2311735 2170909 2078198 2176475
16924 2176475 1843421 2069152 2325545 2216228 2195443 2140945 2008376 2441466 2392729 2613699
16914 2613699 2324346 2555929 2578220 2314763 2565671 2684962 2692764 2677532 2473819 3069754
16904 3069754 2665754 2619067 2751168 2993383 3474948 2841450 3088248 2949398 2922172 3255588
16894 3255588 3092304 3269562 3345723 3086085 3417695 3326441 3517566 3502491 3550082 3531250
16884 3531250 3571892 3502014 3796195 3571350 3948097 3966802 3876918 3760400 4258238 4201389
16874 4201389 4178980 4361222 4356184 4279658 4302488 4426782 4543085 4640157 4802951 4657344
16864 4657344 5199161 4796128 4864068 5360071 5125017 5590138 5505367 5488713 5545170 5607680
16854 5607680 5900255 6119072 6028193 6200474 6003386 6295076 6611357 6484331 6637252 6755385
16844 6755385 6623507 7069566 7322571 7085137 7902809 7627464 7864817 8073018 7856231
16835 7856231 8356902 8412665 8537717 8832809 8598084 9052368 9412620 9554664 9752844 10157104
16825 10157104 9903590 10613638 10432703 10788700 11549166 11368620 11650489 12063586 12262563
16816 12262563 12352637 13019088 12832033 13534682 13651495 13995943 14052774 14845691 14913225 15608679
16806 15608679 15858975 16410945 16770467 17220960 17356807 18224284 18543310 18953531 19533583
16797 19533583 20246434 20566176 20991776 21737082 22523929 22990461 23663110 24326151 25321279
16788 25321279 25941788 26651237 27441211 28528836 29338469 30207248 31291407 32216714 33017602
16779 33017602 34344470 35369357 36580009 37522975 38675175 40314842 41524017 42945956
16771 42945956 44573599 45972219 47470429 49239041 50608370 52336059 54103028 55963334
16763 55963334 57930265 59810877 61883694 63857510 65727020 68138327 69953092 71975679
16755 71975679 74513595 76520805 78546332 81223298 83510408 85744446 87533609 89713059
16747 89713059 91692619 93906513 95687670 97456401 98948610 100671072 101850163 102901923
16739 102901923 103967870 104636421 105522102 105666788 105739370 106011477 105482687 105018096 104724504
16730 104724504 103463832 102714491 101237485 100173304 98590893 96643359 95370250 93572640
16722 93572640 91653888 89691057 87547943 85682111 82913235 81002304 78704186 76820269
16714 76820269 74462094 72630474 70709404 68427217 66174580 64701205 62556249 60762318
16706 60762318 58610973 57396441 55263360 53594315 52039760 50509859 49206676 47909285
16698 47909285 46322873 44748659 43364165 42102109 41004058 39889957 38443976 37142745
16690 37142745 36078236 35479531 34388692 33296540 32356026 31412309 30915347 29618949 29386817
16681 29386817 28046988 27455271 26811577 25824592 25344192 24955980 23938806 23866236 23334368
16672 23334368 22739674 22015266 21391884 21085114 20323508 20043312 19493860 19102635 18502749
16663 18502749 18216627 17898654 17553752 16817998 16662407 16343266 16328248 15689702 15578152
16654 15578152 15236102 14852527 14414861 14137778 13906110 13753937 13397089 13298088 12669322
16645 12669322 12876411 12344523 12470813 11720409 11968545 11918101 10968798 10837211 11035849
16636 11035849 10598673 10676896 10483692 10060663 10347290 9901063 9772845 9361766 9256940
16627 9256940 9283403 9093863 8720620 9003609 8644694 8428895 8202812 8484911 8255531 8011395
16617 8011395 8029977 7601085 8165430 7672844 7756177 7609647 7215755 7333328 7331567 7069843
16607 7069843 6921321 6545596 6796559 6629983 6545151 6426232 6511421 6469296 6366713 6509529
16597 6509529 6167271 5981437 6333368 5642120 5727592 5790160 5695412 5373017 5469295 5360013
16587 5360013 5189123 5453922 5380114 5228517 5203424 5336383 4901448 4850823 5058790 4932953
16577 4932953 5164586 4903882 4618816 5014668 4839903 4465135 4253305 4374488 4274509 4429554
16567 4429554 4374972 4291240 4042715 4449119 4473869 4101337 4032385 3959244 3899569 4105734
16557 4105734 3991746 4142519 3847284 4131448 3916489 3744005 3854597 3611144 3830704
16548 3830704 3331681 3810604 3649135 3657585 3834881 3573477 3454030 3624012 3400936 3507242
16538 3507242 3603229 3419658 3429318 3276596 3048814 3440601 3431079 2934180 3185910 3008116
16528 3008116 2996186 3105361 3244037 3038811 3353435 2709875 3037707 2985900 3439783 2904932
16518 2904932 3308534 2583985 3031854 2994070 2741728 3039756 2975946 2675210 2916749 2844669
16508 2844669 2640337 2811757 2572782 2509621 2867651 2422571 2735006 2401886 2766941 2416864
16498 2416864 2568378 2751256 2576252 2803906 2499104 2568431 2575393 2403245 2557044 2347530
16488 2347530 2428850 2750244 2545972 2446538 2310103 2663386 2644684 2423053 2541542 2457978
16478 2457978 2250112 2722335 2228543 2127201 2294558 2426545 2303622 2001883 2255529
16469 2255529 2340577 2226997 2007674 2186698 2034664 2386348 2472670 2214627 2098633 2504559
16459 2504559 2067218 2056441 2110894 2170496 1928821 2042491 2464335 2537937 2006538 2340355
16449 2340355 2082564 1993861 2147224 2260555 2198397 2019405 2192429 2064371 1995485 2267602
16439 2267602 1894229 1777853 1736390 1827862 2098443 2284140 1819721 1978413 1958892 1869331
16429 1869331 1756556 2098240 2066628 1793575 1863962 1932221 2233440 1610654 1863958 1983956
16419 1983956 1759038 1718029 2107601 1776882 1880381 1876003 2172357 2250140 1649987 1590815
16409 1590815 1901492 1651930 1781353 1936277 1858621 1963498 1865028 1783767 2068960 1904180
16399 1904180 1985076 1965529 1436678 1727077 1840800 1815299 1658447 2028374 1786782 2100016
16389 2100016 1978704 1276093 1770829 1742087 1987094 1795983 1733438 1869307 1949209 1703939
16379 1703939 1672048 1991490 1619085 1911077 1557059 1634687 1768304 1477467 1591668 1710188
16369 1710188 2002543 1361320 1822010 1481922 1512466 1465998 1775601 1474415 1368024 1725477
16359 1725477 2041035 1993848 1883863 1993610 1808861 1782595 1839451 1667225 1740769 1707919
16349 1707919 1726140 1448151 1797125 1425306 1502220 1695925 1769496 1778679 1623939 1621613 1377330
16338 1377330 1401436 1766351 1507009 1664754 1356209 1658175 1618632 1496237 1573496 1884329
16328 1884329 1279688 1399649 1321995 1562952 1660002 1816286 1557146 1729494 1410729 1273492
16318 1273492 1523204 1564211 1655285 1466525 1645393 1621122 1427654 1833444 1306651 1627564
16308 1627564 1484375 1486946 1134165 1528022 1566404 1379343 1338592 1138390 1515074 1425800
16298 1425800 1622636 1584628 1382745 1355511 1325888 1467911 1421313 1383787 1204338 1551159
16288 1551159 1318036 1365433 1198110 1365502 1753576 1371584 1359064 1194310 1135898 1461984
16278 1461984 1287197 1352157 1525923 1600227 1246724 1388782 1396163 1422598 1317880 1352303
16268 1352303 1574001 1211492 1153031 1100527 1408510 1192830 990992 1148092 1263885 1377798
16258 1377798 1180161 1350128 971175 992575 1193697 1310792 1279997 1099071 1166963 1177880
16248 1177880 1558805 1126413 1177321 1213021 1123455 1162187 1094015 1230040 974604 1265291
16238 1265291 1096182 1091229 988250 1027117 1058520 657859 1195343 1319363 982339 1304071
16228 1304071 1241773 941058 1086760 1152275 1379225 650239 951927 1115336 855288 1026781
16218 1026781 944512 1008707 1089692 1461382 1019061 1129957 818560 956459 1154104 717584
16208 717584 822624 837247 487762 829329 866830 798544 822034 811073 958449 457705
16197 990010 952770 858557 870155 1008394 992201 1079037 773462 1139560 1037259 999631 783793
16186 783793 1094156 996706 900876 873529 1207585 948539 882723 647163 830029 1071699
16176 1071699 553632 596284 564949 580180 836009 907996 884308 606532 613760 572054 885672
16165 885672 754336 710944 794156 750773 600438 603636 441188 367645 853598 470708 703127
16154 703127 577990 502352 975753 683467 345356 505631 669511 452382 521465 580759
16144 580759 468359 682946 371371 242482 735713 802569 570333 725362 315954 848676
16134 848676 381748 528483 949229 611729 437801 717188 574656 680902 368712 292099
16124 292099 483581 559711 566221 381525 355738 836851 386086 444940 746653 626399
16114 626399 331361 621007 646482 401760 743173 473628 408454 414840 401785 615957
16104 615957 437714 290921 506104 275117 467640 410866 120925 690731 282305 607375
16094 607375 638765 386874 228102 395083 273791 225189 314536 260781 187922 402056
16084 402056 74682 486587 241875 337092 162135 531183 280369 370693 153287 301742
16074 301742 92344 355785 116344 461672 277874 63610 512067 355533 450783 336711
16064 336711 291178 -78370 352523 138848 281609 421157 93831 244223 515533 411166
16054 411166 271655 225131 84733 236610 277382 245251 402324 240880 301573 138353
16043 138423 418602 33549 59781 210488 45775 149839 216149 196014 29060 -52463 211768
16031 22851 236676 206096 32445 39446 248265 229344 -9987 259648 323339 281539 373716
16020 373716 75055 20610 201344 228366 231087 -21716 380192 -21561 66992 532572 210602
16008 291154 -62159 44901 327907 30641 146576 210231 11520 -34966 207749 387506 71313
15996 153000 41323 55418 105960 229230 496427 228547 150430 443845 24909 637263
15986 637263 675925 548460 917156 338455 423176 83442 487717 497178 136793 324467
15976 324467 327427 202424 55275 233729 252357 283771 63983 108119 225251 335755 337849
15965 337849 -16471 -13138 14387 361670 175583 152840 103480 179206 -315476 148576 394996
15954 394996 124897 16607 196557 -98151 359299 265602 -182208 159509 319437 24170
15943 -127799 102560 408581 -152902 -233317 223194 303019 -122231 171580 -32304 106935
15932 25190 16867 47140 -140320 265710 -36985 155148 -91442 248378 357014 -99746 141028
15920 -199796 283885 -28316 132286 -16401 148975 190192 442 87307 227042 -236547 77735
15908 132849 105296 -11678 -108133 -36430 -313564 -161064 190639 222515 -119714 304416
15897 25082 47928 63282 -72896 -159935 -22050 -8242 -137856 56730 -280289 150498 246260
15886 246260 301739 248993 14492 90602 -301820 -46614 -39059 -57783 192329 -520270 -313353
15875 -313353 10819 -143901 -141846 136843 156368 -17378 -67474 233251 -275699 -49155 -134953
15864 -134953 27523 110023 -159148 -42763 159699 -21377 -210347 -250359 19014 -46882 -323992
15853 -323992 -34309 -70628 243972 -149581 247226 -58656 -119106 80119 87134 -12652 -42157
15842 -42157 113780 -66445 -39352 196300 145422 -260858 -17407 -213132 100374 -87697 -101283
15831 -101283 -77217 -221723 19430 -117060 -36218 152161 44242 307012 223498 250082 -196580
15819 -335904 86520 -89869 151724 87954 116518 6771 -51780 -450399 -258990 -11122 -47813
15808 -47813 112061 -125309 33827 192480 152998 -184618 154439 -209114 -127397 114890
15797 116610 208433 75666 237418 -68421 -205597 -17189 119069 49332 -13863 -76913 122532
15785 -4805 -239626 176969 -111262 60493 -73882 215542 291334 16460 724 -300752 -248833
15774 -248833 -261498 140786 239492 193224 -75491 -152439 313863 89339 -34895 -521 20188
15762 61035 268344 115681 -258757 398008 123093 -260875 126982 220295 127414 273262
15752 273262 -80447 -265665 9055 120263 296268 -157183 89408 -69034 301784 104739
15741 39983 -24713 391851 53821 32600 96806 -299000 257957 11141 237553 270089 279913
15730 279913 -96738 -123521 513921 55959 -96215 127375 293282 -430133 -169867 -51652
15719 307481 197721 56603 -259056 -119416 -101359 178950 -20230 -120113 82713 -17277 4352
15707 90072 -44582 -206622 101052 -208324 98368 -71983 -102054 -416646 119728 46956 -107567
15695 37031 433066 -176202 -135248 -115858 -72295 -230885 248370 72446 115739 38107 -81121
15683 58656 -82226 -94530 -97613 -110476 -111975 15968 -142088 120271 -39039 2827 -580725 244833
15670 -249463 -7535 89581 -112053 209440 -22297 13348 7728 28979 40026 -119166 176031
15658 274371 -321807 -167139 132667 98522 56725 331849 -21619 -112230 -463211 101019
15647 -101404 185207 127361 -39843 -100349 -57308 74590 -221033 -255163 118215 -216643 -212477
15636 -212477 -51448 -81526 -202484 -130446 67372 -191864 -279046 37476 -194319 -284794 -218163
15625 -218163 -189411 -30121 165236 -27051 100137 77342 -214533 -359583 -62093 51078 34532
15614 34532 72114 -87541 67472 -282092 292771 4877 -119423 -101982 -237039 -74914 -125914
15603 -125914 355732 91510 236198 138336 -468611 -181841 -234792 84210 -296187 -568490
15593 -568490 -92747 -164332 -109935 -179430 -154661 57457 63059 -1419 71841 103317 234646 378719
15581 378719 210765 -195499 222915 -107652 107702 -10640 131659 281061 -302749 -106259
15570 -60647 26512 150554 263180 -324933 -273867 58947 295272 -5477 -2492 113615 216354
15559 216354 -218408 -249002 52301 170901 332784 428626 264369 124191 -55238 21225
15548 187304 84825 273668 45456 -98011 -176696 1420 -7995 226625 202644 96466 33998
15536 -160682 -359847 -222274 -163226 24452 -224025 245911 -99386 -101155 70302 -131382 76410
15524 19027 26356 193656 -68247 86690 246319 -308813 190676 -310324 -148217 23017 -139146
15512 84282 -87350 -139470 -68933 46838 4052 -10627 -233255 2686 -63711 -112498 11472 -69291
15499 33094 61043 -105355 -232206 -128984 -240163 66876 -294008 -157355 -196083 -100947
15489 -100947 -54670 -14169 -231096 -151124 163020 -163422 -132062 -144623 26112 -238324 146628
15477 48136 -191606 166471 -220844 12763 196023 350585 -12602 -46891 35372 63217 158834
15466 158834 -135353 -160997 -28333 -258515 -41715 169325 2702 281434 245611 -14556 173874
15454 -68405 -12896 216945 9625 67644 477373 -87326 -148724 -170335 256364 169548 180130
15443 180130 -116355 -128159 288620 244442 43420 19041 28365 -122263 224518 122412 -66270
15431 702 -323587 -379163 -63831 -45629 116486 -116375 87880 160627 -80296 -233878 -10367
15419 -42396 143657 29820 247522 47588 -226583 -29141 -496781 25769 132679 147027 -265831
15407 -495853 -237247 23722 226973 -219618 51 104697 276815 -39039 13268 135122 44257
15395 236355 124039 187938 -138399 -5407 -120031 197691 -203448 212927 82195 268343
15385 268343 -188803 -34490 -50443 190692 239931 97569 -98120 -71088 -46918 -40158 189430
15373 -120100 69572 -32421 -59065 339165 -98044 186218 217171 -96837 261779 101428 -255797
15361 -119860 -191773 54865 -529280 222472 580021 225538 -232521 -67967 -98103 25479
15350 110497 -22372 163480 139458 -360033 194818 49867 488915 240658 333195 -37680
15339 83762 76563 -1469 41742 -85513 130109 152373 2098 69965 -136019 26836 205299 -208411
15326 -35427 -10781 99813 -7342 97161 -168007 -97302 -216162 -164629 246208 347769 -193960
15314 -58680 -237970 34747 -118947 -51816 388444 -177725 60212 -4138 82924 95927 156480
15303 156480 112084 -13329 -117179 140349 183910 90618 203131 -373368 -2276 171611 22229
15291 -74853 78680 166176 33938 242012 22907 5401 174329 -425720 -215986 -24488 -89980
15280 -89980 -208416 -57192 216095 161031 -47070 199345 59372 167731 -21640 -78134 -47628
15269 -47628 178229 -91308 -48000 -226347 -7686 50926 -9849 154682 -137501 239745 -30284
15257 164445 124280 149818 39497 -17143 63587 100110 189696 64605 109906 74226 47890
15246 47890 173350 -7325 57400 89496 -142403 -39782 -107123 203549 -32289 63963 -86238
15234 155998 102291 206387 12883 17032 -60589 14779 214247 -334385 101959 103468 -225503
15222 106546 84645 300628 213730 99902 72992 73422 -176252 28658 88096 -92341 136384
15210 75733 303169 71129 21456 103572 83567 52879 17098 -32147 -75304 220422 -4822
15198 -199390 -37631 -75856 47839 50043 -302241 -141546 314709 -233753 349774 -190813
15187 244898 -267394 -34382 42704 104618 -170985 -158553 202384 -79603 9685 138178 -16700
15175 294176 149105 -18662 86408 57741 2895 70267 330974 55744 71674 -4789 96060
15163 152753 108730 279103 23158 -6270 -80336 95454 -388484 73707 94974 -9560 55443
15151 -46012 248194 -140511 115837 -59436 -294732 25661 17770 380601 -24900 150260 -150078
15139 156092 386683 -134950 -19024 -216124 213140 -161419 162340 -110102 481183 34666
15128 -124171 84599 32506 -221550 255314 108842 281594 519946 79478 98961 380018
15118 380018 128380 -141476 -316869 156320 -22575 222134 -98616 186940 355126 249703
15108 249703 103674 189660 165240 63042 -254084 50189 48499 145427 -58745 -27182 407045
15096 291981 294763 212549 34564 58160 180310 19765 41804 205956 48466 112914 324126
15085 324126 74549 98922 -2122 174420 90824 -21812 -47430 187327 -16145 -109290 205288
15073 126399 181939 51973 7458 219616 166914 -146402 124908 202745 323650 375224 45694
15061 300808 253420 170180 -148456 65768 50800 150075 379903 194893 -51155 276462 127059
15049 123003 369253 414168 191443 -35525 -355119 35632 291348 165086 398570 505356
15039 505356 422556 -134646 375564 68677 320732 68614 257668 105018 410937 329667
15029 329667 44053 334601 100543 440406 578021 519700 428195 173810 369743 412613
15019 412613 189556 562749 380549 471022 471944 321706 342694 544757 559407 138865 -90235
15007 42119 101973 467574 142616 279442 477505 234127 356511 -363129 544738 383137
14997 383137 215745 175399 408010 240561 442604 400579 494356 193980 92271 247110
14987 247110 318984 -7852 142451 463961 218010 169944 85128 132727 436728 354345 463051
14976 463051 708286 607595 532138 601513 474683 607913 470801 476645 505144 161632
14965 484293 -39689 153698 -92184 468248 -121015 374945 458582 322685 241163 326186
14955 326186 460489 231475 181013 422844 326898 427129 289307 224908 373442 382918
14945 382918 500457 446566 472844 241128 325593 421748 21979 254598 53962 585645 360249
14934 360249 594359 186020 425552 445905 452351 543583 361765 522720 652264 855442
14924 855442 433125 669456 901522 751360 1031949 758896 710664 841544 902098 433026
14913 499976 632971 588811 153435 840018 373100 128004 576609 207123 369434 361443
14903 361443 356107 230518 222863 388587 459088 204402 333015 138985 480923 730432
14893 730432 116727 297352 449836 511691 447849 405287 379798 247628 721364 135650
14882 352211 602605 315961 421157 344363 665417 469215 736111 229151 476568 269927
14872 269927 620256 450612 335194 458436 439650 224017 557027 417527 470024 370768
14862 370768 337898 369717 285730 115219 269281 458116 404540 423333 196869 299405
14852 299405 221099 503375 415523 131286 231428 188794 355683 308694 316908 470703 542219
14841 542219 724415 842362 577432 715160 544080 552552 735195 796887 513609 517384
14831 517384 51635 313308 609206 246629 515246 334954 643143 482405 525459 495622
14821 495622 209462 131120 576873 527743 177028 672787 196954 482519 609751 583911
14811 583911 656050 278701 530671 605590 513840 321788 635485 448820 717680 497402
14801 497402 769277 429476 615026 227965 484453 876401 563169 792838 552068 716831
14791 716831 555470 609985 398700 434652 677312 708946 657904 430785 399264 142300
14780 542036 358418 379857 639030 512890 565847 594359 570520 442447 524582 433840 695305
14769 695305 387438 444438 466903 628525 358435 759400 667441 514872 610449 471196
14759 471196 579169 233241 377126 481517 533597 685710 812109 588535 583715 812431
14749 812431 596112 755743 784552 659614 818497 641540 496963 414294 468892 840986
14739 840986 649828 766637 884519 518533 643698 748062 819187 657961 843518 800789
14729 800789 708922 674037 833584 590814 403066 664468 947456 1214376 719013 1041252
14719 1041252 968638 1049237 935283 1059579 1185805 734878 617591 770098 694973 731651
14709 731651 1134548 904482 896774 1029258 691705 634554 763966 648734 929641 752314
14699 752314 493764 783268 1106405 1261661 989383 1161395 938164 1264739 979679 867152
14689 867152 732785 740429 1181400 985728 1010002 946820 1070796 885476 1056547 1178690
14679 1178690 1034469 1133534 701183 1038146 656324 1105466 1006829 926693 978727 1039133
14669 1039133 905974 1035339 1116965 915415 1002237 1012970 548575 844277 990130 923794
14659 923794 839778 963981 1427482 976748 978645 1015350 1283068 883491 926265 1176990
14649 1176990 1144101 962399 1340771 909415 1268686 1540209 908941 1300856 1001074 944466
14639 944466 905152 1266833 1013678 1146126 1140254 1185373 1068468 1026883 1313627 1256780 1011899
14628 1011899 1310494 1212657 1430150 1054788 831798 1123600 1082207 1112477 1365090 1301770
14618 1301770 1179477 862748 1619889 1478688 1435534 1165324 1577046 1195406 1697941 1528145
14608 1528145 1258654 1526928 1090710 1549684 1532787 1149845 1227006 1529091 1558533 1685570
14598 1685570 1334700 1484152 1646246 1359260 1651073 1599955 1523003 2122596 1553864 1534206
14588 1534206 1506697 1763659 1471104 1589062 1930087 1553052 1946839 1745587 1979200 1822869
14578 1822869 1972773 2079994 1892071 1933252 1975990 1980487 1894266 2137481 2438207 2256414
14568 2256414 2020624 2226356 2276147 2307888 2569953 2260135 2265278 2768438 2574784 3045908
14558 3045908 2825318 2946060 3304955 3107847 3979476 3870374 4768099 5338310 6560337
14549 6560337 8652731 13033089 20084912 30946362 30770659 17658811 10021136 5818233
14541 5818233 3470492 3336621 2786301 2322178 2250578 2526124 1987912 2036266 2202262 1831117
14531 1831117 2191675 2216558 2226158 2383114 1949218 2505777 2131382 2199192 2216816 2525830
14521 2525830 2301838 2395095 2438543 2797136 2357121 2546673 2374793 2355037 2679988 2839042
14511 2839042 2619954 2523704 2462588 2930368 3088937 2516669 2978973 2895633 2577537 2943535
14501 2943535 3131785 2984054 2955168 2914092 3362913 2997675 2992084 3123837 3385924 2921514
14491 2921514 3138386 3121694 3205873 3761683 3528932 3432480 3505800 3241065 3331890 3681795
14481 3681795 3416302 3617622 3846791 3359670 3836540 3567283 4067496 3812741 3878423 3925640
14471 3925640 4166806 3904441 4217003 4359085 4189008 4504813 4290371 4005038 4069979 4650328
14461 4650328 4462598 4598538 4450223 4410236 4614351 4570727 5102352 4674753 5050142 5114463
14451 5114463 5313595 5115035 5228941 5397159 5332989 5201915 5324266 5650150 5460124 5427522
14441 5427522 5333278 5924098 6238549 5965697 6192318 6012730 6348433 6132305 6261727 6621898
14431 6621898 6371571 6730706 6409376 6841390 6707118 7030737 6881762 6877550 7341146 7148163
14421 7148163 7607576 7424990 7558597 7820562 8112623 8435224 8408702 8393560 8231521 8603411
14411 8603411 8460619 8811348 8648083 8833823 9303587 9215801 9424491 9758812 9729905 9973169
14401 9973169 10131866 10472872 10267936 10486567 10769193 10903128 11023446 11240808 11533744
14392 11533744 11540777 11692746 11999655 12176745 11949869 12670055 12981995 13298787 13274239 13407554
14382 13407554 13679786 13997463 14214172 14502037 14820073 15111855 15451397 15630595 16062451
14373 16062451 16049164 16659527 16881558 17274416 17784442 17857467 18399295 18826867 19069488 19537808
14363 19537808 20043608 20576014 20675325 21377941 21692060 22235120 22714536 23340651 23990695
14354 23990695 24235831 25243299 25625277 26040787 26738371 27540878 28130911 29227276 29960588
14345 29960588 30594040 31417179 32226184 33108828 33866249 34981402 36292644 36790543 37841097
14336 37841097 39320539 40368274 41313888 42414231 43955594 45209894 47245338 48266511
14328 48266511 49906973 51700459 53116125 54975393 57068809 58869134 61040948 63265035
14320 63265035 65016404 67763186 70415920 72758427 75673747 78200177 81423292 84316075
14312 84316075 88410556 91275208 95314519 99607541 103780711 107978949 112808149 118027745
14304 118027745 123325699 128671584 134861129 141037598 147763781 155047460 162366613 170585705
14296 170585705 179036213 187504855 196825534 206379850 216161483 227312101 238365268 249805816
14288 249805816 262166236 274968792 288256886 301281525 315074275 329014913 342893260
14281 342893260 356928266 370580558 384082746 397085073 408833818 419871877 429750933
14274 429750933 437779212 442964253 445475835 446105068 446444112 444375606 440074507 434268183
14266 434268183 427715772 419281254 408402917 396032208 382500331 368119752 353243685
14259 353243685 338446329 323391538 308521526 293873747 279879082 266111994 253428320
14252 253428320 240846537 228739722 217412445 206764000 196509910 187161066 178165881
14245 178165881 169500866 161499997 153879053 146818791 140143744 133931296 127550745 122370859
14237 122370859 117167151 111800102 107045822 102468510 98363543 94320139 90708311 86954084
14229 86954084 83380937 80336956 77483581 74387029 71475060 68877611 66627931 64291073
14221 64291073 61878108 59874004 57728337 55859325 54055782 52280603 50663119 49216843
14213 49216843 47993511 46287630 45093832 43612928 42336606 41197117 40034416 39323457
14205 39323457 37830174 36935084 35635382 34455147 34117950 33508920 32428503 31325785
14197 31325785 30493107 29437646 28991421 28473764 27777084 27264901 26619353 25641833 25175007
14188 25175007 24532735 24162886 23258203 23189745 22397146 21889990 21693170 20967817 20510640
14179 20510640 20471849 19924729 19545298 18875172 18474343 18132215 17958224 17412376 17119748
14170 17119748 16781036 16498681 15989337 15933702 15567130 15792309 14913026 14772072 14801452 14278503
14160 14278503 13882948 13375072 13592835 13151827 12977640 12856014 12534120 12367316 12031047
14151 12031047 12337397 11882021 11411923 11471462 11260317 11146399 10719729 10575836 10356308
14142 10356308 10266926 10459604 10225308 9949316 9849376 9454233 9258906 9457506 9179456 8842342
14132 8842342 8723243 8874074 8665022 8519887 8476051 8099234 8221961 7759583 8126108 7794368
14122 7794368 8081549 7347820 7372397 7151149 7509678 7131262 7634970 7171496 6991197 6540427
14112 6540427 6629077 6808680 6666942 6235783 6538487 6272548 6240801 6325670 6362796 5807380
14102 5807380 5732546 5876019 5726277 5748173 5889459 5782020 5518743 5541904 5416908 5468166
14092 5468166 5460226 5541043 5245238 5265910 5010624 5360952 5150374 4908499 4785138 5130940
14082 5130940 4685398 4799009 4785355 4686735 4239534 4491091 4283979 4468372 4428484 4133751
14072 4133751 3825514 4220887 3997707 4308180 4169747 3684156 4510526 3681025 3732692 3944916
14062 3944916 3983510 4085305 3854059 3980416 4144661 3953970 3781303 3695245 3542659 3582590
14052 3582590 3641006 3925540 3529403 3595046 3339477 3489671 3178917 3460693 3188069 3760977
14042 3760977 3088815 3368203 3347429 3153230 3021079 3132842 3256965 3232655 3342478 2879695
14032 2879695 2585457 2939172 3090135 2970264 2826455 2430482 2980741 2739530 2718264 2952265
14022 2952265 2800350 2649517 2609446 2659601 2712429 2718177 2845111 2349874 2337461 2559099
14012 2559099 2219367 2485180 2834218 2492395 2029254 2485613 2157013 2265111 2134379
14003 2134379 2024385 2174379 2160422 2209246 2016967 2260217 2162971 2095907 2116310 2269936
13993 2269936 2639080 2895047 3612491 3745139 5052229 7853834 13814012 25537628 32956940
13984 32956940 23445142 14377555 9177196 7152920 5322391 4448587 3789657 3645543
13976 3645543 3459786 3232531 3311733 3004889 2942819 2545717 2344469 2394708 2363215 2552870
13966 2552870 2343390 2021103 2051702 2189188 1866622 2293715 1749482 2074284 1907794 2253924
13956 2253924 2166450 1829079 2302204 1988278 1967343 1728848 2030680 1585701 2295921 1769364
13946 1769364 1490742 1982696 1744523 1665313 1889372 1778946 1596679 1877979 1581781 1674211
13936 1674211 1498737 1796178 1908292 1728972 1565980 1557014 1779420 1629045 1619687 1529888
13926 1529888 1684058 1735378 1744718 1554089 1690297 1320262 1458993 1409526 1464749 1590653
13916 1590653 1385107 1536698 1360260 1582374 1730337 1311081 1549243 1563766 1402968 1269577
13906 1269577 1343977 1442482 1206834 1520621 1410296 1435860 1398297 1445036 1307421 1363596
13896 1363596 1284335 1316142 1292446 1690645 1437178 1135059 1274990 1301829 1029230 1437280
13886 1437280 1566362 1066658 1156983 1487005 1233214 1291657 873419 1077149 982781 1372134
13876 1372134 1250830 1424314 1391388 1057171 942691 883333 1462172 835496 1132611 1192496
13866 1192496 1296570 1198656 907306 974512 1015838 1223255 809894 822196 1484640 1109080
13856 1109080 1010527 1294935 1045654 1041985 473453 763177 1274044 1208383 1060355 1062825
13846 1062825 969056 1090780 1018434 1169569 1365065 798402 1033575 762400 881529 662599
13836 662599 1047101 903818 1205788 1111152 810076 780169 770378 1009442 873344 840199
13826 840199 761272 931528 1027579 1135528 966377 769450 885747 857588 993060 881674
13816 881674 984435 645542 875433 787120 1033138 714404 1086455 695027 964018 702798
13806 702798 858866 1108147 787508 824999 548093 551950 856469 788151 604462 918864
13796 918864 907931 557355 675364 445698 1088839 606444 815667 741075 808579 676483
13786 676483 769462 760084 595199 671533 837567 745460 644528 462018 624346 865617
13776 865617 575304 522040 833837 466267 983256 753386 705299 589804 1032903 583579
13766 583579 680176 651785 611836 764645 640907 836430 169741 849055 879229 372751
13755 500919 799705 489882 599912 785328 322299 869306 682799 641541 549498 689866
13745 689866 417908 773532 543589 543204 469806 913476 465914 501426 616342 636965 640663
13734 640663 754059 731798 363458 719763 580641 434368 502642 820016 655459 506901
13724 506901 519140 561119 700855 541693 354000 577316 214842 497019 348289 589859
13714 589859 577361 438342 520199 519133 495016 319656 492111 270847 568220 594048 617802
13703 617802 399548 506894 578436 526983 475125 437877 419770 805155 596086 551067 303543
13692 303543 457506 909326 828137 427845 780922 479508 545113 282473 261008 414627
13682 414627 532415 363719 658531 743799 545840 450274 445843 357034 796001 391649
13671 631826 695822 372007 358997 387737 648304 485276 727875 602761 721583 589212
13661 589212 573672 439814 581449 599729 289267 644680 633878 431295 461611 368677
13651 368677 355132 657244 410621 491898 592254 319764 453937 169446 304384 375137
13641 375137 394245 465902 562668 624639 391099 330042 351404 231016 376999 320653 553048
13630 553048 614213 681166 461946 297544 629318 684944 289682 527625 177888 324167
13620 324167 350213 276276 227795 436848 515902 603125 460077 344435 234433 253931 297674
13609 297674 219931 595901 210951 331978 417087 281700 357215 206635 476846 370467
13599 370467 363909 556545 420371 89918 218744 215001 325462 472002 651106 277422
13588 230015 303270 320622 495394 484195 -244307 285064 58818 34567 200468 182204 145841
13577 145841 598508 472516 529568 46434 389639 234226 199058 68891 315807 204228
13567 204228 575576 319029 49806 285640 227994 368615 -68186 342251 470863 355444
13557 355444 286358 348193 337141 325466 581867 185724 191073 162860 629872 243447 239706
13546 239706 23588 -8951 7975 305258 462999 356190 222779 352552 114361 408690
13536 408690 419017 209089 429568 418966 17205 411725 373702 483722 203654 400179
13526 400179 354005 193578 513746 294124 284172 327411 336135 230264 487060 44124 416273
13515 416273 422966 376384 369871 301214 363974 139985 15747 322812 107928 532905 114911
13503 189701 407042 302226 342777 117071 279417 514808 339404 80704 447716 418391
13493 418391 421735 472304 574298 482017 68800 170057 265011 506958 115707 513067 217134
13481 306660 395165 634384 286739 62208 429283 270443 288033 392560 144259 387252
13471 387252 517069 440823 182684 610859 128622 588100 270762 52223 -75416 523285
13460 505954 106341 170459 302086 100380 -37283 79575 190866 154669 62328 184073
13450 184073 225328 7291 80316 56440 581326 335764 169398 571109 79460 271773 151086
13439 151086 135379 74214 296426 93088 -7647 166284 349259 382060 9729 455785 51803
13427 124974 103343 173103 98535 247636 165905 356745 420120 219404 99843 334762 242947
13416 242947 254847 -69877 167134 68073 99589 293704 231375 228096 403589 -36050 -45418
13405 -45418 381789 -247187 309200 58009 21082 126125 125372 -41108 266713 -2841 122151
13393 566321 330296 78334 286559 106618 275079 113815 141464 442614 192426 115269
13383 115269 420288 130321 25436 227578 68659 386770 557471 280784 85166 -91930
13372 161797 54169 73102 339532 80058 111664 45545 306689 338529 35343 160976 -31453
13360 11733 -16136 248969 509216 290980 464186 85055 102610 -13959 -62918 192919 198442
13349 198442 209249 221159 418247 97449 449705 615381 450783 272744 314553 228777
13339 228777 151598 465518 -1329 367155 186648 127238 67674 489152 123572 125395 237820
13328 237820 109145 350760 75754 377261 250732 402652 -114261 6001 213063 145559
13318 145559 261316 -59078 169726 -108851 41945 384969 40206 352335 296856 72003
13307 -42669 133000 219175 67293 101457 188320 157074 208 -280420 104858 242742 -86762
13295 -96583 178148 203188 92089 194254 -170300 114905 269473 -73332 257092 78845
13284 422219 147157 243127 163521 78889 3116 300439 105464 -5353 70247 208623 119089
13273 119089 329087 157718 267505 257556 113385 71847 55377 349286 125866 167219
13263 167219 133962 382601 471465 281654 179819 15226 112818 -10032 370968 168328
13252 -21990 -155405 203188 -57622 175377 -33834 -41224 -19706 321700 203540 137556 98770
13241 98770 33282 229418 141741 219662 146172 92663 -94194 139986 398746 -118893 244970
13229 501835 286289 140305 209884 -39523 -76870 -237121 106383 -23410 38713 356406
13219 356406 446806 7215 198932 280148 107525 324251 141691 -65661 256455 -146429
13208 86225 311745 -163675 255367 106100 236951 -14501 -153047 -16916 21447 77288
13198 77288 292049 -37496 264394 76720 99909 8523 47714 242484 88003 -113634 164616
13186 186712 -43048 273901 340905 398818 -17775 99669 64344 131786 24413 329016 -214946
13174 294687 -178910 202351 80100 250578 -36147 319365 70311 252323 60555 183262
13164 183262 140908 -183970 -99984 -14758 -125711 -40550 -96529 141385 -8381 32088 201086
13153 201086 224319 381689 149527 -230728 -220870 205098 77651 -52623 43903 195836 312501
13142 312501 -29891 152882 21078 -124447 517005 293333 -38001 -85569 55492 26073 44413
13131 44413 289609 -157098 -26888 257888 162414 192637 -23968 309107 84429 20727 125779
13120 125779 71071 -247007 -82764 140095 -80722 -103159 -413261 27924 340395 -247927
13109 -7094 241177 41085 305365 146235 22499 430128 121083 -111342 -117742 -13658 5466
13097 -31293 216057 295916 200148 134137 111840 -218397 -53278 -120193 217913 104773 220152
13086 220152 195840 278386 14217 -355580 81907 311402 95774 -72251 -63369 121775 402935
13075 402935 54304 190787 10259 -14129 293851 149322 240979 268580 -115851 -34589 -121098
13064 -121098 34783 -20714 357722 27829 -60420 240032 -217538 177895 173914 178229 -90472
13052 162642 -179274 239435 398325 -65292 342366 294878 -111915 350183 -13061 -212790
13042 -212790 117185 362255 53890 85984 99071 194449 -163966 133890 149660 -103846
13031 -125293 171313 199551 326077 317831 -38748 294789 6625 -410640 152335 -113043 -45170
13019 -56613 43420 430275 -56096 244844 500512 -27006 42561 258218 257300 310625 148840
13007 143348 28003 188895 -16842 53764 323539 -83004 -137617 77701 -103804 -214806 -24938
12995 -36464 -19961 108855 56148 -280638 5078 -111507 -42032 38885 -55216 -93480 134587
12983 -127764 267876 188000 -58004 121094 187260 -287658 34135 -230612 -88847 113142
12972 175758 -19385 -144270 42818 -229568 76998 -29727 111300 57134 403824 169886
12961 -257647 295152 371457 86900 96382 102711 -42319 130294 175386 145566 300676 45914
12949 228829 -61064 -33257 -164610 174644 47862 56058 -250010 103227 -103235 136883
12938 -159989 -1327 277361 -90846 -146089 208422 265595 -280148 -25791 -137174 100032 378873
12927 378873 363044 -243105 129401 86853 -130150 94440 33479 278247 3374 381767 -320927
12915 -7097 94381 113946 -128723 6621 216907 -265759 95536 356912 -217803 210352 193906
12904 193906 1358 130096 100964 114159 -110454 -186226 56642 65331 279978 -36475 119752
12892 -26927 132961 -41257 183914 148194 -26578 316341 176973 113587 128707 84863 -95066
12880 -78303 -2830 -19097 -209184 -266019 104666 -96330 258776 243618 -127783 118615 84759
12869 84759 133579 170669 207587 306420 -89084 327569 125807 -162680 95466 -227312 209457
12857 -73365 9189 206365 -19205 118170 132745 105903 -5824 -260238 -427683 251991 35980
12845 61258 31777 336668 121481 36520 -429362 -204249 132526 390319 -1076 64632 -209663
12833 16987 15842 169196 340335 130427 227248 61916 118872 -77968 -82150 26277 67877
12822 67877 -44536 -183992 167271 -48705 -60076 136202 131122 -125361 130873 4570 70670
12811 70670 89115 228274 -39755 -259389 311069 249155 -516895 83751 55721 -139629 340971
12799 99249 -3672 120935 -267432 -33551 109719 121398 370480 154405 -163460 52266 94526
12788 94526 135507 -119500 -376370 7258 -205596 358686 -104514 -25951 275299 226819 -243350
12776 -135975 23949 -2191 -294309 -188587 -82083 -280604 -160971 61131 -257293 6402 278349
12765 278349 -115713 -147819 56676 -198576 -321483 -64096 -81527 -49827 6352 -383325 94143
12753 84870 -110574 23991 -202101 -61204 111673 39120 -120592 -356568 189915 198472 137134
12742 137134 18575 -284107 -7514 13536 -194972 -98561 63345 227983 -87246 236419 148821
12731 148821 332355 -189280 88545 29044 -162678 5134 -6084 -27690 255842 177896 -252195
12719 37785 -127301 -221853 11225 -69947 119154 -91315 109936 -10897 6460 -81225 -12708
12707 483524 188057 141062 -11849 85492 65767 59331 27336 63486 178852 1231 179873
12696 179873 65113 56618 -234435 -235804 231226 34999 -29022 -117150 -25677 199151 310474
12685 310474 360638 279738 412126 211700 -40185 173710 90722 193373 -155858 -78593
12675 -78593 135153 48210 -81882 13171 6474 -293175 -46641 159896 -82080 34447 63979
12664 63979 -75131 239376 272044 113372 129463 138912 515588 295938 89992 78093 346833
12653 346833 -10268 -369624 76186 201237 -30591 126950 -843 -141513 148735 31900 -246779
12641 -13506 -39021 334182 151091 165514 93722 17390 -181171 240031 158313 -10351 382302
12629 120062 174586 83100 23142 15978 98094 32902 160034 251578 249510 -25098 -83613 87927
12616 -125964 -221656 -428595 -296269 299564 -103818 -47137 -264028 -91518 12564 150417
12606 150417 78825 -77886 48599 52453 -979 13256 610180 -114913 85566 129118 -155278
12594 273721 -188607 147675 -258629 296758 240418 16031 136979 117907 -210137 -471810
12584 -471810 142617 155468 -36040 137063 100869 66781 -101642 -15565 99100 88798 205253
12573 205253 229107 -136844 56058 -94581 -139819 -130635 53120 52611 -139514 -397918 -37612
12561 101922 11853 156172 -224738 -385306 -282557 33 81398 -336102 40430 304661 -118713
12549 -244427 -3925 -166749 165123 -305908 72525 180042 -60203 178345 133858 -49991 180509
12537 72064 -61614 -280059 143729 -186660 -255591 193468 13608 -141567 -85962 -258503
12527 -258503 -119117 -433597 -164032 -85709 166408 326239 -2175 513103 58327 12035
12516 147007 345017 141301 -100762 36373 -28575 -184468 -230007 427465 -55197 86769
12505 -2496 108561 179717 67318 236331 268104 -72869 -3557 21551 115031 152072 -86660 67193
12492 -262325 254755 59673 13419 91247 286499 -83954 -152621 -83669 -53248 -144297 -4841
12480 60998 -204214 -177713 -143852 -28105 -323903 -68143 -19274 223670 11639 -264225 55577
12468 -127189 -290545 153425 -302146 65727 61332 -122733 11227 -285570 257721 -223281
12457 214950 -218272 -295439 -182098 -156110 -97852 135351 -176786 -94966 118562 27286
12446 143655 28188 13317 -36816 23631 379844 -19981 -169853 -121039 -127306 -48062 -24465
12435 -24465 -186660 12275 -151493 -24861 208088 169112 -122618 -192711 -285900 -188096 19158
12423 66881 -29289 12000 99432 280448 76142 13074 97977 253492 1699 20395 48068
12412 48068 -195658 57212 -117510 -42651 442302 251459 -186011 124355 -94601 281850
12401 -87435 -321787 128948 -6133 -74346 130753 -31151 -209602 260076 112869 -250222
12390 -52103 5937 369126 62993 80674 117394 277877 25738 -121142 67291 -80888 -119940
12379 -119940 -106053 -248040 188836 -212012 -148741 -41721 125409 -323692 -112503 -62540
12369 -62540 -180538 -46212 -37174 193761 -269050 39727 -197730 -148567 223669 -210704 -59864
12357 -81072 254273 11116 107967 -52054 -24039 -47451 -146340 49742 -221839 201607 113140
12346 113140 61314 136194 4353 350918 -65165 34060 136359 -69099 141767 222961 26782
12334 -107134 171105 143094 217857 -299531 68510 -212076 306533 108230 -374807 208449
12323 -173614 -123851 300426 185955 -100448 62604 107253 -33723 176069 23895 124235
12313 124235 11635 38961 40657 152189 16129 -9553 206757 -96906 -18830 9652 119171
12302 119171 -60866 -18890 -4594 133477 -216533 278257 -214304 -76242 381193 -140 -282708
12291 -282708 -358464 256334 -163187 119721 -107740 -174053 247419 6894 440357 87267
12280 -299002 47625 163730 237245 -178560 55165 -175567 -51196 149273 89567 -327442
12269 -312882 146481 325593 -6433 113787 241994 -44029 -114511 110844 220022 -25248
12258 -59480 17454 -168631 -172422 -43199 156499 -15656 -143978 23654 87458 355156 -213402
12246 -86412 304372 104361 85715 -121274 -155892 11713 -379333 121847 210476 -53617 -240487
12235 -240487 170338 39948 210167 58534 57662 368299 186591 188515 96965 351519 -73439
12223 13804 332401 -266035 294234 452638 -4164 -71177 24362 292228 189244 -67492 64772
12211 126704 -166254 132604 440971 247360 -107883 226928 239407 14642 54413 -295642
12200 360161 -204861 170207 -54731 -76670 58282 114289 335089 -33861 209739 325268
12190 325268 18634 137279 131573 237640 215216 126645 216694 130635 -93870 136546 318256
12179 318256 -8645 477990 279600 -50065 18884 175448 162367 125685 4981 -108272 131789
12167 136932 -248000 96280 53956 -89335 -88870 218140 -193755 -38838 329536 174570 -183045
12155 266519 200812 -66431 97504 -27124 20002 204729 177927 210584 -252106 -233629 107488
12143 255826 137948 72305 -53994 242462 193500 99505 -81103 123607 34865 148491 340541
12132 340541 19271 36155 73817 83079 -33542 16815 -149538 163711 108863 110187 -40527
12120 57870 -58347 -82171 186859 156013 -17410 159851 -83978 372107 239491 191406 57537
12108 47430 -244848 22795 217181 -211569 29851 -62927 86826 112228 43239 -23120 83082
12096 275135 64162 116412 -11825 -70735 24302 -375410 -41859 -78056 25496 157120 -147173
12084 -8706 -46707 125022 21504 -237470 -82513 -32263 88715 -246932 33204 152992 -44933
12072 -121494 63685 -23578 -297348 76023 -142651 180175 -85347 199859 318282 -50649
12061 -203431 336835 105493 354957 -9621 181326 558654 623044 13239 -227322 -280778
12051 -280778 254310 5280 -267240 268815 -63378 8017 -94773 44496 -173914 -269034 347685
12039 -121604 111585 449113 -78307 163789 -253342 -58069 -114940 -190149 105730 -21689
12028 -326264 -79602 214363 -123202 439607 123298 -77610 -307812 -28010 328579 313264
12018 313264 -264714 -123612 -86812 3089 13444 -185377 183449 -11475 534333 136901
12007 -17142 -98490 -237833 210981 104663 -292093 -245347 -26131 186261 -156122 18724
11996 -121045 136727 72569 63455 234465 158658 219873 -292696 -15653 21854 -156243 48671
11984 -109591 -193868 180322 196121 -18221 -81494 231134 290346 -193576 -277005 307665 -61998
11972 -150055 22273 140919 -3436 -20694 111475 -183488 -317010 -112034 -174369 -325267
11962 -325267 -337471 -4761 -149406 -200242 -30842 -74886 263216 -291703 -83849 -9167 23763
11950 -8150 -23435 -1245 -129041 56551 -234478 -66182 -144569 -237518 200032 -17884 246895
11938 -92412 -93250 376110 -84182 84252 -261777 -17960 85884 -117573 313577 -274145 -185363
11927 -185363 248611 171774 -19405 -312545 381222 -93526 -38795 -82317 26539 -46276 58409
11915 -70074 93588 -268456 111066 128872 -93851 -94212 -162637 16815 30790 56670 23617 -81027
11902 -123593 -278667 237785 -110375 -23974 -80979 -98330 206236 20251 -198751 12896
11891 -49125 86147 -8851 -16333 -332978 219067 -302587 -30789 -185961 -259908 286881 -63174
11879 -133214 275708 206497 -63309 281083 -33895 -72581 116147 68990 -281752 -67557 -1166
11867 -20402 -165894 -116992 -80551 -58666 105430 -46736 -302963 -156367 295892 16436 -113636
11855 -195591 346399 -458013 41147 22111 238665 288150 32276 -26143 -44885 -88270 139178
11843 135879 281723 -16468 -233076 340851 -90619 -262013 -4152 45896 114161 -45976 -260952
11832 -260952 -225285 235625 -395948 -32462 -158474 -253429 34348 -74211 -166248 -174033 81626
11820 -201809 -123687 140044 159042 -298659 -464075 71028 -243152 -123798 -3058 -21752 -219925
11809 -219925 -45868 -9371 270622 -226558 237203 -33886 294482 111918 160659 -243938
11798 -92035 -195940 -86045 62592 -15287 -286727 31245 -7866 179837 -270768 308168 87482
11786 216146 27495 -7206 -122638 146280 -147432 -84835 93545 -107677 48863 -137810 27704
11774 70599 274407 178574 72026 -294769 -75510 268876 -118845 -31086 509395 -105663
11763 -1552 98721 112920 -236095 -23550 -354762 94348 5282 -88788 -149708 184988 299418
11752 299418 -9678 -100576 -26339 -80096 -241556 304702 -109847 -297128 -124919 117991
11741 -35190 21729 -1672 50447 -172745 -4 -133895 -156843 110024 -98565 -10538 51912 151786
11729 151786 103866 -41129 -114001 -12851 -171742 -166688 -6378 88847 251609 43624 91373
11718 91373 -159360 185381 -229524 281325 106881 -267891 -279137 41623 207538 152238
11708 152238 194835 -138726 -63719 -105680 -41045 90832 -10453 -32832 335823 -78172 236472
11696 -115464 -12313 214240 -51258 57178 22903 150230 64634 -138552 -12870 -25705 -128256
11685 -128256 514006 -83549 370072 -46883 -53686 -195630 249279 -5125 51764 35579 -585343
11673 228905 45680 152323 -288476 -55071 22072 -197659 203913 -80305 79662 -115891
11662 -87421 106748 -226216 16758 -49247 -210614 -100559 99720 160371 -261537 29996 -215685
11650 60292 -180052 104906 -187190 -2542 -38421 259696 -310787 -59518 -167929 24211 -183321
11638 143827 -198853 -28431 264194 248077 -33015 -53891 -121620 -5584 132330 93657 -82045
11626 110537 -226493 -5419 143412 2107 181982 -141918 33131 -123695 -320270 98981 114246
11615 114246 30260 351982 56828 108448 350985 110197 -258642 -214990 -152831 256989
11604 -251021 -946 -69734 49833 143327 137159 303236 93220 47409 -15795 227115 -128055
11592 60219 -98523 126545 -305763 -12222 254538 290583 32194 178660 351833 129682
11581 -96479 -242594 -260305 56756 70155 139399 229558 -81882 138839 144600 -189502 344749
11569 143049 55247 -33086 128136 140617 86016 -60094 107087 48250 -7863 -79746 129428
11557 -58583 82643 23644 -19478 -344804 -149257 61655 66873 137847 -39716 139662 126327
11546 126327 119951 -109948 -14679 152724 19925 98799 -72290 124509 -37987 3552 173349
11535 173349 -66624 30151 412282 425398 -16274 69343 17772 220188 176857 154025 -156145
11523 35611 16934 -201081 25295 -161471 88599 -24990 231398 -21779 61066 124743 39092
11511 -118342 71665 -128264 -43521 311476 455033 322629 14041 109787 -41409 -338899
11501 -338899 421809 87223 120804 -70699 290161 -22163 -84246 -230856 344609 42407 500421
11490 500421 -126878 -52244 -101127 88803 -42609 134392 305596 172350 -253457 360690
11479 -63894 -81277 -50313 192203 138376 48567 41707 -152639 -102372 73058 130418 213456
11468 213456 230873 -111364 184399 250842 88912 288304 -168980 364473 -140109 154327
11457 46234 38760 84262 -195559 186268 -49260 24038 105714 97955 93480 283544 -66728 -39360
11445 -39360 387366 106974 -50126 300332 35205 -38911 83087 -182300 166257 341533
11435 341533 -1878 -227221 52658 276185 -277082 199104 65413 -45438 -159792 576206
11424 -27135 -350719 185207 -181730 -186894 100124 -172884 113429 47057 -208801 -163753
11414 -163753 -154842 -119449 111447 -400498 -292847 -31043 115424 22812 71195 41034 218838
11403 218838 38362 241449 61267 -311762 -189500 9775 -99784 4553 -48467 310670 -378915
11391 320748 -102231 -110166 -215177 -82669 107863 207560 -24096 -23051 102332 -136256 21210
11379 219124 -195089 156822 -171801 72916 359503 152604 -495956 -253006 225287 -192167
11368 -11435 68513 90389 -74135 -14693 -2135 -97418 -401314 10439 98059 187382 -46364 -96727
11356 -96727 -159931 -86465 -172939 5163 -91379 259168 13348 451601 246647 130157 223166
11345 223166 -33794 -262351 210514 21052 -94207 30172 -276833 -228102 130636 -208882
11334 -138593 -132955 177083 -38372 130302 -57886 98089 -68723 -194956 -111412 109437 206616
11323 206616 -125773 343620 30923 -203629 90639 330867 44779 -169740 -144409 -102108
11313 -102108 57485 -100269 130218 142398 -439766 -107513 -26061 145021 -2856 189390
11302 -75008 22170 -303953 -169284 310091 65892 160749 -1396 179546 -1396 -102309 -44850
11290 -214810 -180469 3463 -25390 -162887 218869 40730 -262873 70212 -136776 -130998 285626
11278 211553 -230037 106286 -38396 190497 -81845 98232 181969 -129133 -92716 255666
11267 196531 -265554 -135177 -240031 -79423 296024 -43856 297581 -298076 -53171 20785
11256 -190473 -160377 33685 -90159 15990 -50047 -209190 -116890 256913 104464 52989 50774
11245 50774 97263 255473 -174359 122147 156540 -366166 -86193 -37000 -119326 56725 180806
11234 180806 -300083 -59278 138598 123656 -194383 1080 18093 182682 -196623 221075
11223 276170 -108735 118865 70142 -99843 -297754 -247306 -250085 89737 -9484 9350 76037
11212 76037 -108336 -79482 -374720 -372395 39949 -289341 163130 -519396 46779 -208236 -177432
11201 -177432 -70418 110638 -20010 132541 -392840 249545 -17626 -483859 165066 -237931
11190 41093 -137225 -171462 -70407 24733 -313305 -17192 10915 -127359 -3309 22826 -249760
11178 -98938 52155 -280355 123342 180369 64885 -2208 24230 85028 100454 108211 70700 -560372
11165 274295 -176143 -45371 -271268 358753 -217242 -32089 243856 86858 -182246 -104945
11155 -104945 -354724 -90914 -246985 61013 -185359 -173390 190464 2654 -233403 -379458
11145 -379458 151727 161029 58106 -276176 -178957 -180446 -118249 -36062 223189 351970 -197405
11133 196531 276000 -65129 60216 138761 26273 -27243 251471 -16011 -237199 273436 50964
11121 189397 -111891 150610 94920 -14296 -96173 -350347 -339862 -159356 -8188 49638 276277
11110 276277 16282 300962 -397274 166815 -8163 99852 30247 560554 32475 1652 67927
11099 67927 -22219 300738 123396 74361 199303 -133402 -80951 205 109515 368310 257584
11088 257584 203360 -34010 159904 116554 203868 450967 140758 480154 -151377 62318
11077 190658 136314 31540 157403 424467 355657 147295 182290 166693 316669 138253
11066 36817 337466 229173 401183 179671 364372 321816 416602 409354 99584 436794 298389
11055 298389 459800 176468 585124 434698 382829 295004 297426 499639 491327 321534 488838
11044 488838 462615 287755 576955 478331 494114 174286 838936 256853 434043 346955
11034 346955 363814 281024 523817 366986 647141 242076 273348 732219 461923 467037
11024 467037 507276 540177 787690 775374 536929 555305 373172 411186 708970 447979
11014 447979 539948 431922 246376 299091 374658 405130 299402 403777 570861 577046 758541
11003 758541 501988 420934 155544 622328 504572 101659 246395 380884 674419 421177
10993 421177 598306 699431 574504 495537 805363 376250 415774 256621 623664 730081
10983 730081 456020 674562 517025 1009015 767412 891245 934922 932791 1260283 1406607
10973 1406607 1051858 1136982 1291987 1575468 1955467 1670022 1803911 1611722 1759917 1615172
10963 1615172 1342246 1285026 1229805 1055659 1063562 796354 1248142 943144 1114320 1280100
10953 1280100 1066210 1098627 1013530 851255 911456 656130 755843 451182 317690 98407
10942 321172 477413 281204 -114230 80808 319894 8064 417031 111181 354352 176263
10931 90581 190453 -61761 -60911 152114 -151418 -21866 222854 -53053 167541 2442 59652
10920 59652 166802 151878 -229775 -23136 29397 31705 -43163 -142506 -13079 -74914 -220169
10909 -220169 446025 -35956 -43043 132521 -86982 12959 -36691 -37849 -27901 -183869 -72234
10897 1283 -146863 -103901 -63755 -496696 948 158365 59207 45328 18088 -279437 102204
10885 188270 -94909 -3219 70789 -6710 -106436 92396 55804 -29494 -329179 -91859 -29443 316790
10872 165153 54543 -116631 40754 39403 -4315 -101081 -397215 -78062 -267415 -2386 115009
10860 -16045 167717 163854 -85277 -29523 47636 -35807 -149796 318004 183707 -233014 -13152
10848 -207621 -28968 172770 424478 43621 -98428 241375 -24134 -247388 -375192 46327
10837 74576 -202103 -134240 -329884 -208952 -139290 173320 -145931 193511 48041 416758
10827 416758 45671 161955 -33264 -187505 -129204 -316996 -13613 -145898 -64030 -287975
10817 -287975 138000 314285 -98723 321186 -182285 6556 -1002 -45465 307611 -92955 -317798
10806 -317798 384362 -121616 -52927 174369 -79070 271033 -186266 187588 184356 -58232
10795 -109312 161684 -192269 163088 -84395 -27075 270657 -212347 -203719 -52491 -71095 223553
10783 -171634 -203020 -5542 -23798 -97234 54555 -114074 -6212 -344084 -75574 163836 13401
10771 -127650 -58809 60203 -47341 188612 50854 -33437 -311699 144475 145233 179222 -277807
10759 -204571 -192936 -101569 166997 -243414 -78529 -173755 -89030 -29115 -426459 -4792 266554
10747 -22227 30732 65061 -185965 149473 51397 52765 -236613 -352151 143153 -79059 105212
10735 184001 -48067 11827 -234729 -95287 -181056 -28932 -341082 -59888 -99833 264900 -423218
10723 -315979 171353 -64222 281857 -376678 38695 -115161 157511 -40814 -205458 -49835
10712 -88106 -218143 -220538 -268876 99486 71366 -15114 -249268 -153321 42767 -129349 -344483
10701 -344483 219773 60804 19965 68402 -209035 -308379 78650 49758 -114115 -175863 -38703
10689 -96886 -171367 -321817 145633 140868 105063 7869 -131130 35563 234749 -319659 124553
10677 -186148 -178410 -338590 -164337 -30901 -89035 -160856 -286246 161959 48656 148848 87072
10666 87072 -78682 33105 -104338 -52124 -211371 -376009 -149330 146608 105374 -361667
10655 -287535 -362126 -125285 -280291 207064 -121085 51055 200520 202152 -194868 -321864
10645 -321864 -540663 -138153 32064 -140315 -14828 -168915 -101749 -212881 212193 -149109
10634 -151503 63799 -136875 -15372 -140714 -8054 38393 134685 -67430 70590 -93781 80346
10622 -126614 68481 225077 -91037 48111 107034 18548 -419943 246019 -189565 -107006 97270
10610 -371023 -28410 -12803 50876 -299865 62247 455625 123055 111419 -142535 -12747 -138257
10599 -138257 129963 -303519 -123246 173371 -380358 -14567 340370 -216389 -23763 -129663
10589 -129663 27689 30256 341790 69281 -93615 23629 451096 57398 -57575 -206326 5623
10577 -2317 64514 -90508 -218038 44489 -176177 -303110 -152529 -175127 271469 -237637 -364353
10566 -364353 -275093 -150424 112206 111811 471200 -37071 -81817 195320 -133026 9904 81801
10555 81801 178671 267211 304665 -130339 -250033 103175 100330 85111 -15075 117815 -47717
10543 -128915 -154668 -187017 -77358 -63591 136442 100577 95150 -132793 -402139 -139943 100638
10531 32309 -13518 -73856 -261880 84091 -218030 70956 16697 -229396 -46043 213572 6782
10519 40157 289542 -93012 103344 -232408 -24412 -97819 26941 -241948 -406689 226346
10508 -453231 290801 -120090 148092 28473 73352 -200828 85120 -165808 6505 187368
10498 187368 -143296 -72733 -88364 -14434 -21009 204454 250299 -195331 66768 -251472 -12494
10486 -22451 -141377 -112357 68871 123420 205087 462198 269105 109404 29810 154158 -24294
10474 -259939 26445 -252091 -79549 84642 146482 172742 16722 -159488 -465446 124939 -279092
10462 52041 -154899 92450 116824 137968 -150136 -136359 -20764 22932 -3310 25447 -337205
10450 50426 -230019 -83278 20656 363456 206054 -1872 -49202 42523 -44221 171229 43014
10438 -182566 -561730 -190007 -100297 12345 -23448 71378 -154967 -103370 -254835 55593 53451
10427 53451 245361 -143211 6674 -30250 -111806 -6418 165952 52242 -101529 239449 137728
10416 137728 -19523 -99350 -128264 -132078 15345 -140571 -151130 -192 -206594 220870 -61084
10404 -56790 -113062 -354366 17982 59374 -17321 -150425 -29014 254069 187270 239744 128261
10393 128261 16401 -128239 135271 154912 -14126 -10374 -130320 -162198 530868 262208 -70614
10381 157857 74507 -138948 -44275 -87022 198771 229175 359327 209660 15549 118943
10371 118943 151276 36218 -56996 163281 192407 37345 452864 362397 100093 369038 335393
10360 335393 155396 157975 -26871 70466 433851 58829 120323 179208 32817 74517 430576
10349 430576 75424 107965 334872 -119404 446076 291331 -26146 337431 118195 12466
10338 191270 283686 58397 200703 -44302 171509 -161918 173140 -64932 563973 -266082
10327 -86291 64098 111829 173320 81581 -175378 -830 120871 69888 12151 -300152 103716
10315 70815 -170958 76712 -67327 -7134 -69639 -105607 -133300 -4425 101229 278203 224782
10304 224782 2374 129024 115770 -33394 114757 207200 -141534 -23504 -11347 90048 143433
10293 143433 97900 332 -369936 -137501 -13635 -315529 -41512 115005 234249 7118 224966
10282 224966 105994 -407415 -83391 -82564 44221 -43934 58257 96675 79925 -70373 -126572
10271 -126572 369832 -199716 -62076 44177 -183447 -158645 193446 237666 141204 -173470
10260 -61663 189119 -124576 -39992 165934 242252 44661 -33260 366033 -181233 -230949 75987
10248 2582 -81382 170657 90359 -89740 146333 -329532 -124329 147879 -260924 -45515 -24627
10237 -24627 -12021 -154820 135670 -30539 -199238 -434753 53781 -91070 -153861 -278659 -295767
10226 -295767 -377710 36007 -59298 -159854 -114752 -107901 -76051 -117320 103542 10167 -155276
10214 -365299 73969 188572 -145338 -126826 -56222 84811 27325 68236 53821 137026 -199648
10202 -160616 -127766 45099 110452 31680 -231673 379457 -162696 -170215 312724 116079 182202
10191 182202 -251665 -206012 -157867 -104033 -168834 270983 -507947 -188648 -19167 125987
10180 -251036 -218560 121748 -24592 124212 -157758 -239985 -91649 -46076 14685 -100810 104567
10168 -300714 289982 -17271 -5086 47966 -60506 -80630 -235417 92655 -32193 153203 16940
10156 -137111 -351310 206923 -352403 -87748 -140292 -130147 193031 -90321 -131814 124970
10145 -109665 35771 224754 50764 -11454 -171552 -236949 -36001 -68867 79560 43227 144393
10134 144393 -144798 -62416 -114879 21855 46562 -81109 76220 -141511 24335 -207628 -260920
10123 -260920 148673 -73359 -44251 -185881 -34643 103183 -242688 114250 -90985 -97584 -70569
10112 -70569 -52902 -170643 -401377 154577 -202392 55575 -83328 139283 -158204 170026
10101 -89924 -75656 -44451 -454 9615 -60744 -310283 -297995 59293 -432252 -38839 331077 -177224
10088 -316158 -8113 173103 23066 -46245 -171296 -51402 -39962 -21061 -490955 -64337 -66145
10077 -66145 -240563 11376 -168268 286645 -209124 -71594 -47708 139070 29919 -160333
10066 48359 -228695 38833 147741 104083 -216063 -150855 -184437 105263 -155249 71022 2396
10054 99145 -412986 200956 -77005 -103979 -285559 -10037 -288376 96281 -267183 39626 -398446
10042 130583 144068 -122964 -201545 -397515 69750 243852 -291625 99736 -132933 -217274
10032 -217274 50380 70903 81242 -149068 -191537 -228853 61631 -239243 23793 -28109 359
10020 -291923 40037 -59934 148850 -158813 405544 -148498 -16336 -295739 267041 117215
10009 -73710 -198069 -84392 -328308 -319569 -73647 100713 -255523 -202817 22834 61499 -281644
9997 -81682 -238438 -72245 10980 6458 103807 -213319 -137295 -368624 244360 -25222 31843
9985 -329805 -147278 -214622 -77241 -207428 121999 74173 178903 -248155 133785 71369
9975 71369 -100624 295835 -583270 -117211 26909 -5456 20019 -49247 146813 26941 -141750
9963 -159625 -264284 -486824 -103005 160644 -220809 359284 -27705 133477 -21295 -281896
9953 -281896 107343 -299926 -211362 -78456 -135841 191949 -88692 36771 80607 98090 -279024
9941 -164269 -143217 -73931 -33303 -512693 33611 -64584 -163570 57194 213275 -367118 471412
9929 -239969 -68329 113791 9995 -205965 -239506 45159 -10353 90944 -79708 -258353 44695
9917 -13908 28058 -165902 182481 273193 153105 -58230 -235727 -78469 125950 -40636 15651
9905 8205 74370 -177115 331662 299153 55801 -238042 380212 -33879 108881 165855 -302991
9893 -165288 -304190 164533 87983 -216933 3928 -138398 204182 361364 -65109 142970
9882 371525 220894 -108485 25785 -207436 -154421 161975 -320228 -82623 306777 -122950
9871 -265202 -111125 -191559 -39814 -57604 -253995 -61244 -181797 -28915 24136 -214219 49609
9859 109338 54225 -138416 -33364 -12235 -2966 -169084 -18813 -116039 97093 -3128 -276134
9848 -276134 -534931 -81306 -195445 291914 133755 -52406 -114942 -182715 -43847 -336353 -23242
9836 -226777 -430412 -118732 -201980 88571 185482 -109754 -63602 291357 -54060 8408 91494
9825 91494 -95917 -6889 139850 -107190 -184043 232794 394565 -183518 -134380 -11648 60974
9813 -55909 -381027 -15713 15388 -282650 -231822 -76572 -51282 -130376 22245 32531 78341
9802 78341 -187757 -199032 -20268 -93227 -233602 -81642 -11303 -19942 -273598 -171966 -74079
9790 59417 110796 -51206 -63202 -144474 -5389 -35699 -380649 80056 -191694 36165 -44530 11982
9777 -228278 139660 -179062 -334304 279060 -63726 315947 -185998 -309257 96390 -224695
9766 -158554 9225 -58042 41329 -64097 -255528 -113222 -233461 219789 -148326 9115 -167366
9754 -83561 -108885 14925 -24297 -144564 120299 -184869 -616999 -161657 -4397 -113040 56938
9742 -48033 -186883 -243984 -569366 272679 178864 -77619 -151908 -272996 -74733 87170 -197327
9730 34455 138555 20145 -49085 -299637 -219393 -276304 155447 -92636 -7694 -105649 -140005
9719 -140005 159202 -23167 33023 27182 -106842 10037 268902 -152875 -155601 24085 -224898
9707 74268 146415 -221641 -231057 1160 -52395 95986 -170652 83141 250461 177029 216710 104137
9694 -237243 176754 103845 9045 -362262 21153 -122378 339305 16152 -94905 -62761 -63173
9683 -63173 448090 -227391 358600 -104505 -89117 133985 229593 306340 -256613 298172
9672 8854 36067 -141161 60684 -65174 37597 -75861 45557 -94422 -146479 -35472 108667 -197487
9659 176857 157049 19956 -267478 -435 -92089 265359 -282985 -245992 -139221 168234 11961
9647 -31747 -33141 -213746 45441 148623 -98260 -3008 -56078 -43254 204929 -121706 25205
9635 65825 -416331 -113738 140568 43880 -58285 -3465 -84133 -96729 -249046 -292343 120093
9623 -131560 264547 -6751 149376 86593 -406172 -166868 127608 280455 -113705 149253
9612 -207074 -86822 -62150 -83598 -201652 290159 -119494 -123918 -19923 -64275 -60851 -281623
9601 -281623 -297877 -162619 -138956 -66847 -56109 339867 -53278 -411824 108059 -258402 -4360
9589 -47688 11624 -335025 -205486 38156 51024 47310 -42628 77296 -93683 -218903 -112507
9578 -112507 -328034 -138993 -66275 -216235 -299034 -429613 -311923 187815 -130021 58660
9567 -137019 -86649 -316876 -403673 255964 227014 304337 216187 -164218 165936 -117733 95282
9555 -70044 105610 134049 -70139 -114863 66696 107373 -27770 -37350 46720 -132480 -37089 110712
9542 -72686 -142481 -66361 -188232 81110 -218344 -35794 6172 -80124 -264366 56017 142501
9531 142501 -205665 286888 -189259 202250 356703 118450 9429 48849 107461 184877 7820
9519 55330 -227392 242717 -56658 -3598 -181105 -79195 -124869 -247663 125913 184568 -195768
9507 423258 -62526 -104270 -116630 -202491 26070 -145880 -472141 -182207 65437 151555 -130936
9495 -210271 189789 43736 -181135 -142692 24439 -401677 82155 -323993 39534 98344 -94788
9483 -60696 362129 34356 306993 210508 -124003 182988 176738 -39187 -111471 138334 263317
9472 263317 178064 148147 6543 -43596 -58606 -253294 196893 99752 -13986 -145466 122782
9460 -52130 -13076 236337 -85564 -121748 -16153 -412976 93641 -302925 113063 10702 213231
9449 213231 314079 -274902 35682 -127861 -21239 -113635 53599 -103190 -136149 247497 20083
9437 -556475 46867 -223103 -194280 17692 489115 -304897 3287 261751 204880 -64638 -205755
9426 -205755 95650 -10299 -303399 69017 -96005 -285525 84389 27362 221903 -109467 -188149
9415 -188149 166271 -451183 -151717 1939 -138721 -64930 -39234 68107 -328590 208285 -176013
9403 -57261 -121788 -133865 -160576 -26513 -215831 -406356 165723 339589 -289817 -57873 -35748
9392 -35748 8775 -150214 33704 40010 -140141 193034 -324929 157695 -4779 -121569 -152799
9381 -152799 12927 -259340 -196313 -341839 -73207 -447790 -218667 -102987 -349816 -309417
9371 -309417 -165968 -129633 -148101 -251285 -148746 158930 -42263 -223708 -99149 146880
9360 -283974 71369 -9211 73562 -81919 -63271 165953 42738 -159541 136647 -200623 -108402
9349 -108402 -1450 -113713 97833 -241483 260980 167502 -147115 -72627 -161351 79071 -253547
9337 -138263 -71922 -346892 354741 -126712 -228898 34993 -55038 -203469 322458 -158294
9326 355547 -346850 21243 -118623 -19859 -192376 53964 -174590 -73588 90680 -39436 -280796
9315 -280796 109611 -243178 -166722 -94070 -121928 174931 -99809 -254328 -255642 95095 -167809
9303 2155 270692 -235748 -49832 108853 -107221 22717 -140770 186300 -60753 -258732 475991
9291 193032 12524 -124963 483243 -170464 -190750 -219152 -119378 206355 -48107 -103909 10888
9279 70268 -66493 10243 -44945 -97446 -177680 -176586 98596 127126 294441 -423307 -45750 -56205
9267 -56205 94988 105642 -117897 -27336 -188381 10963 -209596 61779 -81066 86672 -111472
9255 291523 -121053 -226556 122441 -71001 -163064 -3637 -7640 20086 -51234 -63100 -132227
9244 -132227 -298776 -59105 -255497 -71476 -292860 -89500 -33013 -220263 131973 -81697 -352335
9233 -352335 256151 350450 -212732 -208033 -61258 -47199 -51527 3370 -209549 -303033 -200833
9222 -200833 -95913 62823 -283834 246861 -204225 -120972 104027 -173589 -97392 -81802 194041
9210 -165763 -53827 -230076 -85748 -194891 -81554 -219957 182148 7745 15847 -11511 -22024
9199 -22024 95656 -256230 -45728 135178 -187031 -50616 324001 -90455 107609 -329191 100460
9187 -159604 -440986 -193893 -136989 -260676 -93524 -163202 120300 16005 133606 -127312
9176 -37477 55436 -24589 94222 -376429 49929 -383446 -115470 517385 -243440 -88668 4787
9164 76266 56504 64583 207896 124986 -131513 -56038 14437 -239670 -148274 -148659 -399219 -133460
9151 92315 -5616 125734 -205249 253904 -82993 -240857 -248712 -151891 272412 -150621 199109
9139 92681 -200171 -191388 84860 -63918 110587 177483 155445 27551 -10802 24371 259986
9128 259986 74830 232732 -156212 30158 115715 -157566 101116 121648 -461348 -275665
9118 -275665 143417 67430 155737 -18185 -61460 -240297 51272 -139262 -185764 102408 39890
9106 -521040 112167 64652 -289102 -168182 -25668 -1091 314733 262404 50511 -163106 -145832
9095 -145832 259573 85416 -6937 -552016 -225738 -8791 118209 -125343 102674 -290288 -83277
9083 -177323 -295002 130219 -310766 -204925 34442 -24012 26317 -432639 -6478 347321 57220
9071 -253139 -27874 -265820 -364895 -147115 -112479 -7256 23601 35392 -500470 -78932 -196758
9060 -196758 -26635 280503 82891 -220760 140030 -16917 -22253 -145038 175664 -151617 -188931
9049 -188931 -70704 -318815 100976 -265101 31539 -240346 -254133 4864 -123367 80491 -7046
9037 -127436 267805 -117544 15680 83767 -20729 210042 168743 -211039 9502 -21981 -136521
9026 -136521 37378 98345 20708 283379 -99762 -39066 187943 -121331 54538 64386 -156092
9014 0 -131595 -156280 -232975 44402 64662 181517 48228 -55106 193544 344763 44949 -147752
9001 -457790 50473 -135766 -86487 -282630 78165 113093 -54157 -12545 217752 -69897 -36798
8990 -36798 133516 -168350 35098 29638 -165053 95368 -91456 -213767 -138885 157649 -123043
8978 158898 231025 -71728 233529 -122752 -438536 54325 -390053 88707 -433768 133384
8967 -146933 -482333 -99910 -115152 21250 367732 -87646 -238536 131211 148058 64609 107134
8956 107134 175027 -101903 206981 282821 -370741 -241813 -21288 -72831 81161 -563058 32301
8944 -22550 -93743 -120296 139710 -192905 -147871 64844 -156142 -244210 47497 167669 -206166
8932 -24813 -32257 -177805 -214983 -356596 -354015 122438 12807 -240955 -21586 -349550 -133516
8920 143850 626652 935091 -18253 347959 -242084 -66360 -66557 126311 -89938 -13879 -22912
8909 -22912 139908 -149256 -37219 212239 -117648 161618 -236259 -173198 -253088 196515
8898 3681 -5667 -29051 -8652 -89567 297808 -308265 -31812 153782 37080 -24010 -129627 208407
8885 -79258 109170 -166236 -24318 145557 -99699 175851 -56721 -20068 -34127 -128835 -123758
8874 -123758 -15461 -80746 -340396 25567 -84846 -254472 -45994 -1620 -141271 333711 24400
8862 -74877 -56031 -241777 74929 -72906 67796 50935 -153898 129864 -38290 -86199 -113635
8851 -113635 -86806 83143 -486722 -52951 64108 -53926 263321 -159491 367682 303450 109513
8839 116265 -283429 -294265 -189147 -262374 85977 -223999 25736 -117506 25925 -148022 -6081
8827 65166 -2423 -232703 254280 -128054 -189275 103236 103929 -51665 -120534 -258093 76787
8815 -60344 -432777 -358922 -351475 66659 -230724 106461 -165743 -190585 121639 -133096 -19934
8803 5229 -127202 -117797 -84417 -347472 -84672 -140941 -16101 -248871 215462 39519 -143331
8791 -81587 -104072 133978 -55687 -205767 -376083 -181933 14056 133338 -246160 -41780 -127253
8780 -127253 -227255 -238930 -43029 -28971 -142314 -27559 -79687 -42335 -58306 137578 -165488
8768 -122733 96145 34444 -69775 -104337 -3875 -118767 9878 -45324 -294242 -227316 361527
8756 71891 55283 -377132 66149 63593 -103377 13830 233525 -438977 19803 191061 105401
8745 105401 -19950 -359433 -310291 -30850 -70415 -120579 -9038 -9165 38943 -269989 -41934 40726
8732 140746 -120350 -97417 154374 -96241 -187949 -385798 176010 -150972 151971 -160031
8721 253075 -22480 -100546 79718 -53627 -184769 -48116 -105859 -49860 -29337 -46879 249078
8709 -82030 -289619 -233651 198385 -169685 -459622 -253419 -286983 -5246 -41985 -93376 -318153
8698 -318153 16789 139019 24878 -360254 -65885 -60274 44488 111967 3436 -57972 71141 -94616
8685 295010 73532 36177 -233730 -141022 246771 34753 95649 -290621 89624 108549 -160878
8673 -145801 137463 155855 124664 -52386 -197474 -110061 138023 -1516 92330 158082 307404
8662 307404 -190573 229406 -190946 -131057 -206711 -299508 45141 -231890 -193670 19405 -226457
8650 108339 -190692 -31418 121848 -36286 -117455 -223173 70890 -78395 -336 -37293 -66988
8639 -66988 -88064 -46134 -158068 -333427 198037 114532 93923 76216 10670 -36336 -136832
8628 -136832 195152 -17312 -133395 206870 129980 -182745 -271046 -254873 -159889 -166107 -466310
8617 -466310 7814 -75564 417791 -54736 -158023 210560 -412165 -56970 -266985 -134078 257565
8605 45203 108950 -177703 11668 257171 61310 -10402 3065 128554 -74900 9803 -474880
8593 41756 25979 -163657 214268 -152351 -10533 -169518 -53582 -228885 104752 -103989
8582 -4024 207396 -292792 329568 395498 -105070 59543 186174 83263 -188000 49987 -18
8570 -114059 -306762 -160837 19017 -86429 -37923 75845 65874 148577 299883 -18275 117993
8558 177375 -173088 -21036 173479 -109887 -8700 -193353 50373 -187002 57545 -59234 -207269
8547 -207269 -355338 -172226 65723 23085 -308696 -41000 -107125 -109958 51817 -26293 -162911
8536 -162911 -118556 -70653 -59207 72742 -228095 -146078 215930 591 247393 120260 -334210
8524 -73265 -24931 -158147 -47700 292205 -177178 109891 -355668 138373 -91470 -160901 216561
8512 -85313 259423 -196168 -37632 -148701 113705 221254 -185939 -30311 -107124 -212334
8502 -212334 -53956 -181498 6378 -30379 192436 -327125 -86211 -39431 21275 -111848 133250
8490 -234479 163226 -107360 22831 -61365 -241619 80504 92101 291599 189748 23330 -33023
8478 74639 118349 -404504 -91232 -64828 363759 295553 -371603 -57348 42585 105964 -172677
8466 -329181 54166 31017 -222919 -215166 -275315 -54429 -70645 5041 -38641 -67278 -11905 -77377
8454 -77377 -289237 186548 -32393 -157068 109451 -10678 -4526 -228822 -96021 -149977 104085
8442 -138702 84107 -157074 -375157 224353 33822 -275043 -56678 132139 48183 -136633
8431 72330 31754 12983 305148 127533 84105 -101853 14910 -86654 -19356 -286941 -57468
8419 59581 -242062 -169846 3632 52867 33236 103050 -324587 -87880 231267 7816 -119238
8407 -78503 -63361 -115225 134633 -77887 7090 227103 -46999 79367 3235 -28893 -146476 -173810
8395 -173810 19333 -300025 26404 -176837 20080 -14297 -202490 54932 -72401 4148 -23040
8383 -247676 26282 -132045 -324277 -243640 85916 -150374 -96371 -112362 -14567 22984 203663
8372 203663 -195262 -74034 13537 -961 -108677 2692 50712 -68269 31381 -16182 -267399 -82704
8359 167556 -20753 19356 -126107 229854 -243454 -107857 -22560 24568 57594 -96548 116699
8347 -122285 -103982 120333 -252397 254408 -60293 -65114 -306561 210181 104510 127651 244600
8336 244600 76193 -352498 -161218 -188363 164342 -40174 -124982 -74449 -87618 77748 174127
8325 174127 -197546 21560 -35093 -88303 -144529 -345458 405322 -275211 -52697 -165782 -183609
8314 -183609 32259 106472 -46113 -79065 -381306 4228 -358733 65166 -189125 44140 29417
8303 29417 43863 -290038 -113799 124005 109848 46285 -85168 -54568 -91768 -36778 -24861
8292 -24861 253404 128417 141502 -29824 -92323 -116885 -133707 68304 -117619 134081 -12920
8280 106427 -386489 161257 -149560 10973 145396 -159496 -150555 75814 -168406 -47696 65213
8268 408111 136483 -145528 63527 -298342 209651 20884 -250800 -229419 205555 -82106
8257 -41549 166344 115136 -168430 -134547 78940 29242 -368686 -193942 316 -355662 140027
8245 202458 -122328 -256863 142881 191967 182278 -29349 -28394 21800 194820 -10478 204468
8233 -7574 130863 -224716 -23683 -223198 235534 96786 -90148 -8266 30467 47540 257648
8222 257648 17259 182442 -159054 10160 113633 -83230 -103698 179118 129805 -30431 134855
8210 33137 144846 -174018 -328774 49770 -1143 -59913 -265671 -152107 -272511 152924 268406
8199 268406 45013 58193 -136520 43318 -74995 -197389 154681 67736 -44817 -1618 163592
8187 94348 -140057 176048 -77898 -219998 -45907 232521 139174 -279856 107138 -253060
8176 -41900 19627 -14196 192363 303910 -270655 10757 13527 44805 71104 103085 146037
8165 146037 -135327 -143588 -114983 79943 -195850 -30587 93886 101509 9667 -160389 -11100 1451
8152 -234089 95752 67584 -202856 72582 -279158 -271138 -228996 -110627 -30833 -17806 -96296
8141 -96296 219434 -125639 -34882 -144600 153402 -416192 23117 145554 -34521 207804
8130 -215332 255012 8114 -128654 -116642 -14447 242389 84415 113682 83629 -12071 85442
8118 -113476 -25242 -87629 44386 51539 -136595 -118860 -94807 -229724 25936 -59831 37635
8106 -152353 95110 -314768 -5098 -69638 40896 227018 -108143 -305749 -219399 -104514 -117104
8095 -117104 -60201 -73297 141609 -51657 -222398 -177556 -24731 69203 72444 67008 17944 -349447
8082 37914 -10356 209079 -286147 -133302 116984 -454690 -40168 -94311 -462749 190257
8071 -40280 -264439 1022 -71306 -70887 84025 -96726 -152628 90663 -82053 48820 63780 -66684
8058 -745 128891 -56013 27632 166071 131741 158448 -136217 -20129 142464 -21455 -205353
8047 -205353 196763 -53135 -231945 -249477 61529 -37376 -356588 -124879 -11750 53574 -217182
8035 -234699 -178867 -168296 -387689 -61260 146441 181513 -108108 -5405 -45847 -18915 19311
8023 502920 269851 317725 -37898 14321 293455 -291430 -377737 132042 172937 141163 -37111
8011 -55292 -505129 75526 12476 -231503 18221 -78551 261281 -170133 -163773 -203109 -184600
8000 -184600 -41969 -25126 -49931 -111282 -167806 -161442 33887 32613 84687 -63659 -5776 30643
7987 59785 228593 -143830 -49089 167491 76535 -89276 149547 136429 -53897 438161 116369
7975 -179724 136403 -64807 59881 320843 -397737 -237499 -248205 68027 1769 7631 127795
7964 127795 -19609 -109695 -46277 -277390 3263 157909 11946 113732 209271 -79619 -61783
7953 -61783 -248646 115584 302841 89060 64573 -25208 -210684 -139868 -146134 -19123 -92415
7942 -92415 -91103 -288701 -317633 -12241 260873 -41974 128452 177136 -335225 -95842 -58292
7931 -58292 -71292 -133078 21724 -84506 40081 -173911 -77894 -224938 205102 -246272 -228378
7920 -228378 -28822 -35272 -178914 39746 -71803 -27814 231041 -207034 -35511 -323878 29463
7908 -30509 -110735 155947 244670 -220967 -150585 215336 250922 182428 -265732 -99284 -127597
7897 -127597 -87044 -161946 -153755 -57866 128496 -122110 50526 59258 -79050 -93437 19258 244756
7885 244756 -46209 159862 -87669 -171865 184958 -108471 -20565 120993 -15295 35695 -47708
7873 75742 77944 -26586 -379806 -126243 -178082 -197854 341954 124282 174441 -61596 -272359
7862 -272359 -137267 -146919 -148762 12056 -34324 -186721 29795 -419194 40910 195558 25211
7850 -175454 -102088 -60784 62200 129140 76721 -13578 -31146 -204098 -560419 -172167 176236
7838 -122535 -177816 -331312 -26152 -107785 -34741 233549 -116123 -206896 87564 -145782 82804
7826 -320614 17257 -147326 97744 241684 -190975 -173936 -114055 -34279 -63589 138442 3275
7814 -36470 -8785 124271 323859 -153716 -254915 -117190 -199008 -11749 -26609 31114 -289958
7802 169814 112854 -32021 -185922 225147 -44535 81251 -442182 519 120187 148646 203515
7791 203515 -23267 169977 69079 86387 -126616 -172146 -180544 -39268 -35049 -143010 292267
7779 -82067 -155872 128154 -79507 50658 194350 -245577 -33432 -237382 164011 21582 -1610
7767 135120 -13703 77703 -272435 133040 -247136 -26211 96933 -29590 166580 131472 3608
7755 -6902 -237056 2181 -121750 -61845 -101275 -92221 47023 167750 152065 34839 -317729 42664
7742 -227281 -94705 -163665 -314297 391128 15736 -62766 108420 -285125 64248 121021 348968
7731 348968 -147541 -23324 -97732 2250 -204540 -237691 -122104 -225944 -243117 -33661 -67239
7720 -67239 42638 199155 -40636 8794 -39105 180161 -145223 -35177 -16037 -370793 -333579
7709 -333579 -350225 62262 120048 -45823 23638 -330506 -474305 -24066 187671 293028 119075
7697 -227895 -232169 -166328 -12057 242565 -112435 336722 -257929 90148 -147630 -141679 -197582
7686 -197582 251591 37393 -137799 521722 -172744 -104638 173690 417082 -312083 44912
7675 -272142 -153749 -200667 50960 -159525 -142243 37085 174738 46590 115509 -139381 -237672
7664 -237672 47250 -130347 -310263 69744 -158801 -8451 -82297 -11844 -161672 -219453 16749
7652 119496 -197091 -81087 24923 -181142 196552 -48832 154551 191888 -130210 -146462 -148852
7641 -148852 -364675 111068 104395 138708 -60789 248680 -134992 -104477 123677 -10831 -56137
7630 -56137 -170632 223 63863 -423895 69925 181910 -47827 169525 112124 -267162 -303346
7619 -303346 -36029 20360 -54319 284262 -45558 468625 223513 111702 -64754 51022 -22790
7607 -173822 -137135 54775 -75953 -395800 288580 -124104 -154588 -77973 62955 16087 -149990
7595 21619 -157500 131303 256655 204847 -45867 3987 133439 170374 -77510 -254983 -68076
7583 35292 -141633 -92946 97428 -380527 -37801 7380 -158335 31089 -160968 50576 208486
7572 208486 -2029 -93106 44307 -70984 45492 -74182 271294 50525 295637 -204193 -139377
7561 -139377 208902 28376 -76779 -75572 -125182 -184162 16468 20814 -156195 -48600 41063 384682
7549 384682 -43712 -270603 -174868 48697 -90899 -167589 409624 204955 -23378 -51902 -27370
7538 -27370 -140131 -283213 23368 117068 -4177 -76541 -43143 266984 -101453 200621 -211601
7526 -175030 176431 53226 123259 341323 94914 -206273 -50765 -154285 -15331 -29013 67150
7514 -237862 -168792 -22461 37878 34374 171650 129359 118450 166899 111978 -201103 -107170
7503 -107170 97830 131523 -26449 184810 -9451 -175389 22792 -302267 -265806 -387458 84589
7491 -297494 425593 -168980 -38107 321559 -208354 -211381 -35673 -139450 -158670 99766 -167311
7479 -214492 200879 -164283 -25346 -50953 -391729 17886 -178871 106057 10999 -18445 307084
7467 -25500 20245 73719 -224284 -231498 230681 -60830 -209056 475389 230244 -54101 -199540
7456 -199540 220631 -102396 -99988 -309047 -291771 -207836 75909 130716 -193022 -50782 -288450
7445 -288450 -168951 -59211 -17266 -22125 20633 -305886 -59623 -210783 96574 302619 -294518
7433 -308228 44564 130205 -130821 -257577 -66504 25699 258808 -167908 76952 312435 -215372
7421 245611 159611 87192 -281543 29259 222683 -64959 141970 -363132 43850 183414 -7912
7409 -188590 55213 -128229 10387 -55347 -25916 -44424 58821 -174426 118926 -173494 206211
7397 -329924 130689 -135145 101361 -249180 -170901 -11825 177941 26587 34847 -57923 74112
7385 -180679 -83366 154160 -156432 -157037 -94805 -184697 151476 72223 -47460 -163518 -39553
7373 85859 210753 -30641 20756 -94033 6329 -168952 252584 -168589 19907 3244 -113471
7361 387507 -25893 65080 -58052 -215470 63461 -22560 305936 150349 -3611 -128223 -38155
7349 -291334 150361 199220 210155 218374 604 150561 -190488 320832 17326 223662 85446
7337 136758 198779 190831 69191 -200971 -75996 -149870 -15144 -147539 186243 70796 -192328
7325 163625 143123 24256 134614 78688 -193070 -286737 -70663 8032 -219834 -215951 79250
7313 69220 214486 -24031 402561 -325341 -118603 -71545 -2441 -86071 20565 -299784 -214230
7302 -214230 -243283 -185474 60627 151262 -58559 -171969 57642 -84226 121165 144630 -145611
7290 -435548 281488 169420 -111596 -308128 -7966 -199702 -296554 87171 91206 32023 -273963
7278 -72405 113790 -58511 186849 155340 -101535 164290 140181 240145 328522 -27192 -54063
7267 -54063 -228545 10165 -19740 -1353 -80480 45180 -161016 25127 38954 -347302 -102542
7255 353982 45143 314776 -107963 -37 -46371 -227241 -196760 137782 131925 295074 -350702
7243 -153519 6424 4342 68582 -219708 -175056 -484118 105797 -229295 252118 -327868 -62107
7231 -234672 197838 -76599 112709 -126528 -85671 -188208 -184676 210597 81676 42972 -87695
7219 -26699 169122 114788 -7843 -171755 -176137 134816 -262432 197179 -102618 -59494 9220
7207 104333 49967 131756 117 -255278 -248715 -151938 1259 -60936 82412 161665 -130485 355009
7194 -95542 -274067 69157 -55678 -277030 -128061 409388 -96199 118025 336912 -9236 -148730
7183 -148730 -80968 -83558 -35278 -182941 -187292 -47911 8001 -199018 153654 6849 90336 135089
7171 135089 25409 -14720 296768 78306 -42246 -115731 -105747 67728 87063 84579 85969 253978
7159 253978 86797 -53554 -58602 -363443 53618 -8512 6958 176520 36248 -128721 -46361 -486696
7147 -486696 -158115 -10079 158427 -16975 75400 -62614 -155181 -136199 63773 86470 287838
7136 287838 50617 -21562 -60460 -143693 -134046 -91338 184355 -175470 114485 46055 5201
7124 -117581 -55 -35267 21007 -30397 28783 165347 -41028 -337995 -36586 -278862 117641
7112 -1313 -52765 -98637 -201241 -23570 52267 39651 -435454 177317 -87571 54544 -146850
7100 230896 93647 -413393 -186625 89806 87879 -250937 -270295 -70280 97355 -14758 -34133
7089 -34133 26281 -112294 -201821 158549 -290574 31715 192436 31924 3369 -44726 -57586
7078 -57586 208877 196222 -44672 -95103 -70274 -28672 34562 89715 37257 -217727 85980
7066 -159113 84569 -167816 76152 141235 -133745 129547 -302701 -116949 -131894 103900
7055 -175722 140178 -52085 -132578 -64931 -194538 21314 -344681 -86056 -58216 -387864 -404049
7044 -404049 -278135 210510 12732 -236974 65859 3209 118855 178740 -75310 118196 146608
7033 146608 -139912 125294 -181172 -291113 -80131 125647 4875 -106402 83715 -148028
7022 279952 246550 20736 106800 171302 -57248 -189961 -166182 -203073 27850 -78596 -209804
7011 -209804 -91903 -69131 190000 -54929 -440952 9325 285976 227817 -49427 130274 -103016
6999 -85423 54796 233657 98183 -98130 58650 -35628 280661 -35801 -182320 -260313 -288329
6988 -288329 140854 -121192 -177791 25839 -271385 111481 -142954 172670 115797 -435261
6977 71798 -134725 -45252 -5494 -20565 -73288 -270481 -148346 -170853 -53213 -422359 -56532
6965 -153701 -39976 236443 227872 363015 -8526 107914 -65742 -208396 -139844 -28991 -36261
6954 -36261 27238 -70533 -293472 39224 340764 -250258 306390 -144861 -97842 -483905 121926
6942 -228735 -98457 -173370 143211 78556 241510 87214 -49982 189866 -111509 -92657 -195620
6931 -195620 36217 -138027 -8763 134588 57354 -109980 -22085 37301 117980 -128228 1381
6919 -170650 -210111 293880 -93719 502159 159805 -24868 56751 90176 -195397 156937 2607
6907 -455094 301630 260755 -100839 -27322 137221 60467 134265 63322 164411 -64174 32842
6895 -78904 1953 78841 171299 -166592 -220821 -189868 1671 -131699 1851 99306 -283672 -91480
6882 -103166 15883 119190 169747 329883 -20466 170108 -83729 -195026 -279313 -5510 -315134
6871 -315134 162842 124774 -86971 -218734 -23874 434901 133730 -187826 262686 -226018
6860 -14823 -264693 -45385 100207 -26334 148604 -7262 -29398 86232 54814 -69359 -182390
6849 -182390 172114 89426 83817 -284240 163675 -131771 -149576 150032 -24875 5231 -175819
6837 133897 -106993 -146707 192604 -109237 -79604 83921 177600 -32044 -16053 69507 19670
6825 78641 333715 -34159 251985 -215046 40922 69582 -152738 -204896 -437746 -55321 99353
6813 443275 22051 -104373 -59481 72804 -192981 -156568 157973 -261437 170194 168548 -55357
6801 227723 -341206 -216288 -13780 185018 -37675 -143925 -50253 -280215 -209686 -77028 -174048
6790 -174048 -57698 30424 39863 198378 76489 126145 -320601 -316791 50173 185975 -214045
6778 -241483 -18344 -48093 32137 28941 -128562 -355732 -373351 259974 -28633 -363149 -63351
6766 74960 -408058 52775 146410 -204254 -162385 -186085 -98545 -62246 -44623 -19755 72265
6754 98019 86963 -232090 281729 170971 -454910 207892 -239613 377294 -120032 229984
6743 21073 -39172 -29872 -210690 146023 103684 -178948 284382 -119125 129576 304237 63497
6731 93783 -198958 309516 267148 -191186 -9540 -245266 121172 -74635 -267746 -53667 -217935
6720 -217935 -63361 -4352 -382477 -161501 105459 -203086 -36495 -102894 -150663 -46613 -52743
6709 -52743 286795 -1617 -334100 26456 132544 14869 -18504 -129683 -110437 104710 161576
6698 161576 52273 98790 -78540 -379104 -168937 -168161 -178819 203113 -41289 -220784 -59729
6686 -467808 26038 -101266 -78610 -39858 -996 69945 -167118 -63100 14002 -93006 53679 -83112
6673 -29691 -238360 57668 -501706 -219018 66065 -158309 -41915 109963 -112036 -154354 -11848
6661 70585 262991 188715 127266 117251 161289 -29484 41892 -188525 91538 -288582 -66236
6649 71143 181920 -87128 9196 -28559 -117632 -126475 -148333 -282320 -58259 -121013 323143 -346779
6636 -107521 -43211 -7244 -162894 -367002 -138407 -301739 7382 -81662 -19059 4049 -151290
6624 -13859 -199493 135243 -244568 209424 59003 -69941 172027 -33736 31167 -30870 -358260
6613 -358260 -114246 -27938 -229391 -321085 388675 42180 -136909 480889 33988 -36211 -172383
6602 -172383 -20049 130181 -21745 -74597 36122 -62311 29021 -197639 68974 -132130 372707
6590 -121122 137464 91987 84 48860 190434 -122075 -355174 -164297 52762 -71257 -76414
6579 -76414 102715 -189734 198613 104685 -125159 214557 -137695 64485 -99801 310082
6568 -243426 133663 -7497 193524 -82855 -109231 214113 86680 157342 73490 298005 -112779
6556 18350 -71887 93361 -49191 50047 170606 7002 -223145 353435 19023 -115488 3401
6544 -5601 -280884 -21920 90428 33937 39838 -221011 61661 -18497 -179898 131061 -52473
6532 107116 -32359 17576 43747 -260442 -186732 -36584 -234745 -177593 151955 42654 -258275
6520 116823 104085 -221561 50873 138121 -93930 -180275 53328 16439 57568 -47085 -165251
6509 -165251 36915 -58277 127523 9652 49912 -28019 -135890 -39354 -15252 260819 70155
6497 -81426 -6855 156304 -21898 -244206 163029 129707 -231288 -27556 231794 -26134 123566
6485 310183 91307 -62695 38085 186048 19751 86816 -263660 -64193 -187694 18999 -64646
6473 103788 31679 -140492 40593 61323 30420 -105874 -31891 84553 -138841 -262047 195658
6461 167623 -8102 -66090 27350 -64902 224864 -63925 -3953 -194499 -246124 -14819 -165684
6450 -165684 -378605 45641 -266157 194358 -120596 -175580 -84216 24106 -121395 -189369 -251439
6439 -251439 467426 41918 -3363 33037 -104663 59263 -182098 41658 48846 -15504 -39133
6428 -39133 3306 -43243 -2105 -271849 9912 -76659 154311 -149554 -185237 231411 7810 -137030
6415 -134053 -284148 -282011 173333 -94573 -37432 158104 -219625 -24908 -192870 -101899 -263194
6404 -263194 67326 -118607 84429 110933 -123929 -267456 154677 89620 43720 228378 129580
6393 129580 73796 167522 -68641 114302 64022 107384 -157629 5138 -133636 -170407 222424
6381 -76386 122902 120785 290261 -68105 -220427 -228672 -10324 64925 325633 -358802 -102529
6369 -84434 -85605 59481 28060 238604 -84765 128214 -212071 139146 145426 58492 -4751 -79447
6357 -79447 169608 -453 -161995 224050 -202665 -11666 233865 28739 -62142 -19658 84109
6345 -260179 209597 204307 -201045 111693 -393144 -256945 122972 -16598 18668 105258 -184839
6333 31535 -162222 -46661 483609 89893 127926 -113323 -96165 212816 -183963 -81607 -120441
6322 -120441 -176133 -115770 392577 24825 31186 -122213 242110 98711 202919 -76082 167867
6310 219405 -114922 180399 219060 -132107 -144615 -15584 140221 -136427 -104345 -298340
6300 -298340 319879 96277 204082 -63393 -148488 -21431 -213609 162425 -53517 204091 -5846
6288 -10279 183074 14758 87208 -52106 -166097 120831 14674 -216456 -288716 -227621 162107
6276 -18411 144675 313007 -190300 -55099 56651 231580 282228 299275 54741 -116877 -264379
6265 -264379 -109891 100194 115685 473685 132435 -344624 -122808 193058 -226055 -40529
6254 112195 18906 -287116 -54017 220058 32757 -301497 -153470 -97086 169877 -29301 29896
6242 -292323 -47769 -117224 -60060 -109404 -372957 16067 -52037 100455 -336401 -206220 -102015
6230 -142116 218810 -178571 -109762 -67511 34713 192108 137312 -6210 -8342 208442 -126339
6218 -331578 -319437 125323 63411 5212 -43979 -68920 -224335 114734 52910 32513 -98728
6206 -191614 -5596 -261877 -197365 88075 -419497 348206 -13317 -292108 69494 166041 -202744
6194 -23165 -110342 -19816 117399 44366 -142684 -32859 59310 -182058 63915 -130031 -153855
6183 -153855 -233893 205949 -139736 56681 68490 111128 -83198 -407846 -118430 4207 154573
6172 154573 215846 -225524 207291 -91714 53892 -34995 -172397 -123680 28326 35043 139096
6161 139096 -81453 73765 -232020 -355553 391555 -281951 178907 294556 -105011 302498
6150 -39217 -201983 -301075 -42009 -162354 264556 -427201 152307 -248019 59014 -173143
6139 176111 316969 -15400 174333 104639 153440 -147284 -115954 -239086 -72304 -116846 -93316
6128 -93316 137373 -238045 217927 -292256 156567 189171 -227316 116506 -171497 85303
6117 146082 -82503 200173 357320 129303 254938 -142696 -154702 -120495 111331 -485007
6106 -86211 -15975 -114530 -153205 -177464 218953 77028 -386022 71732 37673 -8057 13463 77292
6094 77292 24116 19489 -68168 -28088 -227392 -212858 -190241 265921 17642 -210568 10232
6082 -66385 398641 31947 94327 -116519 275145 -104631 425676 -5330 85846 239529 -203764
6070 176031 -48212 -126485 152621 91141 166915 289046 115213 48474 229916 -222866 97656
6058 -27811 -50717 -476620 168377 -80630 -38245 110709 -377622 -19654 -96247 -92068 -171720
6047 -171720 259531 -141978 -414 212934 -47189 -31550 -41999 237703 258162 -347658 -160556
6035 -248977 441987 -34571 -349168 347010 162409 493 -37592 108795 38997 13307 -190249
6023 263485 26783 136253 14970 -137457 109315 16512 -75786 288151 -137207 80999 -181766
6011 136942 113407 289225 126203 -77797 81202 -186926 725 185021 111759 -35123 116844
5999 -65604 -268378 -99022 -16914 -177143 -176904 273082 -230215 -487058 -50014 378839 -152790
5987 -8991 9191 119214 -91881 -90749 -44041 -292674 226975 -55694 108013 252711 -96408
5975 160443 -55429 -35642 -3060 -33476 121875 264894 -24884 431931 60514 345748 424203
5964 424203 103913 40845 -506 20463 -208070 414782 -160707 138760 -50852 -174773 -97213
5953 -97213 87151 113386 37125 -158357 -49370 312120 25338 -58711 -2919 25755 -8796 -82270
5941 -82270 13933 -53962 -75845 -326557 -43570 192825 -23642 279386 -307538 171644 97373
5930 97373 -215508 40701 -256749 17671 -75248 178883 -46043 215291 -32662 -206797 104028
5918 279446 -63499 137683 34172 42781 164690 59782 93580 409043 -25345 -21024 -140464
5907 -140464 -337391 -65612 -201141 -34501 171775 -508 20060 -42732 -113321 -88062 -143217
5896 -143217 60243 -301851 -222521 -41542 -39141 148530 -116336 -123457 -36317 68041 -158216
5884 -122641 136780 247242 48644 290049 213610 -4605 39514 -402612 23964 -121309 -78228
5873 -78228 -2275 74595 -42894 84206 61773 -468080 -82760 -118715 25501 -222461 150448
5861 117927 256094 68706 -46710 -243538 120927 30477 -26310 -174033 29662 -127595 -202534
5850 -202534 39657 -123432 -41824 205672 205003 -81657 -165351 233541 113442 -315066 184777
5838 302343 -30519 -146591 24009 267970 -377727 36996 -15872 117540 -197766 -66323 -107409
5827 -107409 62661 -149285 -103531 -16559 -139680 359652 -118193 -58769 404091 -198907
5816 66948 414748 -262937 -18213 -193966 211927 65354 179285 124608 -160472 -109568 241478
5804 122298 421871 5381 -122487 -90188 -205278 6320 -88423 -28839 401524 249446 -44462
5792 -35340 15001 -23341 48684 221669 -325518 193488 270348 -236123 138570 205583 -255423
5780 193654 -112980 -267697 68542 -286943 -135038 3528 158594 147181 -274498 135639
5769 111821 154056 -186904 13599 -272343 -65508 -157447 -181296 37253 63404 -52368 42434
5757 -52623 -103516 -272319 -155671 -18132 -427871 182266 11900 -36239 -234137 -38420 18852
5745 -200480 -206470 49005 -246592 131925 -26396 259322 138198 18298 -63462 -186149 -232498
5734 -232498 -132647 -250880 127137 -4912 54634 -104352 -96572 -82989 28087 12578 -36474
5722 22174 179664 -33440 26231 43589 308651 62113 -2576 -134530 -303960 -197464 155974
5710 185826 -84089 14971 -46331 -9474 66335 -11888 48053 -131141 -189843 173196 -139563
5698 -223208 -275511 -95121 345633 -85798 -42354 -199935 330498 201665 28476 280934 137235
5686 -115444 70453 -95113 38953 113403 68663 11442 -106963 -22508 9647 2690 141112 159518
5674 159518 63791 -160899 -218635 -97583 50091 -154823 316487 37481 31924 -144077 -180650
5663 -180650 -258468 -134746 102321 26644 82946 296417 79488 158543 205871 32751 41919
5652 41919 286046 -40372 -101888 -109422 51563 82298 122759 355178 104283 120051 381236
5641 381236 -92842 326422 -115742 -27068 -335773 -138342 287027 225309 40371 -242721
5630 -131641 190183 4063 -80568 -58928 112896 -248056 332415 -291650 -81067 -4335 -78422
5619 -78422 7667 -127233 -307707 -61292 291140 254345 106096 369069 33268 188703 -50428
5607 -150403 114831 -8146 -226622 -146866 -14764 36543 13028 100496 211148 -91884 228755
5595 162198 -181798 -33305 303491 71013 144465 79000 -69175 4503 -105181 231849 -103917
5583 311572 115940 11146 347042 -145612 -15428 -28588 -3333 126864 -145423 -117285 -372161
5572 -372161 33977 -279730 -31279 51960 190305 -154096 -111155 299760 196422 -140155
5561 -40321 -35316 277702 -95136 161141 92574 -143620 170434 -267896 -14032 -76126 185463
5549 148985 -307484 -233987 4357 -180679 -57224 25624 -240390 -21934 -75069 177288 -161722
5537 -113450 235994 231332 -171511 28737 -101832 -147903 -202821 67253 -219018 107235 237305
5526 237305 234532 -63171 -80621 -319515 37499 -17392 201766 -103206 -85002 -271021 163362
5514 94083 170284 -50094 -196446 224803 -58067 81331 45894 157098 -62143 -57222 -46528
5503 -46528 90395 135793 -5511 -25831 -43136 -208969 70621 -211755 79349 39286 41164 240658
5491 240658 -109581 -425782 15803 177326 -25466 -477992 -409519 86099 98633 12237 -13359
5479 -106660 -10802 451967 -361510 306862 101139 234397 -153903 -110184 -118514 -154407 51796
5467 -121425 103908 -353738 -70316 -192848 -39126 26403 -31518 -89919 71637 -73164 529150
5455 433098 362426 16824 -151972 112092 35996 178995 304596 31867 -150728 146404
5444 -156245 77762 38291 -74800 -111992 -53497 -45521 -61224 176108 401434 233143 390712
5433 390712 -2398 -60294 -121392 -35823 -10763 -174218 78627 190667 -13618 -35788 21696
5421 -152935 150430 325000 46711 275268 263493 13332 148077 -71984 -97515 126571 368711
5410 368711 -49912 14542 -260620 -203505 -242614 58950 25339 167414 232080 -31753 89033
5398 -320012 15986 -71795 -121529 271553 111301 -42027 -100859 -59296 492403 169671 -335690
5386 -122366 48149 -205967 168562 147358 39662 97162 45480 -153536 -20165 116259 491025
5375 491025 -51132 105735 -138943 151505 312572 88368 186638 103419 23135 -198586 254740
5363 -71556 -136414 -146129 -33114 -283066 -76361 -98131 -88786 -88088 -99122 177249 -109429 -336236
5351 -336236 32143 1799 34039 -27721 104063 -73331 150232 -200527 -261755 49698 36186
5340 36186 -79480 122745 109189 -125741 -91112 130718 -121869 -25294 98119 -21548 -62980
5329 -62980 154948 86085 -31942 239021 130202 -126657 109143 -152143 15084 -247255
5318 -13311 159120 411711 118871 69545 21780 -62560 256951 36283 -191482 279847 69717
5306 -5879 148371 144625 -81112 -168487 -176864 19918 175496 -211786 14597 -157561 405723
5294 137420 -24150 36060 -236081 -332636 -298624 87247 3294 -122629 -134327 -103618 -58377
5283 -58377 -125267 156292 -123986 15514 127756 -4755 -247143 -174310 -300830 -54715 18852
5271 -186552 51213 383888 107188 3888 206201 267460 -165310 -87717 189573 17978 297164
5260 297164 18418 460837 53392 -109386 -212642 -159950 117000 -186094 -329011 170169
5249 -312088 -32660 21616 190292 139834 -121199 232087 120926 51845 -117291 64821 -156979
5237 -112821 135049 -95309 40324 108058 -227555 -105678 285380 116109 -111531 -270942
5227 -270942 84943 -53499 79831 249803 52187 250121 -98287 205356 145627 -124818 17731
5215 174836 53354 406502 -42361 -298648 237562 160477 260894 -35045 -8136 249643 218053
5204 218053 -248116 100376 11473 173821 -190947 -149067 109456 -53016 133309 -210658
5193 -133366 279691 -220650 -225782 109569 25951 -41828 78228 -94253 -105000 58434 -213526
5181 -6738 -110290 119191 74241 19629 182882 12687 38568 66764 55283 81897 -167027
5169 -89965 -178868 -206729 -58695 44109 -315346 11975 4274 -157566 252402 41447 -299878
5157 -138336 -60486 398380 54984 -79846 8241 -262140 -42919 173639 202320 26886 129801
5146 129801 117515 23683 233205 530 161101 24567 -118201 -176751 164623 -147576 -147660 72175
5133 52256 181733 12056 -110056 182060 -84602 163885 157839 190126 409933 278488 -317700
5121 39139 68176 -48726 96054 266022 72832 -104555 37305 -144822 -67300 -201679 29849
5109 -64340 -59666 72656 -73243 -68856 -10163 102307 -89680 -339338 -292014 131097 355015
5098 355015 110727 -49053 11200 38941 -88330 -154949 262209 229331 -45616 191903 158927
5087 158927 223436 -42654 288429 -256978 151451 -151846 120129 -59348 -183540 -213222
5077 -213222 33862 -78104 162700 -365668 6553 -70800 -1396 -116617 -23611 94739 -136065
5065 58481 -264849 154402 243871 60258 113476 45598 235213 223288 99020 17599 -205165
5053 -140983 64764 29373 -22413 110333 -140336 -161121 -107092 105957 49947 45591 -70509
5041 30634 207168 -270449 29146 -168390 193946 -117642 86999 269337 -48121 -104421 138258
5029 -221997 -122566 -133874 94572 -72598 -191265 -209583 59634 -47706 -32687 357637 62356
5017 -103670 132334 -46746 198156 -378633 10349 -2534 48099 169404 -331736 -344025 -233527
5006 -233527 -52904 90786 48754 -256122 24218 181300 32712 -197562 138208 -110948 154127
4994 -31945 -81980 269959 -232559 360308 55421 160058 -401985 16556 160768 280392
4984 280392 42923 -298971 -54202 8522 -149302 -37991 -278571 129266 29865 -47927 140445
4972 -229751 -444260 4359 299231 368736 181177 31347 -128327 -24789 -35286 209020 -148824
4960 4853 -245674 -142819 -117909 67675 -23259 -281805 -51556 35178 230415 -10481 -246525
4949 -246525 246497 -86675 47507 -41035 -34916 -103049 416140 30125 -8203 59043 -263851
4937 104874 -25973 -180203 18649 -128950 100554 -288727 290435 -258687 134791 -215869
4926 -21926 215316 -2498 -73847 74488 158433 -76674 -307592 -124676 230398 25393 -287201
4914 252786 196048 124773 60060 -109698 -16891 -183650 -49962 51091 -113718 -173898 -201222
4903 -201222 286918 -80333 -190058 -40358 18076 12131 171068 -124828 393668 -310116 -182430
4892 -182430 -68981 -31290 313402 195723 -70294 59731 227406 -45514 182124 -154694 -34961
4880 272380 83569 -2251 -12559 -182067 -119805 15828 -71095 -329772 -349813 -134782 -62663
4868 132047 -49833 81115 43465 -91029 119819 -83300 -213438 -491095 45079 -291439 128513
4856 90695 -38978 10927 -59080 11782 -163153 40328 90681 -8430 -204550 183400 151402
4845 151402 -538670 -34343 -161159 -22908 188782 280561 80247 136027 -73031 39736 41544
4834 41544 100886 -186794 -220000 -231269 96472 -53978 -95052 -60958 8502 -52862 -295929 35204
4821 108813 -77304 30083 -93347 264034 -82796 135500 -75869 101311 23906 -35755 29517
4809 -62853 275877 -33931 12323 -53168 266354 2761 78485 -258150 -254691 -122053 58716
4797 -86625 -219181 -124532 351404 119673 13367 83387 -69220 -279497 -227382 12007 98478
4786 98478 2557 -107139 -598 -85123 95232 77720 -154750 111349 -39034 -459960 70746 -178633
4773 22505 -205280 -51634 -57920 -265858 -144297 73356 124354 -18065 -430866 -118518 -78378
4762 -78378 39925 413681 -101883 -122022 -98116 -67414 437726 -188610 -181353 -246892 105779
4750 198763 -262732 76461 -307892 8125 -187667 279373 -48060 62081 123160 94649 -77685
4738 94588 -146228 43041 -366566 -11929 402155 109634 200895 64283 -270 168135 15487
4726 257201 -85334 147415 -180438 -54303 30424 -131999 -21179 -41941 122724 184892 249109
4715 249109 -481006 -294217 -47804 105911 -236374 319703 294851 113305 -286061 -298309
4705 -298309 272 150606 -164819 -195524 226805 11233 -49029 64524 3925 -9894 -254144 98388
4692 192298 -165360 -224416 -56958 194624 103495 29532 123963 -17506 -403809 -103762 195829
4680 -155910 406424 14557 145302 -160257 -30044 41467 -192972 -29682 -3637 -69631 -1639
4668 -24718 39967 125631 19831 -60706 -267831 -262550 -252764 -325460 -43825 -55169 -14421 62558
4655 408495 87064 -76610 -198303 -80528 -8926 133890 201709 402971 103824 15571 70597
4644 70597 198198 152703 6572 -80877 -74324 48485 123134 -89617 -97125 -224217 -34436 -210944
4632 -210944 -12738 186767 -171741 191519 85630 179015 -161115 253739 265035 -54979 -117702
4621 -117702 216548 -235953 -88583 368713 118388 212808 129198 -309983 -188611 143998
4610 429767 -124224 89513 -132583 32029 26380 20601 317084 133349 150951 173629 235463
4599 235463 -45834 161053 126767 -60384 -152913 6036 -213321 -262788 -35581 -31584 315564
4587 46235 291261 -36921 246396 -54396 159194 -110327 -200741 -352795 -68880 29897 -226321
4575 165210 -68598 255510 249578 60041 -137779 63739 -156723 189980 255856 -27453 38477
4563 -48279 48994 252766 38568 -83650 169108 -172711 222354 458587 -168123 -118113 -194874
4552 -194874 73573 256070 -50289 -108808 293793 -41889 357732 830 139109 164120 59234
4540 61166 203426 42489 217536 116254 1837 -150364 -120728 64692 209218 55037 21869
4528 169852 -34182 96071 131252 -96256 333582 20806 -252489 77293 241257 149714 -145362
4516 -244861 280493 68062 69192 -226142 192352 55022 71974 59802 -105539 -28193 -355582
4505 -355582 209511 -82222 137621 77409 79514 -250534 -230013 44215 200006 -78880 -149587
$$ [...]
##END NTUPLES=NMR SPECTRUM
##END=
