##TITLE=NES1001_50250289_9225092_mVNcrKuYP1
##JCAMPDX= 6.0         $$ Bruker NMR JCAMP-DX V2.0
##DATA TYPE= NMR SPECTRUM
##DATA CLASS= NTUPLES
##ORIGIN= BRUKER
##OWNER= Administrator
$$ 1.72 TOPSPIN		Version 2.1
$$ 2015-07-02 03:40:22.414 -0700  Administrator@X
$$ Compression mode = diff/dup
##.OBSERVE FREQUENCY= 400.02188249412
##.OBSERVE NUCLEUS= ^1H
##.ACQUISITION MODE= SIMULTANEOUS (DQD)
##.ACQUISITION SCHEME= undefined
##.AVERAGES= 64
##.DIGITISER RES= 22
##SPECTROMETER/DATA SYSTEM= spect
##.PULSE SEQUENCE= noesygpps1d.comp
##.SOLVENT NAME= COFFEE_meoh
##.SHIFT REFERENCE= INTERNAL, COFFEE_meoh, 1, 14.9622
##AUDIT TRAIL= $$ (NUMBER, WHEN, WHO, WHERE, PROCESS, VERSION, WHAT)
$$ ##TITLE= Audit trail, TOPSPIN		Version 2.1
$$ ##JCAMPDX= 5.01
$$ ##ORIGIN= Bruker BioSpin GmbH
$$ ##OWNER= Administrator
$$ $$ E:\/data/COFFEE/nmr/NES1001_50250289_9225092_mVNcrKuYP1/22/pdata/1/auditp.txt
$$ ##AUDIT TRAIL=  $$ (NUMBER, WHEN, WHO, WHERE, PROCESS, VERSION, WHAT)
(   1,<2015-07-02 03:40:16.914 -0700>,<Administrator>,<X>,<go>,<TOPSPIN 2.1>,
      <created by zg
	started at 2015-07-02 03:28:47.492 -0700,
	POWCHK enabled, PULCHK disabled,
       configuration hash MD5:
       21 0F 79 D6 B3 7B B4 F6 88 20 88 DB 03 48 BD 9F
       data hash MD5: 64K
       17 39 A1 33 E3 A6 1A 75 F1 33 34 8B F7 A0 FE 45>)
(   2,<2015-07-02 03:40:20.336 -0700>,<Administrator>,<X>,<proc1d>,<TOPSPIN 2.1>,
      <Start of raw data processing
       efp LB = 0.3 FT_mod = 6 PKNL = 1 PHC0 = 0 PHC1 = 0 SI = 128K 
       data hash MD5: 128K
       61 CC C0 35 4F E7 58 BE 8C 8B 30 6F 8E 60 D8 25>)
(   3,<2015-07-02 03:40:21.211 -0700>,<Administrator>,<X>,<proc1d>,<TOPSPIN 2.1>,
      <pk PHC0 = -86.87988 PHC1 = 0 
       data hash MD5: 128K
       DB FB 58 54 04 9E 85 BE 1F 08 E2 AD 05 DD 5D 19>)
(   4,<2015-07-02 03:40:21.586 -0700>,<Administrator>,<X>,<proc1d>,<TOPSPIN 2.1>,
      <abs ABSG = 1 
       data hash MD5: 128K
       8D FE C2 45 9E 58 CC DF 85 82 A0 67 63 0C 05 1D>)
(   5,<2015-07-02 03:40:21.695 -0700>,<Administrator>,<X>,<proc1d>,<TOPSPIN 2.1>,
      <abs ABSG = 2 
       data hash MD5: 128K
       E2 7D 56 DB 05 71 08 BE 61 53 BB BE 06 09 2B 66>)
(   6,<2015-07-02 03:40:21.805 -0700>,<Administrator>,<X>,<proc1d>,<TOPSPIN 2.1>,
      <abs ABSG = 3 
       data hash MD5: 128K
       07 97 F8 D1 5A 69 5A BD B0 76 36 7B 03 16 73 AF>)
(   7,<2015-07-02 03:40:21.899 -0700>,<Administrator>,<X>,<proc1d>,<TOPSPIN 2.1>,
      <abs ABSG = 4 
       data hash MD5: 128K
       1B 09 C1 1D 73 57 DF E2 21 E7 A8 04 25 11 69 05>)
(   8,<2015-07-02 03:40:22.008 -0700>,<Administrator>,<X>,<proc1d>,<TOPSPIN 2.1>,
      <abs ABSG = 5 
       data hash MD5: 128K
       FE 76 1E 18 79 59 38 42 74 41 65 74 2C 99 51 66>)
$$ ##END=
$$ 
$$ $$ hash MD5
$$ $$ 44 19 24 07 79 81 B4 AE BA E3 D2 5B AB FA 74 08
##$RELAX= 
##$RELAX= 
##$RELAX= 
##$RELAX= 
##$RELAX= 
##$RELAX= 
##$RELAX= 
##$RELAX= 
$$ Bruker specific parameters
$$ --------------------------
##$DU= <E:\>
##$EXPNO= 22
$$ [...]
150 150 150 150 150 150 150 150
##$TP07= 0
##$TPNAME0= <>
##$TPNAME1= <>
##$TPNAME2= <>
##$TPNAME3= <>
##$TPNAME4= <>
##$TPNAME5= <>
##$TPNAME6= <>
##$TPNAME7= <>
##$TPOAL= (0..7)
0.5 0.5 0.5 0.5 0.5 0.5 0.5 0.5
##$TPOFFS= (0..7)
0 0 0 0 0 0 0 0
##$TUNHIN= 0
##$TUNHOUT= 0
##$TUNXOUT= 0
##$USERA1= <user>
##$USERA2= <user>
##$USERA3= <user>
##$USERA4= <user>
##$USERA5= <user>
##$V9= 5
##$VALIST= <valist>
##$VCLIST= <CCCCCCCCCCCCCCC>
##$VD= 0
##$VDLIST= <DDDDDDDDDDDDDDD>
##$VPLIST= <PPPPPPPPPPPPPPP>
##$VTLIST= <TTTTTTTTTTTTTTT>
##$WBST= 2048
##$WBSW= 25
##$XGAIN= (0..3)
0 0 0 0
##$XL= 0
##$YL= 0
##$YMAX_a= 5964751
##$YMIN_a= -10777748
##$ZGOPTNS= <>
##$ZL1= 120
##$ZL2= 120
##$ZL3= 120
##$ZL4= 120
##$ABSF1= 14.9622
##$ABSF2= -5.595982
##$ABSG= 5
##$ABSL= 3
##$ALPHA= 0
##$AQORDER= 0
##$ASSFAC= 0
##$ASSFACI= 0
##$ASSFACX= 0
##$ASSWID= 0
##$AUNMP= <proc_prof1d_extract.lims>
##$AXLEFT= 0
##$AXNAME= <>
##$AXNUC= <1H>
##$AXRIGHT= 0
##$AXTYPE= 0
##$AXUNIT= <>
##$AZFE= 0.1
##$AZFW= 0.1
##$BCFW= 0
##$BC_mod= 0
##$BYTORDP= 0
##$COROFFS= 0
##$CY= 15
##$DATMOD= 1
##$DC= 0
##$DFILT= <>
##$DTYPP= 0
##$F1P= 0
##$F2P= 0
##$FCOR= 0.5
##$FTSIZE= 131072
##$FT_mod= 6
##$GAMMA= 0
##$GB= 0
##$INTBC= 1
##$INTSCL= 1
##$ISEN= 128
##$LB= 0.3
##$LEV0= 0
##$LPBIN= 0
##$MAXI= 10000
##$MC2= 0
##$MEAN= 0
##$ME_mod= 0
##$MI= 0
##$NCOEF= 0
##$NC_proc= -2
##$NLEV= 6
##$NOISF1= 0
##$NOISF2= 0
##$NSP= 0
##$NTH_PI= 0
##$NZP= 0
##$OFFSET= 14.9622
##$PC= 1
##$PHC0= -86.87988
##$PHC1= 0
##$PH_mod= 1
##$PKNL= yes
##$PPARMOD= 0
##$PPDIAG= 0
##$PPIPTYP= 0
##$PPMPNUM= 2147483647
##$PPRESOL= 1
##$PSCAL= 4
##$PSIGN= 0
##$PYNMP= <proc.py>
##$REVERSE= no
##$SF= 400.020009157838
##$SI= 131072
##$SIGF1= 0
##$SIGF2= 0
##$SINO= 400
##$SIOLD= 131072
##$SPECTYP= <>
##$SREGLST= <1H.CDCl3>
##$SSB= 0
##$STSI= 131072
##$STSR= 0
##$SW_p= 8223.68421052631
##$SYMM= 0
##$S_DEV= 0
##$TDeff= 65536
##$TDoff= 0
##$TI= <>
##$TILT= no
##$TM1= 0
##$TM2= 0
##$TOPLEV= 0
##$USERP1= <user>
##$USERP2= <user>
##$USERP3= <user>
##$USERP4= <user>
##$USERP5= <user>
##$WDW= 1
##$XDIM= 131072
##$YMAX_p= 343156263
##$YMIN_p= -11355
##$CURPLOT= <Network HP LaserJet P1505>
##$CURPRIN= <$Network HP LaserJet P1505>
##$DFORMAT= <normdp>
##$LAYOUT= <+/1D_H.xwp>
##$LFORMAT= <normlp>
##$PFORMAT= <normpl>
##$SURQMSG= 1
$$ End of Bruker specific parameters
$$ ---------------------------------
##NTUPLES= NMR SPECTRUM
##VAR_NAME=  FREQUENCY,     SPECTRUM/REAL,   SPECTRUM/IMAG
##SYMBOL=    X,             R,               I
##VAR_TYPE=  INDEPENDENT,   DEPENDENT,       DEPENDENT
##VAR_FORM=  AFFN,          ASDF,            ASDF
##VAR_DIM=   131072,        131072,          131072
##UNITS=     HZ,            ARBITRARY UNITS, ARBITRARY UNITS
##FACTOR=    0.0627417313425164, 1,          1
##FIRST=     8223.62146879497, -1043,        -41838
##LAST=      0,             837,             -43184
##MIN=       0,             -11355,          0
##MAX=       8223.62146879497, 343156263,    0
$$ Real data points
##PAGE= N=1
##DATA TABLE= (X++(R..R)), XYDATA
$$ [...]
61243A689536O2047O5973O7683O5348N7352M3814K6899R502o145j8783k7894l3733
$$ 1689536 1751583 1817556 1885239 1950587 2007939 2051753 2078652 2088154 2082009 2063226 2035332 2001599
61231B001599l7326l9772m1412m1851m0749l8313l5080l1460k7523k3100j8118
$$ 2001599 1964273 1924501 1883089 1841238 1800489 1762176 1727096 1695636 1668113 1645013 1626895
61220A626895j3058r029p313q790j3650k1300l0258l8444m4095m6538m6036m3095
$$ 1626895 1613837 1604808 1597495 1588705 1575055 1553755 1523497 1485053 1440958 1394420 1348384 1305289
61208A305289l8336l2820k7928k4528k2511k1211k0094j8969j7737j6263j4437
$$ 1305289 1266953 1234133 1206205 1181677 1159166 1137955 1117861 1098892 1081155 1064892 1050455
61197A050455j2247r801p372n402m424m810o339q012q712q231p408o992o704n924
$$ 1050455 1038208 1028407 1021035 1015633 1011209 1006399 1000060 992048 983336 975105 967697 960705 954001 948077
61183I48077m896m503m948n460n454n242n194n008m280l288k596k265j970j655
$$ 948077 943181 938678 933730 928270 922816 917574 912380 907372 903092 899804 897208 894943 892973 891318
61169H91318j383r03j0Q22Q59J15p05j293k179l980o814j0473j4512j7922j9535
$$ 891318 889935 889032 889022 889844 890703 890818 890113 888820 886641 882661 875847 865374 850862 832940 813405
61154H13405j9247j8333j7966j7844j6879j4877j2815j1627j1361j1542j1761
$$ 813405 794158 775825 757859 740015 723136 708259 695444 683817 672456 660914 649153
61143F49153j1722j1294j0778j0691j1057j1184j0521r379q551q333q297p885
$$ 649153 637431 626137 615359 604668 593611 582427 571906 562527 553976 545643 537346 529461
61131E29461o935n654m371l357k573j630k69J124J833J830K023L188M884N875
$$ 529461 522526 516872 512501 509144 506571 504941 504672 505796 507629 509459 511482 514670 519554 525429
61117E25429N523M281K807J163q72l053m719n499n717n999o628p244p210o345
$$ 525429 530952 535233 538040 539203 538331 535278 530559 525060 519343 513344 506716 499472 492262 485917
61103D85917n214m562m422m209l710l477l919m496m394l649k995k763k657k525
$$ 485917 480703 476141 471719 467510 463800 460323 456404 451908 447514 443865 440870 438107 435450 432925
61089D32925k554k550j911o47K64J08n50o24R1R41J473J844K268K684K935K914
$$ 432925 430371 427821 425910 425263 425527 425635 425085 424461 424552 425493 426966 428810 431078 433762 436697 439611
61073D39611K508J880J542J719J811J077k33j069r25l95k79p48j619k762l903
$$ 439611 442119 443999 445541 447260 449071 450148 449915 448846 447921 447526 447247 446499 444880 442118 438215
61058D38215m533m480m168m037m014l882l804m030m403m523m274l808l266k765
$$ 438215 433682 429202 425034 420997 416983 413101 409297 405267 400864 396341 392067 388259 384993 382228
61044C82228k432k153j525n30R1l52j427j893j059O84K615M390N820O607O720
$$ 382228 379796 377643 376118 375588 375679 375327 373900 372007 370948 371632 374247 378637 384457 391064 397784
61029C97784O816P753R702J1949J3705J5017J6759J9720K3856K8746L4567M2229
$$ 397784 404600 412353 422055 434004 447709 462726 479485 499205 523061 551807 586374 628603
61017F28603N2493O5370Q0139R4605J03530R9460P7970M3280P388j7728k7145
$$ 628603 681096 746466 826605 921210 1024740 1124200 1202170 1245450 1252838 1235110 1207965
61006A207965k2802q792J0634K8949L6780K6676p89l6315o7744q7009r2772q8333
$$ 1207965 1185163 1176371 1187005 1215954 1252734 1279410 1278621 1242306 1174562 1087553 994781 906448
60994I06448p8178o5935n3893m3187l4128k6549k0121j4520r546n264j926L02
$$ 906448 828270 762335 708442 665255 631127 604578 584457 569937 560391 555127 553201 553503
60982E53503J500J842J503Q05K47J35K79K80N9j37j17R9M67Q94J086P17j01q59
$$ 553503 555003 556845 558348 559153 559400 559535 559814 560094 560153 560016 559899 559998 560465 561359 562445 563162 563061 562202
60964E62202j249j507j960k519k831k819k830l225l976m737n320n959o975q172
$$ 562202 560953 559446 557486 554967 552136 549317 546487 543262 539286 534549 529229 523270 516295 508123
60950E08123q905q965r026r806j0989j1568j1191j0449r755q596o406l589j179
$$ 508123 499218 490253 481227 471421 460432 448864 437673 427224 417469 408873 402467 398878 397699
60937C97699K69R29J148J207J508K365L451L953L455K471J865J994K551L126L607
$$ 397699 397968 398897 400045 401252 402760 405125 408576 412529 415984 418455 420320 422314 424865 427991 431598
60922D31598M081M457M491M118L643L366L127K425J071n20j673j949j312j55P83
$$ 431598 435679 440136 444627 448745 452388 455754 458881 461306 462377 461857 460184 458235 456923 456768 457551
60907D57551R02L32k12k93k72p79j936l303m337m687m313l556k962k811k980l271
$$ 457551 458453 458785 458573 458280 458008 457229 455293 451990 447653 442966 438653 435097 432135 429324 426344 423073
60891D23073l603l795l655l516m040n137n686m996l927l768m371m442l487k390
$$ 423073 419470 415675 412020 408504 404464 399327 393641 388645 384718 380950 376579 372137 368650 366260
60877C66260j965j975j914j799j677j113J12J298J567J015N19O31J186J877K648
$$ 366260 364295 362320 360406 358607 356930 355817 355929 357227 358794 359809 360328 360959 362145 364022 366670
60862C66670L408L845L797L581L739M478N359N668N113M112L265K681K127J666
$$ 366670 370078 373923 377720 381301 385040 389518 394877 400545 405658 409770 413035 415716 417843 419509
60848D19509J675K058K065J133l73j645k363k819l286l701l880l743l398l159
$$ 419509 421184 423242 425307 426440 426067 424422 422059 419240 415954 412253 408373 404630 401232 398073
60834C98073l372l982m465m407m034l915m273m835n201n084m448l669l399l808
$$ 398073 394701 390719 386254 381847 377813 373898 369625 364790 359589 354505 350057 346388 342989 339181
60820C39181m152l603k415j657j799k185k089j632j315j225j224j459j997k301
$$ 339181 335029 331426 329011 327354 325555 323370 321281 319649 318334 317109 315885 314426 312429 310128
60806C10128j805q97n96j082j330n02R18J884K151K220K337K216J809J575J852
$$ 310128 308323 307426 306830 305748 304418 303916 304834 306718 308869 311089 313426 315642 317451 319026 320878
60791C20878K428K963L390L739L940M011M117M252M229M100M122M117L481K184
$$ 320878 323306 326269 329659 333398 337338 341349 345466 349718 353947 358047 362169 366286 369767 371951
60777C71951J225J437K300K644K207J738J651J568J125N09o4o72j250j399r83
$$ 371951 373176 374613 376913 379557 381764 383502 385153 386721 387846 388355 388291 387619 386369 384970 383987
60762C83987m43k29l17m68n28l02K84P23K09j265k631l027k851l010l667m299
$$ 383987 383544 383315 382998 382530 382002 381700 381984 382707 382916 381651 379020 375993 373142 370132 366465 362166
60746C62166m674n089n805o700p424p529o666n080l670l118l102k829k051j148
$$ 362166 357492 352403 346598 339898 332474 324945 318279 313199 309529 306411 303309 300480 298429 297281
60732B97281m33P9M34Q27J741L372N018N715N425M979M876M789M299L440K390
$$ 297281 296848 296927 297361 298188 299929 303301 308319 314034 319459 324438 329314 334103 338402 341842 344232
60717C44232J217J68m28p38j333k266k826k562k015k034k811l920m924n471n334
$$ 344232 345449 345617 345189 344451 343118 340852 338026 335464 333449 331415 328604 324684 319760 314289 308955
60702C08955m784m558m907n080m322l082k482k797l201l011k425j828j103m0J050
$$ 308955 304171 299613 294706 289626 285304 282222 279740 276943 273742 270731 268306 266478 265375 265335 266385
60687B66385J654J703J599J717K174K869L467L460K678J642J125J281J521J318
$$ 266385 268039 269742 271341 273058 275232 278101 281568 285028 287706 289348 290473 291754 293275 294593
60673B94593Q43O52R46J403J685J869K257K928L604L964M007M004M088M053L737
$$ 294593 295436 296088 297034 298437 300122 301991 304248 307176 310780 314744 318751 322755 326843 330896 334633
60658C34633L441L684M457N052M859M119L541L329L011K195J093J50m86q76r74
$$ 334633 338074 341758 346215 351267 356126 360245 363786 367115 370126 372321 373414 373564 373078 372202 371228
60643C71228o86j44L29M59J38m93j052j164r07p85j090j514j592j344j182j371
$$ 371228 370542 370398 370727 371186 371324 370831 369779 368615 367708 366923 365833 364319 362727 361383 360201 358830
60627C58830j867k488k962k948k385j721j447j462j249o38m9P5k19n44n81l08
$$ 358830 356963 354475 351513 348565 346180 344459 343012 341550 340301 339663 339614 339689 339470 338926 338345 338037
60611C38037p2l84j390k551l064k701j988j571j671k057k346k290k051k075k434
$$ 338037 337965 337581 336191 333640 330576 327875 325887 324316 322645 320588 318242 315952 313901 311826 309392
60596C09392k489j647l17M63L83J99N76J177J290Q24L16J85M39Q77J256J482J743
$$ 309392 306903 305256 304939 305402 305785 305984 306560 307737 309027 309851 310167 310352 310791 311668 312924 314406 316149
60579C16149K279K829K747J986J448J924K988L571L401L167L351L618L632L794
$$ 316149 318428 321257 324004 325990 327438 329362 332350 335921 339322 342489 345840 349458 353090 356884
60565C56884M710O210P573Q558R724J1472J3293J4484J5440J7451K1037K5201
$$ 356884 361594 367804 375377 383935 393659 405131 418424 432908 448348 465799 486836 512037
60553E12037K8901L2681L7947M4880N2167N8758O4585O9025O9870O4963N4330
$$ 512037 540938 573619 611566 656446 708613 767371 831956 900981 970851 1035814 1090144
60542A090144L9713K2545L492j6154l3910m7400n5593n8750n7841n4288m9493
$$ 1090144 1129857 1152402 1155894 1139740 1105830 1058430 1002837 944087 886246 831958 782465
60531G82465m4148l8301l2153k6368k1398j7136j3401j0263p612m958k018R39
$$ 782465 738317 700016 667863 641495 620097 602961 589560 579297 571685 566727 564709 565648
60519E65648L764O893J0753J5168J9891K5299L1841L9090M6106N2698N9477O6391
$$ 565648 569412 576305 587058 602226 622117 647416 679257 718347 764453 817151 876628 943019
60507I43019P1748P3095O8831N8934M4619K7661R924o860k0944l0427l3686l0324
$$ 943019 1014767 1087862 1156693 1215627 1260246 1287907 1297831 1290971 1270027 1239600 1205914 1175590
60495A175590k1662j0016K640J5276K7158L6740M1573L9632L0765J6625p86k0031
$$ 1175590 1153928 1143912 1146552 1161828 1188986 1225726 1267299 1306931 1337696 1354321 1353535 1333504
60483A333504l9506n6643o8848p5353p7425p6611p3436o7953o0810n3125m5809
$$ 1333504 1293998 1237355 1168507 1093154 1015729 939118 865682 797729 736919 683794 637985
60472F37985l9506l4736l1346k8214k4289j9921j6433j4353j2898j1312r827q853
$$ 637985 598479 563743 532397 504183 479894 459973 443540 429187 416289 404977 395150 386297
60460C86297q018o721n239m470m692n218n304m885m322l852l472l174k989k896
$$ 386297 378279 371558 366319 361849 357157 351939 346635 341750 337428 333576 330104 326930 323941 321045
60446C21045k741k309j527o46j2L40O96J159J462J443J377J523J629J307O82K08
$$ 321045 318304 315995 314468 313822 313810 314150 314846 316005 317467 318910 320287 321810 323439 324746 325428 325636
60430C25636mk01m00l67j74k55p17j028o42K96J065J075M75J23Q18K294L316L177
$$ 325636 325632 325431 325031 324664 324490 324235 323518 322490 321848 322144 323209 324284 324759 324882 325700 327994 331310 334487
60412C34487K675K923L590L438K522K430L858N303N145M052M012N622P667R141
$$ 334487 337162 340085 343675 347113 349635 352065 355923 361226 366371 370423 374435 380057 387724 396865
60398C96865J0200J1015J1035J0009Q784Q306Q383Q118P246O379O051O022N678
$$ 396865 407065 418080 429115 439124 447908 456214 464597 472715 479961 486340 492391 498413 504091
60385E04091M753L611K845K671K706K421J765J167R62R92Q22J84q03j657j812
$$ 504091 508844 512455 515300 517971 520677 523098 524863 526030 526992 527984 528806 528990 528187 526530 524718
60370E24718j128j61L16R0m06p58r38r83p43k78j18o99j716k415k496k398k673
$$ 524718 523590 523429 523745 523835 523429 522671 521733 520750 520007 519729 519611 518912 517196 514781 512285 509887 507214
60353E07214l445m509n620o413o363n241l601k450k285k639k750k452k130j972
$$ 507214 503769 499260 493640 487227 480864 475623 472022 469572 467287 464648 461898 459446 457316 455344
60339D55344j745j308r81j095j549k011k368k721l005l048k905k858l065l362
$$ 455344 453599 452291 451310 450215 448666 446655 444287 441566 438561 435513 432608 429750 426685 423323
60325D23323l495l396l205l098l100l053k824k556k492k491k000p24Q64J962K336
$$ 423323 419828 416432 413227 410129 407029 403976 401152 398596 396104 393613 391613 390889 391753 393715 396051
60310C96051K604L694N988Q734J0305R502O862M146K213N2l448p443r923j0199
$$ 396051 398655 402349 408337 417071 427376 436878 443740 447886 450099 450151 446703 439260 429337 419138
60296D19138r426q651p683o261n043m570m160k860r30N41J166J417J509J082J65
$$ 419138 409712 401061 393378 387117 382074 377504 373344 370484 369554 370095 371261 372678 374187 375269 375434
60281C75434m91k98M89J312J933K315K339K075K038K703L865M863N375N690O179
$$ 375434 374943 374645 375134 376446 378379 380694 383033 385108 387146 389849 393714 398577 403952 409642 415821
60266D15821O736O981O855O760O990P236O894N859M755M239M330M629M931N239
$$ 415821 422557 429538 436393 443153 450143 457379 464273 470132 474887 479126 483456 488085 493016 498255
60252D98255N364N044M589M888O339Q034Q583P767O917P454R339J1301J2335J2618
$$ 498255 503619 508663 513252 518140 524479 532513 541096 548863 555780 563234 572573 583874 596209 608827
60238F08827J2939J3719J4765J5789J6814J8096J9789K1773K3834K6042K8832
$$ 608827 621766 635485 650250 666039 682853 700949 720738 742511 766345 792387 821219
60227H21219L2423L6285L9581M2211M4946M8283N1587N3877N5056N5748N6139
$$ 821219 853642 889927 929508 971719 1016665 1064948 1116535 1170412 1225468 1281216 1337355
60216A337355N5624N3646N0269M5871M0796L5438L0161K4941J9463J3733Q128
$$ 1337355 1392979 1446625 1496894 1542765 1583561 1618999 1649160 1674101 1693564 1707297 1715425
60205A715425K808k359p086j0490j2092j2494j2549j2254j0966q426n039j278
$$ 1715425 1718233 1715874 1708788 1698298 1686206 1673712 1661163 1648909 1637943 1629517 1624478 1623200
60193A623200K659O720J0952J5539K0559K5732L0691L5400L9913M3945M7067M9223
$$ 1623200 1625859 1632579 1643531 1659070 1679629 1705361 1736052 1771452 1811365 1855310 1902377 1951600
60181A951600N0574N0840M9292M5599M0304L4293K7996K1256J3844N836k460j0842
$$ 1951600 2002174 2053014 2102306 2147905 2188209 2222502 2250498 2271754 2285598 2291434 2288974 2278132
60169B278132j9330k7876l6052m3223m8958n3013n5059n4956n3347n1253m8671
$$ 2278132 2258802 2230926 2194874 2151651 2102693 2049680 1994621 1939665 1886318 1835065 1786394
60158A786394m4301l7306k8901k1204j4815q435r05P328J4969K1123K5387K7443
$$ 1786394 1742093 1704787 1675886 1654682 1639867 1631432 1630527 1637855 1652824 1673947 1699334 1726777
60146A726777K7300K5518K2698J8958J4283R056L793j402o709j1978j6658k0286
$$ 1726777 1754077 1779595 1802293 1821251 1835534 1844590 1848383 1846981 1840272 1828294 1811636 1791350
60134A791350k2750k4114k4418k3617k1628j8534j4765j0748o312p78N976J3090
$$ 1791350 1768600 1744486 1720068 1696451 1674823 1656289 1641524 1630776 1624464 1623686 1629662 1642752
60122A642752J9796K6511L4208M2960N1976O0937P0298Q0013Q9059R6870J04359
$$ 1642752 1662548 1689059 1723267 1766227 1818203 1879140 1949438 2029451 2118510 2215380 2319739
60111B319739J12450J20237J25707J28143J28507J27351J23634J16269J05681
$$ 2319739 2432189 2552426 2678133 2806276 2934783 3062134 3185768 3302037 3407718
60102C407718R2923P8066O0679M1491K2240L807j4279l2192m8855o3136p5209
$$ 3407718 3500641 3578707 3639386 3680877 3703117 3706924 3692645 3660453 3611598 3548462 3473253
60091C473253q5850r5021j01904j06025j07611j07047j04554j00394r4807q7864
$$ 3473253 3387403 3292382 3190478 3084453 2976842 2869795 2765241 2664847 2570040 2482176
60081B482176p9743p0993o2057n2765m2755l2333k2343j3307n152K247Q800J4450
$$ 2482176 2402433 2331440 2269383 2216618 2173863 2141530 2119187 2105880 2100728 2102975 2111775 2126225
60069B126225J9192K2806K5029K5918K5660K4077K0943J6641J1883O706N71o436
$$ 2126225 2145417 2168223 2193252 2219170 2244830 2268907 2289850 2306491 2318374 2325080 2325651 2319215
60057B319215j3300j9283k4704l0082l5193l9527m3071m6061m8324m9543m9862
$$ 2319215 2305915 2286632 2261928 2231846 2196653 2157126 2114055 2067994 2019670 1970127 1920265
60046A920265m9637m8796m6943m3902l9731l4425k8109k1330j4677q250j885M381
$$ 1920265 1870628 1821832 1774889 1730987 1691256 1656831 1628722 1607392 1592715 1584465 1582580 1586961
60034A586961J0597J7300K4900L2793L9837M5806N1627N7829O3371O6469O6248
$$ 1586961 1597558 1614858 1639758 1672551 1712388 1758194 1809821 1867650 1931021 1997490 2063738
60023B063738O3239N8429N2176M4172L4303K3390J2773L025o553j6795k7320l6835
$$ 2063738 2126977 2185406 2237582 2281754 2316057 2339447 2352220 2355245 2348692 2331897 2304577 2267742
60011B267742m4584n0825n5794n8948n9599n7838n4462n0248m5551m0304l4217
$$ 2267742 2223158 2172333 2116539 2057591 1997992 1940154 1885692 1835444 1789893 1749589 1715372
60000A715372k7244j9974j3230p082p41O317J3570K0188K6213L2438L9398M7000
$$ 1715372 1688128 1668154 1654924 1647842 1647101 1653418 1666988 1687176 1713389 1745827 1785225 1832225
59988A832225N4947O2906P0177P5821P9285Q0588P9723P6324P0175O1769N2030
$$ 1832225 1887172 1950078 2020255 2096076 2175361 2255949 2335672 2411996 2482171 2543940 2595970
59977B595970M1611L0730J9546Q326k934j4757k7555m0654n2260o0714o5718o8118
$$ 2595970 2637581 2668311 2687857 2696183 2693249 2678492 2650937 2610283 2558023 2497309 2431591 2363473
59965B363473o8605o7088o3254n7240m9558m0831l1844k3372j5479p417J299J0072
$$ 2363473 2294868 2227780 2164526 2107286 2057728 2016897 1985053 1961681 1946202 1938785 1940084 1950156
59953A950156J7962K4912L1554L8073M4051M9287N3828N7132N8197N6902N4328
$$ 1950156 1968118 1993030 2024584 2062657 2106708 2155995 2209823 2266955 2325152 2382054 2436382
59942B436382N1297M7355M1784L5015K8237K2042J6192J0407M745n99n193q267
$$ 2436382 2487679 2535034 2576818 2611833 2640070 2662112 2678304 2688711 2693456 2692857 2687664 2679397
59930B679397r371q972p702n195l83O985J5862K5090L4417M4178N4584O5593P6904
$$ 2679397 2670026 2661054 2653352 2648157 2647774 2654759 2670621 2695711 2730128 2774306 2828890 2894483 2971387
59917B971387Q7733R7022J04167J09201J12096J12272J09073J02308R2023P8215
$$ 2971387 3059120 3156142 3260309 3369510 3481606 3593878 3702951 3805259 3897282 3975497
59907C975497O1181M1833K1275K37k0706m0539n7869p1594q1428q7869r1759r3556
$$ 3975497 4036678 4078511 4099786 4100023 4079317 4038778 3980909 3909315 3827887 3740018 3648259 3554703
59895C554703r2946q9369q3103p5427o7511n9461n0761m1270l1338k1245j1007
$$ 3554703 3461757 3372388 3289285 3213858 3146347 3086886 3036125 2994855 2963517 2942272 2931265
59884B931265p01R372J8900K7776L6210M4619N3150O1203O7892P3077P7290Q0229
$$ 2931265 2930564 2939936 2958836 2986612 3022822 3067441 3120591 3181794 3249686 3322763 3400053 3480282
59872C480282Q0027P4846O4791N1429L5711J7372l459k5072m4970o1414p3937
$$ 3480282 3560309 3635155 3699946 3751375 3787086 3804458 3800999 3775927 3730957 3669543 3595606
59861C595606q2860q8748r2066r3083r2123q9855q6935q3431p8909p3196o6660
$$ 3595606 3512746 3423998 3331932 3238849 3146726 3056871 2969936 2886505 2807596 2734400 2667740
59850B667740n9771n2805m6101m0110l4892k9905k4636j9292j4580j0793p263
$$ 2667740 2607969 2555164 2509063 2468953 2434061 2404156 2379520 2360228 2345648 2334855 2327592
59839B327592k905K650Q450J3152J6523J9610K3148K6426K8304K8669K8027K6053
$$ 2327592 2324687 2327337 2335787 2348939 2365462 2385072 2408220 2434646 2462950 2491619 2519646 2545699
59827B545699K1769J5155P504j4p120j3539j8404k1242k2733k3828k4718k5102
$$ 2545699 2567468 2582623 2590127 2590113 2582993 2569454 2551050 2529808 2507075 2483247 2458529 2433427
59815B433427k4937k4338k3378k2518k2481k3175k3404k2526k1659k2250k3952
$$ 2433427 2408490 2384152 2360774 2338256 2315775 2292600 2269196 2246670 2225011 2202761 2178809
59804B178809k5078k4932k4492k4779k5635k6338k6530k6133k5064k3465k1710
$$ 2178809 2153731 2128799 2104307 2079528 2053893 2027555 2001025 1974892 1949828 1926363 1904653
59793A904653j9852j7421j3981r498m058K397R779J7768K6253L5501M5673N6523
$$ 1904653 1884801 1867380 1853399 1843901 1839843 1842240 1852019 1869787 1896040 1931541 1977214 2033737
59781B033737O7783P9612R2337J05940J19897J33260J44587J51744J51945J42134
$$ 2033737 2101520 2181132 2273469 2379409 2499306 2632566 2777153 2928897 3080842 3222976
59771C222976J19931Q5083M0588p683n2915q9583j14754j28198j31673j27756
$$ 3222976 3342907 3427990 3468578 3460895 3407980 3318397 3203643 3075445 2943772 2816016
59761B816016j18829j06777r3110p8955o4955n1556l9410k9175k0824j3621o941
$$ 2816016 2697187 2590410 2497300 2418345 2353390 2301834 2262424 2233249 2212425 2198804 2191863
59750B191863q98M052P832J0925J4007J7553K1621K5838K9779L3558L7868M3272
$$ 2191863 2190965 2195017 2202849 2213774 2227781 2245334 2266955 2292793 2322572 2356130 2393998 2437270
59738B437270M9548N5940O2020O8118P4934Q2874R1799J01382J11577J22622J34623
$$ 2437270 2486818 2542758 2604778 2672896 2747830 2830704 2922503 3023885 3135462 3258084 3392707
59727C392707J47278J60143J72984J85639J97712K08629K17888K24872K28421
$$ 3392707 3539985 3700128 3873112 4058751 4256463 4465092 4682980 4907852 5136273
59718E136273K27012K19689K06747J89553J69957J49807J30676J13613R9283Q8306
$$ 5136273 5363285 5582974 5789721 5979274 6149231 6299038 6429714 6543327 6642610 6730916
59708F730916Q1215P7863P7092P7326P7469P7126P6116P4021P0324O4796N7723
$$ 6730916 6812131 6889994 6967086 7044412 7121881 7199007 7275123 7349144 7419468 7484264 7541987
59697G541987M9815M1848L4232K6921J9834J3348Q219M992L672M157O693J1688
$$ 7541987 7591802 7633650 7667882 7694803 7714637 7727985 7736204 7741196 7744868 7749025 7755718 7767406
59685G767406J9107K8539L9879N3555O9760Q7799J06611J25688J44952J63858
$$ 7767406 7786513 7815052 7854931 7908486 7978246 8066045 8172656 8298344 8443296 8607154
59675H607154J81193J95875K07457K15697K19967K19214K12039J96797J72330
$$ 8607154 8788347 8984222 9191679 9407376 9627343 9846557 10058596 10255393 10427723
59666A0427723J38998R8585N2870K930m9784j02365j51266j93925k29028k55587
$$ 10427723 10566721 10665306 10718176 10721106 10671322 10568957 10417691 10223766 9994738 9739151
59656I739151k72681k80025k78247k68644k53278k35198k17917k04717j98787
$$ 9739151 9466470 9186445 8908198 8639554 8386276 8151078 7933161 7728444 7529657
59647G529657k03327k19887k45991k75269l00662l17629l24641l22066l11373
$$ 7529657 7326330 7106443 6860452 6585183 6284521 5966892 5642251 5320185 5008812
59638E008812k94859k75071k54100k33335k13455j94379j75684j57481j40682
$$ 5008812 4713953 4438882 4184782 3951447 3737992 3543613 3367929 3210448 3069766
59629C069766j26127j13673j02436r1733q1535p2216o4092n7131n0941m5184m0038
$$ 3069766 2943639 2829966 2727530 2635797 2554262 2482046 2417954 2360823 2309882 2264698 2224660
59618B224660l5999l3234l1384l0023k8890k7606k5695k3226k1021j9874j9794
$$ 2224660 2188661 2155427 2124043 2094020 2065130 2037524 2011829 1988603 1967582 1947708 1927914
59607A927914k0185k0532k0656k0572k0338j9987j9554j9258j9474k0114k0326
$$ 1927914 1907729 1887197 1866541 1845969 1825631 1805644 1786090 1766832 1747358 1727244 1706918
59596A706918j9469j8248j7989j8701j8921j7790j6255j5500j5158j4059j2001
$$ 1706918 1687449 1669201 1651212 1632511 1613590 1595800 1579545 1564045 1548887 1534828 1522827
59585A522827r707p526n358l538k591k038o43J918M570O372P687R449J1881J4491
$$ 1522827 1513120 1505594 1500236 1496698 1494107 1492069 1491426 1493344 1497914 1504286 1511973 1521422 1533303 1547794
59571A547794J6811J8722K0368K2105K4226K6517K8413K9856L1580L4203L7396
$$ 1547794 1564605 1583327 1603695 1625800 1650026 1676543 1704956 1734812 1766392 1800595 1837991
59560A837991M0408M3122M6043M9402N2802N5860N8720O1785O5390O9896P5506
$$ 1837991 1878399 1921521 1967564 2016966 2069768 2125628 2184348 2246133 2311523 2381419 2456925
59549B456925Q1266Q4483Q2151P3587O1459M9788M1029L5114L0644K6242K1053
$$ 2456925 2538191 2622674 2704825 2778412 2839871 2889659 2930688 2965802 2996446 3022688 3043741
59538C043741J4875Q124J243n945j3742k1652k8690l4741m0664m6744n1937n5211
$$ 3043741 3058616 3066740 3067983 3062038 3048296 3026644 2997954 2963213 2922549 2875805 2823868 2768657
59526B768657n6757n7256n6750n5070n2649m9852m6071m0585l3911k7097k0050
$$ 2768657 2711900 2654644 2597894 2542824 2490175 2440323 2394252 2353667 2319756 2292659 2272609
59515B272609j1799k345P173J6254K5704L6126M7005N7775O8687P9832R0198R8571
$$ 2272609 2260810 2258465 2265638 2281892 2307596 2343722 2390727 2448502 2517189 2597021 2687219 2785790
59503B785790J04681J08708J10156J08026J01707R1165P6663N9022L9576J9243
$$ 2785790 2890471 2999179 3109335 3217361 3319068 3410233 3486896 3545918 3585494 3604737
59493C604737k086k4379m6128o5107q0241r1843j00088j04322j04177j00445r4347
$$ 3604737 3602651 3578272 3532144 3467037 3386796 3294953 3194865 3090543 2986366 2885921 2791574
59482B791574q6538p7277o7011n6260m5241l4048k3066j2750l226N501J3032J8749
$$ 2791574 2705036 2627759 2560748 2504488 2459247 2425199 2402133 2389383 2386157 2391658 2404690 2423439
59470B423439K2479K4576K5336K4631K2226J8164J2644N848j986j0410j9047k7819
$$ 2423439 2445918 2470494 2495830 2520461 2542687 2560851 2573495 2579343 2577357 2566947 2547900 2520081
59458B520081l6779m5709n4075o1286o6914p0780p3047p4096p4156p3176p1250
$$ 2520081 2483302 2437593 2383518 2322232 2255318 2184538 2111491 2037395 1963239 1890063 1818813
59447A818813o8894o6533o3860o0353n6303n2706m9982m7378m4012l9947l5840
$$ 1818813 1749919 1683386 1619526 1559173 1502870 1450164 1400182 1352804 1308792 1268845 1233005
59436A233005l2014k8374k4910k1728j8746j5814j2969j0242p409m247o75L587
$$ 1233005 1200991 1172617 1147707 1125979 1107233 1091419 1078450 1068208 1060799 1056552 1055877 1059464
59424A059464Q899J4430J7504J5414Q186j008q285j1502j0711p322l122Q33M891
$$ 1059464 1068363 1082793 1100297 1115711 1123897 1122889 1114604 1103102 1092391 1085069 1081947 1082780 1087671
59411A087671R884J5145J8043J6035R083k24q542j3586j4788j3026r822o376l140
$$ 1087671 1097555 1112700 1130743 1146778 1155861 1155637 1147095 1133509 1118721 1105695 1095873 1089497 1086357
59398A086357j17K782N745R008J2543J5956J8921K1547K4195K7094L0228L3410
$$ 1086357 1086240 1089022 1094767 1103775 1116318 1132274 1151195 1172742 1196937 1224031 1254259 1287669
59386A287669L6462L9484M2882M6790N0580N3439N5393N7251N9342O1034O1682
$$ 1287669 1324131 1363615 1406497 1453287 1503867 1557306 1612699 1669950 1729292 1790326 1852008
59375A852008O1684O2094O3650O6481P0551P6057Q3422R2982J04491J17105J30191
$$ 1852008 1913692 1975786 2039436 2105917 2176468 2252525 2335947 2428929 2533420 2650525 2780716
59364B780716J43997J58924J74279J88606K01221K12413K21814K27625K28145
$$ 2780716 2924713 3083637 3257916 3446522 3647743 3860156 4081970 4309595 4537740
59355D537740K23278K13950K00856J84564J66048J46121J24777J01996P8680N5844
$$ 4537740 4761018 4974968 5175824 5360388 5526436 5672557 5797334 5899330 5978010 6033854
59345F033854L3345J0475j2585l5027n6899p9077j01724j24024j45534j66496
$$ 6033854 6067199 6077674 6065089 6030062 5973163 5894086 5792362 5668338 5522804 5356308
59335E356308j86394k03287k15348k22264k24622k22771k17111k08904j99690
$$ 5356308 5169914 4966627 4751279 4529015 4304393 4081622 3864511 3655607 3455917
59326C455917j89992j79297j67297j54639j42348j30932j20257j10068j00426
$$ 3455917 3265925 3086628 2919331 2764692 2622344 2491412 2371155 2261087 2160661
59317B160661r1567q3418p5523o7597n9984n3252m7461m2211l7272l2701k8368
$$ 2160661 2069094 1985676 1910153 1842556 1782572 1729320 1681859 1639648 1602376 1569675 1541307
59306A541307k3958j9624j5982j3259j0882q290n646l387j460M90K465M191N660
$$ 1541307 1517349 1497725 1481743 1468484 1457602 1449312 1443666 1440279 1438819 1439309 1441774 1445965 1451625
59293A451625P140Q723J0324J2029J4016J6056J7599J8505J9292K0466K1915K3241
$$ 1451625 1458765 1467488 1477812 1489841 1503857 1519913 1537512 1556017 1575309 1595775 1617690 1640931
59281A640931K4419K5689K6917K7490K7008K5736K4119K2043J8874J4205Q288
$$ 1640931 1665350 1691039 1717956 1745446 1772454 1798190 1822309 1844352 1863226 1877431 1885719
59270A885719J754m878j1373j7646k3636k9118l3678l6998l9222m0874m2255m3186
$$ 1885719 1887473 1882595 1871222 1853576 1829940 1800822 1767144 1730146 1690924 1650050 1607795 1564609
59258A564609m3373m2928m2326m1963m1770m1132l9306l6228l2875l0470k9115
$$ 1564609 1521236 1478308 1435982 1394019 1352249 1311117 1271811 1235583 1202708 1172238 1143123
59247A143123k7675k5170k1861j8719j6264j4337j2567j0623q228n486k948j008
$$ 1143123 1115448 1090278 1068417 1049698 1033434 1019097 1006530 995907 987679 982193 979245 978237
59235I78237O27K437M322N781O755P732R140J1016J3197J5407J7353J9101K1196
$$ 978237 978864 981301 985623 991404 998159 1005891 1015031 1026047 1039244 1054651 1072004 1091105 1112301
59222A112301K4080K7618L1573L6158M1507M7053N2174N7271O3382P0820P9003
$$ 1112301 1136381 1163999 1195572 1231730 1273237 1320290 1372464 1429735 1493117 1563937 1642940
59211A642940Q7469R6229J05165J13954J22712J31731J40358J46929J50056J49251
$$ 1642940 1730409 1826638 1931803 2045757 2168469 2300200 2440558 2587487 2737543 2886794
59201B886794J44204J34511J20359J02530Q1240N5986K7178k932l1757n8119q1791
$$ 2886794 3030998 3165509 3285868 3388398 3469638 3525624 3552802 3549870 3518113 3459994 3378203
59190C378203j02107j17976j28976j35543j38245j37500j33821j27773j19917
$$ 3378203 3276096 3158120 3029144 2893601 2755356 2617856 2484035 2356262 2236345
59181B236345j11068j02214r3689q4915p5417o5703n6596m8261m0536l3712k8171
$$ 2236345 2125277 2023063 1929374 1844459 1769042 1703339 1646743 1598482 1557946 1524234 1496063
59170A496063k3549j9073j4503j0132o194k957r94n29q48j216k084m363p716j0683
$$ 1496063 1472514 1453441 1438938 1428806 1422612 1419655 1418661 1418132 1417284 1416068 1413984 1409621 1401905 1391222
59156A391222j2523j3815j5099j6092j6586j7006j7494j7322j5911j3722j1548
$$ 1391222 1378699 1364884 1349785 1333693 1317107 1300101 1282607 1265285 1249374 1235652 1224104
59145A224104r483p326n428m320l678k472j90K561M764N957O425O764P352Q134
$$ 1224104 1214621 1207295 1201867 1197547 1193869 1191397 1191207 1193768 1198532 1204489 1210914 1217678 1225030 1233164
59131A233164Q857R397R803J0025R870R207Q087O671N278M423M430M925N110M684
$$ 1233164 1242021 1251418 1261221 1271246 1281116 1290323 1298410 1305081 1310359 1314782 1319212 1324137 1329247 1333931
59117A333931M127L956L979L617K652J426M18j67n40j164k278l485m072l825l349
$$ 1333931 1338058 1342014 1345993 1349610 1352262 1353688 1354106 1353939 1353399 1352235 1349957 1346472 1342400 1338575 1335226
59102A335226l347l792m019l486k280r23J95J215K565M285N806O672P335Q700
$$ 1335226 1331879 1328087 1324068 1320582 1318302 1317379 1317574 1318789 1321354 1325639 1331445 1338117 1345452 1354152
59088A354152J0946J3305J5135J6559J7866J8810J9051J8741J8171J7091J5004
$$ 1354152 1365098 1378403 1393538 1410097 1427963 1446773 1465824 1484565 1502736 1519827 1534831
59077A534831J1963Q565N217J932j274m315p371j0776j4393j7585k0093k2436
$$ 1534831 1546794 1555359 1560576 1562508 1561234 1556919 1549548 1538772 1524379 1506794 1486701 1464265
59065A464265k5116k7733k9370k9698k9286k8740k8067k7065k5954k5166k4605
$$ 1464265 1439149 1411416 1382046 1352348 1323062 1294322 1266255 1239190 1213236 1188070 1163465
59054A163465k3616k1847j9815j8324j7506j6745j5490j3800j2038j0369q659
$$ 1163465 1139849 1118002 1098187 1079863 1062357 1045612 1030122 1016322 1004284 993915 985256
59043I85256o862n213m000l133k087n37R39J207j48k209l771m698n725p116q252
$$ 985256 978394 973181 969181 966048 963961 963424 964363 965570 965422 963213 959442 954744 949019 941903 933651
59028I33651q659q607q384p681o288m864m207m054l391j978p67n94j004q95J00
$$ 933651 924992 916385 908001 900320 894032 889168 884961 880907 877516 875538 874771 874177 873173 872278 872378
59013H72378J337K195K785L500M270M662M670M930N967P481Q651R077R129R441
$$ 872378 873715 875910 878695 882195 886465 891127 895797 900727 906694 914175 922826 931903 941032 950473
58999I50473J0334J1723J3273J4688J6097J8134K1237K4834K7784K9757L1530
$$ 950473 960807 972530 985803 1000491 1016588 1034722 1055959 1080793 1108577 1138334 1169864
58988A169864L3580L5069L4934L3481L1973L0720K8579K4583J9251J3756Q479
$$ 1169864 1203444 1238513 1273447 1306928 1338901 1369621 1398200 1422783 1442034 1455790 1464269
58977A464269L055k470p307j0847j3340j5403j7146j8124j8023j7152j6115j5148
$$ 1464269 1467324 1464854 1457547 1446700 1433360 1417957 1400811 1382687 1364664 1347512 1331397 1316249
58965A316249j3892j1861r070o126l718k076r21J00J031J550J403Q22M63P96J711
$$ 1316249 1302357 1290496 1281426 1275300 1271582 1269506 1268585 1268685 1269716 1271266 1272669 1273491 1273954 1274750 1276461
58950A276461K763L687M378M598M231L858M514O503Q867J0536J1681J3299J5650
$$ 1276461 1279224 1282911 1287289 1291887 1296118 1299976 1304490 1310993 1319860 1330396 1342077 1355376 1371026
58937A371026J7961J9744K1513K3789K6202K8346L0857L4714L9721M4720M9231
$$ 1371026 1388987 1408731 1430244 1454033 1480235 1508581 1539438 1574152 1613873 1658593 1707824
58926A707824N3772N8339O1543O1910N9289N4388M7635L9466L1260K4996K1801
$$ 1707824 1761596 1819935 1881478 1943388 2002677 2057065 2104700 2144166 2175426 2200422 2222223
58915B222223K1366K2718K5093K8119L1742L6039M0768M5274M9258N3434N8791
$$ 2222223 2243589 2266307 2291400 2319519 2351261 2387300 2428068 2473342 2522600 2576034 2634825
58904B634825O5355P2325P9351Q6874R5223J04145J13461J23316J33460J42863
$$ 2634825 2700180 2772505 2851856 2938730 3033953 3138098 3251559 3374875 3508335 3651198
58894C651198J50411J55327J56692J53418J45286J33472J19484J04188Q8379P3571
$$ 3651198 3801609 3956936 4113628 4267046 4412332 4545804 4665288 4769476 4857855 4931426
58884D931426O1212N1383M3003L5103K7173J8544Q402l452j6400k9756m3156n6332
$$ 4931426 4992638 5044021 5087024 5122127 5149300 5167844 5176246 5172794 5156394 5126638 5083482 5027150
58872E027150o9009q1043r2239j02020j09784j15662j20346j24195j26977j28518
$$ 5027150 4958141 4877098 4784859 4682839 4573055 4457393 4337047 4212852 4085875 3957357
58862C957357j29016j28559j26867j23847j19997j16018j12218j08475j04421
$$ 3957357 3828341 3699782 3572915 3449068 3329071 3213053 3100835 2992360 2887939
58853B887939r9629r3955q7972q2606p8124p3748o8611o2837n7331n2648m8443
$$ 2887939 2788310 2694355 2606383 2523777 2445653 2371905 2303294 2240457 2183126 2130478 2082035
58842B082035m4028l9186l4356l0093k6516k3284k0003j6544j2960r388o102l402
$$ 2082035 2038007 1998821 1964465 1934372 1907856 1884572 1864569 1848025 1835065 1825677 1819575 1816173
58830A816173j167J228M284P757J1043J3934J6604J9038K1016K2707K4692K7144
$$ 1816173 1815006 1816234 1820518 1828275 1839318 1853252 1869856 1888894 1909910 1932617 1957309 1984453
58818A984453K9394L0608L0688L0348L0548L1844L4105L6718L9287M2082M5536
$$ 1984453 2013847 2044455 2075143 2105491 2136039 2167883 2201988 2238706 2277993 2320075 2365611
58807B365611M9537N3611N7837O2932O9325P6575Q3870R0666R6746J02235J07756
$$ 2365611 2415148 2468759 2526596 2589528 2658853 2735428 2819298 2909964 3006710 3108945 3216701
58796C216701J13941J20433J25932J29661J32263J34617J36300J35995J33186
$$ 3216701 3330642 3451075 3577007 3706668 3838931 3973548 4109848 4245843 4379029
58787D379029J28556J22730J15440J06192R5177Q3074P0216N6271M0489K1942
$$ 4379029 4507585 4630315 4745755 4851947 4947124 5030198 5100414 5156685 5197174 5219116
58777E219116l52k6919n7001q8175j17138j41270j59586j72219j79345j81084
$$ 5219116 5218764 5191845 5134844 5046669 4929531 4788261 4628675 4456456 4277111 4096027
58767D096027j78287j72735j66090j58953j51227j42979j34614j26482j18782
$$ 4096027 3917740 3745005 3578915 3419962 3268735 3125756 2991142 2864660 2745878
58758B745878j11681j05060r8334r1059q3649p6991p1289o5746n9549n2833m6397
$$ 2745878 2634197 2529137 2430803 2339744 2256095 2179104 2107815 2042069 1982520 1929687 1883290
58747A883290m0773l5837l1150k6485k2005j8041j4747j2018r805q323p728p672
$$ 1883290 1842517 1806680 1775530 1749045 1727040 1708999 1694252 1682234 1672429 1664106 1656378 1648706
58735A648706p460o744n745m652l101n98K619N470O893O565M576O20n882j4704
$$ 1648706 1641246 1634502 1628757 1624105 1621004 1620406 1623025 1628495 1635388 1641953 1646529 1647149 1641267 1626563
58721A626563k4170l2059l7157l9756m0860m1318m1601m1841m1758m0950l9396
$$ 1626563 1602393 1570334 1533177 1493421 1452561 1411243 1369642 1327801 1286043 1245093 1205697
58710A205697l7479l5371l2848k9850k6747k3693k0175j5678j0538n577j123L109
$$ 1205697 1168218 1132847 1099999 1070149 1043402 1019709 999534 983856 973318 967741 966618 969727
58698I69727P197J0609J2562J2437R797M548k777j1016j8810k4966k8675k9711
$$ 969727 976924 987533 1000095 1012532 1022329 1026877 1024100 1013084 994274 969308 940633 910922
58686I10922k8480k5633k1726j7287j2858q609m215M77M940Q629J1969J6025K1223
$$ 910922 882442 856809 835083 817796 804938 796329 792114 792591 797531 806160 818129 834154 855377
58673H55377K6931L2306L6947M0738M3685M6003M7741M7951M4808L6850K3969
$$ 855377 882308 914614 951561 992299 1035984 1081987 1129728 1177679 1222487 1259337 1283306
58662A283306P373j0755k7505m0212m7865n1286n1628m9289m4553l8584l2879
$$ 1283306 1290679 1279924 1252419 1212207 1164342 1113056 1061428 1012139 967586 929002 896123
58651H96123k8077k3907k0155j7078j4997j3989j3864j4082j3852j2747j1089
$$ 896123 868046 844139 823984 806906 791909 777920 764056 749974 736122 723375 712286
58640G12286r430p880o334n001m066l145j734k02M29j75j118j283m44P68J515
$$ 712286 702856 694976 688642 683641 679575 676430 674696 674494 674923 674748 673630 672347 671903 672671 674186
58625F74186J310L78l09K10J816L336L900L931M468N859P494Q721R557J0505J1886
$$ 674186 675496 675874 675565 675775 677591 680927 684827 688758 693226 699085 706579 715300 724857 735362 747248
58610G47248J3525J5007J6198J7441J9132K1279K3592K5924K8295L0515L2261
$$ 747248 760773 775780 791978 809419 828551 849830 873422 899346 927641 958156 990417
58599I90417L3648L5282L7492L9760M1242M1664M1408M0815L9733L7728L4487
$$ 990417 1024065 1059347 1096839 1136599 1177841 1219505 1260913 1301728 1341461 1379189 1413676
58588A413676K9959K4292J7777J0856M156j740o702j1071j5042j8152j9893k0609
$$ 1413676 1443635 1467927 1485704 1496560 1500716 1498976 1492274 1481203 1466161 1448009 1428116 1407507
58576A407507k1124k1424k0560j8307j5957j4680j3759j1627q280n395l988l274
$$ 1407507 1386383 1364959 1344399 1326092 1310135 1295455 1281696 1270069 1261789 1256394 1252406 1249132
58564A249132k252j223r34j109r16m03m91j722l802o399r505j3039j6793k0908
$$ 1249132 1246880 1245657 1244723 1243614 1242698 1242295 1241804 1240082 1236280 1229881 1220376 1207337 1190544 1169636
58550A169636k5686l0692l4643l6546l6560l5424l3548l1033k8160k5250k2249
$$ 1169636 1143950 1113258 1078615 1042069 1005509 970085 936537 905504 877344 852094 829845
58539H29845j8910j5348j2074r533p881p232p700r104j0827j2149j2715j2695
$$ 829845 810935 795587 783513 773980 766099 758867 751167 742063 731236 719087 706372 693677
58527F93677j2594j2741j2828j2124j0323q057o301n397m962m649m541m614m381
$$ 693677 681083 668342 655514 643390 633067 625010 618709 613312 608350 603701 599160 594546 590165
58514E90165l410k053j123q81p30m4J008J794K215K893M341O262P956R073R715
$$ 590165 586755 584702 583579 582698 581968 581924 582932 584726 586941 589834 594175 600437 608393 617466 627181
58499F27181R969R837R563R520R673R561R000Q340P853P288O450N712N458N320
$$ 627181 637150 646987 656550 666070 675743 685304 694304 702644 710497 717785 724235 729947 735405 740725
58485G40725M582L210J875R94K91o40j909l526n429p218q383q948r421r915r961
$$ 740725 745307 748517 750392 751386 751677 751037 749128 745602 740173 732955 724572 715624 706203 696288 686327
58470F86327r489r285r930j0789j0704r407p658o197n208m700m685m926m988m706
$$ 686327 676838 667553 657623 646834 636130 626723 619065 612868 607660 602960 598275 593349 588361 583655
58456E83655m200l434k223q17N4j7o11r59p24j49L17L26j33o68p82m10Q9N53J243
$$ 583655 579455 576021 573798 572981 573035 573018 572407 571448 570724 570575 570892 571218 571085 570417 569635 569225 569314 569867 571110
58437E71110K222K901K704J982J750K565L974N083N322M668L577K784K844L576
$$ 571110 573332 576233 578937 580919 582669 585234 589208 594291 599613 604281 607858 610642 613486 617062
58423F17062M227M337M187M235M459M511M313M051L755L301K855K893L639M714
$$ 617062 621289 625626 629813 634048 638507 643018 647331 651382 655137 658438 661293 664186 667825 672539
58409F72539N468N511M891M039L557L701M012L768K983K564L126M083M362L769
$$ 672539 678007 683518 688409 692448 696005 699706 703718 707486 710469 713033 716159 720242 724604 728373
58395G28373L098K988L272L582L994M722N609O302O740P148P656Q181Q626Q885
$$ 728373 731471 734459 737731 741313 745307 750029 755638 761940 768680 775828 783484 791665 800291 809176
58381H09176Q733P941O611N194M067L205K337J421Q31R66J755K690L395L922M411
$$ 809176 817909 825850 832461 837655 841722 844927 847264 848685 849516 850482 852237 854927 858322 862244 866655
58366H66655M702M603M405M697N671O876P730P960P599O928O502O763P456P824
$$ 866655 871357 875960 880365 885062 890733 897609 905339 913299 920898 927826 934328 941091 948547 956371
58352I56371P629P556Q222R173R369Q459P136O294O328P140Q352R469J0212J0822
$$ 956371 964000 971556 979778 988951 998320 1006779 1013915 1020209 1026537 1033677 1042029 1051498 1061710 1072532
58338A072532J1708J2771J3473J3588J3515J3671J3995J4251J4491J4875J5342
$$ 1072532 1084240 1097011 1110484 1124072 1137587 1151258 1165253 1179504 1193995 1208870 1224212
58327A224212J5761J6251J6915J7522J7832J8203J9256K0891K2115K2250K1822
$$ 1224212 1239973 1256224 1273139 1290661 1308493 1326696 1345952 1366843 1388958 1411208 1433030
58316A433030K1826K2400K2851K2873K3021K3673K4295K4075K2988K1628K0346
$$ 1433030 1454856 1477256 1500107 1522980 1546001 1569674 1593969 1618044 1641032 1662660 1683006
58305A683006J9214J8539J8714J9477K0025K0104K0374K1450K3155K5023K6994
$$ 1683006 1702220 1720759 1739473 1758950 1778975 1799079 1819453 1840903 1864058 1889081 1916075
58294A916075K9092L0921L2115L3065L4565L6807L9252M1399M3193M4757M6190
$$ 1916075 1945167 1976088 2008203 2041268 2075833 2112640 2151892 2193291 2236484 2281241 2327431
58283B327431M7727M9550N1361N2667N3603N5008N7361O0102O2345O4001O5631
$$ 2327431 2375158 2424708 2476069 2528736 2582339 2637347 2694708 2754810 2817155 2881156 2946787
58272B946787O7429O8837O9268O8741O7653O6305O4909O3794O3261O3295O3802
$$ 2946787 3014216 3083053 3152321 3221062 3288715 3355020 3419929 3483723 3546984 3610279 3674081
58261C674081O4994O7216P0304P3614P6872Q0561Q5186R0561R6238J02250J08838
$$ 3674081 3739075 3806291 3876595 3950209 4027081 4107642 4192828 4283389 4379627 4481877 4590715
58250D590715J15747J22420J28823J35397J42289J49260J56431J64312J72993
$$ 4590715 4706462 4828882 4957705 5093102 5235391 5384651 5541082 5705394 5878387
58241E878387J82034J91442K01972K14058K27074K40156K53246K66926K81617
$$ 5878387 6060421 6251863 6453835 6667893 6894967 7135123 7388369 7655295 7936912
58232G936912K97445L14571L33235L53637L75935M00036M25572M52555M82040
$$ 7936912 8234357 8548928 8882163 9235800 9611735 10011771 10437343 10889898 11371938
58223A1371938N15358N52766N93819O38963O89602P46448Q09225Q78447R56024
$$ 11371938 11887296 12440062 13033881 13672844 14362446 15108894 15918119 16796566 17752590
58214A7752590J043659J142102J252755J378525J522694J688681J880535K099509
$$ 17752590 18796249 19938351 21191106 22569631 24092325 25781006 27661541 29761050
58206B9761050K338321K584130K833905L107485L442265L874698M428177N115267
$$ 29761050 32099371 34683501 37517406 40624891 44067156 47941854 52370031 57485298
58198E7485298N945513O930216Q084558R428493J0985158J2777774J4825368J7130417
$$ 57485298 63430811 70361027 78445585 87874078 98859236 111637010 126462378 143592795
58190A43592795J9652100K2267770K4723261K6569926K7127997K5582973K1294655
$$ 143592795 163244895 185512665 210235926 236805852 263933849 289516822 310811477
58183C10811477J4214839N123667m551764j3269560j9920229k4079511k5918072
$$ 310811477 325026316 330149983 325598219 312328659 292408430 268328919 242410847
58176B42410847k5937842k4722817k2786845k0514319j8162106j5889411j3788213
$$ 242410847 216473005 191750188 168963343 148449024 130286918 114397507 100609294
58169A00609294j1903459j0247542q813585p585007o539938n654173m904570m270602
$$ 100609294 88705835 78458293 69644708 62059701 55519763 49865590 44961020 40690418
58161D0690418l733490l276125k884728k549215k261221k012719j796939j609261
$$ 40690418 36956928 33680803 30796075 28246860 25985639 23972920 22175981 20566720
58153B0566720j446328j304777j181201j072572r76258q90147q13028p44324o83215
$$ 20566720 19120392 17815615 16634414 15561842 14585584 13695437 12882409 12138085 11454870
58144A1454870o28359n78653n33741m93580m57723m25211l95066l66972l41485
$$ 11454870 10826511 10247858 9714117 9220537 8762814 8337603 7942537 7575565 7234080
58135G234080l19265k99874k81831k64138k47294k32327k19370k07778j97071
$$ 7234080 6914815 6614941 6333110 6068972 5821678 5589351 5369981 5162203 4965132
58126D965132j86995j77051j66925j57173j48681j41466j34751j28083j21634
$$ 4965132 4778137 4601086 4434161 4276988 4128307 3986841 3852090 3724007 3602373
58117C602373j15470j09368j03448r8193r3749q9744q5921q2363p8998p5501p1785
$$ 3602373 3486903 3377535 3274087 3175894 3082145 2992401 2906480 2824117 2745119 2669618 2597833
58106B597833o8112o4592o1084n7614n4363n1257m8109m5127m2673m0478l7899
$$ 2597833 2529721 2465129 2404045 2346431 2292068 2240811 2192702 2147575 2104902 2064424 2026525
58095B026525l5047l2982l2441l3022l3918l4818l5695l6321l6503l6453l6352
$$ 2026525 1991478 1958496 1926055 1893033 1859115 1824297 1788602 1752281 1715778 1679325 1642973
58084A642973l5922l4894l3627l2814l2661l2772l2689l2236l1414l0264k8879
$$ 1642973 1607051 1572157 1538530 1505716 1473055 1440283 1407594 1375358 1343944 1313680 1284801
58073A284801k7388k5919k4652k3745k3101k2440k1630k0779j9847j8568j6949
$$ 1284801 1257413 1231494 1206842 1183097 1159996 1137556 1115926 1095147 1075300 1056732 1039783
58062A039783j5502j4691j4372j4132j3929j3958j4080j3886j3385j3153j3577
$$ 1039783 1024281 1009590 995218 981086 967157 953199 939119 925233 911848 898695 885118
58051H85118j4271j4516j4020j3045j1926j0729r434q201p315o964p065p316p332
$$ 885118 870847 856331 842311 829266 817340 806611 797177 788976 781661 774697 767632 760316 752984
58038G52984o854n921m872m154m069m550n158n380n102m786m957n498n750n346
$$ 752984 746130 740209 735337 731183 727114 722564 717406 712026 706924 702138 697181 691683 685933 680587
58024F80587m707m392m325m045l460k828k121j085j3L18k79r33p36K45J360K258
$$ 680587 675880 671488 667163 663118 659658 656830 654709 653624 653611 653929 653650 652717 651981 652226 653586 655844
58008F55844K944L379L659M286N639P364Q770R719J0580J1513J2395J3235J4062
$$ 655844 658788 662167 665826 670112 675751 683115 691885 701604 712184 723697 736092 749327 763389
57995G63389J4508J4138J3242J2625J2650J3162J4306J6596J9874K3034K5234
$$ 763389 777897 792035 805277 817902 830552 843714 858020 874616 894490 917524 942758
57984I42758K6711K8012K9025K9370K9167K8694K7604K5210K1420J6734J1384
$$ 942758 969469 997481 1026506 1055876 1085043 1113737 1141341 1166551 1187971 1204705 1216089
57973A216089N119k144r965j7816k5351l2095l7345m0691m2319m2513m1158l8142
$$ 1216089 1221208 1219064 1209099 1191283 1165932 1133837 1096492 1055801 1013482 970969 929811 891669
57961H91669l4124l0339k7516k5254k2749j9851j7152j5099j3369j1261q464n373
$$ 891669 857545 827206 799690 774436 751687 731836 714684 699585 686216 674955 666491 661118
57949F61118k683p79N53J755K807L172K610J805J558J546O42j395l393m416n002
$$ 661118 658435 657656 658209 659964 662771 665943 668553 670358 671916 673462 674104 672709 669316 664900 659898
57934F59898o010o921o471m656k869j899r70R30L601O154Q258J0206J2097J3489
$$ 659898 653888 646967 640496 635840 632971 631072 630102 631032 634633 640787 649045 659251 671348 684837
57920F84837J3803J2775J0549P443L546j251o616j1503j5082j7719k0209k2238
$$ 684837 698640 711415 721964 729407 732953 731702 725086 713583 698501 680782 660573 638335
57908F38335k2638k1226j9288j7842j6555j4915j3385j2475j1640j0163q452p372
$$ 638335 615697 594471 575183 557341 540786 525871 512486 500011 488371 478208 469756 462384
57896D62384o850o303n984o594p773q302p886p467p578p535o710n515m573l714
$$ 462384 455534 449231 443247 436653 428880 420578 412692 405225 397647 390112 383402 377887 373314 369600
57882C69600k502j147j78M26J143K177L253M010M303M216M081M272M785N185N095
$$ 369600 367098 365951 365773 366199 367342 369519 372772 376782 381085 385301 389382 393654 398439 403624 408719
57867D08719M511L644K703J943J535J286Q52K69j65n99j648l388m939n538n561
$$ 408719 413230 416874 419577 421520 423055 424341 425193 425462 425297 424698 423050 419662 414723 409185 403624
57852D03624n938o890p810q171p963p342o388n251m076k708q90J196K954M024
$$ 403624 397686 390796 382986 374815 366852 359510 353122 347871 343795 341087 340197 341393 344347 348371
57838C48371M567M832M770M264L456K675K191K117K345K403J648o7j985l046l014
$$ 348371 352938 357770 362540 366804 370260 372935 375126 377243 379588 381991 383639 383572 381587 378541 375527
57823C75527k699k933l518l569k808j947j619j347j38K097M350N829O761P723
$$ 375527 372828 369895 366377 362808 360000 358053 356434 355087 354949 357046 361396 367225 373986 381709
57809C81709Q743R574J0399J1629J3227J4851J6515J8502K0565K1953K2415K2543
$$ 381709 390452 400026 410425 422054 435281 450132 466647 485149 505714 527667 550082 572625
57797E72625K2600K1553J7989J1896M902j277o187j0306j3874j6523j7945j8492
$$ 572625 595225 616778 634767 646663 651565 650288 644101 633795 619921 603398 585453 566961
57785E66961j8906j9537j9990j9602j8308j6941j6506j7109j7719j7174j5403
$$ 566961 548055 528518 508528 488926 470618 453677 437171 420062 402343 385169 369766
57774C69766j3476j2405j2093j1586j0292q646p511p120o863o061m641l021j645
$$ 369766 356290 343885 331792 320206 309914 301268 293757 286637 279774 273713 269072 266051 264406
57761B64406p70n79j027j628j701j021MQ44J354J594J523J254J355K305L624M162
$$ 264406 263636 263057 262030 260402 258701 257680 257684 258528 259882 261476 262999 264253 265608 267913 271537 275699
57745B75699L446K300J793J996K199K101K107K620L496M329M834M850M438M025
$$ 275699 279145 281445 283238 285234 287433 289534 291641 294261 297757 302086 306920 311770 316208 320233
57731C20233M077M394M222L266K182J684J509P89o94k182k786k234p91R84K309
$$ 320233 324310 328704 332926 336192 338374 340058 341567 342356 341662 339480 336694 334460 333669 334653 336962
57716C36962K563J944J443J813K759L425L461L279L436M159N352O622P301O887
$$ 336962 339525 341469 342912 344725 347484 350909 354370 357649 361085 365244 370596 377218 384519 391406
57702C91406N681M663M524N003N394N412N451O139P838J0360J2950J4783J5738
$$ 391406 397087 401750 406274 411277 416671 422083 427534 433673 441511 451871 464821 479604 495342
57689D95342J6500J7702J9172K0462K1765K3792K6785L0284L3979L8219M3420
$$ 495342 511842 529544 548716 569178 590943 614735 641520 671804 705783 744002 787422
57678G87422M9489N6185O3663P2347Q2485R4197J07720J23145J39807J55464J65358
$$ 787422 836911 893096 956759 1029106 1111591 1205788 1313508 1436653 1576460 1731924 1897282
57667A897282J62147J38615R2900L1922l1027q3108j17502j34046j36627j30458
$$ 1897282 2059429 2198044 2290944 2322866 2291839 2208731 2091229 1957183 1820556 1690098
57657A690098j20307j09332r8757q8690p9207p0567o2889n6063m9962m4469l9407
$$ 1690098 1569791 1460459 1361702 1273012 1193805 1123238 1060349 1004286 954324 909855 870448
57646H70448l4703l0514k6987k4019k1431j9139j6905j4256j1076q086o175n316
$$ 870448 835745 805231 778244 754225 732794 713655 696750 682494 671418 663332 657157 651841
57634F51841m568l196j327O29K604M618O304P220P459P675Q464J0016J2125J4364
$$ 651841 647273 644077 642750 643379 645983 650601 656905 664125 671584 679259 687723 697739 709864 724228
57620G24228J6254J7633J8861K0423K2287K3952K5157K6216K7465K8626K9028
$$ 724228 740482 758115 776976 797399 819686 843638 868795 895011 922476 951102 980130
57609I80130K8383K6954K5016K2386J8682J3858Q273K314l832r989j5778k0771
$$ 980130 1008513 1035467 1060483 1082869 1101551 1115409 1123682 1125996 1122164 1112175 1096397 1075626
57597A075626k4877k8321l1219l3341l4535l5142l5613l5760l4902l2928l0691
$$ 1075626 1050749 1022428 991209 957868 923333 888191 852578 816818 781916 748988 718297
57586G18297k9037k7799k6247k4224k2217k0499j8947j7622j6796j6230j5218
$$ 718297 689260 661461 635214 610990 588773 568274 549327 531705 514909 498679 483461
57575D83461j3644j2243j1412j0503q954p442p041p591p861p183o036m993l956
$$ 483461 469817 457574 446162 435659 426705 419263 412222 404631 396770 389587 383551 378558 374602
57562C74602k761j700j136r48p76m78j30J60K89K98M41Q76J307J348J265J721
$$ 374602 371841 370141 369005 368057 367281 366803 366673 366833 367122 367420 367861 368737 370044 371392 372657 374378
57546C74378K759L630L883L973M468N185N600N645N624N746O138P055Q537J0112
$$ 374378 377137 380767 384650 388623 393091 398276 403876 409521 415145 420891 427029 434084 442621 452733
57532D52733J1271J2076J2879J3741J4545J5486J6958J8999K1191K3058K4255
$$ 452733 464004 476080 488959 502700 517245 532731 549689 568688 589879 612937 637192
57521F37192K4659K4580K4698K5356K6102K6270K5721K4597K2622J9406J5245
$$ 637192 661851 686431 711129 736485 762587 788857 814578 839175 861797 881203 896448
57510H96448J0998P086L172j075n446r558j3261j6552j9438k1959k4040k5313
$$ 896448 907446 914532 917704 916629 911183 901625 888364 871812 852374 830415 806375 781062
57498G81062k5504k4979k4408k3931k3149k1946k0671j9427j7850j5877j4039
$$ 781062 755558 730579 706171 682240 659091 637145 616474 597047 579197 563320 549281
57487E49281j2687j1503j0153q839p725o417m621k862j863j479r27J42J466K844
$$ 549281 536594 525091 514938 506099 498374 491957 487336 484474 482611 481132 480205 480347 481813 484657
57473D84657M272N522O297O914Q104R983J1815J3068J4078J5437J7143J8847K0400
$$ 484657 488929 494451 500748 507662 515766 525749 537564 550632 564710 580147 597290 616137 636537
57460F36537K1809K2889K3519K3954K4390K4363K3107K0577J7585J4871J2333
$$ 636537 658346 681235 704754 728708 753098 777461 800568 821145 838730 853601 865934
57449H65934R367N633J312l152p391j1268j4891j8336k1375k3626k5029k5912
$$ 865934 875301 880934 882246 879094 871703 860435 845544 827208 805833 782207 757178 731266
57437G31266k6560k6890k6733k6075k4914k3203k1188j9486j8431j7563j6222
$$ 731266 704706 677816 651083 625008 600094 576891 555703 536217 517786 500223 484001
57426D84001j4444j2818j1637j0740j0065r668r196q108o628n721n772n955n459
$$ 484001 469557 456739 445102 434362 424297 414629 405433 397325 390697 384976 379204 373249 367790
57413C67790m621m205m064l473k447j838k091k684k920k631j961j050j67L30M31
$$ 367790 363169 358964 354900 351427 348980 347142 345051 342367 339447 336816 334855 333805 333638 333968 334399
57398C34399M88O25N42P3m22m99j64K60N22N32L31J45K49O42J067J390J682J897
$$ 334399 334887 335512 336054 336127 335705 335206 335042 335302 335824 336356 336687 336832 337081 337723 338790 340180 341862 343759
57380C43759J820J481J226J237J334J461J919K811L612L689L075K422K294K684
$$ 343759 345579 347060 348286 349523 350857 352318 354237 357048 360660 364349 367424 369846 372140 374824
57366C74824L125L132K715K497L034L957M202L290J989J362J605K118K390K334
$$ 374824 377949 381081 383796 386293 389327 393284 397486 400776 402765 404127 405732 407850 410240 412574
57352D12574K065J791J790K129K575K940L297L579L423K809K402K742L416L693
$$ 412574 414639 416430 418220 420349 422924 425864 429161 432740 436163 438972 441374 444116 447532 451225
57338D51225L660L954M507M501L689K967L233M265N098N199M921M962N583O304
$$ 451225 454885 458839 463346 467847 471536 474503 477736 482001 487099 492298 497219 502181 507764 514068
57324E14068O412N920N739O577P822Q224P587P052P491Q384Q699Q318Q012Q333
$$ 514068 520480 526400 532139 538716 546538 554762 562349 569401 576892 585276 593975 602293 610305 618638
57310F18638R084R752J0058J0102J0212J0580J0983J0993J0629J0481J1013J1980
$$ 618638 627722 637474 647532 657634 667846 678426 689409 700402 711031 721512 732525 744505
57298G44505J2799J3234J3452J3615J3723J3806J3912J3976J3907J3696J3322
$$ 744505 757304 770538 783990 797605 811328 825134 839046 853022 866929 880625 893947
57287H93947J2597J1351R703P926O193M557L117J979J147N91L66M97Q72J377K027
$$ 893947 906544 917895 927598 935524 941717 946274 949391 951370 952517 953108 953474 953971 954843 956220 958247
57272I58247K804L576M307N140O048O669O859P135Q116R563J0527J0548J0195
$$ 958247 961051 964627 968934 974074 980122 986791 993650 1000785 1008901 1018464 1028991 1039539 1049734
57259A049734J0221J0643J0976J1069J1222J1604J2024J2354J2757J3338J3792
$$ 1049734 1059955 1070598 1081574 1092643 1103865 1115469 1127493 1139847 1152604 1165942 1179734
57248A179734J3780J3504J3562J4184J4936J5357J5617J6236J7234J7977J7952
$$ 1179734 1193514 1207018 1220580 1234764 1249700 1265057 1280674 1296910 1314144 1332121 1350073
57237A350073J7349J6731J6375J6203J6225J6643J7525J8567J9340J9616J9440
$$ 1350073 1367422 1384153 1400528 1416731 1432956 1449599 1467124 1485691 1505031 1524647 1544087
57226A544087J9046J8833J9282K0575K2195K3143K2868K1978K1680K2423K3416
$$ 1544087 1563133 1581966 1601248 1621823 1644018 1667161 1690029 1712007 1733687 1756110 1779526
57215A779526K3690K3367K3382K4083K4741K4547K3686K3036K3083K3473K3565
$$ 1779526 1803216 1826583 1849965 1874048 1898789 1923336 1947022 1970058 1993141 2016614 2040179
57204B040179K3189K2804K2999K3821K4713K5162K5247K5325K5324K4850K3904
$$ 2040179 2063368 2086172 2109171 2132992 2157705 2182867 2208114 2233439 2258763 2283613 2307517
57193B307517K3010K2464K1998K1383K0815K0402J9774J8690J7610J7283J8180
$$ 2307517 2330527 2352991 2374989 2396372 2417187 2437589 2457363 2476053 2493663 2510946 2529126
57182B529126K0618K4838L0268L5245L8344L9770M0683M1392M1187L9803L7923
$$ 2529126 2549744 2574582 2604850 2640095 2678439 2718209 2758892 2800284 2841471 2881274 2919197
57171B919197L6024L3759L0833K7683K4778K2072J9616J7968J7352J6994J6060
$$ 2919197 2955221 2988980 3019813 3047496 3072274 3094346 3113962 3131930 3149282 3166276 3182336
57160C182336J4788J4034J4060J4406J4770J5183J5573J5733J5726J5761J5764
$$ 3182336 3197124 3211158 3225218 3239624 3254394 3269577 3285150 3300883 3316609 3332370 3348134
57149C348134J5537J5250J5228J5295J4881J3795J2405J1107J0062R461R491J0084
$$ 3348134 3363671 3378921 3394149 3409444 3424325 3438120 3450525 3461632 3471694 3481155 3490646 3500730
57137C500730J1110J2776J5301J8237K0761K2678K4455K6189K7355K7844K8431
$$ 3500730 3511840 3524616 3539917 3558154 3578915 3601593 3626048 3652237 3679592 3707436 3735867
57126C735867K9679L1083L1949L2610L4041L6616L9928M3633M7853N2774N8401
$$ 3735867 3765546 3796629 3828578 3861188 3895229 3931845 3971773 4015406 4063259 4116033 4174434
57115D174434O4630P1154P7467Q3631R0952J01355J15999J34947J58002J85180
$$ 4174434 4239064 4310218 4387685 4471316 4562268 4663623 4779622 4914569 5072571 5257751
57105E257751K16228K50645K88668L31800L81958M40434N08221N86980O79030
$$ 5257751 5473979 5724624 6013292 6345092 6727050 7167484 7675705 8262685 8941715
57096H941715P86292R09419J047792J199923J363663J536149J713423J890034
$$ 8941715 9728007 10637426 11685218 12885141 14248804 15784953 17498376 19388410
57088A9388410K059047K212503K341632K436466K485547K476459K396658K234309
$$ 19388410 21447457 23659960 26001592 28438058 30923605 33400064 35796722 38031031
57080C8031031J980195J631968J198986P03665J77173l48004q44022j289974j671779
$$ 38031031 40011226 41643194 42842180 43545845 43723018 43375014 42530992 41241018 39569239
57071C9569239j981363k215685k375447k463989k486958k452304k369720k249562
$$ 39569239 37587876 35372191 32996744 30532755 28045797 25593493 23223773 20974211
57063B0974211k102082j937208j764202j590839j422846j264220j117815r85357
$$ 20974211 18872129 16934921 15170719 13579880 12157034 10892814 9774999 8789642
57055H789642q67144p62352o69882n88793n18113m56656m03261l57007l17167
$$ 8789642 7922498 7160146 6490264 5901471 5383358 4926702 4523441 4166434 3849267
57046C849267k83170k54565k30678k10208j91615j74129j58017j43767j31331
$$ 3849267 3566097 3311532 3080854 2870646 2679031 2504902 2346885 2203118 2071787
57037B071787j20402j10853j02498r4757q7166p9977p3789o8745o4507o0795n7405
$$ 2071787 1951385 1840532 1738034 1643277 1556111 1476134 1402345 1333600 1269093 1208298 1150893
57026A150893n3886m9969m6184m3367m1436l9339l6480l3526l1410l0087k8771
$$ 1150893 1097007 1047038 1000854 957487 916051 876712 840232 806706 775296 745209 716438
57015G16438k7018k5056k3249k1649k0096j8494j7008j6032j5789j5867j5535
$$ 716438 689420 664364 641115 619466 599370 580876 563868 547836 532047 516180 500645
57004E00645j4559j3377j2370j1438j0524r971r882r658q730p388o258n293m002
$$ 500645 486086 472709 460339 448901 438377 428406 418524 408866 400136 392748 386490 381197 377195
56991C77195k461j306p39k30O54J808L055M401N571N902N030L256J032j485m077
$$ 377195 374734 373428 372689 372459 373113 374921 377976 382377 387948 393850 398880 402136 403168 401683 397606
56976C97606o203p506q191q525q365p621o736o110n341l729j467L81J170J430
$$ 397606 391403 383897 375706 367181 358816 351195 344459 338349 333008 329279 327812 328193 329363 330793
56962C30793K096L488N281P100Q712R861J0251R665P911M767L04m723r062j1794
$$ 330793 332889 336377 341658 348758 357470 367331 377582 387247 395158 399925 400229 395506 386444 374650
56948C74650j2885j2894j2279j1147r570p844o253m782l253j650q0J572L593N981
$$ 374650 361765 348871 336592 325445 315875 308031 301778 296996 293743 292093 292013 293585 297178 303159
56934C03159Q335J0412J2475J4735J6561J6712J4383R789L755k854r127j4062
$$ 303159 311494 321906 334381 349116 365677 382389 396772 406561 410316 407462 398335 384273
56922C84273j7060j8361j8621j8150j6892j5086j3366j2046j0785r196p466n988
$$ 384273 367213 348852 330231 312081 295189 280103 266737 254691 243906 234710 227244 221256
56910B21256m749l614k909l054l671l788l069k175j657j193m36Q1l02j117j185
$$ 221256 216507 212893 209984 206930 203259 199471 196402 194227 192570 191377 190941 191022 190720 189603 188418
56895A88418j93J036J927K884M297N607O117O171O772Q128R314R389Q255O218
$$ 188418 188225 189261 191188 194072 198369 203976 210093 216264 223036 231164 240478 249867 258122 264340
56881B64340L326l16l853o013o332n671n186n006m364k817q60Q99K505M361O502
$$ 264340 267666 267350 263497 257484 251152 245481 240295 235289 230925 228108 227248 228147 230652 235013 241515
56866B41515Q738J1148J3926J6936J9934K3047K6245K8492K8190K4749J9047J2195
$$ 241515 250253 261401 275327 292263 312197 335244 361489 389981 418171 442920 461967 474162
56854D74162M639l173j0068j4877j7387j8058j7197j5044j2140q860m862J74N473
$$ 474162 478801 475628 465560 450683 433296 415238 398041 382997 370857 361997 357135 357309 362782
56841C62782R766J2899J5996J9866K4152K8312L2587L7236M1265M2624L9614L1814
$$ 362782 372548 385447 401443 421309 445461 473773 506360 543596 584861 627485 667099 698913
56829F98913J9981N618r240k2325l1801l6955l8372l7351l4955l1560k7249k2417
$$ 698913 718894 724512 715272 692947 661146 624191 585819 548468 513513 481953 454704 432287
56817D32287j7622j2970q081k724K774P900J2466J6648K0703K4615K7819K9200
$$ 432287 414665 401695 393614 390890 393664 401564 414030 430678 451381 475996 503815 533015
56805E33015K7673K2850J5119N233n790j6463k5139l0801l3318l3013l0399k6491
$$ 533015 560688 583538 598657 603890 598100 581637 556498 525697 492379 459366 428967 402476
56793D02476k2633j9467j6488j3019r275n923k989R4L463O560R023J1185J3313
$$ 402476 379843 360376 343888 330869 321594 315671 312682 312776 316239 322799 331822 343007 356320
56780C56320J4810J4582J2090P723K311l448r051j3992j7704j9773k0163j9300
$$ 356320 371130 385712 397802 405525 407836 404388 395337 381345 363641 343868 323705 304405
56768C04405j7894j6564j5507j4465j3104j1446r861q651p766p025o412n947n428
$$ 304405 286511 269947 254440 239975 226871 215425 205564 196913 189147 182122 175710 169763 164335
56755A64335m632l700l000k562k118j691j694k168k415j857r61p31j400k126k088
$$ 164335 159703 156003 153003 150441 148323 146632 144938 142770 140355 138498 137537 136806 135406 133280 131192
56740A31192j367n75J8N92J183J431J059L89M0J23J00m57j206j559j547j641j799
$$ 131192 129825 129250 129268 129860 131043 132474 133533 133922 133962 134085 134185 133728 132522 130963 129416 127775 125976
56723A25976j409l36O48Q93P59Q80J087Q37L19K80Q33J262J129Q43Q69J054J094
$$ 125976 124567 124231 124879 125772 126531 127411 128498 129335 129654 129934 130767 132029 133158 134001 134870 135924 137018
56706A37018J075J162J193J042J036J530K305K844L053L260L624L924L978L904
$$ 137018 138093 139255 140448 141490 142526 144056 146361 149205 152258 155518 159142 163066 167044 170948
56692A70948L954M191M440M372L777K837K074J827J881J731J151L80j83k69J08
$$ 170948 174902 179093 183533 187905 191682 194519 196593 198420 200301 202032 203183 203563 203380 203111 203219
56677B03219N98P18L59L6L86J455K635L262L084K256J211M64K36K12l3m12m45
$$ 203219 203817 204535 204894 204930 205316 206771 209406 212668 215752 218008 219219 219683 219919 220131 220098 219686 219241
56660B19241r6Mo12j568k113k081j908j919j994j988j993k055j997j736j547j717
$$ 219241 219145 219149 218537 216969 214856 212775 210867 208948 206954 204966 202973 200918 198921 197185 195638 193921
56644A93921k079k206k005j870k171k753l045k590j488l60J30j05m36j33Q74J974
$$ 193921 191842 189636 187631 185761 183590 180837 177792 175202 173714 173354 173484 173379 172943 172810 173684 175658
56628A75658K608K765K676K294J424K17q05j263j270j183j185j249j286j229j053
$$ 175658 178266 181031 183707 186001 187425 187642 186837 185574 184304 183121 181936 180687 179401 178172 177119
56613A77119q03o24o09p08q59j100j406j516j111k50N82R39Q35O30O44J002J686
$$ 177119 176316 175692 175083 174375 173516 172416 171010 169494 168383 168133 168715 169654 170489 171119 171763 172765 174451
56596A74451K453K742K048O39l40N4J410K306J929J036R38J809K546K296J565
$$ 174451 176904 179646 181694 182333 181993 182047 183457 185763 187692 188728 189666 191475 194021 196317 197882
56581A97882J423K012K419J980J148P53R37J213J332J509J741J572Q19J24K94
$$ 197882 199305 201317 203736 205716 206864 207617 208554 209767 211099 212608 214349 215921 216740 216864 217158
56566B17158J256K174K447K206J872J703J868K482L287L744L630L313L142K922
$$ 217158 218414 220588 223035 225241 227113 228816 230684 233166 236453 240197 243827 247140 250282 253204
56552B53204K299J344L76n85j702k861l715m176m434m580m583m621m885n126m866
$$ 253204 255503 256847 257223 256638 254936 252075 248360 244184 239750 235170 230587 225966 221081 215955 211089
56537B11089m227l936m357m975n135m822m380l913l415l149l348l668l502k786
$$ 211089 206862 202926 198569 193594 188459 183637 179257 175344 171929 168780 165432 161764 158262 155476
56523A55476k061j682j481j244j077j022p95k46J40k74j326k027j678o74P9K94
$$ 155476 153415 151733 150252 149008 147931 146909 146114 145868 146008 145734 144408 142381 140703 140029 140108 140402
56507A40402M67R06J234J032N87M56N88M11j83n99m07M0K22K48N73J161J428R81
$$ 140402 140869 141775 143009 144041 144628 145084 145672 146083 145900 145301 144894 144934 145156 145404 145977 147138 148566 149547
56489A49547N2q72j494j765j719j377p69J1P28J131J264J459J833K018J651R89
$$ 149547 149599 148727 147233 145468 143749 142372 141603 141614 142342 143473 144737 146196 148029 150047 151698 152687
56473A52687O26P03Q15P81R83J730K659L104K889K396J998J723J446J091N67j94
$$ 152687 153313 154016 154831 155612 156595 158325 160984 164088 166977 169373 171371 173094 174540 175631 176198 176004
56457A76004j039j596j651j347r12l18M76J095R88K09m37l16K67N67M66M14M57
$$ 176004 174965 173369 171718 170371 169459 169141 169617 170712 171700 171909 171472 171156 171423 171990 172456 172870 173327
56440A73327M3r98j863j718p85J1J84m0l72o98p96m52Mj06q54j514j564j357j394
$$ 173327 173370 172372 170509 168791 168006 168017 168201 168161 167789 167091 166295 165843 165847 165741 164887 163373 161809 160452 159058
56421A59058j426r05qM83L04K8J30L19J44k02j89K05N12N66P25J147J346Q48o
$$ 159058 157632 156727 156719 157202 157506 157534 157664 157983 158127 157925 157736 157941 158453 159019 159744 160891 162237 163085 163079
56402A63079l68J10R36J470J528J267Q63N47O33J198J887K276K317K248K208K188
$$ 163079 162711 162821 163757 165227 166755 168022 168885 169432 170065 171263 173150 175426 177743 179991 182199 184387
56386A84387K289K661L178L329K580R44p80j471o71P50J318M74q70j524j298p68
$$ 184387 186676 189337 192515 195844 198424 199368 198588 197117 196446 197196 198514 198988 198118 196594 195296 194528
56370A94528k40L74R29J058Q14P02R23J163J239J387J734J972J802J289N74k77
$$ 194528 194288 194662 195591 196649 197463 198165 199088 200251 201490 202877 204611 206583 208385 209674 210248 209971
56354B09971q93o87L78J471J774J328P57M67M90O78P03K53l40j69J009K089J892
$$ 209971 209078 208391 208769 210240 212014 213342 214099 214566 215056 215734 216437 216690 216350 216181 217190 219279 221171
56337B21171P66J39O24J524K125K567L109L420L129K547K307K566L008L357L525
$$ 221171 221937 222076 222700 224224 226349 228916 232025 235445 238574 241121 243428 245994 249002 252359 255884
56322B55884L541L571L851M314M514M205L730L527L498L276K934K889L179L348
$$ 255884 259425 262996 266847 271161 275675 279880 283610 287137 290635 293911 296845 299734 302913 306261
56308C06261L219L295M034N064N509N087M419M153M119L648K588J598J328J682
$$ 306261 309480 312775 316809 321873 327382 332469 336888 341041 345160 348808 351396 352994 354322 356004
56294C56004K077K203K175K094J922J849K376L731N389O458O582O282O356P088
$$ 356004 358081 360284 362459 364553 366475 368324 370700 374431 379820 386278 392860 399142 405498 412586
56280D12586Q144R206J0376J1805J3088J3570J3379J3580J4976J7158J9333K1622
$$ 412586 420730 429936 440312 452117 465205 478775 492154 505734 520710 537868 557201 578823
56268E78823K4693K8241L1015L2670L4631L8381M3609M8904N3787N9046O5262
$$ 578823 603516 631757 662772 695442 730073 768454 812063 860967 914754 973800 1039062
56257A039062P2114P9179Q6438R3574R9635J04031J07226J09782J11039J09488
$$ 1039062 1111176 1190355 1276793 1370367 1470002 1574033 1681259 1791041 1902080 2011568
56247B011568J04337R6097Q5672P3466N9571M4215K7741J0478o922k3256l7352
$$ 2011568 2115905 2212002 2297674 2371140 2430711 2474926 2502667 2513145 2506223 2482967 2445615
56236B445615m8921n8585o7007p4278q0140q4503q7499q9208q9579q8662q6638
$$ 2445615 2396694 2338109 2271102 2196824 2116684 2032181 1944682 1855474 1765895 1677233 1590595
56225A590595q3701q0036p5928p1768o7832o4168o0642n6967n2781m7937m2822
$$ 1590595 1506894 1426858 1350930 1279162 1211330 1147162 1086520 1029553 976772 928835 886013
56214H86013l8109l4121l0620k7305k4213k1437j8828j6307j4193j2808j1846
$$ 886013 847904 813783 783163 755858 731645 710208 691380 675073 660880 648072 636226
56203F36226j0637r038p591o732o253n678m859m036l564l658m081m101l182j779
$$ 636226 625589 616551 608960 602228 595975 590297 585438 581402 577838 574180 570099 565998 562816 561037
56189E61037r33q67o87K00J087J073N82Q11J937K948L235L385M095N222O376P587
$$ 561037 560104 559237 558550 558750 559837 560910 561492 562303 564240 567188 570423 573808 577903 583125 589501 597088
56173E97088Q841R579R466R159R519J0401J1046J1441J2372J4052J5649J6482
$$ 597088 605929 615508 624974 634133 643652 654053 665099 676540 688912 702964 718613 735095
56161G35095J7005J8075J9793K1610K3267K5024K7170K9853L3394L8280M4735
$$ 735095 752100 770175 789968 811578 834845 859869 887039 916892 950286 988566 1033301
56150A033301N2623O1927P3036Q6268J01295J17153J32593J45972J54817J56068
$$ 1033301 1085924 1147851 1220887 1307155 1408450 1525603 1658196 1804168 1958985 2115053
56140B115053J47634J30105J07138Q4009O5521N4407N0527N0768N0089M3899L0522
$$ 2115053 2262687 2392792 2499930 2583939 2649460 2703867 2754394 2805162 2855251 2899150 2929672
56129B929672J1980p411k3311l3042l6342l5510l4756l8664n0220o9333r2718
$$ 2929672 2941652 2934241 2910930 2877888 2841546 2806036 2771280 2732616 2682396 2613063 2520345
56118B520345j15289j32398j41548j42500j36336j24780j10105r4696q0059o6525
$$ 2520345 2405056 2272658 2131110 1988610 1852274 1727494 1617389 1522693 1442634 1376109
56108A376109n4159m3507l4983k8048k1753j5971j1299p840m878j953N78K446
$$ 1376109 1321950 1278443 1243460 1215412 1193659 1177688 1166389 1158549 1153671 1151718 1152296 1154742
56096A154742M165O288Q500J0146J1251J2310J3376J4041J4222J4218J4026J3332
$$ 1154742 1158907 1165195 1173695 1183841 1195092 1207402 1220778 1234819 1249041 1263259 1277285 1290617
56084A290617J2291J1539J1271J0872R878Q687P903P470O978O512O639P653R267
$$ 1290617 1302908 1314447 1325718 1336590 1346468 1355155 1363058 1370528 1377506 1384018 1390657 1398310 1407577
56071A407577J0943J2258J3103J3857J5166J7174J9174K0384K0911K1458K2247
$$ 1407577 1418520 1430778 1443881 1457738 1472904 1490078 1509252 1529636 1550547 1572005 1594252
56060A594252K2846K3057K3344K4167K5386K6558K7493K8276K9046L0005L1348
$$ 1594252 1617098 1640155 1663499 1687666 1713052 1739610 1767103 1795379 1824425 1854430 1885778
56049A885778L2967L4422L5465L6312L7272L8336L9428M0724M2316M3720M4267
$$ 1885778 1918745 1953167 1988632 2024944 2062216 2100552 2139980 2180704 2223020 2266740 2311007
56038B311007M4016M3969M5142M7581N0401N2662N4074N5044N6240N8226O1226
$$ 2311007 2355023 2398992 2444134 2491715 2542116 2594778 2648852 2703896 2760136 2818362 2879588
56027B879588O4918O8439P0997P2674P4374P6789P9673Q2488Q5340Q8743R2675
$$ 2879588 2944506 3012945 3083942 3156616 3230990 3307779 3387452 3469940 3555280 3644023 3736698
56016C736698R6593J00352J04435J09086J13942J18750J23765J29165J34690J40262
$$ 3736698 3833291 3933643 4038078 4147164 4261106 4379856 4503621 4632786 4767476 4907738
56006D907738J46304J53010J59886J66592J73684J81833J90777J99835K09132
$$ 4907738 5054042 5207052 5366938 5533530 5707214 5889047 6079824 6279659 6488791
55997F488791K19509K31290K43969K57083K70735K85255L00888L18028L37177
$$ 6488791 6708300 6939590 7183559 7440642 7711377 7996632 8297520 8615548 8952725
55988H952725L58508L81779M06747M33453M62171M93339N27489N65049O06347
$$ 8952725 9311233 9693012 10099759 10533212 10995383 11488722 12016211 12581260 13187607
55979A3187607O51911P02426P58260Q19524Q86935R62132J046720J141505J247229
$$ 13187607 13839518 14541944 15300204 16119728 17006663 17968795 19015515 20157020 21404249
55970B1404249J365629J499387J651633J826093K027285K260268K530931K847145
$$ 21404249 22769878 24269265 25920898 27746991 29774276 32034544 34565475 37412620
55962C7412620L218959L657737M176568M792119N524358O393435P418627Q621208
$$ 37412620 40631579 44289316 48465884 53258003 58782361 65175796 72594423 81215631
55954H1215631J0026068J1659053J3544051J5699842J8126323K0774066K3502763
$$ 81215631 91241699 102900752 116444803 132144645 150270968 171045034 194547797
55947A94547797K6028957K7860845K8267868K6401321K1636960J4006400M406115
$$ 194547797 220576754 248437599 276705467 303106788 324743748 338750148 343156263
55940C43156263n638117j4544777k1225709k5309983k7021693k6900138k5549572
$$ 343156263 337518146 322973369 301747660 276437677 249415984 222515846 196966274
55933A96966274k3492146k1114105j8671673j6322670j4157059j2217341j0514126
$$ 196966274 173474128 152360023 133688350 117365680 103208621 90991280 80477154
55926H0477154r039967p778040o705455n796437n026823m375919l824946l356329
$$ 80477154 71437187 63659147 56953692 51157255 46130432 41754513 37929567 34573238
55918C4573238k955406k611334k315635k060870j840720j649830j483122j336289
$$ 34573238 31617832 29006498 26690863 24629993 22789273 21139443 19656321 18320032
55910A8320032j206898j093649r94400r06087q26737p56174o94362o40082n91594
$$ 18320032 17113134 16019485 15025085 14118998 13292261 12536087 11841725 11201643 10610049
55901A0610049n47640n07418m70492m36940m06836l79399l53475l28952l06708
$$ 10610049 10062409 9554991 9084499 8647559 8240723 7861324 7507849 7178897 6872189
55892F872189k86942k68590k50681k33317k16934k01571j87503j75730j67041
$$ 6872189 6585247 6316657 6065976 5832659 5615725 5414154 5226651 5050921 4883880
55883D883880j61015j56494j52657j49147j45555j41465j36838j31912j26716
$$ 4883880 4722865 4566371 4413714 4264567 4119012 3977547 3840709 3708797 3582081
55874C582081j21078j15096j09336j04381j00166r5961r1170q6158q1836p8389
$$ 3582081 3461003 3345907 3236571 3132190 3032024 2936063 2844893 2758735 2676899 2598510
55864B598510p5005p1137o7351o4306o1530n8125n4267n1014m8777m7016m5380
$$ 2598510 2523505 2452368 2385017 2320711 2259181 2201056 2146789 2095775 2046998 1999982 1954602
55853A954602m4196m3603m3105m2307m1293m0147l8752l7286l6110l5049l3515
$$ 1954602 1910406 1866803 1823698 1781391 1740098 1699951 1661199 1623913 1587803 1552754 1519239
55842A519239l1551k9903k8844k7771k6323k4970k3995k2812k0966j8990j7543
$$ 1519239 1487688 1457785 1428941 1401170 1374847 1349877 1325882 1303070 1282104 1263114 1245571
55831A245571j6363j4858j3204j1947j0971r752q405p627p719q374r418j1073
$$ 1245571 1229208 1214350 1201146 1189199 1178228 1168476 1160071 1152444 1144725 1136351 1126933 1115860
55819A115860j3385j5884j8002j9435k0201k0497k0562k0338j9520j8123j6738
$$ 1115860 1102475 1086591 1068589 1049154 1028953 1008456 987894 967556 948036 929913 913175
55808I13175j5838j5109j3970j2463j1119j0043q758o966m878k709l52K168M254
$$ 913175 897337 882228 868258 855795 844676 834633 825875 818909 814031 811322 810970 813138 817392
55795H17392M963L583L0m999j0146j3983j5858j6223j6097j6126j6131j5527j4143
$$ 817392 822355 825938 825968 820969 810823 796840 780982 764759 748662 732536 716405 700878 686735
55782F86735j2523j1270j0326r239q117p622p817p579n727k469Q03K946L854L998
$$ 686735 674212 662942 652616 643377 635260 627638 619821 612242 606515 604046 604849 607795 611649 615647
55768F15647L732L186K338J011r41l431o234r228j2283j4947j6659j7297j7297
$$ 615647 619379 622565 624903 625914 624973 621542 615308 606080 593797 578850 562191 544894 527597
55755E27597j7210j7283j7470j7554j7213j6196j4525j2491j0456q753p605o907
$$ 527597 510387 493104 475634 458080 440867 424671 410146 397655 387199 378446 370841 363934
55743C63934o231n315m415l935l779l494l000k738l025l605l973l880l425k892
$$ 363934 357703 352388 347973 344038 340259 336765 333765 331027 328002 324397 320424 316544 313119 310227
55729C10227k680l058l775m165l827l119k718k836l148l371l543l670l435k662
$$ 310227 307547 304489 300714 296549 292722 289603 286885 284049 280901 277530 273987 270317 266882 264220
55715B64220j814j641k218k722k417j556r45q52p27l8J052J915K061J449N08j14
$$ 264220 262406 260765 258547 255825 253408 251852 250907 250055 249328 249290 250342 252257 254318 255767 256275 256161
55699B56161j16J49J77N7J98M76L46r1m3O68J127P63L55Q39J788K110J752J555
$$ 256161 256045 256194 256371 256428 256626 257102 257448 257357 257314 257982 259109 259872 260227 261066 262854 264964 266716 268271
55681B68271J801K044K307L165M463N093M425K994J461k18k070l483l987l991
$$ 268271 270072 272116 274423 277588 282051 287144 291569 294563 296024 295806 293736 290253 286266 282275
55667B82275m075m128l822l459l544l912l914l317k373j244P8J425K579L699N057
$$ 282275 278200 274072 270250 266791 263247 259335 255421 252104 249731 248487 248565 249990 252569 256268 261325
55652B61325O417P204P315P324P794Q742R859J0844J1376J1005R385O708L798
$$ 261325 267742 274946 282261 289585 297379 306121 315980 326824 338200 349205 358590 365298 369096
55639C69096J592L28p14k391m602o354o932o522n598m261k592j111l43k48m90
$$ 369096 370688 371016 370302 367911 363309 356955 350023 343501 337903 333642 331050 329939 329596 329348 328858
55624C28858r50j539j920k068k774m817p760j0326j1878j2762j3304j3306j2720
$$ 328858 327908 326369 324449 322381 319607 314790 307030 296704 284826 272064 258760 245454 232734
55611B32734j2030j1554j0993j0046q956q128p553p007o419n797n084m309l608
$$ 232734 220704 209150 198157 188111 179155 171027 163474 156467 150048 144251 139167 134858 131250
55598A31250k944k253j886k368l496m273m088l334k536j552k49P05N97k15p50
$$ 131250 128306 126053 124167 121799 118303 114030 109942 106608 104072 102520 102271 102976 103573 103358 102608
55583A02608p24n78m21J23R91J535J549J582J930K052J380J78r08j652k140k274
$$ 102608 101884 101306 100885 101008 101999 103534 105083 106665 108595 110647 112027 112205 111297 109645 107505 105231
55567A05231j952j444j104q84n50k32k63n17l72N05J641K189J782Q61J77J1k4
$$ 105231 103279 101835 100731 99847 99297 99065 98802 98285 97913 98418 100059 102248 104030 104891 105068 105079 105055
55550A05055m13j044j377j193q34o46n44l95m17q85j607k047j919j361p00l08
$$ 105055 104642 103598 102221 101028 100194 99548 99004 98609 98192 97307 95700 93653 91734 90373 89673 89365
55534H9365m92j123j538j141j49O27P38M86L63M11L45rn06q21o78n2P99J574K164
$$ 89365 88873 87750 86212 85071 84922 85549 86287 86773 87136 87547 87892 87883 87377 86556 85878 85826 86625 88199 90363
55515I0363K641L068L505M030M593M930M928M901N284O102P075Q047Q945R425
$$ 90363 93004 96072 99577 103607 108200 113130 118058 122959 128243 134345 141420 149467 158412 167837
55501A67837R137Q277P342O227M198J016k462n213p060q417r457j0118j0520j0800
$$ 167837 176974 185251 192593 198820 203018 204034 201572 196359 189299 180882 171425 161307 150787 139987
55487A39987j0689r901q754p888p342o580n464m619m573n012n179m685l629k325
$$ 139987 129298 119397 110643 102755 95413 88833 83369 78750 74177 69165 63986 59301 55672 53347
55473E3347j224q72j444k407k954k810k323j862j416r19n69n93q05p75m11j71
$$ 53347 52123 51251 49807 47400 44446 41636 39313 37451 36035 35116 34547 33954 33149 32374 31963 31792
55457C1792m79j131j459j100m10l4j78m28l27J8L4n80j361j576j076m04J2L61
$$ 31792 31313 30182 28723 27623 27213 27179 27001 26573 26246 26264 26298 25718 24357 22781 21705 21301 21313 21674
55439B1674R14J370J226O52L65N85P17K93k77l33L0J26l38r17j080p69k55K21
$$ 21674 22588 23958 25184 25836 26201 26786 27503 27796 27519 27186 27216 27342 27004 26087 25007 24238 23983 24204
55421B4204M76L76k3l84l95j47l9k85o34o95m80l73n60p52o43l86k81k12K00Q68
$$ 24204 24680 25056 25033 24649 24254 24107 24068 23783 23149 22454 21974 21601 21041 20289 19646 19260 18979 18767 18967 19835
55401A9835J197Q02k0p05r30o19Q9P90J076J046J110J231R36K64j2M51Q81M65
$$ 19835 21032 21834 21814 21109 20179 19560 19649 20439 21515 22561 23671 24902 25838 26102 26090 26541 27422 27887
55383B7887m65j054j213j361j333n84N79J040L72o00j039j094j280j530j446j037
$$ 27887 27422 26368 25155 23794 22461 21877 22456 23496 23868 23268 22229 21135 19855 18325 16879 15842
55367A5842o53m43k54KK04J48k03n77n21P7P28Q87O13K90j54j090k237k638j890
$$ 15842 15189 14746 14492 14494 14698 14846 14643 14066 13545 13622 14350 15237 15850 16140 15986 14896 12659 10021 8131
55348H131p66k36l42m36j08M92J037J304J266J057P83L39k90o41k02O55Q58J2
$$ 8131 7365 7129 6787 6351 6243 6735 7772 9076 10342 11399 12182 12521 12231 11590 11388 12043 12901 12913
55330A2913j014j268q63n41n69o79p60r12j013p73j57O10J276J529J055Oq61r88
$$ 12913 11899 10631 9768 9227 8658 7979 7219 6307 5294 4521 4364 4974 6250 7779 8834 8840 7979 6991
55312F991p05o60q22o48l7M71M47P6j85l2N74J390J932J831J149K37n87j051r64
$$ 6991 6286 5626 4804 4156 4119 4590 5037 5113 4928 4896 5470 6860 8792 10623 11772 12009 11422 10371 9407
55293I407n20k56l24j02R81K472L284K889J662K30r02j336r94m28l08o04p15l72
$$ 9407 8887 8631 8307 8205 9186 11658 14942 17831 19493 19723 18821 17485 16491 16063 15755 15151 14436 14064
55275A4064J61O46R97R54L06n33q13n06l30n98q03o13m73p75j085p80K8P52J115
$$ 14064 14225 14871 15868 16822 17128 16595 15782 15276 14946 14348 13545 12932 12459 11684 10599 9819 9847 10599 11714
55256A1714J201J021N99K30J10j9l98o83m14J25J94l23p46o38m34p01j312j662
$$ 11714 12915 13936 14535 14765 14875 14856 14458 13775 13361 13486 13680 13357 12611 11973 11539 10838 9526 7864
55238G864j476r62l88J19M05L16k6k41j16K33O57J179J682J742J143L81K09O68
$$ 7864 6388 5426 5038 5157 5562 5878 5852 5611 5495 5728 6385 7564 9246 10988 12131 12512 12721 13389
55220A3389J024P19j8o03o98k91L27N07k61j494j889q11Q59J853J905J502Q52
$$ 13389 14413 15132 15114 14511 13813 13522 13849 14356 14095 12601 10712 9901 10760 12613 14518 16020 16872
55203A6872o8q33r33o46o26p63m55J03M0o47q52j04N67J45q86j392j195r28p82
$$ 16872 16804 15971 15038 14392 13766 13003 12548 12651 12691 12044 11192 11088 11655 11800 10914 9522 8327 7399 6617
55184F617l62L63Q03N71l4m25l89k26l70p77p97P9J345J898J450Q75R39J337J438
$$ 6617 6255 6618 7421 7992 7958 7533 7144 6918 6548 5771 4974 5053 6398 8296 9746 10621 11560 12897 14335
55165A4335J307J349J413J046L06l27o89r70j223j351j387j334r28r1O64P79L86
$$ 14335 15642 16991 18404 19450 19756 19429 18740 17770 16547 15196 13809 12475 11547 11456 12120 12899 13285
55148A3285l2m23r45j247q10J00O20M63J96K66M60M57L10J62Lp7J28N30P62O93
$$ 13285 13253 12830 11885 10638 9828 9928 10548 11011 11207 11473 11933 12390 12700 12862 12865 12788 12916 13446 14208 14901
55128A4901N35L89R5l61p75j065j210r27k8Q75Q43l4n44pP63O63j82p72o01M0
$$ 14901 15436 15825 15920 15559 14784 13719 12509 11582 11554 12429 13272 13238 12694 12687 13450 14113 13931 13159 12558 12598
55108A2598P89J503J953J925J618J494J601J512J005L69n5l37o98r79p08K30J191
$$ 12598 13387 14890 16843 18768 20386 21880 23481 24993 25998 26367 26312 25975 25277 24298 23590 23820 25011
55091B5011J297M34m64m68K47O62K16o21j078r15l62K95P91Q96P25P21J043J200
$$ 25011 26308 26742 26278 25810 26057 26719 26935 26314 25236 24321 23959 24254 25045 25941 26666 27387 28430 29630
55073B9630O83l49j298j811j927j702j187n67o6K87N00M15K0k57J2N64O57Nq45
$$ 29630 30313 29964 28666 26855 24928 23226 22039 21472 21406 21693 22193 22608 22628 22371 22383 22947 23604 23609 22764
55054B2764j189q73k76J70L45M69Q56J467J742J108k74j530j918j542j092j044
$$ 22764 21575 20702 20426 20596 20941 21410 22266 23733 25475 26583 26309 24779 22861 21319 20227 19183
55038A9183j195r59r1R48J406J077N09L13M26L72J8k36q7K34K75j9k40K2P35J499
$$ 19183 17988 17029 16938 17886 19292 20369 20878 21191 21617 21989 22007 21771 21684 21918 22193 22174 21934 21956 22691 24190
55018B4190K005K297K463K208J186k51j095q35j32J33J12N95J515J776P67o34
$$ 24190 26195 28492 30955 33163 34349 34098 33003 32168 32036 32169 32281 32876 34391 36167 36934 36300
55002C6300j145o49j38l32r35j250j031n94l80n49r23j164j055o38p0N07R23R28
$$ 36300 35155 34506 34368 34036 33101 31851 30820 30226 29846 29297 28374 27210 26155 25517 25447 25954 26877 27805
54984B7805M02l81q61o49R1P36P34J25m90n33k2O02J089J546J969J956J266M52
$$ 27805 28207 27826 26965 26316 26407 27143 27877 28002 27512 26979 26957 27559 28648 30194 32163 34119 35385 35837
54966C5837M92J673L135L705L089K020J378J368J646J955K391L075L895M699N578
$$ 35837 36329 38002 41137 44842 47931 49951 51329 52697 54343 56298 58689 61764 65659 70358 75936
54951G5936O723Q108R539J0939J2309J3422J3810J3109J1214Q099L859r15n091
$$ 75936 82659 90767 100306 111245 123554 136976 150786 163895 175109 183208 187067 186152 181061
54938A81061p809r186j0007j0742j1142j0779r731q598p942p787p615o849n398
$$ 181061 173252 164066 154059 143317 132175 121396 111665 103067 95125 87338 79723 72874 67476
54925F7476l721k418j751j574j539j341r13m39r5K09O37J037J120J108J702L174
$$ 67476 63755 61337 59586 58012 56473 55132 54219 53780 53685 53894 54531 55568 56688 57796 59498 62672
54909F2672M947O439P868R645J1353J2167J2036J1621J0989R373O525L380P99
$$ 62672 67619 74058 81926 91571 102924 115091 127127 138748 149737 159110 165635 169015 169814
54896A69814j615m701q222j1007j2362j2592j2238j1509j0558r590q487o904m964
$$ 169814 168199 163498 155276 144269 131907 119315 107077 95568 85010 75420 66933 60029 55065
54883E5065l468l047l389l589l138k321j689j364r92l22L69O20N08O16J159J560
$$ 55065 51597 48550 45161 41572 38434 36113 34424 33060 32068 31746 32115 32735 33243 33859 35018 36578
54867C6578J225L94k48m88n19k98K95Q08N39l50r10p80o59j097j623j584j146
$$ 36578 37803 38197 37949 37461 36942 36644 36939 37747 38286 37936 37026 36246 35587 34490 32867 31283 30137
54850C0137p94m54J03M81Q9p91j288j138q74q60q28n05l6L44N66N26J62j93j1
$$ 30137 29343 28889 28992 29473 29562 28771 27483 26345 25471 24611 23783 23278 23242 23586 24152 24678 24840 24647 24636
54831B4636O35J032P40Q4m24o74o76k28P13J681K111J945J487R28L28j36l02l14
$$ 24636 25271 26303 27043 27127 26703 26029 25353 25125 25838 27519 29630 31575 33062 33990 34318 34182 33880 33566
54813C3566l96m61k39K24N71O30O33Q76J352J864K390L074L922M642M978N147
$$ 33566 33170 32709 32470 32694 33265 33895 34528 35404 36756 38620 41010 44084 48006 52648 57626 62773
54797F2773N750P053Q583R687J0335J1010J1846J2267J1602R686O715K977j086
$$ 62773 68523 75576 84159 93846 104181 115191 127037 139304 150906 160592 167307 170284 169198
54784A69198m809p659r478j0221r757q281o561n382m825m454m057l804l729l528
$$ 169198 164389 156730 147252 137031 127274 118993 112432 107050 102225 97771 93714 89910 86181 82653
54770H2653l015k392j956j705j376p86j1P12J256J793K606L659M537N004N407
$$ 82653 79638 77246 75290 73585 72209 71423 71412 72124 73380 75173 77779 81438 85975 90979 96386
54755I6386O261P553Q855J0065J1595J3670J5825J7306J7760J7267J5873J3418
$$ 96386 102647 110200 119055 129120 140715 154385 170210 187516 205276 222543 238416 251834
54743B51834R800N170j02n462j0222j3782j6042j7409j8233j8326j7299j5351
$$ 251834 261634 266804 266702 261240 251018 237236 221194 203785 185552 167226 149927 134576
54731A34576j3334j1941j0983r802q107o200m541l474l192l456l476k643j424
$$ 134576 121242 109301 98318 88516 80409 74209 69668 66194 63002 59546 56070 53427 52003
54718E2003r61j575k342k389j908j463j004l16J56j47q44j045o92n40p81p35q9
$$ 52003 51042 49467 47125 44736 42828 41365 40361 40045 40201 40054 39210 38165 37473 36933 36152 35417 35328
54701C5328N20N41L24L07K39j50l93J6O28O18R2j44P1O1l76n06J50R19R52M63
$$ 35328 35848 36389 36713 37020 37259 37109 36716 36732 37360 37978 38070 37926 37997 38058 37682 37176 37326 38245 39197 39660
54681C9660L05O53R09P97P77J166J536J358P84L85L85N92Q46J035Q52J28o27o27
$$ 39660 39965 40618 41527 42324 43101 44267 45803 47161 47945 48330 48715 49307 50153 51188 52040 52168 51541 50914
54663E0914J17O60L55l36o07l80q0K26P99J546K059K359K866L593L942L596L106
$$ 50914 51031 51691 52046 51710 51103 50723 50643 50869 51668 53214 55273 57632 60498 64091 68033 71629 74735
54646G4735L278M276N601O651P162P359P934R507J1904J4181J5569J6159J6458
$$ 74735 78013 82289 87890 94541 101703 109062 116996 126503 138407 152588 168157 184316 200774
54633B00774J6590J6208J4866J2165P762J741n002j1061j5281j7282j7445j6588
$$ 200774 217364 233572 248438 260603 268365 270106 265104 254043 238762 221480 204035 187447
54621A87447j5484j4363j2965j1176r405q133p284o390n280m289l816l898m204
$$ 187447 171963 157600 144635 133459 124054 115921 108637 102247 96967 92678 88862 84964 80760
54608H0760m284l849l072k447k251k165j733j048o84r45j496j796j664j317j045
$$ 80760 76476 72627 69555 67108 64857 62692 60959 59911 59227 58282 56786 54990 53326 52009 50964
54593E0964j018j215j419j365r78m88k31k92l58m1N85R33N56j82n08k39lk91p37
$$ 50964 49946 48731 47312 45947 44969 44481 44250 43958 43600 43559 44144 45077 45633 45451 44943 44704 44701 44410 43673
54574D3673o71j15K74M8n63r60o83K52J259J565J004K64j0n9n14j257j478q82
$$ 43673 43002 42887 43161 43209 42646 41686 41003 41255 42514 44079 45083 45347 45337 45278 44764 43507 42029 41147
54556D1147j96k32r09j477j386p41j08Nl36m19L35J529K225K203K202K685L065
$$ 41147 40951 40719 39810 38333 36947 36206 36098 36103 35767 35348 35683 37212 39437 41640 43842 46527 49592
54539D9592K668J884J631K024K302K081J926K508L717M910N724O312O964P766
$$ 49592 52260 54144 55775 57799 60101 62182 64108 66616 70333 75243 80967 87279 94243 102009
54525A02009Q557R047Q989Q298P037N293L149P69j567l623n344o769p800q196
$$ 102009 110566 119613 128602 136900 143937 149230 152379 153148 151581 147958 142614 135845 128045 119849
54511A19849p872p147o578o391o270n789m978m235l731l211k444j615j111j116
$$ 119849 111977 104830 98252 91861 85591 79802 74824 70589 66858 63647 61203 59588 58477 57361
54497E7361j502j960k156j939j503j125p18P2J135J698J213J59m82m24j96k03
$$ 57361 55859 53899 51743 49804 48301 47176 46458 46530 47665 49363 50576 50735 50253 49829 49633 49430
54481D9430k37j05j91q95j820k023j121J91Q62N22k99q38p36j14O79J256J302
$$ 49430 49193 49088 48897 48002 46182 44159 43038 43229 44091 44613 44314 43476 42740 42626 43305 44561 45863
54464D5863Q28K60K6O0o8m84p88o69l75l34n48p01o83o03m03J12Q23J271J148
$$ 45863 46691 46951 46977 47037 46969 46485 45697 45028 44653 44319 43771 43070 42387 41784 41381 41493 42316 43587 44735
54445D4735O21P5j84j5M04N74J36n01n86j28l4p93j552j087O11K321K988K581
$$ 44735 45356 45431 45247 45232 45636 46210 46346 45845 45259 45131 45097 44304 42752 41665 42276 44597 47585 50166
54427E0166J627N73k22n17m62m74n98l84L38J003J004N43K91M49O44O86Q39J284
$$ 50166 51793 52366 52144 51627 51165 50691 50093 49709 50047 51050 52054 52597 52888 53337 53981 54667 55506 56790
54409E6790J775K023K077K083J945J500Q29J53m23r06j217j258j110r80r59r43
$$ 56790 58565 60588 62665 64748 66693 68193 69022 69175 68752 67846 66629 65371 64261 63281 62322 61379
54393F1379p87n11l25m49q28j074q54l66j56l98o32l82J77M76K78j33m27n64o78
$$ 61379 60592 60081 59756 59307 58479 57405 56551 56185 56029 55631 54999 54617 54794 55270 55548 55415 54988 54424 53746
54374E3746q73j161j393j231n24L44P07L42k76n45l48KK26K91K95L63O47J266
$$ 53746 52873 51712 50319 49088 48564 48908 49615 49957 49681 49136 48788 48790 49016 49307 49602 49965 50612 51878
54356E1878K057K490K006P28l25j41J096K074J853Q85J50j88o69j345j635j289
$$ 51878 53935 56425 58431 59159 58834 58693 59789 61863 63716 64601 64751 64563 63894 62549 60914 59625
54340E9625p45l15J49N36K37q48j792j777j213j046j381j524j155o21k67j41l49
$$ 59625 58880 58565 58714 59250 59487 58639 56847 55070 53857 52811 51430 49906 48751 48130 47863 47722 47373
54323D7373r05j218n58P93J508P23r21k069k011j041O1N48J07p56j045l73M63
$$ 47373 46468 45250 44692 45485 46993 47716 46795 44726 42715 41674 41735 42283 42390 41634 40589 40216 40679
54306D0679M29m61j277j421j150q77n48j9L85K22l52o77m43q2j24m16l26L81J201
$$ 40679 41108 40647 39370 37949 36799 35922 35374 35355 35740 35962 35610 34933 34490 34408 34284 33868 33542 33923 35124
54287C5124J490J175P38O13P77Q14L14o91j616j798j129j49N76R13R54O75R0m97
$$ 35124 36614 37789 38527 39140 39917 40731 41045 40354 38738 36940 35811 35662 36238 37151 38105 38780 38870 38373
54269C8373p07n05j24K50N29N87L93J55P5N8q4k32j47J40L88M63L14j84r44j413
$$ 38373 37666 37161 37037 37287 37816 38403 38796 38951 39026 39084 39000 38768 38621 38761 39149 39612 39926 39742 38798 37385
54249C7385j126l63K23M79O32N19j99j113j254m76K51K60Q6M49J099J366J163
$$ 37385 36259 35896 36119 36598 37230 37749 37550 36437 35183 34707 34958 35218 35304 35753 36852 38218 39381
54232C9381Q04K83m61j018r06l08K35N19N13j01j337k273j920o47K10J21k09k28
$$ 39381 40185 40468 40007 38989 38083 37775 38010 38529 39042 38941 37604 35331 33411 32764 32974 33095 32886 32658
54214C2658l26q72j361j109k16P07J298J506J309Q66N80O21O29L03j0J71O23O04
$$ 32658 32332 31460 30099 28990 28774 29481 30779 32285 33594 34460 35040 35661 36290 36593 36583 36754 37377 37981
54196C7981j47j046j354r23j56M94Q83J137J400J615J555J046J27r62j805j960
$$ 37981 37834 36788 35434 34511 34355 34849 35732 36869 38269 39884 41439 42485 42612 41650 39845 37885
54180C7885j353n30k04m30n47j05M88N21j14r14j473j784j860j517o75L52J088
$$ 37885 36532 36002 35798 35368 34821 34716 35204 35725 35611 34697 33224 31440 29580 28063 27388 27740 28828
54163B8828J335J227R29M77Qo2N66J503J770Q51o32j562j553j108o99k46L52Q21
$$ 28828 30163 31390 32319 32796 32804 32742 33308 34811 36581 37432 36800 35238 33685 32577 31878 31632 31984 32805
54145C2805R34Q89R25Q78N62K33J42K5m74j050j034m03J86L05J78N5j67m58m08
$$ 32805 33739 34628 35553 36431 36993 37226 37368 37393 36919 35869 34835 34432 34618 34923 35101 35156 34989 34531 34123
54126C4123J36O52O23L24L88Q35J105R84Q62R53Q03n1j224j778j291l44K42K86
$$ 34123 34259 34911 35534 35858 36246 37081 38186 39170 40032 40985 41788 41737 40513 38735 37444 37100 37342 37628
54108C7628K59M84P34O61L55K19M10O85Q38R51J101J112Q14L56l2m44j063j599
$$ 37628 37887 38371 39105 39766 40121 40340 40750 41435 42273 43224 44325 45437 46251 46607 46575 46131 45068 43469
54090D3469j455n76K57L72J09L42J215J901J708R51M58M16K58m04j113j111k71
$$ 43469 42014 41438 41695 42067 42176 42518 43733 45634 47342 48293 48751 49167 49425 49021 47908 46797 46526
54073D6526P58J275J202R22P15N42L11J49K77P03J256J835K485L127L396K950
$$ 46526 47284 48559 49761 50683 51398 51940 52251 52400 52677 53380 54636 56471 58956 62083 65479 68429
54057F8429J952J096R85J515K018K079K016K404L260M023M349M523M835M987M530
$$ 68429 70381 71477 72462 73977 75995 78074 80090 82494 85754 89777 94126 98649 103484 108471 113001
54042A13001L674L134L204L509L718L916M042L579K259O80k77m71m40n57p47r89
$$ 113001 116675 119809 123013 126522 130240 134156 138198 141777 144036 144716 144439 143968 143528 142971 142224 141235
54026A41235j474k165k677k794k798l048l482l767l733l519l354l344l405l366
$$ 141235 139761 137596 134919 132125 129327 126279 122797 119030 115297 111778 108424 105080 101675 98309
54012I8309l180l035l106l299l336l071k518j779j104q94j293j862k017j709j272
$$ 98309 95129 92094 88988 85689 82353 79282 76764 74985 73881 72987 71694 69832 67815 66106 64834
53997F4834p84j02N48O76L27P2N8j92p72r66m00J36k08r98j190p45n22p41o48
$$ 64834 64050 63948 64496 65172 65499 65571 65629 65437 64665 63699 63299 63435 63227 62229 61039 60294 59772 59031 58383
53978E8383J35Q82P86Lp50j075r35l14O28J369J466J070O97N98O76Q05R19R05
$$ 58383 58518 59400 60186 60189 59439 58364 57429 57115 57743 59112 60578 61648 62345 62943 63619 64424 65343 66248
53960F6248P41O51Q86J342J664J712J712J929K360K819L123L222L166L054K930
$$ 66248 66989 67640 68526 69868 71532 73244 74956 76885 79245 82064 85187 88409 91575 94629 97559
53945I7559K822K865L323M298N479O333O641O748P154P849Q241P889P261P424
$$ 97559 100381 103246 106569 110867 116346 122679 129320 136068 143222 151071 159312 167201 174462 181886
53931A81886Q791J0417J0919R981Q589P652O998N942M462L187K364J504K24j011
$$ 181886 190677 201094 212013 221994 230583 238235 245233 251175 255637 258824 261188 262692 262916 261905
53917B61905j447j113r05j552k857m059m681m784m624m344m074m068m576n512
$$ 261905 260458 259345 258440 256888 254031 249972 245291 240507 235883 231539 227465 223397 218821 213309
53903B13309o398o645o085n236m946n549o467o818o343n523m873m485m287m302
$$ 213309 206911 200266 194181 188945 183999 178450 171983 165165 158822 153299 148426 143941 139654 135352
53889A35352m454m481m296m161m149l812k850j867j792k615l221k712j409l76
$$ 135352 130898 126417 122121 117960 113811 109999 107149 105282 103490 100875 97654 94942 93533 93157
53875I3157k97j059k078k733k687k121j594j484j578j343n48M51R60N08o96j823
$$ 93157 92860 91801 89723 86990 84303 82182 80588 79104 77526 76183 75635 76086 77046 77554 76858 75035
53859G5035k104j563q64m75k34J18M42N02N30R13J513J673J023k6p66r11o80m17
$$ 75035 72931 71368 70504 70029 69795 69913 70355 70857 71387 72300 73813 75486 76509 76483 75717 74806 74126 73709
53841G3709k64j72nL16O96R06Q24O01M86N09M55K03q8j63K0L15N89Q32J072J367
$$ 73709 73445 73273 73268 73584 74280 75186 76010 76611 77097 77606 78061 78264 78176 78013 78033 78348 78937 79769 80841 82208
53821H2208J855K576L268L527L334L134L312L763M167M392M453M318M013L754
$$ 82208 84063 86639 89907 93434 96768 99902 103214 106977 111144 115536 119989 124307 128320 132074
53807A32074L597L209K347J395R45R16O53j6m31k6Q19J212P22l21j320j895k064
$$ 132074 135671 138880 141227 142622 143567 144483 145136 145120 144689 144663 145482 146694 147416 147095 145775 143880 141816
53790A41816k155k484l027l558m030m567n058n106m536l613k613j642r73j051
$$ 141816 139661 137177 134150 130592 126562 121995 116937 111831 107295 103682 101069 99427 98454 97403
53776I7403j776k259j864j159j194k057k754k555j772j103q11p87r76j292j407
$$ 97403 95627 93368 91504 90345 89151 87094 84340 81785 80013 78910 78099 77312 76336 75044 73637
53761G3637j055n24m91j209k097k311j674q04l44k51j22J5k64j011j583j376n44
$$ 73637 72582 72058 71567 70358 68261 65950 64276 63472 63128 62877 62755 62770 62506 61495 59912 58536 57992
53744E7992K74O48O27M63L89M57M54J73r8K22J116J664J132m1p97p77m52k28n6
$$ 57992 58266 58914 59541 60004 60393 60850 61304 61477 61379 61601 62717 64381 65513 65472 64675 63898 63446 63218 63162
53725F3162J73M42Q34J418J847J589P07n4o7O20J458J785J172j25j140j170o80
$$ 63162 63335 63777 64611 66029 67876 69465 70172 70118 70051 70671 72129 73914 75086 74961 73821 72651 71971
53708G1971n65p37k96P94J425R94L47M14Q94J053J061J488K092K197J881J740
$$ 71971 71406 70669 70373 71167 72592 73586 73933 74347 75241 76294 77355 78843 80935 83132 85013 86753
53692H6753J686J070P4k10O85J842K178J703J125Q42Q19J063J589K144K316J953
$$ 86753 88439 89509 89583 89373 90058 91900 94078 95781 96906 97748 98567 99630 101219 103363 105679 107632
53676A07632J241N36J45O3j04o89j354j397p61k23l46p00n89n9L23M31O02Q90
$$ 107632 108873 109409 109554 109617 109513 108824 107470 106073 105312 105089 104743 104043 103454 103395 103718 104149 104751 105641
53658A05641Q72M11k3k7J41n9o37j011p08R4P82R09N79K13Q0Q7Q8J71N09R96J278
$$ 105641 106513 106924 106901 106874 107015 106956 106319 105308 104600 104694 105476 106385 106964 107177 107257 107344 107432 107603 108112 109108 110386
53637A10386J143P20K57j56n41q76j052r79o95k86K14Q54J566J982J716R45M19
$$ 110386 111529 112249 112506 112350 111809 110933 109881 108902 108207 107921 108135 108989 110555 112537 114253 115198 115617
53620A15617O72J314J525J105O89Q46J462K068K371K232J557O16J47O38J626K153
$$ 115617 116289 117603 119128 120233 120922 121768 123230 125298 127669 129901 131458 132074 132221 132859 134485 136638
53604A36638J919J528J570J863J848J423J052J136J561J905J977J901J809J633
$$ 136638 138557 140085 141655 143518 145366 146789 147841 148977 150538 152443 154420 156321 158130 159763
53590A59763J391J363J663J782J076k26j011n60N99J425J541J232P43J87j83k06
$$ 159763 161154 162517 164180 165962 167038 166812 165801 165241 165840 167265 168806 170038 170781 170968 170785 170579
53574A70579j91m56p29o64n97r70j269o62L92M98n49j319r46l50m46n51J93J003
$$ 170579 170388 169932 169203 168539 167942 166972 165703 165041 165433 165931 165382 164063 163117 162767 162321 161770 161963 162966
53556A62966O47l21l05O70R62jq29m25M53O79M56N65Q77P43K68J64O76J388J970
$$ 162966 163613 163292 162987 163657 164619 164618 163789 163364 163817 164496 164952 165517 166394 167137 167405 167569 168245 169633 171603
53537A71603K386K621K661K640K625K541K476K690L013K800J970J505K238L597
$$ 171603 173989 176610 179271 181911 184536 187077 189553 192243 195256 198056 200026 201531 203769 207366
53523B07366M343M168L721L417L127L008L574M780N884O546P249Q289R014Q732
$$ 207366 211709 215877 219598 223015 226142 229150 232724 237504 243388 249934 257183 265472 274486 283218
53509B83218P887P677Q658J0235J1435J1833J1657J1407J1472J1998J2922J4047
$$ 283218 291105 298782 307440 317675 329110 340943 352600 364007 375479 387477 400399 414446
53497D14446J5031J5474J5255J4704J4264J3987J3685J3498J3910J4986J5982
$$ 414446 429477 444951 460206 474910 489174 503161 516846 530344 544254 559240 575222
53486E75222J6046J5141J4009J3347J3312J3734J4419J5139J5538J5267J4206
$$ 575222 591268 606409 620418 633765 647077 660811 675230 690369 705907 721174 735380
53475G35380J2626J1140J0391J0542J1092J1372J1269J1288J1778J2383J2408
$$ 735380 748006 759146 769537 780079 791171 802543 813812 825100 836878 849261 861669
53464H61669J1593J0204Q547O763N119L947L120J943n7k503m658o286p586q516
$$ 861669 873262 883466 892013 898776 903895 907842 910962 912905 912848 910345 905687 899401 891815 883299
53450H83299q767q389p879p602p657q292r766j1612j2758j2746j2262j2059j2025
$$ 883299 874532 866143 858264 850662 843005 834713 824947 813335 800577 787831 775569 763510 751485
53437G51485j1745j1330j1013j0531r729r275r764j0437r925q129o203m708l073
$$ 751485 739740 728410 717397 706866 697137 687862 678098 667661 657736 649607 643404 638696 635623
53424F35623j183j16n14j353j317n62n9J89R93K426L676M483N482O920Q097Q556
$$ 635623 634440 634324 633810 632457 631140 630578 630519 630708 631701 634127 637803 642286 647768 654688 662785 671341
53408F71341Q901R857J1168J2119J2627J3134J3749J4223J4592J5127J5790J6362
$$ 671341 680242 690099 701267 713386 726013 739147 752896 767119 781711 796838 812628 828990
53396H28990J7140J8700K0821K2365K2709K2719K3727K5848K7984K9318L0104
$$ 828990 846130 864830 885651 908016 930725 953444 977171 1003019 1031003 1060321 1090425
53385A090425L0961L1981L2867L3416L3606L3515L3476L3918L4695L4833L3487
$$ 1090425 1121386 1153367 1186234 1219650 1253256 1286771 1320247 1354165 1388860 1423693 1457180
53374A457180L1096K9007K7960K7449K6667K5517K4367K3169K1462J9139J6728
$$ 1457180 1488276 1517283 1545243 1572692 1599359 1624876 1649243 1672412 1693874 1713013 1729741
53363A729741J4796J3351J1975J0274P977M796N31m686j0397j6084k1356k5865
$$ 1729741 1744537 1757888 1769863 1780137 1788114 1792910 1793441 1788755 1778358 1762274 1740918 1715053
53351A715053k9281l1490l2647l2960l2547l1724l1199l1519l2324l2523l1467
$$ 1715053 1685772 1654282 1621635 1588675 1556128 1524404 1493205 1461686 1429362 1396839 1365372
53340A365372k9686k8248k7608k7414k7233k7098k7255k7710k8194k8336k7808
$$ 1365372 1335686 1307438 1279830 1252416 1225183 1198085 1170830 1143120 1114926 1086590 1058782
53329A058782k6427k4327k2003j9976j8439j7216j6081j4941j3725j2278j0601
$$ 1058782 1032355 1008028 986025 966049 947610 930394 914313 899372 885647 873369 862768
53318H62768r086q271q192q316q294q478r340j0526j1023j0354r113q236q053
$$ 862768 853682 845411 837219 828903 820609 812131 802791 792265 781242 770888 761775 753539 745486
53305G45486q230q176p363n693l896l052l316l554k729j282m83o31o94L37K375
$$ 745486 737256 729080 721717 716024 712128 709076 705760 702206 699477 698195 697712 697081 696387 696724 699099
53290F99099M644O574Q079R329J0530J1687J2521J2833J2933J3358J4181J4975
$$ 699099 703743 710317 718396 727725 738255 749942 762463 775296 788229 801587 815768 830743
53278H30743J5431J5580J5385J4599J3228J1750J0701J0297J0437J0743J0611
$$ 830743 846174 861754 877139 891738 904966 916716 927417 937714 948151 958894 969505
53267I69505R664Q193O757N382L672J707P7j162k775n230p966j0216j2018j3800
$$ 969505 979169 987362 994119 999501 1003173 1004880 1004957 1003795 1001020 995790 987824 977608 965590 951790
53253I51790j5512j6837j7828j8695j9229j9149j8817j8934j9530j9843j9207
$$ 951790 936278 919441 901613 882918 863689 844540 825723 806789 787259 767416 748209
53242G48209j7625j5575j3749j2866j3175j4068j4621j4612j4598j5034j5714
$$ 748209 730584 715009 701260 688394 675219 661151 646530 631918 617320 602286 586572
53231E86572j6145j6076j5587j4971j4577j4437j4048j2889j1153r586q547p698
$$ 586572 570427 554351 538764 523793 509216 494779 480731 467842 456689 447103 438556 430858
53219D30858o626n373m235l451l233l672m502n256n871o683p753q593q910r125
$$ 430858 424232 418859 414624 411173 407940 404268 399766 394510 388639 381956 374203 365610 356700 347575
53205C47575r748j0580j1004j0862j0485r986r100p832o748o268o000n193l774
$$ 347575 337827 327247 316243 305381 294896 284910 275810 267978 261230 254962 248962 243769 239995
53192B39995k570k410l283m473n311n606n506n287n224n335n218m480l416k854
$$ 239995 237425 235015 231732 227259 221948 216342 210836 205549 200325 194990 189772 185292 181876 179022
53178A79022l115l510l238k375j617j312j318j547j934j977j105K95R68K62j026
$$ 179022 175907 172397 169159 166784 165167 163855 162537 160990 159056 157079 155974 156269 157237 157499 156473
53163A56473j696j586j420j595j748j450p51N1P39J123J014M63k01o63q78q88
$$ 156473 154777 153191 151771 150176 148428 146978 146227 146278 147017 148140 149154 149617 149416 148753 147875 146987
53147A46987n77J50R92J357R89K71k74o47j153j622j371k03R80J115K27p16j098
$$ 146987 146410 146560 147552 148909 149898 150169 149895 149248 148095 146473 145102 144899 145879 146994 147221 146505 145407
53130A45407j174j291j311j041p04n83o31o97q93j296j635j666j629j852k125
$$ 145407 144233 142942 141631 140590 139886 139303 138672 137975 137082 135786 134151 132485 130856 129004 126879
53115A26879j903j109l00k0l39j032j807k298k243j810j528j634j752j391o44
$$ 126879 124976 123867 123567 123547 123208 122176 120369 118071 115828 114018 112490 110856 109104 107713 107069
53100A07069j68m60j285j862j617p00K31P03P35N43J58m49j078j399j260p94k68
$$ 107069 106901 106441 105156 103294 101677 100977 101208 101911 102646 103189 103347 102898 101820 100421 99161 98367 98099
53083I8099M6k4l50n69n97q60j591k163j674k34R69J113O65M86N79L25l20o62
$$ 98099 98145 98121 97771 97202 96605 95745 94154 91991 90317 90083 91052 92165 92830 93316 93895 94220 93900 93238
53065I3238k53M81Q33N50j48r37j464j402o97K82J057J380J219N98k67r16j020
$$ 93238 92985 93466 94299 94849 94701 93764 92300 90898 90201 90483 91540 92920 94139 94737 94470 93554 92534
53048I2534p66o14o87o99m28j2L29M97M61K30J11N47J487K138J737M86n81o69
$$ 92534 91768 91154 90467 89768 89340 89328 89657 90154 90615 90845 90956 91503 92990 95128 96865 97351 96770 96101
53030I6101J14J120J871K329K682L043L284L107K422J575J069R40P31J63m49o03
$$ 96101 96215 97335 99206 101535 104217 107260 110544 113651 116073 117648 118717 119657 120388 120551 120102 119499
53014A19499l41k39p01j467j921j746j216q56r11j136j103o75j40J11l1l35m75
$$ 119499 119158 118919 118218 116751 114830 113084 111868 111012 110101 108965 107862 107187 107047 107158 107127 106792 106317
52997A06317l22l2J33Q8j5p1j86m65p07n79r6L84O29P79R64J013P63M34L62N16
$$ 106317 105995 105963 106096 106184 106169 106098 105912 105447 104740 104161 104065 104449 105078 105857 106821 107834 108597 109031 109393 109909
52977A09909N60L75K02K38L84N06O56R10J085Q99L60r7L5Q58J901K479K225J388
$$ 109909 110469 110844 111046 111284 111668 112174 112830 113740 114825 115724 116084 115987 116022 116880 118781 121260 123485 124873
52959A24873N76J89J71K37K47L17N03N78J87o73j509j794j503j038o86l73k8J66
$$ 124873 125449 125638 125809 126046 126293 126610 127113 127691 127878 127205 125696 123902 122399 121361 120675 120302 120274 120440
52941A20440L9k75n15o43p11o22k97J0k2k41j60K97N65J96n18r28q39o44p36j072
$$ 120440 120479 120204 119689 119046 118335 117713 117416 117426 117404 117163 117003 117300 117865 118061 117543 116615 115776 115132 114396 113324
52921A13324j328j234p93k27J93L67L84M06N39P73R08N92k32r83r18j41L46n2
$$ 113324 111996 110762 109969 109742 109935 110302 110686 111092 111631 112404 113312 113904 113672 112689 111771 111630 111976 111924
52903A11924o47m66K39L09n90j449j379p44l66l39l13m19r75j536j240j70N57
$$ 111924 111277 110811 111050 111359 110769 109320 107941 107197 106831 106492 106179 105760 104785 103249 102009 101839 102396
52886A02396L74J36Q24K015K388J498K86j16M29J285J854J962J730J399J150R50
$$ 102396 102770 102906 103730 105745 108133 109631 109917 109801 110230 111515 113369 115331 117061 118460 119610 120560
52870A20560O76N03Q73J876K872L056K350J344M08o77k042l169l470l121k867
$$ 120560 121236 121739 122612 124488 127360 130416 132766 134110 134518 133841 131799 128630 125160 122039 119172
52855A19172l003l087k746k233j976j999k122k338k612k591j987j147p04p62q34
$$ 119172 116169 113082 110336 108103 106127 104128 102006 99668 97056 94465 92478 91331 90627 89865 89031
52840H9031n58p5L25N00L85N0j87j20j16o72j576k061j979j960k255k189j338
$$ 89031 88473 88398 88723 89223 89608 89658 89471 89351 89235 88563 86987 84926 82947 80987 78732 76543 75205
52823G5205m82o15j510k098j964j636j522j392r24j26P88J495J555R23L38N46
$$ 75205 74723 74108 72598 70500 68536 66900 65378 63986 63062 62936 63724 65219 66774 67697 68035 68581
52807F8581J218J381R02O82J210J790J654J061P05O18L23k24n37l27J18L28J23
$$ 68581 69799 71180 72082 72764 73974 75764 77418 78479 79184 79802 80125 79901 79364 79037 79155 79483 79606
52790G9606k78n32n46n73p95q78l58O44J493J864J948J802J152R6o89q24o89o61
$$ 79606 79328 78796 78250 77677 76882 76004 75646 76290 77783 79647 81595 83397 84549 84645 83956 83132 82443 81782
52772H1782m78O7M75K59j69j39J67J13k03r2M99Q27N76L01M53O59M75K01M55J276
$$ 81782 81304 81371 81846 82105 81936 81797 81964 82077 81874 81782 82281 83108 83684 83985 84438 85097 85572 85773 86228 87504
52752H7504K060K263J807J021L68J76M24P57Q18N40J38p8J08O19J089J105M59
$$ 87504 89564 91827 93634 94655 95023 95199 95623 96380 97198 97738 97876 97798 97906 98525 99614 100719 101178
52735A01178p86k269l284l210k199j200r28j115j077o53r3O07J547K287K200J458
$$ 101178 100392 98123 94839 91629 89430 88230 87302 86187 85110 84457 84364 84971 86518 88805 91005 92463
52719I2463R50J074J334J267J015P52K58n07j010q63m03j33M3M70J034J306J201
$$ 92463 93413 94487 95821 97088 98103 98855 99113 98606 97596 96733 96330 96197 96240 96710 97744 99050 100251
52702A00251R33N39r5q41j349j402r71j07Q46J289R68M20L06N33N43L03L30P82
$$ 100251 101184 101723 101628 100787 99438 98036 97065 96958 97804 99093 100061 100481 100787 101320 101863 102166 102496 103278
52684A03278J214J365J467J588J294M23m49p65q27j203j697j654j164j120j889
$$ 103278 104492 105857 107324 108912 110206 110629 110180 109415 108588 107385 105688 104034 102870 101750 99861
52669I9861k666k520j581p26m29m70n32n24m37k99k42k89j16M87J079J016L88
$$ 99861 97195 94675 93094 92368 91939 91469 90937 90413 89976 89677 89435 89146 89030 89517 90596 91612 92000
52652I2000j35l99q85j534j400j10J218J362P06N52J113J342O98j16l50j51R6
$$ 92000 91865 91466 90581 89047 87647 87537 88755 90117 90823 91375 92488 93830 94528 94412 94062 93911 94007
52635I4007M62R64J113O25L9L7M65O60M31J47Kk54q13j411j557j018j30M07K30
$$ 94007 94469 95433 96546 97171 97210 97247 97712 98372 98803 98950 98952 98698 97885 96474 94917 93899 93769 94176 94406
52616I4406k24k49J50L20Q6J80J182K565L326L168K581K099J959K145K290J789
$$ 94406 94182 93933 94083 94403 94489 94669 95851 98416 101742 104910 107491 109590 111549 113694 115984 117773
52600A17773N88m03l65L06N51J61j03J71M24N9p37j389j648j640j591j752k201
$$ 117773 118361 117958 117593 117899 118450 118611 118508 118679 119103 119162 118425 117036 115388 113748 112157 110405 108204
52583A08204k537k200j211k28L01N88Q89J041R23Q87J244J632J448O88r0n77r16
$$ 108204 105667 103467 102256 102028 102329 102917 103806 104847 105770 106657 107901 109533 110981 111669 111579 111002 110086
52566A10086j214j359j437j789k431k750k189j038j68kp3K40Q31R93L57o31j244
$$ 110086 108872 107513 106076 104287 101856 99106 96917 95879 95711 95709 95636 95876 96707 97700 98057 97426 96182
52549I6182j261j029q89p81m49J41O49O41P9n26n98j29L77N77O00O21M95J22k35
$$ 96182 94921 93892 93003 92222 91773 91914 92563 93204 93283 92757 92159 92030 92407 92984 93584 94205 94700 94822 94587
52530I4587l38l89o39q99r05q48r31p32J08Q19J96j520k562j879m13M76Q03J231
$$ 94587 94249 93860 93221 92322 91417 90569 89638 88906 89014 89833 90029 88509 85947 84068 83655 84131 84934 86165
52512H6165J461O98o48j177m60L66K83l77q13r59j162j297r78l31J02N7k62n43
$$ 86165 87626 88324 87676 86499 86039 86405 86688 86311 85498 84539 83377 82080 81102 80771 80873 80930 80668 80125
52494H0125n60j78M09P18N02K03M26J189J986K422K418J953J126L45Ll2j53l16
$$ 80125 79565 79387 79796 80514 81016 81219 81645 82834 84820 87242 89660 91613 92739 93084 93087 93055 92902 92586
52476I2586j44L04M88K70J35L56N04K30j27j80j96n61r57q54m74m91q83r60m94
$$ 92586 92442 92746 93234 93504 93639 93995 94499 94729 94602 94422 94226 93665 92708 91854 91380 90889 90006 89046 88552
52457H8552k6Q5Q5J29j08o69q93l21N36Q82P07N15L95oo76j086r01k89M27J037
$$ 88552 88526 88611 88696 88825 88717 88048 87155 86834 87370 88252 88959 89474 89869 89863 89187 88101 87200 86911 87338 88375
52437H8375J258Q10j65j058j367j150p96n13j89K62N83L37m52j009m99Q89J998
$$ 88375 89633 90443 90278 89220 87853 86703 85907 85394 85205 85467 86050 86387 85935 84926 84427 85316 87314
52420H7314K011J316P87O33M61P4l62p36j013r15k26O29R14N34J17J09K90L67
$$ 87314 89325 90641 91428 92061 92522 92596 92234 91498 90485 89570 89344 89973 90887 91421 91538 91647 91937 92304
52402I2304M37P01J059J242J031K67q93j771j669o93L58J033J541K016K138J812
$$ 92304 92741 93442 94501 95743 96774 97041 96148 94377 92708 92015 92373 93406 94947 96963 99101 100913
52386A00913J500J460J313Q12M70P55J236J224Q72Q74J359J800J933J965K033
$$ 100913 102413 103873 105186 105998 106468 107223 108459 109683 110555 111429 112788 114588 116521 118486 120519
52371A20519K025J956J904J644R67K90K80Q32J160J003J028J727K576K723K048
$$ 120519 122544 124500 126404 128048 129015 129305 129585 130417 131577 132580 133608 135335 137911 140634 142682
52356A42682J185Q43J373K568L586L506K427J629K171L578M436M038L034K531
$$ 142682 143867 144710 146083 148651 152237 155743 158170 159799 161970 165548 169984 174022 177056 179587
52342A79587L043M293N525O002N615N101N326O287P083P078O666O813P961R694
$$ 179587 182630 186923 192448 198450 204065 209166 214492 220779 227862 234940 241606 248419 256380 266074
52328B66074J1208J1985J2127J2251J2956J4224J5449J6131J6413J6669J6803
$$ 266074 277282 289267 301394 313645 326601 340825 356274 372405 388818 405487 422290
52317D22290J6336J5201J4087J3705J4011J4363J4287J3859J3307J2658J1815
$$ 422290 438626 453827 467914 481619 495630 509993 524280 538139 551446 564104 575919
52306E75919J0841R905R013P895O216L930J409p38k065k540k502k481k975m099
$$ 575919 586760 596665 605678 613573 619789 623719 625128 624390 622325 619785 617283 614802 611827 607728
52292F07728n399o177o253o167o410o702o371n274l877k513j150J10R50J425K102
$$ 607728 602329 596152 589899 583732 577322 570620 564249 558975 555098 552585 551435 551545 552495 553920 556022
52277E56022L258M555N804P375R311J0721J0908J0633J1242J2696J3650J3414
$$ 556022 559280 563835 569639 577014 586325 597046 607954 618587 629829 642525 656175 669589
52265F69589J2781J2568J2377J1506J0196R215Q729Q317P682O665M888K280k72
$$ 669589 682370 694938 707315 718821 729017 738232 746961 755278 762960 769625 774513 776793 776521
52252G76521j662j968k407l812n774p454q540r200r631j0101j0902j1874j2387
$$ 776521 774859 772891 770484 766672 760898 753444 744904 735704 726073 715972 705070 693196 680809
52239F80809j2144j1644j1419j1174j0325r131q557q891r107q055n883l894l101
$$ 680809 668665 657021 645602 634428 624103 614972 606415 597524 588417 580362 574479 570585 567484
52226E67484l252l390k971k254j678j251o70J40R81J742K505L189L428L041K360
$$ 567484 564232 560842 557871 555617 553939 552688 552018 552158 553139 554881 557386 560575 564003 567044 569404
52211E69404J843J590J504J713K390L266L717L424K607J624P36K35L46Q02R60
$$ 569404 571247 572837 574341 576054 578444 581710 585427 588851 591458 593082 593818 594053 594399 595201 596161
52196E96161N24j32n79q07r25q61o78p73j207j407j056r17j881l518m439m173
$$ 596161 596685 596553 595974 595167 594242 593381 592703 591930 590723 589316 588260 587343 585462 581944 577505 573332
52180E73332l669l698l787l269k487k188k280k084j479r43o44l72k66p73j688
$$ 573332 569663 565965 562178 558909 556422 554234 551954 549870 548391 547448 546804 546432 546166 545393 543705
52165E43705k136j780j335j442j675j352o88m11n00k25N47R97N86r0j40M26R12
$$ 543705 541569 539789 538454 537012 535337 533985 533297 532886 532386 532161 532708 533705 534291 534201 534061 534487 535399
52148E35399J003R78R60O50n1o88p49j68Q79K298L856N075N706O141O938Q077
$$ 535399 536402 537380 538340 538990 538939 538251 537502 537334 538213 540511 544367 549442 555148 561289 568227 576304
52132E76304R127R919J0601J1129J1385J1693J2626J4073J5184J5523J5567J5776
$$ 576304 585431 595350 605951 617080 628465 640158 652784 666857 682041 697564 713131 728907
52120G28907J5807J5279J4697J4723J4943J4343J2922J1816J1645J1619J0728
$$ 728907 744714 759993 774690 789413 804356 818699 831621 843437 855082 866701 877429
52109H77429R062P422O133M912L518J954J80j777l514m615n308o202p338q116
$$ 877429 886491 893913 900046 904958 908476 910430 910610 908833 905319 900704 895396 889194 881856 873740
52095H73740q316q653r729j0915j0977r684q164p398o999n970m222k698k021j725
$$ 873740 865424 856771 847042 836127 825150 815466 807302 799904 792905 786935 782713 780015 777994 776269
52081G76269j036J43J425K751M429O462Q340R618J0332J0740J0999J1244J1690
$$ 776269 775233 775376 776801 779552 783981 790443 798783 808401 818733 829473 840472 851716 863406
52068H63406J2401J3063J3263J2865J2017J0902R640Q362P143N873M339K478M45
$$ 863406 875807 888870 902133 914998 927015 937917 947557 955919 963062 968935 973274 975752 976197
52055I76197j508l218m683o033p489r204j1119j2940j4302j5082j5568j6261j7384
$$ 976197 974689 971471 966788 960755 953266 944062 932943 920003 905701 890619 875051 858790 841406
52042H41406j8524j9043j8821j8471j8642j9247j9558j9020j7747j6275j5023
$$ 841406 822882 803839 785018 766547 747905 728658 709100 690080 672333 656058 641035
52031F41035j4088j3355j2625j1695j0554r480q851q783r058r400r636r580r056
$$ 641035 626947 613592 600967 589272 578718 569238 560387 551604 542546 533146 523510 513930 504874
52018E04874q260p841q246r008r217q669q156q369r014r361r327r495j0177j1004
$$ 504874 496614 488773 480527 471519 462302 453633 445477 437108 428094 418733 409406 399911 389734 378730
52004C78730j1473j1459j1122j0697j0469j0645j1047j1189j0781r990r131q399
$$ 378730 367257 355798 344676 333979 323510 312865 301818 290629 279848 269858 260727 252328
51992B52328p934p793p652o938n663m701m744n211m831l364k018j839k311k170
$$ 252328 244394 236601 228949 222011 216348 211647 206903 201692 196861 193497 191479 189640 187329 185159
51978A85159j248o27j053k000k735l448m585n557n253l827k863l328m273m214
$$ 185159 183911 183284 182231 180231 177496 174048 169463 163906 158653 154826 151963 148635 144362 140148
51964A40148l156k281k124k126j868j696j874j978j557q47m35o53j476k568l181
$$ 140148 136992 134711 132587 130461 128593 126897 125023 123045 121488 120641 120206 119553 118077 115509 112328
51949A12328k600j072J45J42o31j070p32mO09Q18M61l09r26r72p17o83q85r58
$$ 112328 109728 108656 108801 108943 108312 107242 106510 106506 107115 107933 108394 108085 107159 106187 105470 104787 103902 102944
51931A02944q54p79o93m40l11p69j556j746r04K81P89K82p71j591j561p08J36
$$ 102944 102090 101311 100618 100178 99867 99098 97542 95796 94892 95173 95962 96244 95473 93882 92321 91613 91749
51914I1749P5p39j187o23L06O68M85M48P21P70L02k84m95l34j51j90m94r66j296
$$ 91749 91824 91085 89898 89275 89581 90249 90734 91182 91903 92673 92975 92691 92196 91862 91711 91521 91027 90061 88765
51895H8765j039o4J055J345L43j299k244j699k18Q92R49M41J95L16K83j30m86
$$ 88765 87726 87662 88717 90062 90405 89106 86862 85163 84945 85837 86786 87227 87422 87738 88021 87891 87405
51878H7405l13K99R21J335J568J545J091L68j9L51J145J631J540J295J326J546
$$ 87405 87092 87391 88312 89647 91215 92760 93851 94219 94200 94551 95696 97327 98867 100162 101488 103034
51862A03034J717J985K637L487M028M236M762O107P974R711J1118J2535J4293
$$ 103034 104751 106736 109373 112860 116888 121124 125886 131993 139967 149678 160796 173331 187624
51849A87624J6481J9156K2382K5883K8840L0108K8608K3671J5373M801o181j5689
$$ 187624 204105 223261 245643 271526 300366 330474 359082 382753 398126 402927 396746 381057
51837C81057k2573k6496k7601k6321k3477k0211j7478j5509j3881j2113j0191
$$ 381057 358484 331988 304387 278066 254589 234378 216900 201391 187510 175397 165206
51826A65206q503p367o698o127n387m490l546k561j532p40n90j088j646j735j458
$$ 165206 156703 149336 142638 136511 131124 126634 123088 120527 118995 118255 117665 116577 114931 113196 111738
51811A11738j201q90j69P59J114O33N0Q1M70N66M18N66R96J107P15L11K03P5l34
$$ 111738 110537 109647 109478 110237 111351 111984 112034 112115 112585 113151 113569 114135 115131 116238 116953 117264 117467 117542 117208
51792A17208o84n27K3M55M15j44j022j716j658q49lJ87k20o46p35n96m93n70p65
$$ 117208 116524 115997 116020 116475 116890 116746 115724 114008 112350 111501 111498 111685 111465 110819 110084 109488 108995 108425 107660
51773A07660q75q01p36q91r99n61L29R06P62M55O39J089J146P95O19Q69J208J323
$$ 107660 106785 105984 105248 104357 103358 102797 103126 104032 104794 105249 105888 106977 108123 108918 109537 110406 111614 112937
51755A12937J256J130R38O57K30m49j162j236l45Q25J272J039J071J749K331K089
$$ 112937 114193 115323 116261 116918 117148 116699 115537 114301 113956 114781 116053 117092 118163 119912 122243 124332
51739A24332J273N66J87j01m93j077j909k729k940k225r96j4K45k17r91j354p89
$$ 124332 125605 126171 126358 126257 125764 124687 122778 120049 117109 114884 113888 113874 114119 113902 112911 111557 110768
51722A10768K79P52J42q68j462j628j640j278l96K71j61j301j814j100J15R35
$$ 110768 111047 111799 111941 111073 109611 107983 106343 105065 104669 104940 104779 103478 101664 100564 100679 101614
51706A01614J072M14j146k946l545k256j60J064R82L94m7l88o53n08J22P16P64
$$ 101614 102686 103100 101954 99008 95463 93207 93047 94111 95093 95487 95440 95052 94399 93891 94013 94729 95493
51689I5493L41j96p23j251j568j400q71m82n48q24q30m22j4j30q15j488j472o40
$$ 95493 95834 95638 94915 93664 92096 90696 89825 89343 88795 87971 87141 86719 86705 86575 85760 84272 82800 82160
51671H2160N07J360J697J643J309P30O9k86p7M70P72M66j88n33j48P05J310J190
$$ 82160 82667 84027 85724 87367 88676 89406 89475 89189 89112 89582 90354 90820 90632 90099 89951 90656 91966 93156
51653I3156O17L52Q01J495J580Q09j62n43k28L55R52J716K662L350L354K852K448
$$ 93156 93773 94125 94926 96421 98001 98810 98648 98105 97877 98232 99184 100900 103562 106912 110266 113118 115566
51636A15566K456K600K470K069J759J724J728J464J013P56P84O42j44j322k035
$$ 115566 118022 120622 123092 125161 126920 128644 130372 131836 132849 133605 134389 135031 134887 133565 131530
51621A31530j738q61k89l90p69r24q70r33j175j308j147r47j102j606j988j854
$$ 131530 129792 128931 128642 128252 127483 126559 125689 124756 123581 122273 121126 120179 119077 117471 115483 113629
51605A13629j399j155j311j464j202o90m32n27n19o9M89N78J50k93m06l72m44
$$ 113629 112230 111075 109764 108300 107098 106408 105976 105449 104930 104861 105350 105928 106078 105785 105379 105007 104563
51588A04563m61j19M77Q61P80M12m4o03j165j306p79n5J04l29n17R4R23R80K38
$$ 104563 104102 103983 104460 105321 106101 106513 106469 105866 104701 103395 102616 102561 102665 102336 101819 101913 102836 103816 104054
51569A04054k90Q0Q25J051P63P41J324J873J714R98L92J64Q5J06N50J545K588
$$ 104054 103764 103844 104669 105720 106483 107224 108548 110421 112135 113133 113525 113689 113774 113880 114430 115975 118563
51552A18563K994K591J785J030M48n7m83n83n1J099K291K769K349J673J563K128
$$ 118563 121557 124148 125933 126963 127411 127354 126871 126288 126237 127336 129627 132396 134745 136418 137981 140109
51536A40109K772K959K718K283J623N76o92j647j817j159l9R72J385J070M12m1
$$ 140109 142881 145840 148558 150841 152464 153040 152348 150701 148884 147725 147686 148658 150043 151113 151525 151484
51520A51484j31k00n59r69r48m49L4Q9j32k33j53j71m24p72j127j644k354k882
$$ 151484 151353 151153 150594 149625 148677 148228 148262 148351 148219 147986 147833 147662 147238 146466 145339 143695 141341 138459
51502A38459k787k132j499j397j768k104j997j513j068r81j132j165r67q35j064
$$ 138459 135672 133540 132041 130644 128876 126772 124775 123262 122194 121213 120081 118916 117949 117114 116050
51487A16050j535j845j780j501j291j298j486j657j537r98k53K72L01r2o24j011
$$ 116050 114515 112670 110890 109389 108098 106800 105314 103657 102120 101122 100869 101141 101442 101350 100726 99715
51471I9715j088q95o10l03J89Q71J287R76K50MN45J084P19l85j293j499j272j001
$$ 99715 98627 97732 97122 96819 97008 97879 99166 100142 100392 100396 100941 102025 102744 102359 101066 99567 98295 97294
51453I7294q03p59r93j274j099m25J02j7m24m33K2M23M85M63O40R79J365J791
$$ 97294 96491 95732 94739 93465 92366 91941 92043 92026 91602 91169 91191 91614 92099 92562 93202 94181 95546 97337
51435I7337K163K216J844J295Q69O01L74J37j31n22r99j283j178q47o00m73l59
$$ 97337 99500 101716 103560 104855 105724 106325 106699 106836 106705 106183 105184 103901 102723 101876 101276 100803 100444
51418A00444l53n85p63m17L44P61L97k23l41M8L85M42M79N24J72p63j810k398
$$ 100444 100091 99506 98743 98326 98670 99431 99828 99605 99264 99312 99697 100139 100618 101142 101314 100551 98741 96343
51400I6343k490k449k440k305j967j666j726k168k556k355j523p20o29j115j384
$$ 96343 93853 91404 88964 86659 84692 83026 81300 79132 76576 74221 72698 71978 71349 70234 68850
51385F8850j024m90l35l73m5O73J211J195Q61O12N22M06J30k10l30NO22Q99M26
$$ 68850 67826 67336 67001 66628 66583 67256 68467 69662 70523 71135 71657 72063 72193 71983 71653 71658 72280 73179 73605
51366G3605l96o88j29P00J081R24N97K95r0n69q89q29n60n09q56j271j259q07
$$ 73605 73209 72521 72392 73092 74173 75097 75694 75989 75899 75330 74441 73612 73052 72543 71687 70416 69157 68350
51348F8350m15m38o37n57j68K44N03N38J53o80j349j045K42J645K425K592K485
$$ 68350 67935 67497 66860 66303 66135 66379 66882 67420 67573 66893 65544 64499 64741 66386 68811 71403 73888
51331G3888K308K232K360K262J292l47j452j290n56k46k66K8M18J52o19q86m08
$$ 73888 76196 78428 80788 83050 84342 83995 82543 81253 80697 80451 80185 80213 80631 80783 80164 79278 78870
51314G8870j51p76j646j770r95J89J327J947J552K82q71j171j043j259j700j695
$$ 78870 78719 77943 76297 74527 73532 73721 75048 76995 78547 78829 77958 76787 75744 74485 72785 71090
51298G1090j222q86q38n64J52Q28J011Q20N08J21k02j69J82M33M99P83J288J239
$$ 71090 69868 68982 68144 67580 67732 68560 69571 70391 70899 71020 70818 70649 70831 71264 71763 72546 73834 75073
51280G5073K26q38p13N19J605J858J816K069K294J968J375J249J691K074J923
$$ 75073 75299 74461 73748 74267 75872 77730 79546 81615 83909 85877 87252 88501 90192 92266 94189
51265I4189J411R63P33N85L58L6k58l99m47n94q58r71p60m94n67q98r78n48Q4
$$ 94189 95600 96563 97296 97881 98239 98275 98017 97618 97171 96577 95719 94748 93988 93494 92927 92029 91051 90503 90587
51246I0587M61M85L74K77J77j0l22p12j009j030o96j38L69M64j10j146k005k165
$$ 90587 91048 91533 91907 92184 92361 92351 92029 91317 90308 89278 88582 88444 88813 89277 89167 88021 86016 83851
51228H3851j771j263o79K90J574K560K793K396J617N59m37p13j03O10O05M4l65
$$ 83851 82080 80817 80138 80428 82002 84562 87355 89751 91368 91927 91490 90777 90674 91284 91889 91933 91568
51211I1568m59n65n93r0P65J052L11p87j339j243j011r19q19n35r3L58O06M89
$$ 91568 91109 90544 89951 89861 90626 91678 91989 91202 89863 88620 87609 86690 85871 85336 85243 85601 86207 86696
51193H6696Q4l43o25p44o06j24M62O84N07L45L55K09j72k13M60J253J339P95K93
$$ 86696 86780 86437 85812 85068 84462 84338 84800 85484 85991 86336 86691 86900 86728 86515 86975 88228 89567 90362 90655
51174I0655J8l36o20k65O02J051P09M24J021J979K083J032l32j219j633j875j965
$$ 90655 90673 90337 89717 89452 90054 91105 91814 92238 93259 95238 97321 98353 98021 96802 95169 93294 91329
51157I1329j782j445j181j081j057q98l69N95J646K190J963J282O77M48O18J035
$$ 91329 89547 88102 86921 85840 84783 83885 83516 84111 85757 87947 89910 91192 91869 92317 92935 93970
51141I3970J317J018J60n65m89K42Q80J011Q99Q60P93M88J2l80n57m15J62J002
$$ 93970 95287 96305 96465 95900 95411 95653 96533 97544 98443 99303 100096 100584 100596 100216 99659 99244 99406 100408
51123A00408J525J199J69q89j315q29L93J629J900Q67n59r63J06J760K835K971
$$ 100408 101933 103132 103301 102412 101097 100268 100661 102290 104190 105057 104498 103535 103641 105401 108236 111207
51107A11207K576K148J889J690J285N65j11k18K62O90M88k14q06q89n44j32L8
$$ 111207 113783 115931 117820 119510 120795 121360 121249 121031 121293 121983 122471 122257 121451 120562 120018 119886 119924
51090A19924j12l96n88o43n71k06N81J446J756J381Q70P39Q96J008R66P41K13
$$ 119924 119812 119416 118828 118185 117614 117408 117989 119435 121191 122572 123442 124181 125077 126085 127051 127792 128005
51073A28005m57o21J10J172J583J089L01k11m61o56p84p35n58m30m94p34r17p35
$$ 128005 127548 126927 127037 128209 129792 130881 131182 130971 130510 129854 129070 128335 127777 127347 126853 126119 125202 124467
51055A24467j69L80N69N55O96J020J272J364J337J083M87j45k78J98Q46J282J475
$$ 124467 124298 124678 125247 125802 126498 127518 128790 130154 131491 132574 133061 132916 132638 132836 133682 134964 136439
51038A36439J474J252R31P93R16J102J174J133R90Q27J018J844K809K940K037
$$ 136439 137913 139165 140096 140889 141805 142907 144081 145214 146204 147031 148049 149893 152702 155642 157679
51023A57679J140J254K060K408J879J216J305K193L264L978M208M160M163M468
$$ 157679 158819 160073 162133 164541 166420 167636 168941 171134 174398 178376 182584 186744 190907 195375
51009A95375N056N615N803N583N241N068N084N208N541O262P197P850Q061Q370
$$ 195375 200431 206046 211849 217432 222673 227741 232825 238033 243574 249836 257033 264883 272944 281314
50995B81314R348J0815J2118J3094J4284J6121J8390K0612K2566K4385K6342K8806
$$ 281314 290662 301477 313595 326689 340973 357094 375484 396096 418662 443047 469389 498195
50983D98195L2021L5790L9502M2629M5067M7055M8962N1130N3489N5374N6029
$$ 498195 530216 566006 605508 648137 693204 740259 789221 840351 893840 949214 1005243
50972A005243N5358N3781N1427M8054M3774L9137L4193K8237K0994J3420O727
$$ 1005243 1060601 1114382 1165809 1213863 1257637 1296774 1330967 1359204 1380198 1393618 1400345
50961A400345J073m122q880j2533j4727j5895j6589j6923j6721j5839j4285j2376
$$ 1400345 1401418 1397296 1388416 1375883 1361156 1345261 1328672 1311749 1295028 1279189 1264904 1252528
50949A252528j0783j0116j0502j1721j3637j6106j8718k1166k3777k7075l0822
$$ 1252528 1241745 1231629 1221127 1209406 1195769 1179663 1160945 1139779 1116002 1088927 1058105
50938A058105l4106l6507l8619m1008m3209m4143m3293m1132l8528l6059l3811
$$ 1058105 1023999 987492 948873 907865 864656 820513 777220 736088 697560 661501 627690
50927F27690l1563k9095k6418k3778k1378j9197j7091j4962j2852j0931r378q166
$$ 627690 596127 567032 540614 516836 495458 476261 459170 444208 431356 420425 411047 402881
50915D02881p021n784m678m028l728l282k369j189j83L77M96M17M96R44J618K193
$$ 402881 395860 390076 385398 381370 377642 374360 371991 370802 370619 370996 371492 371909 372405 373349 374967 377160
50899C77160K546K769K915K992L229L949N093O165O762O956O988P022P284Q114
$$ 377160 379706 382475 385390 388382 391611 395560 400653 406818 413580 420536 427524 434546 441830 449944
50885D49944R467J0698J1243J1421J2074J3497J5175J6639J8131K0159K2760K5597
$$ 449944 459411 470109 481352 492773 504847 518344 533519 550158 568289 588448 611208 636805
50873F36805K8628L2211L6457M0962M5396N0193N6134O3375P1222P9022Q6861
$$ 636805 665433 697644 734101 775063 820459 870652 926786 990161 1061383 1140405 1227266
50862A227266R5112J03592J11552J18429J24217J29051J32662J34354J33307J28856
$$ 1227266 1322378 1425970 1537522 1655951 1780168 1909219 2041881 2176235 2309542 2438398
50852B438398J20726J09132R4547P7399N8188L7933J8178K31j5504k9207m0698
$$ 2438398 2559124 2668256 2762803 2840202 2898390 2936323 2954501 2954732 2939228 2910021 2869323
50841B869323m9087n3465n3752n0673m5050l7513k8851k0280j2918p209l352k092
$$ 2869323 2820236 2766771 2713019 2662346 2617296 2579783 2550932 2530652 2517734 2510525 2507173 2505081
50829B505081m490j0652j9251k8638l8151m8006n8312o8757p8934q8379r6249
$$ 2505081 2500591 2489939 2470688 2442050 2403899 2355893 2297581 2228824 2149890 2061511 1965262
50818A965262j01604j04114j04173j02283r8739r3830q7895q1016p3093o4432
$$ 1965262 1863658 1759544 1655371 1553088 1454349 1360519 1272624 1191608 1118515 1054083
50808A054083n5875m8221m1716l6216l1404k6795k1960j7092j2947r945p639n354
$$ 1054083 998208 949987 908271 872055 840651 813856 791896 774804 761857 751912 744273 738919
50796G38919l063j281l51k06o24j345k036k485k796l210l843m758o096p785r270
$$ 738919 735856 734575 734224 734018 733394 732049 730013 727528 724732 721522 717679 712921 706825 699040 689770
50781F89770r966r981j0049j0696j1744j2572j2708j2022j0753r400q358p531
$$ 689770 679804 669823 659774 649078 637334 624762 612054 600032 589279 579879 571521 563990
50769E63990o395m665k687r86M39K078M168O285P940R365J1323J4122J7206J9943
$$ 563990 557595 552930 550243 549257 549696 551774 555942 562227 570167 579532 590855 604977 622183 642126
50755F42126K2431K5207K8397L1667L4928L8587M2930M7648N2243N6552O0678
$$ 642126 664557 689764 718161 749828 784756 823343 866273 913921 966164 1022716 1083394
50744A083394O4632O8294P1577P4350P6307P7060P6344P4083P0300O4985N7893
$$ 1083394 1148026 1216320 1287897 1362247 1438554 1515614 1591958 1666041 1736341 1801326 1859219
50733A859219M8597L6948K3533R428m437j7326k8252l6131m0496m1571l9515l4345
$$ 1859219 1907816 1944764 1968297 1977725 1973288 1955962 1927710 1891579 1851083 1809512 1769997 1735652
50721A735652k6877j8932j1895n671K41N136P574P175M802J002m701j2608k1908
$$ 1735652 1708775 1689843 1677948 1672277 1672518 1677654 1685228 1692403 1697205 1698207 1693506 1680898 1658990
50708A658990l1406m0488m8797n5580o0114o2486o3356o2997o1202n8082n4328
$$ 1658990 1627584 1587096 1538299 1482719 1422605 1360119 1296763 1233766 1172564 1114482 1060154
50697A060154n0554m6718m2478l7820l3070k8451k3950j9589j5520j1697p695
$$ 1060154 1009600 962882 920404 882584 849514 821063 797113 777524 762004 750307 742612
50686G42612l131J759O255R899J2893J5607J7962J9514J9969J9457J8339J6956
$$ 742612 739481 741240 747495 757394 770287 785894 803856 823370 843339 862796 881135 898091
50674H98091J5468J3763J1610R002O320M036K410J504J177R26Q5j439k919l643
$$ 898091 913559 927322 938932 947934 954254 958290 960700 962204 963381 964307 964392 962953 960034 956391
50660I56391l652l214k032K51L024N231O964R517J3425J7365J9705K0403K0641
$$ 956391 952739 949525 947493 947744 950768 955999 962963 972480 985905 1003270 1022975 1043378 1064019
50647A064019K1066K1344K1145K0600J9675J7963J5418J2671J0215P825N097K239
$$ 1064019 1085085 1106429 1127574 1148174 1167849 1185812 1201230 1213901 1224116 1231941 1237038 1239277
50635A239277k13k189m129o260q275r737j0494j0644j0339r774r090q247p154
$$ 1239277 1239064 1236875 1232746 1226486 1218211 1208474 1197980 1187336 1176997 1167223 1158133 1149886 1142732
50622A142732o032n322n042m599l516k047o86O74K498M553N884N919N024L628
$$ 1142732 1136700 1131378 1126336 1121737 1118221 1116174 1115488 1116162 1118660 1123213 1129097 1135016 1140040 1143668
50608A143668J408k116o668j1518j6389k1491k6703l1345l4826l7032l8077l8063
$$ 1143668 1145076 1142960 1136292 1124774 1108385 1086894 1060191 1028846 994020 956988 918911 880848
50596H80848l7148l5534l3324l0678k7995k5541k2962j9622j5560j1646q722o856
$$ 880848 843700 808166 774842 744164 716169 690628 667666 648044 632484 620838 612116 605260
50584F05260n507m021j982N58K979M580N255N502N761O113O558P114P600P775
$$ 605260 599753 595732 593750 594308 597287 601867 607122 612624 618385 624498 631056 638170 645770 653545
50570F53545P829Q329R578J1401J3560J5865J7853J9056J9675K0366K1143K1252
$$ 653545 661374 669703 679281 690682 704242 720107 737960 757016 776691 797057 818200 839452
50558H39452K0395J9293J8538J7685J6203J4619J3993J4668J6239J8316K0524
$$ 839452 859847 879140 897678 915363 931566 946185 960178 974846 991085 1009401 1029925
50547A029925K2215K3099K3988K5991K9057L2127L4745L7668M1717M6759N2004
$$ 1029925 1052140 1075239 1099227 1125218 1154275 1186402 1221147 1258815 1300532 1347291 1399295
50536A399295N6681O0262O2508O3585O3745O2884O0705N7282N2792M6777L8431
$$ 1399295 1455976 1516238 1578746 1642331 1706076 1768960 1829665 1886947 1939739 1986516 2024947
50525B024947K7847J6363N318n053j5162k5106l4513m3004n0330n6195o0294o2488
$$ 2024947 2052794 2069157 2074475 2069422 2054260 2029154 1994641 1951637 1901307 1845112 1784818 1722330
50513A722330o2824o1524n8969n5415n0827m5273l9408l4093k9400k4529j8832
$$ 1722330 1659506 1597982 1539013 1483598 1432771 1387498 1348090 1313997 1284597 1260068 1241236
50502A241236j2483o015L28O447J2113J7096K1277K4330K5649K4836K1893J6800
$$ 1241236 1228753 1222738 1223066 1229513 1241626 1258722 1279999 1304329 1329978 1354814 1376707 1393507
50490A393507R344k66j1074k2000l2299m1217m7816n1735n3677n4486n4125n2195
$$ 1393507 1402851 1402585 1391511 1369511 1337212 1295995 1248179 1196444 1142767 1088281 1034156 981961
50478I81961m9128m6064m3577m1233l8434l5133l1640k8272k5206k2309j9087
$$ 981961 932833 886769 843192 801959 763525 728392 696752 668480 643274 620965 601878
50467F01878j5239j1188p664m849k447m49Q92J856L258N381P534R040J0051J1021
$$ 601878 586639 575451 567787 562938 560491 560042 560934 562790 566048 571429 578963 588003 598054 609075
50453F09075J1874J2160J1728J0821R747Q833Q409Q444Q447Q042P447P004O647
$$ 609075 620949 633109 644837 655658 665405 674238 682647 691091 699538 707580 715027 722031 728678
50440G28678O243O160O880Q215R468J0324J0947J1362J1416J1417J2098J3594
$$ 728678 734921 741081 747961 756176 765644 775968 786915 798277 809693 821110 833208 846802
50428H46802J5152J6256J7469J9589K2392K4912K6765K8463L0447L2396L3723
$$ 846802 861954 878210 895679 915268 937660 962572 989337 1017800 1048247 1080643 1114366
50417A114366L4252L4172L3587L2350L0198K6903K2486J7267J1537N159k129r977
$$ 1114366 1148618 1182790 1216377 1248727 1278925 1305828 1328314 1345581 1357118 1362277 1360148 1350171
50405A350171j7452k4059l0296l6787m3096m8010n0794n1697n1257m9719m7280
$$ 1350171 1332719 1308660 1278364 1241577 1198481 1150471 1099677 1047980 996723 947004 899724
50394H99724m4370m1245l7623l3185k8237k3558j9502j5659j1447o877k515J193
$$ 899724 855354 814109 776486 743301 715064 691506 672004 656345 644898 638021 635506 636699
50382F36699M380P556J0995J4408J7106J8480J8219J6317J2966Q551L549j678
$$ 636699 641079 648635 659630 674038 691144 709624 727843 744160 757126 765677 769226 767548
50370G67548o940j1990j6288j9215k0655k1252k1812k2448k2535k1662k0364j9530
$$ 767548 760608 748618 732330 713115 692460 671208 649396 626948 604413 582751 562387 542857
50358E42857j9257j8761j7528j5983j4738j3605j1923r603p297n557m334l356
$$ 542857 523600 504839 487311 471328 456590 442985 431062 421459 414162 408605 404271 400915
50346D00915k498j649o55M46J465K491L910N743P382Q282Q589Q788Q985R038R078
$$ 400915 398417 396768 396113 396559 398024 400515 404425 410168 417550 425832 434421 443209 452194 461232 470310
50331D70310R392R828R870R423R063R194R337Q596O750M524K777J731J124Q37
$$ 470310 479702 489530 499400 508823 517886 527080 536417 545013 551763 556287 559064 560795 561919 562756
50317E62756J008J538J909J713J192R15J053J226J024L68o42j855k952l554l654
$$ 562756 563764 565302 567211 568924 570116 571031 572084 573310 574334 574702 574060 572205 569253 565699 562045
50302E62045l669l878m039l827l430l300l432l209k137m78R34J492J277P95L73
$$ 562045 558376 554498 550459 546632 543202 539902 536470 533261 531124 530646 531580 533072 534349 535144 535517
50287E35517%l06l31k3K30O4l21m46k76j58k47n05j198k617m192m708l832k641
$$ 535517 535517 535211 534880 534857 535087 535151 534830 534384 534108 533950 533703 533198 532000 529383 525191 520483 516651 514010
50269E14010k219k394k537k855l920n361o016n358l943k484j179KJ032J955K747
$$ 514010 511791 509397 506860 504005 500085 494724 488708 483350 479407 476923 475744 475746 476778 478733 481480
50254D81480L011K402J277M26O9k06n82p01l96j7J66L03N30P06P87R12R20L82
$$ 481480 484491 486893 488170 488596 488665 488459 487877 487176 486780 486763 486929 487232 487762 488468 489255 490167 491087 491469
50236D91469o48j526j932k323l149m099m645m812m968n242n560n913o187o087
$$ 491469 490821 489295 487363 485040 481891 477792 473147 468335 463367 458125 452565 446652 440465 434378
50222D34378n590n120m963m829m408l832l221k238p21O31R29K55m51n55j85L44
$$ 434378 428788 423668 418705 413876 409468 405636 402415 400177 399456 400087 401016 401271 400820 400265 400080 400424
50206D00424R23J358J268N50k98n03L86K152M010N261N990O971Q681J0692J2331
$$ 400424 401347 402705 403973 404523 404225 403722 404108 406260 410270 415531 421521 428492 437173 447865 460196
50191D60196J3689J5556J8518K2355K6197K8992L0111K9867K9132K8210K6454
$$ 460196 473885 489441 507959 530314 556511 585503 615614 645481 674613 702823 729277
50180G29277K3313J9340J5595J2518J0020Q227P329O895O149M827K905k92n733
$$ 729277 752590 771930 787525 800043 810063 818290 825619 832514 838663 843490 846395 846103 840370
50167H40370j3253k1362k8637l4570l8872m0956m0627l8621l5915l2921k9666
$$ 840370 827117 805755 777118 742548 703676 662720 622093 583472 547557 514636 484970
50156D84970k6280k2869j9378j5952j3091j1090r705q605p713o959o149n367m935
$$ 484970 458690 435821 416443 400491 387400 376310 366605 358000 350287 343328 337179 331812 326877
50143C26877m736m159l063k138j818j517o29L27M03l40q97o63R4R44J770K516
$$ 326877 322141 317982 314919 312781 310963 309446 308817 309144 309547 309207 308310 307647 307741 308685 310455 312971
50127C12971L101L665M382N004N097M725M423M476M692M860M969M920M552L967
$$ 312971 316072 319737 324119 329123 334220 338945 343368 347844 352536 357396 362365 367285 371837 375804
50113C75804L463L110K827K781L231M011M690N254O050O994P559P655P838Q351
$$ 375804 379267 382377 385204 387985 391216 395227 399917 405171 411221 418215 425774 433429 441267 449618
50099D49618Q709Q646Q738R458J0184J0008R160Q761R317J0261J1077J1999J3287
$$ 449618 458327 466973 475711 485169 495353 505361 514521 523282 532599 542860 553937 565936 579223
50086E79223J4545J5256J5571J5991J6541J6900J7226J8284K0514K3424K6262
$$ 579223 593768 609024 624595 640586 657127 674027 691253 709537 730051 753475 779737
50075G79737K8948L1991L5597L9358M2926M6530N0505N4463N7230N7581N5011
$$ 779737 808685 840676 876273 915631 958557 1005087 1055592 1110055 1167285 1224866 1279877
50064A279877N0030M3998L8483L4493L2131L1066L1011L1482L1351K9173K4160
$$ 1279877 1329907 1373905 1412388 1446881 1479012 1510078 1541089 1572571 1603922 1633095 1657255
50053A657255J6467O644m758j6855k8339l8168m6151n2547n7315o0200o1355o1382
$$ 1657255 1673722 1680366 1675608 1658753 1630414 1592246 1546095 1493548 1436233 1376033 1314678 1253296
50041A253296o0676n9064n6281n2540m8466m4551m0824l7120l3561l0618k8512
$$ 1253296 1192620 1133556 1077275 1024735 976269 931718 890894 853774 820213 789595 761083
50030G61083k6705k4387k1595j9410j8715j9001j8857j7555j5694j4303j3802
$$ 761083 734378 709991 688396 668986 650271 631270 612413 594858 579164 564861 551059
50019E51059j3894j4079j3988j3488j2775j2224j2028j2016j1834j1088r479p155
$$ 551059 537165 523086 509098 495610 482835 470611 458583 446567 434733 423645 414166 407011
50007D07011m999m012m169m338l677k691k368k721k885k479k106k359l035l599
$$ 407011 402012 398000 393831 389493 385816 383125 380757 378036 375151 372672 370566 368207 365172 361573
49993C61573l869l944l877l785l915m259m404m135l832l931m183m031l477l068
$$ 361573 357704 353760 349883 346098 342183 337924 333520 329385 325553 321622 317439 313408 309931 306863
49979C06863l104l327l387l147k517j532o17k97m77m30K63J207J849K222K718
$$ 306863 303759 300432 297045 293898 291381 289849 289232 288935 288458 288028 288291 289498 291347 293569 296287
49964B96287L398M001M448M934N624O564P807R404J1252J3286J5725J8834K2478
$$ 296287 299685 303686 308134 313068 318692 325256 333063 342467 353719 367005 382730 401564 424042
49951D24042K6145K9432L2303L4879L7162L8899L9526L8333L5032L0255K5227
$$ 424042 450187 479619 511922 546801 583963 622862 662388 700721 735753 766008 791235
49940G91235K0887J7510J5152J4006J4012J4360J3738J1190O494j77q700j8748
$$ 791235 812122 829632 844784 858790 872802 887162 900900 912090 918584 918407 909707 890959
49928H90959k9200l8224m4329m7400m8414m8153m6495m3154l8656l4098l0113
$$ 890959 861759 823535 779206 731806 683392 635239 588744 545590 506934 472836 442723
49917D42723k6536k3089j9816j6863j4292j2324j1256j0818j0135q677o981n877
$$ 442723 416187 393098 373282 356419 342127 329803 318547 307729 297594 288917 281936 276059
49905B76059n396m983m486m222m109l602k654j963j883j826j320j001j699k972
$$ 276059 270663 265680 261194 256972 252863 249261 246607 244644 242761 240935 239615 238614 236915 233943
49891B33943l511k940k172j896j641q58oJ11m20q92j097j337j543j238m41J87
$$ 233943 230432 227492 225320 223424 221783 220925 220919 221030 220610 219718 218621 217284 215741 214503 214062 214249
49875B14249L74O08J212J612J189L47J03P40J488J543R75N01O44J331K100K520
$$ 214249 214623 215231 216443 218055 219244 219591 219694 220434 221922 223465 224440 224941 225585 226916 229016 231536
49859B31536K391J786R89L72J91L43M98N40O92R84Q89o5j445k249k148j767j631
$$ 231536 233927 235713 236702 237074 237265 237608 238106 238646 239338 240322 241211 241146 239701 237452 235304 233537 231906
49842B31906j523j253j263j888k548k394j467n18L1K72K13j70m32oQ97J459J392
$$ 231906 230383 229130 227867 225979 223431 221037 219570 219052 219083 219355 219568 219398 218966 218960 219857 221316 222708
49825B22708J201J205J132Q90R50J501J924J585P19%k95l21k21j95n46j175j475
$$ 222708 223909 225114 226246 227136 228086 229587 231511 233096 233815 233815 233520 233199 232978 232783 232237 231062 229587
49808B29587j199j044j670k445k092m88R79J056M7p54o22kK75k3l15PO88Q23k
$$ 229587 228388 227344 225674 223229 221137 220649 221628 222684 222731 221977 221355 221353 221628 221605 221290 221297 221985 222808 222806
49789B22806j109j584j414j241j267j121q16r81j807k384j721p8J284J582J213
$$ 222806 221697 220113 218699 217458 216191 215070 214254 213273 211466 209082 207361 207283 208567 210149 211362
49774B11362R06P35K96m22p79k55Q11J512J421J027J010J362J457R08Mp39j068
$$ 211362 212268 213003 213299 212877 212098 211843 212654 214166 215587 216614 217624 218986 220443 221351 221355 220616 219548
49757B19548r88n39J60Q05J152J316J613K052K196J658O68p5j41J60K32pm2N28
$$ 219548 218560 218021 218181 218986 220138 221454 223067 225119 227315 228973 229641 229566 229425 229585 229817 229810 229768 230296
49739B30296J433K084K248K125J924J638J369J435J966K493K271J115k59r16p41
$$ 230296 231729 233813 236061 238186 240110 241748 243117 244552 246518 249011 251282 252397 252138 251222 250481
49724B50481n44j033j880k102j285m8P25P43K65l67q00o89n6M72K53o20j442j716
$$ 250481 249937 248904 247024 244922 243637 243589 244314 245057 245322 244955 244155 243466 243410 243882 244135 243515 242073 240357
49706B40357j542j310j290j484j544r40L96J670J944J247N31M45O70O15K61j4
$$ 240357 238815 237505 236215 234731 233187 232247 232643 234313 236257 237504 238035 238480 239150 239765 240026 240012
49690B40012n8l3j03l03o17r46j151j238j291j188p09k8K85j5m92o80o96q48j037
$$ 240012 239954 239921 239818 239515 238898 237952 236801 235563 234272 233084 232375 232347 232632 232617 232125 231445 230749 229901 228864
49671B28864r83p89p38p21l73L04Q43Q52K87o45j500j679r60J52R86J463J886
$$ 228864 227881 227092 226354 225633 225260 225564 226407 227259 227546 226901 225401 223722 222762 222914 223900 225363 227249
49654B27249K206K176K009K107K169J441Q8o49o4J068J641J576J395J117M44l68
$$ 227249 229455 231631 233640 235747 237916 239357 239445 238796 238732 239800 241441 243017 244412 245529 245973 245605
49638B45605p25n69l91m51o88j127j762k159j912j385j267j511j450r85o98p43
$$ 245605 244880 244311 243920 243469 242781 241654 239892 237733 235821 234436 233169 231658 230208 229223 228525 227782
49622B27782n60L2M00K00JK39L75j60q53p99n9O19J041J636K373K578J958J114
$$ 227782 227222 227254 227654 227854 227855 228094 228469 228309 227456 226657 226598 227217 228258 229894 232267 234845 236803 237917
49604B37917Q18J236J967K454K384J993J911K368K787K620K287K595L486M097
$$ 237917 238735 239971 241938 244392 246776 248769 250680 253048 255835 258455 260742 263337 266823 270920
49590B70920L994L534L114K895L241M454N885O386N864N465N754N863N082M178
$$ 270920 274914 278448 281562 284457 287698 292152 298037 304423 310287 315752 321506 327369 332451 336629
49576C36629M212M879N152M945N024N554N916N706N045M003K720J976K574M065
$$ 336629 340841 345720 350872 355817 360841 366395 372311 378017 383062 387065 389785 391761 394335 398400
49562C98400N062M950M424M152L895L320K759K558K383J809J108Q76J170J564
$$ 398400 403462 408412 412836 416988 420883 424203 426962 429520 431903 433712 434820 435696 436866 438430
49548D38430J719J533R61J84k90j35K75K59l78j209j764j939j814j423p47J15
$$ 438430 440149 441682 442643 442827 442537 442402 442677 442936 442558 441349 439585 437646 435832 434409 433662 433777
49532D33777R09J417J692K061K703L446M076M667N260N476N023M455M751O090
$$ 433777 434686 436103 437795 439856 442559 446005 450081 454748 460008 465484 470507 474962 479713 485803
49518D85803P596Q501Q780Q571P721O397N383N048M601L154J115l45q53j081j514
$$ 485803 493399 501900 510680 519251 526972 533369 538752 543800 548401 551555 552670 552325 551472 550391 548877
49503E48877j956k352l180m640o038o536o179n815o111o956p698p749p013n898
$$ 548877 546921 544569 541389 536749 530711 524175 517996 512181 506070 499114 491416 483667 476654 470756
49489D70756m983m646m972n723o302n971m561k947k410l327m702n179m409l367
$$ 470756 465773 461127 456155 450432 444130 438159 433598 430651 428241 424914 420212 415033 410624 407257
49475D07257l339m643o292o945o135m496k875j611p58n27j061j941k474k408k009
$$ 407257 403918 399275 392983 386038 379903 375407 372532 370921 370163 369636 368575 366634 364160 361752 359743
49460C59743j470p35J03N81K48q51k176k974k729j599l54L81P71J313J961K185
$$ 359743 358273 357538 357641 358222 358470 357619 355443 352469 349740 348141 347787 348168 348939 350252 352213 354398
49444C54398J958K102L410N680P759Q312O659L293k88k738l942m667n203m990
$$ 354398 356356 358458 361868 367548 375307 383619 390278 393571 393283 390545 386603 381936 376733 371743
$$ [...]
##END NTUPLES=NMR SPECTRUM
##END=
