##TITLE=NES1002_872015069_9225048_ANn9Li6YHk
##JCAMPDX= 6.0         $$ Bruker NMR JCAMP-DX V2.0
##DATA TYPE= NMR SPECTRUM
##DATA CLASS= NTUPLES
##ORIGIN= BRUKER
##OWNER= Administrator
$$ 1.72 TOPSPIN		Version 2.1
$$ 2015-06-17 18:00:14.878 -0700  Administrator@X
$$ Compression mode = diff/dup
##.OBSERVE FREQUENCY= 400.02188249412
##.OBSERVE NUCLEUS= ^1H
##.ACQUISITION MODE= SIMULTANEOUS (DQD)
##.ACQUISITION SCHEME= undefined
##.AVERAGES= 8
##.DIGITISER RES= 22
##SPECTROMETER/DATA SYSTEM= spect
##.PULSE SEQUENCE= zg30
##.SOLVENT NAME= COFFEE_meoh
##.SHIFT REFERENCE= INTERNAL, COFFEE_meoh, 1, 14.98509
##AUDIT TRAIL= $$ (NUMBER, WHEN, WHO, WHERE, PROCESS, VERSION, WHAT)
$$ ##TITLE= Audit trail, TOPSPIN		Version 2.1
$$ ##JCAMPDX= 5.01
$$ ##ORIGIN= Bruker BioSpin GmbH
$$ ##OWNER= Administrator
$$ $$ E:\/data/COFFEE/nmr/NES1002_872015069_9225048_ANn9Li6YHk/10/pdata/1/auditp.txt
$$ ##AUDIT TRAIL=  $$ (NUMBER, WHEN, WHO, WHERE, PROCESS, VERSION, WHAT)
(   1,<2015-06-17 18:00:07.472 -0700>,<Administrator>,<X>,<go>,<TOPSPIN 2.1>,
      <created by zg
	started at 2015-06-17 17:59:01.644 -0700,
	POWCHK enabled, PULCHK disabled,
       configuration hash MD5:
       21 0F 79 D6 B3 7B B4 F6 88 20 88 DB 03 48 BD 9F
       data hash MD5: 64K
       29 ED 60 F8 D6 AE F6 D3 B6 13 7E E5 6E CB 29 0F>)
(   2,<2015-06-17 18:00:10.800 -0700>,<Administrator>,<X>,<proc1d>,<TOPSPIN 2.1>,
      <Start of raw data processing
       efp LB = 0 FT_mod = 6 PKNL = 1 PHC0 = 0 PHC1 = 0 SI = 32K 
       data hash MD5: 32K
       12 C4 68 C2 A9 0F 70 A0 4F D0 D5 48 CF 6D F1 B0>)
(   3,<2015-06-17 18:00:11.081 -0700>,<Administrator>,<X>,<proc1d>,<TOPSPIN 2.1>,
      <pk PHC0 = 93.23547 PHC1 = 0 
       data hash MD5: 32K
       EB 7D CC F9 ED 8B 75 01 65 CE 61 6D D6 A3 57 0F>)
(   4,<2015-06-17 18:00:11.191 -0700>,<Administrator>,<X>,<proc1d>,<TOPSPIN 2.1>,
      <abs ABSG = 1 
       data hash MD5: 32K
       0E ED 15 30 71 6A 9C EE 0C 55 18 61 CD C4 57 FF>)
(   5,<2015-06-17 18:00:11.284 -0700>,<Administrator>,<X>,<proc1d>,<TOPSPIN 2.1>,
      <abs ABSG = 2 
       data hash MD5: 32K
       AC 2C 21 4F 1E C1 7C 7C 54 2A 1F 65 90 1D 76 1C>)
(   6,<2015-06-17 18:00:11.331 -0700>,<Administrator>,<X>,<proc1d>,<TOPSPIN 2.1>,
      <abs ABSG = 3 
       data hash MD5: 32K
       E7 60 E2 B0 39 5E 55 03 71 8B BE F0 E9 97 54 D7>)
(   7,<2015-06-17 18:00:11.394 -0700>,<Administrator>,<X>,<proc1d>,<TOPSPIN 2.1>,
      <abs ABSG = 4 
       data hash MD5: 32K
       80 5C C2 35 FA FF 86 DD 20 F2 FE D9 C4 43 69 C6>)
(   8,<2015-06-17 18:00:11.456 -0700>,<Administrator>,<X>,<proc1d>,<TOPSPIN 2.1>,
      <abs ABSG = 5 
       data hash MD5: 32K
       12 82 BD 0E FE DC 9A 08 0B ED 30 CF 9A 95 E4 80>)
$$ ##END=
$$ 
$$ $$ hash MD5
$$ $$ 17 06 EA 02 F0 AE 7A BC 88 6C C2 BE F0 00 2E 1B
##$RELAX= 
##$RELAX= 
##$RELAX= 
##$RELAX= 
##$RELAX= 
##$RELAX= 
##$RELAX= 
$$ Bruker specific parameters
$$ --------------------------
##$DU= <E:\>
##$EXPNO= 10
##$NAME= <NES1002_872015069_9225048_ANn9Li6YHk>
$$ [...]
150 150 150 150 150 150 150 150
##$TP07= 0
##$TPNAME0= <>
##$TPNAME1= <>
##$TPNAME2= <>
##$TPNAME3= <>
##$TPNAME4= <>
##$TPNAME5= <>
##$TPNAME6= <>
##$TPNAME7= <>
##$TPOAL= (0..7)
0.5 0.5 0.5 0.5 0.5 0.5 0.5 0.5
##$TPOFFS= (0..7)
0 0 0 0 0 0 0 0
##$TUNHIN= 0
##$TUNHOUT= 0
##$TUNXOUT= 0
##$USERA1= <user>
##$USERA2= <user>
##$USERA3= <user>
##$USERA4= <user>
##$USERA5= <user>
##$V9= 5
##$VALIST= <valist>
##$VCLIST= <CCCCCCCCCCCCCCC>
##$VD= 0
##$VDLIST= <DDDDDDDDDDDDDDD>
##$VPLIST= <PPPPPPPPPPPPPPP>
##$VTLIST= <TTTTTTTTTTTTTTT>
##$WBST= 2048
##$WBSW= 25
##$XGAIN= (0..3)
0 0 0 0
##$XL= 0
##$YL= 0
##$YMAX_a= 623796
##$YMIN_a= -521489
##$ZGOPTNS= <>
##$ZL1= 120
##$ZL2= 120
##$ZL3= 120
##$ZL4= 120
##$ABSF1= 14.98509
##$ABSF2= -5.573092
##$ABSG= 5
##$ABSL= 3
##$ALPHA= 0
##$AQORDER= 0
##$ASSFAC= 0
##$ASSFACI= 0
##$ASSFACX= 0
##$ASSWID= 0
##$AUNMP= <proc_prof1d_extract_pilot.lims>
##$AXLEFT= 0
##$AXNAME= <>
##$AXNUC= <1H>
##$AXRIGHT= 0
##$AXTYPE= 0
##$AXUNIT= <>
##$AZFE= 0.1
##$AZFW= 0.1
##$BCFW= 0
##$BC_mod= 0
##$BYTORDP= 0
##$COROFFS= 0
##$CY= 15
##$DATMOD= 1
##$DC= 0
##$DFILT= <>
##$DTYPP= 0
##$F1P= 0
##$F2P= 0
##$FCOR= 0.5
##$FTSIZE= 32768
##$FT_mod= 6
##$GAMMA= 0
##$GB= 0
##$INTBC= 1
##$INTSCL= 1
##$ISEN= 128
##$LB= 0
##$LEV0= 0
##$LPBIN= 0
##$MAXI= 10000
##$MC2= 0
##$MEAN= 0
##$ME_mod= 0
##$MI= 0
##$NCOEF= 0
##$NC_proc= -8
##$NLEV= 6
##$NOISF1= 0
##$NOISF2= 0
##$NSP= 0
##$NTH_PI= 0
##$NZP= 0
##$OFFSET= 14.98509
##$PC= 1
##$PHC0= 93.23547
##$PHC1= 0
##$PH_mod= 1
##$PKNL= yes
##$PPARMOD= 0
##$PPDIAG= 0
##$PPIPTYP= 0
##$PPMPNUM= 2147483647
##$PPRESOL= 1
##$PSCAL= 4
##$PSIGN= 0
##$PYNMP= <proc.py>
##$REVERSE= no
##$SF= 400.02
##$SI= 32768
##$SIGF1= 0
##$SIGF2= 0
##$SINO= 400
##$SIOLD= 32768
##$SPECTYP= <>
##$SREGLST= <1H.CDCl3>
##$SSB= 0
##$STSI= 32768
##$STSR= 0
##$SW_p= 8223.68421052631
##$SYMM= 0
##$S_DEV= 0
##$TDeff= 65536
##$TDoff= 0
##$TI= <>
##$TILT= no
##$TM1= 0
##$TM2= 0
##$TOPLEV= 0
##$USERP1= <user>
##$USERP2= <user>
##$USERP3= <user>
##$USERP4= <user>
##$USERP5= <user>
##$WDW= 1
##$XDIM= 32768
##$YMAX_p= 436131450
##$YMIN_p= -744492
##$CURPLOT= <Network HP LaserJet P1505>
##$CURPRIN= <$Network HP LaserJet P1505>
##$DFORMAT= <normdp>
##$LAYOUT= <+/1D_H.xwp>
##$LFORMAT= <normlp>
##$PFORMAT= <normpl>
##$SURQMSG= 1
$$ End of Bruker specific parameters
$$ ---------------------------------
##NTUPLES= NMR SPECTRUM
##VAR_NAME=  FREQUENCY,     SPECTRUM/REAL,   SPECTRUM/IMAG
##SYMBOL=    X,             R,               I
##VAR_TYPE=  INDEPENDENT,   DEPENDENT,       DEPENDENT
##VAR_FORM=  AFFN,          ASDF,            ASDF
##VAR_DIM=   32768,         32768,           32768
##UNITS=     HZ,            ARBITRARY UNITS, ARBITRARY UNITS
##FACTOR=    0.250966925370066, 1,           1
##FIRST=     8223.43324360094, -197651,      -35112
##LAST=      0,             -300152,         -191461
##MIN=       0,             -744492,         0
##MAX=       8223.43324360094, 436131450,    0
$$ Real data points
##PAGE= N=1
##DATA TABLE= (X++(R..R)), XYDATA
$$ [...]
19472A60751G7389b53595Q4671J7666f612k73344q0898A27586a42740A10687b52110
19460d06042a04571j40703k043H7456R7364p9803b53466j0322e3144H3221c2613
19448f6393K7427a3577j33375j43437A724K38329c15449E8431K1469c18443a31192
19436D6766l753b68902f9210L1397l11034A13918O0341a57127k068e7740l35123
19425c92863G3708d7192A00022a52066B00373c03022a11680m672C57108a31359
19414h7417j02261A96308b20575B9900b3200j10852B71322b90304n272J23573
19404a72003a9308A7812J11941a93860f9552H1167a36444M6088m3517A5147a492
19392H3429l835A340J25577C3086i531l06924H9699c01714d268l87120G62h1734
$$ plain form
19472 160751 77389 -253595 -168924 -151258 -6612 -279956 -360854 127586 -142740 110687 -252110
19460 -406042 -104571 -245274 -247317 87456 184820 105017 -253466 -263788 -53144 83221 -32613
19448 -66393 -38966 -13577 -146952 -290389 1724 240053 -315449 58431 79900 -318443 -131192
19436 46766 43013 -268902 -69210 -37813 -348847 113918 174259 -157127 -159195 -57740 -392863
19425 -392863 73708 -47192 100022 -152066 200373 -303022 -111680 -116352 357108 -131359
19414 -87417 -189678 196308 -220575 29900 -23200 -134052 271322 -290304 -295576 -172003
19404 -172003 -19308 17812 129753 -193860 -69552 81167 -136444 -90356 -133873 15147 -1492
19392 83429 79594 1340 126917 33086 -9531 -316455 89699 -301714 -4268 -391388 762 -81734
19379a71120e027A03819b40481e1114j34594A27580m9228d0247I4367a13250d6027
19367b06719e0044E4530N6909a84685N8195A12245a45915B458d4315J6022B1329
19355D4539N1954b55417D0402L42553I0791O5655f7771A31817a29647j2822a7026
19343B8496h1166o9228A76838F8708J84951D020g5669C313f6766C5894a19786
19331a45311j26146E9995a18666l08838J59201a00256E2878b71412M9149r3499
19321c15762h0211j58527a04275A1201a76454P9115k2310d9756A48806A5167g0345
19309a34516p989n8522F7533b89061E89b30138k47156h3506A65567n5542J2782
19298A22807J05713J91186c4017l54375e8728k96822J58978P0576j69272Q9686
$$ plain form
19379 -171120 -5027 103819 -240481 -51114 -185708 127580 78352 -40247 94367 -113250 -46027
19367 -206719 -50044 54530 111439 -184685 -126490 112245 -145915 2458 -44315 -28293 21329
19355 44539 96493 -255417 40402 382955 90791 156446 -67771 131817 -129647 -142469 -17026
19343 28496 -81166 -150394 176838 68708 253659 4020 -75669 3313 -66766 35894 -119786
19331 -145311 -271457 59995 -118666 -427504 -268303 -100256 52878 -271412 -222263 -315762
19321 -315762 -80211 -238738 -104275 11201 -176454 -97339 -119649 -49756 148806 15167 -70345
19309 -134516 -142505 -201027 67533 -289061 589 -230138 -477294 -83506 165567 110025 122807
19298 122807 228520 419706 -34017 -388392 -58728 -355550 -196572 -125996 -295268 -205582
19288b05582i6305B58727a78904q9314O4920h3273m2555k2086J5850A72986a84503
19276A33093a05102A5420a70B8567a8037j81535p1439a28600M9776J2662a2893
19264b66176B6750e5651k23547i1333n5131j60166R4480j2496h8696E32859a81885
19252e84010i4204o4415M6553A02021a06764o8316J2889a1048m0853C2714c02453
19240E9688d385j11880A13588c9854A44524h1705H7380a07025j69462e1497k07040
19229b58537C1936j560b0038E4454d9499J7153f077k48395C1143A2307h9330A03198
19216A56150a42955J0608H8577a23699e7928j74188J5491R7688A30991M4648b32954
19204A10181c27957a41527A68132c6802A31152B8712g2659L3196j91841c3193
$$ plain form
19288 -205582 -96305 258727 -178904 -268218 -203298 -83273 -125828 -147914 -132064 172986 -184503
19276 133093 -105102 15420 -170 28567 -18037 -199572 -271011 -128600 -78824 -66162 -12893
19264 -266176 26750 -55651 -279198 -91333 -146464 -306630 -212150 -224646 -88696 532859 -181885
19252 -584010 -94204 -158619 -112066 102021 -106764 -175080 -162191 -11048 -51901 32714 -302453
19240 59688 -4385 -116265 113588 -39854 144524 -81705 87380 -107025 -276487 -51497 -258537
19229 -258537 31936 30376 -20038 54454 -49499 -32346 -6077 -254472 31143 12307 -89330 103198
19216 156150 -142955 -132347 88577 -123699 -57928 -232116 -216625 -118937 130991 175639 -232954
19204 110181 -327957 -141527 168132 -36802 131152 28712 -72659 -39463 -231304 -33193
19193A29167b44874f207n3749i290F2908a34543n7784A49704b4590D7113j7069
19182C0044J9046a13960A92504b76249J20254q2559B2066a77580k2605j51894
19172c52079J28019A06714b095A56052c07335O9300Q1231l25265i7557A68958
19161b08154e1359j55645R634Q0466n4318a9555A31258a80053m8463H9989i9255
19149i2120o7603j19880I866M8542a11662J6709j13571j48109h421B8806k861
19138B5945a06620j85548D685R1498O6949J00713q3587E3673C98J73366G6528
19126a03693B66830H6525c9041H5599A7560e1128j11893m9399B85364G6985D547
19114b54997L353a5423j15761F646K96340c19238A51867b44821Q7330F0037b38639
$$ plain form
19193 129167 -244874 -6207 -59956 -9290 62908 -134543 -192327 149704 -24590 47113 30044
19182 30044 49090 -113960 192504 -276249 -155995 -238554 22066 -177580 -200185 -352079
19172 -352079 -224060 106714 -2095 156052 -307335 -238035 -156804 -482069 -97557 168958
19161 -208154 -51359 -207004 -197370 -116904 -171222 -19555 131258 -180053 -228516 89989 -99255
19149 -92120 -159723 -279603 9866 58408 -111662 -94953 -208524 -356633 -8421 28806 25945
19138 25945 -106620 -292168 4685 96183 163132 263845 180258 53673 398 173764 76528
19126 -103693 266830 86525 -39041 85599 17560 -51128 -163021 -212420 285364 76985 4547
19114 -254997 -251644 -15423 -131184 6646 302986 -319238 151867 -244821 -157491 60037 -238639
19102c7793k38216j63017B4781b38129L2199B543a82544h7559E8245f886j13784
19091a20670j90593e9508F4054a18453N0567j56393J05734J3028n3783j14151
19081b73451B1062a26053b1781E44659d269j91751j24366B30873b63450a03137
19070E9497b02363j33671A24838b99951a35576e2449F6343c9047C98218d5895
19059b67365J17622C3784c54024B12965N4611b3259o5674P050A41449O0156b37446
19047A55488C6778a72379j23855O7436n2883L9082N6229J7715I4509a97408B26747
19035d39639A18525a34842b4445k02231g0248C23114D2365d9366A50109a52454
19024g3549A40989i7635G5508J35277b35415A02812a39521A6731J55134k0592
$$ plain form
19102 -37793 -276009 -439026 24781 -238129 -205930 2543 -182544 -87559 58245 -6886 -120670
19091 -120670 -311263 -59508 64054 -118453 -67886 -224279 -118545 -105517 -159300 -273451
19081 -273451 21062 -126053 -21781 544659 -4269 -196020 -320386 230873 -263450 -103137
19070 59497 -202363 -336034 124838 -299951 -135576 -52449 66343 -39047 398218 -45895
19059 -267365 -149743 33784 -354024 212965 267576 -23259 -88933 -81883 141449 201605 -237446
19047 155488 36778 -172379 -296234 -228798 -281681 -242599 -186370 -168655 94509 -197408 226747
19035 -439639 118525 -134842 -24445 -226676 -70248 323114 42365 -49366 150109 -152454
19024 -73549 140989 -97635 75508 210785 -235415 102812 -139521 16731 171865 151273
19014A51273g8088j37297G8358b74374C49660A32565e6919A67746C2859i3657
19003a28870l71195E134N7241a87775E540a01814G9588h5396G2629a15869K0232
18992i5637C1396b1974p6695B3715b3158B0751d30428b11073A12751K1799b89186
18980A05363J1072a30362j74372B08145c3206J5450B0661K08235i7649B6366N3455
18969G9821b7359J1473A61440K13821a56311C5895a11585M9659q3218O5331m19362
18958d99175A49684d7105H1211B1723c02553Q6235B06596J31443a70933j37729
18948c08662A25426o859a64704d2584C14825a05307B65219i2158j00160o002c8538
18936A08407a8440k66561B27691H0557C7934f3202D4684J00018c755l19182f2326
$$ plain form
19014 151273 -78088 -215385 78358 -274374 349660 132565 -56919 167746 32859 -93657
19003 -128870 -500065 5134 62375 -187775 5540 -101814 79588 -85396 72629 -115869 -95637
18992 -95637 31396 -21974 -98669 23715 -23158 20751 -430428 -211073 112751 134550 -289186
18980 105363 116435 -130362 -304734 208145 -33206 -17756 20661 228896 -97649 26366 79821
18969 79821 -27359 -15886 161440 375261 -156311 35895 -111585 -61926 -145144 -79813 -499175
18958 -499175 149684 -47105 81211 21723 -302553 -216318 206596 338039 -170933 -308662
18948 -308662 125426 118567 -164704 -42584 314825 -105307 265219 -92158 -192318 -198320 -38538
18936 108407 -18440 -285001 227691 80557 37934 -63202 44684 144702 -3755 -322937 -62326
18924B05738i026A45511h16G0878f1063j46985P3855L0543m0537k20514D2080
18912g5621D147L17968A49728K8801i720k03743A59394L786K33551A11193D145
18900c0111j28595g7301n5058A28120a62101K0534A25138a46681L3888k2334l63267
18889d98394H5409e0850a9054L888p1921D2261d00500H8875c09364J14080D263
18877c64574b0208p5595k60307E6221a08881A50701c35228a02182q92j52288k2865
18866b78227A61762f7169j35952f4006C07168I1707b4975m9045F4760a61671j33444
18855b95115a43075C13050q1603K1825a56902A34863a53310a1150A6575N096g849
18843a08223N0208B37065a97507M1936G5609c3454c216H8228J15339g4614j27709
$$ plain form
18924 205738 -9026 145511 -816 70878 -61063 -208048 -134193 -103650 -144187 -364701 42080
18912 -75621 4147 322115 149728 178529 -9720 -213463 159394 163180 396731 111193 4145
18900 -30111 -158706 -77301 -132359 128120 -162101 -141567 125138 -146681 -112793 -135127 -498394
18889 -498394 85409 -50850 -19054 -15166 -87087 42261 -400500 88875 -309364 -195284 4263
18877 -364574 -20208 -95803 -356110 56221 -108881 150701 -335228 -102182 -103074 -255362 -278227
18866 -278227 161762 -67169 -203121 -64006 307168 91707 -24975 -74020 64760 -161671 -295115
18855 -295115 -143075 313050 231447 253272 -156902 134863 -153310 -11150 16575 21671 -7849
18843 -108223 -58015 237065 -197507 -155571 75609 -33454 -3216 88228 203567 -74614 -202323
18832b02323A8166K52540C1742O8286J18921a08650j5169d1597I1916f8453a8951
18820a06110N0603B29961b41098B48853b168A48139b74748D3943c9332A905a04692
18808F1153G028O7076b42669C27625b35913e4930A65167b07031n73G8867a65231
18796g2594k08534k49379a17548A56295a91051B8904O0793f2348A40731j1629
18786A29102R0178F7332b13006g6297k38612H1914K8632b09410q1843a01441A59020
18774a69411l1112l0981R3017F1838b89997H231f0423A40748f0918k7205L0009
18763e8114B65957a95818l0775B82803f3427A90240c74126a66157O0206k49978
18753c55929a22967D2037b9420m0434j96252o7125H0399k2266g2856G5283N7366
$$ plain form
18832 -202323 18166 270706 31742 100028 218949 -108650 -123819 -41597 91916 -68453 -18951
18820 -106110 -55507 229961 -241098 248853 -2168 148139 -274748 43943 -39332 1905 -104692
18808 61153 7028 74104 -242669 327625 -235913 -54930 165167 -207031 -207604 78867 -165231
18796 -72594 -281128 -530507 -117548 156295 -191051 28904 89697 -62348 140731 129102
18786 129102 219280 67332 -213006 -76297 -314909 81914 110546 -209410 -291253 -101441 159020
18774 -169411 -200523 -231504 -138487 61838 -289997 8231 -60423 140748 -60918 -88123 -58114
18763 -58114 265957 -195818 -226593 282803 -63427 190240 -374126 -166157 -105951 -355929
18753 -355929 -122967 42037 -29420 -69854 -266106 -333231 80399 58133 -72856 75283 132649
18742A32649m5604P5980c10189J39115C2678J93094f8395B24795g4099j13120
18732a87219m5702K5572A43769c54643C92906A24303M3332c07726J45676K8243
18722a33807c3043C2350a55301j15228a6110k32786L8640B8624c14850e8091p4519
18711a32610f976j59785Q603j9649h052l3736m5856l4665q444A7153J01087b23564
18698D0487p47J56425i8848I7383M7698b0556j09818N9539o3577j15464f6987
18686a19297d8422G817c61987B3214G993e4000j03777K4302A5100a00076b8975
18674b7616j36754L9541B27269a21370j56120B79045e900G9764d7747H2544k803
18663G9741L7672g4714a8631j38435o5758A02193L5514h6197E6153J79551f5652
$$ plain form
18742 132649 87045 163025 -310189 -171074 32678 225772 -68395 224795 -74099 -187219
18732 -187219 -232921 -207349 143769 -354643 392906 124303 167635 -307726 -162050 -133807
18722 -133807 -33043 32350 -155301 -270529 -16110 -248896 -210256 28624 -314850 -58091 -132610
18711 -132610 -6976 -166761 -158158 -177807 -8052 -41788 -87644 -122309 -130753 17153 118240 -223564
18698 40487 39740 196165 -98848 97383 145081 -20556 -130374 -70835 -134412 -249876 -66987
18686 -119297 -48422 7817 -361987 23214 7993 -54000 -157777 -133475 15100 -100076 -28975
18674 -27616 -164370 -124829 227269 -121370 -277490 279045 -5900 79764 -47747 82544 79741
18663 79741 117413 -74714 -18631 -157066 -222824 102193 137707 -86197 56153 235704 -65652
18651D3765d8669k8561k29223a1072k36642C51214A70737E5964k7575a5566A51742
18639G5457a96509R4190B5988h6956A62139a49949F2836a19972m4951A75725b50598
18627a19805q4745A81040B2792J36080b42075d6834j01552f3622l44238i4302
18616G8649J12040P5031B201b96391a3048A01389K35766a10626A33411k8625d13505
18604I9965i8227A29880k3998H705c19805H7277c3268A56800b82418G8648l5991
18593D2657i103A57602e6429a3721p5708J7330q196B7486b24362j3398j60357
18582c98117a06433h051j17875a0203l8501A87075p6255B8797a27184M1883L2363
18571e2938n8290k15868B96020b02833A10596b274C9583j0045O5360J12415a07994
$$ plain form
18651 43765 -48669 -77230 -306453 -11072 -247714 351214 170737 55964 28389 -15566 151742
18639 75457 -196509 -102319 25988 -86956 162139 -149949 62836 -119972 -164923 175725 -250598
18627 -119805 -204550 181040 22792 158872 -242075 -46834 -148386 -63622 -407860 -94302
18616 78649 190689 265720 2201 -296391 -13048 101389 337155 -110626 133411 104786 -413505
18604 99965 -98227 129880 105882 8705 -319805 87277 -33268 156800 -282418 78648 42657
18593 42657 -9103 157602 -56429 -13721 -89429 -72099 -80295 27486 -224362 -237760 -398117
18582 -398117 -106433 -8051 -125926 -10203 -48704 187075 110820 28797 -127184 -85301 -52938
18571 -52938 -111228 -327096 296020 -202833 110596 -2274 39583 29538 94898 207313 -107994
18559b8181m36989c6031A44792D9510h0125p5782M5035c6339A3599a24955j31132
18548b56087Q7325G2189a56433B9667I028J11821e8790k18798a34193A06518d8917
18536a37730D0997a53553A99243d9118D8920e4498A46987c20576J23953B69662
18525e1858p9611A25426b94491J19423p6406n5397A30697b183q8929L4372A05594
18513A38345E6323a5761k83264f4904p0796i004C26083c34967D73770b13202m3830
18502b57032h1233B16642n8089j4467b2402m06138a71960f5600D0771j317i3967
18490b23841c9426a1872l9238B45798G7244d2372j29205O7096a1616j48348A07296
18478i0067j08418B59251I8746L3099i4434i178k33566F4993P3086d320G1303
$$ plain form
18559 -28181 -465170 -36031 144792 49510 -80125 -155907 -110872 -36339 13599 -124955 -256087
18548 -256087 -168762 72189 -156433 29667 9028 120849 -58790 -277588 -134193 106518 -48917
18536 -137730 40997 -153553 199243 -49118 48920 -54498 146987 -320576 -196623 269662
18525 -51858 -131469 125426 -294491 -175068 -251474 -306871 130697 -2183 -91112 -56740 105594
18513 138345 56323 -15761 -299025 -64904 -135700 -9004 326083 -334967 473770 -213202 -257032
18502 -257032 -81233 216642 158553 144086 -22402 -428540 -171960 -65600 40771 39454 -93967
18490 -223841 -39426 -11872 -51110 245798 77244 -42372 -171577 -104481 -11616 -159964 107296
18478 -90067 -198485 259251 98746 131845 -94434 -9178 -242744 64993 138079 -4320 71303
18466c93009A1060J51038D3513d3704k07756H1273a03083j13401G4164D836Q5383
18455I0219j514b5992B8845q074b81857B16023b29655B75431a32393n967d3191
18443C21984b17326a9148q4306L5871A64388m5396e3493k7613J6022m0921j85189
18432b91194c9048j31315F1486g7556A44410b53458N7315l0642l1717B71836a41052
18420i6269A26218a54655m4288g3790j47833B13307I699a33053n4867F7227Q8999
18409A56226F0011a49318A74575a28600d00k97164Q8571A73014L0774F9708b26321
18397b3596j205C7281b99400P0274C4785f5052b7975f172j69480O9077j23212
18386b29787H9300a90956O627P7195L7240p0547C92119D9762f0162j33305I7992
$$ plain form
18466 -393009 11060 162098 43513 -43704 -251460 81273 -103083 -216484 74164 4836 90219
18455 90219 88705 -25992 28845 20771 -281857 216023 -229655 275431 -132393 -138360 -43191
18443 321984 -217326 -19148 -103454 -67583 164388 118992 -53493 -81106 -65084 -106005 -291194
18432 -291194 -39048 -170363 61486 -77556 144410 -253458 -196143 -226785 -258502 271836 -141052
18420 -96269 126218 -154655 -198943 -73790 -221623 213307 9699 -133053 -187920 67227 156226
18409 156226 60011 -149318 174575 -128600 -400 -297564 -208993 173014 203788 69708 -226321
18397 -23596 -24801 37281 -299400 -229126 34785 -65052 -27975 -6172 -175652 -106575 -229787
18386 -229787 89300 -190956 -184329 -107134 -69894 -140441 392119 49762 -60162 -193467 97992
18374b69750A10824a77285I1774N27930i5661A1501K77396a71753B31103E1369
18363c9231A07915e0874E9631r501d6697m7981p7332j19623g2256a1023k30787
18352b41810O6156C6614e0203k61048A14026K14327A3950e385E4961a6522A4461
18340a54880f1530o5619c3404j14467e8357A14900l5006C2103J0038i7469r6328
18329a93797A1306N5145K78002A07653a59757D7317a05894B24013g1888E21453
18318b6110J0849B31624I7242o297a34210O131d0680j82264a9434A0440J48345
18307A58785G1524a30757q6370F4036J22599a88701L8445g4079E1174j9173J79476
18296B11477b45320J03619n2121j5118A42853c94461a05841A2782a6156c967D4694
$$ plain form
18374 -269750 110824 -177285 91774 619704 -95661 11501 288897 -171753 231103 51369
18363 -39231 107915 -50874 59631 50130 -46697 -94678 -172010 -291633 -72256 -11023 -241810
18352 -241810 -175654 36614 -50203 -311251 114026 328353 13950 -5385 54961 -16522 14461
18340 -154880 -61530 -127149 -33404 -147871 -58357 114900 79894 32103 42141 -97469 -193797
18329 -193797 11306 66451 344453 107653 -159757 47317 -105894 224013 -71888 521453
18318 -26110 -15261 231624 97242 90945 -134210 -128079 -40680 -222944 -19434 10440 158785
18307 158785 71524 -130757 -217127 64036 186635 -188701 -150256 -74079 51174 32001 211477
18296 211477 -245320 -141701 -193822 -208940 142853 -394461 -105841 12782 -16156 -3967 44694
18284a06825l2936j26810I6424c1789J5339C25723a42038n3033e5376n0739I3932
18272a54528e0040j22963L2853B88072H3379E475M8179g8671j44179B01610D7562
18260B10843g4689k14058b8927A22978b97651e2482G8470a06939e2546g4E022
18248C532J15997d89140A03507c0139j01452h777A15395b56549I327i1215D2975
18236a48618B9335O2193f2324A4024m928g0541p0606j3780e7580k22675A53786
18224A67473J01305d3960o8708A84619G5082b03262R0084r4536B887J47459a1928
18212B01427a43039A7527a14666j58543B14456e7137n2455D8852L6412b72659
18201A24014d59838b12843J7213A31815c4720B45248a15322B2878J44113J82670
$$ plain form
18284 -106825 -139761 -266571 96424 -31789 -16450 325723 -142038 -195071 -55376 -106115 93932
18272 -154528 -50040 -173003 -140150 288072 83379 5475 53654 -78671 -222850 201610 47562
18260 210843 -74689 -288747 -28927 122978 -297651 -52482 78470 -106939 -52546 -74 5022
18248 3532 119529 -489140 103507 -30139 -131591 -8777 115395 -256549 9327 -91215 42975
18236 -148618 29335 91528 -62324 14024 9096 -70541 -141147 -154927 -57580 -280255 153786
18224 167473 268778 -43960 -112668 184619 75082 -203262 -113178 -207714 2887 150346 -11928
18212 201427 -143039 17527 -114666 -273209 214456 -57137 -109592 48852 85264 -272659
18201 124014 -459838 -212843 -195630 131815 -34720 245248 -115322 22878 166991 349661
18191C49661B3096a23619B90816D5045N6664a37228r3429d6829j13820j1929f3462
18179a56041B1387a57194C3655Q1650D8831e4419A86059a00150B94954e6431j21355
18168a77786P4369k57888a12338K0251i808k49670P2436B3869O588J22028b03366
18156D07968b6057A11213F694e9067A37513a9709E0537a30811j6165l76878C9191
18144i2754F2387a64714A62230a85471M7131B418Q174b78095J18281e2911K0775
18133c2136A24146J09135H5638o960e9152E8132B306b58699B88299o3689a35117
18121a12606B2643a27997m9306A5519e7410H2493l6894K93871c67140J82660D0991
18109A00002c9470j49565r5388o1687a00419j36554h074r4843B95893A28249m6329
$$ plain form
18191 349661 23096 -123619 290816 45045 101709 -137228 -230657 -46829 -160649 -172578 -63462
18179 -156041 21387 -157194 33655 115305 48831 -54419 186059 -100150 294954 -56431 -177786
18168 -177786 -103417 -361305 -112338 -92087 -9808 -259478 -187042 23869 30457 152485 -203366
18156 407968 -26057 111213 6694 -59067 137513 -19709 50537 -130811 -146976 -523854 39191
18144 -92754 62387 -164714 162230 -185471 -138340 2418 10592 -278095 -159814 -52911 -32136
18133 -32136 124146 233281 85638 78678 -59152 58132 2306 -258699 288299 224610 -135117
18121 -112606 22643 -127997 -177303 15519 -57410 82493 45599 339470 -367140 -184480 40991
18109 100002 -39470 -189035 -284423 -346110 -100419 -236973 -8074 -102917 295893 128249 81920
18098H1920J88330j4319i0884a7853B05426C2629J04186c1409F6072b85076A51857
18086d2271C3125J67984d0272k68761J09930j69400b1888A25052o0836b43910
18075A28480l2888b44182C5742c40766a63602k5166J1346k20267J06310r1805
18065c83184A26211D413Q6359b32907B02896H4147b19610h9223k06534K0460F3788
18053A56855a55548k8919C8268f0026b7842A58054a08091j74245a14390E0443
18042A97206G9175a36782k44250J73703K8032E240P8023K49149M4965A75405P7623
18031B53028p2455p7482A5467J89256i3235K1587G6201b39332P5785K7007A4379
18019a72943Q2747j02408F228J41088o7216a33908g239k42814B42969d7505A60324
$$ plain form
18098 81920 270250 255931 -90884 -17853 205426 32629 136815 -31409 66072 -285076 151857
18086 -42271 33125 201109 -40272 -309033 -199103 -368503 -21888 125052 64216 -243910
18075 128480 95592 -244182 35742 -340766 -163602 -188768 -177422 -397689 -291379 -383184
18065 -383184 126211 4413 90772 -232907 202896 84147 -219610 -89223 -295757 -275297 63788
18053 156855 -155548 -184467 38268 -60026 -27842 158054 -108091 -282336 -114390 50443
18042 197206 79175 -136782 -381032 -207329 -179297 5240 83263 332412 377377 175405 253028
18031 253028 180573 103091 15467 204723 -93235 -71648 76201 -239332 -163547 -136540 14379
18019 -172943 -90196 -192604 6228 147316 80100 -133908 -7239 -250053 242969 -47505 160324
18007c30225A10707D1685M9571a35496G1178c71946B64007n7571J83433e9388
17996c8415j39965G0687d41175B26376n2313P2471a94456M7428D8500B1095M5131
17985F6226J43618H6172C8315L1985K53372a73805l6547q8673e7723J8628j57461
17974a96556n8613R6604B68643F4971J37610d6234J246I1389i5613K8302j27728
17963a95039d6590B69013O1377I607K2447O8641a01379k4987A91423p8690a51849
17951e6528j08090M9992j08774a3126B18141j1031I2072J02475k9056g2588r222
17940h1810G9717L665R2641a61397A08507a20411j14731h2013I7381Q1834a9936
17928B19297K15661I8829h2360F4646a24144J1280G0675a81283I9891J8089g7631
$$ plain form
18007 -330225 110707 41685 91256 -135496 71178 -371946 264007 206436 389869 -59388
17996 -38415 -178380 70687 -441175 226376 174063 246534 -194456 -147028 48500 21095 66226
17985 66226 209844 86172 38315 70300 323672 -173805 -210352 -299025 -57723 -39095 -196556
17974 -196556 -255169 -158565 268643 64971 202581 -46234 -44988 91389 -95613 -67311 -195039
17963 -195039 -46590 269013 330390 9607 32054 100695 -101379 -126366 191423 112733 -151849
17951 -56528 -164618 -114626 -223400 -13126 218141 207110 92072 194547 165491 -72588 -81810
17940 -81810 79717 83382 176023 -161397 108507 -120411 -235142 -82013 97381 179215 -19936
17928 219297 434958 98829 -82360 64646 -124144 -112864 70675 -181283 99891 117980 -77631
17916A08245c22173J26101C6863a52198A77489J19155b1574G2947Q5525k6154
17906A32318m9888A6021a27912r9502B2341L76102f1497b7681A29635J24066K0204
17895B73905b04050R7704B8186K02162K29672I6705c07079h7326A41286M0764
17885A82050k7807a31606B14790b52967E7628J43903d6384n7608a6987c666A41231
17873G1952b74533b7522j3108l027B64569M1460j33320B7694N3857b05617h080
17861C39349A28498C1562a69995C60023b4989Q471j33593A77036i4928i204k69401
17850b78605h8163E2143J90422K687D7315J45344a98373b2925j85573C1553f8147
17838G6408K89091D85R2968J9670G835M0425g0323C52692i6766B63048A26184
$$ plain form
17916 108245 -322173 -196072 36863 -152198 177489 296644 -21574 72947 158472 132318
17906 132318 82430 16021 -127912 -227414 22341 398443 -61497 -27681 129635 253701 273905
17895 273905 -204050 -106346 28186 230348 460020 96705 -307079 -87326 141286 182050
17885 182050 154243 -131606 214790 -252967 57628 201531 -46384 -103992 -16987 -3666 141231
17873 71952 -274533 -27522 -40630 -43657 264569 306029 172709 27694 81551 -205617 -8080
17861 339349 128498 31562 -169995 360023 -24989 -16518 -150111 177036 -94928 -9204 -278605
17850 -278605 -88163 52143 242565 245252 47315 192659 -198373 -22925 -208498 31553 -68147
17838 76408 365499 485 93453 113123 7835 48260 -70323 352692 -96766 263048 126184
17826A59712b07587l3731o2933J38730l04931d7590F7378R0908o2750J76151k6159
17815B45528f3836q58B32003o1511a30414b6572D48413g634B8541Q5998M8183
17804A62722j0286f2475B48177B5613K1910J68553a91947b2300l7480k43266H9753
17792D5733c33125a8108A10504m9802k6544I452K45908b04262g441j44547r60
17781a52948A1808J78399a60674O9700F7655h6746A07372a94031A89622I1284
17770i8225L3935D819a14473I3319a66004a5112C54830j20583J01767A60313K87635
17759D47948h1284b4777B25012h0245A58657c2660B73971r2558p9602P0098M596
17748A76505E9480a31957b4089A71705J99894A59814A4650a90452M6805A9479
$$ plain form
17826 159712 -207587 -241318 -304251 -165521 -470452 -47590 67378 158286 95536 271687 245528
17815 245528 -63836 -64694 232003 170492 -130414 -26572 448413 -7634 28541 114539 162722
17804 162722 152436 -62475 248177 25613 47523 216076 -191947 -22300 -59780 -303046 89753
17792 45733 -333125 -18108 110504 60702 34158 9452 255360 -204262 -7441 -151988 -152948
17781 -152948 11808 190207 -160674 -90974 67655 -86746 107372 -194031 189622 91284
17770 -98225 -64290 4819 -114473 93319 -166004 -15112 354830 234247 336014 160313 447948
17759 447948 -81284 -24777 225012 -80245 158657 -32660 273971 181413 101811 171909 176505
17748 176505 59480 -131957 -24089 171705 371599 159814 14650 -190452 -143647 19479
17737c6894k09675A04664e0679C0636J89911J16604a45444O2948I0359P947A1052
17725F9109c2737H5177J89672J28854c23273B91532j38716n1582c16917A87218
17714d0208H171i1934A04674K86104a44028D47632I6364a21502A18146B4576a78842
17702D2922a20105c486A38566L9212n9322C4913a516k96732h5597B47947H9318
17690F2933R0823J62422j15373k3842e7623J9659B76362a47796C18608j39848
17680A78760p7368R9846a10894A27277i108A23899i7016a7180q664k40149P4645
17669a91348p881B41062C0491L247a99619H5047J80656L6156r1321E9128a15546
17657I6194d990l59887J47252H4180B3507J66646c499k92126A46918n2687J48423
$$ plain form
17737 -36894 -246569 104664 -50679 30636 220547 337151 -145444 -82496 90359 98306 11052
17725 69109 -32737 85177 274849 403703 -323273 291532 152816 101234 -316917 187218
17714 -40208 8171 -91934 104674 390778 -144028 447632 96364 -121502 118146 24576 -178842
17702 42922 -120105 -3486 138566 177778 118456 34913 -1516 -298248 -85597 247947 89318
17690 62933 153756 316178 200805 176963 -57623 -37964 276362 -147796 318608 178760
17680 178760 101392 201238 -110894 127277 -9108 123899 -97016 -17180 -25844 -265993 -191348
17669 -191348 -199229 241062 30491 33738 -199619 85047 265703 301859 210538 59128 -115546
17657 96194 -4990 -364877 -217625 84180 23507 190153 -3499 -295625 146918 94231 242654
17646B42654a47748C02728B7028a21435B72505m2878g9831C24631g6912D8382
17635f4608A37970e660A96809f4375j04589A45746j8767O5603I4949k591i1167
17623A84924a41185j95344G0645N3812e1168i05j30595d413F3581H01a98375D74764
17610A48911G2347b48907e0377E2353N8850Q2221m5727J22487I9023a23988G2810
17598D2771o505M672L98621j52966J27361A4891P3371K4022J49817J24162f5674
17586i4960A20219f1031A79218G4632B2826a86728B56377O9249j52087N0206d1056
17574B90528j21183Q109D0041a07545A59669J34726A7863h3726E9040J62645k9537
17563A92148M5225K1625m8203q8466J37359p4028Q2947l1885H1458J18192F2223
$$ plain form
17646 242654 -147748 302728 27028 -121435 272505 229627 -79831 324631 -76912 48382
17635 -64608 137970 -5660 196809 -64375 -168964 145746 126979 192582 94949 92358 -91167
17623 184924 -141185 -336529 70645 124457 -51168 -905 -131500 -4413 63581 801 -198375 474764
17610 148911 72347 -248907 -50377 52353 111203 193424 147697 270184 99023 -123988 72810
17598 42771 36266 40938 439559 286593 413954 14891 88262 112284 262101 386263 -65674
17586 -94960 120219 -61031 179218 74632 22826 -186728 256377 325626 173539 223745 -41056
17574 290528 169345 177454 40041 -107545 159669 294395 17863 -83726 59040 221685 192148
17563 192148 237373 258998 210795 122329 259688 185660 268607 236722 81458 199650 62223
17551C8983K61082b6185m6357B49836k9517B3158M5376N1043M9297k7395h0637
17539A52417J43316g6968C58662A02274c012B22070K88592A2258M00724J2866
17529D25848B1907P7093J27349L77824E2171L80203J3502j77694L10297k51468
17519C27011N9478j09977L14557A52142K71473j70923L39493q6098K0872k04590
17509C22369J90854B09252L55625j67501J24746A52383K17891J38447J15664k74584
17499C49801o9611j02259J51101A30690K1611L1015R6961a4225D41643A71358
17488G9167J10234D9038a05839A48432c4514B50181G7737J4229J69550J94027
17478D55543a53921e6924A246K76384j20500k7445a11538I5092Q8227A3802P8266
$$ plain form
17551 38983 300065 -26185 -72542 249836 220319 23158 68534 119577 168874 141479 -80637
17539 152417 295733 -76968 358662 102274 -3012 222070 510662 12258 412982 425848
17529 425848 21907 99000 226349 604173 52171 432374 445876 268182 578479 327011
17519 327011 386489 276512 591069 152142 423615 252692 592185 506087 526959 322369
17509 322369 513223 209252 564877 397376 522122 152383 370274 508721 624385 349801
17499 349801 280190 177931 329032 130690 152301 183316 280277 -14225 441643 171358
17488 79167 189401 49038 -105839 148432 -34514 250181 77737 91966 261516 455543
17478 455543 -153921 -56924 1246 277630 157130 129685 -111538 95092 183319 13802 92068
17467I2068J12101J55829j41681R4455n1021r5938E810f454H8754F024O1688L76615
17455D44327q6965H8826K93894k5645j8042o7316F9046i9221C74347n6381o6818
17444B51148j07695O1536R1797B9098L41050j02482b16643D14289A75274i0272
17433B4609J82487o040b7825C15408J65731A67024M01339q0655A19541K14134
17423C33675N08555B15835N02150k98371A05748K22636A48630K29797o4564Q4280
17413C98143J17225k04975A3691K58496r5610K58621A70313R5546k0798j03514
17403A41547M953K63622A38181J1425l0574L41224H2752K18148F2419F381J38478
17392A44859e8127A61564b82013A14249Q5216J87461N7012I370M00323D5809K17658
$$ plain form
17467 92068 204169 359998 218317 312772 261751 165813 5810 -6454 88754 6024 67712 444327
17455 444327 357362 88826 382720 357075 339033 271717 69046 -99221 374347 317966 251148
17444 251148 143453 204989 296786 29098 370148 267666 -216643 414289 175274 -90272
17433 24609 207096 201056 -27825 315408 481139 167024 568363 487708 119541 333675
17423 333675 842230 215835 717985 419614 105748 328384 148630 378427 313863 398143
17413 398143 515368 310393 13691 272187 176577 435198 170313 265859 245061 141547
17403 141547 146500 410122 138181 149606 119032 460256 82752 300900 62419 6381 144859
17392 144859 -58127 161564 -282013 114249 199465 386926 443938 9370 409693 45809 263467
17381B63467M073a40502A53601J21299K46273A75686i9146C26502A52366J34350
17371B86716j37607o4920Q7752J982L13171A47895h6772B20776R4790a00591C11515
17359B38748J58758j75052R230A05385J90029A9461J31897l8929J78700a09666
17348a41037D40212A78138M3821q4617M7551K68396A41984J66961j12292J03170
17338B99823k1106m0236N8957I636K14668J21382A1855L40234A66509k3262Q8397
17327B31644j04334J0614m6127r448J22733J08463D2098M272K90780a10094A12801
17315C94992j74085p2393F8502b2583m9793A13135K38807o851j55171J77199J04321
17304D71440a62765C66882j42702h7140A73535J57441H8891J28861R0557H7135
$$ plain form
17381 263467 267540 -140502 153601 274900 521173 175686 -99146 326502 152366 286716
17371 286716 149109 84189 171941 173923 487094 147895 -86772 220776 315566 -100591 311515
17359 238748 397506 222454 231684 105385 295414 19461 151358 112429 291129 -109666
17348 -141037 440212 178138 221959 137342 184893 453289 141984 308945 196653 299823
17338 299823 278717 238481 297438 9636 224304 345686 11855 352089 166509 143247 231644
17327 231644 127310 137924 91797 82349 205082 313545 42098 46370 337150 -110094 112801
17315 394992 220907 148514 68502 -22583 -72376 113135 351942 345091 189920 367119 471440
17304 471440 -162765 366882 224180 -87140 173535 330976 88891 217752 308309 87135
17293F00569k92565K51730A05962J39534J36216J97162b7967C22915D5560J92873
17283B38433b8358C26523k0925n6785a36718a4660A43631J60015A20839O9056
17273A89895N0767o283L1041J63543l182j38797A5994N21426B50152J92916E486
17261C30631j11892J28828j34157P4163J0742P7469J67895B02463P6617N2815
17251C31895K46249A53404B4576K20863l3090k0777K82169L7465k21573K05399
17241D95032O5011A66698K10327j03214J45660O0573k1370q0019K17069k23248
17231C72476j25828E3721M99464p135j34745H3470R6567n8522O41019A00038M30240
17220E30278Q2355B57469O4947J12753j10757K35009q2100p3556J38322H2553
$$ plain form
17293 600569 308004 559734 105962 245496 381712 578874 -27967 322915 45560 238433
17283 238433 -28358 326523 305598 248813 -136718 -14660 143631 303646 120839 189895
17273 189895 240662 234379 265420 428963 425781 286984 15994 537420 250152 443068 5486
17261 330631 218739 347567 213410 287573 298315 375784 543679 202463 279080 331895
17251 331895 578144 153404 24576 245439 212349 191572 473741 511206 289633 495032
17241 495032 560043 166698 377025 273811 419471 480044 458674 378655 595724 372476
17231 372476 246648 53721 553185 546050 411305 83470 180037 121515 762534 100038 530278
17220 530278 612633 257469 322416 435169 324412 559421 477321 403765 542087 82553
17209B92225K26213k17492o4773P341R0523e2448D98188k0358q8461K73372A95022
17197D16244J5796p4229p0749K51168F6402J72790j06217k4224J14959E9213L40517
17186C99730r8709J83915n0035N5198m4322R1340j64002j17923K34437J10673
17176F00302B92911k7134K30400p538R8204J53072k57564j03625F1177L87290
17166D48467A07300M85802B21399K63807k21156K25692N8002B47158K56822j20845
17156C83135K32010k05188K67590q7368B74472K47197O9322j27424j34883R3777
17146D22461j51681L55773l04128J38552J54231l9376J04615J62243j18054N443
17136G30079k94378J22768K4296k20147J89626j09898m2268L3353P4434o4337
$$ plain form
17209 292225 518438 300946 236173 243514 334037 -52448 498188 477830 389369 662741 195022
17197 416244 432040 357811 287062 538230 66402 239192 132975 108751 223710 59213 399730
17186 399730 301021 484936 434901 490099 445777 537117 373115 255192 489629 600302
17176 600302 292911 265777 496177 488639 586843 739915 482351 378726 61177 448467
17166 448467 107300 593102 221399 485206 264050 489742 547744 247158 503980 383135
17156 383135 615145 409957 677547 590179 274472 521669 590991 463567 328684 422461
17146 422461 270780 626553 322425 460977 615208 575832 680447 842690 724636 730079
17136 730079 435701 558469 582765 362618 552244 442346 400078 433431 507865 443528
17126D43528L74938m00969j04278K01730P5584L045K12391B90968J23296j4264
17116D00000P7850J5542J65699k48667L09586j75804k54964K55069j05399J52139
17106E91051j30953M40174j85849J08468j43179K10635C95572P6442o7159M23676
17096H28531l46924M54366j65442o1106J62539k67236l1137K19335j85961L32051
17086I39016j08234l18534J93710P8193q8941J33351j40276J14404K4426k29017
17076E98098M46002l51810R8678k74930J54413j53366K65682r5328K79899p7459
17066H89879k54393J08860K06368j7680l6358m01834M31316j74218o3232J34666
17056H23374j91209K82210r2257k35659Q8570J02063N33479l41550k9282k32851
$$ plain form
17126 443528 818466 417497 313219 514949 590533 593578 805969 290968 414264 400000
17116 400000 477850 493392 659091 410424 720010 544206 289242 544311 438912 591051
17106 591051 460098 900272 714423 822891 679712 890347 395572 472014 404855 828531
17096 828531 481607 935973 770531 709425 871964 604728 573591 792926 606965 939016
17086 939016 830782 512248 705958 784151 695210 828561 688285 802689 827115 598098
17076 598098 1044100 692290 790968 516038 670451 517085 782767 687439 967338 889879
17066 889879 635486 744346 950714 933034 896676 494842 926158 751940 688708 823374
17056 823374 632165 914375 822118 586459 675029 777092 1310571 969021 939739 706888
17046G06888L21337k24166M8701l638J27697M9110l19051L95606k90370N15658
17036A327772n23646J49499K12783k72508J5993K10890j32373j73446k7029L50346
17026A138281j07293l17538N98108o733J05100m94496J42526J14016j70545J52502
17016A153928J53899k36086J02505k18620o4434J75079K18216k96360N14682q9072
17006A413737q6131J11684m7060j00663J12812N3324p5341m0269k60611O9416
16996A150898L71795k21481O4546L8398k2815K03133j43156J91024k91275K83111
16986A624178k59375J72811n9910j73324J60958J80542k45961J34479J06920j79819
16976A461499K68503k7562k6584L3342J04936j61401J60404l88166K23845K30923
$$ plain form
17046 706888 1028225 804059 852760 849122 976819 1025929 706878 1102484 812114 1327772
17036 1327772 804126 953625 1166408 893900 909893 1120783 988410 814964 787935 1138281
17026 1138281 1030988 713450 1311558 1304825 1409925 915429 1057955 1171971 1001426 1153928
17016 1153928 1307827 1071741 1174246 955626 891192 1066271 1284487 988127 1502809 1413737
17006 1413737 1327606 1439290 1392230 1291567 1404379 1457703 1382362 1342093 1081482 1150898
16996 1150898 1522693 1301212 1365758 1404156 1381341 1584474 1441318 1632342 1341067 1624178
16986 1624178 1364803 1537614 1477704 1304380 1465338 1645880 1399919 1534398 1641318 1461499
16976 1461499 1730002 1702440 1675856 1709198 1814134 1652733 1813137 1424971 1648816 1879739
16966A879739l16056J79068K11050q6793k35794J08229K0420j28159L80202j12015
16956A899891n8637p9312J62002L49630o6349k30932j30914J79922j3931R5638
16946B107008j11927K67297n6791O2557l15948L26381o9059J91591j35432K6983
16936B292660m0940R7563J33320J04639k62480L49838l86168N0407J23447P505
16926B469791N989N5511N9615K41890k89288K04482p8317J15527m2931K05492
16916B947761m88939N81782p5611J4648K53603q7782k11948M1039K12540J60676
16906C347769j94970M32009k07833K25566l01354J65471j76210K34403k5915L04711
16896C803647j93733J97930k1348K29281L075l46376L96407J34950n51936M19645
$$ plain form
16966 1879739 1563683 1742751 1953801 1867008 1631214 1739443 1759863 1631704 2011906 1899891
16956 1899891 1841254 1761942 1923944 2273574 2207225 1976293 1845379 2025301 2011370 2107008
16946 2107008 1995081 2262378 2205587 2268144 1952196 2278577 2209518 2401109 2265677 2292660
16936 2292660 2251720 2349283 2482603 2587242 2324762 2674600 2288432 2338839 2462286 2469791
16926 2469791 2475780 2531291 2590906 2832796 2543508 2747990 2669673 2785200 2742269 2947761
16916 2947761 2458822 3040604 2964993 2979641 3233244 3145462 2933514 2974553 3187093 3347769
16906 3347769 3152799 3584808 3376975 3602541 3301187 3466658 3290448 3524851 3498936 3803647
16896 3803647 3609914 3807844 3786496 4015777 4018852 3672476 4068883 4203833 3651897 4071542
16886D071542Q6887j48376K01596L58418l65353K74867L09252l33028L26997j52578
16876D630224K09466P1411J40050n46797J85489K00359N09294p6798Q4891n8328
16866E349261J4503M09437q8905J78092k27568L53348Q5353k03371K69142Q9992
16856F229284M9918L35112L06183l9805k8198J71354K00727M6078j31286j6996
16846G122371J09732M44695K95340j85642J88131J65215K31609J87620N1684l9214
16836H571541O99636k21304K64290J23891M08133L67965O6864j05040N2556J81782
16826A0410314N80683R769P9635L85872L25496J76304J20350N55779L9364L75633
16816A3059199M09665K72232k89572L77953O63747K73681N24244J5894K30443
$$ plain form
16886 4071542 4158429 4010053 4211649 4570067 4204714 4479581 4788833 4455805 4782802 4630224
16876 4630224 4839690 4911101 5051151 4504354 4689843 4890202 5399496 5322698 5407589 5349261
16866 5349261 5363764 5773201 5684296 5862388 5634820 5988168 6073521 5870150 6139292 6229284
16856 6229284 6279202 6614314 6920497 6880692 6852494 7023848 7224575 7270653 7139367 7122371
16846 7122371 7232103 7676798 7972138 7786496 7974627 8139842 8371451 8559071 8610755 8571541
16836 8571541 9271177 9049873 9314163 9438054 9846187 10214152 10281016 10175976 10228532 10410314
16826 10410314 10990997 11000766 11080401 11466273 11791769 11968073 12088423 12644202 12683566 13059199
16816 13059199 13468864 13741096 13451524 13829477 14493224 14766905 15291149 15307043 15537486
16807A5537486N12659L00358K52072J031983l46315R41581K58496L81056M58678
16798A9328054L38383P89790L55058J45335R95111L82364K79144O37871J176558
16789B4427668J60791Q36154P26176Q13612K27629R58430M74168R36184Q38590
16780C0399402J031120O08263R66415J065237J176657P12219R90058J105311J349881
16771C9404563Q43583J361078J102660Q58675J700920J395314R17020J286864
16763D8870677J498773J625571J507227J355982J326138K006752J233688J983824
16755F1408632J504762J520158J562024J865839J671372J586109J765576J824620
16747G4709092J367031J892868J444930J258217J878666J172967J230464J738548
$$ plain form
16807 15537486 16050145 16350503 16602575 17634558 17288243 18229824 18488320 18869376 19328054
16798 19328054 19666437 20456227 20811285 20956620 21951731 22334095 22613239 23251110 24427668
16789 24427668 24588459 25424613 26150789 26964401 27192030 28150460 28624628 29560812 30399402
16780 30399402 31430522 32038785 33005200 34070437 35247094 35959313 36949371 38054682 39404563
16771 39404563 40248146 41609224 42711884 43570559 45271479 46666793 47583813 48870677
16763 48870677 50369450 51995021 53502248 54858230 56184368 58191120 59424808 61408632
16755 61408632 62913394 64433552 65995576 67861415 69532787 71118896 72884472 74709092
16747 74709092 76076123 77968991 79413921 80672138 82550804 83723771 84954235 86692783
16739H6692783R16157Q34440R75337Q37582J009979N05890L77333M53001n6860
16730I2545642N61931k23051q2321l54411q29606l61102q54095r17084q75913
16721H8609990j051632j105424j542571j363938j254921j080857j875427j500271
16713G7834949j604180j709734j616888j320440j931385j638636j409605j837425
16705F4766656j471180j608843j398193j759263j490522j208092j745937j574913
16697E2509713j181823j417233j373830j350148j496008p86754j499762q98689
16689D2505466j130543j351791r83389r11469r02119j114157p20819j174671r44329
16680C3272179m88132q89515q01867p76800n22725p72188q68816p65720m39622
$$ plain form
16739 86692783 87608940 88443380 89418717 90256299 91266278 91772168 92149501 92602502 92545642
16730 92545642 93107573 92884522 92802201 92447790 91618184 91257082 90402987 89485903 88609990
16721 88609990 87558358 86452934 84910363 83546425 82291504 81210647 79335220 77834949
16713 77834949 76230769 74521035 72904147 71583707 69652322 68013686 66604081 64766656
16705 64766656 63295476 61686633 60288440 58529177 57038655 55830563 54084626 52509713
16697 52509713 51327890 49910657 48536827 47186679 45690671 44903917 43404155 42505466
16689 42505466 41374923 40023132 39039743 38128274 37226155 36111998 35391179 34216508 33272179
16680 33272179 32784047 31894532 31092665 30315865 29793140 29020952 28152136 27386416 26946794
16671B6946794q23004n34540j04460j180063m50362p05954j44184l48799p76794
16662B1878634p29667J02982q21862m69949k84153p21146K5231p41884k72895
16653A7965291k17070n77724l70403m13294L0802n24783m75021j92l04620k49200
16643A4863786m05824p1596q8830l71077l80088j04686n89878j58072j09886j10854
16633A2472995k96111j65589L0793k58735k66590k18469o54818M35680l75912
16624A0703244m821m35199L24325n12596k3511k77265j7898k98769l52100L91430
16614I496840m68990K67544m61370j87659q0111j37059j23507n6668Q999l38302
16604G919717k97928Q5051k26898K50440l73157j54232k27757L14337p3909j75226
$$ plain form
16671 26946794 26123790 25589250 25484790 24304727 23854365 23148411 23004227 22655428 21878634
16662 21878634 21148967 21251949 20430087 19960138 19675985 18954839 18980070 18238186 17965291
16653 17965291 17748221 17170497 16800094 16386800 16417602 15892819 15417798 15417606 15112986 14863786
16643 14863786 14457962 14386366 14297536 13926459 13546371 13441685 12851807 12693735 12583849 12472995
16633 12472995 12176884 12011295 12042088 11783353 11516763 11298294 10643476 11079156 10703244
16624 10703244 10698423 10263224 10587549 10074953 10051442 9774177 9756279 9457510 9105410 9496840
16614 9496840 9027850 9295394 8834024 8646365 8566254 8429195 8305688 8249020 8258019 7919717
16604 7919717 7621789 7706840 7479942 7730382 7357225 7202993 6975236 7289573 7215664 7040438
16594G040438j21295k7752j92965K62458n06217P6745j96729J23890k44060J81051
16584F395564l13118J0566j61509J64688l40220J07373O7554k37452l38922N0015
16574E404539j56153J16401n4620p4023p9953P0443J02306l74602q3455M71003
16564E341886O9783n27731p8536J47806m3452j12864L6967j66311l29862L91076
16554D728762o9017N6990l62388L3417k65202J1105M53689o95890N21243l66992
16544D045717L6352l35841J95769O134l21770M11449q5071L53084p90590J95896
16534C711129J43014k62458n3915j78548K99604k67554K14486p2852J16754j92687
16524C456973Q6878k58099K23228l53948l6909J02350k13920J40405K70487k11677
$$ plain form
16594 7040438 6919143 6891391 6698426 6960884 6454667 6531412 6334683 6458573 6214513 6395564
16584 6395564 6082446 6093012 5931503 6096191 5755971 5863344 5930898 5693446 5354524 5404539
16574 5404539 5248386 5364787 5310167 5236144 5156191 5226634 5328940 4954338 4870883 5341886
16564 5341886 5411669 4883938 4805402 4953208 4909756 4796892 4833859 4667548 4337686 4728762
16554 4728762 4659745 4716735 4354347 4387764 4122562 4133667 4587356 3891466 4412709 4045717
16544 4045717 4082069 3746228 3941997 3948131 3626361 4037810 3952739 4305823 3515233 3711129
16534 3711129 3854143 3591685 3537770 3359222 3658826 3391272 3605758 3532906 3649660 3456973
16524 3456973 3543851 3285752 3508980 3155032 3118123 3220473 3006553 3146958 3417445 3205768
16514C205768P9329o4634R4443j55255m71198K40804j93506o6334K68114N3817
16504B991348K1229l38330L76275k78443M19299l74565K19858J37690j0068l75206
16494B789087m28541M30918N0748l85356M46131m82607L02296l96565j21968K68535
16484B472678J89731k13255J76901O241j79880J08677l9929k50028L21961j39872
16474B453225p0782K88396j72822j20432J33803N9495l08779P9127j30772k4956
16464B185503n5867j99474J65679K48027m23j89202K57323k05326j9911j56393
16454B029936N8345m405P0424L7608N9815k88614J3972J43021j44628J33797p7274
16443B031997k11229J88003l08337K13860k02539J36605R2598L61150n25396j4458
$$ plain form
16514 3205768 3285097 3220463 3314906 3159651 2688453 2929257 2735751 2669417 2937531 2991348
16504 2991348 3012577 2674247 3050522 2772079 3191378 2816813 3036671 3174361 3164293 2789087
16494 2789087 2360546 2791464 2842212 2456856 2902987 2420380 2722676 2326111 2204143 2472678
16484 2472678 2662409 2449154 2626055 2632296 2452416 2561093 2521164 2271136 2593097 2453225
16474 2453225 2382443 2670839 2498017 2377585 2511388 2570883 2262104 2341231 2210459 2185503
16464 2185503 2129636 1930162 2095841 2343868 2343445 2154243 2411566 2206240 2186329 2029936
16454 2029936 2088281 2083876 2154300 2191908 2251723 1963109 1977081 2120102 1975474 2109271 2031997
16443 2031997 1820768 2008771 1700434 1914294 1711755 1848360 1940958 2302108 1776712 1762254
16433A762254L97890k70353P2020j82227M5693N1151O070n7843J6428j72427Q5588
16422A754244r1964J15787J06635j9561n18172O2752J07370J8950K78483k79991
16412A534533K23713j13168M00726n65580m0548K66520j02233J36K6414k47383
16402A383130k22709L58687L09743k73935L7836J55215l48420O5592J82019k60666
16392A386492K18320j29119L20506l70779j15765K15271k69774J63620m2299l18786
16382A057687O15924k64007J58059k29594L1050l541J56159j82857n9728M88681
16372A767833k07062j66281k61850K74398l06025N4407J83716j75774j2057J13665
16362A264970j2661k0680J24552l3534j04538k07968K02302J26235K3248k58141
$$ plain form
16433 1762254 2160144 1889791 1961811 1779584 1825277 1876428 1882498 1824655 1841083 1668656 1754244
16422 1754244 1662280 1778067 1884702 1865141 1346969 1409721 1517091 1536041 1814524 1534533
16412 1534533 1758246 1645078 2045804 1480224 1439676 1706196 1603963 1604099 1630513 1383130
16402 1383130 1160421 1519108 1828851 1554916 1592752 1747967 1399547 1465139 1647158 1386492
16392 1386492 1604812 1475693 1796199 1425420 1309655 1524926 1255152 1418772 1376473 1057687
16382 1057687 1673611 1409604 1567663 1338069 1369119 1365578 1521737 1338880 1279152 1767833
16372 1767833 1560771 1394490 1132640 1407038 1101013 1155420 1339136 1163362 1151305 1264970
16362 1264970 1252309 1231629 1356181 1322647 1218109 1010141 1212443 1338678 1361926 1103785
16352A103785J94240J7292o2200J3997o9250J14919k40103M59384m72125K22346
16342A282285r0112K23016m86369M64409l58295o5408O2369L02318k78213K97249
16332A353249k05815k7052J26273p084q6161J55625l97976L14566l37976L07645
16322A195294R4376k81423o1626N0420J64356K6502k00531r2740R8980J14274
16312A107882l9467O8073k03117L50247j14264j78995k56103K90811k65386J91171
16302I50852j40785J88412O574r5339L68047k85416k78879J48839j28806K06203
16292I39702k08879K05038K36867l3488j78913o610j85571J3872m7133r4154K95214
16281I35945k6891R4438j23755K443K70905n31077J76007j7505r4058P6296Q1631
$$ plain form
16352 1103785 1298025 1315317 1253117 1267114 1197864 1312783 1072680 1532064 1059939 1282285
16342 1282285 1192173 1415189 928820 1393229 1034934 969526 1031895 1334213 1056000 1353249
16332 1353249 1147434 1120382 1246655 1239571 1153410 1309035 911059 1225625 887649 1195294
16322 1195294 1289670 1008247 946621 997041 1161397 1187899 987368 894628 993608 1107882
16312 1107882 1068415 1136488 933371 1283618 1169354 990359 734256 1025067 759681 950852
16302 950852 810067 998479 1005053 909714 1277761 992345 713466 862305 733499 939702
16292 939702 730823 935861 1172728 1139240 960327 953717 768146 782018 734885 640731 935945
16281 935945 909054 1003492 879737 882180 1153085 622008 798015 780510 686452 762748 844379
16270H44379j53057J74362j27052N3367K04322k16704k37448N31087k30756K68072
16260A110572k10992j12579J43175J32689k13626O5349J8637k1024r8180j905
16250H12116j23874J43718k93707P5213L01544l68256Q5201L29829l7683r0651
16240H33450R4291K69816m32637l67271K86984k21302K43549O0725l19236j071
16230D47298L36077M5984j69819L3857l0667C16066K78506P7110J47803j44486
16220F74999j35646Q2559K17595l96526K25828j40273k3398J95264j48632J94370
16210G46140k05982M48935D49325j34315M77475A52995O66751l64354N8898K06700
16200G20990j15540J24744l03278J17777J03410j81815K55773j67447K03479j77967
$$ plain form
16270 844379 691322 865684 738632 791999 996321 779617 542169 1073256 842500 1110572
16260 1110572 899580 787001 930176 1062865 849239 914588 933225 912201 814021 812116
16250 812116 688242 831960 538253 613466 915010 546754 631955 961784 924101 833450
16240 833450 927741 1197557 764920 397649 684633 463331 706880 767605 448369 447298
16230 447298 783375 829359 659540 693397 662730 316066 594572 671682 819485 674999
16220 674999 539353 621912 839507 442981 668809 528536 505138 700402 551770 746140
16210 746140 540158 989093 449325 315010 792485 152995 819746 455392 514290 720990
16200 720990 605450 730194 426916 544693 648103 466288 722061 554614 758093 580126
16190E80126j91583K26937k09927Q6000j9416K17246k3996j38799K2499j9979
16180E29108j19730j1479K7902M45355B65607R4664J65458p0564M63085C68313
16169F05004j16417j17514M2927J72517o3482j9778Q0315r2791L6622j57675L09146
16158F78874j30190A88222L59001r2566q2515J7790m2724M6676L34362B48642
16147D25083j49145L0018j4745N55973l80609J65531k11381k10133J85869j81784
16137B14677q079K96049p4447k00475J29315A18498M21268I2375M59733o2845
16127D89263I8933L08234J0421A67924J36456K74196B33136K04476j93496m8482
16117A95634K88304B33955K13399k18250l8123J89579q8655L75821q4480j25625
$$ plain form
16190 580126 388543 615480 405553 491553 472137 689383 665387 526588 549087 529108
16180 529108 409378 397899 425801 871156 265607 360271 525729 455165 918250 368313
16169 605004 488587 371073 414000 586517 523035 503257 583572 490781 527403 369728 678874
16158 678874 548684 188222 547223 454657 372142 389932 347208 393884 728246 248642
16147 425083 275938 305956 291211 847184 466575 632106 420725 210592 396461 214677
16137 214677 206598 502647 428200 227725 357040 118498 539766 92375 552108 489263
16127 489263 98933 407167 417588 167924 304380 578576 233136 437612 244116 195634
16117 195634 483938 233955 447354 229104 190981 380560 291905 667726 583246 457621
16107D57621k04842F0616c6597B90161J18909j56298n6174m5822K76220a37975
16096B98015P8467A70753J75028l0934j21839M44802B12623N4437j13674D8509
16085B79037p9062K69235A68924K15379A83186J21986A41265O8491A02600M14440
16075E17040g2495A66164L01667A66862J72278p541A23628I684L15305A31084
16064A85177H4631K79459K44337k42218o3266M7864o4671a4135C86809A20140
16053A74327l4450J28254j05633l6945L2957A7414d3526A42732p73g3016A63104
16041D09617i9847C41711n4456j38638l7024J53272j26760L08660Q2252B03261
16030A32024P4276J32025N2799A35240a4815C41514b5573E1875K77601J82053
$$ plain form
16107 457621 252779 60616 -36597 290161 409070 252772 196598 150776 426996 -137975
16096 298015 376482 170753 345781 314847 193008 637810 212623 267060 153386 48509
16085 279037 199975 469210 168924 384303 183186 305172 141265 209756 102600 517040
16075 517040 -72495 166164 467831 166862 339140 331599 123628 9684 324989 131084
16064 185177 84631 364090 608427 366209 302943 350807 286136 -14135 386809 120140
16053 174327 139877 268131 162498 125553 158510 17414 -43526 142732 141959 -73016 163104
16041 409617 -99847 341711 287255 148617 111593 264865 138105 446765 529017 203261
16030 132024 206300 338325 391124 135240 -14815 341514 -25573 51875 329476 511529
16020E11529j97251B9712L2485J75083l8271F1263B8971L56483F0057J36203k835
16009A93425L5094c8501I440L50324C2532L12388A48707e6047K5149m668n3975
15998h9541A83870l4277M8110L5133D553K49999D6529L44250R4918K55410q5696
15987F55411K92576R534l07894J77666O5372C21216K59719B88772A09274E2476
15976D52418F5101e8095F3911J21966M5030C5777K86854E4203J02272L8084m0572
15965A53987n6603a35399G2543K83294a04629m1494A58326J32252L38268a3397
15954B40705J09050j47783B8848J57786G9160J20959a796A2200K67481I4549R9138
15943A93687b4901A3148a4423A00470b05803a1247A67265a577D9059a41684D86695
$$ plain form
16020 511529 314278 29712 62197 237280 199009 61263 28971 385454 60057 196260 193425
16009 193425 228519 -38501 9440 359764 32532 344920 148707 -56047 -30898 -35566 -89541
15998 -89541 183870 149593 197703 232836 4553 254552 46529 390779 485697 741107 655411
15987 655411 947987 957521 649627 827293 892665 321216 580935 288772 109274 52476
15976 452418 65101 -58095 63911 185877 230907 35777 322631 54203 156475 194559 153987
15965 153987 97384 -135399 72543 355837 -104629 -146123 158326 290578 628846 -13397
15954 240705 349755 201972 28848 186634 79160 200119 -1796 12200 279681 94549 193687
15943 193687 -24901 13148 -14423 100470 -205803 -11247 167265 -1577 49059 -141684 486695
15931a16939E1297a00250j2951K8055D3996a37485L1735H2075J28401c9333A32307
15919D9454J66728d0384B04637L062A00178j8902a31269B23867F5522l1682J76599
15908B10439E8838Q2680i294F9895L4305c1382p4424A51333K2552m0229R8942
15897B32598a90439g3675A59917m9258a6721i36B27787D1244L23875A29174k6820
15886A02354a60325A65413B2557b4612B48125a76224C574K1448K6454K03638b5892
15874b69964r447K4254C01077i6751a61j30737o7392c0553A911a45363H5061h2840
15861a90277B37044a07311j91638C19339d5679j13130B89807b07150C48308A19099
15850F6622J47283A325J68506K4742n7507m3564Q386A6014J4914g0378C816L27418
$$ plain form
15931 -116939 51297 -100250 -113201 -85146 43996 -137485 -105750 82075 210476 -39333 132307
15919 49454 216182 -40384 204637 207699 100178 81276 -131269 223867 65522 33840 210439
15908 210439 58838 141518 -9294 69895 104200 -31382 -105806 151333 173885 133656 232598
15897 232598 -190439 -73675 159917 110659 -16721 -936 227787 41244 365119 129174 102354
15886 102354 -160325 165413 22557 -24612 248125 -176224 3574 25022 51476 255114 -25892
15874 -269964 -279411 -255157 301077 -96751 -161 -130898 -198290 -30553 1911 -145363 85061 -82840
15861 -190277 237044 -107311 -298949 319339 -45679 -158809 289807 -207150 348308 119099
15850 66622 213905 1325 169831 194573 137066 93502 101888 16014 30928 -70378 3816 331234
15838C31234J67703a70733C5857p38J29646P8832j04985e29466b43670J20024
15828a23646K3548A63091o7691K41238f0537A5318J40978p5616O1034C6392D551
15816A23406b46886a19255A10988h8652C3296K29242a7050o57A7373M625b25639
15804C5115J57754a64934P4802C06944c3734j4122A40680a7975B33596a74012
15793a0991k03707A2291K40741Q4921A09713K39902E0409d95814a30639A03907
15782a52764I0725d7687C03607D8604L4155b0200A42508R6082I2538J45299q6930
15771A50907G149O806Q6287a25406d0902L758j76469d622F0764M7502e6832A87269
15758c54783M7063B20558a41011a6977n1594B25493C5493a33400M4617d3323i84
$$ plain form
15838 331234 498937 -170733 35857 35119 164765 243597 138612 -529466 -243670 -123646
15828 -123646 -100098 163091 95400 336638 -60537 15318 156296 80680 141714 36392 4551
15816 123406 -246886 -119255 110988 -88652 33296 262538 -17050 -17707 17373 21998 -225639
15804 35115 192869 -164934 -90132 306944 -33734 -47856 140680 -17975 233596 -174012
15793 -10991 -214698 12291 253032 337953 109713 349615 50409 -495814 -130639 103907
15782 -152764 90725 -47687 303607 48604 82759 -20200 142508 238590 92538 237837 150907
15771 150907 7149 13955 100242 -125406 -40902 -37144 -213613 -4622 60764 108266 -56832 187269
15758 -354783 -307720 220558 -141011 -16977 -68571 225493 35493 -133400 -88783 -43323 -984
15746a97605c5198C56816B2943a28193A22381e3254A65372b4465F3894L1133h2751
15734B05641D3732f9758k24379h9220c8481J0410D9957a58912L6181c6157a5236
15722A01155h4433j43182G8838N61054d77478A2829b25445A26138A8446a40901
15711a38680A95331J08190d4895B44966c781n9761j82854c1866E8618J6645c9140
15699B05306J7562A5371J39346b99750B98990E883J86829a61832O8690B08275
15688C25521a7257A79234H1804d1836H5959N5019a35672B30821F1026f8417j87267
15677b55684A31288i4285p270j05227A43619a70671c8241k27675B29697c04688
15666B3550J3099N1872a40534A12488J88143b31805A5940g4384g224D8763f8845
$$ plain form
15746 -197605 -35198 356816 22943 -128193 122381 -53254 165372 -24465 63894 95027 -82751
15734 205641 43732 -69758 -294137 -89220 -38481 -28071 49957 -158912 -122731 -36157 -15236
15722 101155 -84433 -227615 78838 639892 -477478 12829 -225445 126138 18446 -140901
15711 -138680 195331 303521 -44895 244966 -3781 -63542 -246396 -31866 58618 75263 -39140
15699 205306 222868 15371 154717 -299750 298990 5883 192712 -161832 -93142 208275
15688 325521 -17257 179234 81804 -41836 85959 140978 -135672 230821 61026 -68417 -255684
15677 -255684 131288 -94285 -101555 -206782 143619 -170671 -38241 -265916 229697 -304688
15666 23550 36649 88521 -140534 112488 300631 -231805 15940 -74384 -7224 48763 -68845
15654c305l66121A94181C8903d0152f406F7768a01388C8873r882A0431L5822Q9433
15642A35686a67255A8368M7765f1464B08433a18993A02067a43899k24922J42612
15632b26209L5032B33419a98703B53297a55676j64311B04553G6449k706J53572
15622B27315A7906a6297G5748a76306e8636B20773b84031a06505A47247a12279
15611g6828k76659F5208a32349A50504G1190Q1442a62250G1451l3556J33750A2849
15599a76610a7575A51591a37743O2481C33299j61567a74323B68409f7047C35031
15588D27708a98453r0947j12834a14807A11515n4509h9195L8024g73l61586B51167
15576I3055a38530A00573f3427j41041E3339c85963a51446A8591e7178k52726
$$ plain form
15654 -3305 -369426 194181 38903 -40152 -6406 67768 -101388 38873 28991 10431 46253 135686
15642 135686 -167255 18368 66133 -61464 208433 -118993 102067 -143899 -368821 -226209
15632 -226209 -191177 233419 -198703 253297 -155676 -319987 204553 76449 73743 227315
15622 227315 17906 -16297 75748 -176306 -58636 220773 -284031 -106505 147247 -112279
15611 -76828 -353487 65208 -132349 150504 71190 152632 -162250 71451 37895 171645 12849
15599 -176610 -17575 151591 -137743 -75262 333299 171732 -174323 268409 -67047 335031
15588 427708 -198453 -289400 -402234 -114807 111515 57006 -89195 -51171 -773 -362359 251167
15576 93055 -138530 100573 -63427 -204468 53339 -385963 -151446 18591 -57178 -309904
15566c09904a52054a6026I364i7585d0161A3302b48829J20192j18501G5408j501
15555G3907K099l722O5069b35115B58294a02813m9890o311l8419A97293d3316
15543a69854D3546N606d6262A07345h7123C547R9752a71940d1998G4945J70768
15532B45713J805b28057h5068A1643N0043A201J4371a07988A95962b7425B0491
15520d4103l27568A5060b0485G7966B0174K14277a21198j39355A82663o7760p753
15509A07150a5687C38219i3472l0423A00659f0122e609r8681B04982k6836h7431
15497A56892b67720J16533j2248n0204L1556O70g8221D4565g0890a0120H3357
15485e7129I0848M75215G6209J8497R9406m7219O1038J51274k08j3269O9621j32257
$$ plain form
15566 -309904 -152054 -16026 9364 -97585 -40161 13302 -248829 -128637 -247138 75408 73907
15555 73907 76006 72284 137353 -235115 258294 -102813 -152703 -159014 -197433 197293 -43316
15543 -169854 43546 49152 -46262 107345 -87123 3547 103299 -171940 -41998 74945 245713
15532 245713 247518 -228057 -85068 11643 61686 1201 15572 -107988 195962 -27425 20491
15520 -44103 -371671 15060 -20485 77966 20174 234451 -121198 -260553 182663 114903 107150
15509 107150 -15687 338219 -93472 -123895 100659 -60122 -5609 -104290 204982 178146 -87431
15497 156892 -267720 -151187 -163435 -213639 -182083 -181413 -78221 44565 -70890 -10120 83357
15485 -57129 90848 566063 76209 94706 194112 146893 207931 359205 358997 345728 415349 283092
15473B83092j01056a98276j41013A08227L375g4266A53268c2880C4733J20881
15463A55614a8850F6533J14367a18249D50725H1058o081e6744r4895e6599H0802
15451A65574f1594B00917a2046k30777C24216j13019H7942J23679n0215J24863
15441B86269M2497k7339r2353A9325J91535J46502a69582P7694K3577p1588D2811
15429g6302c707D0335b11362E558J75599E6673J31498n5650D8885f0882F7781
15417g17l1547A66434a64338A08644a38253A10304a74643j87390A78796a10552
15406b42322j96898A54823m8821j6B6750c1865l0254B31142G0087b04175A44989
15394H2701a05956r862A24675e1463k35199f5961I2614c5859E6191Q5478N6807
$$ plain form
15473 283092 182036 -198276 -339289 108227 111602 -74266 153268 -32880 34733 155614
15463 155614 -18850 66533 180900 -118249 450725 81058 74977 -56744 -151639 -56599 80802
15451 165574 -61594 200917 -12046 -242823 324216 211197 87942 211621 161406 286269
15441 286269 328766 301427 209074 19325 210860 357362 -169582 -91888 -68311 -139899 42811
15429 -76302 -3707 40335 -211362 5558 181157 56673 188171 132521 48885 -60882 67781
15417 -717 -32264 166434 -164338 108644 -138253 110304 -174643 -362033 178796 -110552
15406 -242322 -439220 154823 106002 105986 26750 -31865 -62119 231142 70087 -204175 144989
15394 82701 -105956 -115818 124675 -51463 -286662 -65961 92614 -35859 56191 141669 198476
15383A98476a95444g1542A72796A7026b2767j17605f9028o7808k00856A40897
15372A78725a69682A98942n3257f6963A4789J28847C1991L43052j29960p4832
15362A70251E1897N2858N8747A3432M1628K34292r7107J18249j10422a11841B60773
15350A06248d6277F0581M52643G8399a0582k43791B5076K33797j22065B3481K45794
15339B69275J74450a20062b3249B90338A32531l0051c432j13997D6281K51588
15329B97869b29024H2318k6416O9420L42450I5289J9656k5563d1270j74144P9492
15318a35922B34772F4925L4143b37221H2857J02781F4703l0942a80078C29996
15307A65531C9141a41381B74602n0872r1856q732J73844c20884A05415P5047l4314
$$ plain form
15383 198476 -195444 -71542 172796 17026 -22767 -140372 -69028 -136836 -337692 140897
15372 178725 -169682 198942 145685 -66963 14789 143636 31991 375043 245083 170251
15362 170251 51897 104755 163502 13432 55060 289352 192245 310494 200072 -111841 260773
15350 106248 -46277 60581 513224 78399 -10582 -254373 25076 258873 136808 23481 269275
15339 269275 443725 -120062 -23249 290338 132531 102480 -3432 -117429 46281 297869
15329 297869 -229024 82318 55902 125322 467772 95289 114945 89382 -41270 -215414 -135922
15318 -135922 234772 64925 99068 -237221 82857 185638 64703 33761 -180078 329996
15307 165531 39141 -141381 274602 223730 131874 123142 296986 -320884 105415 180462 146148
15296A46148k3236p46i3148A41576c7666A53064J46083D1680J46897d0690A66171
15284A53718f5840B6833a3819j77921h616E6489K0513e4063o2310b9825C60080
15272A32853B8998a64631H0218J64229A02298k3031r692l470i6465B32199a79973
15260A61007O9967r5522f0906J9185B26704b19298a1015D39707b67321B15132
15249D27358L98425J228476q60466M14367k8051o68210D24625A62721a55311A99255
15238A10849L517C2870N0448b443j04648j00446B51564J95038B15310b09203J3500
15227a95703h0844A43294j3260C6501O9144l1046l2855a08065c7278k8007C52495
15215F5463J63479n697b7563C7802d5748B73550d8575B14952F9966a8785A82259
$$ plain form
15296 146148 122912 122166 -93148 141576 -37666 153064 299147 41680 188577 -40690 166171
15284 153718 -65840 26833 -13819 -191740 -8616 56489 77002 -54063 -116373 -29825 360080
15272 132853 28998 -164631 80218 244447 102298 79267 69575 66105 -96465 232199 -179973
15260 161007 230974 135452 -60906 -41721 226704 -219298 -11015 439707 -267321 215132
15249 427358 825783 2054259 1193793 1608160 1580109 911899 424625 162721 -155311 199255
15238 110849 114366 32870 83318 -2443 -107091 -207537 251564 446602 215310 -209203 -195703
15227 -195703 -80844 143294 130034 36501 105645 74599 41744 -108065 -37278 -65285 352495
15215 65463 228942 223245 -27563 37802 -45748 273550 -48575 214952 69966 -18785 182259
15203B87390K5024q8848q7630a59256B26712a33370f0198C49777b9628G3293e6461
15191A92488a16435B95616A5962L6408A0175h4753A70836B9078a19066C00411
15180g2990c6187H8983R923a89155I8871g3673J0012K72j80514A42451e8210E5129
15167b04177D9650a3699A43180a35285I4289f4567A8293M4871c498m1313B10275
15155b75631J32273p9598d4093A61999C9368K7162b36562c7175I4148J04539E4547
15143b36782E6418O3200C1323K54471r5253o9101a58441J1110E117J35442B0779
15131g0662A35385O1616Q3382o9656b8093p2734C61183j29573b03421A46728K9160
15120A75888b38855C32466r269M7273F5979M7052P6974J01119o8966a70529e8620
$$ plain form
15203 287390 312414 223566 135936 -159256 226712 -133370 -60198 349777 -29628 73293 -56461
15191 192488 -116435 295616 15962 52370 10175 -84753 170836 29078 -119066 300411
15180 -72990 -36187 88983 98906 -189155 98871 -73673 -63661 -63389 -243903 142451 -58210 55129
15167 -204177 49650 -13699 143180 -135285 94289 -64567 18293 63164 -3498 -44811 210275
15155 -275631 -143358 -222956 -44093 161999 39368 66530 -236562 -37175 94148 198687 54547
15143 -236782 56418 119618 31323 285794 190541 121440 -158441 -147331 5117 140559 20779
15131 -70662 135385 197001 280383 210727 -28093 -100827 361183 231610 -203421 146728 175888
15120 175888 -238855 332466 323197 370470 65979 113031 190005 291124 222158 -170529 -58620
15108c4620A2721J56061J5676J26331r5233G1540g5167B21457l7826E2932a37834
15096A8045O7710R1661b02372A87691h952B02563b2600k28011H7338l6313M81941
15085E32966B16847K00008b0187B97186L0113a11515L0601A39922m0522J21153
15075B20553f2438A65449b45237C49300l3185i7796a6408C03550h531l697A58757
15063b273A26829a02443D52358D1445J6595N24394G4494L66862E5766K37882J20465
15052D14113j35068J39749k00701F8465P448J1876L2684J75188r3621g909A23713
15040A74861p0610K74898A3543K50750A01850J61379K3224a79336I6712K46196
15030C42908P6456J14668k16027G9278P74983A39417A3411M24297J19689l9696
$$ plain form
15108 -34620 12721 168782 184458 310789 215556 71540 -75167 221457 183631 52932 -137834
15096 18045 85755 177416 -202372 187691 -8952 202563 -22600 -250611 87338 51025 532966
15085 532966 216847 416855 -20187 297186 327299 -111515 -80914 139922 99400 220553
15075 220553 -62438 165449 -245237 349300 316115 -97796 -16408 303550 -8531 -12228 158757
15063 -2273 126829 -102443 452358 41445 58040 582434 74494 441356 55766 293648 414113
15052 414113 279045 418794 218093 68465 75913 87789 120473 295661 202040 -7909 123713
15040 174861 104251 379149 13543 264293 101850 263229 286453 -179336 96712 342908
15030 342908 419364 534032 318005 79278 854261 139417 13411 437708 557397 517701
15020E17701A61449L49123r2634o3239A43178O0527d2517E11469k9066I3573J81830
15009B75403K45388B54142n1856b9806A72977K9851M92974B1786Q3616L7070o2593
14998G9879L04021j56214A09473J57988G7359J47750J754J99146A83230J94215
14988C77445r3146G7201L49609j24127G2091M42534j59854L19171B15213K66893
14978D82106l3333j96358L05402j95135J90173r949B64681K11739j1051j55831
14968C09538K04626A34019O93162l55370q3169l835A75212J3974K325J55397J60495
14957E07403k23458J22916j51294J79050b54454C09617j36771J54437A43085L84693
14947E27778B17073M57719D4328Q8168M82427j86349B03299J15652J73580M350
$$ plain form
15020 517701 161449 510572 417938 354699 143178 203705 -42517 511469 482403 93573 275403
15009 275403 520791 254142 202286 -29806 172977 202828 695802 21786 105402 142472 79879
14998 79879 383900 227686 109473 267461 77359 225109 226863 426009 183230 377445
14988 377445 284299 77201 426810 302683 72091 514625 354771 673942 215213 482106
14978 482106 448773 252415 557817 362682 552855 542906 264681 476420 465369 309538
14968 309538 514164 134019 827181 471811 388642 384807 175212 189186 191511 346908 507403
14957 507403 283945 406861 255567 434617 -254454 309617 172846 327283 143085 527778
14947 527778 217073 674792 44328 132496 614923 428574 203299 318951 492531 496881
14937D96881o4375A52106L93304N7216M8590j47455n7230O62564m62975Q4778
14927G30898O2073j60417K11218o8742J47548j63282J77018k76238K27552J50341
14917A037969J22179k0319o8235L0763k80159N0956k82844N5396q8801N4378k26359
14906C84924N06270B32823K38580B31298L1487q3976E8477c1868C38958A46735
14895C28854o8417K10300j2143J12159j79242R1630j04631J02011J42308j34336
14885D88493j5791l1409j96181M0154J75032J42739N0908n9091L27974m07917
14875E14911B32933R8336G2670L75290k07538O9227R038K55840j88004K99061
14865F85584l09963K65839k32049A99673N58142C56846A51184K83217A34111J03496
$$ plain form
14937 496881 432506 152106 545410 602626 651216 503761 446531 1109095 646120 730898
14927 730898 792971 632554 843772 775030 922578 759296 936314 660076 887628 1037969
14917 1037969 1160148 1139829 1071594 1102357 822198 873154 590310 645706 556905 611283 384924
14906 384924 891194 232823 471403 231298 262785 178809 58477 -31868 338958 146735
14895 328854 260437 470737 458594 570753 391511 483141 378510 480521 622829 488493
14885 488493 472702 441293 245112 285266 460298 603037 653945 594854 922828 514911
14875 514911 232933 331269 72670 447960 240422 309649 318687 574527 386523 685584
14865 685584 375621 641460 409411 199673 757815 356846 151184 434401 134111 237607
14855B37607m7508L24114B51659L48604O8023A60988J03192J03863J17621J396
14845D87060r3818L08610C46658L91802K1680j17479o0831J68337L16991D48770
14834I25045C05632L06221n0113J41061l08857j76651L63261j46412K00755j72550
14824D62347L3565j66430K89791q754P8816n3287n9425k21341K36873K10826l02827
14813E00154A84648L22469A84134M88671k2587j14581j45994L15442p4321l7905
14803E92859k13715K68691M06687L0648l38706j83188Q6772J81080k85792L7618
14793E82954j86378L94900B70016J20997j82174L42612J05221r7551N3352J31262
14783G43735o7531k05454P8897j35283o0913J13190j6514N3441o3869M86818l22550
$$ plain form
14855 237607 190099 514213 251659 600263 668286 160988 264180 368043 485664 487060
14845 487060 393242 701852 346658 738460 760140 642661 581830 750167 1067158 448770
14834 925045 305632 611853 561740 702801 393944 217293 580554 434142 634897 462347
14824 462347 495912 329482 619273 610519 689335 636048 576623 355282 592155 802981 500154
14813 500154 184648 507117 184134 672805 650218 535637 389643 705085 630764 592859
14803 592859 379144 647835 1054522 1085170 746464 563276 650048 831128 545336 582954
14793 582954 396576 791476 270016 391013 208839 551451 656672 559121 612473 743735
14783 743735 676204 470750 549647 414364 353451 466641 450127 503568 439699 926517 603967
14772F03967k09575K61049K96883j32410k27525P8965l19478l4218N00792k79098
14762E39352J27929J90786m28073J91593k49396L99681j55945K69130j37302J180
14752G48935j53129j133M46981m77924J81639m3409r0881J86457k23041J16483
14742F90978B50423K41387k273K39274m3674k02188K20680k09219K01412l46716
14732C49106J46384K48851j18904R2776J65341M7488k90717K59466J0109j83135
14722G26765K81286o9737K8890j38268J98482q5418j71563K57818K19993m36067
14712H12181L9831k44315L05072l68117O26088j85026r7057q0915J18760J71746
14702A098248D98872O50208j28890J97960J19201Q4141m95760L78456m6996l66395
$$ plain form
14772 603967 394392 655441 952324 819914 592389 671354 351876 317658 818450 539352
14762 539352 667281 858067 429994 621587 372191 771872 615927 885057 747755 748935
14752 748935 595806 594673 1041654 563730 745369 701960 611079 797536 574495 690978
14742 690978 250423 491810 489537 728811 685137 482949 703629 494410 695822 349106
14732 349106 495490 744341 625437 718213 883554 931042 640325 899791 909900 726765
14722 726765 1008051 938314 967204 828936 1027418 942000 770437 1028255 1248248 812181
14712 812181 852012 607697 912769 544652 1170740 985714 888657 807742 926502 1098248
14702 1098248 498872 1149080 1020190 1218150 1337351 1421492 925732 1304188 1257192 890797
14692H90797o8741q5499L39913l23789O224M5381J49849r7411p3416k4981L26016
14681A084343N6288l06946L34124D86944O69483k18565r0368R3711L40669j94140
14671A087734j90467q597L6267K25336L38636o35477L64950n4638j79986j65562
14661H18196J93631J11984K1916M4032Q1232K9847m71200O23895l63878J14154
14651A203809j25845R0437k30806O1885K02617q3437K78438m6168F66919O52840
14641A319759j44123l86615K36971j45776N01894n3323n3848j3488J54003j96635
14631A218819k04057r0077L64324l54423L15708J63502j43112j7865j31989M02209
14621A523039j43373j58211R2140J08507L8405l4071Q760n8306K51383m9877j55810
$$ plain form
14692 890797 822056 736557 1076470 752681 758905 804286 954135 856724 783308 758327 1084343
14681 1084343 1140631 833685 1167809 486944 1156427 937862 847494 941205 1281874 1087734
14671 1087734 897267 888670 924937 1150273 1488909 853432 1218382 1163744 983758 818196
14661 818196 1011827 1123811 1145727 1189759 1270991 1300838 829638 1453533 1089655 1203809
14651 1203809 1077964 1168401 937595 999480 1202097 1118660 1397098 1350930 666919 1319759
14641 1319759 1175636 789021 1025992 880216 1382110 1328787 1274939 1261451 1415454 1218819
14631 1218819 1014762 924685 1289009 934586 1250294 1413796 1270684 1252819 1120830 1523039
14621 1523039 1379666 1221455 1313595 1422102 1460507 1426436 1435196 1376890 1628273 1578396 1422586
14610A422586L2150m5063l22165K67684j36408N80619m59069K69009p4535N0589
14600A585397K26236m27423J12111O6516P6039m01331M70992k22449N0701P647
14590A544436J64515R8802J79241o13246O33774l04488J35567m3466K832Q6219
14580A884186r0529K84174l83351j5642Q9622n3097M98107J1318j23045o3024
14570B038719K27752k08046M9923j63355K04121L58728q5408j86213L43018J170
14560B580409m0294K18688M6341M37343l42918L73045N70971m5597L39239P49009
14550D886236P80103J690977L956491P468582J5772006O271900j9465505I701526
14541E454973j886698r35052m03948L335j01186P8468j34382l29265M79780l060
$$ plain form
14610 1422586 1454736 1409673 1087508 1355192 1218784 1799403 1340334 1609343 1534808 1585397
14600 1585397 1811633 1384210 1496321 1562837 1638876 1237545 1708537 1486088 1536789 1544436
14590 1544436 1708951 1807753 1986994 1373748 2007522 1703034 1838601 1795135 1797967 1884186
14580 1884186 1793657 2077831 1694480 1678838 1768460 1715363 2213470 2224788 2101743 2038719
14570 2038719 2266471 2058425 2108348 1944993 2149114 2507842 2422434 2236221 2579239 2580409
14560 2580409 2540115 2758803 2805144 3242487 2899569 3272614 3843585 3797988 4137227 4886236
14550 4886236 5666339 7357316 11313807 18782389 34554395 40826295 21360790 9701526
14541 5454973 3568275 2633223 2229275 2232610 2131424 2209892 2075510 1746245 2226025 2222965
14531B222965l14030K23837M16249p10704L5690N42800j28152k30852L06649j00978
14521B263474Q4592O279K9931J08527M62044j27658k09442j2701k78709K28309
14511B554646J38425J17069j14791P2275n0742J68753j05653R4241K16825j9765
14501C071283K53147m88343L11203J06532l96339M78784j94229N5821L13934L63059
14491C874852l73741K54858m89650J68480O7000r8440L73011j53790l6171J63420
14481C749829j22472J7591K24645m2329N29906m78361J3361J51121j25835P3879
14471C991335K61239N9900l37148N35147J26546P4561j78664J42246J18961k81156
14461D512967q4627P58647o24744N06244m80547M49285r8965o486J65840J12260
$$ plain form
14531 2222965 1908935 2132772 2549021 1838317 1874007 2416807 2288655 2057803 2364452 2263474
14521 2263474 2348066 2354345 2384276 2492803 2954847 2827189 2617747 2605046 2326337 2554646
14511 2554646 2693071 2810140 2695349 2767624 2716882 2885635 2779982 2874223 3091048 3071283
14501 3071283 3324430 2836087 3147290 3253822 2857483 3336267 3142038 3197859 3511793 3874852
14491 3874852 3501111 3755969 3266319 3434799 3501799 3403359 3776370 3622580 3586409 3749829
14481 3749829 3627357 3644948 3869593 3827264 4357170 3878809 3892170 4043291 3917456 3991335
14471 3991335 4252574 4312474 3975326 4510473 4637019 4711580 4532916 4675162 4794123 4512967
14461 4512967 4428340 5186987 4562243 5068487 4587940 5037225 4938260 4931774 5097614 5209874
14451E209874j58905J15950L33040L9654j04436J98378o1032K44477p6380J68346
14441E908966j7819J3133K71588j7052R272n4280L07134J11494j05130m0031K54706
14430F641981K72134J83055j25723j06453K17587L8410L68336J74558k23269L78337
14420G818953K7496k80K84317K36285m6011M2885O5087Q5279M1892R8726K56362
14409H910991Q5153L8301N38359r7081J43383N71010m24129K92738L1557K22047
14399A0312329M41118O0217K89270k30678K88472K38642J62318J90436L12884
14390A2065008k46094M23405L35203Q9112K44130L17502K65084K59494m7665L22417
14380A4027596L71775L54835Q2464M55898J63259M48038L31414J01105O25419
$$ plain form
14451 5209874 5050969 5166919 5499959 5539613 5435177 5633555 5572523 5817000 5740620 5908966
14441 5908966 5891147 5904280 6175868 6158816 6168088 6113808 6420942 6532436 6427306 6387275 6641981
14430 6641981 6914115 7097170 6971447 6864994 7082581 7120991 7489327 7663885 7440616 7818953
14420 7818953 7846449 7846169 8130486 8366771 8320760 8363645 8428732 8514011 8555903 8654629 8910991
14409 8910991 8996144 9034445 9572804 9475723 9619106 10190116 9765987 10058725 10090282 10312329
14399 10312329 10753447 10813664 11102934 10872256 11160728 11399370 11561688 11752124 12065008
14390 12065008 11818914 12242319 12577522 12666634 12910764 13228266 13493350 13752844 13705179 14027596
14380 14027596 14399371 14754206 14836670 15292568 15455827 15903865 16235279 16336384 16961803
14371A6961803K5282M73369N99738J08233K60695O58862N00811L49231K52419
14362B0190443L77636L11609K93235P79055O56613K52313N66685N49395N44968
14353B4521952P79009M57920L99115J050725L94854P70800Q95199M37136M74864
14344C0181574J165844J048195O76187Q30852J084781P46446R25394J429104Q89833
14335C8978210J169170Q64132J521101J409722O82500J694314J315889J179398
14327D8814436J663944J759301J928881J910507J597636J812491J915601K224079
14319F3626876K017492K330685K385108K716850K546679K807919L072541L250831
14311H4754981L201488L248130L741874M123977L749117M458652M892999M882200
$$ plain form
14371 16961803 16987085 17460454 18060192 18168425 18429120 19087982 19588793 19938024 20190443
14362 20190443 20568079 20879688 21172923 21951978 22608591 22860904 23427589 23976984 24521952
14353 24521952 25300961 25758881 26157996 27208721 27603575 28374375 29269574 29706710 30181574
14344 30181574 31347418 32395613 33071800 33902652 34987433 35733879 36659273 38088377 38978210
14335 38978210 40147380 41011512 42532613 43942335 44624835 46319149 47635038 48814436
14327 48814436 50478380 52237681 54166562 56077069 57674705 59487196 61402797 63626876
14319 63626876 65644368 67975053 70360161 73077011 75623690 78431609 81504150 84754981
14311 84754981 87956469 91204599 94946473 99070450 102819567 107278219 112171218 117053418
14303A17053418M768939N485060N957286N893622O130225P146466P040654P772310
14295A67247980P855615Q438107Q646721R457205R468839J0435532J0533938J1266503
14287B43350440J1560158J1985867J2854892J3101587J3334953J3435306J3974750
14280C33597953J3954644J3646527J3267625J3029261J2012369J1240977R695171
14273D20444527P761341L954310K105782J865490q1728k677019l817527l778005
14265D25777171n777487q645100j1017437j2576748j3275024j4233069j4468905
14258C45783401j4970325j4779984j4544176j4309340j2552198j3160822j2907069
14251B48559487j2001480j2154109j1044477j0500824r767743r576705q899054
$$ plain form
14303 117053418 121822357 127307417 133264703 139158325 145288550 152435016 159475670 167247980
14295 167247980 175103595 183541702 192188423 201645628 211114467 221549999 232083937 243350440
14287 243350440 254910598 266896465 279751357 292852944 306187897 319623203 333597953
14280 333597953 347552597 361199124 374466749 387496010 399508379 410749356 420444527
14273 420444527 428205868 432160178 434265960 436131450 436049722 433372703 429555176 425777171
14265 425777171 419999684 411354584 400337147 387760399 374485375 360252306 345783401
14258 345783401 330813076 316033092 301488916 287179576 274627378 261466556 248559487
14251 248559487 236558007 224403898 213359421 202858597 193090854 183514149 174615095
14244A74615095p767798q132186p213073p092786o944440o231094n464085n322098
14236A20447535n364219m765902m936425m454889l999402l524396l646528l699745
14228H6056029l604450l169608k887354k539642k688624l030506k183955k500190
14220F3451700j874323j858030k491088j904530j487404k142089j236376j447722
14212D9010138j582090j483407j348135j009251j388511q83861j037638j286326
14204C8990919j133879j331459p14141r72190o50318j232820p34765q31478q24225
14195C0565644p81596n79250r51768j84684j499495k95274n08691m57025p09896
14186B4597965q75730j79450j97581r67003m82676m3996j068300r7338p07372
$$ plain form
14244 174615095 166847297 158715111 151502038 144409252 137464812 131233718 125769633 120447535
14236 120447535 115083316 110317414 105380989 100926100 96926698 93402302 89755774 86056029
14228 86056029 82451579 79281971 76394617 73854975 71166351 68135845 65951890 63451700
14220 63451700 61577377 59719347 57228259 55323729 53836325 51694236 50457860 49010138
14212 49010138 47428048 45944641 44596506 43587255 42198744 41314883 40277245 38990919
14204 38990919 37857040 36525581 35811440 34839250 34188932 32956112 32221347 31389869 30565644
14195 30565644 29784048 29204798 28253030 28068346 26568851 26273577 25764886 25307861 24597965
14186 24597965 23722235 23542785 23345204 22378201 21895525 21851529 20783229 20685891 19978519
14177A9978519l12160l36251j77790o40502j23941l49901m37965j30574l68113
14168A7101322l45847k25121p33219M2058m49362j54534o38049j71453j71210
14159A4254585n3819j87194l65625k67535k79038k80360j51614j02982j37567
14150A2428851n85846L0272q7564m61958K69147n02534J32318k08887m81747j81519
14140A0350533l32616R0140p2850k41325q4888j78619j57840J26664k07000M946
14130I297145n4958n59072Q0052N8834m04118k95521j48085J49613o1276m10552
14120G652062J79765l80096J45347l71324q5212K65587n85853L61988l10751k79236
14110F592277Q0164J23623l5834n18460L37382j91933M1420j30938O74o02447
$$ plain form
14177 19978519 19666359 19330108 19152318 18511816 18387875 18037974 17600009 17469435 17101322
14168 17101322 16755475 16530354 15797135 15839193 15389831 15235297 14597248 14425795 14254585
14159 14254585 14200766 14013572 13647947 13380412 13101374 12821014 12669400 12566418 12428851
14150 12428851 11843005 11873277 11785713 11323755 11592902 11090368 11222686 11013799 10532052 10350533
14140 10350533 10017917 10108057 10035207 9793882 9708994 9530375 9372535 9499199 9292199 9297145
14130 9297145 9242187 8683115 8763167 8822001 8417883 8122362 7974277 8123890 8062614 7652062
14120 7652062 7831827 7451731 7597078 7225754 7140542 7406129 6820276 7182264 6871513 6592277
14110 6592277 6672441 6796064 6760230 6241770 6579152 6387219 6428639 6297701 6298375 5695928
14100E695928J29132K42872l3868k03906k15331n3580J71020l04780k3111J54456
14090E558832m60128M53456n52322L41912o7714k27737j35501K64453k16240m17172
14080D541839K73709O9582k40307J08312K50112l04154K3906l07783J33504k84
14070D548436k51392J26998l71109m4827K44517j96838k11566K85359J05948n7796
14060D177730P7785o4136j22635J6775k37188k82618K94114l94240J71939J06346
14050C743872l5020N0263j95105q5630M5668m70707L23113m94355M72084N9714
14040C413897j94718M1765l03243n4225K8606L06399j95863j40932J79105Q5527
14030C166318k0656m27174N11522m15012J30845l76141L60866l76767M15086l93624
$$ plain form
14100 5695928 5825060 6067932 6034064 5830158 5614827 5561247 5732267 5427487 5404376 5558832
14090 5558832 5098704 5552160 4999838 5341750 5274036 5046299 4910798 5175251 4959011 4541839
14080 4541839 4815548 4885130 4644823 4753135 5003247 4699093 4722999 4415216 4548720 4548436
14070 4548436 4297044 4424042 4052933 4008106 4252623 4055785 3844219 4129578 4235526 4177730
14060 4177730 4255515 4191379 4068744 4085519 3848331 3565713 3859827 3465587 3637526 3743872
14050 3743872 3708852 3759115 3564010 3478380 3524048 3053341 3376454 2882099 3354183 3413897
14040 3413897 3219179 3260944 2957701 2903476 2932082 3238481 3042618 2901686 3080791 3166318
14030 3166318 3145662 2718488 3230010 2814998 2945843 2569702 2930568 2553801 2968887 2575263
14020B575263J99384j10919l97777O24160m78203k06043L34435o0885j02639J11861
14010B488637L60653l77251J04426r8763J56365k59799l1332j94945K21796m78411
14000A891376K11140J61045j61031K77983j48688K64972Q8553R4672m78468L14875
13990B516429M66824P47835K046512N355850J3023346J9270654j6929006j1671010
13982A4827434n098097l076383j655513n13901q69760j09807m85727O0350k15531
13973B863065j63574j87553K696M5309P5052k2514j87546k1752m1976k52748K64817
13962B373276J22637m13040K46203k31210l3741o5273L3441j8609j69760j68931
13952A674993J45429M19937j11395j94125K62254k75424J995J9040k48885j8355
$$ plain form
14020 2575263 2774647 2663728 2265951 2890111 2411908 2205865 2540300 2479415 2376776 2488637
14010 2488637 2849290 2472039 2576465 2477702 2634067 2374268 2342936 2147991 2369787 1891376
14000 1891376 2102516 2263561 2102530 2380513 2231825 2496797 2585350 2680022 2201554 2516429
13990 2516429 2983253 3731088 5777600 11133450 24156796 43427450 26498444 14827434
13982 14827434 9729337 6652954 4997441 4483540 3613780 3503973 3018246 3078596 2863065
13973 2863065 2699491 2511938 2514634 2559943 2634995 2612481 2424935 2403183 2361207 2108459 2373276
13962 2373276 2495913 2082873 2329076 2097866 2064125 1998852 2032293 2013684 1843924 1674993
13952 1674993 1820422 2240359 2128964 1934839 2197093 1921669 1923664 1942704 1693819 1675464
13942A675464K89308O5087j98981J13612n13044L10922K5328l68780N60018n95309
13932A363625L65542J11144m15658R3553J13622n2551j06243o9459j40149K98724
13922A562150Q1881k39826j17894k6407J24973J43283O2776k28742O9810n6407
13912A375597m4313K29812j15595l83678M90830M982j19053k76881M66462m03557
13902A224606K29933k04791J15325p5003P6409J8799m0600j93369K38362m6557
13892A343114k33847K54054m8086j13577j94917J54918O6734n3245p9593K73930
13882A369485m74727L77327j51182O952j43072Q5649K03213l01645K11228J48423
13872A331651P2542n21239J49563J46686J54496k57485K29839o40466Q20827o23147
$$ plain form
13942 1675464 1964772 2029859 1830878 1944490 1431446 1742368 1767696 1398916 1958934 1363625
13932 1363625 1729167 1840311 1424653 1518206 1631828 1579277 1473034 1403575 1263426 1562150
13922 1562150 1644031 1404205 1286311 1259904 1384877 1528160 1590936 1362194 1432004 1375597
13912 1375597 1331284 1561096 1445501 1061823 1552653 1557635 1438582 1161701 1628163 1224606
13902 1224606 1454539 1249748 1365073 1290070 1366479 1385278 1344678 1151309 1389671 1343114
13892 1343114 1109267 1363321 1315235 1201658 1006741 1161659 1228393 1175148 1095555 1369485
13882 1369485 894758 1272085 1120903 1127855 984783 1070432 1273645 972000 1183228 1331651
13872 1331651 1404193 882954 1032517 1179203 1333699 1076214 1306053 665587 1486414 863267
13862H63267R4616M1650P0436L13733k86524P6161q9675K99435l72463J22361
13852A132997j08731J307p257K31679l90901m8755K72967N7320n27646N71117
13842A184097k82808M42805k50330j92207K98708m73433L80193k92298K64656
13833A079383n35605O75089j50377l1522l39035K31695k0926L2890l140J17120
13823A055572o8905k02347J25996K27246l59610J11988k6435j3980k06464N0283
13813F93344K98374j46182k1812j55286J12663J78454j60180j71556L28056L6539
13803I92414m69366K17262o8727Q5517k27764K40246Q1612K54264l94254J54339
13793H65543D14911N47444j93005j53489M63816l73366o712K79651l5012k59642
$$ plain form
13862 863267 957883 999533 1069969 1383702 1097178 1173339 1083664 1383099 1010636 1132997
13852 1132997 1024266 1025573 1018316 1249995 859094 810339 1083306 1140626 612980 1184097
13842 1184097 901289 1344094 1093764 901557 1200265 726832 1107025 814727 1079383
13833 1079383 543778 1218867 1068490 1036968 697933 929628 908702 941592 938452 1055572
13823 1055572 986667 784320 910316 1137562 777952 889940 863505 849525 643061 693344
13813 693344 991718 845536 823724 668438 781101 959555 799375 627819 955875 992414
13803 992414 523048 740310 671583 757100 529336 769582 851194 1105458 711204 865543
13793 865543 414911 962355 769350 615861 1079677 706311 699599 979250 944238 684596
13783F84596K7297j97361M35797l23053Q0695j4854O8541J6968J68280D01669
13772I60128j10661k83656J24088J28052o5632j67585m300K52145j09239P0248
13762G93588k00294J54177M6496k9823J25893l43149K8963J78049R1427j52530
13752F92797l1884j78296L32931j40448J73803C88730M07516k81988K65580k48023
13742E31815K60427l913K9089j92825j39658K0459l9154M0157m3353L3015K08768
13731G04827j53633L0738K37290j99719j86145M30622k91851r7374B22991K36688
13721D59679q0658L48458j92212M9559J09346j83699M09240C99010J06367k0614
13711D84763J23620j0559k01073k5445J72722n7964m7786J09247j20247K77604
$$ plain form
13783 684596 711893 514532 950329 627276 707971 693117 761658 778626 946906 401669
13772 960128 849467 565811 689899 817951 752319 584734 580434 832579 723340 793588
13762 793588 593294 747471 793967 764144 890037 546888 575851 753900 845327 692797
13752 692797 660913 482617 815548 675100 848903 388730 796246 514258 779838 531815
13742 531815 792242 788329 817418 624593 484935 505394 466240 506397 463044 496059 704827
13731 704827 551194 581932 819222 619503 433358 863980 572129 474755 222991 459679
13721 459679 379021 727479 535267 584826 694172 510473 919713 399010 505377 484763
13711 484763 608383 597824 396751 371306 544028 486064 438278 547525 427278 704882
13701G04882k06571G6704M71373Q8462k91144r7282L38531q9884J68549k60312
13691D04997p9305J83840J35116m9225k79965L43931C02287L41147l5877k82956
13681C24601K36911O7664k49807M84797j50747C51477J74742j97161J57703j5373
13671D71388A07905N25582A94509R7143J63784K1693K6918K2298A92346K38759
13661D31105L48873C69035K45448j71049J10445n8139p1632J00175j96464m8644
13651B79175A8678M05662k0278A72367L76636r8316j63245L0766J03377A64527
13640A92116K10698J1924j03157J29419R1451B64303K16451E2204N24346B83021
13629D01868o5401K09448j22028Q2916A83289J86633R9427q1193M4710k07514
$$ plain form
13701 704882 498311 76704 548077 636539 345395 248113 586644 496760 665309 404997
13691 404997 325692 509532 644648 595423 315458 659389 302287 643434 607557 324601
13681 324601 561512 629176 379369 864166 713419 351477 526219 329058 486761 471388
13671 471388 107905 633487 194509 291652 455436 477129 504047 526345 192346 431105
13661 431105 779978 369035 614483 443434 553879 495740 424108 524283 327819 279175
13651 279175 18678 424340 404062 172367 549003 450687 287442 318208 421585 164527
13640 192116 402814 414738 311581 441000 532451 264303 480754 52204 576550 283021
13629 401868 336467 545915 423887 506803 183289 369922 469349 388156 432866 225352
13619B25352L59305B67784M02789A47767L01452B21336n2924P6866L96863k13484
13609D28657k7962m862K48578A85858K84306J06956k67003n4499j07384K49509
13599C97743Q1186j22668m9280M130J44566A22449K58832p4889M3984j08641J9787
13588B61522J62288I5974J10089H6589R123J77755n0419Q4906Q4888j73125P624
13577B27341J58466j60766Q0872A05011N2687K40413j73819J17903A11222L60007
13567D71229A86621J58714p2582J47995J12814G4442N92845p5650B04920K53313
13557D58233K47750j81497B02034L14681B35083o7950J82798J33127l6982b20336
13546E88149k69592J4926j08617I2673K34637k61A30996K99098A71513J72647
$$ plain form
13619 225352 584657 267784 670573 147767 449219 221336 168412 245278 642141 428657
13609 428657 400695 395833 644411 185858 470164 577120 310117 255618 148234 397743
13599 397743 478929 356261 306981 311111 455677 122449 381281 306392 350376 241735 261522
13588 261522 423810 95974 206063 86589 95712 273467 223048 307954 392842 219717 227341
13577 227341 385807 225041 305913 105011 157698 398111 224292 342195 111222 471229
13567 471229 186621 345335 272753 420748 533562 74442 667287 591637 204920 458233
13557 458233 705983 524486 202034 516715 235083 167133 349931 483058 446076 -220336
13546 588149 318557 333483 224866 92673 327310 327049 130996 430094 171513 344160
13536C44160j62828J97757l8392J01700L07553C14853D4459K90040l7064K2406
13526C19841K47464B42082N5087n3046J65580b3360F80389a00620A55950K27886
13516C83836j57223k7828P3290l6890P4567L71149l01076a05334D2849N00931
13506E43780k66197N1052M8643j77677J00659m2572O5745K26677B46356Q8885
13496C35241j59909F8091K16746L36444k36991f3371C0286K57482p1484Q8960
13486C05244m1291r9825k7038M31078H3937L17488j69326H0138N21417B68007
13475C65428b00025D15560J4603j40299C6145R4634O1066J6964O9027A36257K30180
13464C66437A50463O2221j9236J96376J8736b48041C33259J86266B22481g2086
$$ plain form
13536 344160 181332 379089 340697 442397 749950 314853 44459 334499 297435 319841
13526 319841 567305 242082 297169 244123 409703 -23360 680389 -100620 155950 383836
13516 383836 226613 198785 272075 235185 309752 680901 379825 -105334 42849 543780
13506 543780 277583 328635 377278 199601 300260 257688 323433 550110 246356 335241
13496 335241 175332 68091 284837 621281 384290 -63371 30286 287768 216284 305244
13486 305244 263953 164128 137090 568168 83937 401425 232099 80138 601555 268007
13475 365428 -200025 415560 430163 289864 36145 130779 191845 208809 277836 136257 366437
13464 366437 150463 212684 193448 389824 408560 -248041 333259 519525 222481 -72086
13453B5664J73346H5795L01106J3923j87567P6616o9417J49803A13590Q0518F7155
13441E14881A03017L22347A77398G1390K16332Q5930j01393a85982E38063B7194
13430D00609N0026H3513K68019L3066e1848m3476E24682A57895D8276J33822L88231
13419E70329A17726K3282J17329n4774F4661K09600J36322A67748K03870j34202
13409B37416L1717B9404K48332G4773N19210B24934A12365N7318J11265I7390
13398B84034c2544C09488j26629e0528D34356j34083A39261N3102D8648L09119
13388C57767j50813A9214J56423e090j11359B52116o8262J33136R5888O1715A01214
13376B66646A2175L04108l9129g4198A94049n1316K24416j1588j75413o2390L1360
$$ plain form
13453 25664 199010 85795 386901 400824 213257 289873 220456 370259 113590 194108 67155
13441 514881 103017 425364 177398 71390 287722 373652 272259 -185982 538063 27194
13430 400609 450635 83513 351532 384598 -51848 -95324 524682 157895 48276 182098 570329
13419 570329 117726 141008 258337 203563 64661 274261 410583 167748 371618 237416
13409 237416 269133 29404 277736 74773 593983 224934 112365 169683 280948 97390
13398 284034 -32544 309488 182859 -50528 434356 300273 139261 192363 48648 357767
13388 357767 206954 19214 175637 -5090 -116449 252116 183854 316990 412878 474593 101214
13376 266646 12175 316283 277154 -74198 194049 142733 367149 355561 180148 117758 149118
13365A49118J35274j8121L58218B64326a26975A34972F6435K15263A00712J77226
13355B77938i0834L4842A25780J59854K6916j30106d222A15169J18997o0206G6785
13343C12163j36914L0604J43059L6125a3197H3848J70687h2574j65505A92712
13332C45199j00981E6832K09060e962A28777b49321B04179G6904K49581I612K90560
13321C00172f1881A61768D9038K06391r1072O7043K64858A2020J70866J63047
13311C45933n2909d472B55636A02010L38250G9735J2477J38593L6514q2226a0780
13299B15657k1434B0630J8549j14h0902A48911p0874C8506P3270d3496B55372
13287a43644B64398D2526j7299b26380A02350O6888J13301l5601K36006c9811
$$ plain form
13365 149118 284392 266271 624489 264326 -126975 134972 66435 281698 100712 277938
13355 277938 -90834 -55992 125780 285634 312550 182444 -4222 115169 234166 173960 76785
13343 312163 175249 205853 348912 385037 -13197 83848 254535 -82574 -248079 192712
13332 345199 244218 56832 265892 -5962 128777 -249321 204179 76904 326485 9612 300172
13321 300172 -61881 161768 49038 255429 164357 231400 496258 12020 182886 345933
13311 345933 293024 -4472 255636 102010 440260 79735 92212 230805 267319 185093 -10780
13299 215657 194223 20630 39179 39065 -80902 148911 78037 38506 111776 -43496 255372
13287 -143644 264398 42526 25227 -226380 102350 169238 282539 246938 482944 -39811
13276C47596J7a10463I5177a39340E4010J63384K74517j10025o9798I3914i426
13264A50567J39940a66103I1748a14555j77331C11053d8332A79060l4886a8249
13253A89868o6867P4858e788l420B52601b22041e7253A98530c44340a09778C11849
13241B23852l2324D8067K28528j7876j03641p0460J41570J1324o382J99056h296
13229B07154d6140A63906b7598A95096k3231n8425J40729E401d927C2808J0020
13218D2828L41060H231J35134L2721P5673A10454K2360K6116J4613a1699C114
13206a4151p0093C62705D584J21614a158k2251e057A91518E519L17664F8355l6
13194F8319b85932E20711A7641b48731d3435B52864a60193a5514m0110A02840
$$ plain form
13276 347596 347613 -110463 95177 -139340 54010 217394 491911 381886 312088 93914 -9426
13264 150567 290507 -166103 91748 -114555 -291886 311053 -48332 179060 144174 -18249
13253 189868 123001 197859 -5788 -9208 252601 -222041 -57253 198530 -344340 -109778 311849
13241 223852 191528 48067 276595 258719 155078 84618 226188 237512 231130 430186 -8296
13229 207154 -46140 163906 -27598 195096 171865 113440 254169 5401 -4927 32808 42828
13218 42828 383888 8231 143365 176086 251759 110454 132814 158930 173543 -11699 3114
13206 -14151 -84244 362705 4584 126198 -1158 -23409 -5057 191518 5519 323183 68355 68319
13194 68319 -285932 520711 17641 -248731 -43435 252864 -160193 -15514 -55624 102840
13183A41453M3768F9687A5154a16527I9138g0417B86083c3039B61430I7600J7191
13172A14791L3651J87404a9372E633J79868k7709J37049n3461a582A80750R7459
13161B78209Q9570A29508Q085m3151b34582A89990F2949B1542J27479k2175J9667
13150A46513q498J26335a27254B83071D4938L05068A47414K68389A5698L34820
13140C50518l8353c8902C98447J8134i84B4659g1555A16903g7422I3915D500J4770
13128A9270J21665a27359C30786A31282P1298N5561n2060L60591a87499A57452
13117C62847A63583a35190I3102P7096G0106J13447l7573J49464p8334I3421k0615
13106G2806c1075C15840A19159j4158N5913l4318l7289E762L08295i3124C0389
$$ plain form
13183 141453 185221 69687 15154 -116527 99138 -70417 286083 -33039 261430 97600 114791
13172 114791 148442 335846 -19372 5633 185501 157792 294841 241380 -1582 180750 278209
13161 278209 367779 129508 137593 94442 -234582 189990 62949 21542 149021 126846 146513
13150 146513 138015 264350 -127254 283071 44938 350006 147414 415803 15698 350518
13140 350518 312165 -38902 398447 416581 -984 24659 -71555 116903 -77422 93915 4500 19270
13128 19270 140935 -127359 330786 131282 202580 258141 206081 566672 -187499 157452
13117 362847 163583 -135190 93102 170198 70106 183553 145980 295444 217110 93421 72806
13106 72806 -31075 315840 119159 105001 160914 126596 89307 5762 314057 -93124 30389
13094b64856a10080j33227J09521C32177f7375A35870J15798b578n3263A59955
13083B47900e8383B66814C4206a06598A9419J2907b12226B7773e1677F6941K18109
13072B85050e1610A07081E728h1481J0276A00069J9740m5135a9022j7264j14305
13061a50591C10984e2628G482h286H0234P9624C0098O9443K4895Q3505P494A9995
13048c504B40802b6725l41646A20033c3700f971G9900L1866c0494C48223H3053
13036a45329A0843J54324A1123L4378a38038H3314C3971J72531C4615K31532A04433
13024A53659O2249I9762f0808H9712O2944L4989f0641A87058R6105H5800J58864
13013B44664C9966N0257d2336B9704i8087F1954a6184A53357A496J46277K42421
$$ plain form
13094 -264856 -110080 -243307 -133786 332177 -67375 135870 251668 -2578 -55841 159955
13083 247900 -58383 266814 34206 -106598 19419 32326 -212226 27773 -51677 66941 285050
13072 285050 -51610 107081 5728 -81481 -71205 100069 119809 74674 -19022 -36286 -150591
13061 -150591 310984 -52628 7482 -8286 80234 159858 30098 99541 124436 207941 215435 19995
13048 -3504 240802 -26725 -368371 120033 -33700 -6971 79900 111766 -30494 348223 83053
13036 -145329 10843 165167 11123 45501 -138038 83314 33971 206502 34615 266147 104433
13024 153659 215908 99762 -60808 89712 152656 187645 -60641 187058 283163 85800 244664
13013 244664 39966 90223 -42336 29704 -98087 61954 -16184 153357 1496 147773 390194
13002C90194A8183G585K43327J3240E0355a41491a8548r0407k8707I0113a1184
12990b02285f4848R898j39087D4143A1239a4927G6970J92926c1420l85796C10302
12978B5921J37089O2151o1399a83240D31092b9765D0923K35471j03625a71279
12967f2474A969b68906D4878J181N662d22265c5098l4704A65193i7294H4928O1847
12955A46775a24676B0366J9418j1317J12853P1912I5074A222J82667l9255k2615
12944A22019a45732D14042D824c67879a07168G4611f0957B89593n4150a14600
12933A9572K39766b52859i5497k4488j01747F0838L50393a94376j69743C09123
12922c42970b6918I0179J3022C1388J49226A5599e8793q1800j6489A17892b08301
$$ plain form
13002 390194 18183 7585 250912 264152 50355 -141491 -18548 -108955 -137662 90113 -11184
12990 -202285 -64848 -54950 -194037 44143 11239 -14927 76970 269896 -31420 -417216 310302
12978 25921 163010 225161 163762 -183240 431092 -29765 40923 276394 172769 -171279
12967 -62474 1969 -268906 44878 46059 51721 -422265 -35098 -69802 165193 -97294 84928 146775
12955 146775 -124676 20366 39784 28467 141320 213232 95074 1222 183889 144634 122019
12944 122019 -145732 414042 4824 -367879 -107168 74611 -60957 289593 235443 -114600
12933 19572 259338 -252859 -95497 -119985 -221732 60838 411231 -194376 -364119 309123
12922 -342970 -26918 90179 103201 31388 180614 15599 -58793 -140593 -157082 117892 -208301
12910B14173K4124j10449L6874o8784h8133M3808G5258k9271P0330J61002A17092
12898i2550A76401R6107c2627p9628B26152b0301A93564a8550A05374a30390A65253
12886I2421f9579L3836H2539b6334D8433k0203J23330c0338a2490j63331A95380
12874G4132d5978j17301H5628d4348B18267c9656m8920D72361a31438B61823b2729
12862D5062N9707b5475A15616g2798q944k34745C99926F799M20a64435C34155
12850a55923F0965F575J06472b87371I2667b94829B07570a04505A16768b04269
12839B98728b9554D3182f2479B90646h5606N997A2294a4467m49163a31828L9581
12828i2247B5518K96803G5085b74530D6907L21153b9237n4467J8752A62341n6578
$$ plain form
12910 214173 238297 127848 164722 95938 -88133 -44325 75258 45987 116317 277319 117092
12898 -92550 176401 272508 -32627 -112255 226152 -20301 193564 -18550 105374 -130390 165253
12886 92421 -69579 -35743 82539 -26334 48433 28230 151560 -30338 -12490 -175821 195380
12874 74132 -45978 -163279 85628 -44348 218267 -39656 -88576 472361 -131438 261823 -22729
12862 45062 104769 -25475 115616 -72798 -81742 -316487 399926 6799 7219 -164435 334155
12850 -155923 60965 6575 113047 -287371 92667 -294829 207570 -104505 116768 -204269
12839 298728 -29554 43182 -62479 290646 -85606 -79609 12294 -14467 -463630 -131828 -92247
12828 -92247 25518 322321 75085 -274530 46907 368060 -29237 -83704 -64952 162341 105763
12817A05763l7097a12793A49203F8675P8637A9592a44406b4054C62081j34457
12807B27624e3457A31587g1866j22690B57411b34775I6853f6745k53795a9373
12796B7136K22688a5970k0119p3311M6757C20177A0470K08504J1375G8756b92341
12784A29927A0991K0951a14088c1827A0003e2350e542A58437B4097b4260B5147
12772a22298k7653H1033C289M71797I8150b22240A19088g2108A24879B4630K85432
12761C10062f6726n2812C59031a18442B7156K6703J8262c3876H290g3618C52607
12749a10645k85883A33749f0289A66538a43464n8374B15990r1103c0811E9789
12738h6557m1106a5656A20623l1834b19286A60310l9581b1101p3400N435d2276
$$ plain form
12817 105763 68666 -112793 149203 68675 147312 19592 -144406 -24054 362081 227624
12807 227624 -53457 131587 -71866 -194556 257411 -234775 96853 -66745 -320540 -19373
12796 27136 249824 -15970 -36089 -109400 -62643 320177 10470 218974 230349 78756 -292341
12784 129927 10991 31942 -114088 -31827 10003 -52350 -5542 158437 24097 -24260 25147
12772 -122298 -149951 81033 3289 475086 98150 -222240 119088 -72108 124879 24630 310062
12761 310062 -66726 -119538 359031 -118442 27156 53859 72121 -33876 8290 -73618 352607
12749 -110645 -396528 133749 -60289 166538 -143464 -201838 215990 124887 -30811 59789
12738 -86557 -127663 -15656 120623 88789 -219286 160310 120729 -21101 -94501 -89066 -42276
12726C1011Q6899J17558a05783A84020c7199c071j25009A77214n9688J70315c85662
12714A62261d8563C75905a8723j93310B37811q7490K55425b8108A37248a98780
12703C5470K37708H8200e0829E6298J21344J39609g0421a9888A2257f9526A21281
12691B75439c48938a64694C5421J9708J08697n1283K15489b84344b972A43449
12680B23483F1764J50044m343j2097F5552K32893J25391I125h5786A07723m6601
12669F1122B8264K4938J2078i3146A10186c08880C9102b0339B04106F6356a8055
12657A57628J8527g6016A88056e8571k16980B26440A00681J17407F0893L26268
12647C87161a23226a5317l97238a89266c1365A01235a4792k69435C10199A239
$$ plain form
12726 31011 117910 235468 -105783 184020 -37199 -3071 -128080 177214 117526 287841 -385662
12714 162261 -48563 375905 -18723 -212033 237811 150321 405746 -28108 137248 -198780
12703 35470 273178 88200 -50829 56298 177642 317251 -70421 -19888 12257 -69526 121281
12691 275439 -348938 -164694 35421 55129 163826 112543 328032 -284344 -2972 143449
12680 223483 61764 211808 207465 195368 65552 298445 423836 9125 -85786 107723 61122
12669 61122 28264 53202 65280 -93146 110186 -308880 39102 -20339 204106 66356 -18055
12657 157628 176155 -76016 188056 -58571 -275551 226440 100681 218088 60893 387161
12647 387161 -123226 -15317 -412555 -189266 -31365 101235 -14792 -284227 310199 1239
12636a89740F1498m934K72492A28444O1904J2387D2706g8517j973K1143I8863
12624C52193q1739a919m21196B53716N7976f511j20301A94730F2973K57963a05382
12612A8514L8521o510c34855C06459b16129C5463J25592E3393i6841A05076A3951
12600a1769G7695k3277a64066B04689d5853r8308b3111l08937D3510e7492G6085
12588a92815C2527J84322k9792K7261h4135A44839K2590G8976d1574j60085b8463
12576I0902l0869e2441A38890J00515d879B05232k9758b10064B07184a32789A28162
12564A48261p0067M8305d9912A60848h8853C0309a56136B9771a45641O0001n4734
12553a40374R440a8819m7154o644j5304L4057B07038a64877h1998H4254K39312
$$ plain form
12636 -189740 61498 56564 329056 128444 190348 202735 42706 -78517 -80490 -59347 98863
12624 352193 270454 -1919 -423115 253716 311692 -6511 -126812 194730 62973 320936 -105382
12612 18514 57035 50525 -334855 306459 -216129 35463 161055 53393 -96841 105076 13951
12600 -11769 77695 54418 -164066 204689 -45853 -144161 -23111 -332048 43510 -57492 76085
12588 -192815 32527 216849 187057 214318 -84135 144839 167429 78976 -41574 -201659 -28463
12576 90902 60033 -52441 138890 239405 -4879 205232 175474 -210064 207184 -132789 128162
12564 148261 78194 126499 -49912 160848 -88853 30309 -156136 29771 -145641 -85640 -140374
12553 -140374 -130934 -18819 -65973 -72617 -87921 -53864 207038 -164877 -81998 84254 323566
12542C23566c1963l92147J02450h1765H267a41027A3104a02481j4145j7171m7230
12531a81027G8965K31153f8902p1943A61254H496g8504A26177b73490F9937J29087
12520A99024h2848A25260f8016I7617h8913K2626B02973b11158C4219J5064P495
12509E6778J27468C8712A7244c2160A01398d2516j88519B41778R7646b9585C37740
12497g7466J3503B38541C0950a36345k29705B17637b44298B39849p2736Q3895
12487B51008a3521C468N4416A0697R1894J80192E4644O337b30998a05458B18241
12475D740L34857A62503E6598k1351a51863j08314o841B4351L1224a44559e8771
12463B65479j28b8535B79204I4560a29859m200j1193E7610F658J32927c8587A13854
$$ plain form
12542 323566 -31963 -424110 -321660 -81765 8267 -141027 13104 -102481 -116626 -133797 -181027
12531 -181027 78965 310118 -68902 -140845 161254 8496 -78504 126177 -273490 69937 199024
12520 199024 -82848 125260 -68016 97617 -88913 -66287 202973 -211158 34219 49283 56778
12509 56778 184246 38712 17244 -32160 101398 -42516 -231035 241778 339424 -29585 337740
12497 -77466 -63963 238541 30950 -136345 -366050 217637 -244298 239849 167113 251008
12487 251008 -13521 3468 57884 10697 102591 282783 54644 60981 -230998 -105458 218241
12475 4740 339597 162503 56598 35247 -151863 -260177 -267018 24351 55575 -144559 -58771
12463 265479 265351 -28535 279204 94560 -129859 -134059 -145252 57610 6658 139585 -38587 113854
12450e2737D3508d0977f893A85906f2030j58647H8161a4683j7631I6939D312J0362
12438A4674J07996J68387b14500e4703j71709d811A10812D193a37873b4347B799
12426b16225j40655J08886c0679j40076m3045M8545n2079G0442K31262j33193
12416A68511L0863a95229C04964a18524A0907L1208b21846r9730E36132a66205
12405B0866K23840b40129d993B00447g7936D178M7753g68A02592d5118H4383Q0004
12393A64387c7006j03736j29577e2877p4893b2197A5694e7229C8632h9589A02287
12381A44799g4343g521B81022a02464D5426g6944k45212f8869B11008a92870D01
12369a13564A28212b72880B34175q7537f3406G3597r432b29723J4709A6398a85726
$$ plain form
12450 -52737 43508 -40977 -6893 185906 -62030 -220677 88161 -14683 -32314 96939 4312 14674
12438 14674 122670 291057 -214500 -54703 -226412 -4811 110812 4193 -137873 -24347 2799
12426 -216225 -356880 -247994 -30679 -170755 -213800 -165255 -217334 70442 301704 168511
12416 168511 199374 -195229 304964 -118524 10907 42115 -221846 -321576 536132 -166205
12405 20866 244706 -240129 -4993 200447 -77936 4178 51931 -768 102592 -45118 84383 164387
12393 164387 -37006 -140742 -270319 -52877 -127770 -22197 15694 -57229 38632 -89589 102287
12381 144799 -74343 -7521 281022 -102464 45426 -76944 -322156 -68869 211008 -192870 401
12369 -113564 128212 -272880 234175 146638 -63406 73597 64165 -229723 -215014 16398 -185726
12357b69728F8014J20657d6742r934k35532a13334A37130A8331K20219D6697j1585
12346C5112M1198J57125b02098A83351b7743A09392R9211g9770O777q0153b095
12334B39730b06227A83404H2920O8449c06242G8521j9952J75642c7920q8009H9252
12322E5559a32933L8628A2077e8302D6534c25161F4076b17582I6169J97354g4416
12310C1977a96517c8877m2205j31725B85146B2902J00800J46462j25514D7374
12299I8287f4341A00734d5073j54269M32B50469D0139a9260I4809k4440Q9755
12288A60124l9331h5166j59905J08534A31179C5419K20673I6603b96282C07208
12277e8287B33680K206C458P2979J63445J64773c4790B70407g0556F2489J22128
$$ plain form
12357 -269728 68014 188671 -46742 -56676 -292208 -113334 137130 18331 238550 46697 35112
12346 35112 76310 233435 -202098 183351 -27743 109392 208603 -79770 -72993 -153146 -2095
12334 239730 -206227 183404 82920 151369 -306242 78521 58569 234211 -37920 -125929 89252
12322 55559 -132933 -94305 12077 -58302 46534 -325161 64076 -217582 96169 293523 -74416
12310 31977 -196517 -38877 -81082 -212807 285146 22902 123702 270164 144650 47374
12299 98287 -64341 100734 -45073 -199342 -198910 250469 40139 -19260 94809 70369 160124
12288 160124 120793 -85166 -245071 -136537 131179 35419 256092 96603 -296282 307208
12277 -58287 233680 235886 3458 76437 239882 404655 -34790 270407 -70556 62489 184617
12266A84617Q5895b45649B11825C8123K59109j08925o2904b54565A78776b2777
12255c02963a2562A79342a06630B15078n5009k0081M8601G9466N894M352J58826
12244B48538a37495B4926b13497E7269J41408j5448m1852j4696L6621D1884h1844
12232a56434d064j12721k8472C40173a66737A05431K11727j00254E1294a5061
12221B57377m446j20054M13988D8584b5000A50143R9605P8266a34565A69909p6253
12210I3656k2372M0886c4505C56010A40791B4885a61036B99989h2790C15417r4997
12199B20420K29228B05132B0085J51777l1774a11037C63057D5260j0412K48542
12189B83390j3695K10652b3221C58143A76622J76925j21249a76651A35853L39603
$$ plain form
12266 184617 270512 -245649 211825 38123 297232 188307 125403 -254565 178776 -22777
12255 -302963 -12562 179342 -106630 215078 160069 139988 188589 79466 85360 89712 248538
12244 248538 -137495 24926 -213497 57269 198677 183229 141377 126681 163302 41884 -81844
12232 -156434 -4064 -116785 -145257 340173 -166737 105431 317158 216904 51294 -15061
12221 257377 252931 132877 546865 48584 -25000 150143 249748 328014 -134565 169909 93656
12210 93656 71284 112170 -34505 356010 140791 24885 -161036 299989 -82790 315417 220420
12199 220420 449648 205132 20085 171862 140088 -111037 363057 45260 34848 283390
12189 283390 269695 480347 -23221 358143 176622 353547 232298 -176651 135853 475456
12179D75456A59990L8510c8189A86600B6326K7251L14194K0494j63040f4888D16592
12167A76087E5589o699J33207A8729a15224A73822O4611D2558A9701a56275A42648
12155A38858P8562L22296a85754A31944L8733i1097j09143B06554N8795K0448
12145B85797m4483o9000N2757a17863B79200k1186E7343d6486A54008a23454B20925
12133d1308J3917l75581J79008H7741a45914j27250A27547n2461P834h2816p737
12122i0553d819B63715j00674P5872A2499a27479M8906K0241C26658m9160a06853
12110c0385r769l7031P084A74360K44985G2044P740a07754C8030G138f3188k0309
12098h3497f982D4911J70418a37360A46284N5075J7601L1823g0783K7513j66055
$$ plain form
12179 475456 159990 198500 -38189 186600 26326 53577 367771 388265 225225 -64888 416592
12167 176087 55589 48890 182097 18729 -115224 173822 238433 42558 19701 -156275 142648
12155 138858 217420 539716 -185754 131944 170677 -91097 -200240 206554 265349 285797
12145 285797 241314 172314 225071 -117863 279200 258014 57343 -46486 154008 -123454 220925
12133 -41308 -27391 -402972 -223964 87741 -145914 -273164 127547 75086 82920 -82816 -90553
12122 -90553 -4819 263715 163041 238913 12499 -127479 -78573 -58332 326658 277498 -106853
12110 -30385 -40154 -77185 -70101 174360 419345 72044 79784 -107754 38030 7138 -63188 -83497
12098 -83497 -6982 44911 215329 -137360 146284 201359 218960 250783 -70783 -43270 -209325
12087b09325h6035L9553j76659k466C2808h734j97842b5907j56163L7513m1077
12076a85634j6759h408B08254a89879j27316J06647A38001a31852q6785B68697
12065F6303O4858a38092F54392L45464D24463h1757I3022Q7155a25659A72912
12054f7612D1636a75496A2124h7035D53741c13236J38710C17241a68225b6626
12043F0760J5535k2912e2864j14793A30818f5646j02525r5842C7977b12693A28177
12031A49763a15631D3527h9512p1854p3305a6321j36714D25902h4677L3520a1635
12019g1219j9540C40208i8940A29532b15451i6868j20335h8994a5678B6804a17422
12007E0623J05671N4386H6688l9309b8759j6538C9246L59745A10848J38085r5756
$$ plain form
12087 -209325 -86035 -46482 -223141 -225607 32808 -8734 -206576 -25907 -182070 -144557 -185634
12076 -185634 -202393 -8408 208254 -189879 -317195 -210548 138001 -131852 -218637 268697
12065 66303 131161 -138092 654392 999856 424463 -81757 93022 180177 -125659 172912
12054 -67612 41636 -175496 12124 -87035 453741 -313236 -174526 317241 -168225 -26626
12043 60760 76295 53383 -52864 -167657 130818 -65646 -168171 -264013 37977 -212693 128177
12031 149763 -115631 43527 -89512 -161366 -234671 -16321 -153035 425902 -84677 -51157 -11635
12019 -71219 -90759 340208 -98940 129532 -215451 -96868 -217203 -88994 -15678 26804 -117422
12007 50623 156294 210680 86688 47379 -28759 -45297 39246 398991 110848 248933 153177
11996A53177b46636a10730H0909i4553C8255N2237d2602C1246M967J81090a91230
11984b34695A62395a22771A47610d14817J1028a27675J9634m63476B33787J20893
11974C54680A48449b2713I8133Q5757e02642A7789g2235K0136J37F7249K15579
11963B82828b25665C57234A44060e1693A6705P5943d0083G5220a35244n6397I4478
11951d6071A9169L11208C0824a62750A70786c43447b8022A12510m6459i5000d321
11939B41446q5570B1736a03757L7556B11981c8593k135B53065h8893B63599j17029
11928A46570b45392A59764d4653G4339i6443G463P0143k456K881m014c8305A48249
11915E8547J54045a12221k2295B7181b80498j03516C56316d8830l7929B25173
$$ plain form
11996 153177 -246636 -110730 80909 -94553 38255 90492 -42602 31246 36213 217303 -191230
11984 -234695 162395 -122771 147610 -414817 -403789 -127675 -108041 -571517 233787 354680
11974 354680 148449 -22713 98133 183890 -502642 17789 -72235 -52099 -51962 67249 282828
11963 282828 -225665 357234 144060 -51693 16705 92648 -40083 75220 -135244 -191641 94478
11951 -46071 19169 330377 30824 -162750 170786 -343447 -28022 112510 66051 -95000 -4321
11939 241446 155876 21736 -103757 -66201 211981 -38593 -40728 253065 -88893 263599 146570
11928 146570 -245392 159764 -44653 74339 -96443 7463 77606 75150 78031 74017 -38305 148249
11915 58547 212592 -112221 -134516 27181 -280498 -384014 356316 -48830 -86759 225173
11904H0487c8760r7395a5113A85646q6111J3173a14887K1238B94741i440l33203
11893c42643A22481a98768O7970c4603F9542J37651p7529g3798D2858e8482l27991
11882c86473b0781A44312J93861c14740F5570c16554a06156b2524j27530E1744
11871i1888j32411R5064B18853a82465r6301a21307b0194j57277c4717C85228
11860a66061F3411j5820P692N46a03394B9597a48954B9831a44991A27684K40256
11849C67940c7959j22125M0118B07612q4342c55853A87921a39263a6472H7230
11838B0328b62121a03636r6804A53183d06707F6359N5549a95205I5552m5423a76521
11826B73184b5506j42893o8659l8475G8922d5047B75186o5951d1614I4684P3676
$$ plain form
11904 80487 -38760 -136155 -15113 185646 99535 112708 -114887 -93649 294741 -9440 -342643
11893 -342643 122481 -198768 -130798 -34603 69542 207193 129664 -73798 42858 -58482 -386473
11882 -386473 -20781 144312 338173 -314740 65570 -316554 -106156 -22524 -150054 51744
11871 -91888 -224299 -129235 218853 -182465 -278766 -121307 -20194 -177471 -34717 385228
11860 -166061 63411 47591 55283 55829 -103394 29597 -148954 29831 -144991 127684 367940
11849 367940 -37959 -160084 -119966 207612 123270 -355853 187921 -139263 -16472 87230
11838 20328 -262121 -103636 -200440 153183 -406707 66359 121908 -195205 95552 50129 -176521
11826 273184 -25506 -168399 -237058 -275533 78922 -45047 275186 209235 -41614 94684 168360
11815A68360d0560j55237b6617j68967Q8261G3418h3817I9510a75028d1718j10104
11804a51822P3811m8913c2272Q063E2797j718j8233c83019E3662D426J99724E7961
11791G15Q2567e9914K3057k5531K3019G4178a10160j6200i400D4193j1907b8673
11778b54796P448b5783j89034h8741l4048F9313R2338B367J16256b25345h0466
11766a80441G279a30232B25892E7049d78364f1130k95398F439b70648g2585E1422
11754a41366r4802a3632j02551L1373C2508M0027J7656P1702e6141A17967a64732
11742F738J4052L06097B5806K410J71396A6633O4433J426J07856r3979a25j33226
11730a33351A12631a09754l16174a97835e9B26400j06901l0176C353K0103a31774
$$ plain form
11815 168360 -40560 -195797 -26617 -195584 -107323 73418 -83817 99510 -175028 -41718 -151822
11804 -151822 -78011 -126924 -32272 -24209 52797 51079 32846 -383019 53662 4426 204150 57961
11791 715 83282 -59914 -36857 -62388 -39369 74178 -110160 -126360 -9400 44193 32286 -28673
11778 -254796 -247348 -25783 -214817 -88741 -122789 69313 161651 2367 118623 -225345 -80466
11766 -180441 7279 -130232 225892 57049 -478364 -61130 -356528 6439 -270648 -72585 51422
11754 -141366 -236168 -13632 -116183 -84810 32508 72535 90191 161893 -56141 117967 -164732
11742 6738 20790 326887 25806 28216 199612 16633 81066 82492 190348 96369 -125 -133351
11730 -133351 112631 -109754 -425928 -197835 -59 226400 119499 89323 3353 23456 -131774
11718C85456d217r3992M3388A57406E0512r781J71986m6584C8073a24722A5906
11706C8134J13695G4442a99142B8961h3825k7339m20b1719l10013a06922B97980
11694b5740k8379j09767b4207r4232N7492B57353a07731A43982N0312o7576O9866
11683A96584n6538a94952h8046A90849M0425a7275j09163K2941j36407f2372B72275
11671a62329p7438G5731C6747b07032j98456A36802b89914C4072j4564N7874J19074
11660A96456e9065B2963a76398e8631j0628j8923C23994A04223a74083J7026I7769
11648h195A3127d17658a78364C4916K5960f1628K6218A84417J41594d85646e5802
11636i4201M1888r8860B37398p5202p5243j5183f2181b9199k80661a24493I7236
$$ plain form
11718 385456 -4217 -98209 -54821 157406 50512 40731 212717 166133 38073 -124722 15906
11706 38134 151829 74442 -199142 28961 -83825 -111164 -111584 -21719 -331732 -106922 297980
11694 -25740 -54119 -163886 -24207 -118439 -60947 257353 -107731 143982 194294 126718 196584
11683 196584 140046 -194952 -88046 190849 231274 -17275 -126438 -103497 -239904 -62372 272275
11671 -162329 -239767 75731 36747 -207032 -405488 136802 -289914 34072 19508 77382 196456
11660 196456 -59065 22963 -176398 -58631 -69259 -88182 323994 104223 -174083 -157057 97769
11648 -8195 13127 -417658 -178364 34916 60876 -61628 -35410 184417 326011 -485646 -55802
11636 -94201 -52313 -151173 237398 162196 86953 71770 -62181 -29199 -309860 -124493 97236
11624B78315g9076C7245L40766b16357l400B04553B5132L43801b80574R1050B2924
11612b9816j61965I1385a22453I1277c651k21815G0413a71179A27652h104q1872
11601h9976a7683k86900B33375a44355O4015G4973J89842b58587h0605l7291A68659
11589A36105C3628K54416a30885k3943f6454A66689j9806K06277a53415d683A53203
11577b83859a31118C7606O4518l4641d1436B27793e6451C85487G6482B0679K00969
11566B21648B2911d9423o4191c8450G1859d8045B22803A9529J52203G6869b18372
11554b68232H4894P2529e4883p0049d4921B13812A04271d1523A39286b17123A64240
11542A25576N9210J85371a67100B19649n686h3571k02864E7855a7891G1212R7716
$$ plain form
11624 278315 -79076 37245 378011 -216357 -219757 204553 25132 368933 -280574 -189524 22924
11612 -29816 -191781 91385 -122453 91277 -3651 -225466 70413 -171179 127652 -8104 -89976
11601 -89976 -17683 -304583 233375 -144355 -80340 74973 264815 -258587 -80605 -117896 168659
11589 136105 33628 288044 -130885 -154828 -66454 166689 146883 353160 -153415 -4683 153203
11577 -283859 -131118 37606 102124 67483 -41436 227793 -56451 385487 76482 20679 221648
11566 221648 22911 -49423 -113614 -38450 71859 -48045 222803 19529 171732 76869 -218372
11554 -268232 84894 157423 -54883 -124932 -44921 213812 104271 -41523 139286 -217123 164240
11542 125576 184786 370157 -167100 219649 213963 -83571 -286435 57855 -17891 71212 168928
11531A68928B5002J83558B371b40031K3125C9019K1630c87951d1727C86562a08068
11519A43949a93191C3262P8904f9249G644J03818a12078D10688a42162A2159a2676
11507a4633k45928A14838h9708A14072m8638N4063J10443a03951r707b0070C9883
11495B36095d06626F1047J71724A0423N4010N864b36073C02531A02287b45669
11484C7935K64272b06706A16335f7926A42247q62a66806E4558k3542J0513a5098
11472A46520J8959g3143A00450M0234n7454j6896a68315D6650j7289g5938B33524
11460B09977C3495K26994H0612g9174A96258b63714e0217I0362D508e0419A303
11448a1357F8493P4822K2441L8171J10681E1211e6756A79651o7182D6685c0129
$$ plain form
11531 168928 25002 208560 2371 -240031 -216906 39019 60649 -387951 -41727 386562 -108068
11519 143949 -193191 33262 112166 -69249 7644 111462 -112078 410688 -142162 12159 -12676
11507 -14633 -260561 114838 -89708 114072 65434 119497 229940 -103951 -113658 -20070 39883
11495 236095 -406626 61047 232771 10423 64433 70297 -236073 302531 102287 -245669
11484 37935 302207 -206706 116335 -67926 142247 141385 -166806 54558 31016 41529 -15098
11472 146520 165479 -73143 100450 140684 83230 66334 -168315 46650 29361 -75938 233524
11460 209977 33495 260489 80612 -79174 196258 -263714 -50217 90362 4508 -50419 1303
11448 -11357 68493 143315 165756 203927 314608 51211 -56756 179651 112469 46685 -30129
11436C5761Q3066c1083A89515i870A55437K12067I63Q402Q9588Q7928k5514P413
11424A68780c595E1050j0286M1229J45791F2860J61857o9324C4396A1379b79724
11412a19473M0352k9698r1836A81460d0092C49631a50727d2365D96456f4852E3594
11400g0888j07391A67092F5045J3172e8749A29201b00704n8375C18075H8039b95062
11388g4441J666i615k24167l6023A3J41661J48932a7499B57633n6021p3250m8323
11376H0039Q5905k7611i1319C28329B9528b60662a16648c1152B95941a60753H7958
11364c9696n8669k3914b4206j43484f5282r573i577A26854N6917G1983c02867
11352f5497k93004a23713C13518Q4240g1063q1093J7071j2416B45106G5305d47079
$$ plain form
11436 35761 118827 -31083 189515 -9870 155437 367504 963 9365 98953 186881 161367 168780
11424 168780 -3595 51050 40764 81993 227784 62860 224717 155393 34396 11379 -279724
11412 -119473 -79121 -108819 -200655 181460 -40092 349631 -150727 -42365 496456 -64852 53594
11400 -70888 -178279 167092 65045 78217 -58749 129201 -200704 -259079 318075 88039 -295062
11388 -74441 -72775 -9615 -233782 -269805 13 141674 290606 -17499 257633 201612 128362 80039
11376 80039 165944 138333 -91319 328329 29528 -260662 -116648 -31152 295941 -160753 87958
11364 -39696 -98365 -122279 -24206 -167690 -65282 -74855 -9577 126854 183771 71983 -302867
11352 -65497 -358501 -123713 313518 397758 -71063 -152156 -135085 -147501 245106 75305 -447079
11340d7951j04816q3812b5333r3254a893p7948B08028b8137A91403r175q7697
11329I4531m2801O6078D0461d78821A70089o344M0746b20579k51794e2605A75198
11317A66726b7274k12538a11285C3527f2882n9550d9153p9357a1969A44400a02947
11305i7067A83044a2968k17657a11201D2620j9748J71414I0869g112D3197j6052
11294B7145d3388F9582b78084l5010A2455a00688q3896d8566A12200a72677B30559
11282b49432A49045c40809a21292k5439M5945d6972k67190c0082Q812k37139B61396
11270A82717B3285a84122h4414c2805A21193l9862C3663b28412f0219A83115a06326
11258b0192j50180P3678j45665A50207a66607k0489B7960f1625A50815i6777b0002
$$ plain form
11340 -47951 -152767 -236579 -25333 -118587 -1893 -79841 208028 -28137 191403 182228 94531
11329 94531 51730 117808 40461 -478821 170089 163745 204491 -220579 -472373 -52605 175198
11317 166726 -27274 -239812 -111285 33527 -62882 -122432 -49153 -128510 -11969 144400 -102947
11305 -97067 183044 -12968 -230625 -111201 42620 22872 194286 90869 -7112 43197 27145
11294 27145 -43388 69582 -278084 -313094 12455 -100688 -184584 -48566 112200 -172677 230559
11282 -249432 149045 -340809 -121292 -146731 -100786 -46972 -314162 -30082 -21270 -258409 261396
11270 182717 23285 -184122 -84414 -32805 121193 81331 33663 -228412 -60219 183115 -106326
11258 -20192 -170372 -96694 -242359 150207 -166607 -187096 27960 -61625 150815 -96777 -20002
11246h9142j3821B21113A8564a5381l79124J15893n3930R2536M4637h0720J3337
11235f7383A9313b4551l1689n3671a0233j9824A5734K52759J0228a68724M9943
11224a18781K983M6726o5180j5268O5794A91118i0570B2208e862A1582i0682B01629
11211d8751A75029b94312c8854j23012B20768a746k63023D6422f9873C0711c80558
11199b56048J10075D4508J64944b07057A9864a03343E4590h0049o1850B42988
11188b13721H7796J05351d9532I5119A2420b05205L5383L4274B16946b03191n6443
11177b59634d4812k66637n8238P6589L314A04489Q779h1927E8140A2867i7561
11165b32450A92564M4902a09973j31035r7172A2425d867A6536L02408C8641J14214
$$ plain form
11246 -89142 -102963 221113 18564 -15381 -394505 -278612 -332542 -240006 -195369 -80720 -67383
11235 -67383 19313 -24551 -56240 -109911 -10233 -30057 15734 268493 278721 -168724 -118781
11224 -118781 -115798 -69072 -134252 -149520 -83726 191118 -90570 22208 -5862 11582 -90682 201629
11211 -48751 175029 -294312 -38854 -161866 220768 -1746 -264769 46422 -69873 30711 -380558
11199 -256048 -145973 44508 209452 -207057 19864 -103343 54590 -80049 -141899 242988
11188 -213721 87796 193147 -49532 95119 12420 -205205 -169822 -135548 216946 -203191 -259634
11177 -259634 -44812 -311449 -369687 -293098 -289784 104489 113268 -81927 58140 12867 -97561
11165 -232450 192564 237466 -109973 -241008 -338180 12425 -4867 16536 318944 38641 152855
11154A52855l2695b26648j89400h5536F9078b9679k89720c6150H1306i9494j22914
11143b22408a254l97531B32912a01343j33384P6403b0573G9613a74203C452R1715
11132I5167J07339b6674D1850K12297G1264J0539c4566C83393n0342l6037h1296
11120i5523K3699L4381A60249a00744A73954E7476E200N8882e0874K4875O432
11109a9567B52436a1063B15573a50550f9786A67821J9586d5790A51174b7421I1598
11097i1193B96689c02446F9364b05552B52518b7779k7595H2532M6384J70691H7547
11085B69908E8658a25792C37893L0842a10141C75842j3969i6269I4669j660J03160
11074A96169N0356b16605h5157A10655L1075D0520e0566A68597b5205C65492I3137
$$ plain form
11154 152855 120160 -226648 -416048 -85536 69078 -29679 -319399 -36150 81306 -99494 -222408
11143 -222408 -1254 -398785 232912 -101343 -234727 -158324 -20573 79613 -174203 3452 95167
11132 95167 202506 -26674 41850 254147 71264 81803 -34566 383393 333051 297014 -81296
11120 -95523 -71824 -37443 160249 -100744 173954 57476 5200 64082 -50874 -25999 -19567
11109 -19567 252436 -11063 215573 -150550 -69786 167821 187407 -45790 151174 -27421 91598
11097 -91193 296689 -302446 69364 -205552 252518 -27779 -55374 82532 128916 299607 87547
11085 269908 58658 -125792 337893 368735 -110141 375842 361873 -96269 94669 93009 196169
11074 196169 246525 -216605 -85157 110655 141730 40520 -50566 168597 -25205 365492 93137
11062B12922a7997n1219A11039m6646J55185e6719F98046k41909l0645A83888
11051B19722J96174M1390O3042j44726o7067L06752k8090R9336m1304n6803j10639
11040D77787A41938J96881J63928J49398j95655r1301J46461l1904M7296J8413
11030E45455k27448L80758m3813B79627J66284A85786J59952J11943j55747q685
11020B93249M0517n8555K08124K1668P3700O1736B77981l269Q5121K41674A31281
11008B51447K69009G8387K11508k6031N1148J36736J38939k68725J74731J9448
10998E16141B45648K17588J25275M5230J12551l02584k3710q0108B6101M49778
10988D75879k0180J34240R1505J48014k18653J94617l97394N24406R2725k26217
$$ plain form
11062 212922 -17997 -69216 111039 64393 219578 -56719 698046 456137 425492 183888
11051 219722 415896 457286 520328 375602 308535 615287 587197 686533 645229 588426 477787
11040 477787 141938 338819 502747 652145 456490 365189 511650 479746 527042 545455
11030 545455 318007 698765 654952 279627 445911 185786 345738 457681 301934 293249
11020 293249 333766 275211 483335 505003 578703 640439 277981 274712 359833 601507 131281
11008 251447 520456 78387 289895 263864 315012 451748 590687 321962 496693 516141
10998 516141 245648 463236 588511 633741 746292 443708 419998 339890 26101 475879
10988 475879 455699 589939 681444 829458 610805 805422 408028 932434 1025159 798942
10978G98942j19367K56767j49132j82236L85271J12065j67122O9831L31571r3499
10968A243091K85097m6671M89765R750k19263l38309M5085l81115k88M5051J43127
10957A275320j8299j9122j62373k3756J71874k915k01622P5695k61601L51246
10947A184447k46533M6923D78129k7974L38109C53380j0273j52747Q0397n5344
10937B15413D6570O5445a73959C07383A8443K53653I9967J13329n421i43j036
10926a979A06992a28381j43745A43159E3348g1287j00429M1269M2310G1718a28792
10914a58165P8361j00884A91320B8210a11535p4954f6939o4476M08j04657f1700
10902b02541A76341F9062J62200d1474H9160j5519K66637c91191g1107A41955
$$ plain form
10978 798942 679575 936342 787210 604974 990245 1102310 935188 1005019 1336590 1243091
10968 1243091 1528188 1481517 1971282 1981032 1761769 1423460 1468545 1087430 1087142 1132193 1275320
10957 1275320 1257021 1237899 1075526 1051770 1223644 1220729 1019107 1094802 833201 1184447
10947 1184447 937914 984837 478129 450155 788264 353380 343107 190360 270757 215413
10937 215413 46570 112015 -173959 307383 18443 272096 99967 213296 207875 -943 -1979
10926 -1979 106992 -128381 -272126 143159 53348 -71287 -171716 -130447 -88137 71718 -128792
10914 -158165 -79804 -180688 191320 28210 -111535 -186489 -66939 -131415 -131007 -235664 -61700
10902 -202541 176341 69062 231262 -41474 89160 73641 340278 -391191 -71107 141955
10891h2462A51a14976E284c06589J02136G8783d2452K0315j20429B9375J79221
10880B08596G6399b68560A40699A4405b85800B34572a75131A00126c7462B8748
10869g0480j10836k6801I1170l6529d4174B12086c22978A10772a05598j70933
10859b76531B94424a01347k27788a33320G4360e2288A3177i7767j1390A83808
10848a22771P504o9959k44094B13838L5294a96620F5458b9568C746d5408k32531
10837b77939c4281k9601B31943a10801b1840o2982k12040E5707b13667e65C13591
10825c44626a08528q1446D3770c01614K8797B10512a31891m645A7268B267O8316
10814G0583b94243L3073a2649j89229k1513J7724b4853j82265G802b6134A52674
$$ plain form
10891 -82462 151 -114976 5284 -306589 -204453 78783 -42452 -22137 -142566 29375 208596
10880 208596 76399 -268560 140699 14405 -285800 234572 -175131 100126 -37462 28748
10869 -70480 -181316 -208117 91170 54641 -44174 212086 -322978 110772 -105598 -276531
10859 -276531 294424 -101347 -329135 -133320 74360 -52288 13177 -97767 -109157 183808
10848 -122771 -115267 -185226 -429320 213838 249132 -196620 65458 -29568 3746 -45408 -277939
10837 -277939 -34281 -63882 231943 -110801 -21840 -84822 -296862 55707 -213667 -565 313591
10825 -344626 -108528 -189974 43770 -301614 -272817 210512 -131891 -136536 17268 2267 70583
10814 70583 -294243 -261170 -12649 -201878 -223391 -205667 -24853 -207118 7802 -26134 152674
10802b38009M5765A25701c08716B7365i2064C06946b36025k19487e1863A57234
10791c24909J49942C2132b1497l02866O6459M8563a5343A69545C0988L0663J21963
10780A83614a2490m6190C3530h281o0610c1349J1627p9565A20461P89a22918F9803
10767B02574h9761C2020J05319J06391m7585c05840J27106f4596r8301A58993
10756c91044b6300C3321b24920M7904A05079b27653B13073c5452l0512A76824
10745g4935B77364p2787b36059a09719B35708f8364A2184K3319J90614I8565c25924
10733c73925H3068e9771A35990n2302d6435j16350p0276e9525j52605R7440b8171
10721b93172A29165B3270a08040L5442E494R7046B1487g3338D32028f4599p2274
$$ plain form
10802 -238009 -192244 125701 -308716 27365 -92064 306946 -236025 -455512 -51863 157234
10791 -324909 -174967 32132 -21497 -324363 -257904 -209341 -15343 169545 30988 61651 183614
10780 183614 -12490 -58680 33530 -8281 -68891 -31349 -19722 -99287 120461 121250 -122918 69803
10767 202574 -89761 32020 137339 243730 196145 -305840 -178734 -64596 -162897 158993
10756 -391044 -26300 33321 -224920 -177016 105079 -227653 213073 -35452 -65964 176824
10745 -74935 277364 204577 -236059 -109719 235708 -68364 12184 35503 226117 98565 -325924
10733 -373925 83068 -59771 135990 83688 -46435 -162785 -233061 -59525 -212130 -114690 -28171
10721 -293172 129165 23270 -108040 -72598 5494 102540 21487 -73338 432028 -64599 -136873
10710a36873o2893E2480a96183A63842B13b6270H396f4333k5731k99298a12287
10698a74858j73061B4327c27670J05603A66476a71149D0399c05040A64037e8932
10687b46410K4287I6320J92751i4550A54829b50282L2936F1241B818a69306E3252
10675a53232D4474h7764j32055J05015L6782C77440a35730A53680J61653d12533
10664A51260b83973c7173a0981H521N2920d16058A86359A5741L17299a58110D4493
10652A48159P8116a39452C20277B3643i5506j55391F0445B9610i691m22667A07229
10640A42889K06944b52277h5765l33571a30912A74407o8834b97767B4421R9465
10630A23886a83395B14241a50307L4443I2750N1010a57307C53509a09002F3648
$$ plain form
10710 -136873 -199766 52480 -196183 163842 213 -26270 8396 -64333 -90064 -389362 -112287
10698 -174858 -347919 24327 -327670 -222067 166476 -171149 40399 -305040 164037 -58932
10687 -246410 -222123 96320 289071 -94550 154829 -250282 -217346 61241 2818 -169306 53252
10675 -153232 44474 -87764 -219819 -114804 -78022 377440 -135730 153680 315333 -412533
10664 151260 -283973 -37173 -10981 8521 61441 -416058 186359 15741 333040 -158110 44493
10652 148159 226275 -139452 320277 23643 -95506 -250897 60445 29610 -9691 -432358 107229
10640 142889 349833 -252277 -85765 -419336 -130912 174407 105573 -297767 24421 123886
10630 123886 -183395 214241 -150307 -115864 92750 143760 -157307 353509 -109002 63648
10619f155p926l0133F8950b21371i3547j33729j21189J51078g8225d010A63195
10607B3774J41260n1380b3322r2417B2960a18551b8790B17014a88202H9391c75903
10595G5585J28856b11609j61169a65294n5P0441J7061L0451j529B12882k841J13543
10583C23584j38152b71026G7156c76463a62430A9878a49010C7327A2744N6372
10573F9116b03796k4340L5379B06420G7587A128b1411A95220I4242c13654J27886
10562a85768H7564c63243B1949M19966a39330N3578b4989H0630a605j17725h13
10550C03219a60043l0850q862j4695C05814a10158A08553i0581m7782J4039E9533
10538a92869D8980c70817G1900c54501d5187o9571A6466e1756B1978M351a54454
$$ plain form
10619 -6155 -14081 -44214 68950 -221371 -93547 -227276 -348465 -197387 -78225 -4010 163195
10607 23774 165034 113654 -23322 -115739 22960 -118551 -28790 217014 -188202 89391 -375903
10595 75585 204441 -211609 -372778 -165294 -165349 -94908 -77847 -47396 -48925 212882 210041 323584
10583 323584 185432 -271026 77156 -376463 -162430 19878 -149010 37327 12744 69116
10573 69116 -203796 -228136 -192757 206420 77587 1128 -21411 195220 94242 -313654 -185768
10562 -185768 87564 -363243 21949 441915 -139330 -85752 -24989 80630 -1605 -119330 -813
10550 303219 -160043 -190893 -199755 -214450 305814 -110158 108553 -90581 -138363 -124324 59533
10538 -192869 48980 -370817 71900 -354501 -45187 -114758 16466 -51756 21978 26329 -154454
10526d2440p2207k26138c9567B09865c6248A93588B5126a78016n8249a05504B5547
10514H8789b5440l0509G9682J1315a67403r0531a08282p7451o0855A19594b56704
10502a84978G5501J90815N1413a35234q161N5387B71943a26852b7980G3024J87001
10491B60025a51778H587K67351b18288D526c57660J64184j23414e5976C75281
10480a27357b6791C10111e7444B16753J28364p796K58671c7218j14784N6032A67338
10468I5655N1381C2190B614g5673k36689N4541I9208a26444b3963r5361E1227
10456B77382E3052a14685A45716c56646J31689o0559A56483a38832B65550D7254
10445a24445d0944F9870i8547k13975A48906C6842a06361J9451H6601c85632b7376
$$ plain form
10526 -42440 -114647 -340785 -39567 209865 -36248 193588 25126 -178016 -236265 -105504 25547
10514 88789 -25440 -55949 79682 90997 -167403 -257934 -108282 -185733 -246588 119594 -256704
10502 -184978 75501 266316 317729 -135234 -143395 -88008 271943 -126852 -27980 73024 260025
10491 260025 -151778 8587 275938 -218288 4526 -357660 -193476 -316890 -55976 375281
10480 -127357 -26791 310111 -57444 216753 345117 337321 595992 -37218 -152002 -95970 167338
10468 95655 147036 32190 2614 -75673 -312362 -257821 99208 -126444 -23963 -119324 51227
10456 277382 53052 -114685 145716 -356646 -224957 -285516 156483 -138832 265550 47254
10445 -124445 -40944 69870 -98547 -312522 148906 36842 -106361 -86910 86601 -385632 -27376
10433f2052k9508A2141L8282a15203j4587j0844j6820r3286q7426J67488C6153
10421a59677O0864p5895G0444b49083O0403o5550P337A11738f8031o5677B00619
10409A33050O2253c73002a07927c8140j12043b2542D245a85097A85850p2032L60993
10398D74811c22000H8383K0504i6350I7797c97799E8533a42912A48277c10046
10387B26929o2930i8482A02657K23925e4892k8396A52547E497c1548A40493k5964
10376A14529C0577R5598N9169L9862Q943D1648M03791B716L48949Q3993A73609
10364B92042A31676M74267k59742J84073B33491D2486k999J3512Q7915L4627m0
10353A75501o7499D2465P3640K35930K5664B4085J98774K20570A68682M6250o4106
$$ plain form
10433 -62052 -91560 12141 50423 -115203 -129790 -140634 -157454 -250740 -338166 -170678 36153
10421 -159677 -98813 -174708 70444 -249083 -188680 -254230 -246893 111738 -68031 -133708 200619
10409 133050 195303 -373002 -107927 -38140 -150183 -22542 4245 -185097 185850 113818 474811
10398 474811 -322000 88383 108887 -96350 97797 -397799 58533 -142912 148277 -310046
10387 226929 163999 -98482 102657 326582 -54892 -83288 152547 5497 -31548 140493 114529
10376 114529 30577 126175 185344 225206 234149 41648 445439 2716 351665 435658 173609
10364 292042 131676 605943 346201 530274 233491 42486 39487 52999 140914 175541 175501
10353 175501 108002 42465 116105 352035 377699 24085 222859 443429 168682 214932 150826
10342A50826o0316O2550J01803i2840B39701Q2247H3084j1892j0450L23970j61991
10331B22721n4613C1375R8049E3124R6656a06773M2104A18110j5006J5425b08052
10319B31344H1183J7984K9541O1931M1811e9476E7519i9660d9244B23727P5977
10308B99704m9010a62116B45409b780k13821e4390m73800a44487F6816a5896B00026
10296B6146D519Q6998C3453a26836r308e6094C2128b81891K1406O5040i3169r6814
10284a89983i4838b4015o364B29788a10538l4733l12056A1335J26278b00795N0945
10273a49850b1411j15426A0182i3835j12803b392k68435J15368f2746F6477J54296
10262B20773j924b73768G4323r724L8028g0246K4393D66798j82275R9690e5958
$$ plain form
10342 150826 90510 153060 254863 -92840 239701 321948 83084 71192 60742 384712 222721
10331 222721 168108 31375 129424 53124 149780 -106773 -64669 118110 103104 118529 -208052
10319 231344 81183 99167 128708 190639 232450 -59476 57519 -99660 -49244 223727 299704
10308 299704 250694 -162116 245409 -2780 -216601 -54390 -528190 -144487 66816 -15896 200026
10296 26146 4519 91517 33453 -126836 -136144 -56094 32128 -281891 -260485 -195445 -93169 -189983
10284 -189983 -94838 -24015 -30379 229788 -110538 -145271 -457327 11335 137613 -200795 -149850
10273 -149850 -21411 -136837 10182 -93835 -206638 -2392 -270827 -155459 -62746 66477 220773
10262 220773 218849 -273768 74323 64599 102627 -70246 -45853 466798 284523 384213 -55958
10250D84803D9838g8839p991A00117J17242f2210j44871P0799F3221e2861C79213
10238a16760j69204A67063b06848b7809l71646A22209f0409k85112B5981a2907
10227a26796O3389J1667H717a37330j71284B92746a80162B29047F5364M5880k0269
10216I0975a31259o8446j85076B68776A21193i1852j51j05831i2595N41m25198
10205e17252a16081k8589n9621e20F5264f5869E7637i1994k09328i3038A14384
10193H1180C6924d8333b443j08408l6057A1918c06141a49109B29090b29042D8236
10181a50421q8462j07946I8611J79500e924j79713b7739E5553b83213H5607a5397
10169i7148B52509e642j51436p4029F6991J6462h143I6087c54789h9648j27980
$$ plain form
10250 484803 49838 -78839 -86830 100117 217359 -62210 -207081 -136282 63221 -52861 379213
10238 -116760 -285964 167063 -206848 -27809 -399455 122209 -60409 -345521 25981 -12907
10227 -126796 -63407 -51740 8717 -137330 -308614 292746 -180162 229047 65364 111244 90975
10216 90975 -131259 -199705 -384781 268776 121193 -91852 -92003 -197834 -92595 -92054 -517252
10205 -517252 -116081 -144670 -204291 -520 65264 -65869 57637 -91994 -301322 -93038 114384
10193 81180 36924 -48333 -2443 -110851 -146908 11918 -306141 -149109 229090 -229042 48236
10181 -150421 -238883 -346829 98611 278111 -5924 -185637 -27739 55553 -283213 85607 -15397
10169 -97148 252509 -5642 -157078 -231107 66991 83453 -8143 96087 -354789 -89648 -217628
10158b17628E9388c48370A16747f2849j22146b7219k6452A3583M0880R0638a65302
10146a90503m2278h6173H2133k2103B5131c55640a69523L2188D38382B17301a18105
10134e4597K4333j96508l10686C7546a118A72858i2046h701D3784a42351A82222
10122a49509K2651L1015o6493j43274J14742B14487r3428k8645a56023d4741E9266
10110a53004M6732j87193L8915Q6894q2804A72206a00349B20154a45548j59641
10100c05189a06560A14703a66440A79925g2434k77090B1209g2872p3984H3255
10089b25189D2337h02A56922b19560f2760A7793L5821O8847F114b48527A15693
10077a26995b5998B27068a10639n4002A0941a12437d3012E398J25336D2815f1749
$$ plain form
10158 -217628 59388 -348370 116747 -62849 -184995 -27219 -53671 13583 54463 145101 -165302
10146 -190503 -232781 -86173 82133 60030 25131 -355640 -169523 -137335 438382 217301 -118105
10134 -54597 -30264 -226772 -537458 37546 -1118 172858 -92046 -8701 43784 -142351 182222
10122 -149509 -126858 -95843 -162336 -305610 -190868 214487 121059 92414 -156023 -44741 59266
10110 -153004 -106272 -293465 -254550 -167656 -250460 172206 -100349 220154 -145548 -305189
10100 -305189 -106560 114703 -166440 179925 -72434 -349524 21209 -72872 -146856 83255
10089 -225189 42337 -802 156922 -219560 -62760 17793 53614 122461 6114 -248527 115693
10077 -126995 -25998 227068 -110639 -164641 10941 -112437 -43012 5398 130734 42815 -61749
10065g4279J5504J4979A94413a18231B9413e3570j60051A56770b6439A28439a98592
10053b82227h6022j07488O3423p2807P8657d6112j7041F8506B7588a76328k1266
10042a97594K8131j5315R0090A10983n0842B7548b9593A23256a23641r0533C20280
10030G4736a8509C8334b70074N4562r4523R1540d2554F296i7310a6876q1059j49343
10018b47278j44142K0632g9505a7733C21595a46910H5084i3162I2964C3788J3989
10007D7777g6431b9965l14323E3358d08422A7878h8148F1887J694j8342g2685
9995B8337h0894M482j41152J0198M4025I2734c10023B28679b34284a05197l17035
9984d22232I1864c18781c6388q828n2071k00449i8656H3050K515c09068P7586
$$ plain form
10065 -74279 -58775 -43796 194413 -118231 29413 -53570 -213621 156770 -26439 128439 -198592
10053 -282227 -86022 -193510 -130087 -202894 -124237 -46112 -63153 68506 27588 -176328 -197594
10042 -197594 -169463 -184778 -94688 110983 60141 27548 -29593 123256 -123641 -214174 320280
10030 74736 -18509 38334 -270074 -215512 -310035 -218495 -42554 6296 -97310 -16876 -97935 -247278
10018 -247278 -391420 -370788 -79505 -17733 321595 -146910 85084 -93162 92964 33788 47777
10007 47777 -76431 -29965 -344288 53358 -408422 17878 -88148 61887 63581 45239 -72685
9995 28337 -80894 -76412 -217564 -207366 -163341 92734 -310023 228679 -234284 -105197 -422232
9984 -422232 91864 -318781 -36388 -45216 -97287 -297736 -98656 83050 85565 -309068 -231482
9973b31482j37459a36778d7071j37513I3255f1309l4935E0039N7579a86098d8889
9961A9609J41749K5854b47599P5301J3814j19215G2535D483c5141A88516d46759
9949a97757A54130k3495h1736k94846D5713J4465D804a08233A32478j1787e5290
9937A19860b29876M5211I333i5268K3789A06960a08624G6489d550B72969c4634
9925i2021D98354b9678j6292r6966N3830D8206J40345J3373c7996j58278B6074
9913b45391B14532a82515M4196C2075b66007B9137K18754b07972C23129b66925
9902a6040M167A14803a22520b126k09806H1089a37595l566A71381B2778J8097
9891D0875g3742m3789J6786N63a9327B5565c30486g5957j7318j8867a3875q7917
$$ plain form
9973 -231482 -368941 -136778 -47071 -184584 93255 -61309 -96244 50039 107618 -186098 -48889
9961 19609 161358 187212 -247599 -172298 -158484 -277699 72535 4483 -35141 188516 -446759
9949 -197757 154130 130635 -81736 -376582 45713 60178 4804 -108233 132478 120691 -55290
9937 119860 -229876 -184665 9333 -95268 -71479 106960 -108624 76489 -4550 272969 -34634
9925 -92021 498354 -29678 -45970 -142936 -89106 48206 188551 201924 -37996 -196274 26074
9913 -245391 214532 -182515 -138319 32075 -266007 29137 247891 -207972 323129 -266925
9902 -16040 -11873 114803 -122520 -2126 -211932 81089 -137595 -141161 171381 22778 40875
9891 40875 -73742 -117531 -100745 -100182 -19327 25565 -330486 -75957 -93275 -112142 -13875 -101792
9879a01792C6724c2136q2723l2775J2284j4439P1532m7624C81099b61432f7537
9867E9517B480a70967G073h2120E2672h3700j89369o137a24145j08775i3451m8560
9855a42011o0816J00553K828J8038q0848j94207a15723m1326B1494c78064i1745
9843b79298M1502A07873c88558A34192o208l4164d4934D01643g9901b2199r6425
9832a18624q6971f0110n3283k35317D8062i0760A30931d927n957E15376h8316
9820b1282E8296P9886a09734C0969O412a79070o8994q9663E2925M7714a5812B85579
9807c8779j80780d3399A62413a54314n0500d2814C2353b13895a03668j72924B55424
9795b29329J12740I7272c25158a41186l6174A44312b4991n4655l00554a11386
$$ plain form
9879 -101792 36724 -32136 -114859 -147634 -135350 -149789 -78257 -125881 381099 -261432 -67537
9867 59517 2480 -170967 7073 -82120 52672 -83700 -273069 -279206 -124145 -232920 -93451 -142011
9855 -142011 -202827 -102274 -99446 -81408 -162256 -356463 -115723 -157049 21494 -378064 -91745
9843 -279298 -237796 107873 -388558 134192 127984 93820 -44934 401643 -79901 -22199 -118624
9832 -118624 -205595 -60110 -113393 -348710 48062 -90760 130931 -4927 -10884 515376 -88316
9820 -21282 58296 138182 -109734 30969 37381 -179070 -248064 -337727 52925 100639 -15812 285579
9807 -38779 -219559 -43399 162413 -154314 -204814 -42814 32353 -213895 -103668 -276592 255424
9795 -229329 -116589 97272 -325158 -141186 -177360 144312 -24991 -79646 -380200 -111386
9784a07391A4913O5721a96370D5283a63228A35704a62589E0965J50563I3806C5134
9772B2828L48817d83108F3132a37105o2658k5782R7661J1959k0306E5124e3286
9760D7556b22451a5516A0242a00093Q590B5317m16a7579l91704J37188F8491d3518
9747h3409C01504a07222E738J23887a32456N8417j56540k874Q5336K8929B4894
9735A42468g4154m7876A44249i9070k4211A0217b42738B53235e5532A61002a17984
9723a61893d9493B42304a1293j74983A19559M4460d7109G0828g0421C5831a62442
9711B31512c06738d7637a7596c687A10891a84635A00171J59928h2427A67605J8486
9700A86091e00612a13166k35530A30207b99115A64919b06746f1601j32523m9787
$$ plain form
9784 -107391 14913 80634 -196370 45283 -163228 135704 -162589 50965 201528 93806 35134
9772 22828 371645 -483108 63132 -137105 -199763 -225545 -127884 -115925 -136231 55124 -53286
9760 47556 -222451 -15516 10242 -100093 -91503 25317 24901 -17579 -409283 -272095 68491 -43518
9747 -83409 301504 -107222 5738 129625 -132456 -74039 -230579 -233453 -148117 -119188 24894
9735 142468 -74154 -122030 144249 -99070 -123281 10217 -242738 253235 -55532 161002 -117984
9723 -161893 -49493 242304 -11293 -186276 119559 164019 -47109 70828 -70421 35831 -162442
9711 231512 -306738 -47637 -17596 -3687 110891 -184635 100171 260099 -82427 167605 186091
9700 186091 -500612 -113166 -348696 130207 -299115 164919 -206746 -61601 -194124 -243911
9690b43911B80825b01366f2934A46008B448b34960C6658J73280R9311A08584c66961
9678B29303A2300K5163c96862A5399i4029L8205l15992B25573M6985a16885A27436
9666A03328a97314N3148K7937K6294j62420e1377A49355a20121q694k24192E1835
9654a60399M5568A99571c49507h4255q4811m4539a7153A19897c61333F9132h023
9642a72780A6088K02048a54442F826a77670A9765b18279j12940B7015J76977c21281
9630C64242A42592c79747a6725C49121j61522O1535b15110a0290m0181k63239
9620c13710F9402J34939n5696a32114A89274b33280B27850e5239K4049A76271
9609a91710j8124r3125C2387b52822a12428J2201A42159R519E8391k0169a31224
$$ plain form
9690 -243911 280825 -201366 -62934 146008 2448 -234960 36658 209938 309249 108584 -366961
9678 229303 12300 37463 -396862 15399 -94029 -55824 -371816 225573 272558 -116885 127436
9666 103328 -197314 -144166 -116229 -89935 -252355 -51377 149355 -120121 -128815 -353007 51835
9654 -160399 -114831 199571 -349507 -84255 -169066 -213605 -17153 119897 -361333 69132 -8023
9642 -172780 16088 218136 -154442 6826 -177670 19765 -218279 -331219 27015 203992 -321281
9630 364242 142592 -379747 -16725 349121 187599 249134 -215110 -10290 -50471 -313710
9620 -313710 69402 204341 148645 -132114 189274 -233280 227850 -55239 -31190 176271
9609 -191710 -209834 -302959 32387 -252822 -112428 -100227 142159 151678 58391 38222 -131224
9597B74957a59250n0128Q7910j13833A37116n1951d2158j17740M2661e6431k72839
9586c29270B17579a78720Q6168j05661B26926r7819a7672D89O4156j1242e7245
9574b41308d2660q1898G5572j2574c59087a64075j34223A90496a6168A1410b46596
9562h7342B64286A25727O9787h3209n8646B35474b35248B18775q6738F5286G847
9550A42812Q082a21365a0844A8439K21937i2663j47613a12874G3902J37573G1912
9538c9632k04341A57229i2471j63600F7346b0215B824e38698A3089c13583g4275
9526D5858k0090h2547A5766J41724a32802D6296J02431h592l2576q7295j89359
9515c17822A38597a43328j03077a22334F5720c03174a4658A5825b59475A9074
$$ plain form
9597 274957 -159250 -209378 -121468 -235301 137116 85165 -42158 -159898 -117237 -56431 -329270
9586 -329270 217579 -178720 -92552 -198213 226926 129107 -17672 489 64645 53403 -57245
9574 -241308 -42660 -124558 75572 62998 -359087 -164075 -298298 190496 -16168 11410 -246596
9562 -87342 264286 125727 195514 -83209 -141855 235474 -235248 218775 132037 65286 7847
9550 142812 150894 -121365 -10844 18439 240376 -92663 -240276 -112874 73902 211475 71912
9538 -39632 -243973 157229 -92471 -256071 67346 -20215 2824 -538698 13089 -313583 -74275
9526 45858 25768 -82547 15766 157490 -132802 46296 148727 -8592 -41168 -128463 -317822
9515 -317822 138597 -143328 -246405 -122334 65720 -303174 -14658 15825 -259475 19074
9504a85109P376H0962g7118j09734B10159L9947I4712f2896B57882a70447E631
9492B54966a33413A21665B6017b59943L0837j16889q3405a23321I4300b02019
9481a64305j78135a57124B51133a09351K9285L1851j29908c1857E1085a02203
9470b20679B45858I959a42085j23188i2705l81549H3080c848j77691N2945A69126
9458B4588b8382H0083K93905b9032O209k07913B2928O1529a77065q7265L7288
9447b27042d775A18592J2678h0410j40369A1417J01579C6988e20241d7913D1192
9435a98057h1556A30518c3361j82189d011m7713F1515R281L28687g367k59246
9424b66613J09355A5559K49056c7530m2916C4224a10422j0521j1321j36213A65510
$$ plain form
9504 -185109 -177733 80962 -77118 -186852 210159 250106 94712 -62896 257882 -170447 5631
9492 254966 -133413 121665 26017 -259943 -229106 -345995 -429400 -123321 94300 -202019
9481 -164305 -342440 -157124 251133 -109351 -80066 -48215 -178123 -31857 51085 -102203
9470 -220679 245858 9959 -142085 -265273 -92705 -474254 83080 -3848 -181539 -128594 169126
9458 24588 -28382 80083 373988 -29032 -22823 -230736 22928 84457 -177065 -264330 -227042
9447 -227042 -4775 118592 131270 -80410 -220779 11417 112996 36988 -520241 -47913 41192
9435 -198057 -81556 130518 -33361 -215550 -4011 -51724 61515 70796 399483 -7367 -266613
9424 -266613 -157258 15559 264615 -37530 -80446 34224 -110422 -120943 -132264 -268477 165510
9412D6355a25002J0790o9174q054L3771C765L272a3421b376l1624j54866j24465
9400c13331M442M4883c8966j7606B65188b8875r5722D9260c00220D6226K37599
9389B83825f1600j25492F8273b85100A49560o3810d95859B67113J77870c00783
9378D0962a33819K8400J4844A12793Q7129b04865B06907h1370A57688c90696h0519
9366d6560j1337l73592h3907L2007q9211o0183B14403M7924b04374h8161j93971
9355b82132A17225a28696m7776k9523B02428f5069l31878a12578C76410A28619
9344A80325h8822L0475A2715L5555J36765a63178F5018M9003m3041b48895I3822
9332a63147B36358i3084l01245A80345b05437A65787K4109J4270b57071A50742
$$ plain form
9412 46355 -125002 -114212 -183386 -191440 -157669 3765 7037 -13421 -2376 -34000 -188866 -313331
9400 -313331 -308889 -264006 -38966 -56572 265188 -28875 -124597 49260 -300220 46226 283825
9389 283825 -61600 -187092 68273 -285100 149560 85750 -495859 267113 444983 -300783
9378 40962 -133819 -105419 -90575 112793 199922 -204865 206907 -81370 157688 -390696 -80519
9366 -46560 -57897 -431489 -83907 -51900 -141111 -201294 214403 262327 -204374 -88161 -282132
9355 -282132 117225 -128696 -176472 -205995 202428 -65069 -396947 -112578 376410 128619
9344 180325 -88822 -58347 12715 48270 185035 -163178 65018 114021 70980 -248895 93822
9332 -163147 236358 -93084 -394329 180345 -205437 165787 189896 204166 -257071 150742
9321B67355b70548a14410f84A43568L9295a0278A31944a43470b6812p1759k03311
9310c01882F900P5712a52746L8078K0073E5283J01659a36323A0335L9653g9780
9298b97871i2847C59469a21782B59299b70099A42442h0907j26836e5422k39948
9288b95370a5253j23682J451B83366a45506O8349j38113E9637J8967I922J07957
9277A17879m999C4265a34451A45080g4597B34836b54995C024K43340b09569C94358
9265c15492J39410K5846O1009A20543k1627b12460L2766B1864j831a48560N7H435
9252d7578G2828e42802p3514b58737A75322a67178d4869j02652n691e6813j66749
9241b23562P1730Q437A98538b54540a17009B4503b24249J07796j20237B4020h7159
$$ plain form
9321 267355 -270548 -114410 -684 143568 182863 -10278 131944 -143470 -26812 -98571 -301882
9310 -301882 6900 82612 -152746 -114668 -94595 55283 156942 -136323 10335 49988 -79780
9298 -297871 -92847 359469 -121782 259299 -270099 142442 -80907 -207743 -55422 -295370
9288 -295370 -15253 -138935 -137484 283366 -145506 -77157 -215270 59637 78604 9922 117879
9277 117879 112880 34265 -134451 145080 -74597 234836 -254995 3024 246364 -209569 394358
9265 -315492 -176082 -150236 -89227 120543 98916 -212460 -179694 21864 20033 -148560 -148503 8435
9252 -47578 72828 -542802 -616316 -258737 175322 -167178 -44869 -147521 -153212 -56813 -223562
9241 -223562 -151832 -143395 198538 -254540 -117009 24503 -224249 -116453 -236690 24020 -87159
9229h6738k0486M2102A03934K7867f7884j15721j00202e1387A7225a06795A45966
9217c3828j26995a544A04732a79506Q9731A70578K7466e1384H882k559f0573o1728
9205a22301j51818A78786F8498a12917G9670b75772J20316H1516b20159a8674
9194c26811J12636L885c296A72629c24620G7793a50417P4596H813J0796J98957
9183B18566A7870b81079B05770b18596A6378b23048f9818c1140q0494E1306a95368
9171g8840L6838A901g6545A40858a76109B43006h1201r6595O0494l20294g1616
9159b84793B1356c17423N7948f7573r723b4824n0837k94969B31702a89086D34096
9147a35086M416A86720c08044B71759b54585h5698q1332L6150e9475I4147M7547
$$ plain form
9229 -86738 -107224 -65122 103934 131801 -67884 -183605 -283807 -51387 17225 -106795 145966
9217 -33828 -160823 -1544 104732 -179506 -89775 170578 198044 -51384 8882 6323 -60573 -122301
9205 -122301 -274119 178786 68498 -112917 79670 -275772 -155456 81516 -220159 -18674
9194 -326811 -214175 -210290 -3296 172629 -324620 77793 -150417 -75821 8813 19609 218566
9183 218566 17870 -281079 205770 -218596 16378 -223048 -69818 -31140 -111634 51306 -195368
9171 -78840 -42002 1901 -76545 140858 -176109 243006 -81201 -177796 -117302 -437596 -71616
9159 -284793 21356 -317423 -259475 -67573 -77296 -24824 -75661 -370630 231702 -189086 434096
9147 -135086 -130670 186720 -308044 271759 -254585 -85698 -167030 -130880 -59475 94147 141694
9136A41694c1370a4103r0854D3114c5603n4902A0841J01322h896n2764k71906
9125c33566d8764J0786q5243b3241q5550r6520C4647a21782e8873r8547A34604
9113A80223C6370a52960M0593j28664I235h144I667K11b15365H7384h6561k40843
9101c27404Q9587a288j07158A2012a08755c3519A08443e7797o3862k57631f1992
9089C7707j620b04227C2540Q4683R7053k1307C9956c22962i4630E9594i8596p2806
9077a71402f592k17019j08681J35054j85541A4080a34624c6012H6145C3839c6905
9065A6674a10579j78753P3874a04996r5760j0870l7774q7021a05897p8478C6540
9053a85966H2J42626b86885a20814k93165i6523C4567J13052C0031c34754b8089
$$ plain form
9136 141694 -31370 -14103 -104957 43114 -35603 -90505 10841 112163 -8896 -61660 -333566
9125 -333566 -48764 -37978 -123221 -23241 -108791 -205311 34647 -121782 -58873 -157420 134604
9113 180223 36370 -152960 -112367 -241031 9235 -8144 9667 9878 -215365 87384 -86561 -327404
9101 -327404 -237817 -1288 -108446 12012 -108755 -33519 108443 -57797 -121659 -379290 -61992
9089 37707 36087 -204227 32540 117223 214276 192969 39956 -322962 -94630 59594 -98596 -171402
9077 -171402 -6592 -223611 -332292 -197238 -382779 14080 -134624 -36012 86145 33839 -36905
9065 16674 -110579 -289332 -215458 -104996 -200756 -211626 -249400 -336421 -105897 -184375 36540
9053 -185966 82 142708 -286885 -120814 -413979 -96523 34567 147619 30031 -334754 -28089
9041a35888k53771J24140B86853b46240b8979k0462A97099a0466k1795k16547
9031b48808h2527J9734k0410j8858A48130D7982f8478I6395b15699R7443a1473
9019F575a72194O2343k73529a05086A03349R363h4703B0165K30255q3467p0736
9008I6217N6899b55011R2808B7406b79236a35677l845E6232K9558a45632n3775
8997a99407l7915O8768f1903l424n2091n6164A35838F4437h3089I6408b5229j5510
8985d0739A38133o8121f0676b3585G3091e2202o6607e9340D258K3510b19310K0205
8973a99105O8983o0848A61247C3185i6346p33L0963a7355A77643D9224b72357
8961B59311A09457M103b62778F3680K61205A30600b12015B7761J18633g4289b5332
$$ plain form
9041 -135888 -389659 -265519 286853 -246240 -28979 -49441 197099 -10466 -32261 -248808
9031 -248808 -82527 -62793 -83203 -102061 148130 47982 -68478 96395 -215699 -118256 -11473
9019 6575 -172194 -109851 -383380 -105086 103349 112712 -84703 20165 250420 166953 96217
9008 96217 153116 -255011 -162203 27406 -279236 -135677 -139522 56232 85790 -145632 -199407
8997 -199407 -237322 -168554 -61903 -65327 -117418 -173582 135838 64437 -83089 96408 -25229 -40739
8985 -40739 138133 70012 -60676 -23585 73091 -52202 -118809 -59340 4258 27768 -219310 -199105
8973 -199105 -130122 -190970 161247 33185 -96346 -97079 -66116 -17355 177643 49224 -272357
8961 259311 109457 113560 -262778 63680 324885 130600 -212015 27761 146394 -74289 -25332
8949c02671N4539E1616L59643b06650A2668b69674a22290i036D2985h7165B4086
8937e9107j72550b1172p2870A57770l4414b11506E8751d6062j23315C0125d83058
8925a00667G6990L4023d144j6578A59781h8937B38419J133891c3301B03416A5296
8913B71626H0283a40933H6094K42542h4942F5315b43113c8760E8761P2012b18504
8901C483a84981A6958a26775N3762m455A44716f989k28444F8015d4405r850j57268
8889b11523j1019E1840g3518j69452B77065D8767e8197b0177j17055m2787H139
8877b16375G4143a25951M8136E1854J02652c54569B35208E9136e1181j7037A71331
8865c091E818J72767l243a15141M5088G1138a32299C1019d2114B26429a83094
$$ plain form
8949 -302671 -248132 51616 411259 -206650 12668 -269674 -122290 -9036 42985 -87165 24086
8937 -59107 -231657 -21172 -94042 157770 123356 -211506 58751 -46062 -169377 30125 -483058
8925 -100667 76990 111013 -4144 -20722 159781 -88937 238419 1372310 -33301 203416 15296
8913 271626 80283 -140933 86094 328636 -84942 65315 -243113 -38760 58761 130773 -218504
8901 3483 -184981 16958 -126775 -73013 -77468 144716 -6989 -235433 68015 -44405 -54255 -211523
8889 -211523 -222542 51840 -73518 -242970 277065 48767 -58197 -20177 -137232 -180019 8139
8877 -216375 74143 -125951 -77815 51854 154506 -354569 235208 59136 -51181 -68218 171331
8865 -3091 5818 178585 175342 -115141 -70053 71138 -132299 31019 -42114 226429 -183094
8853C5498a59576D4905J45298b413j58205j3140P2402G7584a08968A33045b69578
8841a88757A43867l0983c0587A23464n1767a03594k7240e2996A56296a56838j18799
8830b75637B6285g4516K978q3173i08H035a08282Q318k25481D1798a56669k95196
8818d51865a16228A63330a40376f5860G8749A7297J23316d4511B87679c12368
$$ plain form
8853 35498 -159576 44905 190203 -2413 -160618 -173758 -101356 77584 -108968 133045 -269578
8841 -188757 143867 112884 -30587 123464 71697 -103594 -130834 -52996 156296 -156838 -275637
8830 -275637 26285 -74516 -71538 -154711 -908 8035 -108282 -99964 -325445 41798 -156669 -451865
8818 -451865 -116228 163330 -140376 -65860 78749 17297 140613 -44511 287679 -312368
$$ [...]
##END NTUPLES=NMR SPECTRUM
##END=
