##TITLE=NES1002_872015069_9225048_ANn9Li6YHk
##JCAMPDX= 6.0         $$ Bruker NMR JCAMP-DX V2.0
##DATA TYPE= NMR SPECTRUM
##DATA CLASS= NTUPLES
##ORIGIN= BRUKER
##OWNER= Administrator
$$ 1.72 TOPSPIN		Version 2.1
$$ 2015-06-17 18:13:18.409 -0700  Administrator@X
$$ Compression mode = diff/dup
##.OBSERVE FREQUENCY= 400.02188249412
##.OBSERVE NUCLEUS= ^1H
##.ACQUISITION MODE= SIMULTANEOUS (DQD)
##.ACQUISITION SCHEME= undefined
##.AVERAGES= 64
##.DIGITISER RES= 22
##SPECTROMETER/DATA SYSTEM= spect
##.PULSE SEQUENCE= noesygpps1d.comp
##.SOLVENT NAME= COFFEE_meoh
##.SHIFT REFERENCE= INTERNAL, COFFEE_meoh, 1, 14.96291
##AUDIT TRAIL= $$ (NUMBER, WHEN, WHO, WHERE, PROCESS, VERSION, WHAT)
$$ ##TITLE= Audit trail, TOPSPIN		Version 2.1
$$ ##JCAMPDX= 5.01
$$ ##ORIGIN= Bruker BioSpin GmbH
$$ ##OWNER= Administrator
$$ $$ E:\/data/COFFEE/nmr/NES1002_872015069_9225048_ANn9Li6YHk/12/pdata/1/auditp.txt
$$ ##AUDIT TRAIL=  $$ (NUMBER, WHEN, WHO, WHERE, PROCESS, VERSION, WHAT)
(   1,<2015-06-17 18:13:13.081 -0700>,<Administrator>,<X>,<go>,<TOPSPIN 2.1>,
      <created by zg
	started at 2015-06-17 18:01:43.519 -0700,
	POWCHK enabled, PULCHK disabled,
       configuration hash MD5:
       21 0F 79 D6 B3 7B B4 F6 88 20 88 DB 03 48 BD 9F
       data hash MD5: 64K
       E8 02 C1 58 9A A8 2D 75 FC 81 80 AF 84 09 4C E2>)
(   2,<2015-06-17 18:13:16.394 -0700>,<Administrator>,<X>,<proc1d>,<TOPSPIN 2.1>,
      <Start of raw data processing
       efp LB = 0.3 FT_mod = 6 PKNL = 1 PHC0 = 0 PHC1 = 0 SI = 128K 
       data hash MD5: 128K
       A5 15 BD EA FE 5C 4B 83 40 90 D6 28 5C 44 9C 8C>)
(   3,<2015-06-17 18:13:17.253 -0700>,<Administrator>,<X>,<proc1d>,<TOPSPIN 2.1>,
      <pk PHC0 = -84.03442 PHC1 = 0 
       data hash MD5: 128K
       2A AA 2C 33 0A F6 D2 50 A5 3F 4F B3 71 9E 15 FD>)
(   4,<2015-06-17 18:13:17.628 -0700>,<Administrator>,<X>,<proc1d>,<TOPSPIN 2.1>,
      <abs ABSG = 1 
       data hash MD5: 128K
       C8 FB C8 53 00 EA 56 B6 60 71 D8 17 19 30 69 33>)
(   5,<2015-06-17 18:13:17.722 -0700>,<Administrator>,<X>,<proc1d>,<TOPSPIN 2.1>,
      <abs ABSG = 2 
       data hash MD5: 128K
       C1 D4 CA 88 AD 31 2D 71 1B 67 96 28 1F 7F A1 74>)
(   6,<2015-06-17 18:13:17.800 -0700>,<Administrator>,<X>,<proc1d>,<TOPSPIN 2.1>,
      <abs ABSG = 3 
       data hash MD5: 128K
       FF 29 1F 64 30 4E 63 51 03 99 38 03 9C 06 F3 F2>)
(   7,<2015-06-17 18:13:17.878 -0700>,<Administrator>,<X>,<proc1d>,<TOPSPIN 2.1>,
      <abs ABSG = 4 
       data hash MD5: 128K
       A6 6D A9 CE 56 D6 EA 21 A7 3C 4F 63 65 A5 9E 37>)
(   8,<2015-06-17 18:13:17.972 -0700>,<Administrator>,<X>,<proc1d>,<TOPSPIN 2.1>,
      <abs ABSG = 5 
       data hash MD5: 128K
       B2 85 95 CF 6F AA 7E D0 F3 8D 56 C7 71 49 C0 07>)
$$ ##END=
$$ 
$$ $$ hash MD5
$$ $$ D6 C3 C4 5C 12 23 0F CF 78 CA 79 CB F4 F7 7A E4
##$RELAX= 
##$RELAX= 
##$RELAX= 
##$RELAX= 
##$RELAX= 
##$RELAX= 
##$RELAX= 
##$RELAX= 
$$ Bruker specific parameters
$$ --------------------------
##$DU= <E:\>
##$EXPNO= 12
$$ [...]
##$TP07= 0
##$TPNAME0= <>
##$TPNAME1= <>
##$TPNAME2= <>
##$TPNAME3= <>
##$TPNAME4= <>
##$TPNAME5= <>
##$TPNAME6= <>
##$TPNAME7= <>
##$TPOAL= (0..7)
0.5 0.5 0.5 0.5 0.5 0.5 0.5 0.5
##$TPOFFS= (0..7)
0 0 0 0 0 0 0 0
##$TUNHIN= 0
##$TUNHOUT= 0
##$TUNXOUT= 0
##$USERA1= <user>
##$USERA2= <user>
##$USERA3= <user>
##$USERA4= <user>
##$USERA5= <user>
##$V9= 5
##$VALIST= <valist>
##$VCLIST= <CCCCCCCCCCCCCCC>
##$VD= 0
##$VDLIST= <DDDDDDDDDDDDDDD>
##$VPLIST= <PPPPPPPPPPPPPPP>
##$VTLIST= <TTTTTTTTTTTTTTT>
##$WBST= 2048
##$WBSW= 25
##$XGAIN= (0..3)
0 0 0 0
##$XL= 0
##$YL= 0
##$YMAX_a= 6822951
##$YMIN_a= -13138778
##$ZGOPTNS= <>
##$ZL1= 120
##$ZL2= 120
##$ZL3= 120
##$ZL4= 120
##$ABSF1= 14.96291
##$ABSF2= -5.595272
##$ABSG= 5
##$ABSL= 3
##$ALPHA= 0
##$AQORDER= 0
##$ASSFAC= 0
##$ASSFACI= 0
##$ASSFACX= 0
##$ASSWID= 0
##$AUNMP= <proc_prof1d_extract.lims>
##$AXLEFT= 0
##$AXNAME= <>
##$AXNUC= <1H>
##$AXRIGHT= 0
##$AXTYPE= 0
##$AXUNIT= <>
##$AZFE= 0.1
##$AZFW= 0.1
##$BCFW= 0
##$BC_mod= 0
##$BYTORDP= 0
##$COROFFS= 0
##$CY= 15
##$DATMOD= 1
##$DC= 0
##$DFILT= <>
##$DTYPP= 0
##$F1P= 0
##$F2P= 0
##$FCOR= 0.5
##$FTSIZE= 131072
##$FT_mod= 6
##$GAMMA= 0
##$GB= 0
##$INTBC= 1
##$INTSCL= 1
##$ISEN= 128
##$LB= 0.3
##$LEV0= 0
##$LPBIN= 0
##$MAXI= 10000
##$MC2= 0
##$MEAN= 0
##$ME_mod= 0
##$MI= 0
##$NCOEF= 0
##$NC_proc= -2
##$NLEV= 6
##$NOISF1= 0
##$NOISF2= 0
##$NSP= 0
##$NTH_PI= 0
##$NZP= 0
##$OFFSET= 14.96291
##$PC= 1
##$PHC0= -84.03442
##$PHC1= 0
##$PH_mod= 1
##$PKNL= yes
##$PPARMOD= 0
##$PPDIAG= 0
##$PPIPTYP= 0
##$PPMPNUM= 2147483647
##$PPRESOL= 1
##$PSCAL= 4
##$PSIGN= 0
##$PYNMP= <proc.py>
##$REVERSE= no
##$SF= 400.02000887452
##$SI= 131072
##$SIGF1= 0
##$SIGF2= 0
##$SINO= 400
##$SIOLD= 131072
##$SPECTYP= <>
##$SREGLST= <1H.CDCl3>
##$SSB= 0
##$STSI= 131072
##$STSR= 0
##$SW_p= 8223.68421052631
##$SYMM= 0
##$S_DEV= 0
##$TDeff= 65536
##$TDoff= 0
##$TI= <>
##$TILT= no
##$TM1= 0
##$TM2= 0
##$TOPLEV= 0
##$USERP1= <user>
##$USERP2= <user>
##$USERP3= <user>
##$USERP4= <user>
##$USERP5= <user>
##$WDW= 1
##$XDIM= 131072
##$YMAX_p= 413141064
##$YMIN_p= -11682
##$CURPLOT= <Network HP LaserJet P1505>
##$CURPRIN= <$Network HP LaserJet P1505>
##$DFORMAT= <normdp>
##$LAYOUT= <+/1D_H.xwp>
##$LFORMAT= <normlp>
##$PFORMAT= <normpl>
##$SURQMSG= 1
$$ End of Bruker specific parameters
$$ ---------------------------------
##NTUPLES= NMR SPECTRUM
##VAR_NAME=  FREQUENCY,     SPECTRUM/REAL,   SPECTRUM/IMAG
##SYMBOL=    X,             R,               I
##VAR_TYPE=  INDEPENDENT,   DEPENDENT,       DEPENDENT
##VAR_FORM=  AFFN,          ASDF,            ASDF
##VAR_DIM=   131072,        131072,          131072
##UNITS=     HZ,            ARBITRARY UNITS, ARBITRARY UNITS
##FACTOR=    0.0627417313425164, 1,          1
##FIRST=     8223.62146879497, 1011,         -41471
##LAST=      0,             1769,            -41451
##MIN=       0,             -11682,          0
##MAX=       8223.62146879497, 413141064,    0
$$ Real data points
##PAGE= N=1
##DATA TABLE= (X++(R..R)), XYDATA
$$ [...]
63425E46559m027l605l422k755k243l165n472p746r016r695j0620j1940j3145
$$ 546559 542532 538927 535505 532750 530507 527342 521870 514124 505108 495413 484793 472853 459708
63412D59708j3699j3468j2788j2189j1850j1372j0265q529o680n314m623m137
$$ 459708 446009 432541 419753 407564 395714 384342 374077 365548 358868 353554 348931 344794
63400C44794l118j493j34L16N70J786L808N375O053O749Q065R472J0522J1599
$$ 344794 341676 340183 340049 340365 340935 342721 346529 351904 357957 364706 372771 382243 392765 404364
63386D04364J2793J3255J2592J1872J2181J3068J3449J3313J3337J3376J2557
$$ 404364 417157 430412 443004 454876 467057 480125 493574 506887 520224 533600 546157
63375E46157J0501P535L942P0l160m899n441n837o447o645n889m401k791j570
$$ 546157 556658 564193 568135 568205 565045 560146 554705 548868 542421 535776 529887 525486 522695 521125
63361E21125j060j285j926k746l846n316o918q410r824j1068j1688j1396j0438
$$ 521125 520065 518780 516854 514108 510262 504946 498028 489618 479794 468726 457038 445642 435204
63348D35204r103p423n691m613m401m275l551k618k302k797l826n257o830p848
$$ 435204 426101 418678 412987 408374 403973 399698 396147 393529 391227 388430 384604 379347 372517 364669
63334C64669p907p480p099o528n394m084l179k617k152k061k463k550j559m9Q98
$$ 364669 356762 349282 342183 335655 330261 326177 322998 320381 318229 316168 313705 311155 309596 309547 310445
63319C10445J303K063L341M338M504M066L449K980K921L055K533R24j012k420
$$ 310445 311748 313811 317152 321490 325994 330060 333509 336489 339410 342465 344998 345922 344910 342490
63305C42490l620n224o639o800n954n307n152m784m120l840l896l396k276j564
$$ 342490 338870 333646 327007 320207 314253 308946 303794 299010 294890 291050 287154 283758 281482 279918
63291B79918j687j799j403j224j848k584k560k003j629j444r52j23N26O12K36
$$ 279918 278231 276432 275029 273805 271957 269373 266813 264810 263181 261737 260785 260662 261188 261800 262036
63276B62036j77k41RJ33j8N7O49J062N44l57m32L36Q39P20Q65J749K590K682K405
$$ 262036 261859 261618 261627 261760 261742 261799 262448 263510 264054 263697 263265 263601 264440 265160 266025 267774 270364 273046 275451
63257B75451K375K573K904L592M410M552L978L925N172O689O985O143N496N768
$$ 275451 277826 280399 283303 286895 291305 295857 299835 303760 308932 315621 322606 328749 334245 340013
63243C40013O575P453Q386R414J0511J1815J3446J5102J6359J7237J8020J8722
$$ 340013 346588 354041 362427 371841 382352 394167 407613 422715 439074 456311 474331 493053
63231D93053J9179J9514K0012K0620K1011K1100K1116K1208K1213K0828J9865
$$ 493053 512232 531746 551758 572378 593389 614489 635605 656813 678026 698854 718719
63220G18719J8536J7631J8096K0070K2544K4276K4994K5286K5442K4847K2720
$$ 718719 737255 754886 772982 793052 815596 839872 864866 890152 915594 940441 963161
63209I63161J9078J4659R835M091l120j1175j8404k3538k6659k8530k9589k9924
$$ 963161 982239 996898 1006733 1010824 1007704 996529 978125 954587 927928 899398 869809 839885
63197H39885k9677k8943k7492k5246k2636k0002j6980j3206r283o200l947j626
$$ 839885 810208 781265 753773 728527 705891 685889 668909 655703 646420 640220 636273 634647
63185F34647J185M041O516Q594J0120J0884J1383J2514J4269J5607J5910J5696
$$ 634647 635832 639873 646389 654983 665103 675987 687370 699884 714153 729760 745670 761366
63173G61366J5565J5405J5075J4985J5413J5894J5869J5342J4533J3462J2252
$$ 761366 776931 792336 807411 822396 837809 853703 869572 884914 899447 912909 925161
63162I25161J1095R587O878L009q04l774o584j0090j3793j6555j8203j9340k0020
$$ 925161 936256 945843 952721 955730 954926 951152 944568 934478 920685 904130 885927 866587 846567
63149H46567j9702j8396j6851j5506j4016j1969r517p111n043l370k037j015m32
$$ 846567 826865 808469 791618 776112 762096 750127 740610 733499 728456 725086 723049 722034 721602
63136G21602m62j005j752k698m179o167p948q821q761q056o764m988l321k462
$$ 721602 721140 720135 718383 715685 711506 705339 697391 688570 679809 671753 664989 660001 656680 654218
63122F54218k521l044l514l563l022k135j460j157p80j4P96J277J668K284K805
$$ 654218 651697 648653 645139 641576 638554 636419 634959 633802 633022 633008 633804 635081 636749 639033 641838
63107F41838K724K188J694J258O06l0p3N10J197J737K270K619K351J644J341J777
$$ 641838 644562 646750 648444 649702 650308 650278 650205 650715 651912 653649 655919 658538 660889 662533 663874 665651
63091F65651K279K305K433L431M833N297M449L477L551M317M598M139L839M279
$$ 665651 667930 670235 672668 676099 680932 686229 690678 694155 697706 702023 706621 710760 714599 718878
63077G18878M886M901M467M195M164M142M406N503P165Q354Q537Q301Q460R127
$$ 718878 723764 728665 733132 737327 741491 745633 750039 755542 762707 771061 779598 787899 796359 805486
63063H05486R984J0897J1945J3159J4553J6183J7984J9747K1444K3295K5502K8114
$$ 805486 815470 826367 838312 851471 866024 882207 900191 919938 941382 964677 990179 1018293
63051A018293L1134L4354L7234L9408M1178M2989M4558M5192M4887M4286M3571
$$ 1018293 1049427 1083781 1121015 1160423 1201601 1244590 1289148 1334340 1379227 1423513 1467084
63040A467084M2358M0747L9497L8853L8251L7541L7418L8127L8783L8608L7884
$$ 1467084 1509442 1550189 1589686 1628539 1666790 1704331 1741749 1779876 1818659 1857267 1895151
63029A895151L6895L4875L1010K5573J9065J0974O72j1040k2454l2696m1866m9840
$$ 1895151 1932046 1966921 1997931 2023504 2042569 2053543 2054215 2043175 2020721 1988025 1946159 1896319
63017A896319n6150o0818o4132o5667o4762o1967n8807n5837n2082m6786m0667
$$ 1896319 1840169 1779351 1715219 1649552 1584790 1522823 1464016 1408179 1356097 1309311 1268644
63006A268644l4921k9760k4648j9337j4084r141m530j49M224Q742J3101J6553
$$ 1268644 1233723 1203963 1179315 1159978 1145894 1136753 1132223 1132074 1136298 1145040 1158141 1174694
62994A174694J8618J9622K0359K1346K2582K3805K4807K5474K5618K4989K3552
$$ 1174694 1193312 1212934 1233293 1254639 1277221 1301026 1325833 1351307 1376925 1401914 1425466
62983A425466K1797K0385J9318J7720J4686J0128M555j627q244j5079k1939k8858
$$ 1425466 1447263 1467648 1486966 1504686 1519372 1529500 1534055 1532428 1524184 1509105 1487166 1458308
62971A458308l5762m2093m7129n0631n2837n3970n4133n3565n2488n0790m8195
$$ 1458308 1422546 1380453 1333324 1282693 1229856 1175886 1121753 1068188 1015700 964910 916715
62960I16715m4798m1081l7486l4229l1409k8953k6500k3742k0875j8414j6578
$$ 916715 871917 830836 793350 759121 727712 698759 672259 648517 627642 609228 592650
62949E92650j5162j3950j2978j2336j1910j1407j0575r469q433p668o917n923
$$ 592650 577488 563538 550560 538224 526314 514907 504332 494863 486430 478762 471845 465922
62937D65922n110n132n752n887n101m231m099m349m261l955l967m155m032l786
$$ 465922 460812 455680 449928 444041 438940 434709 430610 426261 422000 418045 414078 409923 405891 402105
62923D02105l950m355m377m114m254m801m924m201l201k580k349k228k077j736
$$ 402105 398155 393800 389423 385309 381055 376254 371330 367129 363928 361348 358999 356771 354694 352958
62909C52958j075l56j12m60j021j452j582j140p1Q87P44m30j486j694j487j465
$$ 352958 351883 351527 351415 350955 349934 348482 346900 345760 345689 346576 347320 346890 345404 343710 342223 340758
62893C40758j477j172q14q89j323j589j399q71k70J55K62J55P8M8j17l42k26M19
$$ 340758 339281 338109 337295 336406 335083 333494 332095 331224 330954 331109 331371 331526 331604 331652 331535 331193 330967 331386
62875C31386J282J960K313K317J947J426J219J595K396L276L838L521J965k86
$$ 331386 332668 334628 336941 339258 341205 342631 343850 345445 347841 351117 354955 358476 360441 360155
62861C60155j920k148j509j125j420j969k309k439k528k572k438k165k017k178
$$ 360155 358235 356087 354578 353453 352033 350064 347755 345316 342788 340216 337778 335613 333596 331418
62847C31418k418k294j766j346j393j526j136k78N34J183J945K643K550J490L94
$$ 331418 329000 326706 324940 323594 322201 320675 319539 319261 319795 320978 322923 325566 328116 329606 330000
62832C30000K88J077J702J316L0j273j676r35L07J179J465J621J980K305K277
$$ 330000 330288 331365 333067 334383 334413 333140 331464 330529 330836 332015 333480 335101 337081 339386 341663
62817C41663K076K169K730L489M001M010L698L624M159N016N602N800O018O495
$$ 341663 343739 345908 348638 352127 356128 360138 363836 367460 371619 376635 382237 388037 394055 400550
62803D00550P029P454P923Q505Q982R311R888J1056J2698J4656J7099K0100K3119
$$ 400550 407579 415033 422956 431461 440443 449754 459642 470698 483396 498052 515151 535251 558370
62790E58370K5504K7444K9909L3560L8010M2396M6411N0479N5055N9981O4723
$$ 558370 583874 611318 641227 674787 712797 755193 801604 852083 907138 967119 1031842
62779A031842O8949P2637P5638P7587P8303P7811P5767P1316O3975N4358M3442
$$ 1031842 1100791 1173428 1249066 1326653 1404956 1482767 1558534 1629850 1693825 1748183 1791625
62768A791625L1498J8323M356r258k1754l3250m3955n3502o1298o7094p0916p2873
$$ 1791625 1823123 1841446 1845802 1836544 1814790 1781540 1737585 1684083 1622785 1555691 1484775 1411902
62756A411902p3257p2537p1000o8658o5589o2079n8363n4530n0747m7178m3679
$$ 1411902 1338645 1266108 1195108 1126450 1060861 998782 940419 885889 835142 787964 744285
62745G44285l9925l5913l2010k8493k5468k3131k1579k0376j8946j7371j6079
$$ 744285 704360 668447 636437 607944 582476 559345 537766 517390 498444 481073 464994
62734D64994j4807j2812j0332q688q419q303p058n171l998l706l272k198j029
$$ 464994 450187 437375 427043 418355 409936 401633 394575 389404 385406 381700 378428 376230 375201
62721C75201j06R77K475L909M841N570O590P864R100J0315J1757J3466J5343J7456
$$ 375201 375095 376072 378547 382456 387297 392867 399457 407321 416421 426736 438493 451959 467302 484758
62707D84758J9943K2680K5369K7910L0506L3378L6642M0339M4364M8291N1513
$$ 484758 504701 527381 552750 580660 611166 644544 681186 721525 765889 814180 865693
62696H65693N3769N5288N6262N6297N4645N0904M5249L8044K9611K0374J0831
$$ 865693 919462 974750 1031012 1087309 1141954 1192858 1238107 1276151 1305762 1326136 1336967
62685A336967J172q706j8607k7809l5639m2001m7022n0531n2342n2773n2346n1186
$$ 1336967 1338139 1329433 1310826 1283017 1247378 1205377 1158355 1107824 1055482 1002709 950363 899177
62673H99177m9176m6599m4043m1697l9170l6114l2648k9174k6120k3783k2023
$$ 899177 850001 803402 759359 717662 678492 642378 609730 580556 554436 530653 508630
62662E08630k0254j8111j6075j4894j4524j4156j3206j1803j0286q952q190q174
$$ 508630 488376 470265 454190 439296 424772 410616 397410 385607 375321 366369 358179 350005
62650C50005q329p777o515n490n293n470n271m516l418k256j469j409j679j402
$$ 350005 341676 333899 327384 321894 316601 311131 305860 301344 297926 295670 294201 292792 291113 289711
62636B89711m96mo97j991k778k696k032j029j9L38k51j020r24P0J093J521J471
$$ 289711 289215 289211 288514 286523 283745 281049 279017 277988 277969 278307 278056 277036 276112 276182 277275 278796 280267
62619B80267J331J398J860K628L315L703M018M435M774N075N968P733R525J0400
$$ 280267 281598 282996 284856 287484 290799 294502 298520 302955 307729 312804 318772 326505 336030 346430
62605C46430J0796J1983J4211J6508J8379K0512K3424K6414K8594L0311L2657
$$ 346430 357226 369209 383420 399928 418307 438819 462243 488657 517251 547562 580219
62594E80219L5890L9006M0829M1069M0277L8995L7104L3852K8617K1627J3814
$$ 580219 616109 655115 695944 737013 777290 816285 853389 887241 915858 937485 951299
62583I51299N994j495q406j4352j9239k3519k7549l0919l2901l3479l3429l3323
$$ 951299 957293 955798 947392 933040 913801 890282 862733 831814 798913 765434 732005 698682
62571F98682l2893l1634k9631k7408k5260k3187k1380k0113j9123j7561j5067
$$ 698682 665789 634155 604524 577116 551856 528669 507289 487176 468053 450492 435425
62560D35425j2395j0594r787r299q766q419q282p881p056o465o728p389p342o213
$$ 435425 423030 412436 402649 393350 384584 376165 367883 360002 352946 346481 339753 332364 325022 318809
62546C18809m798l993l736l262k225j162p78j021j165p15J68J166K293L571M615
$$ 318809 314011 310018 306282 303020 300795 299633 298855 297834 296669 295954 296122 297288 299581 303152 307767
62531C07767N080N325O105P627R369J0838J1965J2806J3409J4234J6053J9074
$$ 307767 312847 318172 324277 331904 341273 352111 364076 376882 390291 404525 420578 439652
62519D39652K2501K5309K7281K8976L0994L3451L5936L7700L8087L7055L5116
$$ 439652 462153 487462 514743 543719 574713 608164 644100 681800 719887 756942 792058
62508G92058L2652K9450K5041J9372J2847N916j224q460j5388k1210k5255k7672
$$ 792058 824710 854160 879201 898573 911420 917336 916112 907652 892264 871054 845799 818127
62496H18127k9320l0720l1515l1310l0601l0157k9825k8727k6603k4090k1729
$$ 818127 788807 758087 726572 695262 664661 634504 604679 575952 549349 525259 503530
62485E03530j9532j7597j6156j4838j2862j0275q139p057o462n751n169n018m837
$$ 503530 483998 466401 450245 435407 422545 412270 404131 397074 390612 384861 379692 374674 369837
62472C69837m191l356k609j602k95L82j61r11m60J073K441L160L756M511N154
$$ 369837 365646 362290 359681 358079 357784 358166 358005 357094 356634 357707 360148 363308 367064 371575 376729
62457C76729N789O814P933Q284P766P239P214P244O773N743M151J879p37l002
$$ 376729 382518 389332 397265 405549 413315 420554 427768 435012 441785 447528 451679 453558 452821 449819
62443D49819m790o614q491r577r396q673q390q594q676q339p740p037o311n655
$$ 449819 445029 438415 429924 420347 410951 402278 393888 385294 376618 368279 360539 353502 347191 341536
62429C41536m917l664j838j59N83M96M12Q84J688K326K660L018L789M964O044
$$ 341536 336619 332955 331117 330958 331541 332037 332449 333333 335021 337347 340007 343025 346814 351778 357822
62414C57822O533O511O475O604O536O149O097P068Q584R251Q322O630N552N432
$$ 357822 364355 370866 377341 383945 390481 396630 402727 409795 418379 427630 435952 442582 448134 453566
62400D53566N512N210M759M426L844K645J300N72M42L03J25N36J641K656L060
$$ 453566 459078 464288 469047 473473 477317 479962 481262 481834 482276 482579 482704 483240 484881 487537 490597
62385D90597L345M130N293O484P871R650J1412J2806J4308J6521J9063K1076K2624
$$ 490597 493942 498072 503365 509849 517720 527370 538782 551588 565896 582417 601480 622556 645180
62372F45180K4564K7122K9539L1269L2693L4315L5934L6827L6301L3916K9729
$$ 645180 669744 696866 726405 757674 790367 824682 860616 897443 933744 967660 997389
62361I97389K4511J9266J4465J0068O175K945q0l699p942j1984j5460j9081k3334
$$ 997389 1021900 1041166 1055631 1065699 1071874 1074819 1074739 1071040 1063098 1051114 1035654 1016573 993239
62348I93239k7349k9755l0371l0274l0270k9974k8532k5882k2921k0580j8960
$$ 993239 965890 936135 905764 875490 845220 815246 786714 760832 737911 717331 698371
62337F98371j7569j6199j5123j4310j3142j1405j0032r964j0498r853p526n089
$$ 698371 680802 664603 649480 635170 622028 610623 600591 590627 580129 570276 562750 557661
62325E57661m180m570m803m090k819j583o11O9N30J090K046L194L955L967L347
$$ 557661 553481 548911 544108 540018 537199 535616 535005 535074 535604 536694 538740 541934 545889 549856 553203
62310E53203K434J592J177J360J931K527K976L275L347L180L071L379M005M433
$$ 553203 555637 557229 558406 559766 561697 564224 567200 570475 573822 577002 580073 583452 587457 591890
62296E91890M427M285M310M285L743K619J363M69J42L19P85J208J349J436K112
$$ 591890 596317 600602 604912 609197 612940 615559 616922 617391 617533 617852 618637 619845 621194 622630 624742
62281F24742L784O059Q047R209R790J0447J1676J3600J6082J8844K1604K4191
$$ 624742 628526 634585 642632 651841 661631 672078 683754 697354 713436 732280 753884 778075
62269G78075K6587K8885L1222L3619L5698L6721L6134L4022L0843K6885K2321
$$ 778075 804662 833547 864769 898388 934086 970807 1006941 1040963 1071806 1098691 1121012
62258A121012J7583J3110Q779M208l60m129o950r723j3148j6679j9307k0909k2169
$$ 1121012 1138595 1151705 1160484 1164692 1164332 1160203 1153253 1143530 1130382 1113703 1094396 1073487 1051318
62245A051318k3431k4291k4282k3378k1837j9939j7920j5844j3652j1443r581
$$ 1051318 1027887 1003596 979314 955936 934099 914160 896240 880396 866744 855301 845720
62234H45720q249p106n728m145k772j900j497j291q96k01K49k34j353j908j385
$$ 845720 837471 830365 824637 820492 817720 815820 814323 813032 812136 811935 812184 811950 810597 808689 807304
62219H07304q03j292k503l221l085k718k504k220j819j609j599j366p12J93J210
$$ 807304 806501 805209 802706 799485 796400 793682 791178 788958 787139 785530 783931 782565 781853 782046 783256
62204G83256K240K939L177L613N000O952Q276Q564Q596R066R832J0657J1740J3034
$$ 783256 785496 788435 791612 795225 800225 807177 815453 824017 832613 841679 851511 862168 873908 886942
62190H86942J3888J3873J3458J3267J3257J3066J2860J3249J4553J6549J8791
$$ 886942 900830 914703 928161 941428 954685 967751 980611 993860 1008413 1024962 1043753
62179A043753K0974K3048K5144K7241K8967K9896K9959K9169K7189K3676J9051
$$ 1043753 1064727 1087775 1112919 1140160 1169127 1199023 1228982 1258151 1285340 1309016 1328067
62168A328067J4414J0598P645N282L377J862N66p40k399m801p898j0907j2965
$$ 1328067 1342481 1353079 1360724 1366006 1369383 1371245 1371811 1371071 1368672 1363871 1355973 1345066 1332101
62155A332101j3970j4306j4071j3218j2186j1531j1007r863q052o284m997m110
$$ 1332101 1318131 1303825 1289754 1276536 1264350 1252819 1241812 1231949 1223897 1217613 1212616 1208506
62143A208506l790m345n246n414m796m542n146n565m797l371k437k225k244k351
$$ 1208506 1204716 1200371 1195125 1189711 1184915 1180373 1175227 1169662 1164865 1161494 1159057 1156832 1154588 1152237
62129A152237k638k755k185r68M63J867L146M080M713N660P433R681J1471J1952
$$ 1152237 1149599 1146844 1144659 1143691 1144154 1146021 1149167 1153247 1157960 1163620 1171053 1180734 1192205 1204157
62115A204157J0522O977K117k293m842n472m729k729K30K593K322j020n777r912
$$ 1204157 1214679 1221656 1223773 1221480 1216638 1211166 1206437 1203708 1203938 1206531 1208853 1207833 1202056 1192144
62101A192144j2575j3941j4297j3754j2462j0676q706o912n562m587l620k430
$$ 1192144 1179569 1165628 1151331 1137577 1125115 1114439 1105733 1098821 1093259 1088672 1085052 1082622
62089A082622j174p4J034K560M477O036O554O424O816Q191R670J0270J0239J0563
$$ 1082622 1081448 1081374 1082408 1084968 1089445 1095481 1102035 1108459 1115275 1123466 1133136 1143406 1153645 1164208
62075A164208J1496J2383J2681J2273J0905Q223M530O44l040o576r530j1048j1182
$$ 1164208 1175704 1188087 1200768 1213041 1223946 1232169 1236699 1237343 1234303 1227727 1218197 1207149 1195967
62062A195967j1182j2002j3347j4625j5952j7634j9379k0745k1730k2386k2397
$$ 1195967 1184785 1172783 1159436 1144811 1128859 1111225 1091846 1071101 1049371 1026985 1004588
62051A004588k1625k0506j9413j8194j6857j5956j5691j5229j3774j1749j0227
$$ 1004588 982963 962457 943044 924850 907993 892037 876346 861117 847343 835594 825367
62040H25367r652r758j0243j0712j0442r086p428o623o947p768q466q730q333
$$ 825367 815715 805957 795714 785002 774560 765474 758046 751423 744476 736708 728242 719512 711179
62027G11179p375o534o411o817p227p548p875p869p196o326o048o303o246n392
$$ 711179 703804 697270 690859 684042 676815 669267 661392 653523 646327 640001 633953 627650 621404 616012
62013F16012m089k904k141j866j914j899j656j483j619j746j579j528k120l120
$$ 616012 611923 609019 606878 605012 603098 601199 599543 598060 596441 594695 593116 591588 589468 586348
61999E86348l869m297m798n373n604n463n359n435n426n256n134n028m577l609
$$ 586348 582479 578182 573384 568011 562407 556944 551585 546150 540724 535468 530334 525306 520729 517120
61985E17120k341j095j46L35N27R00J509J784J514J516K561M089M912M910M976
$$ 517120 514779 513684 513538 513873 514400 515300 516809 518593 520107 521623 524184 528273 533185 538095 543071
61970E43071N388N456M891M457M856N768O438O633O583O561O837P611Q672R514
$$ 543071 548459 553915 558806 563263 568119 573887 580325 586958 593541 600102 606939 614550 623222 632736
61956F32736R971J0430J1262J2434J3779J5240J6681J7931J9108K0489K1975K3085
$$ 632736 642707 653137 664399 676833 690612 705852 722533 740464 759572 780061 802036 825121
61944H25121K3653K4081K4712K5411K6027K6827K8122K9771L1387L2835L4247
$$ 825121 848774 872855 897567 922978 949005 975832 1003954 1033725 1065112 1097947 1132194
61933A132194L5651L6971L8365M0284M3001M6315M9938N4136N9642O6761P4935
$$ 1132194 1167845 1204816 1243181 1283465 1326466 1372781 1422719 1476855 1536497 1603258 1678193
61922A678193Q3516R2638J02855J14195J26306J39392J53989J69700J85079J99172
$$ 1678193 1761709 1854347 1957202 2071397 2197703 2337095 2491084 2660784 2845863 3045035
61912C045035K12199K24227K34051K40093K41442K37108K25091K03423J71814
$$ 3045035 3257234 3481461 3715512 3955605 4197047 4434155 4659246 4862669 5034483
61903E034483J31442Q3734L0628k4296p6452j22418j60839j91283k13266k26689
$$ 5034483 5165925 5249659 5280287 5255991 5179539 5057121 4896282 4704999 4491733 4265044
61893D265044k32431k32114k27524k20130k10680j99286j86285j72749j59663
$$ 4265044 4032613 3800499 3572975 3352845 3142165 2942879 2756594 2583845 2424182
61884B424182j47031j34423j22019j10374r9591q9609q0850p3575o6943n9965
$$ 2424182 2277151 2142728 2020709 1910335 1810744 1721135 1640285 1566710 1499767 1439802
61874A439802n3150m7863m4101m0275l5465l0519k6511k3332k0399j7653j5099
$$ 1439802 1386652 1338789 1294688 1254413 1218948 1188429 1161918 1138586 1118187 1100534 1085435
61863A085435j2195q510m496r50J841L998N583O707P720Q884J0061J0917J1207
$$ 1085435 1073240 1064730 1060234 1059284 1061125 1065123 1070706 1077413 1085133 1094017 1104078 1114995 1126202
61850A126202J0850J0029R142Q273P014N421M652N691P772R208R672J0274J1275
$$ 1126202 1137052 1147081 1156223 1164496 1171510 1176931 1181583 1187274 1195046 1204254 1213926 1224200 1235475
61837A235475J1380R849P760O366N335L720J575m69k366m225n376n119m003l248
$$ 1235475 1246855 1256704 1264464 1270830 1276165 1279885 1281460 1280991 1278625 1274400 1269024 1263905 1259902 1256654
61823A256654l078k667j553j05J329K885M712O771R203J2222J5546J8498K0890
$$ 1256654 1253576 1250909 1249356 1249251 1250580 1253465 1258177 1264948 1274151 1286373 1301919 1320417 1341307
61810A341307K3261K6165K9602L3307L7179M1205M5282M9407N3870N8997O4766
$$ 1341307 1364568 1390733 1420335 1453642 1490821 1532026 1577308 1626715 1680585 1739582 1804348
61799A804348P0823P6975Q3567R1178J00014J09790J20321J31977J45319J60550
$$ 1804348 1875171 1952146 2035713 2126891 2226905 2336695 2457016 2588993 2734312 2894862
61789B894862J77586J96385K16792K38355K60888K84897L10722L37308L62578
$$ 2894862 3072448 3268833 3485625 3723980 3984868 4269765 4580487 4917795 5280373
61780E280373L85030M04093M18581M25597M21458M03271L69346L18865K52015
$$ 5280373 5665403 6069496 6488077 6913674 7335132 7738403 8107749 8426614 8678629
61771H678629J70709P9066j6751j09671j93712k65500l23775l67702l96475m10736
$$ 8678629 8849338 8928404 8911653 8801982 8608270 8342770 8018995 7651293 7254818 6844082
61761F844082m13238m07360l95305l78208l57375l34577l11273k88114k65303
$$ 6844082 6430844 6023484 5628179 5249971 4892596 4558019 4246746 3958632 3693329
61752C693329k43168k22329k03337j86059j69626j53434j38085j24785j13838
$$ 3693329 3450161 3227832 3024495 2838436 2668810 2515376 2377291 2252506 2138668
61743B138668j04342r5462q7185p9657p2673o6191o0671n6306n2509m8665m4828
$$ 2138668 2034326 1938864 1851679 1772022 1699349 1633158 1572487 1516181 1463672 1415007 1370179
61732A370179m1278l7907l4615l1837k9972k8681k7188k5149k2799k0622j9068
$$ 1370179 1328901 1290994 1256379 1224542 1194570 1165889 1138701 1113552 1090753 1070131 1051063
61721A051063j8237j7582j6422j4903j3844j3383j2746j1698j1203j1846j2602
$$ 1051063 1032826 1015244 998822 983919 970075 956692 943946 932248 921045 909199 896597
61710H96597j2285j1414j1330j1977j2028j1084j0243j0244j0336r521p985o599
$$ 896597 884312 872898 861568 849591 837563 826479 816236 805992 795656 786135 778150 771551
61698G71551n688m971m250l552k775j737n58L68Q35J056J342J655J604Q89m08
$$ 771551 765863 760892 756642 753090 750315 748578 748020 748388 749223 750279 751621 753276 754880 755769 755361
61683G55361k092m276p094j0057j2198j3091j3299j3502j3572j2940j1576j0027
$$ 755361 753269 748993 741899 731842 719644 706553 693254 679752 666180 653240 641664 631637
61671F31637q690p466o166m827l532k230q63M16J216J142J42j414l104m851o677
$$ 631637 622947 615481 609315 604488 600956 598726 597863 598279 599495 600637 600779 599365 596261 591410 584733
61656E84733q215q905q692q088p454o730n944n347m869m085l026k351k370k500
$$ 584733 576518 567613 558921 550833 543379 536649 530705 525358 520489 516404 513378 511027 508657 506157
61642E06157k271k124k612l339l473k944k299j676q11J41O04M90L44M69N42K58
$$ 506157 503886 501762 499150 495811 492338 489394 487095 485419 484608 484749 485353 485843 486187 486656 487198 487456
61626D87456j59k90n5L33O26O48L09l27j076j662j811j576j537k246l287l477
$$ 487456 487297 487007 486952 487285 487911 488559 488868 488541 487465 485803 483992 482416 480879 478633 475346 471869
61610D71869k343q94l51o81r84r77j115j471j461q59k16lL7L42Q15J103J217J532
$$ 471869 469526 468632 468281 467600 466616 465639 464524 463053 461592 460733 460517 460514 460551 460893 461708 462811 464028 465560
61592D65560K257L163L772L778L404L352M177N647O909P372P273P310P911Q949
$$ 465560 467817 470980 474752 478530 481934 485286 489463 495110 502019 509391 516664 523974 531885 540834
61578E40834J0106J1278J2534J3715J4392J4498J4829J6435J9397K2620K5088
$$ 540834 550940 562218 574752 588467 602859 617357 632186 648621 668018 690638 715726
61567G15726K6845K8495L0038L0697K9714K7033K3255J9191J5287J1337O973K542
$$ 715726 742571 771066 801104 831801 861515 888548 911803 930994 946281 957618 964591 967133
61555I67133r33k879l734m029l478j717M97J757J662J186J258J704J863J664J509
$$ 967133 966200 963321 959587 955558 952080 950363 950860 952617 954279 955465 956723 958427 960290 961954 963463
61540I63463J531J459J104N19l46j735l618n393o306o185n530m854m194l337k245
$$ 963463 964994 966453 967557 968076 967730 965995 962377 956984 950678 944493 938963 934109 929915 926578 924333
61525I24333j028L24J881L581N411P580J0151J2701J4862J7005J9875K3593K7607
$$ 924333 923305 923629 925510 929091 934502 942082 952233 964934 979796 996801 1016676 1040269 1067876
61512A067876L1580L5661L9866M3939M7938N2221N6743O1142O5715P1395P8440
$$ 1067876 1099456 1135117 1174983 1218922 1266860 1319081 1375824 1436966 1502681 1574076 1652516
61501A652516Q6065R3655J01330J08665J14062J16365J16285J15086J12535J07373
$$ 1652516 1738581 1832236 1933566 2042231 2156293 2272658 2388943 2504029 2616564 2723937
61491B723937R9338Q9429P8356O5991N2401L8381K4687J1691l9r550j6297k0539
$$ 2723937 2823275 2912704 2991060 3057051 3109452 3147833 3172520 3184211 3184172 3174622 3158325 3137786
61479C137786k2808k3501k3174k2672k2751k3879k6505l1060l7592m5621n4370
$$ 3137786 3114978 3091477 3068303 3045631 3022880 2999001 2972496 2941436 2903844 2858223 2803853
61468B803853o2908p0203p5429p8136p7979p4630o8492o1050n3837m7142m0365
$$ 2803853 2740945 2670742 2595313 2517177 2439198 2364568 2296076 2235026 2181189 2134047 2093682
61457B093682l3388k6751k0617j4577q639l538L64L792P698J2199J6796K1212
$$ 2093682 2060294 2033543 2012926 1998349 1989710 1986172 1986536 1990328 1998026 2010225 2027021 2048233
61445B048233K5569K9988L4507L9268M4500N0213N6007O0952O3598O2332N6095
$$ 2048233 2073802 2103790 2138297 2177565 2222065 2272278 2328285 2389237 2452835 2515167 2571262
61434B571262M5063L0931J6564M808l017p639j0630j2736j3640j3139j1781j0139
$$ 2571262 2616325 2647256 2663820 2668628 2665611 2657972 2647342 2634606 2620966 2607827 2596046 2585907
61422B585907p980m655j68M683R219J3571J8017K1622K1919J6461M889j0499k6128
$$ 2585907 2577927 2573272 2573104 2577787 2587006 2600577 2618594 2640216 2662135 2678596 2683485 2672986 2646858
61409B646858l8969m7423n1312n1544m9502m6250m2241l7746l3363k9786k7301
$$ 2646858 2607889 2560466 2509154 2457610 2408108 2361858 2319617 2281871 2248508 2218722 2191421
61398B191421k5604k4037k1997j9412j6865j4912j3252j0928p458l249J189N850
$$ 2191421 2165817 2141780 2119783 2100371 2083506 2068594 2055342 2044414 2036956 2033707 2034896 2040746
61386B040746J0912J6345K2248K8934L6379M4029N1554N9278O7440P5622Q3318
$$ 2040746 2051658 2068003 2090251 2119185 2155564 2199593 2251147 2310425 2377865 2453487 2536805
61375B536805R0580R7544J03853J09050J13043J15522J15427J11658J03955R2555
$$ 2536805 2627385 2724929 2828782 2937832 3050875 3166397 3281824 3393482 3497437 3589992
61365C589992P7493N9024L8382J7325k883k1503l7901n1900o4293p6028q6992
$$ 3589992 3667485 3726509 3764891 3782216 3779333 3757830 3719929 3668029 3603736 3527708 3440716
61354C440716r6202j03009j07463j09772j10201j09370j07839j05487j01913r7338
$$ 3440716 3344514 3241505 3134042 3024270 2914069 2804699 2696860 2591373 2489460 2392122
61344B392122r2396q7270q1683p5610o9240o2421n4983m7478m0836l5227k9976
$$ 2392122 2299726 2212456 2130773 2055163 1985923 1923502 1868519 1821041 1780205 1744978 1715002
61333A715002k4588j9134j3697q238l020J538N550R565J3789J7965K1968K5739
$$ 1715002 1690414 1671280 1657583 1649345 1646325 1647863 1653413 1662978 1676767 1694732 1716700 1742439
61321A742439K8556K9265K7515K4233K0666J7407J4564J2282J0774J0045R810
$$ 1742439 1770995 1800260 1827775 1852008 1872674 1890081 1904645 1916927 1927701 1937746 1947556
61310A947556R661R418R388J0026J1162J2054J2420J2787J3422J3690J3125J2337
$$ 1947556 1957217 1966635 1976023 1986049 1997211 2009265 2021685 2034472 2047894 2061584 2074709 2087046
61298B087046J1933J1231R206O234L609J650m03k792m918o623q487j0568j2101
$$ 2087046 2098979 2110210 2119416 2125650 2129259 2130909 2130506 2127714 2122796 2116173 2107686 2097118 2085017
61285B085017j2753j3129j3597j3623j2621j0643p918m599j329P49J012k33k571
$$ 2085017 2072264 2059135 2045538 2031915 2019294 2008651 2000733 1996134 1994805 1995554 1996566 1996333 1993762
61272A993762n916r927j3729j6589j8300j8829j8309j7451j7054j6916j6117j4495
$$ 1993762 1987846 1977919 1964190 1947601 1929301 1910472 1892163 1874712 1857658 1840742 1824625 1810130
61260A810130j2825j1251q769m780j21M052P584J0882J4108J7628K2439K9261
$$ 1810130 1797305 1786054 1777285 1772505 1772384 1776436 1784020 1794902 1809010 1826638 1849077 1878338
61248A878338L7611M6508N5574O4837P3950Q2454R0225R6745J00120R7691Q7833
$$ 1878338 1915949 1962457 2018031 2082868 2156818 2239272 2329497 2426242 2526362 2624053 2711886
61237B711886P0888M8762K4280O37j9570l5335m7174n6041o2527o6848o9037o8951
$$ 2711886 2782774 2831536 2855816 2856453 2836883 2801548 2754374 2698333 2635806 2568958 2499921 2430970
61225B430970o6272o0844n2941m3169l2165k0556r344k29M746M163k015j2364
$$ 2430970 2364698 2303854 2250913 2207744 2175579 2155023 2145679 2145450 2150196 2154359 2152344 2139980
61213B139980k4368l5048m2173m5503m6676m7435m8045m7608m5416m1544l6524
$$ 2139980 2115612 2080564 2038391 1992888 1946212 1898777 1850732 1803124 1757708 1716164 1679640
61202A679640l1122k6267k2568j9966j8168j7233j7332j8150j9028j9580j9779
$$ 1679640 1648518 1622251 1599683 1579717 1561549 1544316 1526984 1508834 1489806 1470226 1450447
61191A450447j9691j9488j9395j9298j8762j7832j7248j7403j7660j7335j6720
$$ 1450447 1430756 1411268 1391873 1372575 1353813 1335981 1318733 1301330 1283670 1266335 1249615
61180A249615j6337j5846j4620j2913j1534j0720j0195r802r224p619m750j969
$$ 1249615 1233278 1217432 1202812 1189899 1178365 1167645 1157450 1147648 1138424 1130805 1126055 1124086
61168A124086q41j208j815k564m664q683j3786j8887k3254k6019k6524k5391k4131
$$ 1124086 1123245 1122037 1120222 1117658 1112994 1104311 1090525 1071638 1048384 1022365 995841 970450 946319
61155I46319k3387k2581k1287j9855j8580j7377j6396j5961j5772j5185j4251
$$ 946319 922932 900351 879064 859209 840629 823252 806856 790895 775123 759938 745687
61144G45687j3509j2879j1844j0605r842r429q655p567o747n895m212k121r57
$$ 745687 732178 719299 707455 696850 687008 677579 668924 661357 654610 648715 644503 642382 641425
61131F41425p23J09K259M705O526Q033R515J0485J0878J1547J2644J2837J1062
$$ 641425 640702 640811 643070 647775 654301 662334 671849 682334 693212 704759 717403 730240 741302
61118G41302P981M919K379L51r61j511j761j958j744r38NO75J073J087N10k52
$$ 741302 749283 754202 756581 756932 755971 754460 752699 750741 748997 748059 748064 748739 749812 750899 751409 751157
61102G51157n08m43r79k256l406l954m313m654m611m345m650n619o352o365o121
$$ 751157 750649 750206 749227 746971 743565 739611 735298 730644 726033 721688 717038 711419 705067 698702 692581
61087F92581n940n508m804m299l984l298k220j329p14N5Q84J348J719K472L063
$$ 692581 686641 681133 676329 672030 668046 664748 662528 661199 660485 660540 661424 662772 664491 666963 670026
61072F70026K851K756M143O272P168O853P318R078J0313R990R351R505R877R914
$$ 670026 672877 675633 679776 686048 693216 700069 707387 716465 726778 736768 746119 755624 765501 775415
61058G75415J0168J0732J0574R419Q373P943P280O108N481N915O698P515Q831
$$ 775415 785583 796315 806889 816308 824681 832624 839904 846012 851493 857408 864106 871621 880452
61045H80452J0250J0742J0845J2315J5191J7654J9111K0740K2774K4240K5734
$$ 880452 890702 901444 912289 924604 939795 957449 976560 997300 1020074 1044314 1070048
61034A070048K9127L3950L7587L9772M3215M8821N4152N7652O0463O2907O3539
$$ 1070048 1099175 1133125 1170712 1210484 1253699 1302520 1356672 1414324 1474787 1537694 1601233
61023A601233O3138O5171P0718P7494Q5238R6695J11424J24525J34075J43835
$$ 1601233 1664371 1729542 1800260 1877754 1962992 2059687 2171111 2295636 2429711 2573546
61013B573546J56176J69601J86543K15426K60225L16317L81933M63596N63391
$$ 2573546 2729722 2899323 3085866 3301292 3561517 3877834 4259767 4723363 5286754
61004E286754O73367P93572R42631J137011J378782J687703K115421K656653L124592
$$ 5286754 5960121 6753693 7696324 8833335 10212117 11899820 14015241 16671894 19796486
60995A9796486L187572K624369J564547M32388l71287p14157o76877l49454K16273
$$ 19796486 22984058 25608427 27172974 27605362 27234075 26519918 25843041 25493587 25709860
60986B5709860Q59989J241044J031459K02961r18239j898936k487948k686651
$$ 25709860 26569849 27810893 28842352 29045313 28127074 26228138 23740190 21053539
60978B1053539k620119k405647k122990j831500j567984j339440j139220r66578
$$ 21053539 18433420 16027773 13904783 12073283 10505299 9165859 8026639 7060061
60970G060061q23279p02665n95052m99111m18926l54255l01255k58760k26535
$$ 7060061 6236782 5534117 4939065 4439954 4021028 3666773 3365518 3106758 2880223
60961B880223k00446j75920j53734j36803j23820j11240r9036q9170q0700p1516
$$ 2880223 2679777 2503857 2350123 2213320 2089500 1978260 1879224 1790054 1709354 1637838
60951A637838o3234n9217n8962n8868n7465n5746n3401m8893m2699l6868l1805
$$ 1637838 1574604 1515387 1456425 1397557 1340092 1284346 1230945 1182052 1139353 1102485 1070680
60940A070680k6529k1386j7594j4820j1972r566q731q833q521q120q531r021q488
$$ 1070680 1044151 1022765 1005171 990351 978379 968813 960082 951249 942728 934608 926077 917056 908568
60927I08568p678p713p767o671n447n668o618o788o787q027r770j0359j0242j0923
$$ 908568 900890 893177 885410 878739 873292 867624 861006 854218 847431 839404 829634 819275 809033 798110
60913G98110j1935j1744j0703j0226r977q764p344p326q077p753o783p094q345
$$ 798110 786175 774431 763728 753502 743525 734761 727417 720091 712014 704261 697478 690384 682039
60900F82039q209o384n130n520o087n638m822m334l888l532l889m603m353k869
$$ 682039 673830 667446 662316 656796 650709 645071 640249 635915 632027 628495 624606 620003 615650 612781
60886F12781j252j47P62J425J377J061J478K407K598J757Q05K18k21k88M27J201
$$ 612781 611529 611382 612144 613569 614946 616007 617485 619892 622490 624247 625052 625270 625049 624761 625188 626389
60870F26389Q37m21j191j028o18q4J105K644L549L713L753L403J855l77j693j580
$$ 626389 627226 626805 625614 624586 623968 623884 624989 627633 631182 634895 638648 642051 643906 643529 641836 640256
60854F40256r10j15J172K584K778J206j349m105o844r155j0490j1133j1797j2279
$$ 640256 639346 639231 640403 642987 645765 646971 645622 641517 634673 625518 615028 603895 592098 579819
60840E79819j1815j0604r526q527o825m730l531l445l296k467j679j450j229n27
$$ 579819 568004 557400 547874 539347 532522 527792 524261 520816 517520 515053 513374 511924 510695 510168
60826E10168K69O39N77K48j91l64m0L47L07J03K09M47N99J187K451L298K715J550
$$ 510168 510437 511076 511653 511901 511710 511346 511306 511653 511960 512063 512272 512719 513318 514505 516956 520254 522969 524519
60808E24519J385K172K671K669K903L180K560J275N74O46N22j8k09Pj22n15l42
$$ 524519 525904 528076 530747 533416 536319 539499 542059 543334 543908 544554 545076 545058 544849 544856 544734 544219 543877
60791E43877J86n1r91j340q50p47j569k472l088m068n277n382m061k850k813l093
$$ 543877 544063 544012 543021 541681 540831 540084 538515 536043 532955 528887 523610 518228 514167 511317 508504 505411
60775E05411k655j959j793j782j199k55L85N18J57p41j745k086j742j466j351
$$ 505411 502756 500797 499004 497222 496023 495768 496153 496671 496828 496087 494342 492256 490514 489048 487697
60760D87697o46O64J449J213R07J284J810J999K513L730M438L264P67j231j839
$$ 487697 487051 487715 489164 490377 491284 492568 494378 496377 498890 502620 507058 510322 511089 509858 508019
60745E08019j678j548j599j685j809k056k449k850k960k632k150j817j389m83
$$ 508019 506341 504793 503194 501509 499700 497644 495195 492345 489385 486753 484603 482786 481397 480914
60731D80914M88N64n59k137l283l628l196k373j992k691m068n150n584n678n491
$$ 480914 481402 481966 481407 479270 475987 472359 469163 466790 464798 462107 458039 452889 447305 441627 436136
60716D36136m809l919l413l267k985k574k361k063j174j68m4o98j019o54l25l06
$$ 436136 431327 427408 423995 420728 417743 415169 412808 410745 409571 409403 409359 408661 407642 406988 406663 406357
60700D06357j1O17P21O7l35K69J364K172K623K810K551K014J868K303K720K750
$$ 406357 406346 406963 407684 407751 407416 407685 409049 411221 413844 416654 419205 421219 423087 425390 428110 430860
60684D30860K671K583K181J660J750K486L035L114L426M201M574M008L157K674
$$ 430860 433531 436114 438295 439955 441705 444191 447226 450340 453766 457967 462541 466549 469706 472380
60670D72380K179J261M04J02j4k96j93Q11K158K984L367L887M459M566M243M002
$$ 472380 474559 475820 476224 476326 476312 476016 475823 476634 478792 481776 485143 489030 493489 498055 502298 506300
60654E06300L940L579K529Q46j078k723l726m236m712n275n542n236m616m124
$$ 506300 510240 513819 516348 517194 516116 513393 509667 505431 500719 495444 489902 484666 480050 475926
60640D75926l967m040l987l398k378j710j917k439k372j761j392j523j735j884
$$ 475926 471959 467919 463932 460534 458156 456446 454529 452090 449718 447957 446565 445042 443307 441423
60626D41423k250k761l007l042l260l495l170k365j788j711j816k013k395k501
$$ 441423 439173 436412 433405 430363 427103 423608 420438 418073 416285 414574 412758 410745 408350 405849
60612D05849j763o52k20n14o00j36L29O25J210J981K251K076K242K700K469J354
$$ 405849 404086 403434 403214 402700 402100 401964 402293 402918 404128 406109 408360 410436 412678 415378 417847 419201
60596D19201L46p2n16j192j276m87K37K95L58R60J447J199P59Q71J345J666J810
$$ 419201 419547 419475 418959 417767 416491 416004 416241 416536 416894 417854 419301 420500 421259 422130 423475 425141 426951
60579D26951J823J459Q84Q26J488K184K491K827L457L942M010L882L466K430J361
$$ 426951 428774 430233 431117 431943 433431 435615 438106 440933 444390 448332 452342 456224 459690 462120 463481
60564D63481J463K587L137K429J703J983K569K591K545L148M008M613N433O811
$$ 463481 464944 467531 470668 473097 474800 476783 479352 481943 484488 487636 491644 496257 501690 508501
60550E08501P983Q376Q829J0298J2418J4526J7110K0856K5160K8978L2506L6798
$$ 508501 516484 524860 533689 543987 556405 570931 588041 608897 634057 663035 695541 732339
60538G32339M2271M8657N5717O2759O7991O9440O6276N8610M6657L0962J2891
$$ 732339 774610 823267 878984 941743 1009734 1079174 1145450 1204060 1250717 1281679 1294570
60527A294570n852k3643l8539m8585n3395n4441n3120m9598m4251l8753l4354
$$ 1294570 1288718 1265075 1226536 1177951 1124556 1070115 1016995 967397 923146 884393 850039
60516H50039l0320k5452k0147j5551j1587p492l443r3K955O653J0947J5212J9740
$$ 850039 819719 794267 774120 758569 746982 739490 736047 735954 738909 745562 756509 771721 791461
60503G91461K5320L1669L7749M3525M9876N6761O2587O5471O4150N7965M7084
$$ 791461 816781 848450 886199 929724 979600 1036361 1098948 1164419 1228569 1286534 1333618
60492A333618L2828J6948Q36j3865k4558k9054k7551k2148j4437m617P131J9771
$$ 1333618 1366446 1383394 1384230 1370365 1345807 1316753 1289202 1267054 1252617 1248000 1255131 1274902
60480A274902L2320M4745N7366O9547P9085Q2807P8238O5181M5496K1225o250
$$ 1274902 1307222 1351967 1409333 1478880 1557965 1640772 1719010 1784191 1829687 1850912 1844662
60469A844662l4910o1133q1312r4085j00274j01198r8014r2143q5011p7329o9341
$$ 1844662 1809752 1748619 1667307 1573222 1472948 1371750 1273736 1181593 1096582 1019253 949912
60458I49912o1558n4545m8226m2241l6806l2453k9043k5745k2012j8135j4900
$$ 949912 888354 833809 785583 743342 706536 674083 645040 619295 597283 579148 564248
60447E64248j2898j1979j1143r411o896m551k858j496l84R4Q0L59J067J445J294
$$ 564248 551350 539371 528228 518817 511921 507370 504512 503016 502632 502726 502806 503165 504232 505677 506971
60432E06971J341J619J076l94j151k80P13Q1j581k563k711l045l621l540k599
$$ 506971 508312 509931 511007 510613 509462 509182 509895 509976 508395 505832 503121 500076 496455 492915 490316
60417D90316j350O6J705K976L380L569M371N363N761N960O730P535P433P083Q061
$$ 490316 488966 489032 490737 493713 497093 500662 505033 510396 516157 522117 528847 536382 543815 550898 558959
60402E58959J0417J2658J3970J4886J5756J6213J6217J6199J5995J4920J2998
$$ 558959 569376 582034 596004 610890 626646 642859 659076 675275 691270 706190 719188
60391G19188J1047R485Q086O796N774M815L705K902K791K709J831O18J29K76J11
$$ 719188 730235 739720 747806 754602 760376 765191 768896 771798 774589 777298 779129 779747 779876 780152 780263
60376G80263m60o52k13L87R21J299R00n22j696j122P18J952J910J512J311Q55
$$ 780263 779803 779151 778938 779325 780246 781545 782445 781923 780227 779105 779823 781775 783685 785197 786508 787363
60360G87363O9l60k74k61n16p04r24j445j615n61J016J387K12j198k130l321n182
$$ 787363 787432 787072 786798 786537 786021 785317 784393 782948 781333 780772 781788 783175 783387 782189 780059 776738 771556
60343G71556o839p510p472p158o560n866n516n296m518l327k621k630k773l018
$$ 771556 764717 757207 749735 742577 736017 730151 724635 719339 714821 711494 708873 706243 703470 700452
60329G00452l905n087n411m765m325m685n159n312n636o257o440n937n410n032
$$ 700452 696547 691460 686049 681284 676959 672274 667115 661803 656167 649910 643470 637533 632123 627091
60315F27091m113k646j769j993k327j839q31K11J517L118M258M520M527M978N989
$$ 627091 622978 620332 618563 616570 614243 612404 611573 611784 613301 616419 620677 625197 629724 634702 640691
60300F40691P761J0495J3086J3456J1039P627M835K115j724o279j0111j2486j3384
$$ 640691 648452 658947 672033 685489 696528 704155 708990 711105 709381 703102 692991 680505 667121
60287F67121j2664j0513q078o445n437m216k606r76N87K128L298L752L789L962
$$ 667121 654457 643944 635866 629421 623984 619768 617162 616186 616773 618901 622199 625951 629740 633702
60273F33702M361M689M668M154L381L204M367O341P759Q245Q798J0016J1154J1500
$$ 633702 638063 642752 647420 651574 654955 658159 662526 668867 676626 684871 693669 703685 714839 726339
60259G26339J1632J2454J3875J5132J5725J5441J4249J2762J1963J1938J1708
$$ 726339 737971 750425 764300 779432 795157 810598 824847 837609 849572 861510 873218
60248H73218J0848J0181J0378J0921J1278J1909J3269J4828J6128J7784K0379
$$ 873218 884066 894247 904625 915546 926824 938733 952002 966830 982958 1000742 1021121
60237A021121K3255K5555K7652L0335L3399L6272L9385M3479M8120N2316N6232
$$ 1021121 1044376 1069931 1097583 1127918 1161317 1197589 1236974 1280453 1328573 1380889 1437121
60226A437121O0795O5748O9667P2063P4010P6249P7910P7715P5575P2274O8195
$$ 1437121 1497916 1563664 1633331 1705394 1779404 1855653 1933563 2011278 2086853 2159127 2227322
60215B227322O3156N7136N0550M3726L6638K9239K1796J4623P628N04o532j2514
$$ 2227322 2290478 2347614 2398164 2441890 2478528 2507767 2529563 2544186 2551814 2552318 2545786 2533272
60203B533272j6585j8796j9805k0026j9548j8562j7153j4782j0729n004J693Q913
$$ 2533272 2516687 2497891 2478086 2458060 2438512 2419950 2402797 2388015 2377286 2372282 2373975 2382888
60191B382888J6584K4371L1796L9084M6896N4991O2095O7381P1179P3764P4390
$$ 2382888 2399472 2423843 2455639 2494723 2541619 2596610 2658705 2726086 2797265 2871029 2945419
60180B945419P2083O6783N9138M9783L9300K8242J6673M135r486k3432l6767m9161
$$ 2945419 3017502 3084285 3143423 3193206 3232506 3260748 3277421 3281556 3272070 3248638 3211871 3162710
60168C162710o0626p0871p9178q4656q6616q5158q1362p6296o9942o1730n1933
$$ 3162710 3102084 3031213 2952035 2867379 2780763 2695605 2614243 2537947 2468005 2406275 2354342
60157B354342m1622l1337k0876j0439p86P960J6445K4655L1495L6117L8500L8329
$$ 2354342 2312720 2281383 2260507 2250068 2249282 2257242 2273687 2298342 2329837 2365954 2404454 2442783
60145B442783L4802K8242K0627J3510O468j422r579j6549k1886k6253l0043l2859
$$ 2442783 2477585 2505827 2526454 2539964 2546432 2545010 2535431 2518882 2496996 2470743 2440700 2407841
60133B407841l4049l3119k9980k5303k0087j4473p595R97J0599K0482L0790M1737
$$ 2407841 2373792 2340673 2310693 2285390 2265303 2250830 2243235 2244232 2254831 2275313 2306103 2347840
60121B347840N2883O4052P6008Q9355J03507J17624J31724J45927J59382J71040
$$ 2347840 2400723 2464775 2540783 2630138 2733645 2851269 2982993 3128920 3288302 3459342
60111C459342J80810J88839J94255J95781J93168J86953J77213J63613J46401
$$ 3459342 3640152 3828991 4023246 4219027 4412195 4599148 4776361 4939974 5086375
60102E086375J26306J03728P8897N2611K5883r39k7803n3983p8286j00121j19427
$$ 5086375 5212681 5316409 5395306 5447917 5473800 5472861 5445058 5391075 5312789 5212668 5093241
60091E093241j35815j48616j57713j63464j65830j64331j58929j50344j39464
$$ 5093241 4957426 4808810 4651097 4487633 4321803 4157472 3998543 3848199 3708735
60082C708735j26951j13276r8688q3146o6776n0214l4118j8642l851R730K1588
$$ 3708735 3581784 3468508 3369820 3286674 3219898 3169684 3135566 3116924 3113073 3122803 3144391
60071C144391L1873M0824M7779N1551N1754M9043M3995L6490K6471J4869L297
$$ 3144391 3176264 3217088 3264867 3316418 3368172 3417215 3461210 3497700 3524171 3539040 3542337
60060C542337p146j6614k6087l6134m6226n5358o3188p0140p6446q1575q4806
$$ 3542337 3535191 3518577 3492490 3456356 3410130 3354772 3291584 3221444 3144998 3063423 2978617
60049B978617q5965q5358q3393q0314p6009p0050o2338n3561m4538l5190k4940
$$ 2978617 2892652 2807294 2723901 2643587 2567578 2497528 2435190 2381629 2337091 2301901 2276961
60038B276961j3960l166P099J7416K8135L8849M9188N9142O8188P5148P9416Q1430
$$ 2276961 2263001 2259835 2266934 2284350 2312485 2351334 2400522 2459664 2527852 2603000 2682416 2763846
60026B763846Q1456P8842P3063O4691N4754M3876L2498K1006R086m105j8391l2050
$$ 2763846 2845302 2924144 2997207 3061898 3116652 3160528 3193026 3214032 3223118 3219013 3200622 3168572
60014C168572m3579n3191o1886o9741p5875p9426p9956p7536p2967o7282o0644
$$ 3168572 3124993 3071802 3009916 2940175 2864300 2784874 2704918 2627382 2554415 2487133 2426489
60003B426489n2521m3265l4270k6024j7353p433K719J1872K0474K9693L9553M9445
$$ 2426489 2373968 2330703 2296433 2270409 2253056 2245623 2248342 2260214 2280688 2310381 2349934 2399379
59991B399379N9603P0595Q1878R2280J01483J09697J16149J19184J17818J12256
$$ 2399379 2458982 2529577 2611455 2703735 2805218 2914915 3031064 3150248 3268066 3380322
59981C380322J03119R1129P7324O2628M7258L1092J4426k246j8743l4934n0303
$$ 3380322 3483441 3574570 3651894 3714522 3761780 3792872 3807298 3805052 3786309 3751375 3701072
59970C701072o4311p6557q6220r2127r4045r3025q9834q3988p5194o4677n3924
$$ 3701072 3636761 3560204 3473984 3381857 3287812 3194787 3104953 3020965 2945771 2881094 2827170
59959B827170m2965l1115j8616o377N343J6793K7729L7691M6694N4733O1249O6033
$$ 2827170 2784205 2753090 2734474 2728097 2733440 2750233 2777962 2815653 2862347 2917080 2978329 3044362
59947C044362O9825P2907P4006P1884O7283O1901N6212M9696M2540L5499K8556
$$ 3044362 3114187 3187094 3261100 3332984 3400267 3462168 3518380 3568076 3610616 3646115 3674671
59936C674671K1290J4151P942K563k213n169m685r47M563J1617K1394L4135M8460
$$ 3674671 3695961 3710112 3718054 3720617 3718404 3713235 3708550 3707603 3712166 3723783 3745177 3779312 3827772
59923C827772O3310P8965R5786J13309J31010J48573J65036J78800J88876J95011
$$ 3827772 3891082 3970047 4065833 4179142 4310152 4458725 4623761 4802561 4991437 5186448
59913E186448J96503J91977J80590J62413J37459J05673O8249K7953j2355n0716
$$ 5186448 5382951 5574928 5755518 5917931 6055390 6161063 6229312 6257265 6244910 6194194
59903F194194q5515j15015j37974j54095j63667j67280j65895j60487j51594j39706
$$ 6194194 6108679 5993664 5855690 5701595 5537928 5370648 5204753 5044266 4892672 4752966
59893D752966j25790j10673r4257p6327n7755l9752k2172l786J5763L5498N4651
$$ 4752966 4627176 4516503 4422246 4345919 4288164 4248412 4226240 4222454 4238217 4273715 4328366
59882D328366P3454R2130J10142J26694J41075J52113J57959J56655J46669J27318
$$ 4328366 4401820 4493950 4604092 4730786 4871861 5023974 5181933 5338588 5485257 5612575
59872E612575R9575O6323L0942m339l8206o9058r5164j15783j31179j41794j48347
$$ 5612575 5712150 5778473 5809415 5805076 5766870 5697812 5602648 5486865 5355686 5213892 5065545
59861E065545j52202j54364j54299j50894j44302j35635j25257j12832r8883q4728
$$ 5065545 4913343 4758979 4604680 4453786 4309484 4173849 4048592 3935760 3836877 3752149
59851C752149p0771n6204m0452k3875p175Q473K0989K8812L3144L7248M3304N1098
$$ 3752149 3681378 3625174 3584722 3560847 3553672 3562145 3583134 3611946 3645090 3682338 3725642 3776740
59839C776740N9898O9671P9692Q7197Q8543Q1431O6015M4749K1369r94k1062l8586
$$ 3776740 3836638 3906309 3986001 4073198 4161741 4243172 4309187 4353936 4375305 4374311 4353249 4314663
59827D314663n2774o2615o8234p0680p0711o9167o8069o9413p2709p5448p6229
$$ 4314663 4261889 4199274 4131040 4060360 3989649 3920482 3852413 3783000 3710291 3634843 3558614
59816C558614p5865p5182p3624p0513o6101o0729n4467m8172m3492m0974l9484
$$ 3558614 3482749 3407567 3333943 3263430 3197329 3136600 3082133 3033961 2990469 2949495 2910011
59805B910011l8068l7099l6936l6809l5911l4454l2831l0728k7774k4095j9610
$$ 2910011 2871943 2834844 2797908 2761099 2725188 2690734 2657903 2627175 2599401 2575306 2555696
59794B555696j3718o306J885J0414J9851L0826M3348N7403P3286R0940J09923
$$ 2555696 2541978 2535672 2537557 2547971 2567822 2598648 2641996 2699399 2772685 2863625 2973548
59783B973548J30245J52114J74567J95356K12122K21999K19972K00008J59621
$$ 2973548 3103793 3255907 3430474 3625830 3837952 4059951 4279923 4479931 4639552
59774D639552J02716L7466k7445q4451j27809j55256j68661j71718j67218j56848
$$ 4639552 4742268 4779734 4752289 4667838 4540029 4384773 4216112 4044394 3877176 3720328
59764C720328j42412j25849j08509r1287p5030o0159m6538l4196k3550j4537o401
$$ 3720328 3577916 3452067 3343558 3252271 3177241 3117082 3070544 3036348 3012798 2998261 2991860
59753B991860J149P549J2684J7592K3123K8878L4159L9126M4250M9560N5133O1558
$$ 2991860 2993009 3000558 3013242 3030834 3053957 3082835 3116994 3156120 3200370 3249930 3305063 3366621
59741C366621O9186P7636Q6631R6458J07158J18311J30182J43927J59940J77137
$$ 3366621 3435807 3513443 3600074 3696532 3803690 3922001 4052183 4196110 4356050 4533187
59731D533187J94686K13164K33024K53190K72309K90272L06945L20303L27412
$$ 4533187 4727873 4941037 5174061 5427251 5699560 5989832 6296777 6617080 6944492
59722F944492L26918L19280L05181K85220K61043K35442K11079J89879J73537
$$ 6944492 7271410 7590690 7895871 8181091 8442134 8677576 8888655 9078534 9252071
59713I252071J63535J60269J62587J68277J74917J80609J84292J85170J81993
$$ 9252071 9415606 9575875 9738462 9906739 10081656 10262265 10446557 10631727 10813720
59704A0813720J73605J60273J43530J24369J02647P8765N4686L2329J1979o596
$$ 10813720 10987325 11147598 11291128 11415497 11518144 11596909 11651595 11683924 11695903 11689307
59694A1689307k2226l2904l7806l7569l2739k3036q101J1860L6284O4527R5931
$$ 11689307 11667081 11634177 11596371 11558802 11526063 11503027 11494926 11506786 11543070 11607597 11703528
59683A1703528J30045J66618K04976K43702K81262L16602L48727L76050L96582
$$ 11703528 11833573 12000191 12205167 12448869 12730131 13046733 13395460 13771510 14168092
59674A4168092M08404M09506L97442L69733L24718K62303J84406R4949j017r8434
$$ 14168092 14576496 14986002 15383444 15753177 16077895 16340198 16524604 16619553 16618536 16520102
59664A6520102j92390k77720l49619m05041m43024m63688m67812m57528m36525
$$ 16520102 16327712 16049992 15700373 15295332 14852308 14388620 13920808 13463280 13026755
59655A3026755m09431l81813l60645l52933l62416l87401m21567m56271m82988
$$ 13026755 12617324 12235511 11874866 11521933 11159517 10772116 10350549 9894278 9411290
59646I411290m96157m95217m83401m64145m39388m10984l81591l53082l25453
$$ 9411290 8915133 8419916 7936515 7472370 7032982 6621998 6240407 5887325 5561872
59637E561872k98407k72779k49384k27704k06908j87210j68945j51338j33534
$$ 5561872 5263465 4990686 4741302 4513598 4306690 4119480 3950535 3799197 3665663
59628C665663j16242j00979q8092p6620o5819n5811m7099m0236l5618l2915l1049
$$ 3665663 3549421 3448442 3360350 3283730 3217911 3162100 3115001 3074765 3039147 3006232 2975183
59617B975183k9275k7797k6889k6145k5320k5059k5993k7774k9782l2042l4638
$$ 2975183 2945908 2918111 2891222 2865077 2839757 2814698 2788705 2760931 2731149 2699107 2664469
59606B664469l6908l8184l8717l8968l8533l6745l3945l1183k8924k6849k4703
$$ 2664469 2627561 2589377 2550660 2511692 2473159 2436414 2402469 2371286 2342362 2315513 2290810
59595B290810k2647k0969j9919j9596j9535j8830j7014j4455j1666q779n909l285
$$ 2290810 2268163 2247194 2227275 2207679 2188144 2169314 2152300 2137845 2126179 2117400 2111491 2108206
59583B108206p51K159N339Q102J0350J2790J5629J8178K0129K2183K4847K7677
$$ 2108206 2107455 2109614 2114953 2123055 2133405 2146195 2161824 2180002 2200131 2222314 2247161 2274838
59571B274838L0298L3126L6435L9840M3332M7646N2849N7764O1645O5359O9976
$$ 2274838 2305136 2338262 2374697 2414537 2457869 2505515 2558364 2616128 2677773 2743132 2813108
59560B813108P5237Q0362Q5404R0822R6506J02071J07427J12417J16659J20160
$$ 2813108 2888345 2968707 3054111 3144933 3241439 3343510 3450937 3563354 3680013 3800173
59550C800173J23166J25297J26098J26311J26399J23375J12005R0887O5221M1704
$$ 3800173 3923339 4048636 4174734 4301045 4427444 4550819 4662824 4753711 4818932 4860636
59540D860636K2427N484j0565k5585l9731n3474o6140p6614q5118r2536r8465
$$ 4860636 4883063 4888547 4877982 4852397 4812666 4759192 4693052 4616438 4531320 4438784 4340319
59529D340319j01697j02016r9790r4570q5999p5463o4790n3734m0615k5055q149
$$ 4340319 4238622 4136606 4036816 3942246 3856247 3780784 3715994 3662260 3621645 3596590 3588441
59518C588441R644K8754M8862O8952Q8990J09642J30230J48579J63004J72852
$$ 3588441 3598085 3626839 3675701 3744653 3833643 3943285 4073515 4222094 4385098 4557950
59508D557950J77092J74059J62810J43552J16786Q3428M5737O614l2159o9769
$$ 4557950 4735042 4909101 5071911 5215463 5332249 5415677 5461414 5468028 5435869 5366100
59498E366100j04649j34335j57219j73186j82547j85562j83018j76071j65418
$$ 5366100 5261451 5127116 4969897 4796711 4614164 4428602 4245584 4069513 3904095
59489C904095j51620j36015j20050j03879q6852o9234n2186l6085k0250m290J1400
$$ 3904095 3752475 3616460 3496410 3392531 3305679 3236445 3184259 3148174 3127924 3123634 3135034
59478C135034K6465M0751N3658O4531P3573Q1197Q6582Q8080Q5143P8669O9416
$$ 3135034 3161499 3202250 3255908 3320439 3394012 3475209 3561791 3649871 3735014 3813683 3883099
59467C883099N7186M1751K3598L638j7177l7901n7871p6695r3520j06936j16369
$$ 3883099 3940285 3982036 4005634 4009272 3992095 3954194 3896323 3819628 3726108 3619172 3502803
59456C502803j22854j27540j30135j29835j26971j22532j16932j10488j04299
$$ 3502803 3379949 3252409 3122274 2992439 2865468 2742936 2626004 2515516 2411217
59447B411217r9095r3899q7412q0140p3596o7965o2273n6337n0787m5523l9968
$$ 2411217 2312122 2218223 2130811 2050671 1977075 1909110 1846837 1790500 1739713 1694190 1654222
59436A654222l4607l0480k7208k3286j8355j3592r723o134k097K216O168R343
$$ 1654222 1619615 1589135 1561927 1538641 1520286 1506694 1496971 1490837 1488740 1490956 1497124 1506467
59424A506467J2106J5895K1671K7168K7464K0319R602J303k574l812l460j000
$$ 1506467 1518573 1534468 1556139 1583307 1610771 1631090 1640692 1641995 1639421 1635609 1632149 1631149
59412A631149K849O550J0936J8018K5823K8404K2850J3284O052L394L803O011
$$ 1631149 1633998 1640548 1651484 1669502 1695325 1723729 1746579 1759863 1765915 1769309 1773112 1779123
59400A779123R908J4830J9592K3955K8579L3752L9209M4732N0170N5382O0675
$$ 1779123 1789031 1803861 1823453 1847408 1875987 1909739 1948948 1993680 2043850 2099232 2159907
59389B159907O6717P3603Q0718Q7726R4793J01685J07624J12310J16131J19241
$$ 2159907 2226624 2300227 2380945 2468671 2563464 2665149 2772773 2885083 3001214 3120455
59379C120455J21575J23953J28022J34805J44354J56831J72636J91301K11552
$$ 3120455 3242030 3365983 3494005 3628810 3773164 3929995 4102631 4293932 4505484
59370D505484K32770K55186K78359L00530L19538L33396L40167L38836L30372
$$ 4505484 4738254 4993440 5271799 5572329 5891867 6225263 6565430 6904266 7234638
59361G234638L16654K98469K76001K50822K25404K00493J74907J48099J20841
$$ 7234638 7551292 7849761 8125762 8376584 8601988 8802481 8977388 9125487 9246328
59352I246328R3007O2774K8785q597m8787r2039j38110j85408k32040k76230l15231
$$ 9246328 9339335 9402109 9430894 9422297 9373510 9281471 9143361 8957953 8725913 8449683 8134452
59341H134452l45610l65545l75644l76997l69995l55578l35952l13297k89011
$$ 8134452 7788842 7423297 7047653 6670656 6300661 5945083 5609131 5295834 5006823
59332E006823k64743k42468k22861k05064j88680j74450j62367j50824j38632
$$ 5006823 4742080 4499612 4276751 4071687 3883007 3708557 3546190 3395366 3256734
59323C256734j26458j15447j05747r7054q9280q1992p4510o7176o1152n6555n2208
$$ 3256734 3130276 3014829 2909082 2812028 2722748 2640756 2566246 2499070 2437918 2381363 2329155
59312B329155m7695m3917m1039l7759l3381k8911k5200k1623j7453j2991q404
$$ 2329155 2281460 2237543 2196504 2158745 2125364 2096453 2071253 2049630 2032177 2019186 2010782
59301B010782k911L983J1684J9234K5309K7332K3148J4528O796L696M460O826
$$ 2010782 2007871 2011854 2023538 2042772 2068081 2095413 2118561 2133089 2139885 2143581 2148041 2154867
59289B154867J0464J5846K2010K7715L3319L9524M5525N0093N3332N5625N6010
$$ 2154867 2165331 2181177 2203187 2230902 2264221 2303745 2349270 2399363 2452695 2508320 2564330
59278B564330N3377M8263M1875L4211K4610J3359J374j0925k3162l4269m3449
$$ 2564330 2617707 2665970 2707845 2742056 2766666 2780025 2781399 2770474 2747312 2713043 2669594
59267B669594n1038n7380o1799o3787o4197o4174o3815o2910o1895o0964n9289
$$ 2669594 2618556 2561176 2499377 2435590 2371393 2307219 2243404 2180494 2118599 2057635 1998346
59256A998346n6310n2777m9529m6267m2543l8709l4890l0279k4654j9312j5267
$$ 1998346 1942036 1889259 1839730 1793463 1750920 1712211 1677321 1647042 1622388 1603076 1587809
59245A587809j1783p921m237j529Q35L794O992R756J2626J6354K0402K3903K7218
$$ 1587809 1576026 1568105 1563868 1562339 1563174 1566968 1573960 1583716 1596342 1612696 1633098 1657001 1684219
59232A684219L1079L5121L8769M2685M7812N3744N9509O5290P2047Q0066Q9152
$$ 1684219 1715298 1750419 1789188 1831873 1879685 1933429 1992938 2058228 2130275 2210341 2299493
59221B299493R9491J11180J23636J36611J50931J67048J83729J99267K13051K24772
$$ 2299493 2398984 2510164 2633800 2770411 2921342 3088390 3272119 3471386 3684437 3909209
59211C909209K33064K36170K33004K22535K03371J75299J40166J00028N5562P600
$$ 3909209 4142273 4378443 4611447 4833982 5037353 5212652 5352818 5452846 5508408 5516008
59201E516008m1217q7826j30487j67627j96485k15095k24580k27547k25065k17099
$$ 5516008 5474791 5386965 5256478 5088851 4892366 4677271 4452691 4225144 4000079 3782980
59191C782980k04870j90540j75212j59171j43461j29136j15470j00980q5950p2029
$$ 3782980 3578110 3387570 3212358 3053187 2909726 2780590 2665120 2564140 2478190 2406161
59181B406161n9693m7996l6569k6038j6547p711M2N738R372J1662J2392J0501
$$ 2406161 2346468 2298472 2261903 2235865 2219318 2211607 2211649 2217387 2226759 2238421 2250813 2261314
59169B261314N825p33q663j8038k8169l7450m4727m9869n3083n4666n5220n5127
$$ 2261314 2267139 2266406 2257743 2239705 2211536 2174086 2129359 2079490 2026407 1971741 1916521 1861394
59157A861394n4006n1514m8277m5058m1711l7951l4473l1972k9767k6791k3419
$$ 1861394 1807388 1755874 1707597 1662539 1620828 1582877 1548404 1516432 1486665 1459874 1436455
59146A436455k0803j8856j6422j3150r756o605l443m16J932L578M948O002O452
$$ 1436455 1415652 1396796 1380374 1367224 1357468 1350863 1347420 1347004 1348936 1352514 1357462 1363464 1369916
59133A369916O602O954P290P098O522N975N262M068K855K257K137K138K546L559
$$ 1369916 1376518 1383472 1390762 1397860 1404382 1410357 1415619 1419687 1422542 1424799 1426936 1429074 1431620 1435179
59119A435179M442M620M910O363Q512J0062J0822J1648J2843J3854J4273J4103
$$ 1435179 1439621 1444241 1449151 1455514 1464026 1474088 1484910 1496558 1509401 1523255 1537528 1551631
59107A551631J3409J2525J2193J2642J3185J3346J3563J4067J4239J4009J4590
$$ 1551631 1565040 1577565 1589758 1602400 1615585 1628931 1642494 1656561 1670800 1684809 1699399
59096A699399J6705J9345K1486K3728K6884L0401L3705L7592M2514M6821M8798
$$ 1699399 1716104 1735449 1756935 1780663 1807547 1837948 1871653 1909245 1951759 1998580 2047378
59085B047378M9258M9926N0425M8979M5235M0062L3395K4571J4244L779o715j7670
$$ 2047378 2096636 2146562 2196987 2245966 2291201 2331263 2364658 2389229 2403473 2407252 2400537 2382867
59073B382867k8092l6509m3318m9870n5738n9211o0159o0089n9575n7960n5422
$$ 2382867 2354775 2318266 2274948 2225078 2169340 2110129 2049970 1989881 1930306 1872346 1816924
59062A816924n3027n0800m7869m4524m1947l9975l7301l3900l1115k9259k7220
$$ 1816924 1763897 1713097 1665228 1620704 1578757 1538782 1501481 1467581 1436466 1407207 1379987
59051A379987k4606k2195k0108j7492j4274j1363q965o524m462m005n144o529
$$ 1379987 1355381 1333186 1313078 1295586 1281312 1269949 1260984 1254460 1249998 1245993 1240849 1234320
59039A234320p611r082j1093j2819j3926j4762j5005j3926j1988j0473r457p954
$$ 1234320 1226709 1217627 1206534 1193715 1179789 1165027 1150022 1136096 1124108 1113635 1104178 1096224
59027A096224n946m355l090j170J158K546K922L668N220O527P151P871Q954R857
$$ 1096224 1090278 1085923 1082833 1081663 1082821 1085367 1088289 1091957 1097177 1103704 1110855 1118726 1127680 1137537
59013A137537J0874J2953J5581J7077J7407J8503K1156K3899K5739K7832L1366
$$ 1137537 1148411 1161364 1176945 1194022 1211429 1229932 1251088 1274987 1300726 1328558 1359924
59002A359924L5693L9712M3485M7344N0755N3082N4315N4277N2238M7903M1731
$$ 1359924 1395617 1435329 1478814 1526158 1576913 1629995 1684310 1738587 1790825 1838728 1880459
58991A880459L3900K4229J3403K924o464j4972k2217k6987k9048k9742l0357l1113
$$ 1880459 1914359 1938588 1951991 1954915 1948451 1933479 1911262 1884275 1855227 1825485 1795128 1764015
58979A764015l1887l2566l2509l1163k9361k8557k8561k7695k5316k2554k0230
$$ 1764015 1732128 1699562 1667053 1635890 1606529 1577972 1549411 1521716 1496400 1473846 1453616
58968A453616j7801j4733j1365p872l892M07M206P226R793J1615J2030J1463J1081
$$ 1453616 1435815 1421082 1409717 1401845 1397953 1398360 1402566 1409792 1419585 1431200 1443230 1454693 1465774
58955A465774J0962J0246R110Q745R271R545R278R532J0786J2348J3864J5644
$$ 1465774 1476736 1486982 1496092 1504837 1514108 1523653 1532931 1542463 1553249 1565597 1579461 1595105
58943A595105J7306J8035J8390J9928K2792K5682K8438L2481L8274M4513N0420
$$ 1595105 1612411 1630446 1648836 1668764 1691556 1717238 1745676 1778157 1816431 1860944 1911364
58932A911364N6726O3681P0001P4429P6510P5359O9805O0517N0163M0792L2828
$$ 1911364 1968090 2031771 2101772 2176201 2252711 2328070 2397875 2458392 2508555 2549347 2582175
58921B582175K6907K4445K5622K8882L3137L8615M5052N1303N7516O5424P5447
$$ 2582175 2609082 2633527 2659149 2688031 2721168 2759783 2804835 2856138 2913654 2979078 3054525
58910C054525Q5688R4838J03997J14490J25923J37539J49654J62441J75110J87378
$$ 3054525 3140213 3235051 3339048 3453538 3579461 3717000 3866654 4029095 4204205 4391583
58900D391583K00085K13133K24448K32129K36059K36556K33212K26359K18096
$$ 4391583 4591668 4804801 5029249 5261378 5497437 5733993 5967205 6193564 6411660
58891F411660K10554K04194J98415J92355J84336J72308J55727J35647J12349
$$ 6411660 6622214 6826408 7024823 7217178 7401514 7573822 7729549 7865196 7977545
58882G977545Q4687N2425J7333j8805n5383r1301j24237j52763j77461j98900
$$ 7977545 8062232 8114657 8131990 8113185 8057802 7966501 7842264 7689501 7512040 7313140
58872G313140k16266k29019k38051k44066k46550k45418k42133k37985k32828
$$ 7313140 7096874 6867855 6629804 6385738 6139188 5893770 5651637 5413652 5180824
58863E180824k26318k18785k10076j99412j87300j75737j65558j55462j44564
$$ 5180824 4954506 4735721 4525645 4326233 4138933 3963196 3797638 3642176 3497612
58854C497612j33804j23867j13884j03514r4192q6835q0147p2725o5013n7870
$$ 3497612 3363808 3239941 3126057 3022543 2928351 2841516 2761369 2688644 2623631 2565761
58844B565761n0982m4140l8286l3844k9604k4646j9767j5777j2092q267n090k783
$$ 2565761 2514779 2470639 2432353 2398509 2368905 2344259 2324492 2308715 2296623 2288356 2283266 2280483
58832B280483Q3M416R094J3062J7132K2268K7675L2218L6131L9976M3407M6303
$$ 2280483 2280566 2284982 2294076 2307138 2324270 2346538 2374213 2406431 2442562 2482538 2525945 2572248
58820B572248M9509N3076N5437N5752N5431N6108N7743O0066O4006P0224P7854
$$ 2572248 2621757 2674833 2730270 2786022 2841453 2897561 2955304 3015370 3079376 3149600 3227454
58809C227454Q6095R5410J05911J16499J26968J38961J53248J68003J81433J94185
$$ 3227454 3313549 3408959 3514870 3631369 3758337 3897298 4050546 4218549 4399982 4594167
58799D594167K07393K20170K30939K39606K46552K50931K51552K47999K39549
$$ 4594167 4801560 5021730 5252669 5492275 5738827 5989758 6241310 6489309 6728858
58790F728858K24758K03530J77665J48001J13150P2714K9483j3395n5133r5284
$$ 6728858 6953616 7157146 7334811 7482812 7595962 7668676 7698159 7684764 7629631 7534347
58780G534347j31462j61691j87030k09294k27860k41153k49625k54637k55973
$$ 7534347 7402885 7241194 7054164 6844870 6617010 6375857 6126232 5871595 5615622
58771E615622k52990k46944k39621k30854k19790k07457j95685j84547j73145
$$ 5615622 5362632 5115688 4876067 4645213 4425423 4217966 4022281 3837734 3664589
58762C664589j61874j51713j42170j32117j21785j12145j03183r4589q6894q0262
$$ 3664589 3502715 3351002 3208832 3076715 2954930 2842785 2739602 2645013 2558119 2477857
58752B477857p3387o5405n7523n0994m5037l8637l2750k8537k4969k0454j5534
$$ 2477857 2404470 2339065 2281542 2230548 2185511 2146874 2114124 2085587 2060618 2040164 2024630
58741B024630j1627q432m805r88K294N795J0586J6001K0706K4543K7279K6949
$$ 2024630 2013003 2004571 1999766 1998778 2001072 2006867 2017453 2033454 2054160 2078703 2105982 2132931
58729B132931K1794J2737K008r438k1051l0961l7596m1863m5481m8365m9774n0626
$$ 2132931 2154725 2167462 2169470 2160032 2138981 2108020 2070424 2028561 1983080 1934715 1884941 1834315
58717A834315n2214n3865n4152n3276n2070n0010m6339m1819l7171l1400k3902
$$ 1834315 1782101 1728236 1674084 1620808 1568738 1518728 1472389 1430570 1393399 1361999 1338097
58706A338097j6422j0480m721K415R244J3039J3830J2756Q412j258j4454k6608
$$ 1338097 1321675 1311195 1306474 1308889 1318133 1331172 1345002 1357758 1366170 1364912 1350458 1323850
58694A323850l5471m1853m6082m7281m5885m3588m0728l6460l1281k6673k2604
$$ 1323850 1288379 1246526 1200444 1153163 1107278 1063690 1022962 986502 955221 928548 905944
58683I05944j7975j3236r818p397m323n86K185L361L605K955R04j948m537o993
$$ 905944 887969 874733 864915 857518 853195 852609 854794 858155 861760 864715 865619 863671 859134 852141
58669H52141r599j1001r857p470o319o768p557q503j0051j1140j0399q774q313
$$ 852141 842542 831541 821684 814214 807895 801127 793570 785067 775016 763876 753477 744703 736390
58656G36390q984r228q832q516p679n376k788j852k143j864j025p86n51J143L591
$$ 736390 727406 718178 709346 700830 693151 687775 684987 683135 680992 679128 678103 677317 676766 677909 681500
58641F81500M878N233O336P963Q443P979Q307R416R615Q533P267O090M814M609
$$ 681500 686378 691611 697947 705910 714353 722332 730639 740055 749670 758203 765470 771560 776374 780983
58627G80983O453Q577Q674P828Q847J1538J3259J3664J4915J7391J9062J9342
$$ 780983 787436 796013 804687 812515 821362 832900 846159 859823 874738 892129 911191 930533
58615I30533J9964K1647K3213K4368K6260K8932L1206L3216L6309M0390M4238
$$ 930533 950497 972144 995357 1019725 1045985 1074917 1106123 1139339 1175648 1216038 1260276
58604A260276M8146N3294N8853O2903O5918O9945P4578P7237P7343P6571P4875
$$ 1260276 1308422 1361716 1420569 1483472 1549390 1619335 1693913 1771150 1848493 1925064 1999939
58593A999939O9963O1146N0310L8648K5594J1455k154j4815k7269l8670m6947
$$ 1999939 2069902 2131048 2181358 2220006 2245600 2257055 2254901 2240086 2212817 2174147 2127200
58582B127200n1985n5359n7009n5538n1790m8595m6605m3877l9789l5996l3119
$$ 2127200 2075215 2019856 1962847 1907309 1855519 1806924 1760319 1716442 1676653 1640657 1607538
58571A607538l0046k6913k5319k5009k3732k0978j8650j7539j6510j5686j6998
$$ 1607538 1577492 1550579 1525260 1500251 1476519 1455541 1436891 1419352 1402842 1387156 1370158
58560A370158k0770k4934k8359l1918l5672l8074l8589l8296l7516l5656l3484
$$ 1370158 1349388 1324454 1296095 1264177 1228505 1190431 1151842 1113546 1076030 1040374 1006890
58549A006890l2485l1899k9546k5678k2636k0832j8548j5746j4325j4338j3736
$$ 1006890 974405 942506 912960 887282 864646 843814 825266 809520 795195 780857 767121
58538G67121j2178j1394j1494j0700r108q803r796r764q330p632q085p633n885
$$ 767121 754943 743549 732055 721355 712247 703444 693648 683884 675554 667922 659837 652204 646319
58525F46319m912n117m363k167p33q50o97L02M02n93m30J434K713K539L050N359
$$ 646319 641407 636290 631927 629760 629027 628177 627480 627782 628184 627591 627161 628595 631308 633847 636897 642256
58509F42256P672Q717R551J0786J1512J1973J3736J6280J7037J5656J4523J4267
$$ 642256 649928 658645 668196 678982 690494 702467 716203 732483 749520 765176 779699 793966
58497G93966J2772R478O567M885K718k59k075k482l712o055o957n766n106o201
$$ 793966 806738 816216 822783 827668 830386 830127 828052 825570 821858 815803 808846 803080 797974 791773
58483G91773p064o725o961q381r072q567q931j0462j0685q986p857q144p599n685
$$ 791773 784709 777984 771023 762642 753570 745003 736072 725610 714925 705939 698082 689938 682339 676654
58469F76654n015o283o484m208k136k202k702k291k387l574l913k879k682l784
$$ 676654 671639 665356 658872 654664 652528 650326 647624 645333 642946 639372 635459 632580 629898 626114
58455F26114l605j446j10o54m54J538K540J260M85J855K967K214J707K688K893
$$ 626114 622509 621063 620953 620299 619845 621383 623923 625183 625668 627523 630490 632704 634411 637099 639992
58440F39992J259M39J805K634J203j7P96J554P95P49K650L723K139N49J282K414
$$ 639992 641251 641690 643495 646129 647332 647315 648111 649665 650460 651209 653859 657582 659721 660270 661552 663966
58424F63966J916J431K606L785L572L631M911N293L873L295M965O300N573M930
$$ 663966 665882 667313 669919 673704 677276 680907 685818 691111 694984 698279 703244 709544 715117 720047
58410G20047N776N970M532M177O027O818M690K769L533M651L883L160M120M558
$$ 720047 725823 731793 736325 740502 746529 753347 758037 760806 764339 768990 772873 776033 780153 784711
58396G84711L044K193L634M592L099J734K495L030J589O44J786K286M47q18M26
$$ 784711 787755 789948 793582 798174 801273 803007 805502 808532 810121 810765 812551 814837 815284 814466 814892
58381H14892J543J002J888N598Q028O496M654N888P697P363P276R566J1221R769
$$ 814892 816435 817437 819325 824923 832951 839447 844101 849989 857686 865049 872325 881891 893112 902881
58367I02881Q266R483J0719R534Q777J0700J1955R902P974R237J0625R249Q234
$$ 902881 911147 920630 931349 940883 949660 960360 972315 982217 990191 999428 1010053 1019302 1027536
58354A027536J0326J1916R756P417Q564R973P998N880P510R867Q961P518R328
$$ 1027536 1037862 1049778 1059534 1066951 1075515 1085488 1093486 1099366 1106876 1116743 1125704 1133222 1142550
58341A142550J1528J0127P889R106J1617J1576J1017J3149J5349J4244J2724J4379
$$ 1142550 1154078 1164205 1172094 1181200 1192817 1204393 1215410 1228559 1243908 1258152 1270876 1285255
58329A285255J6369J5327J4761J8671K3310K3543K1993K3567K6229K5761K4448
$$ 1285255 1301624 1316951 1331712 1350383 1373693 1397236 1419229 1442796 1469025 1494786 1519234
58318A519234K6348K8925K7992K6103K7419K9176K6766K2373K0223J8417J3872
$$ 1519234 1545582 1574507 1602499 1628602 1656021 1685197 1711963 1734336 1754559 1772976 1786848
58307A786848R897J0241J1336R120P534J1170J5828J5992J5228J9074K4014K4184
$$ 1786848 1796745 1806986 1818322 1827442 1834976 1846146 1861974 1877966 1893194 1912268 1936282 1960466
58295A960466K2794K5791L0154K9834K7619K9607L3346L3067L1332L3825L7846
$$ 1960466 1983260 2009051 2039205 2069039 2096658 2126265 2159611 2192678 2224010 2257835 2295681
58284B295681L7710L6303L9485M4295M4600M3028M5438M9224M9213M9126N4572
$$ 2295681 2333391 2369694 2409179 2453474 2498074 2541102 2586540 2635764 2684977 2734103 2788675
58273B788675O0866O0755N7966N9811O2832N9827N4561N4965N8032N6414N3674
$$ 2788675 2849541 2910296 2968262 3028073 3090905 3150732 3205293 3260258 3318290 3374704 3428378
58262C428378N7610O4551O6037O5025O9518P6300P7421P6577Q2218R0625R3026
$$ 3428378 3485988 3550539 3616576 3681601 3751119 3827419 3904840 3981417 4063635 4154260 4247286
58251D247286R3112R9817J09263J12178J12647J20561J32111J37160J39221J48138
$$ 4247286 4340398 4440215 4549478 4661656 4774303 4894864 5026975 5164135 5303356 5451494
58241E451494J59999J64978J67855J79240J93963K00572K04515K18444K37503
$$ 5451494 5611493 5776471 5944326 6123566 6317529 6518101 6722616 6941060 7178563
58232G178563K48840K57449K76622L00925L15966L26998L49350L78494L99376
$$ 7178563 7427403 7684852 7961474 8262399 8578365 8905363 9254713 9633207 10032583
58223A0032583M17394M48850M88650N20187N49231N93788O48794O97006P46215
$$ 10032583 10449977 10898827 11387477 11907664 12456895 13050683 13699477 14396483 15142698
58214A5142698Q17347R04466R87266J074131J189605J328849J471081J628412
$$ 15142698 15960045 16864511 17851777 18925908 20115513 21444362 22915443 24543855
58206B4543855J831529K077002K342509K643702L018949L471469L991872M624861
$$ 24543855 26375384 28452386 30794895 33438597 36457546 39929015 43920887 48545748
58198D8545748N441533O458471P661033R087417J0800456J2803232J5094901J7785833
$$ 48545748 53987281 60445752 68106785 77194202 87994658 100797890 115892791 133678624
58190A33678624K1031537K4887659K9349289L4323838L9072583M1596614L9236544
$$ 133678624 154710161 179597820 208947109 243270947 282343530 323940144 363176688
58183C63176688L0626200J7153201K184975j1193459k1578763k8818896l3023192
$$ 363176688 393802888 410956089 413141064 401947605 380368842 351549946 318526754
58176C18526754l4360637l3386341l0989253k7948410k4720819k1584074j8737785
$$ 318526754 284166117 250779776 219790523 191842113 167121294 145537220 126799435
58169A26799435j6243048j4040431j2087221j0397102q953771p692463o580445
$$ 126799435 110556387 96515956 84428735 74031633 65077862 57385399 50804954
58162E0804954n632844m840262m154674l554657l057898k660742k324535k029253
$$ 50804954 45172110 40331848 36177174 32622517 29564619 26903877 24579342 22550089
58154B2550089j787234j597018j432275j282573j160466j063003r67441q69422
$$ 22550089 20762855 19165837 17733562 16450989 15290523 14227520 13260079 12390657
58146A2390657p86639p21216o55235n86219n31070m91397m49028l99670l58983
$$ 12390657 11604018 10882802 10227567 9641348 9110278 8618881 8169853 7770183 7411200
58137G411200l31843l06277k80872k68171k67013k60066k42925k28915k21712
$$ 7411200 7079357 6773080 6492208 6224037 5957024 5696958 5454033 5225118 5003406
58128E003406k09549j90314j76626j71479j62979j47839j37010j33665j27669
$$ 5003406 4793857 4603543 4426917 4255438 4092459 3944620 3807610 3673945 3546276
58119C546276j16244j08940j07852j03294r3205q7125q7077q3699p5035p0290
$$ 3546276 3430032 3321092 3213240 3109946 3016741 2929616 2842539 2758840 2683805 2613515
58109B613515p1246o8411n9534n3874n4112n1600m3734l8891l9793l8507l2426
$$ 2613515 2542269 2473858 2414324 2360450 2306338 2254738 2211004 2172113 2132320 2093813 2061387
58098B061387k9162l1094l0605k5243k2642k5820k7999k6426k7222l2154l4279
$$ 2061387 2032225 2001131 1970526 1945283 1922641 1896821 1868822 1842396 1815174 1783020 1748741
58087A748741l1241k9718l2444l3580l1018l0562l3928l4994l1883l0579l2787
$$ 1748741 1717500 1687782 1655338 1621758 1590740 1560178 1526250 1491256 1459373 1428794 1396007
58076A396007l2374k7656k5178k7258k7689k3834k1339k2692k2527j8600j6287
$$ 1396007 1363633 1335977 1310799 1283541 1255852 1232018 1210679 1187987 1165460 1146860 1130573
58065A130573j7809j7809j4081j2035j4087j4848j1413q581r418j0242r112r852
$$ 1130573 1112764 1094955 1080874 1068839 1054752 1039904 1028491 1019910 1010492 1000250 991138 981286
58053I81286j3470j4897j2292j0609j2046j2051q576o160p016p075m693m244p147
$$ 981286 967816 952919 940627 930018 917972 905921 897345 891185 884169 877094 872401 868157 861010
58040H61010q340n664l896n431n831k846r77k694l750j823j221m318o563m925
$$ 861010 852670 847006 843110 837679 831848 829002 828025 825331 821581 819758 818537 814219 807656 802731
58026H02731l298m654n550l464j970l556m544k137L54J91K59K712M394L347L277
$$ 802731 799433 794779 789229 785765 783795 780239 775695 773558 773912 774103 774362 777074 781468 784815 788092
58011G88092O631R697R450Q968J1258J3789J4020J4469J7476K0531K1469K2758
$$ 788092 794723 804420 813870 822838 834096 847885 861905 876374 893850 914381 935850 958608
57999I58608K6240K9060K9232K9716L2686L5234L5102L5185L7981M0980M1855
$$ 958608 984848 1013908 1043140 1072856 1105542 1140776 1175878 1211063 1249044 1290024 1331879
57988A331879M2752M5020M5180M0749L4970L1158K7522K2097J7666J6961J7738
$$ 1331879 1374631 1419651 1464831 1505580 1540550 1571708 1599230 1621327 1638993 1655954 1673692
57977A673692J7349J7573K0161K2083J9906J4680Q031k112j7125l3125m5536n4550
$$ 1673692 1691041 1708614 1728775 1750858 1770764 1785444 1793475 1791363 1774238 1741113 1695577 1641027
57965A641027o1874o6042o5381o2023n8537n3940m6959l9734l4415k9599k3837
$$ 1641027 1579153 1513111 1447730 1385707 1327170 1273230 1226271 1186537 1152122 1122523 1098686
57954A098686j9013j6655j4634j1180q288p590o816m137j925k318l109k083j334
$$ 1098686 1079673 1063018 1048384 1037204 1028916 1021326 1014510 1010373 1008448 1006130 1003021 1000938 999604
57941I99604l047m897l984j691l21J429N258R096J0702J2082J5947K0847K4131
$$ 999604 996557 991660 987676 985985 985664 987093 992351 1001447 1012149 1024231 1040178 1061025 1085156
57928A085156K6574K9693L1649L0226K6992K4085J9705J1184p4j0858k0686l0053
$$ 1085156 1111730 1141423 1173072 1203298 1230290 1254375 1274080 1285264 1285190 1274332 1253646 1223593
57916A223593l6985l9675m0065m0691m0425l7257l2666k9090k5753k1110j6866
$$ 1223593 1186608 1146933 1106868 1066177 1025752 988495 955829 926739 900986 879876 863010
57905H63010j5233j4630j2387r551q692r222r104r057j0819j3134j3736j3365
$$ 863010 847777 833147 820760 811209 802517 793295 784191 775134 764315 751181 737445 724080
57893G24080j3802j3902j1762q863p796p579n611k615j315j518q62P18J390J365
$$ 724080 710278 696376 684614 675751 667955 660376 654765 652150 650835 649317 648455 649173 650563 651928
57879F51928K530M781O344P087Q261R698J0329J0540J1175J1272R564P047N385
$$ 651928 654458 659239 665583 672670 680931 690629 700958 711498 722673 733945 743509 750556 755941
57866G55941M204K528J173J012O19j446l849m818n220o413p143n886m157m087
$$ 755941 760145 762673 763846 764858 765477 764031 760182 755364 750144 743731 736588 730702 726545 722458
57852G22458m682l951k708k638k634r17J101J171N75K007M550N119L725K997L333
$$ 722458 717776 713825 711117 708479 705845 704928 706029 707200 707775 709782 714332 719451 723176 726173 729506
57837G29506K799J246N00P03K37r31j199m57j19l93l66k37o78p01R68L312M563
$$ 729506 732305 733551 734051 734754 734991 734060 732861 732404 732285 731892 731526 731289 730611 729910 730878 734190 738753
57820G38753N231O783Q633R504J0385J2639J4577J3587J0571Q621Q205P541O868
$$ 738753 743984 750767 759400 768904 779289 791928 806505 820092 830663 839284 847489 855030 861898
57807H61898Q343J2020J5773J9058K3293K8580L3455L7686M2130M5995M7402M6241
$$ 861898 870241 882261 898034 917092 940385 968965 1002420 1040106 1082236 1128231 1175633 1221874
57795A221874M3445L7960K7920J4456R82j1045k2339l2227l8590m1396m2800m3558
$$ 1221874 1265319 1303279 1331199 1345655 1346637 1335592 1313253 1281026 1242436 1201040 1158240 1114682
57783A114682m2569m0115l8120l6869l4606l0854k7195k4389k1563j8601j6505
$$ 1114682 1072113 1031998 993878 957009 922403 891549 864354 839965 818402 799801 783296
57772G83296j5091j3002j0312q534p858o952n630n019m961l896j631K49R42J124
$$ 783296 768205 755203 744891 736357 728499 721547 715917 710898 705937 702041 700410 700659 701601 702725
57758G02725J150Q64R71K191L336K816J645K189M303N680N771O248P558Q328Q385
$$ 702725 703875 704739 705710 707901 711237 714053 715698 717887 722190 727870 733641 739889 747447 755775 764160
57743G64160R315J1476J3257J3782J3698J3065J1142Q578P053O389M707J790m39
$$ 764160 773475 784951 798208 811990 825688 838753 849895 858473 865526 871915 876622 878412 877973
57730H77973j106j352j687j191J57R91R98J343K257K622K499L361N348O739O770
$$ 877973 876867 875515 873828 872637 872794 873785 874783 876126 878383 881005 883504 886865 892213 898952 905722
57715I05722O601O947P116O838O809P046O921P046Q655J1021J2115J1975J2694
$$ 905722 912323 919270 926386 933224 940033 947079 954000 961046 969701 980722 992837 1004812 1017506
57702A017506J4726J6153J6140J6191J7248J8335J8955K0243K2788K5673K8457
$$ 1017506 1032232 1048385 1064525 1080716 1097964 1116299 1135254 1155497 1178285 1203958 1232415
57691A232415L1756L5327L8023M0200M3648M8597N3377N7617O2898O9606P6046
$$ 1232415 1264171 1299498 1337521 1377721 1421369 1469966 1523343 1580960 1643858 1713464 1789510
57680A789510Q1558Q7648R4882J01481J06068J09243J11395J11747J10673J10279
$$ 1789510 1871068 1958716 2053598 2155079 2261147 2370390 2481785 2593532 2704205 2814484
57670B814484J11692J14677J20318J29436J35658J24352Q3686J6718n9319j24838
$$ 2814484 2926176 3040853 3161171 3290607 3426265 3550617 3634303 3651021 3591702 3466864
57660C466864j68190j87920j89473j80341j66055j49365j32130j16190j02028
$$ 3466864 3298674 3110754 2921281 2740940 2574885 2425520 2293390 2177200 2075172
57651B075172q8593p5556o4139n4996m7101l9675l3304k8142k2960j7213j2203
$$ 2075172 1986579 1911023 1846884 1791888 1744787 1705112 1671808 1643666 1620706 1603493 1591290
57640A591290q893o295l228K2L062O548J0720J4420J6950J9362K2598K5953K8687
$$ 1591290 1582397 1576102 1572874 1572896 1575958 1582506 1593226 1607646 1624596 1643958 1666556 1692509 1721196
57627A721196L1498L5080L8781M1979M5303M9203N2869N5865N9131O3006O5859
$$ 1721196 1752694 1787774 1826555 1868534 1913837 1963040 2015909 2071774 2130905 2193911 2259770
57616B259770O6239O4812O2608N8830N2106M2684L1766J9780O811o243j8439k9765
$$ 2259770 2326009 2390821 2453429 2512259 2564365 2607049 2638815 2658595 2665406 2659163 2640724 2610959
57604B610959m0121m8397n3704n6591n7982n8041n6991n5738n4590n2624m9431
$$ 2610959 2570838 2522441 2468737 2412146 2354164 2296123 2239132 2183394 2128804 2076180 2026749
57593B026749m6147m3663m1172l7727l3891l0595k7743k5071k3001k1391j8947
$$ 2026749 1980602 1936939 1895767 1858040 1824149 1793554 1765811 1740740 1717739 1696348 1677401
57582A677401j5278j2087j0812j0470r338p438n784m437k964j703j018k91Q61
$$ 1677401 1662123 1650036 1639224 1628754 1619416 1611978 1606194 1601757 1598793 1597090 1596072 1595781 1596642
57569A596642J581J344J362K750M561N334N477O258P475Q085Q287R079J0278J0806
$$ 1596642 1598223 1599567 1600929 1603679 1608240 1613574 1619051 1625309 1632784 1640869 1649156 1658235 1668513 1679319
57555A679319J0492J0023R660R450J0100J2000J3988J4642J4345J4566J5569J6449
$$ 1679319 1689811 1699834 1709494 1718944 1729044 1741044 1755032 1769674 1784019 1798585 1814154 1830603
57543A830603J6921J7503J8217J8676J9246K0732K2993K5188K7202K9603L2413
$$ 1830603 1847524 1865027 1883244 1901920 1921166 1941898 1964891 1990079 2017281 2046884 2079297
57532B079297L5059L7463M0058M2870M5546M8112N0824N3450N5539N7125N8395
$$ 2079297 2114356 2151819 2191877 2234747 2280293 2328405 2379229 2432679 2488218 2545343 2603738
57521B603738N9012N8326N6002N1810M5468L7266K8162J8659Q439k213j1737j9074
$$ 2603738 2662750 2721076 2777078 2828888 2874356 2911622 2939784 2958443 2966882 2964669 2952932 2933858
57509B933858k5028l0674l5298l7342l6770l5106l3562l2244l0868k9170k6851
$$ 2933858 2908830 2878156 2842858 2805516 2768746 2733640 2700078 2667834 2636966 2607796 2580945
57498B580945k4015k1277j8834j6061j2696r497o946m369j278J485L192M696P095
$$ 2580945 2556930 2535653 2516819 2500758 2488062 2478565 2471619 2467250 2465972 2467457 2470649 2475345 2482440
57485B482440R865J1871J3332J5208J7250J8478J9086K0241K2153K3996K5505
$$ 2482440 2492305 2504176 2517508 2532716 2549966 2568444 2587530 2607771 2629924 2653920 2679425
57474B679425K7185K9045L0612L2179L4719L8420M2430M6137M9627N2832N5260
$$ 2679425 2706610 2735655 2766267 2798446 2833165 2871585 2914015 2960152 3009779 3062611 3117871
57463C117871N6724N7586N8132N8290N7736N5797N1655M5210L7286K8440J8386
$$ 3117871 3174595 3232181 3290313 3348603 3406339 3462136 3513791 3559001 3596287 3624727 3643113
57452C643113P337l130j1684j8839k5610l1377l4689l5607l5589l5236l3854l1254
$$ 3643113 3650450 3647320 3635636 3616797 3591187 3559810 3525121 3489514 3453925 3418689 3384835 3353581
57440C353581k8402k5973k3521k0533j7295j4333j1794r621p728n829l610j156
$$ 3353581 3325179 3299206 3275685 3255152 3237857 3223524 3211730 3202109 3194381 3188552 3184942 3183786
57428C183786J165L124M574N379N797O547P993R726J1321J2848J4175J4638J4137
$$ 3183786 3184951 3188075 3192649 3198028 3203825 3210372 3218365 3228091 3239412 3252260 3266435 3281073 3295210
57415C295210J3667J4039J4858J5492J6099J6740J6648J5621J5076J6285J8373
$$ 3295210 3308877 3322916 3337774 3353266 3369365 3386105 3402753 3418374 3433450 3449735 3468108
57404C468108J9583J9756J9948K0314K0165J9701J9855K0533K0716K0289K0219
$$ 3468108 3487691 3507447 3527395 3547709 3567874 3587575 3607430 3627963 3648679 3668968 3689187
57393C689187K0845K1468K1758K2264K3267K4351K5205K5878K6166K5836K5427
$$ 3689187 3710032 3731500 3753258 3775522 3798789 3823140 3848345 3874223 3900389 3926225 3951652
57382C951652K5795K6804K7477K7327K6735K6141K5781K5972K6704K7212K6948
$$ 3951652 3977447 4004251 4031728 4059055 4085790 4111931 4137712 4163684 4190388 4217600 4244548
57371D244548K6534K6783K7303K7275K7031K7408K8040K7907K7242K7209K7781
$$ 4244548 4271082 4297865 4325168 4352443 4379474 4406882 4434922 4462829 4490071 4517280 4545061
57360D545061K7726K6740K5915K5863K5915K5588K5350K5540K5773K5827K6047
$$ 4545061 4572787 4599527 4625442 4651305 4677220 4702808 4728158 4753698 4779471 4805298 4831345
57349D831345K6515K6902K7211K7665K7833K7140K6221K6451K7993K9584L0391
$$ 4831345 4857860 4884762 4911973 4939638 4967471 4994611 5020832 5047283 5075276 5104860 5135251
57338E135251L0755L0976L0848L0633L1004L1710L1695L0887L0366L0459L0184
$$ 5135251 5166006 5196982 5227830 5258463 5289467 5321177 5352872 5383759 5414125 5444584 5474768
57327E474768K9214K8735K9586L0958L1808L2271L2749L2864L2385L2132L2808
$$ 5474768 5503982 5532717 5562303 5593261 5625069 5657340 5690089 5722953 5755338 5787470 5820278
57316E820278L3759L3992L3718L3869L4550L4973L4638L3894L3503L4112L5772
$$ 5820278 5854037 5888029 5921747 5955616 5990166 6025139 6059777 6093671 6127174 6161286 6197058
57305F197058L7623L8513L8264L7878L8170L8829L9158L9063L8908L8747L8274
$$ 6197058 6234681 6273194 6311458 6349336 6387506 6426335 6465493 6504556 6543464 6582211 6620485
57294F620485L7121L5132L2573L0139K8222K6317K3765K0901J8598J6875J5029
$$ 6620485 6657606 6692738 6725311 6755450 6783672 6809989 6833754 6854655 6873253 6890128 6905157
57283F905157J3168J2306J2672J3230J3288J3429J4191J5017J5310J5601J6652
$$ 6905157 6918325 6930631 6943303 6956533 6969821 6983250 6997441 7012458 7027768 7043369 7060021
57272G060021J8101J8942J8919J8643J8657J8939J9181J9134J8889J8958J9715
$$ 7060021 7078122 7097064 7115983 7134626 7153283 7172222 7191403 7210537 7229426 7248384 7268099
57261G268099K0688K0941K0260J9393J8966J8835J8627J8211J7521J6564J5739
$$ 7268099 7288787 7309728 7329988 7349381 7368347 7387182 7405809 7424020 7441541 7458105 7473844
57250G473844J5393J5071J4035J2606J1884J2014J1889J0932R994R908J0318J0502
$$ 7473844 7489237 7504308 7518343 7530949 7542833 7554847 7566736 7577668 7587662 7597570 7607888 7618390
57238G618390J0390J0004Q951P288N994N709N774N320M555M170M080L656K747
$$ 7618390 7628780 7638784 7647735 7655023 7661017 7666726 7672500 7677820 7682375 7686545 7690625 7694281 7697028
57225G697028J564R0j741l570m999o102p037p666q063q802j0112j1321j1775j1795
$$ 7697028 7698592 7698682 7696941 7693371 7688372 7682270 7675233 7667567 7659504 7650702 7640590 7629269 7617494 7605699
57211G605699j2015j2324j2181j1580j0928j0324r588q695p681o442n155m346
$$ 7605699 7593684 7581360 7569179 7557599 7546671 7536347 7526759 7518064 7510383 7503941 7498786 7494440
57199G494440l987l159j318N36R44q2j135j277j017j357k598m250n707o856q189
$$ 7494440 7490453 7487294 7485976 7486512 7487456 7487374 7486239 7484962 7483945 7482588 7479990 7475740 7470033 7463177 7454988
57184G454988j0322j3195j5962j7748j8359j8134j7586j7379j8095j9658k1415
$$ 7454988 7444666 7431471 7415509 7397761 7379402 7361268 7343682 7326303 7308208 7288550 7267135
57173G267135k3077k5097k7773l0539l2691l4268l5695l6969l7777l8088l8057
$$ 7267135 7244058 7218961 7191188 7160649 7127958 7093690 7057995 7021026 6983249 6945161 6907104
57162F907104l7620l6757l5890l5499l5542l5632l5642l5651l5583l5272l4784
$$ 6907104 6869484 6832727 6796837 6761338 6725796 6690164 6654522 6618871 6583288 6548016 6513232
57151F513232l4337l4123l4387l5367l6926l8571m0071m1695m3603m5488m7150
$$ 6513232 6478895 6444772 6410385 6375018 6338092 6299521 6259450 6217755 6174152 6128664 6081514
57140F081514m8920n1116n3447n5306n6365n6543n5851n4584n3285n2167n0970
$$ 6081514 6032594 5981478 5928031 5872725 5816360 5759817 5703966 5649382 5596097 5543930 5492960
57129E492960m9550m8145m6875m5590m4461m4017m4199m4125m3239m1905m0413
$$ 5492960 5443410 5395265 5348390 5302800 5258339 5214322 5170123 5125998 5082759 5040854 5000441
57118E000441l8143l4490k9856k5008j9993j4548r004l857J189P097J4758K5166
$$ 5000441 4962298 4927808 4897952 4872944 4852951 4838403 4829399 4825542 4826731 4833828 4848586 4873752
57106D873752L9908O0566Q7751J21189J60507K05564K56693L15524L85375M70222
$$ 4873752 4913660 4974226 5061977 5183166 5343673 5549237 5805930 6121454 6506829 6977051
57096F977051N73508O98096Q46283J018663J213145J425672J651288J883906K115789
$$ 6977051 7550559 8248655 9094938 10113601 11326746 12752418 14403706 16287612 18403401
57087A8403401K337973K540025K707982K823530K867317K823700K682542K439466
$$ 18403401 20741374 23281399 25989381 28812911 31680228 34503928 37186470 39625936
57079C9625936K098752J677151J202234P04617K10767k58977o90115j074358j408715
$$ 39625936 41724688 43401839 44604073 45308690 45519457 45260480 44570365 43496007 42087292
57070D2087292j691639j920223k092364k211024k284715k323421k334217k319619
$$ 42087292 40395653 38475430 36383066 34172042 31887327 29563906 27229689 24910070
57062B4910070k278329k207456k105588j975118j822220j655121j482502j312450
$$ 24910070 22631741 20424285 18318697 16343579 14521359 12866238 11383736 10071286
57054A0071286j151333j003083q69702p52163o50414n63057m88065m23882l69359
$$ 10071286 8919953 7916870 7047168 6295005 5644591 5081534 4593469 4169587 3800228
57045C800228l22990k83172k49049k20169j95410j73366j53766j37183j23132
$$ 3800228 3477238 3194066 2945017 2724848 2529438 2356072 2202306 2065123 1941991
57036A941991j09916r6893q5239p5582o6426n6224m5389l4577k2811r400M514
$$ 1941991 1832075 1735182 1649943 1574361 1507935 1451711 1406322 1371745 1348934 1339534 1344048
57025A344048K0134M4480Q2259J21897J36481J05885L7358l9678r8188j29803
$$ 1344048 1364182 1408662 1490921 1612818 1749299 1855184 1892542 1852864 1754676 1624873
57015A624873j40284j37490j26843j12825r8870q6065p4394o4582n7174n1151
$$ 1624873 1484589 1347099 1220256 1107431 1008561 922496 848102 783520 726346 675195
57005F75195m5349m0244l6599l3389k9061k4109k0469j8729j7740j6722j5942
$$ 675195 629846 589602 553003 519614 490553 466444 445975 427246 409506 392784 376842
56994C76842j5347j4119j1972r610p601n666l293k46L497P638J1419J4217J6082
$$ 376842 361495 347376 335404 325794 318193 312527 309234 308988 312485 320123 331542 345759 361841
56981C61841J7027J6228J2800P154Q10m882r048j0975j0649r320q422q017p247
$$ 361841 378868 395096 407896 415050 415860 410978 401930 390955 380306 370986 362564 354547 347300
56968C47300n932m605l285j525M76K115L686O096R245J2053J4340J7161K0720
$$ 347300 341368 336763 333478 331953 332429 334544 338230 344326 353571 365624 379964 397125 417845
56955D17845K3100K1843J6158P301k353j0390j5532j8323k0037k0805j9699j6684
$$ 417845 440945 462788 478946 486247 483894 473504 457972 439649 419612 398807 379108 362424
56943C62424j3217j0423p886m872j662J086L458N912Q549J1449J5064J9519K4078
$$ 362424 349207 338784 330898 326026 324364 325450 328908 334820 343369 354818 369882 389401 413479
56930D13479K7777K9862K9026K3421J2781j17j1325j8965k3675k6402k7136k5903
$$ 413479 441256 471118 500144 523565 536346 536229 524904 505939 482264 455862 428726 402823
56918D02823k3598k1190j8857j6473j4328j2735j1331r513p380n686m781m187
$$ 402823 379225 358035 339178 322705 308377 295642 284311 274798 267418 261732 256951 252764
56906B52764l477k992l197l709l636k839k069j744j358m15P58J698K573L590M307
$$ 252764 249287 246295 243098 239389 235753 232914 230845 229101 227743 227328 228086 229784 232357 235947 240254
56891B40254M454M880O672R524J2084J3774J5097J6179J6082J3876R552L711k669
$$ 240254 244708 249588 256260 265784 277868 291642 306739 322918 339000 352876 362428 366139 363470
56878C63470q028j0875j1161j0243r178p903o205m409k545O2L624P124R570J1347
$$ 363470 355442 344567 333406 323163 313985 306082 299877 295468 292923 292985 296609 303733 313303 324650
56864C24650J3563J6650K0506K5446L1890L8940M4018M4167L7784K5585J0382
$$ 324650 338213 354863 375369 400815 432705 471645 515663 559830 597614 623199 633581
56853F33581m290j5902k3586k7501k8148k6374k3263j9551j5418j1015o645k228
$$ 633581 629291 613389 589803 562302 534154 507780 484517 464966 449548 438533 431888 429660
56841D29660K681Q159J3784J9565K6164L3829M1940N0040N8219O5308O7504O0263
$$ 429660 432341 440500 454284 473849 500013 533842 575782 625822 684041 749349 816853 877116
56829H77116M2113J6332j0822l3355m7958n4715n5903n3820m9607m3809l7260
$$ 877116 919229 935561 924739 891384 843426 788711 732808 678988 629381 585572 548312
56818E48312l0785k4564j8344j2041n764M04O423J2455J9124K7023L5659M3531
$$ 548312 517527 492963 474619 462578 456814 457218 463641 476096 495220 522243 557902 601433
56806F01433M9275N1688M8487L6997J7509n087k4527l7678m4997m7807m6990m3801
$$ 601433 650708 702396 750883 787880 805389 800302 775775 738097 693100 645293 598303 554502
56794E54502l9842l5689l0822k5156j9592j4794j0535o431k396J849O730J2040
$$ 554502 514660 478971 448149 422993 403401 388607 378072 371641 369245 371094 377824 389864
56782C89864J7042K1462K5371K7766K6461K0099R760j841j2249k0116k5033k7297
$$ 389864 406906 428368 453739 481505 507966 528065 537825 535984 523735 503619 478586 451289
56770D51289k7657k6800k5163k3116k1032j8988j6845j4623j2555j0752r230q145
$$ 451289 423632 396832 371669 348553 327521 308533 291688 277065 264510 253758 244528 236383
56758B36383p619p384p015o427n679m585l092j786j269j239r12k37J89L12P09
$$ 236383 228764 221380 214365 207938 202259 197674 194582 192796 191527 190288 189376 189139 189328 189640 190349
56743A90349J452J848J555J036O70K39l54o94n25j65J19M60Q16P80L04n8M7L00
$$ 190349 191801 193649 195204 196240 196910 197149 196795 196101 195576 195411 195530 195990 196806 197586 197890 197832 197879 198179
56725A98179L86M40N49N00L44M91Q59P31j07q43q09l86k19j88R3M39M92M47O34
$$ 198179 198565 199005 199554 200054 200398 200889 201748 202479 202372 201529 200720 200334 200115 199927 200020 200459 200951 201398 202032
56706B02032Q82R77J309K330L722M849N621O175O188N407M516M375M592L946K286
$$ 202032 202914 203891 205200 207530 211252 216101 221722 227897 234085 239492 244008 248383 252975 256921 259207
56691B59207Q75N25M88k00j104j076o2Q35J058J383K574L934M048K704J259Q80
$$ 259207 260082 260607 261095 260895 259791 258715 258653 259488 260546 261929 264503 268437 272485 275189 276448 277328
56675B77328J194J207Q88J002J634J881J160%p65j025j221j648k321l109l681
$$ 277328 278522 279729 280617 281619 283253 285134 286294 286294 285529 284504 283283 281635 279314 276205 272524
56660B72524l695l321l234l733m245m061l250k479k186k317k662l057l357l395
$$ 272524 268829 265508 262274 258541 254296 250235 246985 244506 242320 240003 237341 234284 230927 227532
56646B27532l018k126q57K55O87M93K60M20R69J762K577K921K414J409O81M18
$$ 227532 224514 222388 221531 221786 222473 222966 223226 223646 224615 226377 228954 231875 234289 235698 236379 236797
56630B36797J27l46n79m86o19j152j439j109p24p83r20q10j068k211l410l393
$$ 236797 236924 236578 235999 235513 234894 233742 232303 231194 230470 229687 228767 227957 226889 224678 221268 217875
56614B17875k217j090o27l73M3L53M11O42J310J989K131J789J450J452J726K017
$$ 217875 215658 214568 213941 213568 213611 213964 214375 215017 216327 218316 220447 222236 223686 225138 226864 228881
56598B28881K190K352K641K902K805K325J804J496J317J186J173J204J116J087
$$ 228881 231071 233423 236064 238966 241771 244096 245900 247396 248713 249899 251072 252276 253392 254479
56584B54479J458J970J842R49K03L10Q49J122J189J421J665J683J831K462L100
$$ 254479 255937 257907 259749 260698 260901 261211 262060 263182 264371 265792 267457 269140 270971 273433 276533
56569B76533L095K758K987L978N061N672N732N327M638M064L771L345K429J379
$$ 276533 279628 282386 285373 289351 294412 300084 305816 311143 315781 319845 323616 326961 329390 330769
56555C30769P05K46m16j114j443j649k343l539m693n523o034o084n632n235n463
$$ 330769 331474 331720 331304 330190 328747 327098 324755 321216 316523 311000 304966 298882 293250 288015 282552
56540B82552o059o362o309o264o243o069n980o199o227n507m464l910l681k917
$$ 282552 276493 270131 263822 257558 251315 245246 239266 233067 226840 221333 216869 212959 209278 206361
56526B06361j468mJ048J644J459K62j153j648j251r16q82n68o5k50j229k018k119
$$ 206361 204893 204889 205937 207581 209040 209302 208149 206501 205250 204334 203452 202884 202819 202569 201340 199322 197203
56509A97203k110k346k293j659r83o25k11M02O27J86l27m59n59q78r77n96k15
$$ 197203 195093 192747 190454 188795 187812 187187 186976 187378 188005 188191 187864 187405 186846 185968 184991 184395 184180
56492A84180j79j0P62J797K505K710K400J578P64P72J516J894J430J071J678K662
$$ 184180 184001 183991 184753 186550 189055 191765 194165 195743 196507 197279 198795 200689 202119 203190 204868 207530
56476B07530K928K478K121K168K233K017J565R21J47n05q12q07n70j33K29J53
$$ 207530 210458 212936 215057 217225 219458 221475 223040 223961 224108 223603 222791 221984 221414 221281 221510 221663
56460B21663k33l75j17J42K17L47M77J91l58l06O80J826K320K266K051J635R29
$$ 221663 221430 221055 220938 221080 221297 221644 222121 222312 221954 221648 222328 224154 226474 228740 230791 232426 233355
56443B33355K72j15m94j008j370j518j924k719l237k986k384k022j829j504j198
$$ 233355 233627 233512 233018 232010 230640 229122 227198 224479 221242 218256 215872 213850 212021 210517 209319
56428B09319j105r57n08o5l9l11m94l87L1N98Q51M65qL54J453K159J911J448J582
$$ 209319 208214 207257 206749 206684 206645 206334 205840 205453 205484 206082 206933 207398 207390 207744 209197 211356 213267 214715 216297
56409B16297K166K670K849K494J494N42P42J999K897K617J937J699J566J043N36
$$ 216297 218463 221133 223982 226476 227970 228512 229254 231253 234150 236767 238704 240403 241969 243012 243548
56394B43548M37K31m64j003q20m96p26j105j042r26j307j646j181k71K09K83M77
$$ 243548 243985 244216 243752 242749 241929 241433 240707 239602 238560 237634 236327 234681 233500 233229 233438 233721 234198
56377B34198O62L94n1j24j4j39o0Q82K237K817K308J526J276J661K353K789K400
$$ 234198 234860 235254 235203 235079 235065 234926 234866 235748 237985 240802 243110 244636 245912 247573 249926 252715 255115
56360B55115J347O41R50J664J801J341R63R51J072J157J129Q89O36Q66J596K215
$$ 255115 256462 257103 258053 259717 261518 262859 263822 264773 265845 267002 268131 269020 269656 270522 272118 274333
56344B74333K443K729L208L283K765K441K822L336L428L361L296K800K069K261
$$ 274333 276776 279505 282713 285996 288761 291202 294024 297360 300788 304149 307445 310245 312314 314575
56330C14575L611M576M091L281L575M432M585M313M620N143M829M013L948M706
$$ 314575 318186 322762 326853 330134 333709 338141 342726 347039 351659 356802 361631 365644 369592 374298
56316C74298N247N223N161N173M936M566M245L490K078J049J304J924J463L07
$$ 374298 379545 384768 389929 395102 400038 404604 408849 412339 414417 415466 416770 418694 420157 420464
56302D20464pO92J198J032Q75J082J396J917K893L814M136M531N897P601Q293
$$ 420464 420457 421149 422347 423379 424254 425336 426732 428649 431542 435356 439492 444023 449920 457521 465814
56287D65814Q045P994Q313Q375Q572R972J2261J3948J4659J5416J6662J7813J8923
$$ 465814 473859 481853 490166 498541 507113 517085 529346 543294 557953 573369 590031 607844 626767
56274F26767K0960K4081K7228K9860L2643L6198M0426M5213N0579N6088O1370
$$ 626767 647727 671808 699036 728896 761539 797737 838163 883376 933955 990043 1051413
56263A051413O7094P4012Q1304Q7393R2241R7206J02563J06856J08837J08492
$$ 1051413 1118507 1192519 1273823 1361216 1453457 1550663 1653226 1760082 1868919 1977411
56253A977411J05990J01121R4051Q5275P4719O2139M8392L4926K2036R096l634
$$ 1977411 2083401 2184522 2278573 2363848 2438567 2500706 2549098 2584024 2606060 2615156 2611522
56242B611522j4984k4680l3539m1847m9096n5406o1593o7672p2803p6886q0685
$$ 2611522 2596538 2571858 2538319 2496472 2447376 2391970 2330377 2262705 2189902 2113016 2032331
56231B032331q4191q6381q6834q6137q4452q1171p6337p1144o6619o2830n9436
$$ 2032331 1948140 1861759 1774925 1688788 1604336 1523165 1446828 1375684 1309065 1246235 1186799
56220A186799n6094n2320m8033m4020m0853l7823l4114l0374k7725k5789k3364
$$ 1186799 1130705 1078385 1030352 986332 945479 907656 873542 843168 815443 789654 766290
56209G66290k0503j8180j6339j4126j1731j0180r496q811p976p378o591m993l271
$$ 766290 745787 727607 711268 697142 685411 675231 665735 656924 648948 641570 634979 629986 626715
56196F26715k487k155j159O8M09L97J369K840L209K695K998M299N170N260N601
$$ 626715 624228 622073 620914 620982 621391 621788 623157 625997 629206 631901 634899 639198 644368 649628 655229
56181F55229O345O761P314R120J1439J2379J2050J2362J3823J5162J6061J7368
$$ 655229 661574 668335 675649 684769 696208 708587 720637 732999 746822 761984 778045 795413
56169G95413J8647J8539J7627J7967J9516K0095J9112J8325J8561J8884J9355
$$ 795413 814060 832599 850226 868193 887709 907804 926916 945241 963802 982686 1002041
56158A002041K1480K5304K9234L3287L9401M7939N7190O7075Q0041R7303J17123
$$ 1002041 1023521 1048825 1078059 1111346 1150747 1198686 1255876 1322951 1402992 1500295 1617418
56147A617418J37537J57402J73646J80981J76046J59857J35861J08593Q4490O9868
$$ 1617418 1754955 1912357 2086003 2266984 2443030 2602887 2738748 2847341 2931831 3001699
56137C001699O5994O8207P0488O8391N8239L8318J2481j1146k6882l4465l5680
$$ 3001699 3067693 3135900 3206388 3274779 3333018 3371336 3383817 3372671 3345789 3311324 3275644
56126C275644l2800l1367l9282n9777q8265j17732j43848j63428j72681j70392
$$ 3275644 3242844 3211477 3172195 3112418 3024153 2906421 2762573 2599145 2426464 2256072
56116B256072j59998j45825j29530j11896r4874p9672o5572n2496m2053l4579
$$ 2256072 2096074 1950249 1820719 1708823 1613949 1534277 1468705 1416209 1374156 1339577
56106A339577k8089k1618j6377j2351p391j233L255M636N111O436P346O865O247
$$ 1339577 1311488 1289870 1273493 1261142 1253751 1252518 1255773 1260409 1265520 1271956 1279302 1286167 1292414
56093A292414N860L943M42j830j785j748k746k477o2J741J514J782M071N947N809
$$ 1292414 1298274 1302217 1302659 1300829 1299044 1297296 1294550 1292073 1292011 1293752 1295266 1297048 1301119 1307066 1312875
56078A312875O016Q198R951R443Q881J0229J1754J2065J3098J5810J7441J6549
$$ 1312875 1318891 1327089 1337040 1346483 1355364 1365593 1377347 1389412 1402510 1418320 1435761 1452310
56066A452310J6181J8468K0660K0289J9711K1500K3787K4212K4197K5325K5836
$$ 1452310 1468491 1486959 1507619 1527908 1547619 1569119 1592906 1617118 1641315 1666640 1692476
56055A692476K4629K4328K6395K7880K6889K6382K8422K9908K8472K7388K9686
$$ 1692476 1717105 1741433 1767828 1795708 1822597 1848979 1877401 1907309 1935781 1963169 1992855
56044A992855L2567L2795L2593L4858L7420L7514L7177L8790M0155L9370L9656
$$ 1992855 2025422 2058217 2090810 2125668 2163088 2200602 2237779 2276569 2316724 2356094 2395750
56033B395750M3717M8263M9784N0755N4371N8349N9868O1365O5318O8684O8716
$$ 2395750 2439467 2487730 2537514 2588269 2642640 2700989 2760857 2822222 2887540 2956224 3024940
56022C024940O8839P2422P6269P6835P7061Q0338Q3654Q3781Q4156Q8385R3075
$$ 3024940 3093779 3166201 3242470 3319305 3396366 3476704 3560358 3644139 3728295 3816680 3909755
56011C909755R4522R6103J01403J06739J08534J11098J18668J26933J31240J35712
$$ 3909755 4004277 4100380 4201783 4308522 4417056 4528154 4646822 4773755 4904995 5040707
56001E040707J44957J54527J59532J64847J76164J88865J96794K04152K17130
$$ 5040707 5185664 5340191 5499723 5664570 5840734 6029599 6226393 6430545 6647675
55992F647675K31845K42606K53918K71749K91268L06237L21895L45008L70257
$$ 6647675 6879520 7122126 7376044 7647793 7939061 8245298 8567193 8912201 9282458
55983I282458L90739M12357M42766M76135N04829N35744N77952O25278O69468
$$ 9282458 9673197 10085554 10528320 11004455 11509284 12045028 12622980 13248258 13917726
55974A3917726P19190P86265Q64806R44913J034651J146162J273375J407808J562717
$$ 13917726 14636916 15423181 16287987 17232900 18267551 19413713 20687088 22094896 23657613
55965B3657613J755727J982778K237650K541038K919858L376829L915603M575707
$$ 23657613 25413340 27396118 29633768 32174806 35094664 38471493 42387096 46962803
55957D6962803N403419O409949P600138R013707J0688736J2622534J4835773J7437888
$$ 46962803 52366222 58776171 66376309 75390016 86078752 98701286 113537059 130974947
55949A30974947K0556506K4253390K8559822L3352779L7779857L9771832L6703119
$$ 130974947 151531453 175784843 204344665 237697444 275477301 315249133 351952252
55942C51952252K7231722J2732464l227040j6973578k6484119l1597314l3177237
$$ 351952252 379183974 391916438 388689398 371715820 345231701 313634387 280457150
55935B80457150l2330453l0068016k7172630k4129336k1184250j8474022j6073459
$$ 280457150 248126697 218058681 190886051 166756715 145572465 127098443 111024984
55928A11024984j3975269j2122859j0481917r046931p797576o699549n741270
$$ 111024984 97049715 84926856 74444939 65398008 57600432 50900883 45159613
55921D5159613m927692m243280l656434l153641k736471k391462k093847j835710
$$ 45159613 40231921 35988641 32332207 29178566 26442095 24050633 21956786 20121076
55913B0121076j622335j445980j289314j149650j034967r40330q51419p67106
$$ 20121076 18498741 17052761 15763447 14613797 13578830 12638500 11787081 11019975
55905A1019975o96482o37552n79810n24108m79639m44417m08051l70942l42238
$$ 11019975 10323493 9685941 9106131 8582023 8102384 7657967 7249916 6878974 6536736
55896F536736l21178k98324k73161k53587k39611k23622k05396j91571j81678
$$ 6536736 6215558 5917234 5644073 5390486 5150875 4927253 4721857 4530286 4348608
55887D348608j69030j54006j42698j34144j22345j08991j00790r6276q8734q0427
$$ 4348608 4179578 4025572 3882874 3748730 3626385 3517394 3416604 3320328 3231594 3151167
55877C151167q0214q8001r4664r6781r8700j00572r7164q8994q2703p9585p4641
$$ 3151167 3070953 2982952 2888288 2791507 2692807 2592235 2495071 2406077 2323374 2243789 2169148
55866B169148o7339o2573o0553n6273m9537m5525m4847m2712l8474l6539l7214
$$ 2169148 2101809 2039236 1978683 1922410 1872873 1827348 1782501 1739789 1701315 1664776 1627562
55855A627562l5926l2159l0292l0973l0211k7570k6828k7996k7083k4159k3542
$$ 1627562 1591636 1559477 1529185 1498212 1468001 1440431 1413603 1385607 1358524 1334365 1310823
55844A310823k5408k5279k2271k0033j9065j6052j1381r343j0146r329o025m329
$$ 1310823 1285415 1260136 1237865 1217832 1198767 1182715 1171334 1161991 1151845 1142516 1136491 1132162
55832A132162n648o946p377r481j2910j4076j3016j3678j6565j7956j7278j8267
$$ 1132162 1126514 1119568 1112191 1102710 1089800 1075724 1062708 1049030 1032465 1014509 997231 978964
55820I78964k1628k3437k2198k1027k1464k1278j9763j9161j9579j8314j5295
$$ 978964 957336 933899 911701 890674 869210 847932 828169 809008 789429 771115 755820
55809G55820j3427j2751j0233o059m022m655m208j549Q2n34n61J024J463k08j318
$$ 755820 742393 729642 719409 713350 709328 704673 700465 698916 698998 698464 697903 698927 700390 700182 698864
55794F98864q79j269l131m099m121o443j1535j5446j5990j5415j5115j3110q837
$$ 698864 697985 696716 693585 689486 685365 678922 667387 651941 635951 620536 605421 592311 583474
55781E83474n260l879k249J321M934O805P626P547N116Q04k588m496p308j1418
$$ 583474 578214 574335 572086 573407 578341 585146 592772 600319 605435 606239 603651 599155 591847 580429
55767E80429j4109j4620j5540j7599j7994j5623j3318j2861j2395j0783j0043
$$ 580429 566320 551700 536160 518561 500567 484944 471626 458765 446370 435587 425544
55756D25544j1132j1692j0322r080r428r487p680n514m609m312m191n430p905
$$ 425544 414412 402720 392398 383318 373890 364403 356723 351209 346600 342288 338097 332667 324762
55743C24762r322q914q639r273q952p077n783n920n449l530k334k846k862j138
$$ 324762 315440 306526 297887 288614 279662 272585 266802 260882 255433 251903 249569 246723 243861 242723
55729B42723K43k04p61p0L21p73j774j455j161j817j962q44k21j020j484o61l74
$$ 242723 242966 242762 242001 241931 242252 241479 239705 238250 237089 235272 233310 232466 232245 231225 229741 229080 228706
55712B28706j530j921p2J984K257K053L201M915N878O705P923Q198O837N531N448
$$ 228706 227176 225255 225183 227167 229424 231477 234678 239593 245471 252176 260099 268297 275134 280665 286113
55697B86113N242L953L114L771M289L417K805M026N724O068N675N666N216L463
$$ 286113 291355 295308 298422 302193 306482 309899 312704 316730 322454 328522 334197 339863 345079 348542
55683C48542J623R35N01q43k490l690n036o646p258o778p164r054j0223r236p825
$$ 348542 350165 351100 351601 350758 348268 344578 339542 332896 325638 318860 311696 302642 292419 283183 275358
55668B75358p604p306n549l554k557j269J510M188N011N148O472Q417R600J0552
$$ 275358 267754 260448 254899 251345 248788 247519 249029 253217 258228 263376 269848 278265 287865 298417
55654B98417J2269J3894J4347J4401J4809J4219J1271P020L079p29m696p338p521
$$ 298417 310686 324580 338927 353328 368137 382356 393627 400647 403726 402997 398301 390963 383442
55641C83442o639o353o026m633l145k668k151m48J231J388R01J092R47j162m576
$$ 383442 376803 370450 364424 359791 356646 353978 351827 351379 352610 353998 354899 355991 356938 355776 351200
55626C51200p651j0327j3035j4744j4698j4448j5554j6750j5928j3539j1497j0162
$$ 351200 343549 333222 320187 305443 290745 276297 260743 243993 228065 214526 203029 192867
55614A92867q879q055q118p825o182m655m895n688m949l384l194m169m245l161
$$ 192867 183988 175933 167815 159990 153808 149153 144258 138570 133621 130237 127043 122874 118629 115468
55600A15468k581k883k669j479n32o21j210j698k034k163k103k197k311j649k86
$$ 115468 112887 110004 107335 105856 105324 104703 103493 101795 99761 97598 95495 93298 90987 89338 89052
55585H9052L39l80j037m98K86K99M01J469K409K082J529K102K952K758K306K912
$$ 89052 89391 89011 87974 87476 87762 88061 88462 89931 92340 94422 95951 98053 101005 103763 106069 108981
55569A08981L701L114J898J894K866L167K654K438K508K003J202R37Q02N3n67
$$ 108981 112682 115796 117694 119588 122454 125621 128275 130713 133221 135224 136426 137363 138165 138218 137651
55554A37651j43K88p70k548l188k726k487k403j531m93p61k017k697k707l132
$$ 137651 137508 137796 137026 134478 131290 128564 126077 123674 122143 121650 120889 118872 116175 113468 110336
55539A10336l768l380k114j250r39m05Ro18j607j411k67K47%L00J283J736J472
$$ 110336 106568 103188 101074 99824 98885 98480 98489 97871 96264 94853 94586 94833 94833 95133 96416 98152 99624
55522I9624J631K518L325L978N189O676P411P624Q515R980J0705J0562J0749J1397
$$ 99624 101255 103773 107098 111076 116265 122941 130352 137976 146491 156471 167176 177738 188487 199884
55508A99884J1164R539P632O178M447J640k038n961r490j1731j2203j1765j1633
$$ 199884 211048 220587 228219 234397 238844 240484 238446 232485 222995 211264 199061 187296 175663
55495A75663j1685j1013r742q863q518q013p257o715o226n372m644m773n228m962
$$ 175663 163978 152965 143223 134360 125842 117829 110572 103857 97631 92259 87615 82842 77614 72652
55481G2652m256m170m560m301l191k040j175m17j53q36j737j771j154p81n55N9
$$ 72652 68396 64226 59666 55365 52174 50134 48959 48542 48389 47553 45816 44045 42891 42110 41555 41614
55465D1614N02m8r16q79k80k85o66m17K9n45j689j793p67N1L94J126J971J616
$$ 41614 42116 42068 41152 40273 39993 39708 39042 38625 38654 38109 36420 34627 33860 33911 34305 35431 37402 39018
55447C9018K52l53L35R50O62K35K70L16J71K45L38k21j003q58J1J51p49j425j287
$$ 39018 39270 38917 39252 40202 40864 41099 41369 41685 41856 42101 42439 42218 41215 40357 40368 40519 39770 38345 37058
55428C7058j157j396j148k2J123J535J429J111O26L60O12O46l16j393j058K79
$$ 37058 35901 34505 33357 33335 34458 35993 37422 38533 39159 39519 40131 40777 40461 39068 38010 38289
55412C8289O82l55j333j259p53l50L18J201J554J357J405J674J301L65j18r4n67
$$ 38289 38971 38616 37283 36024 35271 34921 35239 36440 37994 39351 40756 42430 43731 44096 43978 43884 43317
55395D3317j580k038j751j653j728q54Q45J644Q69j44m28o72j369j645j016m63
$$ 43317 41737 39699 37948 36295 34567 33713 34558 36202 37071 36927 36499 35827 34458 32813 31797 31334
55379C1334o95r51n33l9n9p1L53N41n4p50o75jN50O12R4q35j393q75Q0J49o12
$$ 31334 30639 29688 29155 29116 29057 28986 29339 29880 29826 29076 28401 28400 28950 29562 29656 28821 27428 26553 26633 26782 26170
55358B6170p88J02Q15L37p70j452j308l37J179K241J895O48j42k66n86j068p61
$$ 26170 25382 25484 26299 26636 25866 24414 23106 22769 23948 26189 28084 28732 28590 28324 27738 26670 25909
55341B5909J68M22j31j80N30O44k82p85J4R25P99K22L7j31o64q16q4O50N55J60
$$ 25909 26077 26499 26368 26188 26718 27362 27080 26295 26309 27234 28033 28255 28292 28161 27497 26681 26597 27247 27802 27962
55321B7962K19M37L10J32J98P2n08j033j165j193j001J04J892K898K371J236M88
$$ 27962 28181 28618 28928 29060 29258 29330 28822 27789 26624 25431 24430 24534 26426 29324 31695 32931 33419
55304C3419j8n00m42K33N75N1o19q06q52r62o35R7K90k43l34N77J400J179M61
$$ 33419 33401 32901 32459 32692 33267 33318 32699 31893 31041 30079 29444 29541 29831 29588 29254 29831 31231 32410 32871
55285C2871l2o31j561j998j445p55o73o77k54j4m04n65K04J133J250R19R00J002
$$ 32871 32839 32208 30647 28649 27204 26449 25776 25099 24845 24831 24427 23862 24066 25199 26449 27368 28268 29270
55267B9270P05K04k58j018j982k119r52M57J046J079J088P01k98j021p68k11j48
$$ 29270 29975 30179 29921 28903 26921 24802 23850 24307 25353 26432 27520 28221 27923 26902 26134 25923 25775
55250B5775k15O3J10n33r94l92N92P61J79k74l15j22L44Q35N53n33j099k59J002
$$ 25775 25560 25623 25733 25200 24206 23814 24406 25167 25346 25072 24757 24635 24979 25814 26367 25834 24735 24476 25478
55231B5478J326Q65N22L07k06o59m77L1K87M09O11M93p8l42M8J86n14j093o43
$$ 25478 26804 27669 28191 28498 28292 27633 27156 27187 27474 27883 28494 28987 28909 28567 28615 28801 28287 27194 26551
55212B6551ml39j104j030k85O7OK88P54N72j09l36P5M35M45L73K04k82p45o13
$$ 26551 26547 26208 25104 24074 23789 23856 23862 24150 24904 25476 25367 25031 25106 25541 25986 26359 26563 26281 25536 24923
55192B4923L7O99J188J399R12l09j356j394o90M1O34J039P88j57q48o45k51n09
$$ 24923 24960 25659 26847 28246 29158 28849 27493 26099 25409 25450 26084 27123 27911 27754 26906 26261 26010 25501
55174B5501j032j106j012j215j169k68P51P94K12J75P85J135Q78M47P9k64k71
$$ 25501 24469 23363 22351 21136 19967 19699 20450 21244 21456 21631 22416 23551 24429 24876 24955 24691 24420
55157B4420K91R37J063Q27N97J64o03j005m79L62N92K67p3m11q07p61j27K40k08
$$ 24420 24711 25648 26711 27538 28135 28299 27696 26691 26212 26574 27166 27433 27360 26949 26142 25381 25254 25494 25286
55138B5286o18j20O29N99R5J9L11N53J147K342K959J898J84k51P71J865K396K790
$$ 25286 24668 24548 25177 25776 25871 25890 26201 26754 27901 30243 33202 35100 35284 35033 35804 37669 40065 42855
55120D2855L030K671K079J927J695M06j424k243j751j137j077j126j027j061j082
$$ 42855 45885 48556 50635 52562 54257 54663 53239 50996 49245 48108 47031 45905 44878 43817 42735
55105D2735o24l3j48q58j279j180j015p41l6N83L71j74LN69K75p18r00J04R00
$$ 42735 42111 42078 41930 41072 39793 38613 37598 36857 36821 37404 37775 37601 37604 38173 38448 37730 36830 36934 37834
55086C7834O13P4K08P49J135J404J517J023n2r22j167j171j123n87M66J202J009
$$ 37834 38447 38521 38729 39478 40613 42017 43534 44557 44505 43583 42416 41245 40122 39535 40001 41203 42212
55069D2212K75k82m53m22l76l94l35J84J120J624J000k78j220j601j689j235J03
$$ 42212 42487 42205 41752 41330 40954 40560 40225 40409 41529 43153 44153 43875 42655 41054 39365 38130 38233
55052C8233J658K324K090J858J891J667J108O98M44r4p04p04k17k6j41K34J196
$$ 38233 39891 42215 44305 46163 48054 49721 50829 51527 51971 51877 51173 50469 50252 50226 50085 50319 51515
55035E1515J886J928J904K105J976J154R8o51j065j232j103q23n84j94N69J299
$$ 51515 53401 55329 57233 59338 61314 62468 62566 61915 60850 59618 58515 57692 57108 56914 57483 58782
55019E8782J496J386J424J334O67j04k63j83p35j623j795j294j169j586j574p85
$$ 58782 60278 61664 63088 64422 65089 64985 64722 64539 63804 62181 60386 59092 57923 56337 54763 53978
55003E3978n8N1j53n17j312k174k115j011J45P50J162J520J277L73l40l01P7K92
$$ 53978 53920 53971 53818 53301 51989 49815 47700 46689 46834 47584 48746 50266 51543 51916 51576 51275 51352 51644
54985E1644L89M25L11L49R29J573J355L63l04j60K61O93J510K590L138L037L073
$$ 51644 52033 52458 52769 53118 54047 55620 56975 57338 57034 56874 57135 57828 59338 61928 65066 68103 71176
54968G1176L481L465K662J894J980K779L872N180O534P640Q765J0489J2560J4055
$$ 71176 74657 78122 80784 82678 84658 87437 91309 96489 103023 110663 119428 129917 142477 156532
54954A56532J4832J5530J5906J4613J1152O747K612j350n518r337j2040j3636
$$ 156532 171364 186894 202800 217413 228565 235312 237924 236574 231056 221719 209679 196043
54942A96043j4404j4231j3161j1888j1020j0352r404q149o847n670m791m295l946
$$ 196043 181639 167408 154247 142359 131339 120987 111583 103434 96587 90917 86126 81831 77885
54929G7885l476l031k701j943l77J175J592J188J298K355L633M810O225P654Q435
$$ 77885 74409 71378 68677 66734 66357 67532 69124 70312 71610 73965 77598 82408 88633 96287 104722
54914A04722Q939J0288J2380J3802J3963J3621J2928J0780O811K297j671n290
$$ 104722 113661 123949 136329 150131 164094 177715 190643 201423 208234 210531 208860 203570
54902B03570q655j0902j1676j1921j2243j1974j0756r544q995q251o598m979m547
$$ 203570 194915 184013 172337 160416 148173 136199 125443 115899 106904 98653 92055 87076 82529
54889H2529m804m492l459k393j561q74n49o95q94r62j302j878j774n73P67J247
$$ 82529 77725 73233 69774 67381 65820 64946 64397 63702 62808 61846 60544 58666 56892 56319 57086 58333
54873E8333J016N72j63j070j323o42n5l92r78q40k61n0k00k90m53q84j191j122
$$ 58333 59349 59921 59758 58688 57365 56723 56668 56276 55298 54458 54197 54147 53947 53657 53204 52320 51129 50007
54855E0007j125j402j317o04p2k25k76L53P68O6j012j218p17m52m50k06J9k82
$$ 50007 48882 47480 46163 45559 45487 45262 44986 45339 46107 46173 45161 43943 43226 42774 42324 42118 42137 41855
54837D1855o56l88K08M08M53R70J604J598J202J195J416J123M04NO3K05N02J144
$$ 41855 41199 40811 41019 41427 41880 42850 44454 46052 47254 48449 49865 50988 51392 51397 51460 51665 52167 53311
54819E3311J564J157M06J78L01J83L04J585L579M833M976N024N533N963O015O313
$$ 53311 54875 56032 56438 56616 56917 57100 57404 58989 62568 67401 72377 77401 82934 88897 94912 101225
54803A01225P357Q884J0625J2687J4837J6136J5680J3292R484N180J308j911n025
$$ 101225 108582 117466 128091 140778 155615 171751 187431 200723 210207 215387 216695 214784 209759
54790B09759q161j0325j0671r929r517r554q987p459n822m704l836k984k485k439
$$ 209759 201598 191273 180602 170673 161156 151602 142615 135156 129334 124630 120794 117810 115325 112886
54776A12886k255j421j36J164K316L249L772L899M082M905O663R121J1504J2953
$$ 112886 110631 109210 109074 110238 112554 115803 119575 123474 127556 132461 139124 148245 159749 172702
54762A72702J3274J3008J2624J2012J1082J0176R519Q663P108M851J954j838o353
$$ 172702 185976 198984 211608 223620 234702 244878 254397 263060 270168 275019 276973 275135 268782
54749B68782j0499j3294j4886j5840j6092j5435j4472j3890j3310j1888r811q103
$$ 268782 258283 244989 230103 214263 198171 182736 168264 154374 141064 129176 119365 111262
54737A11262p137o382n512m736m093l362k708k523k603k261j359n07k19m59r81
$$ 111262 104125 97743 92231 87495 83402 80040 77332 74809 72206 69945 68586 68079 67860 67401 66420
54722F6420j502j639j276q50p66p47l62J23J61j19j81p6k65o34n44O9N60N37L03
$$ 66420 64918 63279 62003 61153 60387 59640 59278 59401 59562 59443 59262 59186 58921 58287 57743 57812 58372 58909 59212
54703E9212K41L78O72J128J582J799J743J465Q72N2n14n31l80n28p86p61o09o81
$$ 59212 59453 59831 60503 61631 63213 65012 66755 68220 69092 69144 68630 68099 67719 67191 66405 65644 65035 64354
54685F4354p16j39J016K131K725K669K037J298J230J985K634K395J766J708K130
$$ 64354 63638 63499 64515 66646 69371 72040 74077 75375 76605 78590 81224 83619 85385 87093 89223
54670H9223K197J776J529J773K153K386K515K481K261K374L459N393P395Q940
$$ 89223 91420 93196 94725 96498 98651 101037 103552 106033 108294 110668 114127 119520 126915 135855
54656A35855J0103J1151J2329J3781J5217J6016J5949J5283J3823J0692N812N69
$$ 135855 145958 157109 169438 183219 198436 214452 230401 245684 259507 270199 276011 276580
54644B76580l790p562j1300j4197j5182j4773j4257j3590j1902r679q505q614
$$ 276580 272790 265228 253928 239731 224549 209776 195519 181929 170027 160348 151843 143229
54632A43229q488p181n522m581m323m245m200m059l554k847k412k149j467l58
$$ 143229 134741 127560 122038 117457 113134 108889 104689 100630 97076 94229 91817 89668 88201 87843
54618H7843M67O57N15J40p24j825k364k012j222m72kk24j372k748l293k917k344
$$ 87843 88310 88967 89482 89622 88898 87073 84709 82697 81475 81003 81001 80777 79405 76657 73364 70447 68103
54601F8103j727o09P43J290P50M3q9J57M28P41R40O58N8l66p94j772k797k570
$$ 68103 66376 65767 66510 67800 68550 68593 68504 68661 69089 69830 70770 71428 71486 71120 70326 68554 65757 63187
54583F3187r67M97O84J24k12j97k3M48J041J007J20o95o22p0J28q2j72R6O07J158
$$ 63187 62220 62717 63401 63525 63313 63116 63093 63541 64582 65589 65709 65014 64392 64322 64450 64368 64196 64292 64899 66057
54563F6057J416J103N24L52O35O99K63j20K5M99J028J668K247K291J849J640K046
$$ 66057 67473 68576 69100 69452 70087 70786 71049 70929 70954 71453 72481 74149 76396 78687 80536 82176 84222
54546H4222K709L420M430N620O295O380O771P855Q613P886N854L513J423m15k039
$$ 84222 86931 90351 94781 100401 106696 113076 119847 127702 136315 144201 150055 153568 154991 154576 152537
54531A52537l601n375p126p969p495o492n959n862n459m461l281k479k290k473
$$ 152537 148936 143561 136435 128466 120971 114479 108520 102658 97199 92738 89457 86978 84688 82215
54517H2215k392j662q46q78j737k341k001j175m73J25O59O84L5o30o99m65n58
$$ 82215 79823 78161 77315 76437 74700 72359 70358 69183 68710 68835 69494 70178 70213 69583 68884 68419 67861
54500F7861j055j641k055j874o46J160K088J344l4m20M28J458J902J886J660J192
$$ 67861 66806 65165 63110 61236 60590 61750 63838 65182 65148 64728 65156 66614 68516 70402 72062 73254
54484G3254N98L05N11Q44P81K81j63j61Jl03j012j247n64J48j29r37r81j91J61
$$ 73254 73852 74157 74668 75512 76293 76574 76411 76250 76251 75948 74936 73689 73125 73273 73144 72207 71226 71035 71196
54465G1196n08j219j010k63J83K41K11J8m53q41p70l36K71J043J679J528N68k60
$$ 71196 70688 69469 68459 68196 68379 68620 68831 68849 68396 67555 66785 66449 66720 67763 69442 70970 71538 71278
54447G1278k40J97K53j20m64o27p00n46M0Q44J388J372Q38J65j16J14K35k42p50
$$ 71278 71038 71235 71488 71368 70904 70277 69577 69031 69071 69915 71303 72675 73513 73678 73562 73676 73911 73669 72919
54428G2919m86P0l24j542j917o24J106J804J573J268J068Q24R27J690K511K603
$$ 72919 72433 72503 72179 70637 68720 68096 69202 71006 72579 73847 74915 75739 76666 78356 80867 83470
54412H3470K037J403R83Q43J104J491J359P35N03R26J023J48q59j024p64r17j165
$$ 83470 85507 86910 87893 88736 89840 91331 92690 93425 93928 94854 95877 96025 95166 94142 93378 92461 91296
54395I1296p37K0J57k89n10l58l55m98k97J26J14m37r65j233j556k055k447k538
$$ 91296 90559 90579 90736 90447 89937 89579 89224 88726 88429 88555 88669 88232 87267 86034 84478 82423 79976 77438
54377G7438k320j705p69kK57L20M77K55q50k269k843k222j079j42L75N65P38J198
$$ 77438 75118 73413 72644 72642 72899 73219 73696 73951 73101 70832 67989 65767 64688 64546 64921 65486 66224 67422
54359F7422J708J544O31pL75J158J432J454J936K450J988P11j62j40J18J44K31
$$ 67422 69130 70674 71305 71298 71673 72831 74263 75717 77653 80103 82091 82802 82640 82500 82618 82762 82993
54342H2993M70L55k85q68r69r08j174j813k556l042k821j737l69M36M81K34Pk86
$$ 82993 83463 83818 83533 82665 81696 80788 79614 77801 75245 72203 69382 67645 67276 67712 68193 68427 68434 68148
54324F8148o17p85q76j170j571j651j314q85n74l28j65j94l29m13n10o69o12j66
$$ 68148 67531 66746 65870 64700 63129 61478 60164 59279 58705 58377 58212 58018 57689 57276 56766 56097 55485 55319
54306E5319J94q1p16r32n77k47k84l56q9M26R19J286J529J615J509J186O57J68
$$ 55319 55513 55432 54716 53784 53207 52960 52676 52320 52231 52657 53576 54862 56391 58006 59515 60701 61358 61526
54288F1526Q0L86O55O62O48P43O93M77N14Q06N98m05j234q41M17J420J766J697
$$ 61526 61606 61992 62647 63309 63957 64700 65393 65870 66384 67190 67788 67383 66149 65308 65725 67145 68911 70608
54270G0608J102j50j252j151j06N07J02n59p21n65m65k60K90R87J512J794J845
$$ 70608 71710 71560 70308 69157 69051 69558 69660 69101 68380 67815 67350 67090 67380 68367 69879 71673 73518
54253G3518J619J092L03o09j184q64J35P02J89o05n87JQ2n25r98r55p69n70n7
$$ 73518 75137 76229 76532 75923 74739 73875 74010 74712 74901 74296 73709 73710 73792 73267 72269 71314 70545 69975 69918
54234F9918N46N38m4l19M4K87j70q62j129j048r36p00k00K03N9m92q37n46L21
$$ 69918 70464 71002 70958 70639 70683 70970 70800 69938 68809 67761 66825 66125 65925 66128 66187 65695 64858 64312 64633
54215F4633J301J787J494P20N2j85%M76R11Q77M36L14Q67J292O15q23j711j472
$$ 64633 65934 67721 69215 69935 69987 69802 69802 70278 71189 72066 72502 72816 73683 74975 75590 74767 73056 71584
54197G1584p44k04J35L64L05k0k71l64n85r72j232j387j860k687l186k812j868
$$ 71584 70840 70636 70771 71135 71440 71420 71149 70785 70200 69228 67996 66609 64749 62062 58876 56064 54196
54180E4196j142j049j345j426q64J75J049J277R14K72l51n50J3R67J424J160Q82
$$ 54196 53054 52005 50660 49234 48370 48545 49594 50871 51785 52057 51706 51156 51169 52136 53560 54720 55602
54163E5602R04N32n26j218o62L26N29J93K31L29m12j489j594q57o13r97p55M04
$$ 55602 56506 57038 56512 55294 54632 54958 55487 55680 55911 56240 55828 54339 52745 51888 51275 50278 49523 49927
54145D9927J223J031O30N21P6q06j004m5Q52O13j57m76n16p75q57k64N02O88L59
$$ 49927 51150 52181 52811 53332 53408 52602 51598 51553 52405 53018 52861 52385 51869 51094 50237 49973 50475 51163 51522
54126E1522p6o31j171j039j18N56K55k55L1P22P83K05k52m45p34r25m65L79O75
$$ 51522 51446 50815 49644 48605 48487 49043 49298 49043 49074 49796 50579 50784 50532 50087 49353 48428 47963 48342 49017
54107D9017J73l64k01O22J571K119J971J261M83L6n5J37N50Q30N62j6j50J75J1
$$ 49017 49190 48826 48625 49247 50818 52937 54908 56169 56652 56688 56633 56770 57320 58150 58712 58696 58546 58721 58732
54088E8732j049j943j576m49M2m69j076r89l26M35J040J448J676J715J437P86
$$ 58732 57683 55740 54164 53715 53757 53288 52212 51223 50897 51332 52372 53820 55496 57211 58648 59434
54072E9434J23oL67P07Q67J227J720J682J075Q89J606K236J797R18Q30J408J430
$$ 59434 59557 59551 59918 60625 61492 62719 64439 66121 67196 68085 69691 71927 73724 74642 75472 76880 78310
54055G8310M89n92j026p68o9P48J142Q98O93J296K253K356J388M78N39J264J948
$$ 78310 78799 78207 77181 76413 76344 77092 78234 79132 79825 81121 83374 85730 87118 87596 88135 89399 91347
54038I1347K445K947L429L817M272M893N414N446M864L757K271P33k97l17P15
$$ 91347 93792 96739 100168 103985 108257 113150 118564 124010 128874 132631 134902 135635 135338 135021 135736
54023A35736K234L377L566K973K269J797J274M21m37p69o63p76j557k770l783
$$ 135736 137970 141347 144913 147886 150155 151952 153226 153647 153210 152441 151778 151002 149445 146675 142892
54008A42892m113l761l230l082l367l600l386k816k134j336m42J12k48j558l111
$$ 142892 138779 135018 131788 128706 125339 121739 118353 115537 113403 112067 111625 111737 111489 109931 106820
53993A06820l941l567k438j605j671k068j782p50Nk09q96j144p11J20J103J947
$$ 106820 102879 99312 96874 95269 93598 91530 89748 88998 89003 88794 87898 86754 86043 86163 87266 89213
53977H9213K071J102n36j947k530k195j208j43L31R3k52j79J13J95J57L42O50
$$ 89213 91284 92386 91850 89903 87373 85178 83970 83827 84158 84251 83999 83820 83933 84128 84285 84627 85277
53960H5277O38K09k65m02j29L97Q70J011Q75Q32J074J400J672K101K828L556L920
$$ 85277 85915 86124 85859 85457 85328 85725 86595 87606 88481 89313 90387 91787 93459 95560 98388 101944 105864
53943A05864M051M438N382O725P861Q075P199O067N823O638P520P512O510M883
$$ 105864 109915 114353 119735 126460 134321 142396 149595 155662 161485 168123 175643 183155 189665 194548
53929A94548K916R26o52j673k283k429j950j296j211j524j243j42P76R60J280
$$ 194548 197464 198390 197738 196065 193782 191353 189403 188107 186896 185372 184129 183987 184763 185723 187003
53914A87003K513L948M544M541M752N004M584L644K890K300J367L69M1K27M9o22
$$ 187003 189516 193464 198008 202549 207301 212305 216889 220533 223423 225723 227090 227459 227500 227727 227776 227154
53898B27154j115j319j852k745l231l105l207m065n045n387n243n132n038m648
$$ 227154 226039 224720 222868 220123 216892 213787 210580 206515 201470 196083 190840 185708 180670 176022
53884A76022m060l645l530l552l593l573l340k741j909j266j242j800k307k180
$$ 176022 171962 168317 164787 161235 157642 154069 150729 147988 146079 144813 143571 141771 139464 137284
53870A37284j694j768k673l597l809l645l725l837l426k781k640k869k588j540
$$ 137284 135590 133822 131149 127552 123743 120098 116373 112536 109110 106329 103689 100820 98232 96692
53856I6692m26K07M46L34l78j443k004j661j023p77p57l92L88J084J227P55L4
$$ 96692 96266 96473 96919 97253 96875 95432 93428 91767 90744 89967 89210 88818 89206 90290 91517 92272 92306
53839I2306l85k61K1o8n19q76r46q87o49pP60R33M08%L24Q67P11j54q61q06k21
$$ 92306 91921 91660 91681 91613 91094 90218 89272 88385 87736 87729 88489 89422 89830 89830 90154 91021 91732 91578 90717 89911 89690
53818H9690L66P71J048J119Q15J98m06o94n71q2O40J315J733K154L046M197M594
$$ 89690 90056 90827 91875 92994 93809 94007 93601 92907 92336 92254 92894 94209 95942 98096 101142 105339 109933
53801A09933L751K680K745L807M475M068L262K708K242J785J780K201K183J426
$$ 109933 113684 116364 119109 122916 127391 131459 134721 137429 139671 141456 143236 145437 147620 149046
53787A49046Q42J025J160M27n12o67m81r94j938k223j924k168l165l848l619l087
$$ 149046 149888 150913 152073 152500 151988 151321 150840 149846 147908 145685 143761 141593 138428 134580 130961 127874
53771A27874k835k643k299k117k239k289k075j941k148k508k738k680k135j086
$$ 127874 125039 122396 120097 117980 115741 113452 111377 109436 107288 104780 102042 99362 97227 96141
53757I6141n6L82L41K62N4n87j345j665j766k172k497j889o42o8o04j257j223
$$ 96141 96085 96467 96808 97070 97124 96537 95192 93527 91761 89589 87092 85203 84561 84493 83889 82632 81409
53740H1409q23n13j77J52k8p02r93m54K11L13K21O42J525K246K381J812P61q1
$$ 81409 80586 80073 79896 80048 80020 79318 78325 77871 78082 78395 78616 79258 80783 83029 85410 87222 87983 87902
53722H7902q3L82L36k86m56K11P05J50r16j543j724j912k029j864j729j811j472
$$ 87902 87819 88201 88537 88251 87795 88006 88711 88861 87945 86402 84678 82766 80737 78873 77144 75333 73861
53705G3861j69J449K299K326K262K269J817Q82L23Q55K229L514L919L404K661
$$ 73861 73692 75141 77440 79766 82028 84297 86114 86996 87319 88174 90403 93917 97836 101240 103901
53690A03901K345K222J528L28k96J93Q00M36l75k66Q66J697J433P78O54Q87P23
$$ 103901 106246 108468 109996 110324 110028 110221 111021 111457 111082 110816 111682 113379 114812 115590 116244 117131 117854
53673A17854J08k50N2N25M56j49n42k28M32P76P57Q07R53P17m4p72r57p58n92
$$ 117854 117962 117712 117764 118289 118745 118596 118054 117826 118258 119034 119791 120598 121551 122268 122224 121452 120495 119737 119145
53654A19145o00p29r25r01k69Q30J684J953K088K444K544J819O55m4M2M66P48
$$ 119145 118545 117816 116891 115990 115721 116551 118235 120188 122276 124720 127264 129083 129738 129694 129736 130202 130950
53637A30950O49J1j020j743j531p04k28n02q79n23O44J921K472J979R06J44J90
$$ 130950 131599 131610 130590 128847 127316 126612 126384 125882 125003 124480 125124 127045 129517 131496 132402 132546 132736
53620A32736P27J114J129R71P40L11k16l88R4R19J490J596J583J809K107K075
$$ 132736 133463 134577 135706 136677 137417 137728 137512 137124 137218 138137 139627 141223 142806 144615 146722 148797
53604A48797J758J676K021K256J907J366J400K087K810L145L140K759J886R45
$$ 148797 150555 152231 154252 156508 158415 159781 161181 163268 166078 169223 172363 175122 177008 177953
53590A77953P70J571K575K968K701K069J161J13n51l78M26J217J499J161M36j89
$$ 177953 178723 180294 182869 185837 188538 190607 191768 191881 191330 190952 191378 192595 194094 195255 195691 195502
53574A95502l12n7J03pj48k12l48m90l70j51l32q82j122p99n66r64j573j652j130
$$ 195502 195190 195133 195236 195229 195081 194869 194521 194031 193661 193510 193178 192296 191174 190375 189809 188845 187272 185620 184490
53555A84490m31J85O18P04M74L00L97N21N24P09J224J621J490J118R99J044Q21
$$ 184490 184059 184244 184862 185566 186040 186340 186737 187258 187782 188491 189715 191336 192826 193944 194943 195987 196808
53538A96808K23m69r59r58k68Q28J607J702J462J232Q69L47J76O77J397J800K047
$$ 196808 197031 196562 195603 194645 194377 195205 196812 198514 199976 201208 202077 202424 202600 203277 204674 206474 208521
53521B08521K426K619K236J738J935K827L658M005M181M654N598O878Q025Q431
$$ 208521 210947 213566 215802 217540 219475 222302 225960 229965 234146 238800 244398 251276 259301 267732
53507B67732P943P081O424O134O301P116Q293R004R037R353J0707J2337J3036
$$ 267732 275675 282756 289180 295314 301615 308731 317024 326028 335065 344418 355125 367462 380498
53494C80498J2967J3304J4259J4785J4302J3600J3655J4375J4958J4990J4715
$$ 380498 393465 406769 421028 435813 450115 463715 477370 491745 506703 521693 536408
53483E36408J4552J4570J4497J4211J4132J4785J5887J6474J6182J5742J5732
$$ 536408 550960 565530 580027 594238 608370 623155 639042 655516 671698 687440 703172
53472G03172J5628J4811J3771J3355J3286J2634J1434J0684J0826J1289J1615
$$ 703172 718800 733611 747382 760737 774023 786657 798091 808775 819601 830890 842505
53461H42505J1981J2383J2267J1338J0036Q935Q162P562O904N794M000J888J13
$$ 842505 854486 866869 879136 890474 900510 909445 917607 925169 932073 937867 941867 943755 943868
53448I43868j206k523m110n804p394q694r370r362r321r865j0560j0491r795r662
$$ 943868 942662 940139 936029 930225 922831 914137 904767 895405 886084 876219 865659 855168 845373 835711
53434H35711j0695j2131j2951j2944j2402j1608j0963j0892j1239j1249j0518
$$ 835711 825016 812885 799934 786990 774588 762980 752017 741125 729886 718637 708119
53423G08119r438q521p845p322o876o192m913l348k268j796j268m13J91L15P82
$$ 708119 698681 690160 682315 674993 668117 661925 657012 653664 651396 649600 648332 647919 648110 648425 649207
53408F49207K260M063N049N233N621O701P950Q836R473J0189J0992J1709J2302
$$ 649207 651467 655530 660579 665812 671433 678134 686084 694920 704393 714582 725574 737283 749585
53395G49585J2768J2915J2594J2138J2371J3861J6198J8299J9653K0891K2810
$$ 749585 762353 775268 787862 800000 812371 826232 842430 860729 880382 901273 924083
53384I24083K5140K6885K7639K7935K8324K8859K9505L0369L1316L1997L2500
$$ 924083 949223 976108 1003747 1031682 1060006 1088865 1118370 1148739 1180055 1212052 1244552
53373A244552L3281L4252L4609L3982L3046L2515L2094L1097K9561K8111K7031
$$ 1244552 1277833 1312085 1346694 1380676 1413722 1446237 1478331 1509428 1538989 1567100 1594131
53362A594131K6114K5178K4085K2434J9896J6890J4316J2531J1063R351P347N161
$$ 1594131 1620245 1645423 1669508 1691942 1711838 1728728 1743044 1755575 1766638 1775989 1783336 1788497
53350A788497K559r27n442j0608j5749k0252k3783k6328k8112k9418l0415l1044
$$ 1788497 1791056 1790129 1784687 1774079 1758330 1738078 1714295 1687967 1659855 1630437 1600022 1568978
53338A568978l1075l0451k9566k9025k9044k9158k8663k7317k5575k4154k3441
$$ 1568978 1537903 1507452 1477886 1448861 1419817 1390659 1361996 1334679 1309104 1284950 1261509
53327A261509k3284k3325k3449k3822k4515k5200k5325k4501k2763k0590j8639
$$ 1261509 1238225 1214900 1191451 1167629 1143114 1117914 1092589 1068088 1045325 1024735 1006096
53316A006096j7243j6046j4465j2549j0991j0088r238p888o555o199o886p799
$$ 1006096 988853 972807 958342 945793 934802 924714 915476 907588 901033 894834 887948 880149
53304H80149q487r277j0333j0984j0528r150p692o735o278o138o203o325o203
$$ 880149 871662 862385 852052 841068 830540 821390 813698 806963 800685 794547 788344 782019 775816
53291G75816n505m169k531j091j32M32Q32J273J957K936L925M577N090O142P928
$$ 775816 770311 766142 763611 762520 762388 762820 763652 764925 766882 769818 773743 778320 783410 789552 797480
53276G97480R774J1024J1847J2666J3299J3289J2753J2228J1928J1791J1965J2479
$$ 797480 807254 818278 830125 842791 856090 869379 882132 894360 906288 918079 930044 942523
53264I42523J2692J1942J0609R605Q913P615N489L504K418J815R50k48j539l107
$$ 942523 955215 967157 977766 987371 996284 1003899 1009388 1012892 1015310 1017125 1018075 1017827 1016288 1013181
53250A013181n253p813j0307j2410j4013j5212j6382j7819j9069j9272j8361j7415
$$ 1013181 1007928 1000115 989808 977398 963385 948173 931791 913972 894903 875631 857270 839855
53238H39855j7360j7904j8155j7778j7064j6231j5254j4163j3098j2227j1775
$$ 839855 822495 804591 786436 768658 751594 735363 720109 705946 692848 680621 668846
53227F68846j1898j2375j2788j3107j3677j4466j4821j4296j3182j1965j0785
$$ 668846 656948 644573 631785 618678 605001 590535 575714 561418 548236 536271 525486
53216E25486r778r313r348r060p757n814m151l095k380j969k156k917l779m484
$$ 525486 515708 506395 497047 487987 480230 474416 470265 467170 464790 462821 460665 457748 453969 449485
53202D49485n311o562q067r319r996j0281j0599j1084j1309j0875j0078r636r653
$$ 449485 444174 437612 429545 420226 410230 399949 389350 378266 366957 356082 346004 336368 326715
53189C26715r404q297o630n138m243m023m525n565o588p140p334p533p780p891
$$ 326715 317311 309014 302384 297246 293003 288980 284455 278890 272302 265162 257828 250295 242515 234624
53175B34624p842p715p469p048o519n906n096m189l575l375l183k746k505k917
$$ 234624 226782 219067 211598 204550 198031 192125 187029 182840 179265 175890 172707 169961 167456 164539
53161A64539l511l340k304j369j324j808j872j194m08k72q15j371j414j098q91
$$ 164539 161028 157688 155384 154015 152691 150883 149011 147817 147409 147137 146322 144951 143537 142439 141548
53146A41548q74p51m05j06r2l22o79j052j250j181j087j175j088l65N48O18k81
$$ 141548 140674 139923 139518 139412 139320 138998 138319 137267 136017 134836 133749 132574 131486 131121 131669 132287 132006
53129A32006j035q97n77j012j812j869r88m0L79M70N29M62J88j17k95l30j73J61
$$ 132006 130971 130074 129497 128485 126673 124804 123816 123776 124155 124625 125154 125616 125804 125687 125392 125062 124889 125050
53111A25050L80K43K3J92O35O66o7j133j866j977j592j001n85o16j003j271j037
$$ 125050 125430 125673 125696 125888 126523 127189 127122 125989 124123 122146 120554 119553 118968 118352 117349 116078 115041
53094A15041l91K12L56On13q09p56m22J35P71J031M99n25j109p39R5N97N68K97
$$ 115041 114650 114862 115218 115224 114711 113902 113146 112724 112859 113630 114661 115160 114635 113526 112787 112882 113479 114047 114344
53075A14344n1m68p87p87m52J89J166K165K427J608M57PL01N90O37R61J736K284
$$ 114344 114293 113825 113038 112251 111799 111988 113154 115319 117746 119354 119811 119818 120119 120709 121346 122307 124043 126327
53057A26327K091J605J539J804J762J272Q17O56M19k05q67j017o88m18m92p28
$$ 126327 128418 130023 131562 133366 135128 136400 137217 137873 138292 138087 137220 136203 135515 135097 134605 133877
53041A33877j029j568k139j983q12M34O19n5l78J15O49O23N35R93J545J290J49
$$ 133877 132848 131280 129141 127158 126346 126780 127399 127344 126966 127081 127730 128353 128888 129881 131426 132716 132865
53024A32865j001j309p01J25K64m95j200p02P52J625J087P9j78J43J08l54m88
$$ 132865 131864 130555 129854 129979 130243 129748 128548 127846 128598 130223 131310 131389 131211 131354 131462 131108 130620
53007A30620L5Q60J660K217K090J100rl33n5l5k85PR26J523J339J152J624K166
$$ 130620 130655 131515 133175 135392 137482 138582 138573 138240 138185 138150 137865 137872 138798 140321 141660 142812 144436 146602
52989A46602J892J012N24Q08J269J162L37p42j353j039p5O85O97K97J97N99J077
$$ 146602 148494 149506 150030 150838 152107 153269 153606 152864 151511 150472 150397 151082 151779 152076 152273 152872 153949
52972A53949J241J174J198J392J481J192O10J14JK89Q42J463J828J647J067O33
$$ 153949 155190 156364 157562 158954 160435 161627 162237 162351 162352 162641 163483 164946 166774 168421 169488 170121
52956A70121O27P22N65L15K91M12M35M46O04O58L34k6J01M92M44l3j46L45N66
$$ 170121 170748 171470 172035 172350 172641 173053 173488 173934 174538 175196 175530 175504 175605 176097 176541 176508 176362 176707 177273
52937A77273k81j659k281j548j4J360J921J522N01m53p52m24n2j21m88n29J48
$$ 177273 176992 175333 173052 171504 171490 172850 174771 176293 176794 176341 175589 175165 175113 174992 174504 173975 174123
52920A74123J256K145K479K413K178J804J369J183J380J628J559J283J148J104
$$ 174123 175379 177524 180003 182416 184594 186398 187767 188950 190330 191958 193517 194800 195948 197052
52906A97052P55Pp67j230j472j766k135k286j968j386j131j510k054k093j720
$$ 197052 197807 197814 197047 195817 194345 192579 190444 188158 186190 184804 183673 182163 180109 178016 176296
52891A76296j670k077k182j599j083j338j804j476m94J15m1m41p73j221j604j262
$$ 176296 174626 172549 170367 168768 167685 166347 164543 163067 162573 162688 162647 162206 161433 160212 158608 157346
52875A57346j02J047J502J475J505J793K276K778K801J879M22m99n75p92k026
$$ 157346 157244 158291 159793 161268 162773 164566 166842 169620 172421 174300 174722 174223 173648 172856 170830
52860A70830l699m495m020l097k582k503k364j925j518j634k259k724k431j603
$$ 170830 167131 162636 158616 155519 152937 150434 148070 146145 144627 142993 140734 138010 135579 133976
52846A33976r77p99o62l45j91m27o67n03j41n8l72r38j741k683l265l009k120
$$ 133976 132999 132200 131538 131193 131002 130575 129908 129405 129264 129206 128834 127896 126155 123472 120207 117198 115078
52829A15078j315r51p09k39K50K33l78j016j080o42l44n90j045j060l84O59J529
$$ 115078 113763 112812 112103 111864 112114 112347 111969 110953 109873 109231 108887 108297 107252 106192 105808 106467 107996
52812A07996J839J572J108Q43O22o7j104j476n48Q41J289N56l19m95j25L50P81
$$ 107996 109835 111407 112515 113358 113980 113913 112809 111333 110785 111626 112915 113471 113152 112657 112532 112882 113663
52795A13663J045R35N86N23R70J579J946J979J654J010M09K28K55pl77j31P69
$$ 113663 114708 115643 116229 116752 117722 119301 121247 123226 124880 125890 126299 126527 126782 126775 126398 126267 127036
52778A27036J489J560J432J363Q02m66j468j268m06j28o32j032q64o36q65j390
$$ 127036 128525 130085 131517 132880 133682 133216 131748 130480 130074 129946 129314 128282 127418 126782 125917 124527
52762A24527j769j803j458p52J7L39j7p22j207j187p93l16J62P63J433J744J400
$$ 124527 122758 120955 119497 118745 118762 119101 119084 118362 117155 115968 115175 114859 115021 115784 117217 118961 120361
52745A20361P69M81N24L43j31k82J63N69L36k29n34o80j092j582j489o43M74J447
$$ 120361 121130 121611 122135 122478 122347 122065 122228 122797 123133 122904 122370 121690 120598 119016 117527 116884 117358 118805
52727A18805K157K463K206J683J514J873K262K161J589R13M24K92O56J415K089
$$ 118805 120962 123425 125631 127314 128828 130701 132963 135124 136713 137626 138050 138342 138998 140413 142502
52712A42502K079J295L42j21j68m81j289j825j247J07R67O27l34r26p50o4O84
$$ 142502 144581 145876 146218 146097 145929 145448 144159 142334 141087 141194 142161 142788 142454 141528 140778 140714 141398
52695A41398J090J004P83R57J500J876J861J806J896J748J123M05nk04l57l10
$$ 141398 142488 143492 144275 145232 146732 148608 150469 152275 154171 155919 157042 157447 157442 157238 156881 156571
52679A56571r0j08m22m34M5J42q71k321k995k794k519k428k099j544j259j179
$$ 156571 156481 156373 155951 155517 155562 155704 154833 152512 149517 146723 144204 141776 139677 138133 136874 135695
52663A35695o56L11Q30M09l47p38q61j052j133p77j55L31N64O00M73M74J238K928
$$ 135695 135039 135350 136180 136589 136242 135504 134643 133591 132458 131681 131526 131857 132421 133021 133494 133968 135206 138134
52645A38134M572M824L427J512L97L33N76M30N0J17Q67J615J477M15o82j034p78
$$ 138134 142706 147530 150957 152469 152866 153199 153775 154205 154255 154372 155239 156854 158331 158746 158064 157030 156252
52628A56252n86p71j011r36o64n74p33q17o62n91r52j509j666j274q13o69o60
$$ 156252 155666 154895 153884 152948 152284 151710 150977 150160 149498 148907 147955 146446 144780 143506 142693 142024 141364
52611A41364n36m66p29j084j005l59M66J051J262J187J041J073J284J330R80N16
$$ 141364 140828 140362 139633 138549 137544 137185 137651 138702 139964 141151 142192 143265 144549 145879 146859 147375
52595A47375L68M23J72m83r70p97k37k7n20j255j447p91K20Q15P26K93q4l03l58
$$ 147375 147743 148166 148338 147855 146885 146088 145851 145824 145304 144049 142602 141811 142031 142846 143572 143865 143781 143478 143120
52576A43120k13o0k97r66j546j627j422j274j021l75L66N79J70m03q69j350j818
$$ 143120 142907 142847 142550 141584 140038 138411 136989 135715 134694 134319 134685 135264 135434 135031 134162 132812 130994
52559A30994j897j378n15K85P85Q94O60L07M2j98n57r29j083j030q68m65K82R49
$$ 130994 129097 127719 127204 127489 128274 129168 129828 130135 130177 129979 129422 128493 127410 126380 125512 125047 125329 126278
52541A26278R16J85o37j145j432j532j225n95j83k55l98k02J40K13J8j39r1J64
$$ 126278 127194 127379 126742 125597 124165 122633 121408 120813 120630 120375 119977 119775 119915 120128 120146 120007 119916 120080
52523A20080N79Q39M47n61j300r77K9N92K68l49o32p03q50q68m38J60L10m4k85
$$ 120080 120659 121498 121945 121384 120084 119107 119136 119728 119996 119647 119015 118312 117462 116594 116156 116316 116626 116582 116297
52504A16297J3N62Q95R78J019R68O62K24q3l59q97j516j624j074m89m25o58o60
$$ 116297 116310 116872 117767 118745 119764 120732 121394 121618 121535 121176 120279 118763 117139 116065 115576 115151 114493 113833
52486A13833m21l29m63m95k77l6j1j77l39k62K47J076J654J400L94o27j020p69
$$ 113833 113412 113083 112620 112125 111848 111812 111801 111624 111285 111023 111270 112346 114000 115400 115794 115167 114147 113378
52468A13378k96L7J07m6l36o53q43p62m03m1L7j10j36O2J44j57n92p11m35j04
$$ 113378 113082 113119 113226 113180 112844 112191 111348 110586 110183 110142 110179 110069 109933 109995 110139 109982 109390 108679 108244 108140
52448A08140r0n39j218j478p57O35J549J248K74l63m52m28l31J95R67J195N86
$$ 108140 108050 107511 106293 104815 104058 104693 106242 107490 107764 107401 106949 106521 106190 106385 107352 108547 109133
52431A09133k35o53p86r13p79j2J088J756J580P78j50p15n86J94J055J334Q48
$$ 109133 108898 108245 107459 106546 105767 105755 106843 108599 110179 110957 110807 110092 109506 109700 110755 112089 112937
52414A12937j7p79j139r51k27P61J536J747J417Q10K70Q4L39P43P35Q2p43j026
$$ 112937 112920 112141 111002 110051 109824 110585 112121 113868 115285 116095 116365 116449 116788 117531 118266 118348 117605 116579
52396A16579o50j70PQ7L70P01Q35R72J356J650J346O51K53K37O8l10k02O89J579
$$ 116579 115929 115759 115766 115853 116223 116924 117759 118731 120087 121737 123083 123734 123987 124224 124292 123982 123780 124469 126048
52377A26048J624R70L56J67L73Q42J182Q30j13o55p4J082J750J602J006L06j13
$$ 126048 127672 128642 128998 129165 129538 130380 131562 132392 132279 131624 131550 132632 134382 135984 136990 137296 137183
52360A37183L60J713K735K301R46J94N63J274J729K055K209J770Q90M30P66J353
$$ 137183 137543 139256 141991 144292 145238 145432 145995 147269 148998 151053 153262 155032 155922 156352 157118 158471
52344A58471J702J930K053J682Q83M20O01P51L33j06J99J014J514J417J145J136
$$ 158471 160173 162103 164156 165838 166721 167141 167742 168493 168826 168720 168919 169933 171447 172864 174009 175145
52328A75145J552K295K945K984K543K473L232M146M309L846L622L978M441M611
$$ 175145 176697 178992 181937 184921 187464 189937 193169 197315 201624 205470 209092 213070 217511 222122
52314B22122M732N189N912O433O396N927N550N666O114O453O644P099P940Q625
$$ 222122 226854 232043 237955 244388 250784 256711 262261 267927 274041 280494 287138 294237 302177 310802
52300C10802Q714Q582Q969R955J0862J1129J0965J1007J1589J2416J2937J2987
$$ 310802 319516 328098 337067 347022 357884 369013 379978 390985 402574 414990 427927 440914
52288D40914J2972J3330J3936J4267J4116J3822J3793J4032J4235J4106J3518
$$ 440914 453886 467216 481152 495419 509535 523357 537150 551182 565417 579523 593041
52277E93041J2590J1652J0944J0354R613Q712P788O762N455M015K831K047J582
$$ 593041 605631 617283 628227 638581 648194 656906 664694 671456 676911 680926 683757 685804 687386
52264F87386J448J640J717J159J30o63j018j459k316l166l410k903j784k92J060
$$ 687386 688834 690474 692191 693350 693480 692817 691799 690340 688024 684858 681448 678545 676761 676469 677529
52249F77529J750J868K007K382K677K917L663N019O297P067P785Q840R837J0474
$$ 677529 679279 681147 683154 685536 688213 691130 694793 699812 706109 713176 720961 729801 739638 750112
52235G50112J1288J2670J3855J3931J3283J2916J2692J1563R426P548O826O726
$$ 750112 761400 774070 787925 801856 815139 828055 840747 852310 861736 869284 876110 882836
52223H82836O336N636N126M792M143K994J698O04l44j472k935m503n781o677p496
$$ 882836 889172 894808 899934 904726 908869 911863 913561 914165 913821 912349 909414 904911 899130 892453 884957
52208H84957q519r614j0473j1078j1673j2340j2864j3032j2828j2252j1188r566
$$ 884957 876438 866824 856351 845273 833600 821260 808396 795364 782536 770284 759096 749530
52196G49530p640n991n183n297n800n985n538m720m034l856m216m709m763m243
$$ 749530 741890 735899 730716 725419 719619 713634 708096 703376 699342 695486 691270 686561 681798 677555
52182F77555l680l628l927m013l748l437l128k546j776j334j433j772k189k810
$$ 677555 673875 670247 666320 662307 658559 655122 651994 649448 647672 646338 644905 643133 640944 638134
52168F38134l403l374k737k358k734l218l024k355j991k191k641k980k858j976
$$ 638134 634731 631357 628620 626262 623528 620310 617286 614931 612940 610749 608108 605128 602270 600294
52154F00294o52J11k90j288k029k482l026l452l296k775k503k490k210j600j194
$$ 600294 599642 599753 599463 598175 596146 593664 590638 587186 583890 581115 578612 576122 573912 572312 571118
52139E71118j310j756k257k556k294j408n84n97j332k012k236k159j890j398r70
$$ 571118 569808 568052 565795 563239 560945 559537 558953 558356 557024 555012 552776 550617 548727 547329 546359
52124E46359r58j201j334j481j866j987j168K02J006J069J330K168K782K674K628
$$ 546359 545401 544200 542866 541385 539519 537532 536364 536566 537572 538641 539971 542139 544921 547595 550223
52109E50223L521M985O083O616P003P421P848Q560R794J1192J2231J3017J4049
$$ 550223 553744 558729 564812 571428 578431 585852 593700 602260 612054 623246 635477 648494 662543
52096F62543J5372J6573J7469J8146J8451J8172J7750J8073J9314K0454K0382
$$ 662543 677915 694488 711957 730103 748554 766726 784476 802549 821863 842317 862699
52085H62699J9091J7395J5890J4658J3759J3327J3039J2070J0019P526N591M468
$$ 862699 881790 899185 915075 929733 943492 956819 969858 981928 991947 999473 1005064 1009532
$$ [...]
##END NTUPLES=NMR SPECTRUM
##END=
