##TITLE=NES1003_10334_9231133_xLDj0crgvG
##JCAMPDX= 6.0         $$ Bruker NMR JCAMP-DX V2.0
##DATA TYPE= NMR SPECTRUM
##DATA CLASS= NTUPLES
##ORIGIN= BRUKER
##OWNER= Administrator
$$ 1.72 TOPSPIN		Version 2.1
$$ 2015-06-17 22:51:09.894 -0700  Administrator@X
$$ Compression mode = diff/dup
##.OBSERVE FREQUENCY= 400.02188249412
##.OBSERVE NUCLEUS= ^1H
##.ACQUISITION MODE= SIMULTANEOUS (DQD)
##.ACQUISITION SCHEME= undefined
##.AVERAGES= 8
##.DIGITISER RES= 22
##SPECTROMETER/DATA SYSTEM= spect
##.PULSE SEQUENCE= zg30
##.SOLVENT NAME= COFFEE_meoh
##.SHIFT REFERENCE= INTERNAL, COFFEE_meoh, 1, 14.98509
##AUDIT TRAIL= $$ (NUMBER, WHEN, WHO, WHERE, PROCESS, VERSION, WHAT)
$$ ##TITLE= Audit trail, TOPSPIN		Version 2.1
$$ ##JCAMPDX= 5.01
$$ ##ORIGIN= Bruker BioSpin GmbH
$$ ##OWNER= Administrator
$$ $$ E:\/data/COFFEE/nmr/NES1003_10334_9231133_xLDj0crgvG/10/pdata/1/auditp.txt
$$ ##AUDIT TRAIL=  $$ (NUMBER, WHEN, WHO, WHERE, PROCESS, VERSION, WHAT)
(   1,<2015-06-17 22:51:02.800 -0700>,<Administrator>,<X>,<go>,<TOPSPIN 2.1>,
      <created by zg
	started at 2015-06-17 22:49:55.972 -0700,
	POWCHK enabled, PULCHK disabled,
       configuration hash MD5:
       21 0F 79 D6 B3 7B B4 F6 88 20 88 DB 03 48 BD 9F
       data hash MD5: 64K
       F4 0D E9 0E 73 24 70 64 B1 95 85 B7 F8 81 CE EF>)
(   2,<2015-06-17 22:51:05.894 -0700>,<Administrator>,<X>,<proc1d>,<TOPSPIN 2.1>,
      <Start of raw data processing
       efp LB = 0 FT_mod = 6 PKNL = 1 PHC0 = 0 PHC1 = 0 SI = 32K 
       data hash MD5: 32K
       D1 BE 74 18 A9 32 79 54 2C 37 39 96 34 56 E5 FC>)
(   3,<2015-06-17 22:51:06.191 -0700>,<Administrator>,<X>,<proc1d>,<TOPSPIN 2.1>,
      <pk PHC0 = 92.2467 PHC1 = 0 
       data hash MD5: 32K
       C8 18 31 4D 5F 16 14 46 86 45 14 2A B0 BE 5B D5>)
(   4,<2015-06-17 22:51:06.300 -0700>,<Administrator>,<X>,<proc1d>,<TOPSPIN 2.1>,
      <abs ABSG = 1 
       data hash MD5: 32K
       89 7D 2B DE A8 30 8C 69 12 B0 6F 13 18 CB 26 22>)
(   5,<2015-06-17 22:51:06.362 -0700>,<Administrator>,<X>,<proc1d>,<TOPSPIN 2.1>,
      <abs ABSG = 2 
       data hash MD5: 32K
       3F 86 32 89 D0 49 A3 3F 1B 9F 6F 2D 1A 9F 21 96>)
(   6,<2015-06-17 22:51:06.441 -0700>,<Administrator>,<X>,<proc1d>,<TOPSPIN 2.1>,
      <abs ABSG = 3 
       data hash MD5: 32K
       71 DC 7D 07 4E FA A6 7E EE 29 38 AC 41 CD 8F C5>)
(   7,<2015-06-17 22:51:06.503 -0700>,<Administrator>,<X>,<proc1d>,<TOPSPIN 2.1>,
      <abs ABSG = 4 
       data hash MD5: 32K
       D3 6E 3A 56 8C 24 ED EC D6 EA 06 D9 F2 22 B5 B3>)
(   8,<2015-06-17 22:51:06.550 -0700>,<Administrator>,<X>,<proc1d>,<TOPSPIN 2.1>,
      <abs ABSG = 5 
       data hash MD5: 32K
       F1 60 4F BE 5E 5A DD E8 BF FB AD 30 5B 73 11 2B>)
$$ ##END=
$$ 
$$ $$ hash MD5
$$ $$ 80 E0 08 97 A3 56 F2 B3 B5 93 BE C4 5A 6A 15 6A
##$RELAX= 
##$RELAX= 
##$RELAX= 
##$RELAX= 
##$RELAX= 
##$RELAX= 
##$RELAX= 
$$ Bruker specific parameters
$$ --------------------------
##$DU= <E:\>
##$EXPNO= 10
##$NAME= <NES1003_10334_9231133_xLDj0crgvG>
##$PROCNO= 1
$$ [...]
150 150 150 150 150 150 150 150
##$TP07= 0
##$TPNAME0= <>
##$TPNAME1= <>
##$TPNAME2= <>
##$TPNAME3= <>
##$TPNAME4= <>
##$TPNAME5= <>
##$TPNAME6= <>
##$TPNAME7= <>
##$TPOAL= (0..7)
0.5 0.5 0.5 0.5 0.5 0.5 0.5 0.5
##$TPOFFS= (0..7)
0 0 0 0 0 0 0 0
##$TUNHIN= 0
##$TUNHOUT= 0
##$TUNXOUT= 0
##$USERA1= <user>
##$USERA2= <user>
##$USERA3= <user>
##$USERA4= <user>
##$USERA5= <user>
##$V9= 5
##$VALIST= <valist>
##$VCLIST= <CCCCCCCCCCCCCCC>
##$VD= 0
##$VDLIST= <DDDDDDDDDDDDDDD>
##$VPLIST= <PPPPPPPPPPPPPPP>
##$VTLIST= <TTTTTTTTTTTTTTT>
##$WBST= 2048
##$WBSW= 25
##$XGAIN= (0..3)
0 0 0 0
##$XL= 0
##$YL= 0
##$YMAX_a= 535576
##$YMIN_a= -447623
##$ZGOPTNS= <>
##$ZL1= 120
##$ZL2= 120
##$ZL3= 120
##$ZL4= 120
##$ABSF1= 14.98509
##$ABSF2= -5.573092
##$ABSG= 5
##$ABSL= 3
##$ALPHA= 0
##$AQORDER= 0
##$ASSFAC= 0
##$ASSFACI= 0
##$ASSFACX= 0
##$ASSWID= 0
##$AUNMP= <proc_prof1d_extract_pilot.lims>
##$AXLEFT= 0
##$AXNAME= <>
##$AXNUC= <1H>
##$AXRIGHT= 0
##$AXTYPE= 0
##$AXUNIT= <>
##$AZFE= 0.1
##$AZFW= 0.1
##$BCFW= 0
##$BC_mod= 0
##$BYTORDP= 0
##$COROFFS= 0
##$CY= 15
##$DATMOD= 1
##$DC= 0
##$DFILT= <>
##$DTYPP= 0
##$F1P= 0
##$F2P= 0
##$FCOR= 0.5
##$FTSIZE= 32768
##$FT_mod= 6
##$GAMMA= 0
##$GB= 0
##$INTBC= 1
##$INTSCL= 1
##$ISEN= 128
##$LB= 0
##$LEV0= 0
##$LPBIN= 0
##$MAXI= 10000
##$MC2= 0
##$MEAN= 0
##$ME_mod= 0
##$MI= 0
##$NCOEF= 0
##$NC_proc= -8
##$NLEV= 6
##$NOISF1= 0
##$NOISF2= 0
##$NSP= 0
##$NTH_PI= 0
##$NZP= 0
##$OFFSET= 14.98509
##$PC= 1
##$PHC0= 92.2467
##$PHC1= 0
##$PH_mod= 1
##$PKNL= yes
##$PPARMOD= 0
##$PPDIAG= 0
##$PPIPTYP= 0
##$PPMPNUM= 2147483647
##$PPRESOL= 1
##$PSCAL= 4
##$PSIGN= 0
##$PYNMP= <proc.py>
##$REVERSE= no
##$SF= 400.02
##$SI= 32768
##$SIGF1= 0
##$SIGF2= 0
##$SINO= 400
##$SIOLD= 32768
##$SPECTYP= <>
##$SREGLST= <1H.CDCl3>
##$SSB= 0
##$STSI= 32768
##$STSR= 0
##$SW_p= 8223.68421052631
##$SYMM= 0
##$S_DEV= 0
##$TDeff= 65536
##$TDoff= 0
##$TI= <>
##$TILT= no
##$TM1= 0
##$TM2= 0
##$TOPLEV= 0
##$USERP1= <user>
##$USERP2= <user>
##$USERP3= <user>
##$USERP4= <user>
##$USERP5= <user>
##$WDW= 1
##$XDIM= 32768
##$YMAX_p= 380476634
##$YMIN_p= -763903
##$CURPLOT= <Network HP LaserJet P1505>
##$CURPRIN= <$Network HP LaserJet P1505>
##$DFORMAT= <normdp>
##$LAYOUT= <+/1D_H.xwp>
##$LFORMAT= <normlp>
##$PFORMAT= <normpl>
##$SURQMSG= 1
$$ End of Bruker specific parameters
$$ ---------------------------------
##NTUPLES= NMR SPECTRUM
##VAR_NAME=  FREQUENCY,     SPECTRUM/REAL,   SPECTRUM/IMAG
##SYMBOL=    X,             R,               I
##VAR_TYPE=  INDEPENDENT,   DEPENDENT,       DEPENDENT
##VAR_FORM=  AFFN,          ASDF,            ASDF
##VAR_DIM=   32768,         32768,           32768
##UNITS=     HZ,            ARBITRARY UNITS, ARBITRARY UNITS
##FACTOR=    0.250966925370066, 1,           1
##FIRST=     8223.43324360094, -97003,       -232984
##LAST=      0,             -59577,          -139672
##MIN=       0,             -763903,         0
##MAX=       8223.43324360094, 380476634,    0
$$ Real data points
##PAGE= N=1
##DATA TABLE= (X++(R..R)), XYDATA
$$ [...]
19495b39491k8340a12118A3731Q5170f4105O199J7481A62083a80159g0038B15127
19483A668b43042e8724b0471j99137B82653J19759a82639c6970j69161f5643C5918
19471b9492A09369c02508m6716f9455C39164c27024J13565d8936j96825r002k01055
19460d55818F0929N3537a95253b1788H9300c69182B83193a67722l0050f0606h050
19448a04049j30280A07663Q877J66655G398a37343L2708j92677e6873B46695E1655
19436f2098K3467A16621i4593j85882J15826N4763m6733j61620a03613F5396b77981
19424b93153k35109a58955k1376E5207J34721d9243l66580E5291a11883l3960
19414a45843A79634a70844A3650d98231A57920a49401G3576K8112d5489k53406
$$ y = [-239491, -267831, -112118, 13731, 98901, -64105, -57906, -40425, 162083, -180159, -70038, 215127, 1668, -243042, -58724, -20471, -219608, 282653, 402412, -182639, -36970, -206131, -65643, 35918, -29492, 109369, -302508, -349224, -69455, 339164, -327024, -213459, -48936, -245761, -254763, -455818, 60929, 114466, -195253, -21788, 89300, -369182, 283193, -167722, -197772, -60606, -8050, -104049, -234329, 107663, 116540, 283195, 7398, -137343, -104635, -297312, -56873, 246695, 51655, -62098, -38631, 116621, -94593, -280475, -164649, -109886, -156619, -318239, -103613, 65396, -277981, -293153, -528262, -158955, -180331, 55207, 189928, -49243, -415823, 55291, -111883, -145843, 179634, -170844, 13650, -498231, 157920, -149401, 73576, 101688, -45489, -298895]
19404b98895G0488N8176f6120C14300a56551j2730D7071a75696J1736J2582A67247
19392A1566b12390N3025g5468p5874n0026B7599j2906g3198j37312A72092Q430
19381A80522b14572B3527a86230L7017a322B17607b2161A80761a68607f9842j15495
19370a85337L7052J4227l341D9146c4649F3448g8054D0326K1053h7765o6549E0962
19357B71751j30718a42571j37347m957C62628A941K01913a68175A00820a77617
19346I6112D3085J21023b15495D2886b38095A51582g9231A0186a76739C2373K8278
19335F0651O7668L4532a66889o8457P9634g4087j62652H1439N2150a34815A62020
19323i5646A75388K67516B0806C579a56117A98757c8354j13432A16368g0288a8457
$$ y = [-298895, 70488, 128664, -66120, 314300, -156551, -169281, 47071, -175696, -163960, -151378, 167247, 11566, -212390, -159365, -75468, -151342, -201368, 27599, 14693, -73198, -210510, 172092, 180522, -214572, 23527, -186230, -149213, -1322, 217607, -22161, 180761, -168607, -69842, -185337, -148285, -134058, -137399, 49146, -34649, 63448, -78054, 40326, 61379, -87765, -154314, 50962, 271751, 141033, -142571, -279918, -284875, 362628, 1941, 203854, -168175, 100820, -177617, 96112, 43085, 164108, -215495, 42886, -238095, 151582, -79231, 10186, -176739, 32373, 60651, 128319, 162851, -166889, -235346, -155712, -74087, -236739, 81439, 133589, -134815, 162020, -95646, 175388, 442904, 20806, 3579, -156117, 198757, -38354, -151786, 116368, -70288, -18457]
19311a16819m80996A3491J59172a99033O7224k00845J35591b4918A43949a56034
19300h1532C8817b61709J02991K2812C011h9370k6049a9082A2159L7830b29671
19288b22184E1109J70419A03545c9907k13081R7449r134I1166a53366k31571a02056
19276a77118k23495C908K24263I6183a05857A12672N5052a89203B8050d86007
19265b04478B0991K6095J76977c96727h0994l1172j88231a05562e0143r2731R07
19254a41967L1705A059L64694A56179C8533M9102i3148L1l6359C30546B6734a33704
19241a03590j88983J45915O0779m6990d7341a2016k40434A48905g2704l3012j80588
19230b86304N9228i3416A06907d6090k2012c30l01591P9301M8557j86057M8445
$$ y = [-116819, -597815, 13491, 172663, -199033, -131809, -332654, -197063, -24918, 143949, -156034, -81532, 38817, -261709, -158718, -135906, 3011, -89370, -115419, -19082, 12159, 49989, -229671, -222184, 51109, 221528, 103545, -39907, -252988, -155539, -164673, 91166, -153366, -384937, -102056, -177118, -400613, 3908, 228171, 96183, -105857, 112672, 167724, -189203, 28050, -486007, -204478, 20991, 47086, 224063, -396727, -80994, -112166, -300397, -105562, -50143, -142874, -141967, -110262, 1059, 365753, 156179, 38533, 87635, -93148, -93117, -129476, 330546, 26734, -133704, -103590, -292573, -146658, -85879, -132869, -47341, -12016, -252450, 148905, -72704, -105716, -286304, -227076, -93416, 106907, -46090, -68102, -330, -301921, -222620, -174063, -360120, -311675]
19219c11675a31530m0987D0243j0045K12482b92716a3683F5142i5726A27823d603
19207a76186N3714m9988a0965p7614r4951A03729a25396m3741j95152e1057C2323
19195b43404b034o144n39684A56711f8621D2962e3381D7267b56523d4507o4135
19184a08642q2219c8484j92024C638a53654F2803b79875d4666A27984n9374b10459
19172D3881b31934A0129a92609h5869M1982G2243A6168b11786B10234b1583m7636
19161f9219n5700K1629A7594M4330R9023m6664a42591k0131p41D7767f101l47890
19149c53991C1954J95634i33m94856a90609m3691J07685l61575a36716j11651
19139b48367B58998d0200j93557j1418j46977K8860A04747c83250g8549D4018
$$ y = [-311675, -131530, -172517, 40243, 30198, 242680, -292716, -13683, 65142, -95726, 127823, -4603, -176186, -122472, -172460, -10965, -88579, -183530, 103729, -125396, -169137, -364289, -51057, 32323, -243404, -2034, -8178, -547862, 156711, -68621, 42962, -53381, 47267, -256523, -44507, -108642, -190861, -38484, -230508, 3638, -153654, 62803, -279875, -44666, 127984, 68610, -210459, 43881, -231934, 10129, -192609, -85869, -43887, 72243, 16168, -211786, 210234, -21583, -69219, -124919, -103290, 17594, 61924, 160947, 114283, -142591, -162722, -163463, 47767, -6101, -353991, 31954, 227588, -933, -495789, -190609, -234300, -126615, -488190, -136716, -248367, 258998, -40200, -233757, -245175, -392152, -363292, 104747, -383250, -78549, 44018]
19128i1436F3253j3236a639E0130c35231E7635j9348K75800a62564g5148A97150
19116b00973g9746j23944B90609d6543j2771k05942C1858k393K45528b37563F3080
19104e4636I975f3250n32831E9386j5763i7741l61397J68839D268h5036F9149
19092G0119d7837k2598k8730p6386g3959j50183h5023B9784a54929i578j09430
19081a19008c0630j55492M1803F5386c95676B29487a08096a797H3259O9087b7148
19069a25491b5486d807E274a5081r3016n6216A47894a55937A81966K62390a31161
19057h7944C8698J79364m8663a35805p556f9305l1181J8669B15877b62701d532
19045b86000a19234Q651R976m6729B3815J0015L7471h1562m2757A10019C7560
$$ y = [-91436, 63253, 50017, -1639, 50130, -335231, 57635, 38287, 314087, -162564, -75148, 197150, -200973, -79746, -203690, 290609, -46543, -59314, -265256, 31858, 29465, 274993, -237563, 63080, -54636, 9975, -63250, -596081, 59386, 43623, -97741, -459138, -290299, 4268, -85036, 69149, 70119, -47837, -70435, -99165, -175551, -73959, -224142, -85023, 29784, -154929, -9578, -119008, -30630, -186122, -144319, 65386, -395676, 229487, -108096, -1797, 83259, 152346, -27148, -125491, -25486, -4807, 5274, -15081, -108097, -164313, 147894, -155937, 181966, 444356, -131161, -87944, 38698, 218062, 169399, -135805, -143361, -69305, -100486, -81817, 215877, -262701, -4532, -286000, -119234, -110583, -100607, -147336, 23815, 33830, 71301, -81562, -124319, 110019, 37560]
19033B1010f3204r4835A24409J60815a36916L9702j6642j5536h21B36402e58456
19021a96221C9428i3010A6524a16862C21076c3896A7779a4780A94604e8213p4182
19010a32395o1118A86696K9952b29358c5677j0417B05984e757j25019A30823a3804
18998a36028p3957H671K380L7894b1535j70343k4541A42866a2126F7332a38109
18986i0423o4517J2325m7103B73972f6580A39785e2329l4013q002J3487H9550
18974b05670M254A21062L37673E8164K86440n215b7946l4772j50813c6843j23650
18963a60493l1523A8284e1798k87420a09395j99016a09173p2757F5001c38925
18952a63673G962a47511j13275a12415k15902b1249k79600A40257a57529B68554
$$ y = [21010, -63204, -158039, 124409, 285224, -136916, -97214, -113856, -129392, -821, 236402, -558456, -196221, 39428, -93010, 16524, -116862, 321076, -33896, 17779, -14780, 194604, -58213, -132395, -193513, 186696, 216648, -229358, -35677, -46094, 205984, -5757, -130776, 130823, -13804, -136028, -209985, 8671, 11051, 48945, -21535, -191878, -216419, 142866, -12126, 67332, -138109, -90423, -154940, -142615, -189718, 273972, -66580, 139785, -52329, -86342, -94344, -80857, 89550, -205670, -201416, 121062, 458735, 58164, 344604, 339389, -27946, -62718, -213531, -36843, -160493, -192016, 18284, -51798, -339218, -109395, -308411, -109173, -181930, 65001, -338925, -163673, 7962, -147511, -260786, -112415, -328317, -21249, -300849, 140257, -157529, 268554]
18941a00779E9877M3285A5493O5471A6247f1236A62906a14380e2839a193A11273
18929d8970j57747A00914K4240b65466M203A61130J36230b20154h6371n4243D4072
18917c90651C69628a35456j60688R6570B0964J38153a2390B20218k0369M21200
18907F21049l02255b77297B8542O3574l9593N3228k5351A9437b40832m0226e5008
18895A90315H9222L579h1387j75550G8091a08890j59315a12886A00200e1800D1900
18883b77219A8164b30370A28079a12618A7807K7715b58009J00844l2723d8840
18872D28620a83554A56591b3577a527A38642o0994a19397p9492A87804a06892
18861A69082o9215a04571Q41D1147i2416d5295q7505D6417M0379e3259l80444
$$ y = [-100779, 59877, 103162, 15493, 80964, 16247, -61236, 162906, -114380, -52839, -1193, 111273, -48970, -206717, 100914, 125154, -265466, -261263, 161130, 297360, -220154, -86371, -140614, 44072, -390651, 369628, -135456, -296144, -199574, 20964, 159117, -12390, 220218, 199849, 621049, 318794, -277297, 28542, 92116, 52523, 105751, 80400, 19437, -240832, -281058, -55008, 190315, 89222, 92801, -81387, -256937, 78091, -108890, -268205, -112886, 100200, -51800, 41900, -277219, 18164, -230370, 128079, -112618, 17807, 45522, -258009, -157165, -189888, -48840, 428620, -183554, 156591, -23577, -1527, 138642, 77648, -119397, -198889, 187804, -106892, 169082, 99867, -104571, -103730, 41147, -92416, -45295, -132800, 46417, 86796, -53259, -433703]
18850d33703a77123d0637B83128J67464A05130J55160C0641B799N1633d70558
18839A77499J6709a68247A02889a83579g734l1524A07276d17324f2108D9284b7651
18827b3923o5366F6615K42733b07236g5659G4246a59557I4715K7223c42937I6172
18815b10002l5716A9654d0448k04336C777n63J26558o3289k0766J70683a06731
18803h1305j38033j691A35353K5430a50103o2987C0238B051L3890a64658J7811
18792a46847O9902k49372O466d8790I9883C2468c05839b0895l7341k48521l6872
18781c43629J35692a027j97014f3119J8418A93049H1562J11049o2257b35824P4569
18770a61255j1310l8231a05385k34734J47589I0737J00310b04640A16587b47419
$$ y = [-433703, -177123, -40637, 283128, 450592, 105130, 260290, 30641, 2799, 54432, -470558, 177499, 194208, -168247, 102889, -183579, -7734, -39258, 107276, -417324, -62108, 49284, -27651, -23923, -89289, 66615, 309348, -207236, -75659, 74246, -159557, 94715, 121938, -342937, 96172, -210002, -245718, 19654, -40448, -244784, 3777, 3214, 129772, 66483, 45717, 216400, -106731, -81305, -219338, -221029, 135353, 160783, -150103, -213090, 30238, 2051, 35941, -164658, -146847, -76945, -326317, -319851, -48790, 99883, 32468, -305839, -20895, -58236, -306757, -343629, -207937, -1027, -198041, -63119, -44701, 193049, 81562, 192611, 130354, -235824, -161255, -172565, -210796, -105385, -340119, -192530, 90737, 191047, -204640, 116587, -247419]
18759G9301h9411q4437e3105J5815l48232I7695J72150a20579A94063D6013i296
18747D4829a29669L8011M1963j59118B40100O6610I9200a9956j74627j14357E575
18735c09153a33856N998I0396i5267B09999c92027A30547k812Q5359C0186b52828
18723c16648O7210O1978C968L4899J19502i1935j0772o0670M9850j25422l2656
18712b71605b3206F0416d59082e915o9219J4014o3990J6719B11172a56513A17867
18700a26974p1417A8699a32462G2495c10253d9522d321k11596j95696a52884j25710
18689b78594A06656J32147j01756c5376j56897h7106B2682K3059J64765G3356
18678a29773j57019C6615b74362L8679Q0456g4436L3873j09027E286J02690L2088
$$ y = [79301, -89411, -173848, -53105, -37290, -385522, 97695, 269845, -120579, 194063, 46013, -9296, 44829, -129669, -91658, -49695, -208813, 240100, 306710, 99200, -19956, -194583, -308940, 5575, -309153, -133856, -127858, 90396, -95267, 209999, -392027, 130547, 127735, 213094, 30186, -252828, -316648, -249438, -187460, 3968, 38867, 158369, -91935, -102707, -163377, -113527, -238949, -271605, -23206, 60416, -459082, -5915, -75134, -61120, -125110, -108391, 211172, -156513, 117867, -126974, -198391, 18699, -132462, 72495, -310253, -49522, -4321, -215917, -411613, -152884, -278594, 106656, 238803, 137047, -35376, -192273, -87106, 22682, 45741, 210506, 73356, -129773, -286792, 36615, -274362, -235683, -155227, -74436, -40563, -149590, 5286, 107976, 140064]
18667A40064J97404a87295Q8195K2614a089G0525K5839b75062r6432e5281l7527
18656i2808j36739C7471a01700R47F856b17655N424A38549e8956I8400a01628
18644C45067g7904C01574a06159n7173B55065a80358F8560a63942d1954m062q8727
18633a34743A47602e0629J4088k2104j43086F1003a95727c9811m84012A79224
18622a91131A47100l2776a05178k9851E0654d91113a11145B64330a78667C8190
18611a37199A96328o2145e180q8354A01338c19239A63602b25723c4018k00300
18601b34318C7046e8680C4277b14932Q0670o9430O4561J9118j12294j14214C80771
18589A68047p4631f1412j75097R5052H9992J706h5899C1142b51624L6304J9972
$$ y = [140064, 337468, -187295, -99100, -76486, -1089, 70525, 96364, -275062, -371494, -55281, -92808, -229547, 37471, -101700, -100753, 6856, -217655, -212231, 138549, -58956, 98400, -101628, 345067, -77904, 301574, -106159, -163332, 255065, -180358, 68560, -163942, -41954, -46016, -134743, 147602, -50629, -36541, -58645, -201731, 61003, -195727, -39811, -523823, 179224, -191131, 147100, 114324, -105178, -135029, 50654, -491113, -111145, 264330, -178667, 38190, -137199, 196328, 134183, -5180, -93534, 101338, -319239, 163602, -225723, -34018, -234318, 37046, -58680, 34277, -214932, -134262, -203692, -139131, -120013, -232307, -346521, 380771, 168047, 93416, -61412, -236509, -141457, 89992, 91698, -85899, 31142, -251624, -215320, -195348]
18578a95348K3508o4502c9501A29317P7145J4199d11166a66404A19374a71202
18567H0292g4472E13225B1112a64210A72803i4553h710D0680K11840M8484i4499
18555a32804k1158L2406j29777J23067G9622c84538A27829b61355C7759a51906
18544c1171a3772o3874k36928J4865A48638e8298F4566c1119G4590c11418D58740
18532a86383f6348B17770a53177I0998b95880h7823L4778j77143A06704b07604
18521a56584a7629I4499i5942C763J00685a93942i021j69570E0188b31041O8365
18510a62676B7499G248b4403D8517J60938a61905r0952b7428A1365N571i608A00231
18497a213r3852k67989d785j63910r6237J20438f3800K203A00169K7L4476b49070
$$ y = [-195348, -171840, -236342, -39501, 129317, 206462, 220661, -411166, -166404, 119374, -171202, 80292, -74472, 513225, 21112, -164210, 172803, -94553, -8710, 40680, 252520, 301004, -94499, -132804, -153962, -121556, -251333, -128266, 79622, -384538, 127829, -261355, 37759, -151906, -31171, -13772, -77646, -314574, -299709, 148638, -58298, 64566, -31119, 74590, -311418, 458740, -186383, -66348, 217770, -153177, 90998, -295880, -87823, -53045, -230188, 106704, -207604, -156584, -17629, 94499, -95942, 3763, 104448, -193942, -9021, -178591, 50188, -231041, -162676, 27499, 7248, -24403, 48517, 209455, -161905, -252857, -27428, 11365, 16936, -9608, 100231, -1213, -95065, -363054, -4785, -168695, -264932, -144494, -63800, -61597, 100169, 100196, 134672, -249070]
18484b69202J5270B90962m7969I3053b3146J0435j75738B28711a72263i791A18021
18472d60845B85543e8557E352K19244b0647o0H2053J20812n9246l0355F224d0235
18459A19740q619l4923j7575P873P696r048c3888D7788R051a16856K8354E1071
18446b99003G2701f1722F0190j9144K17327h9491a8921k8375j5173A92670b946
18434g417F2189a51738E8937R6263J69004F0786I089a55985B6336f3126B30643
18422E4669K28789A21327c587E3431J0622J53540A8152a16698l42967J93716N1228
18411b14721A46565c7216A24516D6414O392J83715b92192O8210i474A07633a88967
18399A51847i9001p5931A1550a2474k71931J02682A5278O818a10179d7323p62
$$ y = [-269202, -253932, 290962, 242993, 93053, -23146, -12711, -188449, 228711, -172263, -9791, 118021, -460845, 285543, -58557, 5352, 224596, -20647, -20707, 82053, 202865, 143619, 113264, 6224, -40235, 119740, 111121, 76198, 58623, 66496, 74192, 65144, -33888, 47788, 56839, -116856, -88502, 51071, -299003, 72701, -61722, 60190, 41046, 258373, -89491, -18921, -47296, -62469, 192670, -2946, -7417, 62189, -151738, 58937, 155200, 324204, 60786, 9089, -155985, 26336, -63126, 230643, 54669, 283458, 121327, -3587, 53431, 64053, 217593, 18152, -116698, -459665, -265949, -214721, 146565, -37216, 124516, 46414, 52806, 236521, -292192, -223982, -9474, 107633, -188967, 151847, -99001, -174932, 11550, -12474, -284405, -181723, 15278, 22096, -110179, -47323, -48085]
18388d8085I605P8957g0317A15532a9901l4101A95623g5406a5207j96192h577
18376b67769i7354l23667A07976h6297l1373A38725e4833B9207J96456c78728
18365a97847M6564A25974b259o8012j27968A53022E030J61183F2269Q5238c08461
18353e9378B06718D9649a59896B72588A33920c52275a50479b4053A85588b5692
18342i8477e615H3220B6645g4335l33603D265L7036f6301j22912K5100B74211
18330e2908F3271B4106K46021e5813B90618b38337R8384l2799Q2046j43338f029
18318i6409k00405g1881H7195a13220n605D1452J6133B3518c63802B35728e8801
18306A4290i7870M4693F4409a10257D2176K60575H6702h0564a9493l5052j87152
$$ y = [-48085, 9605, 88562, -70317, 115532, -19901, -54002, 195623, -75406, -15207, -211399, -8577, -267769, -97354, -421021, 107976, -86297, -117670, 138725, -54833, 29207, 225663, -378728, -197847, -151283, 125974, -2259, -70271, -198239, 153022, 5030, 166213, 62269, 147507, -308461, -59378, 206718, 49649, -159896, 272588, 133920, -352275, -150479, -24053, 185588, -25692, -98477, -5615, 83220, 26645, -74335, -407938, 4265, 41301, -66301, -189213, -164113, 274211, -52908, 63271, 24106, 270127, -55813, 290618, -238337, -139953, -172752, -90706, -234044, -6029, -96409, -296814, -71881, 87195, -113220, -118825, 41452, 57585, 23518, -363802, 235728, -58801, 14290, -97870, -53177, 64409, -110257, 42176, 302751, 86702, -80564, -19493, -54545, -241697]
18295b41697B08926I1359a01071B7577a76768D6687f8007C7039p263K15194H6507
18283b72627P0525E5469c9011A51104b77269j9722H1100f6124j62689F5961b6617
18271a45270A02870a41949e0541k45353a04385A8086h9768B03145d4520k5407
18261f9927D63222p2756L2389e7606C05745c90518A34183A379J86538c64830J00941
18250b63889B41857b72763a054A99849g8616C3048J14327Q2044G5195m184h848
18238a92116a6690F4215p216k5045b24911f8666h721E7144d6579P688B2590K53202
18226B75792E6691A9199a24330e7284j66670N1319g3321j16539j57362f2190n12393
18215e74583a77540e4755K6034j78757C01407r7442D6822a72249k71649a24043
$$ y = [-241697, 208926, 91359, -101071, 27577, -176768, 46687, -68007, 37039, 29776, 244970, 86507, -272627, -202102, 55469, -39011, 151104, -277269, -296991, 81100, -66124, -228813, 65961, -26617, -145270, 102870, -141949, -50541, -295894, -104385, 18086, -89768, 203145, -44520, -69927, 463222, 390466, 422855, -57606, 305745, -390518, 134183, 1379, 187917, -364830, -263889, 241857, -272763, -1054, 199849, -78616, 33048, 147375, 229419, 75195, 71011, -8848, -192116, -16690, 64215, 56999, 31954, -224911, -68666, -8721, 57144, -46579, -38891, 22590, 275792, 56691, 19199, -124330, -57284, -223954, -172635, -73321, -189860, -347222, -62190, -574583, -177540, -54755, -28721, -207478, 301407, 203965, 46822, -172249, -443898, -124043]
18204g5780C35278c1358K844k97865C02025D1317c4233A07539Q9453k0238H6326
18192A37936J60079l8067c77745G500a58709f8980k60590E3380K0479A2094a86452
18180B65860M4017A54114Q447b2327A08489a06409b4899j61348A58726c59104
18169c50032b5002q3578D3698b97325a03044j71859j67964J82185A16375c93391
18158a30134o0082j43531A52c46948A87402g1193A97977b00809I8349K6449n0695
18147G4103b69222a9162B28682a44175Q327d9256A49739d1254B63398k3558J9815
18136B59655a4665F5048L9607A8638Q142a44991d1732C3451a57478P5271c9377
18124B05656A7432d4844n8452A28052j0289G204L55638A27468l9076b2975l1184
$$ y = [-75780, 335278, -31358, -28514, -326379, 302025, 41317, -34233, 107539, 196992, 176754, 86326, 137936, 298015, 259948, -377745, 7500, -158709, -68980, -329570, 53380, 73859, 12094, -186452, 265860, 309877, 154114, 162561, -22327, 108489, -106409, -24899, -186247, 158726, -359104, -350032, -25002, -108580, 43698, -297325, -103044, -274903, -442867, -260682, 116375, -393391, -130134, -190216, -333747, 152, -346948, 187402, -71193, 197977, -200809, 98349, 124798, 74103, -269222, -19162, 228682, -144175, -135848, -49256, 149739, -41254, 263398, 239840, 259655, -14665, 65048, 104655, 18638, 26780, -144991, -41732, 33451, -157478, -82207, -39377, 205656, 17432, -44844, -103296, 128052, 117763, 7204, 362842, 127468, 88392, -22975, -54159]
18113e4159C392a84208B8633b01685A28364b47125H8473l2830J00500G2298a87251
18101A69880o2180R4424Q775A3809a46147D4523a695D5156a29426m29726F4387
18089C34278b76463A31368b6264d894j94793P8610l67957C72586c42212j3294
18079c55506E7901i1165m03969A7262b4406j65415Q1015A16663a08512N1134A94073
18067A47977C2795a38864c4811j65956e8677j0221r4871p2203H5675C8361O5095
18056A03456E1064b69285A8884b02543D7716J0711K3876p863J0452a58703B64214
18044b6193m0231A024K1793h6784I3211L8449K50953b03705N5986j94658B48506
18032d0353H420c1811r3048o7852d5643j38622e711a317B56178D3712b02822A14278
$$ y = [-54159, 3392, -184208, 28633, -201685, 128364, -247125, 88473, 55643, 156143, 72298, -187251, 169880, 107700, 202124, 210899, 13809, -146147, 44523, -1695, 45156, -129426, -559152, 64387, 334278, -276463, 131368, -26264, -4894, -199687, -121077, -489034, 372586, -342212, -355506, 57901, -91165, -495134, 17262, -24406, -189821, -108806, 116663, -108512, -57378, 194073, 147977, 32795, -138864, -34811, -200767, -58677, -68898, -163769, -235972, 85675, 38361, 103456, 51064, -269285, 18884, -202543, 47716, 58427, 82303, 74440, 84892, -158703, 264214, -26193, -66424, 1024, 22817, -86784, 93211, 131660, 382613, -203705, -147719, -342377, 248506, -40353, 8420, -31811, -124859, -192711, -45643, -184265, -5711, -1317, 256178, 43712, -202822, 114278]
18019A59452m9242C4731a14111j01142C06210b95140A41351b36696B71775j4220
18009B57555b27458B53201J00601b12290A63324b36258a5487j56420B18765b318
17998a6619o0286A34325D3166d0510l2225A76823H0190h9692j72669C57459A09762
17986A01179K12518c82660d1093m4016A4146o146L2053J51213d2978A65072C1248
17974a33718B4915e9336k57819a6996j35359A72405K43821a09758Q233M1749A65987
17962d18721h9325A44712a0706I5841R8309a63814j66803B47732a29737n2248
17952a81985E965K41161b21141H0552J68787a40315B54189Q683b89422b3064G4552
17940B01295P870J38743a64890b4636k38731C2953a4509j41912d5973F1511e7250
$$ y = [159452, 110210, 34731, -114111, -215253, 306210, -295140, 141351, -236696, 271775, 257555, -227458, 253201, 353802, -212290, 163324, -236258, -15487, -171907, 218765, -2318, -16619, -76905, 134325, 43166, -40510, -72735, 176823, 80190, -89692, -262361, 357459, 109762, 101179, 313697, -382660, -41093, -85109, 14146, 8000, 40053, 191266, -42978, 165072, 31248, -133718, 24915, -59336, -317155, -16996, -152355, 172405, 416226, -109758, -101525, -59776, 165987, -418721, -89325, 144712, -10706, 95841, 194150, -163814, -330617, 247732, -129737, -181985, 5965, 247126, -221141, 80552, 249339, -140315, 254189, 262872, -289422, -23064, 74552, 201295, 209165, 347908, -164890, -24636, -263367, 32953, -14509, -156421, -45973, 61511, -57250]
17928d8154j03153N6054A99051m4593e2761B80743g4038H1690f528p734j18146
17917a32408j4002G3037G823O490N1081c0230h774A6381e3468G6364b2662B53376
17904h2543K8999A22470d5261j05832B69047D393a48484a364C23680E1898J01089
17893A52987B0866J39903A3821b43264A5256J65367f2392A80016a24364A0341
17882a81235F5227L8868K35331a90007d5508l7020c2994A68545a26499C47014
17871A01353k4131a70572F1760a43446A47846J3455a71429K3776D4424J79644
17861B24068J31904F7205a09104a7775o5620k09434A87558p3483b0350d159B2227
17849A06469g0355A50537b4353k2346A5257J37410h0365C6502j4338i3151b4482
$$ y = [-48154, -151307, -95253, 199051, 154458, -52761, 280743, -74038, 81690, -6528, -14262, -132408, -146410, 73037, 7823, 14313, 65394, -30230, -8774, 16381, -53468, 76364, -22662, 253376, -82543, -53544, 122470, -45261, -151093, 269047, 4393, -148484, -1364, 323680, 51898, 152987, 20866, 160769, 13821, -243264, 15256, 180623, -62392, 180016, -124364, 10341, -181235, 65227, 104095, 339426, -190007, -45508, -82528, -32994, 168545, -126499, 347014, 101353, 77222, -170572, 61760, -143446, 147846, 161301, -171429, -147653, 44424, 224068, 355972, 67205, -109104, -17775, -83395, -292829, 187558, 114075, -20350, -4159, 22227, 106469, -70355, 150537, -24353, -46699, 15257, 152667, -80365, 36502, 22164, -93151, -24482]
17837a5136A11015n608l1143j3518K55651i7487A57248p5696a19519A62649d24956
17825a70354D20521a8117j73731P247B9070K45578H019i9968b2295j05821A86278
17813A04984l205d5897j74529B33514j11652k7952e6390l7728A15644l2174J21960
17802B05430d781B14671B6352J09009a24911A92901h5957k66874c7781E2923e3007
17790g6647F0403b80889Q7920A74515a93561g8266B2082d08706A704L36768d9242
17778a4927B27324H7279a38215e4902C35846D5541M37757D1123R0110a05733E2684
17766I6712J52021a09334I3155f5704H8549L4911n2896j6091J20123M7073a24215
17754B75857c0198A42700h2382A31770a51372B0046J08281P4617I4707L7564b17240
$$ y = [-15136, 111015, 105407, 74264, 60746, 316397, -97487, 157248, 81552, -119519, 162649, -424956, -170354, 420521, -18117, -191848, -184601, 29070, 274648, 8019, -99968, -22295, -128116, 186278, 104984, 101779, -45897, -220426, 233514, 121862, 93910, -56390, -94118, 115644, 83470, 205430, -4781, 214671, 26352, 135361, -124911, 192901, -85957, -352831, -37781, 52923, -53007, -76647, 60403, -280889, -192969, 174515, -193561, -78266, 22082, -408706, 1704, 338472, -49242, -14927, 227324, 87279, -138215, -54902, 335846, 45541, 483298, 41123, 131233, -105733, 52684, 96712, 248733, -109334, 93155, -65704, 88549, 123460, 70564, 54473, 174596, 221669, -124215, 275857, -30198, 142700, -82382, 131770, -151372, 20046, 128327, 202944, 94707, 132271, -217240]
17742g7336b9751B8477a56041O8041B97151e767A09687f285l9957B06564q6818
17731A19746i3980A01539Q6808D3072K77118A53440K55362A92999a43093A02698
17720C05802n4949B040f768B39021k9747B4156J00840b9182A46545N8830H7084
17708c3504A52405R0451A17502Q1556l7056c3189B47789E7131f7523F7623l1465
17697C6158e3406G2668L22276A60703c32568A33410a82742A55271O6877b65823
17686I5807l7353K53073D0498f0703B09223h9558d1330A01868J045d3438J0519
17675c2919A96260j211b81959A87462C1584J43739b56528N6365j2542A6612M00767
17664D17379A29603E4315K9313J60019a37857c1570B88077g4120F2358g2365c6141
$$ y = [-77336, -29751, 28477, -156041, -88000, 297151, -5767, 109687, -6285, -46242, 206564, 119746, -93980, 101539, 188347, 43072, 320190, 153440, 408802, 192999, -143093, 102698, 305802, 250853, 2040, -6768, 239021, 209274, 24156, 124996, -29182, 146545, 205375, 87084, -33504, 152405, 242856, 117502, 199058, 162002, -33189, 247789, 57131, -67523, 67623, 36158, -53406, 72668, 394944, 160703, -332568, 133410, -182742, 155271, 222148, -265823, 95807, 58454, 311527, 40498, -60703, 209223, -89558, -41330, 101868, 102913, -43438, -32919, 196260, 195049, -281959, 187462, 31584, 175323, -256528, -200163, -212705, 16612, 417379, 129603, 54315, 83628, 243647, -137857, -31570, 288077, -74120, 62358, -72365, -36141]
17652B44578K25352A87107D4782L49539A18345P6937J98341C873e9365j40463
17642a99828j43160E87751B87935j22080c53289E49883D4306K35101A29744g0395
17631A86362a98568H3661J43759B0229K89460B2059O5039a50910B06185M589r3538
17620A17236H594a32452E8740J84583B2216K1228Q9500F4168g8310A12856b21506
17608B22965a72787C62643n6920e9905A72499h2691B57474B5784h6105C04778
17597E6488c50044f1014A87672G8039K7472Q3472C0389J33169r215o3481a15835
17585D0768Q0455a08211j64052A19530K21269q6339A01944c6593J3080j9646A46584
17573E4783K22383a34366D4155K57498A39178j1165n5855J46612q4537E2218J33243
$$ y = [244578, 469930, 187107, 44782, 394321, 118345, 195282, 393623, 3873, -59365, -199828, -342988, 587751, 287935, 165855, -353289, 549883, 44306, 279407, 129744, -70395, 186362, -198568, 83661, 227420, 20229, 309689, 22059, 87098, -150910, 206185, 210774, 117236, 8594, -132452, 58740, 243323, 22216, 43444, 132944, 64168, -78310, 112856, -221506, 222965, -172787, 362643, 305723, -59905, 172499, -82691, 257474, 25784, -86105, 304778, 56488, -350044, -61014, 187672, 78039, 105511, 188983, 30389, 163558, 154343, 90862, -115835, 40768, 121223, -108211, -272263, 119530, 340799, 254460, 101944, -36593, -23513, -43159, 146584, 54783, 277166, -134366, 44155, 301653, 139178, 128013, 72158, 218770, 134233, 52218, 185461]
17562A85461J29100P4068j37899A8916J64819Q4701b35086H1161K4646K35567
17552C41374j63752B9849K56190j29541E3929J05051a43871H3779K65964O4220
17542D13963A92433Q4756P2556D4004N947O4260A0276J52470M3279C537Q5223
17531H8760J59454e4336A15202J66741j27977M20829K56025O2746r1851J4431
17521H16146O3784C70154J30115A54979L8496J65897o9409L95026l04968L4406
17511D14427j3473L41394j22473q8012K32363j65692j75976a4130B62148K73437
17501E35585F8756K33340O6972E4448l433M18617B16366K48221j79951n3639N8866
17490B89863K05262j75910A15046J41293K4268J21178J0615j56769K42888E5079
$$ y = [185461, 314561, 388629, 250730, 18916, 183735, 268436, -235086, 81161, 105807, 341374, 177622, 29849, 286039, 156498, 53929, 158980, -143871, 83779, 349743, 413963, 192433, 277189, 349745, 44004, 49951, 114211, 10276, 162746, 206025, 3537, 88760, 248214, -54336, 115202, 281943, 153966, 574795, 830820, 893566, 801715, 816146, 879930, 370154, 500269, 154979, 193475, 359372, 289963, 684989, 380021, 414427, 400954, 742348, 619875, 531863, 764226, 598534, 422558, -14130, 262148, 535585, 68756, 302096, 369068, 54448, 51015, 469632, 216366, 464587, 284636, 230997, 289863, 495125, 319215, 115046, 256339, 280607, 401785, 412400, 255631, 498519, 55079]
17479b0864B16042B5707M07726o515j62860L6530K1336j13595A01067K85607A56149
17467E14253b1167C7565J89558J98606E4057J43996Q6744J25723A51422K68859
17457D20281A52552J62078j31141l5582L67024j59372J12470k9613j9095j85428
17447B33893m9948J87651j09435k2333K39307q0963H4893J75896l0017K7686K2544
17436B81002L74364B96109J13411j10237k0950D8182L11298l7904N1556p615b26299
17424D94268G5660J69745o1919M1120M2380B0908M82367A1479K26265p457K3518
17413B53805J05922f1284D19871r2858L7966j71560J10643K16680d6264D01579
17402B39183k6617J32855J19221B29336G172L45729b8233j07450D14113j51065
$$ y = [-20864, 216042, 25707, 433433, 426918, 264058, 300588, 321924, 208329, 101067, 386674, 156149, 514253, -21167, 37565, 227123, 425729, 54057, 198053, 284797, 410520, 151422, 420281, 152552, 314630, 183489, 147907, 514931, 355559, 468029, 438416, 419321, 233893, 183945, 371596, 262161, 239828, 479135, 398172, 84893, 260789, 230772, 258458, 281002, 655366, 296109, 409520, 299283, 278333, 48182, 359480, 321576, 373132, 365517, -226299, 494268, 75660, 245405, 183486, 224606, 266986, 20908, 503275, 11479, 237744, 230287, 253805, 359727, -61284, 419871, 327013, 364979, 193419, 304062, 520742, -46264, 401579, 239183, 212566, 345421, 464642, 229336, 7172, 352901, -28233, -135683, 414113, 263048]
17392B63048K8167o9714J01117j50197H4878k7098L35785A01432J83664a51657
17381A22423J61693g9795B14316H6813L82142k6984A66624A7144K81518A8352
17370a23856C59P0022J54326M8021l2770O6904m3501m0968F1295K77343I8670
17358A26364a3074B22817F3674J36972J28212A08756K64743A80097n458N4239
17348B28878p7911J19807Q0863B6761K6857M778K45862R9183j77014L75043j75972
17337D25498A17266J60389a879j3196D69435o3025A08788J09066J25506b31326
17326C61941j41726m7236M7487J0873M18678j59026H6734K13181A23431L71228
17316D94659B38722J1128m3639Q6498k1948l3740g6284D35038a1756A27639R8214
$$ y = [263048, 291215, 221501, 322618, 172421, 84878, 57780, 393565, 101432, 285096, -151657, 122423, 284116, -79795, 214316, 86813, 468955, 441971, 166624, 17144, 298662, 18352, -123856, 359, 70381, 224707, 272728, 239958, 306862, 263361, 222393, 61295, 338638, 98670, 126364, -13074, 222817, 63674, 200646, 328858, 108756, 373499, 180097, 174639, 228878, 150967, 270774, 351637, 26761, 53618, 58396, 304258, 403441, 226427, 601470, 425498, 117266, 277655, -1879, -15075, 469435, 406410, 108788, 217854, 343360, -231326, 361941, 220215, 172979, 220466, 231339, 650017, 490991, 86734, 299915, 123431, 494659, 238722, 249850, 206211, 292709, 270761, 237021, -76284, 435038, -11756, 127639, 225853]
17305B25853r6144j6145k0122a09802A79296P5268I7443J08331K12926I6775C1190
17293C88347A29677J09299O6116J80544C7813Q4237K46022n5234p1288a5515B34697
17281D37169h2180C94870j1683M3356P1045I3655j555J02590M92531f099D04713
17269C26542C1070J34646o3110M45919B45775I129J61385N6591J57988H6001J56608
17258B42609J22715A73785F1940N22276B20248J50321j71319E1419M09783k0374
17248D40828J76014B15395K27759j77234P8496j00480J37617G3321J70259k7937
17238B15643J65934k1177K2220j13339K12803B26662A5628K83222Q7407A30193
17227B40351J71236j93554N6791k9318J26015j281r7468p434J27640K2719P4894
$$ y = [225853, 129709, 113564, 93442, -109802, 179296, 254564, 97443, 205774, 418700, 96775, 31190, 388347, 129677, 238976, 305092, 485636, 37813, 122050, 368072, 312838, 241550, -15515, 234697, 437169, -82180, 394870, 383187, 426543, 497588, 93655, 92100, 194690, 687221, -6099, 404713, 326542, 31070, 165716, 102606, 548525, 245775, 9129, 170514, 227105, 385093, 86001, 242609, 365324, 173785, 61940, 584216, 220248, 370569, 199250, 51419, 461202, 440828, 616842, 215395, 443154, 265920, 344416, 243936, 381553, 73321, 243580, 215643, 381577, 360400, 382620, 269281, 482084, 226662, 15628, 298850, 386257, 130193, 240351, 411587, 218033, 274824, 245506, 371521, 370240, 272772, 265338, 392978, 415697, 490591]
17216D90591k34623A12213N19547r0681k52942j25149J06724j7557J89710J22155
17206E64020j97404K39141B30332K10882J7112k28999L41934A73472d7555G40669
17195F05231k28993n9240K83389k16307J06716q7331r3858j39775J42738J08941
17185D21511j3630j46106J83396M1812A52898L76135J07582p3599k56908J8981
17175C25089L73815i046C57602R0082J33022k29618K52827k43281j19235L21429
17165E62828r6628j34123J13590j81918J7707O4508p0648K43170j14566N262L11802
17154G20984B73828j31652P6568O327L36586Q7376k00262L44340k55273A83889
17143D88672N2824j47935m7695L3815J45481K21540j47244n8756o0028N4234Q7168
$$ y = [490591, 255968, 112213, 631760, 541079, 288137, 162988, 269712, 252155, 441865, 564020, 366616, 605757, 230332, 441214, 458326, 229327, 571261, 173472, -47555, 740669, 605231, 376238, 316998, 600387, 384080, 490796, 403465, 309607, 169832, 312570, 421511, 407881, 261775, 445171, 486983, 152898, 529033, 636615, 563016, 306108, 325089, 698904, -9046, 357602, 447684, 580706, 351088, 603915, 360634, 241399, 562828, 466200, 332077, 445667, 263749, 281456, 345964, 275316, 518486, 403920, 409182, 720984, 273828, 142176, 218744, 225071, 561657, 649033, 448771, 793111, 537838, 183889, 488672, 541496, 393561, 345866, 379681, 525162, 746702, 599458, 540702, 480674, 534908, 622076]
17132F22076j45053J46123j59241j73648L43040B62839L64220O1955j01580k07588
17122C79846P0231P3209O0307N8915J17196J265p8273m3347P7610l30255L95036
17111G81740j51444B77958K26021j17855J74370k16858J39957L66671j67975K0895
17101G03184j01849o6854l2136K87765j05641k22925K21330j87749q059Q5933
17091E72999K76796J7267O5315C72531L44176k92563L75496k46330K71662q4024
17081G40948K50219C87952L57287j30256K68061O4239l7562j91892R1165L0830
17071H39824l16358K4768p080J08390J73674l48726M29950K18079m80294J85423
17061H27650J12423k40128J07927O3978l65931K89486K4506J15804j61550J27964
$$ y = [622076, 477023, 623146, 463905, 290257, 633297, 262839, 627059, 689014, 587434, 379846, 450077, 523286, 583593, 642508, 759704, 760969, 682696, 639349, 716959, 386704, 781740, 630296, 277958, 503979, 386124, 560494, 343636, 483593, 850264, 682289, 703184, 601335, 534481, 502345, 790110, 684469, 461544, 682874, 495125, 487066, 572999, 849795, 867062, 932377, 372531, 716707, 424144, 799640, 553310, 824972, 740948, 991167, 387952, 745239, 614983, 883044, 947283, 909721, 717829, 808994, 839824, 523466, 548234, 541154, 649544, 823218, 474492, 904442, 1122521, 642227, 827650, 940073, 699945, 807872, 871850, 505919, 795405, 819911, 935715, 774165, 902129]
17051I02129j09147K27608j79220N7903P4987l09749N1482k5958K80025j60658
17041H09402q6954L25159k15899r4642M23504j58868k24683j9005J87418J9455
17031I64887L7046J24595J19436k90509Q8319j38335M9688k05281R6847k7893
17021H18800M22163m32870K22851k95741O7089K66377J45107j85461j73214L53411
17011A208512R0822k70987Q5850L8572k46644n3108J45681P8616L19885j98254
17001A198945R8331k37201r8322K56020k79888K61045P8201P30j93833R7906Q4637
16990A266571j27587R7794k16490M55569j23322q4504J88553j54695j08126j85221
16980A008542L5758K32033L22729l50590N3450K50077j48506j9640j58991K14260
$$ y = [902129, 792982, 1020590, 841370, 899273, 974260, 664511, 715993, 690035, 970060, 809402, 722448, 1047607, 831708, 737066, 1160570, 1001702, 777019, 758014, 945432, 964887, 1001933, 1126528, 1245964, 955455, 1043774, 905439, 955127, 749846, 846693, 818800, 1240963, 808093, 1030944, 735203, 802292, 1068669, 1213776, 1028315, 855101, 1208512, 1299334, 1028347, 1114197, 1152769, 906125, 853017, 998698, 1077314, 1397199, 1198945, 1297276, 1060075, 961753, 1217773, 937885, 1198930, 1277131, 1277861, 1084028, 1181934, 1266571, 1138984, 1236778, 1020288, 1475857, 1352535, 1268031, 1456584, 1301889, 1193763, 1008542, 1044300, 1276333, 1599062, 1248472, 1301922, 1551999, 1403493, 1383853, 1224862, 1439122]
16970A439122O6443j53748K75333J70523j26211J858j228j84033M247j54553K75761
16959A613514J51303k50573O325K02250k76766L54678J31926k61852J24576q5521
16949A709860r8055L89660n4778j35695J02064j17134K67167k52804K77035j51013
16939A936307j6251K72970m36771J81388l1017J27418k81973J08003J79937k72884
16929A767127P88124o53272J95933l8479J36861N3155L6876K11304j61684M8991
16919B384936M8355j12192j52978M72205l869p3371O3836k97006L86891r5264
16909B621543O2690J51604J15976j95474l58757M87771k43395M59115j1725k73923
16899B815425L18420l25322J65354j3755P5465L98025l30780j07272J36127J61823
$$ y = [1439122, 1505565, 1351817, 1627150, 1797673, 1671462, 1673320, 1672092, 1488059, 1492306, 1337753, 1613514, 1764817, 1514244, 1520569, 1722819, 1446053, 1800731, 1932657, 1670805, 1795381, 1709860, 1611805, 2001465, 1946687, 1810992, 1913056, 1795922, 2063089, 1810285, 2087320, 1936307, 1920056, 2193026, 1756255, 1937643, 1906626, 2034044, 1752071, 1860074, 2040011, 1767127, 2555251, 1901979, 2097912, 2059433, 2196294, 2249449, 2286325, 2497629, 2335945, 2384936, 2433291, 2321099, 2168121, 2640326, 2636457, 2563086, 2626922, 2329916, 2716807, 2621543, 2684233, 2835837, 2951813, 2756339, 2397582, 2885353, 2641958, 3101073, 3089348, 2815425, 3133845, 2808523, 2973877, 2960122, 3035587, 3433612, 3102832, 2995560, 3131687, 3293510]
16889C293510k5450K01155o0654l3416M05825m04531K46318M2332L120M8879J06440
16878C823528j49259J46954J65088K03799l74034M01285n9955K48810J20593R0718
16868D617527P826M305P8781j54719j5643L32228P1898J45017O9644N6640K6930
16857E240434k9386K80011m34373M75384j77154M03171n3762m7780K18126K78662
16847F153333N4923J03661K051K10842k9835j3217J54006L01666J33989K99265
16837G370684j99109K85996O3138O6416N30711j72449J44820J94687J08193O797
16827H399884N58378J57318q7363M46122k38594L92897k1893N26371q4768M56066
16817A0504418J29185J53682N00548j25169J99661M18267L34572J65247K19811
$$ y = [3293510, 3268060, 3469215, 3408561, 3375145, 3780970, 3376439, 3622757, 3665089, 3668209, 3717088, 3823528, 3674269, 3821223, 3986311, 4190110, 3816076, 4217361, 4157406, 4406216, 4526809, 4617527, 4625353, 4629658, 4708439, 4553720, 4538077, 4870305, 4942203, 5087220, 5156864, 5213504, 5240434, 5211048, 5491059, 5056686, 5532070, 5354916, 5758087, 5704325, 5656545, 5874671, 6153333, 6208256, 6311917, 6313968, 6524810, 6494975, 6481758, 6635764, 6937430, 7071419, 7370684, 7171575, 7457571, 7520709, 7587125, 8117836, 7945387, 8090207, 8284894, 8393087, 8399884, 8958262, 9115580, 9028217, 9474339, 9235745, 9628642, 9606749, 10133120, 10048352, 10504418, 10633603, 10787285, 11287833, 11162664, 11362325, 11780592, 12115164, 12280411, 12500222]
16808A2500222J63867P46350j11872M71169J80101M81266P74065j54091N77528
16799A5628605N13241R3016N32863J85359L89379M12770N61353M50431L30831
16790A9097848P35858N85426J81520R06277L51722O27786R17546J28849Q85167
16781B4417999O70682P47301Q50654M70963J100619M48680J004008P73893J167652
16772C1652451J166532N63764O88707J233849Q88466J187268J234818J342126
16764C9957981R82249J521620R13421J328090J743152J042055J513635J275630
16756E0277833J374466J590435J680874J190003J569089J494694J871438J211370
16748F2260202J688495J642040J435267J743004J068474J642359J506780J140105
$$ y = [12500222, 12664089, 13410439, 13298567, 13769736, 13949837, 14431103, 15205168, 15051077, 15628605, 16141846, 16234862, 16767725, 16953084, 17342463, 17755233, 18316586, 18767017, 19097848, 19833706, 20419132, 20600652, 21506929, 21858651, 22486437, 23403983, 23532832, 24417999, 25088681, 25835982, 26686636, 27157599, 28258218, 28706898, 29710906, 30484799, 31652451, 32818983, 33382747, 34071454, 35305303, 36193769, 37381037, 38615855, 39957981, 40940230, 42461850, 43375271, 44703361, 46446513, 47488568, 49002203, 50277833, 51652299, 53242734, 54923608, 56113611, 57682700, 59177394, 61048832, 62260202, 63948697, 65590737, 67026004, 68769008, 69837482, 71479841, 72986621, 74126726]
16740G4126726J475103J157902R07359J175483J013572Q47286O80702N88365M21752
16731H2394250l0045K08756k93639N35781l14568l15652p63565p58393o22533
16722H0040392r48404q07356j592985m65319j333802j271242j625384j208799
16714G0787101j552711j562881j578216j751843j424914j618131j474326j949491
16706E7874588r53635k045970j169494j335395j455118j754008j251746j085027
16698D6824195j746187j001085j470849q79267j563568r59928j200882r20022
16690C7082407j203922r73025q17404r75537r69844q58559o81069q43292r48017
16681B8811738n70336q90185j015535q09395l32855n64062o61743p24825o26419
$$ y = [74126726, 75601829, 76759731, 77667090, 78842573, 79856145, 80703431, 81384133, 81972498, 82394250, 82364205, 82572961, 82279322, 82815103, 82500535, 82184883, 81421318, 80662925, 80040392, 79091988, 78284632, 76691647, 76226328, 74892526, 73621284, 71995900, 70787101, 69234390, 67671509, 66093293, 64341450, 62916536, 61298405, 59824079, 57874588, 56920953, 54874983, 53705489, 52370094, 50914976, 49160968, 47909222, 46824195, 45078008, 44076923, 42606074, 41726807, 40163239, 39203311, 38002429, 37082407, 35878485, 34905460, 34088056, 33112519, 32142675, 31284116, 30603047, 29759755, 28811738, 28241402, 27351217, 26335682, 25526287, 25193432, 24629370, 23967627, 23242802, 22616383]
16672B2616383n84424o94603m23089m54673k58020q17273l69306m42911l35886
16663A8236198l17393l37969p93504j70591l19908k31969n44264j1627j95815
16654A5313158o07052l89715k73002k53419j71772o94898M8596l54913j39851
16645A2477132l95299J40999j89997n42384m48065j9201k87513r2759l16718P20
16635A0326915j0007l98431j94465j70939k1454l52784o0507j19448k51139m2574
16625H705167K68446m37689m77112K21267n27879R914j44946l7426j43822j67614
16615G268306o793J1729l1139j4982l02168n7792k07733l7824k21661P929M6953
16604F454825l61023k47320M2143J86894l13031J84288j3322j76735j45676k94072
$$ y = [22616383, 22031959, 21337356, 20914267, 20459594, 20201574, 19384301, 19014995, 18572084, 18236198, 17918805, 17580836, 16787332, 16616741, 16296833, 16064864, 15520600, 15508973, 15313158, 14706106, 14316391, 14043389, 13789970, 13618198, 12923300, 12971896, 12616983, 12477132, 12081833, 12222832, 12032835, 11490451, 11042386, 11023185, 10735672, 10642913, 10326195, 10326915, 10316908, 9918477, 9724012, 9553073, 9531619, 9178835, 9118328, 8998880, 8747741, 8705167, 8973613, 8535924, 8058812, 8280079, 7752200, 7762114, 7617168, 7579742, 7435920, 7268306, 7261513, 7273242, 7242103, 7227121, 6924953, 6867161, 6659428, 6621604, 6399943, 6407872, 6454825, 6093802, 5846482, 5888625, 6075519, 5762488, 5946776, 5933454, 5756719, 5611043, 5316971]
16594E316971L50377k91083m50207P6331J87879m7998j65735J48920k62363o812
16584D856280k65320J07088l6642K00389o98794K93938J85943j79927n0766N0958
16574D463147j74092J13506n38345J14639j43168K73132J76872m82711O6192K74713
16564D143885j25438k01291j66249m4333j20769M6499K9438J84168K05602o30694
16554C320818n275Q5099K35171j88387l00694k688J98162k21447K74554k90233
16544C105080j68452k09765M13363j12767j35924o7699L0464J00403j81265J47748
16534B921186k64373J07249j22354M81851k66961l68839J12404J56805k70205
16525B486763J45407r992q7283R4581j79216n6764n4857K71974k21421J86205
$$ y = [5316971, 5667348, 5376265, 4926058, 5002389, 5190268, 5142270, 4976535, 5125455, 4863092, 4856280, 4590960, 4698048, 4661406, 4861795, 4163001, 4456939, 4642882, 4462955, 4412189, 4463147, 4289055, 4402561, 3864216, 3978855, 3835687, 4108819, 4285691, 3802980, 3869172, 4143885, 4018447, 3817156, 3650907, 3606574, 3485805, 3532304, 3561742, 3745910, 3951512, 3320818, 3315543, 3400642, 3635813, 3447426, 3146732, 3144044, 3342206, 3120759, 3395313, 3105080, 2936628, 2726863, 3140226, 3027459, 2891535, 2823836, 2854300, 2954703, 2773438, 2921186, 2656813, 2764062, 2641708, 3123559, 2856598, 2487759, 2600163, 2756968, 2486763, 2632170, 2622178, 2534895, 2629476, 2450260, 2393496, 2338639, 2610613, 2389192, 2575397]
16515B575397m19779K18524j89549M8517m0132k2958n9818k3781J07462j39028
16505B054855j10139J35749j45982O3357N22823m49419K89297j16660l28731J61208
16495B076358J84672l6826k92764K20293K65611m94089K9339j07265J21335l29741
16485A636923K79090J91870j74389k90727P6883J04805J3145r0210M3330o9772
16475A720948J73487k54408N05678o40657Q8279N12566j23023k90692J58127k30030
16465A620275L30437k89918k1426j56465J22932K1117K44234q0591j1369l79846
16455A399380L31431l14234K91500k08352K52247m97015K46674L32860m58992
16446A375499k03003K58668R5224j8426k94597N23177k90127l0868J10790J7607
$$ y = [2575397, 2155618, 2374142, 2184593, 2233110, 2192978, 2170020, 2110202, 2086421, 2193883, 2054855, 1944716, 2080465, 1934483, 1997840, 2520663, 2071244, 2360541, 2243881, 1915150, 2076358, 2261030, 2224204, 1931440, 2151733, 2417344, 1923255, 1952594, 1845329, 1966664, 1636923, 1916013, 2107883, 1933494, 1642767, 1719650, 1824455, 1837600, 1747390, 1790720, 1720948, 1894435, 1640027, 2145705, 1505048, 1593327, 2105893, 1982870, 1692178, 1850305, 1620275, 1950712, 1660794, 1639368, 1482903, 1605835, 1626952, 1871186, 1790595, 1779226, 1399380, 1730811, 1416577, 1708077, 1499725, 1751972, 1254957, 1501631, 1834491, 1375499, 1172496, 1431164, 1526388, 1507962, 1213365, 1736542, 1446415, 1415547, 1526337, 1543944]
16436A543944m82130L47213K58545l42972J11573j09659N0735l3335j42140n75232
16426F26542N95484j29149K15386Q6080N2716l01015N00687l21009j86015L88534
16416A528241k57973o5420m4260p7346J76547L7373O84P3267K021k14971Q7015
16405A245178J96504k76474k15146L93161l14630J9989k5579n670L6451L19439
16395A373223j97766k26867R3081J66812j21117J5631p4091l69965K91546K48191
16385A198678j76142k54017J2669M33004k58098N4346l68527L90938k24622J52454
16375I60683n336L5820j31344L10213J13230p1220k32357k76983K07750j71356
16365G39100L21119k91613J91473k3800M3881k3499l54990J0884Q1440O40955
$$ y = [1543944, 1061814, 1409027, 1667572, 1324600, 1436173, 1326514, 1377249, 1343914, 1201774, 626542, 1222026, 1092877, 1308263, 1394343, 1447059, 1146044, 1646731, 1325722, 1139707, 1528241, 1270268, 1204848, 1160588, 1083242, 1259789, 1297162, 1297846, 1371113, 1373134, 1158163, 1245178, 1441682, 1165208, 950062, 1343223, 1028593, 1048582, 1023003, 1017333, 1053784, 1373223, 1175457, 948590, 1041671, 1208483, 1087366, 1102997, 1028906, 658941, 950487, 1198678, 1022536, 768519, 781188, 1214192, 956094, 1010440, 641913, 1032851, 808229, 960683, 955347, 991167, 859823, 1170036, 1283266, 1212046, 979689, 702706, 910456, 739100, 1060219, 768606, 960079, 936279, 980160, 956661, 601671, 612555, 693995, 1334950]
16355A334950n50558J75851l09893l055R1247L13041k07489K26484j84202q6756
16345G99620L7755K5157K72863k63452J47144j42937L05127m21953Q0340n2914
16335G86750Q0475J79860j34534l09843N29466D62693J75851L28563k69416K69088
16325I66779l13680J34118j18012l2063M97034l98525k30804o263L81633j66984
16315G13233j0147j82733M87753k11760R3515J2454n1280K02585k22636l580q1732
16304G45672k03026L27404m28919O59340D25635L00553J91903k53470B95529M54413
16294G49942P1209k34795J00896J65095k20935J6329K36664k80648J089J02127
16284G06973K10231j32357k66203k17523J7510Q2800K56116K2489M6965k83370
$$ y = [1334950, 784392, 960243, 650350, 647295, 738542, 1051583, 844094, 1070578, 886376, 799620, 837375, 862532, 1135395, 871943, 1019087, 876150, 1181277, 759324, 839664, 786750, 867225, 1047085, 912551, 602708, 1132174, 462693, 638544, 967107, 697691, 966779, 653099, 787217, 669205, 637142, 1134176, 735651, 504847, 498584, 880217, 713233, 703086, 520353, 1008106, 796346, 889861, 902315, 851035, 1053620, 830984, 827404, 745672, 542646, 870050, 441131, 1100471, 425635, 726188, 918091, 664621, 295529, 749942, 821151, 586356, 687252, 852347, 631412, 647741, 884405, 603757, 604846, 706973, 917204, 784847, 518644, 301121, 318631, 401431, 657547, 680036, 727001, 443631]
16274D43631J60921j14197M4988K44657j03810k48255J39893j91924M81669j37131
16264G20442K9230j67402K54801B97463L07757k3933j01944J28694K1070m4687
16254E84420J32725j83408L54667l69182j9419n5893J00275k4166r3253J82926
16244F09692j0969k80121M16672l53840K60997N6598k78321O3457k6606l2014
16234D25545J85479k29653Q0176Q0308p2914A83913K10759J69816B76869J62552
16224D39421R6838j07493j90286L34075j78812J8635J13267J05703k26218A64589
16213B58500J80025A25842N34713l20294M0400J94331P3636j97932Q4072K9975
16203E64743r3629J33942n1385R3088k69532F7499M27787k20647K07707o2758
$$ y = [443631, 604552, 490355, 535343, 780000, 676190, 427935, 567828, 375904, 857573, 720442, 749672, 582270, 837071, 297463, 605220, 581287, 479343, 608037, 629107, 584420, 717145, 533737, 888404, 519222, 499803, 443910, 544185, 520019, 426766, 609692, 598723, 318602, 735274, 381434, 642431, 699029, 420708, 484165, 457559, 425545, 611024, 381371, 461547, 541855, 468941, 183913, 394672, 564488, 276869, 439421, 536259, 428766, 238480, 572555, 393743, 412378, 525645, 631348, 405130, 164589, 258500, 438525, 125842, 660555, 340261, 380661, 574992, 648628, 450696, 534768, 564743, 471114, 605056, 553671, 646759, 377227, 67499, 495286, 274639, 482346, 419588]
16193D19588A10063O9230K92121J00414o0091o7387J61377A41453L05020j24167
16183C22306K03869A66595p3347J94674G5397M13569j65925j43385L56043k44450
16173B91249K6839L60067C37975n7802J05293j36914Q6887J90579k56444K27443
16163D97017j00087A81889K45730j67295K04507l0443r0417P048K11055j53025
16153D09049r7824o1625L4858H6060J04124M58268B43959M1181j08364K75538
16143D52314j10210c8838A25929a558C97676j29639J39139L0012B11167J09444
16133C20611R6466k3708p8301j34916b1409A74464F3586J38760K73135J7385l8338
16122D54528B3152J347Q8981K31066I3431K00366O4136B423K49000G9268c8205
$$ y = [419588, 110063, 179293, 471414, 571828, 511737, 444350, 605727, 141453, 446473, 322306, 526175, 166595, 93248, 287922, 75397, 488966, 323041, 179656, 535699, 291249, 318088, 678155, 337975, 280173, 385466, 248552, 335439, 526018, 269574, 497017, 396930, 181889, 427619, 260324, 464831, 434388, 343971, 351019, 562074, 409049, 311225, 249600, 284458, 86060, 190184, 648452, 243959, 285140, 176776, 452314, 342104, -38838, 125929, -1558, 397676, 268037, 407176, 437188, 211167, 320611, 417077, 393369, 315068, 180152, -21409, 174464, 63586, 202346, 475481, 492866, 454528, 23152, 24499, 113480, 344546, 93431, 293797, 357933, 2423, 251423, 79268, -38205]
16110B00120J28772A32910J81904A06911Q1231J86326A52384j1554R652K74422
16100D24904A97138L7405J57634j78302J80922q6933o0746J75507c0515A82932
16089A19018R6333E6246g3791D0811J13905C6027L53991D0782M35048J22254k87556
16078C10528r7394O1081o3655N276c1823A76914K25001j42335j29349K13038j28680
16067B14589a4644A30751K77717i89B97297A24426c8712B56087G1935J86578J68052
16056D26565A98239N133a42748A97095M1443Q1399C3217K18627N8094r6989E9539
16044B39024M2888N2993m0772J86375j82531a78449C5209c3962C42552F7108K61213
16033C28321D3390J4675A2623a17340F1101L5239J16457J42688a9713j22517B05565
$$ y = [200120, 328892, 132910, 314814, 106911, 188142, 374468, 152384, 140830, 150482, 424904, 197138, 234543, 392177, 213875, 394797, 307864, 247118, 422625, -30515, 182932, 119018, 215351, 56246, -73791, 40811, 154716, 36027, 390018, 40782, 475830, 598084, 310528, 213134, 274215, 210560, 215836, -31823, 176914, 401915, 259580, 130231, 343269, 214589, -14644, 130751, 408468, -989, 297297, 124426, -38712, 256087, 71935, 258513, 426565, 198239, 203372, -142748, 197095, 238538, 319937, 33217, 251844, 309938, 212949, 59539, 239024, 281912, 334905, 294133, 480508, 297977, -178449, 35209, -33962, 342552, 67108, 328321, 43390, 58065, 12623, -117340, 61101, 96340, 212797, 355485, -19713, -142230, 205565]
16021C62357a53870B74820P5898E3872K17853p793b3467A45571K0165h0904I8450
16009C19305A2775a12744A15142m6923F807J97436i3859C2646K28534b22879A08751
15997A40878F3554e2651A970J40879K4545O0558c6371C56515j15738J40604M06135
15986G87516l4159Q107J71350k56676k97756C5793M4432J94338a52121j10684
15976b62805C86419c9957A39199O2585D9634j443a88895M7859A56337K1397d7216
15964A52949p2093O7023i2577A47931R1778a98452a5083k0362C31469A25738m7985
15953G7753G383P2403l0553J19075K3489b5387r3809q0102G3654b2131O268D3803
15940c3272B41725o8412J03436D631J31440a1120A17377d8521b2199A10232J56545
$$ y = [362357, -153870, 274820, 350718, 53872, 271725, 263932, -23467, 145571, 165736, -80904, 98450, 319305, 12775, -112744, 115142, 68219, 6807, 204243, -93859, 32646, 261180, -222879, 108751, 140878, 63554, -52651, 1970, 142849, 167394, 227952, -36371, 356515, 240777, 381381, 787516, 753357, 761464, 932814, 676138, 378382, 35793, 80225, 274563, -152121, -262805, 386419, -39957, 139199, 201784, 49634, 48191, -188895, -141036, 156337, 177734, -47216, 152949, 80856, 147879, -92577, 147931, 239709, -198452, -15083, -35445, 331469, 125738, 77753, 7383, 79786, 49233, 168308, 191797, -25387, -119196, -199298, 73654, -22131, -15863, 43803, -33272, 241725, 173313, 276749, 4631, 136071, -11120, 117377, -48521, -22199, 110232, 266777]
15929B66777b55553J25348B25576h0860A8941b31076A56677g8793D8604a45749
15918B03675a52505B88664A30669e3808C061f9151D8767J24761F1741b62190f9705
15906a55249N2570J9860C68415c65588J62812O5129r9542A2809a38843F55J94118
15895A94773J8392a3845p7970B06038J60717j71695N6305d33491A59778B7294
15884i7177B43371c4411j14785n8818Q0102A98751G4938L8423P199b19571L0445
15873a89126H8220P7053J65049j01759G8046j4813J50068f6919K7860B9926a64289
15861f6436D4100K99278j64838Q8493F1850k2816b33615J2747C4358j6326K26163
15850B44195j08476a80175C04856f9275c2134j33904Q2696l973A20027N4520K30008
$$ y = [266777, -255553, -130205, 225576, -80860, 18941, -231076, 156677, -78793, 48604, -145749, 203675, -152505, 288664, 130669, -53808, 3061, -69151, 48767, 173528, 61741, -262190, -69705, -155249, -102679, -82819, 368415, -365588, -202776, -137647, -237189, 12809, -138843, 655, 194773, 213165, -13845, -91815, 206038, 366755, 195060, 251365, -433491, 159778, 27294, -97177, 243371, -34411, -149196, -208014, -127912, 198751, 74938, 113361, 120560, -219571, -189126, 88220, 165273, 330322, 228563, 78046, 63233, 213301, -66919, -39059, 29926, -164289, -66436, 44100, 343378, 178540, 267033, 61850, 39034, -233615, -220868, 34358, 18032, 244195, 135719, -180175, 304856, -69275, -32134, -166038, -83342, -87315, 120027, 174547, 404555]
15839D04555A59714c1320r248H0278J09151a14651K7962d0302A18541a03410d4532
15827c6425B52292a1036o567j71519e8087i270n873A68107j5564a81758K8245
15816a53513j1409C93430a71096A60231b88423B11411a95147j07368A34762o3337
15806G1425e1831b1815k60535D0009J28568a71728A20068d2307j10145c9595l2027
15795g1622A6544J28722d1735B08940a67079A95708c7198j9384A64479a62068
15784a57620N1365b2365q9983A27470M8723A8918r136c3318C0943b0793D4318
15772B60432k3042a4324n0284j19097A03809f4583l2728B77101B7602a95040A66422
15760B2577g8666C7985K97252d1998A89410e7116q8463j96989A73652q5476J34611
$$ y = [404555, 159714, -31320, -40568, 80278, 189429, -114651, -86689, -40302, 118541, -103410, -44532, -36425, 252292, -11036, -17603, -189122, -58087, -9270, -15143, 168107, 152543, -181758, -153513, -164922, 393430, -171096, 160231, -288423, 211411, -195147, -302515, 134762, 71425, -51831, -21815, -282350, 40009, 168577, -171728, 120068, -42307, -152452, -39595, -71622, 16544, 145266, -41735, 208940, -167079, 195708, -37198, -56582, 164479, -162068, -157620, -106255, -22365, -112348, 127470, 176193, 18918, 9782, -33318, 30943, -20793, 44318, 260432, 237390, -14324, -64608, -183705, 103809, -64583, -97311, 277101, 27602, -195040, 166422, 22577, -78666, 37985, 335237, -41998, 189410, -57116, -145579, -342568, 173652, 88176, 222787]
15749B22787E7554b0529D4821a77836J0326B49602G704P2683e3183K0727G7062
15737a38262k07797C3263c6508A30291D7618c9905j15216j18130a24349A34601
15726b8050E907d14561f1899j3903k4881o8354j42741D4616J32571D2396J5591
15715E7987k2537M4859N9465n7763d0362B06987b0365o2066j8281k057k56711
15704c59480D4188O1327g2471k8757D6126b72867O2723G4773b92552c8757A09373
15692A64691f6253A40745J09480f1488C3504M8486B8573A2650b09853Q7484l3819
15681a56188l7124A9383a12593H4185a38657j86682A6743a45040b2736B10940
15670A39923A7701a25895G2491k7058B1004b3635B20682r1539J18726p8698k5707
$$ y = [222787, 57554, -20529, 44821, -177836, -167510, 249602, 7704, 80387, -53183, -32456, 77062, -138262, -346059, 33263, -36508, 130291, 47618, -39905, -155121, -273251, -124349, 134601, -28050, 5907, -414561, -61899, -75802, -100683, -169037, -311778, 44616, 177187, 42396, 57987, 35450, 80309, 139774, 82011, -40362, 206987, -20365, -82431, -100712, -102769, -359480, 44188, 105515, -72471, -101228, 46126, -272867, -210144, 74773, -292552, -38757, 109373, 164691, -66253, 140745, 250225, -61488, 33504, 81990, 28573, 12650, -209853, -122369, -156188, -193312, 19383, -112593, 84185, -138657, -325339, 16743, -145040, -22736, 210940, 139923, 17701, -125895, 72491, 45433, 21004, -23635, 220682, 129143, 247869, 169171, 143464]
15659A43464a80751M4072J9815e6198p6366I7535b0022j55214B03774D5856a56609
15647B13888c2259C3286K32204f8381G4657P0296c35295a40073j31053M4525a0745
15635A98664d41116A03876C369L9305J8268b22009I9818N9052F6144K7410D5054
15623A01924B5041b15461h7881B54548r4528h5333l2706r886E282J45642a47351
15611i146j15045N3187A05581M6749a0718l5169k7915B61551a28966F8001C90
15599b17385D5423K3478b68807B84542B7104P5798K29578a43869j90539K0606
15589c13802B49469d1856J6020j36142j04388a3686j06558b9055a0946j13232
15579a24178F3135b20439h8984B7399b33407L037A50011a98981A0864J68302g5065
$$ y = [143464, -180751, -136679, -116864, -56198, -132564, 97535, -20022, -175236, 203774, 45856, -156609, 213888, -32259, 33286, 265490, -68381, 74657, 144953, -335295, -140073, -271126, -226601, -10745, 198664, -441116, 103876, 3369, 42674, 60942, -222009, 99818, 158870, 66144, 93554, 45054, 101924, 25041, -215461, -87881, 254548, 160020, -85333, -118039, -127925, 5282, 150924, -147351, -9146, -124191, -71004, 105581, 152330, -10718, -45887, -73802, 261551, -128966, 68001, 390, -217385, 45423, 68901, -268807, 284542, 27104, 102902, 332480, -143869, -334408, -313802, 249469, -41856, -25836, -161978, -266366, -13686, -120244, -29055, -10946, -124178, 63135, -220439, -88984, 27399, -233407, -230370, 150011, -198981, 10864, 179166, -75065]
15567C9286J81480b33489q6907B9968a78332f587A07858A1290a02185D661d9163
15555e6806A91665e3340p525k71001a49397q464d009C8642b31256g44p1106B78435
15542c85572a67093A66062J00296D0885J24139p3693K00787b11966M7098Q1980
15532h2888j03352m656A8460h9096n1171B92423N0911A0591h8028A36870e4657
15520A88818M28323j91062c52064B08332i6102B32686K2621g7640B12814K28102
15510D40916a09226l5866B24989a63670B61727a54543f0137I2756a00555H5868
15499A52194r480a37831I4693b4293A38482b99184C5555J9001J56919I0352h2629
15487i972p4030p2974I6470b0986A13247n3780O3586B5722M759f005E46411j86009
$$ y = [39286, 220766, -233489, -320396, 29968, -178332, -6587, 107858, 11290, -102185, 4661, -49163, -56806, 191665, -53340, -60865, -331866, -149397, -157861, -4009, 38642, -231256, -744, -71850, 278435, -385572, -167093, 166062, 266358, 40885, 165024, 91331, 292118, -211966, -164868, -82888, -186240, -190896, 18460, -89096, -140267, 292423, 343334, 10591, -88028, 136870, -54657, 188818, 617141, 426079, -352064, 208332, -96102, 232686, 255307, -77640, 212814, 440916, -109226, -145092, 224989, -163670, 261727, -154543, -60137, 92756, -100555, 85868, 152194, 142714, -137831, 94693, -24293, 138482, -299184, 35555, 54556, 211475, 90352, -82629, -9972, -84002, -156976, 96470, -20986, 113247, 59467, 123053, 25722, 30481, -6005, 546411, 360402]
15475C60402L23534l02031Q2682A87099K14477A80696B7915J77193l4245d7891
15464a12008j62466g4500A52732d5902A93924a44138A59299J26062D1759L03557
15454C45316a6391j96075f9107A72726b61585b8258A51126C0591K02640M02426
15444F35657k5961k83732M55731J38894m24054k44945A10708b87282B13725l567
15434B10158a0383L79j18365j06687A00727j8154j7603c6491A20033i2874c973
15422a01148b4031j32758j35221F4454J37396b05106C39710d9701o5755M0935
15412g4521n5827A46322K5084A9766hA01570l272J9275D4627i6863G8253d12422
15399d30B26346m0649G4750O4429J78433a05057l6721F4135k2279c02717B08414
$$ y = [360402, 683936, 381905, 464587, 187099, 401576, 180696, 27915, 205108, 170863, -47891, -112008, -274474, -74500, 152732, -45902, 193924, -144138, 159299, 285361, 41759, 345316, -16391, -212466, -69107, 172726, -261585, -28258, 151126, 30591, 233231, 635657, 609696, 325964, 781695, 920589, 496535, 251590, 110708, -287282, 213725, 210158, -10383, -10004, -128369, -235056, 100727, 82573, 64970, -36491, 120033, -92874, -3973, -101148, -24031, -156789, -292010, 64454, 201850, -205106, 339710, -49701, -115456, -74521, -130348, 146322, 171406, 19766, -8, 101570, 98298, 117573, 44627, -96863, 78253, -412422, -430, 226346, 185697, 74750, 139179, 317612, -105057, -141778, 64135, 41856, -302717, 208414]
15387B71085a67124A19039K349J74583j41773a51509P0678H3894j8494N6184J89625
15376C11209A6784i242C29449b71234C00576j18095p048R0619j06267a57280B88670
15364B08272a12734c1149B10949P351m4317L0435j2656D0107K9443N2948a04121
15352C56880A02468N7482L46467H1407d4869k34839e5928A3023J22495K21826
15342C57344q2501K20500j80633m156F1732d22989D04602a97378C1571L1700A0283
15330F4265J34914K24832a47277C95473G2883g4835B49233A12833k2369L84154
15320D74618k23991A10913O0891a25582D71525j94984a7564l02819D37007e6779
15309D9319K42710q8193h4034B96688a29289B41332b51653B41105j14687b65220
$$ y = [271085, -167124, 119039, 121388, 295971, 154198, -151509, -80831, 83894, 65400, 121584, 311209, 16784, -9242, 329449, -271234, 300576, 182481, 175433, 266052, 159785, -157280, 288670, 208272, -112734, -31149, 210949, 218300, 173983, 204418, 191762, 40107, 69550, 122498, -104121, 356880, 102468, 159950, 506417, 81407, -44869, -279708, -55928, 13023, 135518, 357344, 274843, 495343, 314710, 310554, 61732, -422989, 404602, -197378, 31571, 63271, 10283, 64265, 199179, 424011, -147277, 395473, 72883, -74835, 249233, 112833, 90464, 474618, 250627, 110913, 171804, -125582, 471525, 276541, -17564, -320383, 437007, -56779, 49319, 292029, 203836, -84034, 296688, -129289, 241332, -251653, 241105, 126418, -265220]
15298b9317c054A81216D2709h9422E863a65496C2967J47679M5188b12769A73194
15286C367J27005a22312j77050Q5499K9589G3430c6185k00737B78732j17576a2347
15274c1318A89234b49532h3960l355A62175f9339e89j86565j1957B61465F971
15262C7224d7654j78088Q4446B18047a38181B00660N3206a63019I7262J12690
15252B09952a5385E5799O7331L18576g193k83947B84827N89434J11308N99855
15242A585424n00608L24553j7377o34054C00062h7750E59526k68799l7387a1968
15231b85425B17212G7997O03a26141j47679A25728b11289B9616L1318a59820B58348
15219D8377b58579F5023c44034e8595D9567J9449K19811a31671C03657o7743B5694
$$ y = [-29317, -3054, 181216, 42709, -89422, 5863, -165496, 32967, 180646, 225834, -212769, 173194, 3367, 130372, -122312, -299362, -213863, -184274, 73430, -36185, -236922, 278732, 161156, -12347, -31318, 189234, -249532, -83960, -87315, 162175, -69339, -589, -187154, -199111, 261465, 6971, 37224, -47654, -225742, -141296, 218047, -138181, 200660, 253866, -163019, 97262, 209952, -15385, 55799, 123130, 441706, -7193, -291140, 284827, 874261, 985569, 1585424, 1084816, 1409369, 1391992, 757938, 300062, -87750, 559526, 290727, 253340, -11968, -285425, 217212, 77997, 78600, -126141, -273820, 125728, -211289, 29616, 60934, -159820, 258348, 48377, -258579, 65023, -344034, -58595, 49567, 69016, 288827, -131671, 303657, 235914, 25694]
15207D4596a6868A15665a70056B3246a00200C0532J0433f66004B91356e8111A91883
15195C3855K83103j49484c328j70716d4956F3973k2313a21938D3762b0528j96086
15184b16614Q5172G3755J81212G1850j3509P6433c5291j463k51252H903i2861
15172b57611B46054C7731r766K13757C5590a3143A45195o9981a53907L1486L0070
15161i2351A02647L7387b4064I6935l9434a5659I7282b30258a8061G5392A5120
15149B1083J51508K00145a65182E5846a07974I392a1683B81106D4523K21998h5061
15137A51326a33894b1265A97565G8759d1121n7104A26137a38954A2281a9043h466
15125A50211J4517G494c3770E15440A30560J31758o0837D8925K79707j1168I6312
$$ y = [44596, -16868, 115665, -170056, 23246, -100200, 30532, 40965, -666004, 291356, -58111, 191883, 33855, 316958, 167474, -3328, -174044, -44956, 63973, 41660, -121938, 43762, -20528, -216614, -131442, 73755, 254967, 71850, 58341, 134774, -35291, -36754, -288006, 8903, -92861, -257611, 246054, 37731, 27965, 241722, 35590, -13143, 145195, 75214, -153907, -122421, -92351, 102647, 140034, -24064, 96935, 57501, -15659, 97282, -230258, -18061, 75392, 15120, 21083, 172591, 372736, -165182, 55846, -107974, 9392, -11683, 281106, 44523, 266521, -85061, 151326, -133894, -21265, 197565, 78759, -41121, -98225, 126137, -138954, 12281, -19043, -8466, 150211, 164728, 7494, -33770, 515440, 130560, 262318, 201481, 48925, 328632, 317464, 96312]
15113A13162l6959Q3948o9785e218q4983C21136A57460D4317R5741l8868a59464
15101A25244K92147k07754a23699B05147n7917c22297B49944a23808A48331E4631
15090B49426j1257a3900B408N17334A61488p4981K56085a49423o9905O5182B60156
15078A18396A4555J35274o9824P5044l1835l3107J11913R7360J641j24399K12891
15067C89513j52538d6516B75623F1626J68935N1306J05322j89990c6518D56901
15056A58106p6393J01801H4238L63936j54715J58979j02168j71926J6412l3893
15046A60863J36170r2552O968O934J4280J99876A4096M46379l6228j64255N6621
15035C16613p8775J82135j60991K33714A54407K32108A79722N41679r171j27279
$$ y = [113162, 76203, 160151, 90366, -5218, -90201, 321136, 157460, 44317, 140058, 101190, -159464, 125244, 417391, 209637, -123699, 205147, 147230, -322297, 249944, -123808, 148331, 54631, 249426, 238169, -13900, 2408, 519742, 161488, 86507, 342592, -149423, -219328, -154146, 260156, 118396, 14555, 149829, 80005, 155049, 123214, 90107, 202020, 299380, 301021, 176622, 389513, 236975, -46516, 275623, 61626, 230561, 281867, 387189, 197199, -36518, 456901, 158106, 81713, 183514, 84238, 448174, 293459, 452438, 350270, 178344, 194756, 160863, 297033, 204481, 211449, 218383, 232663, 432539, 14096, 460475, 424247, 259992, 316613, 237838, 419973, 258982, 492696, 154407, 386515, 179722, 721401, 712230, 584951]
15025E84951j80199k4557K3645o7099J449K9366J56598k1546k02674H7395L73742
15014D61137n6570l2829I8771M37192B65737K1720j37006L61446l7717j76905
15004B97275A47753K45149D9306R3677J34123m2794J52906j41383E0458N06436
14994E56894E7672K06555j07661N26652I1867J51182J9214r2494J57475J99482
14984E26726A19093K75828j17291K34446j25503K02986A71552M63107k58737J59134
14974E35056j45936j36299P067M46693k8756B54077K22786O7320A33806K77240
14964D11046k6383G6075J54589j6570D5558M69689j72205a63131E9570K54072
14954C13642j52426m198K84292q8978L15917C19132L3318K26776j41928K42563
$$ y = [584951, 404752, 380195, 403840, 336741, 338190, 367556, 524154, 502608, 299934, 87395, 461137, 404567, 371738, 98771, 535963, 265737, 287457, 150451, 511897, 474180, 297275, 147753, 392902, 49306, 142983, 277106, 234312, 387218, 245835, 50458, 556894, 57672, 264227, 156566, 683218, 91867, 243049, 262263, 169769, 327244, 526726, 119093, 394921, 277630, 512076, 386573, 589559, 171552, 634659, 375922, 535056, 389120, 252821, 259888, 706581, 677825, 254077, 476863, 544183, 133806, 411046, 384663, 76075, 230664, 214094, 45558, 515247, 343042, -163131, 59570, 313642, 161216, 157018, 441310, 352332, 668249, 319132, 352450, 579226, 437298, 679861]
14944F79861m4328K00957C53872J50592m4825a00010A96474J74415o1608A13640
14933A54203M17354N30288p1264m59944N57108J76573j70249k22250J60198K50859
14923A322876k41584k74977M49151l14760L19304L06157j63922j84224M026j1947
14913A210100j26904l43470j41519k66922J73202B2082L72264R2991j78872o7914
14903B40551B6413J95984j6585Q036K73274A83344L29633j590p9352A51490L60234
14892E11724d5605A11310j0428M81296j93490M13567R8251L1091m39266J67293
14882F59624l01937J77243J79254n8597O1902A45280N73884j22146K4746j13869
14872E07895J26153j91427J59604B37969K01594L4301J82552C24147K6952m305
$$ y = [679861, 635533, 836490, 353872, 504464, 459639, -100010, 196474, 370889, 309281, 113640, 154203, 571557, 1101845, 1030581, 570637, 1127745, 1304318, 1134069, 911819, 1072017, 1322876, 1081292, 806315, 1255466, 940706, 1260010, 1566167, 1402245, 1218021, 1222047, 1210100, 1083196, 739726, 598207, 331285, 504487, 22082, 394346, 487337, 308465, 240551, 26413, 222397, 205812, 213848, 487122, 183344, 512977, 511387, 432035, 151490, 511724, -45605, 111310, 100882, 582178, 388688, 802255, 900506, 931597, 492331, 659624, 357687, 534930, 714184, 655587, 717489, 145280, 719164, 597018, 621764, 507895, 634048, 442621, 602225, 237969, 439563, 473864, 656416, 324147, 351099, 346794]
14862C46794r1274A15062M13464q0701F3247O2366J45511P0267P1143K13359j94541
14851D31352q3863A53700L19029m3853A80903M47842L9688J86288l84945M19091
14841H88867P5699n2305K86393n56487N1966K73194l48257k03498L9682L30626
14831G85880C34955j28656K91701P7278m4111j52168K22362j64364o7873J89880
14821E59004k30798L12542J33087C37094M61526k15303L2600k02927J13371k04926
14811C21435L14232O7898k68078j48243M13828j66210L47142J05129K3104l15629
14801F94608Q0960o0521r6713k1891k28580K19441k31894q3584M93262C53544
14790D31678M9844P4859k1374o4792k4079K67792l55930L4902j61114J94147l6001
$$ y = [346794, 255520, 115062, 528526, 447825, 63247, 125613, 271124, 341391, 412534, 625893, 431352, 347489, 153700, 472729, 428876, 180903, 628745, 668433, 854721, 469776, 888867, 964566, 912261, 1198654, 642167, 694133, 967327, 619070, 415572, 455254, 785880, 334955, 206299, 498000, 575278, 531167, 378999, 601361, 436997, 369124, 559004, 328206, 640748, 773835, 337094, 798620, 583317, 615917, 412990, 526361, 321435, 635667, 703565, 435487, 287244, 701072, 534862, 882004, 987133, 1010237, 694608, 775568, 715047, 618334, 596443, 367863, 587304, 355410, 271826, 765088, 353544, 431678, 481522, 556381, 535007, 470215, 446136, 713928, 357998, 392900, 231786, 425933, 389932]
14779C89932M9102J63272J23330k39825N48389l01487j82008r5104K27502q8006
14769E95097M2402B23550L12678K6506o353j49556j46836n182M98778p3943k27451
14758D52191J63626j02918q718K3576B33390M52763j29502j19152J09003j56483
14748C90019N715M35394j93684k09241K72290J8118n1376L052B78393M08311M3111
14737G29815J82426l31094Q6430K54484k04365n7435M42051m7619k48164p2L84573
14726A191030J4311q9133L86044k95953l07026l82011K35712l17603O40889l99794
14716F76466m3302L19369l0467k42579K20715K7627j19260k64064R5691J55858
14706G96054j25485K10348q0350K08205l817J94174M11557k22563q336j74598
$$ y = [389932, 439034, 602306, 725636, 485811, 1034200, 732713, 550705, 455601, 683103, 595097, 637499, 223550, 536228, 562734, 556381, 406825, 259989, 254807, 753585, 679642, 452191, 615817, 512899, 504181, 527757, 233390, 686153, 556651, 437499, 546502, 390019, 395734, 831128, 637444, 428203, 700493, 718611, 667235, 670287, 278393, 686704, 729815, 912241, 581147, 667577, 922061, 717696, 660261, 1102312, 1054693, 806529, 806457, 1191030, 1205341, 1116208, 1502252, 1206299, 899273, 517262, 752974, 435371, 1076260, 676466, 633164, 952533, 922066, 679487, 900202, 927829, 808569, 544505, 640196, 796054, 670569, 880917, 800567, 1008772, 1004955, 1199129, 1610686, 1388123, 1379787, 1205189]
14696A205189R241m40885j55160J27318j25265j80193J27476J45516K05238J25216
14686A043691k41616O5594j62854K1603R5664J72962j76343C28878O55013l04269
14676F79622J13284j03085L9604J32057k71618K51750J60641q9973p370j85675
14666G19237J88586m5349L2426K24559k90385K96481J9422m76349J04905O9695
14656H43228j78643P0658J92871J14728O9719l90673K56000r359j12182L6538
14646H92885l7612r6833K00755J53578k73293L12451j93494o7195J80738N19626
14636A591606o13710k18269M35196k13828L394j16351L15606m41571J38459L33145
14626A213677p6708m6575J50727j5417R4500k81107O5049r3590L51446M6512k97115
$$ y = [1205189, 1214430, 773545, 618385, 745703, 620438, 440245, 567721, 713237, 918475, 1043691, 802075, 867669, 704815, 726418, 822082, 995044, 818701, 328878, 983891, 679622, 792906, 689821, 729425, 861482, 589864, 841614, 1002255, 912282, 904912, 719237, 907823, 862474, 894900, 1119459, 829074, 1125555, 1144977, 668628, 773533, 843228, 664585, 735243, 928114, 1042842, 1112561, 721888, 977888, 968529, 856347, 892885, 855273, 758440, 959195, 1112773, 839480, 1151931, 958437, 891242, 1071980, 1591606, 977896, 759627, 1194823, 980995, 984389, 868038, 1183644, 742073, 880532, 1213677, 1136969, 1090394, 1241121, 1225704, 1320204, 1039097, 1104146, 1010556, 1362002, 1408514, 1111399]
14615A111399r9465j04541K38217O7281O8886K07007k13993k4588k1212j1544
14605A217447M90485n10609J57576K05152j16328k27566k4112L62395K9186m50076
14595A133550K77697o5032M5102k0992O6811n6603J75757J83683m55652k5362
14585A258959R7241K26884m1813m7923J1193m235Q5959l1796M91164k80260J84601
14574A949974l08682J71556K95510j67929l29960K68059Q2810j01383J53013j5744
14564A997224N7415j84666J69971L02505k93649K99602L0706L43495j39903L37047
14554B919747N373J12121N96818O69584O80849J885297L901141O611221J3204973
14545C0587124L488782A4863880F761433l112547q31647K92115J499090j675487
$$ y = [1111399, 1011934, 907393, 1145610, 1212891, 1281777, 1488784, 1274791, 1250203, 1228991, 1217447, 1707932, 1197323, 1354899, 1560051, 1443723, 1216157, 1192045, 1554440, 1583626, 1133550, 1411247, 1346215, 1391317, 1370325, 1437136, 1380533, 1556290, 1739973, 1284321, 1258959, 1356200, 1583084, 1541271, 1493348, 1504541, 1500306, 1586265, 1554469, 2045633, 1765373, 1949974, 1641292, 1812848, 2108358, 1940429, 1610469, 1878528, 1961338, 1859955, 2012968, 1997224, 2054639, 1869973, 2039944, 2342449, 2048800, 2348402, 2379108, 2722603, 2582700, 2919747, 2925120, 3037241, 3634059, 4303643, 4984492, 6869789, 10770930, 17382151, 30587124, 34075906, 14863880, 6761433, 3648886, 2817239, 3109354, 4608444, 2932957]
14537B932957j190349N2793M8369l80028K02548p0187P3606L10716k29267J29427
14527A880585R5208k36243O8380J26733L09892k57813p673l15088K93169j0252
14517A946898J05182J72717k66523M60910k71211J43285j26717o9583M79596m88683
14507B085871J98432K83384m032k2008k90687N02536j20278q5649M2836N8652
14497B649057j09801O9966O5057L7231N70883o55151K62850Q0591k90598L6485
14487B716570M51929j04689k8164k06981M8973N50617j55251l46344K82953K04961
14477C414574j30928P3788J49166k6605j30478J69201j08703J426Q3777R3521
14467C588739K75933k23522L68419k39834J96838k61899N16718n49622P31011
$$ y = [2932957, 1742608, 1795401, 1843770, 1463742, 1666290, 1596103, 1669709, 1980425, 1751158, 1880585, 1975793, 1739550, 1807930, 1934663, 2244555, 1986742, 1979069, 1663981, 1957150, 1946898, 2052080, 2224797, 1958274, 2419184, 2147973, 2291258, 2164541, 2094958, 2574554, 2085871, 2284303, 2567687, 2563655, 2541647, 2250960, 2753496, 2633218, 2547569, 2590405, 2649057, 2539256, 2609222, 2674279, 2711510, 3282393, 2627242, 2890092, 2970683, 2680085, 2716570, 3168499, 3063810, 3035646, 2828665, 2877638, 3428255, 3273004, 2926660, 3209613, 3414574, 3283646, 3357434, 3506600, 3479995, 3349517, 3518718, 3410015, 3411441, 3495218, 3588739, 3864672, 3641150, 4009569, 3769735, 3966573, 3704674, 4221392, 3671770, 4402781]
14458D402781k53849l97040N46603p4167j48181J97269j06448O5633N9043J64878
14448D456522P024M33875o1215k61230k3597K50961J9281m5259J45270L27830
14438E249462l34993M34196k72444M46612J07436k98180L22452j48823k1792M23376
14428E907302o9340K16483K21964l02848L72176j8294K09842M16596j33056L70829
14418G191654m15466j85274N22084K55933k04258l89636L76903j05589O84579
14409G730930l2461J62816J01786n3704K72202K78954j58799J54075J20061j08359
14399H467501K58043K3796J97470K57997L51081o2452K08892Q70k707N05281K03095
14388A0408867R1874o8855N09985L18727J68610R236M23035M28673k25385N05530
$$ y = [4402781, 4148932, 3751892, 4298495, 4224328, 4076147, 4273416, 4166968, 4232601, 4291644, 4456522, 4463546, 4897421, 4836206, 4574976, 4551379, 4802340, 4821621, 4776362, 4921632, 5249462, 4914469, 5348665, 5076221, 5522833, 5630269, 5332089, 5654541, 5505718, 5483926, 5907302, 5837962, 6054445, 6276409, 5973561, 6345737, 6327443, 6537285, 6953881, 6820825, 7191654, 6776188, 6590914, 7112998, 7368931, 7164673, 6775037, 7151940, 7046351, 7730930, 7698469, 7861285, 7963071, 7909367, 8181569, 8460523, 8301724, 8455799, 8575860, 8467501, 8725544, 8749340, 8946810, 9204807, 9555888, 9493436, 9702328, 9703198, 9700491, 10205772, 10408867, 10500741, 10431886, 10941871, 11260598, 11429208, 11438444, 11861479, 12290152, 12064767, 12570297]
14378A2570297k5377K27072K41886K53850K69140K36101M14956L19103J88871
14369A4695899K09578J94351Q11576j01755J82079N25232J80592Q30777k89807
14360A7238522L90632N80093L71382O32143M38680J12478M79932M48654J039033
14351B1731549K71080O94994L69106N61308P38109N99592M63762O87870P88763
14342B6906133N68310J237251M25802R06684N26791J169528Q45708R16195J212204
14333C4714606J026980J029780J010914J289609J422146J051745J310884J815320
14325D4671984J397479J287285J901401J753840J863191J818600J869910K109173
14317E8672863K137621K314805K317580K351810L185158K822751L288927K902284
$$ y = [12570297, 12544920, 12771992, 13013878, 13267728, 13536868, 13772969, 14187925, 14507028, 14695899, 14905477, 15099828, 15911404, 15809649, 15991728, 16516960, 16697552, 17528329, 17238522, 17629154, 18209247, 18580629, 19212772, 19651452, 19763930, 20243862, 20692516, 21731549, 22002629, 22697623, 23066729, 23628037, 24366146, 24965738, 25429500, 26117370, 26906133, 27474443, 28711694, 29137496, 30044180, 30570971, 31740499, 32586207, 33502402, 34714606, 35741586, 36771366, 37782280, 39071889, 40494035, 41545780, 42856664, 44671984, 46069463, 47356748, 49258149, 51011989, 52875180, 54693780, 56563690, 58672863, 60810484, 63125289, 65442869, 67794679, 70979837, 73802588, 77091515, 79993799]
14309G9993799L333943L739646M032953L779509M144180M378441M510877M754140
14301A12667488M989361N643670N615415N987911O604014O741583P219336P689528
14293A63158306P963758Q657723Q525752R747092R625671J0078869J0425588J0727329
14285B38910088J1288469J1178218J1409104J2146582J1864153J1866421J1969796
14278C20632831J1254411J0959669J0196929Q560533P621805M060452J483658
14271C74770288J191929K114474K399943k776614k488512l354548o998287q774954
14263C56083719j0589193j1636227j2286465j2885910j2981551j3049896j2901850
14256B69752627j2737557j2634800j1909611j1768996j0973487j0795608r603043
$$ y = [79993799, 83327742, 87067388, 91100341, 94879850, 99024030, 103402471, 107913348, 112667488, 117656849, 123300519, 128915934, 134903845, 141507859, 148249442, 155468778, 163158306, 171122064, 179779787, 188305539, 198052631, 207678302, 217757171, 228182759, 238910088, 250198557, 261376775, 272785879, 284932461, 296796614, 308663035, 320632831, 331887242, 342846911, 353043840, 361604373, 369226178, 373286630, 374770288, 375962217, 378076691, 380476634, 377700020, 375211508, 371856960, 364858673, 356083719, 345494526, 333858299, 321571834, 308685924, 295704373, 282654477, 269752627, 257015070, 244380270, 232470659, 220701663, 209728176, 198932568, 189329525]
14249A89329525q792897q873549r096085p879348p655616o655999o744835o433845
14241A27197351o116158n564464n654934m613637m494994m456794m458981m030999
14233H7806390l353096l268188l231658l284000k871066l039315k786094k362632
14225F3610341k140865k248485k026541k086207j687365j961358j614404j880414
14217D7964702j824719j253120j569894j044728j077416j482868j178214j086201
14209C7447542r96919p66539p36570j387304q24769j186995p97723p92442p36411
14200B9221870l98492j083711q72975p26014l05722p85543o55884o91866k16898
14191B3484765p96215o23463n18249l81991o37934l47828p71398j2454o91831
$$ y = [189329525, 180536628, 171663079, 162566994, 154687646, 147032030, 140376031, 133631196, 127197351, 121081193, 115516729, 109861795, 105248158, 100753164, 96296370, 91837389, 87806390, 84453294, 81185106, 77953448, 74669448, 71798382, 68759067, 65972973, 63610341, 61469476, 59220991, 57194450, 55108243, 53420878, 51459520, 49845116, 47964702, 46139983, 44886863, 43316969, 42272241, 41194825, 39711957, 38533743, 37447542, 36450623, 35684084, 34947514, 33560210, 32735441, 31548446, 30750723, 29958281, 29221870, 28823378, 27739667, 26866692, 26140678, 25834956, 25049413, 24393529, 23701663, 23484765, 22688550, 22065087, 21546838, 21164847, 20526913, 20179085, 19407687, 19395233, 18703402]
14182A8703402m11300l18163k49431m05007l86468l06361n77910k05122k02929
14173A5640711m07335o2712o84584j81069k12166L5736l74728l73617j59191k32328
14163A2988717n59759k65474K23930o55304p1919m53996K88038l08885o9820l19753
14153A0795775o15616L7904K04187l55658j51672J91945m72171L4348l45383j08167
14143I215492k14610N7262l74044n48773L90414L4716m69001j15007m0498j10331
14133G825620K82363k37867l16236J82478k75466k28956k81696L08777o18460
14124F640557l3431O4212J33871m42025K10827l36985L718K22053m09032l57175
14114E696590K56106K2589l84812J92086k1112q2791j68475m22838M17169k11904
$$ y = [18703402, 18292102, 17973939, 17724508, 17319501, 16933033, 16626672, 16048762, 15843640, 15640711, 15233376, 15170664, 14486080, 14305011, 14092845, 14128581, 13753853, 13380236, 13221045, 12988717, 12428958, 12163484, 12387414, 11732110, 11660191, 11206195, 11494233, 11185348, 11115528, 10795775, 10180159, 10218063, 10422250, 10066592, 9914920, 10106865, 9634694, 9669042, 9323659, 9215492, 9000882, 9058144, 8684100, 8135327, 8525741, 8560457, 8091456, 7976449, 7935951, 7825620, 8107983, 7870116, 7553880, 7736358, 7460892, 7231936, 6950240, 7259017, 6640557, 6607126, 6671338, 6805209, 6363184, 6574011, 6237026, 6240744, 6462797, 6053765, 5696590, 5952696, 5975285, 5590473, 5782559, 5761447, 5678656, 5510181, 5087343, 5504512, 5292608]
14104E292608k94339Q7832J36088P1788n92603M49109k40086N6440m58109n148
14094D503580K45249k94045j64441K21806j16166K0752m52443l6900L37810j39340
14084D125862J05626j600N5960l88497J08765n06039P55232j73191n48343J68967
14074C702742r003L1230K7318k73666j24820J75478q167j64185K03862M9117l86327
14063C223579N4594k48175M58559k34764j4482k44582L17407j4341k18170R9140
14053C178765P3943J26304j97473l37386j7270J12908r3229P7691n28655M57561
14043B853159l12870K01480k26135M1728j73296J94203K36830j80107j06224k56743
14033B272025J5700J5648J84119j08342J33429J07104k02433J63005l27720J28232
$$ y = [5292608, 4998269, 5086101, 5222189, 5293977, 4701374, 5150483, 4910397, 4966837, 4508728, 4503580, 4748829, 4454784, 4290343, 4512149, 4395983, 4416735, 3964292, 3927392, 4265202, 4125862, 4231488, 4229888, 4285848, 3897351, 4006116, 3500077, 4255309, 4082118, 3533775, 3702742, 3693739, 3724969, 3752287, 3478621, 3353801, 3529279, 3521112, 3356927, 3560789, 3609906, 3223579, 3278173, 3029998, 3488557, 3253793, 3239311, 2994729, 3312136, 3297795, 3079625, 3178765, 3252708, 3379012, 3181539, 2844153, 2826883, 2939791, 2846562, 2924253, 2395598, 2853159, 2540289, 2741769, 2515634, 2557362, 2384066, 2578269, 2815099, 2634992, 2528768, 2272025, 2287725, 2303373, 2487492, 2379150, 2512579, 2619683, 2417250, 2580255, 2252535, 2380767]
14023B380767j32015q1738q2351L2312j37167J86710m4103j15114M8563R7653
14013B153517l9933j23488J1823P141K78930n59343J51353k36611L01832o1615
14003A883606L6939o1473M0513l09504j8610j9344K45322Q641l4723K13985j76022
13992A809330j09032Q18597J87452R06445K343039N093096J1269371J4874885
13984C7193183j4653857j0656656m905936j967535j120863r51153Q6718j27528
13976B896373k53186k15564n07639K96637M8207l95374K97578N7073m74861L06352
13966B055596j26353k87137K49743L44076k62958o7437k15184J79726j10786k95640
13956A463646K43224R5605l36565K51747j87296j24529J64614k00644L42488m04018
$$ y = [2380767, 2248752, 2167014, 2084663, 2116975, 1979808, 2166518, 2122415, 2007301, 2055864, 2153517, 2113584, 1990096, 2001919, 2009060, 2287990, 1728647, 1880000, 1643389, 1945221, 1883606, 1920545, 1859072, 1899585, 1590081, 1571471, 1552127, 1797449, 1806090, 1771367, 1985352, 1809330, 1700298, 2518895, 2706347, 3612792, 5955831, 11048927, 22318298, 37193183, 22539326, 11882670, 6976734, 5009199, 3888336, 2937183, 3023901, 2896373, 2643187, 2427623, 1919984, 2216621, 2264828, 1869454, 2167032, 2224105, 1749244, 2055596, 1929243, 1642106, 1891849, 2235925, 1972967, 1905530, 1690346, 1870072, 1759286, 1463646, 1706870, 1802475, 1465910, 1717657, 1530361, 1405832, 1570446, 1369802, 1712290, 1308272]
13946A308272J68002J61616j31435j07157K24632j72915n2458K392o4260J97881
13936A534570l10797J36114P5148j23452k34731K67971K12219j75667J88076k43173
13926A326278l0840j30285J26150K00785l40037K01119J24082N8254l96433M60507
13916A599580j48575p8077m97567N11489O846k80286J77995m18565K42773L0376
13906A145989j1874J22840j86171L18313l42785J35990o5402K26446l85288k50556
13896G07502N30660k39267k18141N00600p3117l13093P8207K05458O8623J34435
13886A381867m68107p601J93799k15669K83381j90811n7232J97664k77659K09439
13876A049071q4523k29619K44464o0877J19238p1354k66027L20206L5466k97410
$$ y = [1308272, 1476274, 1637890, 1506455, 1399298, 1623930, 1451015, 1398557, 1400949, 1336689, 1534570, 1223773, 1359887, 1435035, 1311583, 1076852, 1344823, 1557042, 1381375, 1569451, 1326278, 1295438, 1165153, 1291303, 1492088, 1152051, 1353170, 1477252, 1535506, 1139073, 1599580, 1451005, 1372928, 875361, 1386850, 1393696, 1113410, 1291405, 872840, 1115613, 1145989, 1134115, 1256955, 1070784, 1389097, 1046312, 1182302, 1116900, 1343346, 958058, 707502, 1238162, 998895, 780754, 1281354, 1208237, 895144, 973351, 1178809, 1247432, 1381867, 913760, 906159, 1099958, 884289, 1167670, 976859, 919627, 1117291, 839632, 1049071, 964548, 734929, 979393, 918516, 1037754, 966400, 700373, 1020579, 1056045, 758635]
13866G58635j00702L68653o9808J36520p4388l22216J69260J614K36179k41162
13856H62585Q6446k59083K47080J3347j28674J16713L1444K27545l50401R6008
13846I43010j67826l647r8155K41980L0862l3984k04982j19673K95974O8992D57743
13834H04699r2513L5429O5242J80472l25116R3209L35104l06240J30820j63812
13824G57294L4207k06909J03894m705P8949n3590J15322J0578l14600N0839l8766
13813E32513J56041j36904P8851J29906J97386D64802M10644l11485J36327j4157
13803F86131n7943N2313q3145k82935K14725A53418N27294L70545m08451k87942
13793C54864O47853m03227m2601o0120K86615k03442l8712K26174j78687o9378
$$ y = [758635, 657933, 1026586, 956778, 1093298, 1018910, 696694, 865954, 867568, 1103747, 862585, 949031, 689948, 937028, 950375, 821701, 938414, 969858, 1197403, 847002, 943010, 775184, 771537, 673382, 915362, 946224, 912240, 707258, 587585, 883559, 952551, 457743, 804699, 712186, 747615, 812857, 993329, 668213, 761422, 1096526, 790286, 921106, 757294, 791501, 584592, 688486, 683781, 762730, 709140, 824462, 835040, 520440, 571279, 532513, 688554, 551650, 630501, 760407, 957793, 464802, 875446, 563961, 700288, 686131, 628188, 680501, 597356, 314421, 529146, 153418, 680712, 1051257, 642806, 354864, 1002717, 599490, 556889, 496769, 783384, 579942, 541230, 767404, 588717, 519339]
13783E19339A74535M59045J30459C03126K0592M30391J00330B98412J17359J69988
13773E85759n2270j23106L29523k79249K35685N1381k88123M0227K5865K20555
13763G46247B78791l0343Q8095L0473M6743R8709h9395C94762n1387J89584Q5308
13752F18267j72766k8184Q3848N1892k1378j93585K15062j56877K40105B93141
13741E92817o0416J9673j42732R0350j8904n2980L25803l30432j8563J44745J6049
13730E65410n6102j47698M29758j60913B75727M84435q8177A41593K52471J41986
13720E36050m6719j02495L27060j41139j52987O6913k21094K25669A21535Q4266
13710B05801K80672r9385j7237j76837J01497J35668k04441L43693j63739A47590
$$ y = [519339, 174535, 633580, 764039, 303126, 323718, 754109, 854439, 298412, 415771, 585759, 533489, 410383, 739906, 460657, 696342, 747723, 459600, 499827, 525692, 746247, 278791, 248448, 336543, 367016, 413759, 512468, -89395, 394762, 343375, 532959, 618267, 445501, 417317, 501165, 553057, 531679, 338094, 553156, 396279, 636384, 293141, 592817, 532401, 552074, 409342, 499692, 480788, 427808, 753611, 423179, 404616, 549361, 565410, 509308, 361610, 791368, 630455, 275727, 760162, 671985, 141593, 394064, 536050, 489331, 386836, 713896, 572757, 419770, 486683, 265589, 491258, 121535, 205801, 486473, 387088, 369851, 193014, 294511, 430179, 225738, 569431, 405692, 147590]
13699B89035L02145A93748K48492L8076L174J47321j25531J18453k26725n6416
13689C40592L91507k99497k1200j28578N2936M6423K3621q0890J28183j29718
13679C23379r8837K63920q6213r4389K48736j64020J79054e8260F06896A80239
13668D41277H1797M23111k6239j47463M598J46978j45228r4261K34813j95216
13658B82890p3062L41516p7373k33426L06297k65161l5475J50033j8361R161M8633
13647D35672a10197B81643j7052K3517N6218j42523J43042j63887M55745o6756
13637E69947B49569Q118r5248J43328R9898j3463A58363p0110J33134J41287a4550
13625E7802L57324J30249j47391r3304k6934o1227R6982J67735j56510o9366J74053
$$ y = [289035, 591180, 193748, 442240, 480316, 483490, 630811, 505280, 623733, 397008, 340592, 732099, 432602, 411402, 282824, 335760, 382183, 405804, 324914, 453097, 323379, 224542, 488462, 402249, 307860, 556596, 392576, 571630, -58260, 606896, 180239, 441277, 81797, 504908, 478669, 331206, 335804, 482782, 337554, 243293, 478106, 282890, 209828, 551344, 473971, 240545, 546842, 281681, 246206, 396239, 377878, 387039, 435672, -110197, 281643, 264591, 288108, 344326, 201803, 344845, 180958, 636703, 569947, 249569, 257687, 162439, 305767, 405665, 392202, 158363, 88253, 221387, 362674, -14550, 57802, 415126, 545375, 397984, 304680, 277746, 216519, 313501, 481236, 324726, 255360, 429413]
13614D29413j13696O0451M717J33894A90290n248K76760A44417L34297j33957
13604C44757P6382j25672K79039O0466B01384J41462A35864J50973q3391q2000
13594A21446J05881J54782j21474j05937K08845A33445M0591M0199l1823A880
13583C6822K72097j47778J89145J12094k20369K17740a45869C0906P6035M6413
13573A53354i5475A78673b0656B06856E1889J52557r3182J10686L152d7647A56288
13561C21566r4117j6463K21023E1221O5293Q6606J6737d2228D11086G7840K88563
13550C66403n4385P2675K0628r7330f4210D31386A75452L3915K48488j68300a6641
13538B91134j19285n4710J3932L58080B19218E2565K48566j5035A24543M4498
$$ y = [429413, 315717, 376168, 380885, 514779, 190290, 185042, 461802, 144417, 478714, 344757, 421139, 295467, 574506, 634972, 201384, 342846, 135864, 286837, 203446, 121446, 227327, 382109, 260635, 154698, 363543, 133445, 174036, 214235, 182412, 1880, 36822, 308919, 161141, 350286, 462380, 242011, 459751, -145869, 30906, 106941, 153354, -95475, 178673, -20656, 206856, 51889, 204446, 111264, 221950, 225102, -47647, 156288, 321566, 227449, 210986, 432009, 51221, 116514, 203120, 219857, -42228, 411086, 77840, 366403, 312018, 384693, 405321, 307991, -64210, 431386, 175452, 209367, 457855, 289555, -16641, 291134, 171849, 117139, 131071, 489151, 219218, 52565, 301131, 286096, 124543, 169041]
13528A69041R6499J63692g1922C61928A41478M3740J51706A63235J1882i7761
13517B68988J84313I001J3312K52428r4298J5862A5888K796N12095A87566P4019
13506B61585j24374J07330j12651k275F0848K37268n4811J57013j24322f9822
13495B19152a21810A43504o5797K65285q4567K69433A78029O2694L00402A05672
13484C26660F3910J19939n063J16208k9325j16458J04742l4951D3437J58511j3273
13473A88675J03917j40769K05264A03747J19937l2611a85621A65685m9038J06749
13463B23396B9909J71812B8404K21434J13377H8354K26834p667i5080B70334A13379
13451A48903J09177a0690E1127h5412A25891a18014c2224D19201j51922h7298
$$ y = [169041, 265540, 429232, -71922, 361928, 141478, 185218, 336924, 163235, 175117, -97761, 268988, 453301, 9001, 22313, 274741, 180443, 196305, 15888, 18684, 530779, 187566, 261585, 137211, 244541, 131890, 129615, 60848, 298116, 243305, 400318, 275996, -69822, 219152, -121810, 143504, 77707, 342992, 258425, 527858, 178029, 240723, 541125, 105672, 326660, 63910, 183849, 178786, 294994, 265669, 149211, 253953, 219002, 43437, 201948, 188675, 292592, 151823, 357087, 103747, 223684, 191073, -185621, 165685, 116647, 223396, 29909, 201721, 28404, 249838, 363215, 88354, 315188, 307521, -95080, 270334, 113379, 148903, 258080, -10690, 51127, -85412, 125891, -118014, -32224, 419201, 267279, -87298]
13440B17290C0104J25521J15030j29194d7977A85985H604L23268c5280B76734
13429a83877B54991L67262A57346N9950h964C54246h3873C73584A40038j6412
13419A23626J35393l0003H4779a34962A38842M1125o9406D4213g6798A91138r0039
13408A01099L0105L58554j76640q2766N9194j25892R6265a80063A01775O8619
13398A70394H0975J70154j00236K03417l8093C573M4134P5862j2768c6041B2743
13386D3217i445A69161K81164D4652a25482E5551k3637G062L66150A23115K2704
13375A45819L7549l669K4823A6423k069g5967D06989A24231i4259A37300Q3125
13364B20425F6508J55170m0148a00654A54348k2336E8098J50560F0478K33712
$$ y = [217290, 30104, 155625, 270655, 141461, -47977, 185985, 8604, 331872, -35280, 276734, -183877, 254991, 622253, 157346, 217296, -8964, 354246, -83873, 373584, 140038, 123626, 259019, 229016, 84779, -134962, 138842, 179967, 110561, 44213, -76798, 191138, 101099, 131204, 489758, 313118, 230352, 289546, 163654, 259919, -180063, 101775, 170394, 80975, 251129, 150893, 354310, 316217, 3573, 47707, 123569, 110801, -36041, 22743, 43217, -9445, 169161, 450325, 44652, -125482, 55551, 31914, 7062, 373212, 123115, 145819, 183368, 179699, 204522, 16423, 14354, -75967, 406989, 124231, -94259, 137300, 220425, 66508, 221678, 181530, -100654, 154348, 132012, 58098, 208658, 60478, 294190]
13354B94190N9547h0270J8534D4834L78749B8975K65209m6102h7095A32539D0687
13342c339C02744N3652j51807L04521k17985A00133K583K12380j06678q7656l9152
13331H1610j4513b0037G0847K43007m1570M6346A8126b1632C00413A20369K69257
13320C89626j64383d7987B16544o318C1050L95410b13046B18729K1807L7859B2193
13308D06799H0143J35594J14882q2098j6754K1388D7591L50291j4416h0736o9288
13297a50024n6322A75256f7686k3967B39133Q0085D7287c6892C99498a46553d3378
13285C9886J25229N2944a762r7384j76104B15578i2114d5146B98834D1452J06142
13274A47594J4728c498d7C27384e7171A30375a97591A12384K30912A02282J88204
$$ y = [294190, 353737, -80270, -61736, 44834, 423583, 28975, 294184, 248082, -87095, 132539, 40687, -3339, 302744, 356396, 204589, 509110, 291125, 100133, 102716, 315096, 208418, 120762, 81610, 67097, -20037, 70847, 313854, 272284, 318630, 18126, -21632, 300413, 120369, 389626, 225243, -47987, 216544, 210226, 31050, 426460, -213046, 218729, 240536, 278395, 22193, 406799, 80143, 215737, 330619, 248521, 231767, 253155, 47591, 397882, 383466, -80736, -150024, -206346, 175256, -67686, -91653, 239133, 319218, 47287, -36892, 399498, -146553, -43378, 39886, 165115, 218059, -1762, -99146, -275250, 215578, -92114, -45146, 298834, 41452, 147594, 162322, -3498, -47, 327384, -57171, 130375, -197591, 112384, 343296, 102282, 290486]
13263B90486E6234j7518c3360A25029J56747B82J00662K06493j05887D340P8715
13252H3055J76085k7588a16899A53610J46861A06916K28054a23648F2259J32201
13242A94460I2523k232k2392b8252A11383h7997D5797K34643l7425c37054B67519
13230h6664a8131B22204L6940a38464b577j45824A00966b08287C1509K2348K6586
13219H0443a1891C21189C4687J47546c8372I4934D1675p602b11460B07185J488
13208B08673n6610P3476a17789F8260N8530a08049B9544R4579p583e6408B57778
13196a15097L4029L2381B8422N8786P208h9799B00339H0412K58679A20273J39508
13185B59781I3966L4022e01866E8421k417d42357a43622r2536B78987h090A33907
$$ y = [290486, 56234, 38716, -33360, 125029, 281776, 282, 100944, 307437, 201550, 4340, 83055, 259140, 231552, -116899, 153610, 300471, 106916, 334970, -123648, 62259, 194460, 92523, 90291, 67899, -28252, 111383, -87997, 45797, 280440, 243015, -337054, 267519, -86664, -18131, 222204, 259144, -138464, -2577, -148401, 100966, -208287, 31509, 53857, 80443, -11891, 321189, 34687, 182233, -38372, 94934, 41675, 34073, -211460, 207185, 208673, 152063, 225539, -117789, 68260, 126790, -108049, 29544, 124123, 116540, -56408, 257778, -115097, -81068, -48687, 28422, 87208, 94416, -89799, 200339, 80412, 339091, 120273, 259781, 93966, 127988, -501866, 58421, 56004, -442357, -143622, -236158, 278987, -8090, 133907]
13173B91059C5475a7927A81993E1208f0096K2490D40360j49855j19047d8641B73717
13161b86497B14179G4403c1132O274l9972k0920I8075M7425J18423A10237j4169
13150I6068B7545b4053j30703A16087g1349A91240b21665p1942A32999d5593I2782
13138A51236l6146n7263K2526K11510K2492M1098A40742J38504a18361j25268
13128b43629A5876J31041D9977c7951A51498j5871L663I631b31125A06721a44038
13116A57998b37788G1004J9936Q9866i083C39676D6619d7736J4982A71100q2674
13105H8426i2539E7739J63006K44644i9320A06729m6333d34j21710A21148a55434
13093B6206a07201k16252C3889b23729A41700E047H23b95197k31996d9563j49499
$$ y = [291059, 35475, -17927, 181993, 51208, -60096, -37606, 440360, 290505, 171458, -48641, 273717, -286497, 214179, 74403, -31132, -24858, -64830, -85750, 98075, 145500, 263923, 110237, 96068, 27545, -24053, -154756, 116087, -71349, 191240, -221665, -293607, 132999, -45593, 92782, 151236, 115090, 57827, 80353, 291863, 314355, 355453, 140742, 279246, -118361, -243629, 15876, 146917, 49977, -37951, 151498, 135627, 139290, 9631, -231125, 106721, -144038, 157998, -237788, 71004, 90940, 180806, -9083, 339676, 46619, -47736, -32754, 171100, 88426, -92539, 57739, 220745, 465389, -99320, 106729, 60396, -434, -122144, 121148, -155434, 26206, -107201, -323453, 33889, -223729, 141700, 5047, 823, -295197, -527193, -49563, -199062]
13082a99062c4728a3014A35250c33199B16550c95560e0434C5444j6654D335J54201
13071A58536L6304M35223D0371K09526J9309a70765A99644a23436j45833C79799
13060a4851A89100f2349F7918i0885C39416b50853c8262C52860j46593q3290J10236
13049B33213A7250J47753a21664c105A39525a05517m3169g4077A37481J80626
13039C18107H5098J13401b75615F6490H945M1501b1825j53281C8054O5861b09838
13027A45198l8336a31900C69574a5341E9750c6127q9888a3510B17360N4902E5884
13015b8436G6959B210M5506A5141g5456B75701Q8869j82284J22237A06734c29146
13003h136k35877A8626J96199c6295B92922j45607f7530k39602g6737k05621G0428
$$ y = [-199062, -34728, -13014, 135250, -333199, 216550, -395560, -50434, 35444, 18790, 4335, 158536, 194840, 630063, 40371, 249897, 269206, -170765, 199644, -123436, -269269, 379799, -14851, 189100, -62349, 67918, -90885, 339416, -250853, -38262, 352860, 206267, 122977, 233213, 17250, 165003, -121664, -3105, 139525, -105517, -148686, -74077, 137481, 318107, 85098, 198499, -275615, 66490, 8945, 50446, -21825, -175106, 38054, 103915, -209838, 145198, 106862, -131900, 369574, -15341, 59750, -36127, -126015, -13510, 217360, 272262, 55884, -28436, 76959, 2210, 47716, 15141, -75456, 275701, 364570, 182286, 304523, 106734, -329146, -8136, -244013, 18626, 214825, -36295, 292922, 147315, -67530, -307132, -76737, -282358, 70428]
12991d91891b17085f81A11928D9438c9062a5164r3136I1694J22721b00473A65940
12979A97332h034D7268J28080J12314A4296a13979j30181I0288b0833G3043N3498
12968A26541d3043k6171a8968j74281O09g5071b0417A68361a30978j17982J07602
12957a41358C511d3699j33836M8476P810b5962J1960D1637J11396A2358Q9692
12946A02050A1066b8707B81351A01492h9889B3876h8363A6617b01698N4584M1368
12935a05746A8518Q049a63870C2008c370k5964A14818k0443Q91J16553a52794
12923a38306k07466B12044r1504J99164I0566b864k99141B05122c80308J69704
12913b10604h7517A56445a81975j3512E2296R0764a1217B72514E4232J34934B888
$$ y = [-491891, -217085, -681, 111928, 49438, -39062, -15164, -108300, 91694, 214415, -200473, 165940, 197332, -8034, 47268, 175348, 287662, 14296, -113979, -244160, 90288, -20833, 73043, 126541, -43043, -69214, -18968, -193249, -192640, -75071, -20417, 168361, -130978, -248960, -141358, 3511, -43699, -177535, -129059, -121249, -25962, -14002, 41637, 153033, 12358, 102050, 11066, -28707, 281351, 101492, -89889, 23876, -88363, 16617, -201698, -147114, -105746, 18518, 26567, -163870, 32008, -3370, -29334, 114818, 94375, 95266, 211819, -152794, -138306, -345772, 212044, 120540, 319704, 90566, -2864, -302005, 205122, -380308, -210604, -87517, 156445, -181975, -195487, 52296, 143060, -11217, 272514, 54232, 189166, 2888]
12901C5647a07145C67712h1422j38374N9657M008N6455b736C0856a02334H0685
12889a60330b3229C1946b04801A33681i5333C715a52860m4890A21131M562a25011
12877b14594J03053C02792A5153b3213l28250A91794E5838H001R890K24685E280
12865c6639k86444J6402D8813b5769h727j22463B5074f7446n032r6575B3409b66619
12852A25975E3666G737L11056g2590B70865j24988g931A19486f4002a0395p3307
12841h3702m9426C343M7881a22400I0417J55840r3970m1013c2788F4014a47031
12829h1012p5855K1939A10936a50813E6064J96685a94061p810A05263e8255k0295
12818g8550r4287C57667j40121b19598G4188j6555d8727j8314j22562e7883D7769
$$ y = [35647, -107145, 367712, -81422, -219796, -160139, -156131, -99676, -2736, 30856, -102334, 80685, -160330, -23229, 31946, -204801, 133681, -95333, 3715, -152860, -197750, 121131, 125693, -125011, -214594, -111541, 302792, 15153, -23213, -351463, 191794, 55838, 8001, 17891, 242576, 5280, -36639, -323083, -306681, 48813, -25769, -8727, -131190, 25074, -67446, -72478, -169053, 23409, -266619, 125975, 53666, 7737, 318793, -72590, 270865, 145877, -7931, 119486, -64002, -10395, -83702, -133128, 3343, 51224, -122400, 90417, 246257, 152287, 111274, -32788, 64014, -147031, -81012, -156867, -134928, 110936, -150813, 56064, 252749, -194061, -201871, 105263, -58255, -78550, -172837, 357667, 217546, -219598, 74188, 57633, -48727, -67041, -189603, -57883, 47769]
12806C66340I0566i8767p3679b5730Q217A21587J09146E4580f1790k5632K2035
12795f5387k37155A21150k64b8418j80047A40365f5855J9454A26428C0123L1787
12784F1910M1359c08630R3620N4712P1052K5943j01750A44957a80874A89169i1763
12772A6355D404Q5516g1663j92569C2962L6905N1931J61585F7689K4753P546K29798
12760C29786A39613a2978e297C5114K090a97500c2679r022B62528a09862A20924
12748c74177A15431L5660a54184A88350b34404B32296g2707C7265K16521J1443
12738B65229e1033k25088B42229j5802A08326C6607J29237i0432A24580d7986
12727h9414B9621d5674j16160B6819P7774b65375e9847g091l3207j68072Q7806
$$ y = [366340, 90566, -98767, -172446, -25730, -17513, 121587, 230733, 54580, -61790, -87422, -65387, -302542, 121150, 120886, -28418, -208465, 140365, -65855, -46401, 126428, 30123, 61910, 103269, -308630, -215010, -160298, -89246, -63303, -165053, 144957, -180874, 189169, -91763, 16355, 4404, 89920, -71663, -264232, 32962, 69867, 121798, 283383, 67689, 92442, 99988, 329786, 139613, -12978, -5297, 35114, 37204, -197500, -32679, -41701, 262528, -109862, 120924, -374177, 115431, 151091, -154184, 188350, -234404, 232296, -72707, 37265, 253786, 265229, -51033, -276121, 242229, 226427, 108326, 36607, 165844, -90432, 124580, -47986, -89414, 29621, -45674, -161834, 26819, 104593, -265375, -59847, -7091, -40298, -208370, -120564]
12716a20564k39243D3828e4632n148I1910K19614n7432a85011E4685K6154c55667
12704B16700f857B48789H9373O0782p2247i3718k28515b2226C89125a89342k5183
12693b14525k07425C02701r9322b13805a1357E0307a35959A67241c1196A45022
12682A507c4153d951H9261Q0445J58656j62760J78968a46207E3718f5876o6435
12671a32311B70751a5828C09911f4349A45539J29483m6954b39211c1610R255D5511
12659b37412A96012A4223a86713g6510J0084B23080I3785A4823L09292D3920M9467
12648I3387b58260N4936b0201r5199D2418b35476A2185K95856b80212N176a31090
12636A30770a71709B49596c8679E7922k0904O7327R6572J60651r6846h312B45899
$$ y = [-120564, -359807, 43828, -54632, -59780, 91910, 311524, 254092, -185011, 54685, 80839, -355667, 216700, -6857, 248789, 89373, 150155, 77908, -93718, -322233, -22226, 389125, -189342, -214525, -421950, 302701, 203379, -213805, -11357, 50307, -135959, 167241, -31196, 145022, 1507, -34153, -4951, 89261, 169706, 328362, 165602, 344570, -146207, 53718, -65876, -132311, 270751, -15828, 309911, -64349, 145539, 275022, 228068, -239211, -31610, -22355, 45511, -237412, 196012, 14223, -186713, -76510, -66426, 223080, 93785, 14823, 324115, 43920, 93387, -258260, -203324, -20201, -115400, 42418, -235476, 12185, 308041, -280212, -275036, -131090, 130770, -171709, 249596, -38679, 57922, 37018, 104345, 200917, 361568, 264722, -8312, 245899]
12624G5274J10690f898k09261L5980k58198B6410O4175b07992B2365Q578a24869
12612B18297P2771J29271b84708B54145b33282J09478g388B8530b30420d5109
12601f0888H4817Q3484E8004Q4767K5840b66878A49532R3313h7361A43775F3900
12589a9317B9422K40984a21797L7362C508K51552d8941A2533R5320K1624j39a85397
12576a08705A27039h9347C47417c0698H2251g1749a864k08654j5166F0222b95664
12564C4247L1980e4121C622J76288m3891J2003f8964j86140b6107k40836H6081
12552c8646E8526a27896j41415B98733D4975h1351A73436c0600A73129E3595O9152
12541A22747K2562j9259j0777b61229f2432G3452a32332F6642d0962q010p7464
$$ y = [75274, 185964, -6898, -216159, -180179, -438377, 26410, 90585, -207992, 22365, 30943, -124869, 218297, 291068, 420339, -284708, 254145, -233282, -123804, -7388, 28530, -230420, -45109, -60888, 84817, 168301, 58004, 142771, 168611, -266878, 149532, 242845, -87361, 143775, 63900, -19317, 29422, 270406, -121797, -84435, 3508, 255060, -48941, 12533, 107853, 129477, 129338, -185397, -108705, 127039, -89347, 347417, -30698, 82251, -71749, -1864, -210518, -225684, 60222, -295664, 34247, 66227, -54121, 3622, 179910, 136019, 148022, -68964, -255104, -26107, -266943, 86081, -38646, 58526, -127896, -269311, 298733, 44975, -81351, 173436, -30600, 173129, 53595, 122747, 145309, 126050, 115273, -261229, -62432, 73452, -132332, 66642, -40962, -48972, -126436]
12530a26436J9757j83743a08889b7928l810l1120l5512M7485o5093H4267r847
12519G4420C5830b65376d0097m3716C3356a04910A26443E5678h0278L6342j57284
12508b01220R141k32929f8653j55627B8850L8465B1177K64413i4372O049j94092
12497b82415a3338A20623C6662a4669j00758k23931a43503C45885a91625A2974
12486a3747C91554F9766a15236e4232a6729B91988A42536l3778a9115j43597E2247
12474b8559C4226J0395c13324a09590A2266a38771E1904e1577O105o9401A52462
12462c9648j33336M0184D2656N840a03803B42036F5684P5893a51738B09215c39818
12450A84841n9610k768E2501J7201c01027a04180j07584i6821A04566f4740k12937
$$ y = [-126436, -106679, -290422, -108889, -27928, -31738, -62858, -98370, -50885, -115978, 84267, 74420, 35830, -265376, -40097, -83813, 33356, -104910, 126443, 55678, -80278, -43936, -201220, -192079, -425008, -68653, -224280, 28850, 67315, 21177, 285590, -94372, -88323, -282415, -13338, 120623, 36662, -14669, -115427, -339358, -143503, 345885, -191625, 12974, -13747, 391554, 69766, -115236, -54232, -16729, 291988, 142536, 108758, -19115, -162712, 52247, -28559, 34226, 44621, -313324, -109590, 12266, -138771, 51904, -51577, -45472, -114873, 152462, -39648, -172984, -132800, 42656, 48496, -103803, 242036, 65684, 141577, -151738, 209215, -339818, 184841, 125231, 122463, 52501, 69702, -301027, -104180, -211764, -96821, 104566, -64740, -277677]
12439b77677G6971c96774Q1446a28297d8113k18359Q8749E5124c9256r6284G2771
12427a13799F5967A1001e4819A26434J13342j15197a55517C67444F2510f151j14635
12416a20786A0552e9342J3006B66225D6464k1976M3549i36C9961d9276j72751
12405b22027C9645J2982A083d1125j43896K8944l0872j14441a1050j33992d3064
12393a65667F3842g6473a4764j14919K6660F465J65805a70768A0888K72463G8751
12381A23323F0495J6664K465j427L0055K2317g8486B2104K66158d0587B28377
12369F877c8935n0571L2834l3531G4427e2684k52470C3434J17438C7878J51890
12358A89768d5948F2190L687K228c867n2775j5107A5977a12943j47873E6172b33084
$$ y = [-277677, 76971, -396774, -315328, -128297, -48113, -266472, -177723, 55124, -39256, -135540, 72771, -113799, 65967, 11001, -54819, 126434, 239776, 124579, -155517, 367444, 62510, -6151, -120786, 10552, -59342, -46336, 266225, 46464, 24488, 68037, -936, 39961, -49276, -222027, 39645, 52627, 1083, -41125, -185021, -156077, -186949, -301390, -11050, -145042, -43064, -165667, 63842, -76473, -14764, -129683, -103023, 6465, 172270, -170768, 10888, 283351, 78751, 123323, 60495, 77159, 79624, 78197, 108252, 130569, -78486, 22104, 288262, -40587, 228377, 6877, -38935, -89506, -56672, -90203, 74427, -52684, -305154, 33434, 150872, 37878, 189768, -45948, 62190, 65877, 68105, -3867, -56642, -71749, 15977, -112943, -260816, 56172, -233084]
12345H8759b01637B2470b4729C4977R230L01744a01359A55802n5897a67626E9490
12333B88408P4945A56765D5637a73081K3766A45977J10456O9749M14509I9302
12322A44528D3482N5910G633c5839A71013p1661f2710A3872J86981a105H2391
12310B68271j26476R3669A11070D0757b754C99026a88206B12597D3261J87951
12300B31212o745j10877b72744B8641d8648A5308K62056G8594A8662M0717a0137
12288A40576A7677b24768a0488A52865n079J90702c5482I4666J65689d6642A72012
12276B99948j36263d5648D32942a53955K7632A46342A5632a53174A99151J09639
12266C08790F5089a09975E2046b5155C19025j47463E4649a8312C3586b2258A72556
$$ y = [88759, -201637, 22470, -24729, 34977, 44207, 345951, -101359, 155802, 99905, -167626, 59490, 288408, 363353, 156765, 45637, -173081, -149315, 145977, 256433, 326182, 740691, 99302, 144528, 43482, 99392, 7633, -35839, 171013, 99352, -62710, 13872, 200853, -1105, 82391, 268271, 141795, 235464, 111070, 40757, -2754, 399026, -188206, 212597, 43261, 231212, 224467, 113590, -272744, 28641, -48648, 15308, 277364, 78594, 18662, 59379, -10137, 140576, 17677, -224768, -10488, 152865, 147786, 338488, -35482, 94666, 260355, -46642, 172012, 299948, 163685, -45648, 432942, -153955, -126323, 146342, 15632, -153174, 199151, 308790, 65089, -109975, 52046, -25155, 319025, 171562, 54649, -18312, 33586, -22258, 172556]
12254A84582o017F4550Q7599C4328e0911q1584B31943m9051G5288k5074P6494
12243A26708d33120a46586K8597l2383B75578a49303L6319j15575C48697a45813
12232a04593B4750P2673m6755A7972K41688r8846b39686A09081A4211J08261a35755
12220c04676C40957j05506n7998D0293L6574K891J62067i1798F6884J27611J50112
12209C44607G4297d3279B65062m5759e9102A20899J52936b4553j8427A44808l3704
12198A11104m9811J26136P5294r6109e2975B63649M9263A54863a70711g4751B48662
12186D4031N5020i4126k2247A81749c5470A29822a00146K8696G5446J58198H6051
12174B8804J48638q1959N1876K29746A70854a869j57844B07461O5493K0840J6318
$$ y = [184582, 178565, 64550, 152149, 34328, -50911, -132495, 231943, 182892, 75288, 50214, 126708, -433120, -146586, -117989, -150372, 275578, -149303, -112984, -228559, 348697, -145813, -104593, 24750, 97423, 50668, 17972, 259660, 160814, -239686, 109081, 14211, 122472, -135755, -304676, 340957, 235451, 177453, 40293, 76867, 79758, 241825, -91798, 66884, 194495, 344607, 74297, -43279, 265062, 219303, -59102, 120899, 273835, -24553, -42980, 144808, 111104, 61293, 187429, 262723, 166614, -52975, 263649, 312912, 154863, -170711, -74751, 248662, 44031, 99051, -94126, -116373, 181749, -35470, 129822, -100146, -71450, 75446, 233644, 86051, 28804, 177442, 95483, 147359, 377105, 170854, -1869, -159713, 207461, 272954, 293794, 310112]
12163C10112k2048G089J01617a19464F1463K53719a17421A29607B7774J13212
12153A40986d4864p544C6534a96952B90967r1927e0165A11909h0776I0259K16054
12142C06313i644o6751J7921A72061a13842b100F7802O7489b82355B77767E7861
12130A51658F3579a93157D1912a04783c7965k18219e3311E5637K95369j08792
12120B42214J05447j45354J07936e8072B14974J94451A38915A4699K21889F0088
12109A16762E2804K70044j57702o1393K7792e9480l1778B91087A10836b19484
12098b1349E6298J67907K52738C3158J27176C4967D598a03221q4113A45755F2897
12086a63218O1593H8459J83520J28372j84815A04111C5505f1460D3048b5728n7179
$$ y = [310112, 288064, 7089, 108706, -119464, 61463, 315182, -117421, 129607, 27774, 140986, -44864, -52408, 36534, -196952, 290967, 199040, -50165, 111909, -80776, 90259, 306313, -9644, -76395, -58474, 172061, -113842, -2100, 67802, 135291, -282355, 277767, 57861, 151658, 63579, -193157, 41912, -104783, -37965, -256184, -53311, 55637, 351006, 242214, 347661, 202307, 310243, -58072, 214974, 409425, 138915, 14699, 236588, 60088, 116762, 52804, 322848, 165146, 103753, 131545, -59480, -91258, 291087, 110836, -219484, -21349, 56298, 224205, 476943, 33158, 160334, 34967, 4598, -103221, -187334, 145755, 62897, -163218, -101625, 88459, 271979, 400351, 215536, 104111, 35505, -61460, 43048, -25728, -82907]
12075h2907B08080O3150a70768r667E3656j3187f6485j06879A38880J76196a25319
12063c78436a3900H3116a84379n080a8832k3864l26514A3245L0742a3072k3507
12052c6579B8949i735n1117l8531b9810A21140L7221B5207J39519f204C30974
12040c02637O9373D284R5163J40308n4090h8066o7823d3727A52790K3202l1412
12029A44580d06257B99678f2823l08373a04810E0392k1992j1357C263J19348b3487
12017A98440a82411A95740a71659p3303r06h565B49068j4662A4424Q3763f2755
12005E9051j0520g6998F2724b46016g5607o7165M5435k0064A51072M4946a14470
11993a73973K3560B59990K00727a86364A31179b61701M9927L8804C8483g1357
$$ y = [-82907, 208080, 271230, -170768, -180435, 53656, 40469, -66485, -173364, 138880, 315076, -125319, -378436, -13900, 83116, -184379, -189459, -18832, -42696, -369210, 13245, 43987, -13072, -36579, 28949, -9735, -60852, -99383, -29810, 121140, 158361, 25207, 164726, -6204, 330974, -302637, -233264, 4284, 99447, 239755, 185665, -88066, -155889, -43727, 152790, 175992, 144580, -406257, 299678, -62823, -371196, -104810, 50392, 28400, 17043, 3263, 122611, -23487, 198440, -182411, 195740, -171659, -244962, -245868, -8565, 249068, 234406, 14424, 98187, -62755, 59051, 48531, -76998, 62724, -246016, -75607, -142772, -97337, -117401, 151072, 196018, -114470, -173973, -150413, 259990, 460717, -186364, 131179, -261701, -211774, -172970, 38483, -71357]
11982A2174b65203c2437B35309E245a50734j32114Q9897A21621b93534J14074
11972a79460k43816D47753a46880J6873k2372k82093J30835F0232a26511b5A15077
11960h7318E3153a21814m69D411c41958B96962G4733b6018A03181J16447a31859
11948a27563d2775A67784F8138F232J94082r1658D4355b36130h4621D6972a10867
11936a15108F2365F924K9914c43926n077r6827a3476H0325K702B089b96834J09532
11924a87302P9441A45592L3006F8631c34573J05777g9288A21338L5079c2759j22330
11913a55089L2461d3168j54476R279B44739g8555A82811a02766J8588k58188E6418
11901A05872b22844P0965j55140a05237D8256a44993C2991L34707a06734j56659
$$ y = [12174, -265203, -32437, 235309, 5245, -150734, -282848, -192951, 121621, -293534, -179460, -423276, 447753, -146880, -130007, -152379, -434472, -303637, 60232, -126511, -25, 115077, -87318, 53153, -121814, -122283, 4411, -341958, 296962, 74733, -26018, 103181, 219628, -131859, -127563, -42775, 167784, 68138, 6232, 200314, 108656, 44355, -236130, -84621, 46972, -110867, -115108, 62365, 6924, 36838, -343926, -349003, -445830, -13476, 80325, 83027, 2089, -296834, -187302, -107861, 145592, 178598, 68631, -334573, -228796, -79288, 121338, 156417, -32759, -155089, -122628, -43168, -197644, -188365, 244739, -78555, 182811, -102766, -84178, -342366, 56418, 105872, -222844, -151879, -307019, -105237, 48256, -144993, 32991, 367698, -106734, -263393]
11891b63393h3352A67404a20040P160B27578B5588a42930g233l42746J64627d9025
11879A16320a83499k9530a1125m29798c3793J0989A1583b45158j596a7546I6417
11867B1606O6339c26411h8263H4341C6813J66713i5653E3835b7010l76422G9422
11855b40924A5824g4086A23564b85427A80185a91898k17410a57106l13573G3556
11844B16422F058a26479B22124A0756n21a51756B21195f5972k26935G1771a25855
11832D7349K85804b12706C0431J49222k6997d34351M2297f0800j39271P0290l38635
11821d68416g9994B23935K0080i3674b2605i719l271r41j52769A2558c68700a1629
11808F7809a47506g414j88892A2254a82741P7710B7957K08377M1196o6912O196
$$ y = [-263393, -83352, 167404, -120040, -112880, 227578, 25588, -142930, -7233, -349979, -185352, -49025, 116320, -183499, -213029, -11125, -440923, -33793, -22804, 11583, -245158, -246754, -17546, 96417, 21606, 87945, -326411, -88263, 84341, 36813, 203526, -95653, 53835, -27010, -403432, 79422, -240924, 15824, -74086, 123564, -285427, 180185, -191898, -409308, -157106, -470679, 73556, 216422, 6058, -126479, 222124, 10756, 10235, -151756, 221195, -65972, -292907, 71771, -125855, 47349, 333153, -212706, 30431, 179653, 152656, -434351, -392054, -60800, -200071, -129781, -468416, -79994, 223935, 244015, -93674, -22605, -9719, -12990, -13931, -166700, 12558, -368700, -11629, 67809, -147506, -7414, -196306, 12254, -182741, -105031, 27957, 236334, 277530, 210618, 216814]
11797B16814P9562C0709c04856e1527B039c5850H0136F050a05982A70052o0091
11786A09961J42489o6138J61516b90482Q3061k8055b7569H9973C4191a27004A72970
11774D84466a55404k46611H7234J09700a01821q5184A41912C989d2520k78402
11764c20922J43532B29739B7300a27405k09H5669b22489C01672n9958a92937A39479
11752a81592B0167i6104A7287J30778f7985K90A32660a68493C7106d6232A31914
11740A95012d30117A65017c02737a21038C3493R6788I86a17010G7010a32320j4708
11729a47028A16533K13210d72489f636l7505E7508a08012A2596b23048J9702E3326
11717C2051G623K4303c01754Q6954H0881a61535j3282A29989Q1572k7048b3863
$$ y = [216814, 296376, 30709, -304856, -51527, 2039, -35850, 80136, 6050, -105982, 170052, 109961, 252450, 186312, 347828, -290482, -207421, -235476, -27569, 89973, 34191, -127004, 172970, 484466, -155404, -402015, 87234, 196934, -101821, -187005, 141912, 3989, -42520, -320922, -177390, 229739, 27300, -127405, -127614, 85669, -222489, 301672, 241714, -192937, 139479, -181592, 20167, -96104, 17287, 148065, -67985, -67695, 132660, -168493, 37106, -46232, 131914, 195012, -430117, 165017, -302737, -121038, 33493, 130281, 986, -117010, 77010, -132320, -147028, 116533, 329743, -472489, -6636, -44141, 57508, -108012, 12596, -223048, -203346, 53326, 32051, 7623, 31926, -301754, -214800, 80881, -161535, -174817, 129989, 211561, 184513, -23863]
11705C5152L9313Q5821a72624E63232a03642G9628J84018b06716A08183a4554
11694a96351M1289A31511e9475j88996A40654c2446n6943A59995B7905j0395a82067
11682C25519G8462J28191c49457H0439b05956e8872A13771e8566A97921J95126
11672C93047j62906k9960b91972C34274c17873J45540L4072d6997A8363e0319
11661a9027n2277B4740a47377c4574A15868a81768C62777j1830j40135i1354D54088
11649I2202C2100b26960A45589Q1341a89312h795j13720d3656A08205K1072c81356
11637A17379h1671A02741b85378I989R4479j3936c13207a6143m8014n6286j26865
11626b47308d3709j14461D8995B618b15590b6404j11992F8938L1024P8258P1453
$$ y = [35152, 74465, 160286, -172624, 563232, -103642, 79628, 263646, -206716, 108183, -14554, -196351, -155062, 131511, -59475, -248471, 140654, -32446, -89389, 159995, 27905, 17510, -182067, 325519, 78462, 206653, -349457, 80439, -205956, -58872, 113771, -58566, 197921, 393047, 230141, 200181, -291972, 334274, -317873, -172333, -138261, -46997, 18363, -50319, -19027, -71304, 24740, -147377, -34574, 115868, -181768, 362777, 350947, 210812, -91354, 454088, 92202, 32100, -226960, 145589, 226930, -189312, -8795, -122515, -43656, 108205, 129277, -381356, 117379, -81671, 102741, -285378, 9989, 104468, 90532, -313207, -16143, -64157, -120443, -247308, -43709, -158170, 48995, 2618, -215590, -26404, -138396, 68938, 99962, 178220, 249673]
11615B49673g0448j23877M1982f5161D6196a22396M8420B61688b20580q0970J13244
11604a88306A37054J23593i5565o4598H6495c4337A76150d14373C11319j34231
11594A77088f0401A76421j883d7570a9357p8520i571n8572j24013o3671D7729
11582g3849c2280A38089I749d0730a4178k48047F2588J81956A11612i5282r0549
11571a85831A70739b5833j27889A04340m7005J28889c56908a59786C57203B7050
11560a65298b7852n5795a6590A80272B8495a41439O5552A71068E3398J3492C69
11548c5389E0412h561L698H5667g3331C14819A54325a44656B02510b91267P1445
11537b19822I3577a04077j13377F0738J8903i1558A47463C7113a89676A13280
$$ y = [249673, -70448, -194325, -152343, -65161, 46196, -122396, -73976, 261688, -220580, -301550, -188306, 137054, 260647, -95565, -160163, 86495, -34337, 176150, -414373, 311319, 177088, -60401, 176421, 174538, -47570, -19357, -97877, -9571, -68143, -192156, -255827, 47729, -73849, -32280, 138089, 9749, -40730, -14178, -262225, 62588, 244544, 111612, -95282, -185831, 170739, -25833, -153722, 104340, 57335, 186224, -356908, -159786, 357203, 27050, -165298, -27852, -83647, -16590, 180272, 28495, -141439, -75887, 171068, 53398, 66890, 369, -35389, 50412, -8561, -4863, 85667, -73331, 314819, 154325, -144656, 202510, -291267, -219822, 93577, -104077, -217454, 60738, 79641, -91558, 147463, 37113, -189676, 113280]
11526A6797K02304a8359o1555B5726J50556g552l6490l3645E9613m320K24576
11515B79869f0811p1713I268K89319O2886a1772B07668E2104a6418I9557K17316
11504C16873a13520A93535J58221j43802j3141i1228A02554a56713R125B60803
11493A88992D7520J15628a8510B40286A0169J34453D4029c15780B29266f2103
11482i452A72498P2426B0201M6378K30564F4460K1900J07663Q4351a1258j86955
11471a98213E10038d8408C27985j34268K34359I9114K9416M0857F8839J83561
11461B52400k7930H4182L78515A56280K16256a50223M9070M9864k3904q8672F4049
11449C08124j21908b23410A12677J34160F1123h2626g222j60412C8284a28769
$$ y = [16797, 219101, -18359, -79914, 25726, 176282, -7552, -44042, -77687, 59613, 55293, 279869, -60811, -132524, 9268, 298587, 361473, -11772, 207668, 52104, -16418, 99557, 316873, -113520, 193535, 351756, 207954, 194813, -91228, 102554, -156713, -147588, 260803, 188992, 47520, 163148, -18510, 240286, 10169, 144622, 44029, -315780, 229266, -62103, -9452, 172498, 244924, 20201, 66579, 297143, 64460, 86360, 194023, 278374, -11258, -198213, 510038, -48408, 327985, 193717, 428076, 99114, 128530, 169387, 68839, 252400, 224470, 84182, 462697, 156280, 372536, -150223, -101153, -51289, -75193, -163865, 64049, 308124, 186216, -223410, 112677, 246837, 61123, -82626, -7222, -167634, 38284, -128769]
11438G5404a01233m34693c2707A86061m6563n5902f788A13225b93265B45631k2979
11427B22652j08899D6327N1965Q465A7006f1260B17821a06077k9357j52797c03
11415b42401a20668A00614M2019a22189d5751B3414a45696o9947K5771f0259K2565
11404c7694j37952k54052A56434F550b19051N2741I6030b8745k62124G5825J26267
11393B02092K42137a51522C29609C0279J49984p9093b94801a5744A25395b8074
11382I0093J2817c31389a39482A89359j2242a52533d2762q5324d726p7403m2836
11371a24965j36281A7340i746B6896a46057k3613a4416A33019k5202J30799E1308
11359B31679D6711b2315B01423a85978O0872A29579f3496j52943I9604a93070
$$ y = [75404, -101233, -535926, -32707, 186061, 139498, 83596, -6788, 113225, -293265, 245631, 222652, 113753, 46327, 98292, 106757, 17006, -61260, 217821, -106077, -135434, -288231, -303, -242401, -120668, 100614, 142633, -122189, -45751, 23414, -145696, -215643, -189872, -60259, -37694, -175646, -429698, 156434, 6550, -219051, -166310, 96030, -28745, -290869, 75825, 202092, 444229, -151522, 329609, 30279, 180263, 101170, -294801, -15744, 125395, -28074, 90093, 102910, -331389, -139482, 189359, 177117, -152533, -42762, -128086, -4726, -82129, -124965, -261246, 17340, -9746, 26896, -146057, -169670, -14416, 133019, 107817, 238616, 51308, 231679, 46711, -22315, 201423, -185978, -125106, 129579, -63496, -216439, 99604, -193070]
11348F1616M4153n2655R8877l531c0021L476A07798O8854K1251r1533a14669r0511
11336b05180j0723f5093n3946F0202K6551c7060k46835a37863e8502K4271j14582
11325a48813A5654b51597N044A99428g0567c5001B55556d7811J8355j59105A02701
11313a26209G2077B4182h372G7507b56800B54787m2932b243k33652L3177c3221
11301c72215A22538D9189A8681a63871m9503d636l58621i3002o8862j19585b0710
11289b6847m70969h8643j54923b6429H5362C0375a88646B6864h0792A78838e5790
11277a42327A24166d7698A8318a57722j39798a9553k00682O7047K9833j7851E5382
11265G334b68003N5529Q9611O1346j52850A48365D9953a63733A08286O8068a23517
$$ y = [61616, 105769, 53114, 151991, 148460, -30021, -26545, 107798, 176652, 197903, 106370, -114669, -205180, -215903, -65093, -119039, 60202, 86753, -37060, -283895, -137863, -58502, -34231, -148813, 15654, -251597, -246553, 199428, -70567, -35001, 255556, -47811, -29456, -188561, 102701, -126209, 72077, 24182, -8372, 77507, -256800, 254787, 211855, -2243, -235895, -202718, -33221, -372215, 122538, 49189, 18681, -163871, -213374, -4636, -363257, -93002, -161864, -281449, -20710, -26847, -497816, -88643, -243566, -26429, 85362, 30375, -188646, 26864, -80792, 178838, -55790, -142327, 124166, -47698, 18318, -157722, -297520, -19553, -220235, -153188, -123355, -141206, 55382, 7334, -268003, -212474, -122863, -61517, -214367, 148365, 49953, -163733, 108286, 176354, -123517]
11253b67193H1625f0235J1332A34815F5960a09694p2788N1743r131O270b50p0367
11241g0617k26849b1608B44901e2231l4335B62199l5390D4676a34514G2013c5224
11229B41024E8104a58268j00684A13918I195i5944A72243e20043F1822J94201
11219B56023o8631c0669k58603Q9360c7496D7712f0192j83764o3430j82981C3179
11207c0331r4799H8018j0931c15858C40669A50627b8182p2494q9582r4397I8338
11195b16949G6572J24630a91128e1801q3434c303o8993C2397a51303N5501l9439
11184a35241l15372b19131G2099b68083B02998N170J17281A3411f581j96143i5920
11172A73339b9303j6492k74791A44748a6227j55455Q3870B01242E323M6322b07063
$$ y = [-267193, 81625, -60235, -48903, 134815, 65960, -109694, -182482, -130739, -139870, -133600, -250, -70617, -297466, -21608, 244901, -52231, -86566, 262199, 226809, 44676, -134514, 72013, -35224, 241024, 58104, -158268, -258952, 113918, 9195, -95944, 172243, -520043, 61822, 256023, 187392, -30669, -289272, -199912, -37496, 47712, -60192, -243956, -307386, -490367, 33179, -30331, -125130, 88018, 77087, -315858, 340669, 150627, -28182, -100676, -190258, -284655, 98338, -216949, 76572, 201202, -191128, -51801, -135235, -3303, -72296, 32397, -151303, -95802, -135241, -450613, -219131, 72099, -268083, 202998, 208168, 325449, 13411, -6581, -202724, -95920, 173339, -29303, -45795, -320586, 144748, -16227, -171682, -87812, 201242, 5323, 51645, -207063]
11160C88989a03335D46597j41607B2304A1151h7909A6582K00024a51729H9657
11149e233B03351a22859D15207d9457B9550a54982D4377a70129A72962c5276k3850
11138e9126k38252B91371h5899j74723h0560A96087p1655B2698J26372a7752j03235
11127a20987d0728k61017F9794b87902A32508a67673A73359l5203b41774A02748
11116a19028J4653c5738A2753J02641c04933A91269K1608a85407J0845D00549
11105A09751J2562a34047l071A87204c75379D9657c3645C17479C8139a70957A26284
11093a54260D2217n056J1082g1880a0460A01451J3875N27494f1001A14541b86839
11081c8872B5391b09968B6639K34917k9171e0285B52452E8969c90981A50010J23299
$$ y = [388989, -103335, 446597, 304990, 22304, 11151, -87909, 16582, 216606, -151729, 89657, -5233, 203351, -122859, 415207, -49457, 29550, -154982, 44377, -170129, 172962, -35276, -59126, -297378, 291371, -85899, -260622, -80560, 196087, 124432, 22698, 149070, -17752, -120987, -40728, -301745, 69794, -287902, 132508, -167673, 173359, 138156, -241774, 102748, -119028, -104375, -35738, 12753, 115394, -304933, 191269, 212877, -185407, -174562, 400549, 109751, 122313, -134047, -137118, 187204, -375379, 49657, -33645, 317479, 38139, -170957, 126284, -154260, 42217, 37161, 48243, -71880, -10460, 101451, 115326, 642820, -61001, 114541, -286839, -38872, 25391, -209968, 26639, 261556, 232385, -50285, 252452, 58969, -390981, 150010, 273309]
11070B73309b00191A88358N486F6078J39514J5317q5361b7388B32727r7532N80
11059A35775E7869P1382J83290k3814j03887M41479k11734K1631j66454J60104
11049D29866j42948K11044L47965C95503J05464M2130k0146L17302k19884J22716
11039G43085l22339J50484L70449l96033J71035A23935K21286J19409P5038j67593
11029C72075J70382j86528J25137J18728J286J24740k09232j2855k14462M39384
11019G28655k84897p3170K06075k21128J87394J4028j64471R5424j32999J54885
11009E09796K53446C25801A44965J47778P5387K54245k98420q1614K89567A63327
10998C88107M1026j48767j748K46543j57804m5152P6215l172A87842M15527k54345
$$ y = [273309, -200191, 188358, 193844, 66078, 205592, 220909, 135548, -27388, 232727, 135195, 135775, 57869, 129251, 312541, 288727, 184840, 626319, 414585, 436216, 269762, 429866, 286918, 497962, 845927, 395503, 500967, 543097, 522951, 840253, 620369, 743085, 420746, 571230, 941679, 545646, 716681, 123935, 345221, 464630, 539668, 372075, 542457, 355929, 481066, 599794, 601080, 725820, 516588, 503733, 289271, 728655, 443758, 370588, 576663, 355535, 542929, 556957, 392486, 487910, 354911, 509796, 763242, 325801, 144965, 292743, 368130, 622375, 323955, 242341, 531908, 163327, 388107, 429133, 280366, 278618, 525161, 367357, 322205, 398420, 395248, 187842, 603369, 349024]
10987C49024L66149K14354D55749J22075j54922J42779L15489j87590K0890j91431
10977E23039J82924k77211M69381l54533L42185J69021p9416K13080O82624j6021
10967A855073M8274j17870K16187k54394J31244j20218k91057k30823l4594J30711
10957A332533l00835j04000L84433R035j81828j97260N45007l09123j54943r6380
10947I26639o5731j23309r6814k08132J7520K67395B42853C8187K9986J34501
10937B02674F6826K03173O4540a05830D57042A78171O3451Q4770c9344C58074
10926C28846a05729M3865A7858J3925Q406a23734J812A42373J26643q9973j9065
10915A59978a07766d841H8829B1399a99644j53406e2775C1192K41503n8312R4037
$$ y = [349024, 715173, 929527, 455749, 577824, 422902, 565681, 881170, 693580, 714470, 523039, 705963, 428752, 898133, 543600, 885785, 1054806, 975390, 1188470, 1871094, 1855073, 1903347, 1785477, 2001664, 1747270, 1878514, 1758296, 1467239, 1236416, 1201822, 1332533, 1031698, 927698, 1312131, 1321166, 1139338, 942078, 1487085, 1177962, 1023019, 926639, 860908, 737599, 640785, 432653, 450173, 717568, 242853, 38187, 68173, 202674, 66826, 269999, 334539, -105830, 457042, 178171, 241622, 326392, -39344, 358074, 328846, -105729, -61864, 17858, 31783, 40189, -123734, -121922, 142373, 269016, 179043, 159978, -107766, -4841, 88829, 21399, -199644, -353050, -52775, 31192, 272695, 214383, 308420]
10904C08420D3350c11338C6625b96588A14426a6478B86639f1999k43800D9644
10893a22195I2705b29485A10625h0273c5573F2218k0507d616j22427j29393L0616
10882b25820c9829j44394A03476d6608A27948a60447k4860f0021j34095e5389
10871a63053F5168a42736B74108a79635p0614F6861J15388m5699b74109I2745
10860a98280B64050g6521A20596a7344r0202E7614Q314a59021r3210f4533e609
10848A08720h0868E936a85595O4113d4921k8657A44702c1081j81615e5385e302
10836A55724a85861E2381L1791a58733p424A2301K18359b7344l91167a31609E7137
10824a54396g0227o3311q7831a01055A75079M6171a7845o828I5562b78846N9007
$$ y = [308420, 43350, -311338, 36625, -296588, 114426, -16478, 286639, -61999, -305799, 49644, -122195, 92705, -229485, 110625, -80273, -35573, 62218, 41711, -4616, -127043, -256436, -225820, -39829, -184223, 103476, -46608, 127948, -160447, -185307, -60021, -194116, -55389, -163053, 65168, -142736, 274108, -179635, -250249, 66861, 182249, 136550, -274109, 92745, -198280, 264050, -76521, 120596, -17344, -107546, 57614, 65928, -159021, -252231, -64533, -5609, 108720, -80868, 5936, -185595, -121482, -44921, -73578, 144702, -31081, -212696, -55385, -5302, 155724, -185861, 52381, 84172, -158733, -166157, 12301, 230660, -27344, -418511, -131609, 57137, -154396, -70227, -133538, -221369, -101055, 175079, 221250, -17845, -24673, 95562, -278846, -219839]
10813b19839A02263f373A1781M4470K16897d4539o845j48399b6826D8959a39089
10801a455E8605M64g506D6458c0530B7286g1526m9371A08107B4576a04406n8777
10789a63183d6444H2464b45338A16654a85787p135i2351L7769A21977k4683J42211
10778B39505a04228d2693i528A22484a13207j49105A90711d2831C3261b35522
10767H6662J07200h8127j26524e1665m8477A81886G8828b40116A56685a76853
10756F827J33222a7722A08489C3201f2630j55231g0026D5052J96304F0564c3591
10744d0184B60435o5966a54515j7746P8696E8795b55523f4950k98062J55914J01488
10733a05610r1298A73097a97372A60150c06514k45213I5327j0816a48387B02551
$$ y = [-219839, 102263, -6373, 11781, 56251, 273148, -44539, -51384, -199783, -26826, 48959, -139089, -1455, 58605, 59069, -7506, 46458, -30530, 27286, -71526, -120897, 108107, 24576, -104406, -163183, -46444, 82464, -245338, 116654, -185787, -192922, -92351, -54582, 121977, 97294, 239505, -104228, -42693, -9528, 122484, -113207, -262312, 190711, -42831, 33261, -235522, 86662, 193862, -88127, -214651, -51665, -100142, 181886, 78828, -240116, 156685, -176853, 6827, 140049, -17722, 108489, 33201, -62630, -217861, -70026, 45052, 241356, 60564, -33591, -40184, 260435, 194469, -154515, -172261, -93565, 58795, -255523, -64950, -363012, -207098, -105610, -196908, 173097, -197372, 160150, -306514, -551727, 95327, 84511, -148387, 202551]
10722A29673b58665A4831a57606I2462d74103b05535A97848i5393e188B99265
10711b00345G6213c14982a05107M3685B48789m4258G6753K469a14014k54943a70468
10699C1408J06672a98713d547j10675d1169k31222i2679A77431B6545a63673N1818
10688a11855A24210b11888R0966j08301O1247c7049k13807A07798a68282j25173
10678b93455r8784c7196j43003K1926j30588M3091A65983A5409j729a47727n2130
10667a99857c7273n31704g0432A4844h2593E2251a31184b2497A3790J07159a20736
10655b09657g055l81663G7062c6979j49105o3993c4510J36A84792B5874b61947
10643a77819m1104g8512E5813a67258M7197j22350A87632B9083g0917E7310J74421
$$ y = [129673, -258665, 14831, -157606, 92462, -474103, -205535, 197848, -95393, -5188, 299265, -200345, 76213, -314982, -105107, -61422, 248789, 204531, 76753, 79222, -114014, -368957, -170468, 31408, 138080, -198713, -4547, -115222, -41169, -272391, -92679, 177431, 26545, -163673, -111855, 124210, -211888, -120922, -229223, -167976, -37049, -250856, 107798, -168282, -293455, -392239, -37196, -180199, -158273, -288861, -245770, 165983, 15409, 13680, -147727, -199857, -37273, -568977, -70432, 14844, -82593, 52251, -131184, -22497, 13790, 120949, -120736, -209657, -7055, -388718, 77062, -36979, -186084, -250077, -34510, -34374, 184792, 25874, -261947, -177819, -218923, -78512, 55813, -167258, -120061, -242411, 187632, 29083, -70917, 57310, 231731]
10632B31731B5231R863d2195H2773L1064b26575R0075g882A63549b94537a26406
10620b22644l3798a00511m039r9610M3446C43086b65656e3789a222r7616j05168
10609b04006R2958K854A93428h589j47125M8553B2443K40K43680f3628A05335
10597h0828l22042d7815A02714a04918c6787B83461a56437N665j06940j67291
10587d25003a05717F8338O3759a01839K4288B62691B0402J58157a79541M7334
10577a32207j039G7250J26829a66591g7877j59176H3899J83463b29307I4563a08708
10565A91120O7669h4745b1847o1117a7456c923h32A37593n1761J20612a2068q2205
10553i4273J8506A38128a15552b5210C2353N4556J57534A20229Q0417b89852H0625
$$ y = [231731, 25231, 35094, -42195, 82773, 113837, -226575, -136500, -7882, 163549, -294537, -126406, -222644, -256442, -100511, -104550, -204160, -160714, 343086, -265656, -53789, -1222, -98838, -204006, -111048, -108194, 193428, -8589, -155714, -107161, 22443, 22683, 266363, -63628, 105335, -80828, -402870, -47815, 102714, -104918, -36787, 283461, -156437, -150772, -257712, -425003, -105717, 68338, 132097, -101839, -77551, 262691, 20402, 178559, -179541, -132207, -133246, 77250, 204079, -166591, -77877, -237053, 83899, 267362, -229307, 94563, -108708, 191120, 258789, -84745, -21847, -82964, -17456, -3923, -832, 137593, 85832, 206444, -12068, -94273, -75767, 138128, -115552, -25210, 32353, 86909, 244443, 120229, 200646, -289852, 80625]
10541a39636o3525g0724j05330f8005r9133F1371c6766l49765B6972e7928j83412
10530b41340D8813K11560J16527a18640G9024J13824d57500J45322A93672c46549
10519A49255g1859a5826o6786J6360N863a8122j94541l49630d5934j86068Q9705
10508a42297L7079H6444j715f0824c950m35999G3043B5846a37053c2989G516b38270
10495f1414A14329L0132a71439e3212j36427d6319k36103I6984L7913a74929a4165
10483h718l43675J1866D21664p8527f7441A29021B0185f2831J0154B31718A0493
10471B47577A23379J28001f3970B04477a02199M2721A33918i4323J2314k00156
10461b82165A78238g4441B7233b58976A61070b32752j06194a9285j98511k43070
$$ y = [-139636, -203161, -70724, -176054, -68005, -167138, 61371, -36766, -386531, 26972, -57928, -241340, 48813, 260373, 376900, -118640, 79024, 192848, -457500, -312178, 193672, -346549, 149255, -71859, -15826, -82612, -66252, -60389, -18122, -212663, -562293, -45934, -232002, -142297, -105218, 86444, 84729, -60824, -3950, -439949, 73043, 25846, -137053, -32989, 7516, -238270, -61414, 114329, 144461, -171439, -53212, -189639, -46319, -282422, 96984, 134897, -174929, -14165, -8718, -352393, -340527, 421664, 343137, -67441, 129021, 20185, -62831, -52677, 231718, 10493, 247577, 123379, 251380, -63970, 204477, -102199, -59478, 133918, -94323, -82009, -282165, 178238, -74441, 27233, -258976, 161070, -232752, -338946, -19285, -217796, -460866]
10451d60866a71283A36f0454A82802a00719M939A59131a84940O2246E171b26560
10439a67168B3990a76002a8361B97876A1620J12950b32203R4185o1144L5460D381
10427A56167o7435a56490g1273o6797k05541J50376B36748a42483A73159B4070
10416a99781H3680a13434o1514j26874e6056j62927C835J04753c28007a02202
10405A32931c04651j42132c3483d773k12788O3052l28871D1743a1816l03902A98781
10393C22607g2787B08504f5907k70397A5891K42798a1475c081n7995D05583g4404
10381A38782a65497A5579c01423A04849C1647f8489B77598h1405D9838j9721c879
10369e4602J4737A78080N5621H6531J99955r3342J872K31349A64106P8545m8267
$$ y = [-460866, -171283, 136, -60454, 182802, -100719, -95780, 159131, -184940, -122694, 5171, -226560, -167168, 23990, -176002, -18361, 297876, 11620, 124570, -232203, -138018, -199162, -163702, 4381, 156167, 88732, -156490, -71273, -138070, -343611, -193235, 236748, -142483, 173159, 24070, -199781, 83680, -113434, -174948, -301822, -56056, -218983, 3835, 108588, -328007, -102202, 132931, -304651, -446783, -33483, -4773, -217561, -154509, -483380, 41743, -11816, -315718, 198781, 322607, -72787, 208504, -65907, -336304, 15891, 258689, -11475, -3081, -61076, 405583, -74404, 138782, -165497, 15579, -301423, 104849, 31647, -68489, 277598, -81405, 49838, 30117, -3879, -54602, -39865, 178080, 233701, 86531, 286486, 193144, 195016, 426365, 164106, 242651, 194384]
10358A94384J29054J05345a2244A07932n1579J03491C1372j1690O18514B1649
10347h1162C66581J68509h9602B90929Q5784A1461K29024P2493J25053f4094A89111
10335B72807E5961E687Q3659N703d7158C27446f7397G8648J60379d49397A45415
10323A56636a56138D76528G768K4784K55932M8340B0719J89587M7728Q7357a45375
10311b92850B3875K38126j08323F5046b4878H0972c2797l6728b915j5133q9274
10300a07322B87770A0102P6345c07814A85024a27370F828L5007a83247f9458C2578
10288i8948I9507a32934L3943r4623h709j97082l0254L6972O6441N333p9111L3770
10276a72640E1428K33716r6829a55867B41728h9441j64609J08853k275k66j577
$$ y = [194384, 323438, 428783, -12244, 107932, 56353, 159844, 31372, 19682, 638196, 21649, -81162, 366581, 535090, -89602, 290929, 376713, 11461, 240485, 312978, 438031, -64094, 189111, 272807, 55961, 5687, 89346, 95049, -47158, 327446, -67397, 78648, 239027, -449397, 145415, 156636, -156138, 476528, 7768, 32552, 288484, 336824, 20719, 210306, 258034, 345391, -145375, -292850, 23875, 262001, 153678, 65046, -24878, 80972, -32797, -69525, -2915, -18048, -107322, 287770, 10102, 86447, -307814, 185024, -127370, 6828, 41835, -183247, -69458, 32578, -98948, 99507, -132934, -98991, -193614, -8709, -205791, -236045, -199073, -132632, -127299, -206410, -172640, 51428, 285144, 188315, -155867, 241728, -89441, -254050, -145197, -147472, -147738, -149315]
10265a49315k24860a01043B48774B6672h5040j95687b7116C3367g2032B71730
10254C14650h2033j34856B60251O4141J19064h8254G1051N1339b69410a30919
10243g8098A4021N8515k6052a46112j20112A33801d54431F399b94597r2113A02139
10231A15014C7763f4066r2315k7879B43830a45387j66884A44795m7403b27844
10220B45303d5722j00843I1930g3381a7880l08127m75E2836K30254D4022a3736
10208b88256J17779A651K1464J32108E4753k6628N5270k2636a67149A61746d8676
10196c5148j4962A06543c9673A64027A4429J95356A1820d056r932A4585b3629
10184a77701c6549k39884o3975J40235M1254j71347i788B49677A20885J21629
$$ y = [-149315, -374175, -101043, 248774, 26672, -85040, -280727, -27116, 33367, -72032, 271730, 314650, -82033, -216889, 260251, 324392, 443456, -88254, 71051, 122390, -269410, -130919, -78098, 14021, 72536, 46484, -146112, -266224, 133801, -454431, 6399, -294597, -386710, 102139, 115014, 37763, -64066, -156381, -184260, 243830, -145387, -312271, 144795, 97392, -227844, 245303, -45722, -146565, 91930, -73381, -17880, -326007, -326482, 52836, 283090, 44022, -13736, -288256, -170477, 1651, 23115, 155223, 54753, 28125, 83395, 60759, -167149, 161746, -48676, -35148, -50110, 106543, -39673, 164027, 14429, 209785, 11820, -4056, -13988, 14585, -23629, -177701, -36549, -276433, -340408, -200173, -158919, -330266, -9788, 249677, 120885, 242514]
10174B42514b8532L814I1137a78865H575K04739o1865c55471e9409j13491o1078
10163b33978A62838D2007a20592j19524b5318j36250F4938a83345d2982j80067
10153b23049B03430H5491a4701j48929C8336K1032q561a46371j23494l4436B62115
10141A84939a05728m4815b2725H7472a74399j02179G4575a06569A64971c77519
10130e8209l62110a52726A3520f9643A97818h5244N843d308k32388a4803o6036
10119h0839m78072i0669k08106A28729A6227i1601b3085k75881c6984k79941C07971
10107a80320h8942B98095e7973k64565A30426o2057h6987A69214D2021b92398
10096b23411h9019A26020a65963E8167O3055b5411A33053b5939j04550G170d27650
$$ y = [242514, -28532, -24718, 91137, -178865, 8575, 213314, 151449, -355471, -59409, -172900, -233978, 162838, 42007, -120592, -240116, -25318, -161568, 64938, -183345, -42982, -223049, 203430, 85491, -14701, -163630, 38336, 59368, 50807, -146371, -269865, -304301, 262115, 184939, -105728, -150543, -22725, 87472, -174399, -276578, 74575, -106569, 164971, -377519, -58209, -420319, -152726, 13520, -69643, 197818, -85244, -79401, -4308, -236696, -14803, -80839, -558911, -90669, -298775, 128729, 16227, -91601, -23085, -298966, -36984, -316925, 307971, -180320, -88942, 298095, -57973, -322538, 130426, 68369, -86987, 169214, 42021, -292398, -223411, -89019, 126020, -165963, 58167, 121222, -25411, 133053, -25939, -130489, 7170, -427650]
10084a40963C0167a9952A32369b26641A24317e235E2367b09223j14783J02438
10074b21568E9110b63344k55610a62895c7864A19328b51213J00907I4017M0372
10064A34389b1585k22386N0492o6607a229A7740d14299A70134a0434k73448D5717
10052C3804J37467h8946B18923a42714A21098c9595j7478A54425a35273n585H7823
10040d0291L998E5735c25163m1407c6402B31628I4540c16106B0482O8100h4004
10028a68441k04517J56601H3551J20283d6282B068a07288k34658d5842j91171
10018b37013J4271j62361C5543A0652d3694A45524m5872g0349j5469a6547o2340
10007g8887A66450a85040p1888A03836Q1413a48130b9137k43104A56187l3517
$$ y = [-140963, 30167, -19952, 132369, -226641, 124317, -5235, 52367, -209223, -324006, -221568, 59110, -263344, -518954, -162895, -37864, 119328, -251213, -150306, 94017, 134389, -21585, -243971, -193479, -260086, -1229, 17740, -414299, 170134, -10434, -283882, 45717, 33804, 171271, -88946, 218923, -142714, 121098, -39595, -57073, 154425, -135273, -140858, 87823, -40291, -36293, 55735, -325163, -366570, -36402, 231628, 94540, -316106, 20482, 88582, -84004, -168441, -372958, -216357, 83551, 203834, -46282, 2068, -107288, -341946, -45842, -237013, -222742, -385103, 35543, 10652, -43694, 145524, 99652, -70349, -85818, -16547, -78887, 166450, -185040, -256928, 103836, 185249, -148130, -29137, -272241, 156187, 122670]
9997A22670f5655D7571b61872b7144j03108o4408c9838l41264A57623h298o701
9986a4999j48032B16607b98696e9036A86206N7782c19684J37980I6082d03014
9975b6270F367O1385g1003l2632j31865m1146B46571n8689F0046e7464E6775K34729
9963B91504h2646k15573a48407L3138A28725l9817e0679j60080B83403a12609
9952h2107k0411k74180a78826E8250b2070k0871j37842A24162b946l22999b7805
9940f8422k9505r1198R0254d9301k54451B20913a4677k46333a18088j49738E6543
9928c01349I2218c57686D0405a14869D5503j7363i9932B24444g6173A45108D9985
9916a91430e2978j30948b866A19844P3892a10200d0755B8545a85824L8208A3358
$$ y = [122670, -65655, 47571, -261872, -27144, -130252, -194660, -39838, -381102, 157623, -8298, -14999, -163031, 216607, -298696, -59036, 186206, 243988, -319684, -181704, 96082, -403014, -26270, 6367, 67752, -71003, -103635, -235500, -276646, 246571, 187882, 60046, -57464, 56775, 291504, -82646, -298219, -148407, -115269, 128725, 88908, -50679, -210759, 283403, -112609, -82107, -102518, -376698, -178826, 58250, -22070, -42941, -180783, 124162, -2946, -325945, -27805, -68422, -97927, -189125, -98871, -49301, -303752, 220913, -14677, -261010, -118088, -267826, 56543, -301349, 92218, -357686, 40405, -114869, 45503, 28140, -99932, 224444, -76173, 145108, 49985, -191430, -52978, -183926, -2866, 119844, 193736, -110200, -40755, 28545, -185824, -147616, 13358]
9904C7311c56085C0438a40978j67167J11295L6804f9751m7484j26090F1958b15348
9892B5454b10553A3317b27078B63995b43936A80099c68884G2754L2759m6997b65768
9880b21133j30828N9625Q8760l0686L1251R3760G735i7090B06878d18186a5036
9868b84304C7009K213i406l7366j29490e5756j36934A09333a4384j01861C65813
9856A87093H0883b39538e4310k3998k01955a38603A65736h4975I5681b54C94071
9844b93755B08592b5777A8905K1849c4679j73898M8090O960a9037C3930O017c96918
9831B14232E2190a19964j00151A0174b47968A08115B5961e021A37692c40982g8682
9819a20249N5053J1047k16303H1205K2522a2843j49265p7855I4775F106a53817
$$ y = [37311, -356085, 30438, -140978, -308145, -196850, -160046, -69751, -117235, -243325, 61958, -215348, 25454, -210553, 13317, -227078, 263995, -243936, 180099, -368884, 72754, 105513, 58516, -265768, -221133, -351961, -292336, -203576, -234262, -203011, -109251, 7735, -97090, 206878, -418186, -15036, -284304, 37009, 39222, -9406, -46772, -176262, -55756, -192690, 109333, -14384, -116245, 365813, 187093, 80883, -239538, -54310, -78308, -280263, -138603, 165736, -84975, 95681, -254, 394071, -293755, 208592, -25777, 18905, 40754, -34679, -208577, -160487, -153527, -19037, 33930, 39947, -396918, 214232, 52190, -119964, -220115, 10174, -247968, 108115, 25961, -5021, 137692, -340982, -78682, -120249, -65196, -54149, -270452, 81205, 103727, -12843, -162108, -239963, 94775, 6106, -153817]
9807c41939D4068a51046k03272H805d5124a0922A85366b12204A76199a83338P1089
9796a12249L4055B7192g1111a8494H0952B53a91376j76717q7999A91235C4182
9784d1553j85981b1857E9906a36068k47668A52836e6803a8025l7830j38693C34223
9772a37472I0209b24124N2030J9912d7577D0083a02162B33585a5624k31358E7022
9760a62501e3921k9875p4730p3416Q0080f6355F4015c76945a9369j29420O738
9749a42051A3440h8381J1792j31804A92242b6619k6035B59010A05085k911J53649
9738B55823k22q1617q2497A8203R5340a21229j6486A56886b05480A90358c45491
9726H9299g200k70778a2124n8250h004m5760j19237N7770j9678j55373B92162
$$ y = [-341939, 44068, -151046, -354318, 8805, -45124, -10922, 185366, -212204, 176199, -183338, -112249, -78194, 27192, -71111, -18494, 80952, 253, -191376, -368093, -456092, 191235, 34182, -41553, -227534, -21857, 59906, -136068, -383736, 152836, -56803, -18025, -55855, -194548, 334223, -137472, 90209, -224124, -172094, -152182, -47577, 40083, -102162, 233585, -15624, -246982, 57022, -162501, -53921, -83796, -158526, -231942, -151862, -66355, 64015, -376945, -19369, -148789, -142051, 13440, -88381, -76589, -208393, 192242, -26619, -52654, 259010, 105085, 102174, 255823, 255601, 173984, 91487, 18203, 113543, -121229, -137715, 156886, -205480, 190358, -345491, 89299, -7200, -277978, -12124, -70374, -8004, -53764, -173001, -115231, -134909, -290282, 292162]
9714F4957n287J00913B6910K0881b88594a20056J7683k99077d6795j0776l95714
9703d53285A9298b81156a03573j69408j03859J2932D5350a7477H1880d81776B56960
9691D4454O7349b14178E6830O482L956a99267g7747B5638h8073A19775k024g8136
9678a81146F0110c51328A06568A489a49042d4200j69513O3440j59941L667c7282
9666D00032a96473A09677i7390p9165B62915i7964A18584L0536c2335j00963A3635
9654a546A01055a70287f1007K4428A6468Q4853K44688E1335J8577b25866g6802
9642c13648O5875H133b58790f9764l9141L8791k85620A66364J1869c97292a43931
9630d28725a50440B20747a04979o3009O2638j1433b6244B73677a43673H6924c38087
$$ y = [64957, 59670, 160583, 26910, 47791, -288594, -120056, -102373, -401450, -46795, -57571, -453285, 19298, -281156, -103573, -272981, -376840, -363908, 45350, -17477, 81880, -481776, 256960, 44454, 111803, -214178, 56830, 63312, 67268, -199267, -77747, 25638, -88073, 119775, 117751, -78136, -181146, 60110, -351328, 106568, 1489, -149042, -44200, -213713, -150273, -310214, -306547, -37282, 400032, -196473, 109677, -97390, -176555, 262915, -97964, 118584, 149120, -32335, -133298, 13635, -1546, 101055, -170287, -61007, -36579, 16468, 101321, 346009, 51335, 69912, -225866, -76802, -313648, -247773, 8133, -258790, -69764, -108905, -70114, -355734, 166364, 178233, -397292, -143931, -428725, -150440, 220747, -104979, -167988, -105350, -116783, -26244, 273677, -143673, 86924, -338087]
9618h4837B8568a30546K1000o1354l27771f3229A90057a19348l4772l6829A09686
9606a39584K1125m5031l7891i5914K3237l8421r1761B02597l957a61924J9286
9595a42638c63A95789b26899B60748b59564d4889A74579b6800k05625B1544b34258
9583c03041F1530a28112b9223E10734c5569k7033j51581B31433a12739H5348j5625
9572F9723k8098b59467e6117B44872d17887a71803e4808a2416A1093c54091J33187
9561b20904J7706A11008c57301e7410C9369b45317I318h6362C0570K9801a78175
9549f0544b5071H5831c591k640A87427F7777J25118a97064M5643l1068d711q2695
9537h7406b5993q4306M8888j31945l9392B1748a80886C4969J94472b08966d4159
$$ y = [-84837, 28568, -130546, -109546, -170900, -498671, -63229, 190057, -119348, -154120, -190949, 109686, -139584, -118459, -163490, -201381, -95914, -72677, -111098, -202859, 202597, 198640, -161924, -142638, -363, 195789, -226899, 260748, -259564, -44889, 174579, -26800, -232425, 21544, -234258, -303041, 61530, -128112, -29223, 510734, -35569, -62602, -214183, 231433, -112739, 85348, 69723, 41625, -259467, -56117, 244872, -417887, -171803, -54808, -12416, 11093, -354091, -220904, -203198, 111008, -357301, -57410, 39369, -245317, 9318, -86362, 30570, 60371, -178175, -60544, -25071, 85831, -3591, -6231, 187427, 67777, 192895, -197064, -151421, -182489, -4711, -87406, -25993, -110299, -61411, -193356, -232748, 21748, -180886, 34969, 229441, -208966, -44159]
9525a08410M1747j26087H1633f5406A04845b5775A94433h1276A32848d6701C747
9513b18212P3876A5808J24127o5234a60310b6388I5003e06168d0589p7222G9527
9501f5512p2422N4505m2184p4706B07916C0155g0026k75178J11877A91274d7109
9489A22987P1212r4074k6419c8099j18331e8127a1180G2398e6661k2339r4830
9478a73830A20998b24082A28467O3928b44986k7112J29817N9916K9238j73974
9468b27101k7867B5550K8727h219r1011E5039Q7444e7930B02310B3933a72731
9456f5094a1966k07192h3695A16370c69322a09793j8828C07660j33510A4248a29112
9444a55177B9640a62198F7159b05859j60037h2333a2207k12675g0772b3847C04365
$$ y = [-108410, -66663, -192750, 81633, -65406, 104845, -25775, 194433, -81276, 132848, -46701, 3747, -218212, -144336, 15808, 139935, 74701, -160310, -26388, 95003, -506168, -40589, -117811, 79527, -65512, -137934, -83429, -125613, -200319, 207916, 30155, -70026, -345204, -233327, 191274, -47109, 122987, 194199, 100125, 73706, -38099, -156430, -58127, -11180, 72398, -56661, -79000, -173830, 120998, -224082, 128467, 192395, -244986, -272098, -142281, -82365, -53127, -227101, -254968, 25550, 54277, -8219, -99230, 55039, 142483, -57930, 202310, 23933, -172731, -65094, -11966, -219158, -83695, 116370, -369322, -109793, -128621, 307660, 174150, 14248, -129112, -155177, 29640, -162198, 67159, -205859, -365896, -82333, -12207, -224882, -70772, -23847, 304365]
9432A44356j8286l7016h1633j95313c1548A4002d9633M957r4237j60749c9217
9420a96051A07547m0247a59911l27936b40847A15612a34082B7446K2380d4044
9409e6576n1054b9701j63316p4228m9246a48805a1150B4084a35544O5533j05495
9398a75506K7631C90663o8696A55661F2397B637J05699j646O4622b81856a14213
9386a19246l6545M163k13942a0091I9948a44219j61678g8823B0357b10253A470
9374a69087J5105L3399C8672J19140B3380a41815E5820c04979A2320e4795k32114
9363b86909A23091n9292J3563a72758g4176j54956B4287P8653a86799a9525N361
9352a4164A38248a31477M4311a680A19852i3938K4538j27036A88865c5433o1136
$$ y = [144356, 126070, 89054, -81633, -276946, -31548, 14002, -49633, -44676, -138913, -299662, -39217, -196051, 107547, 67300, -159911, -487847, -240847, 115612, -134082, 27446, 49826, -44044, -56576, -107630, -29701, -193017, -267245, -316491, -148805, -11150, 24084, -135544, -70011, -175506, -147875, 390663, 321967, 155661, 62397, 2637, 108336, 106690, 171312, -281856, -114213, -119246, -155791, -151628, -365570, -10091, 99948, -144219, -305897, -78823, 20357, -210253, 1470, -169087, -153982, -120583, 38672, 157812, 23380, -141815, 55820, -304979, 12320, -54795, -286909, 123091, 63799, 77362, -172758, -74176, -229132, 24287, 102940, -186799, -19525, -14164, 138248, -131477, -87166, -1680, 119852, -93938, -69400, -196436, 188865, -35433, -96569]
9341i6569n3862d3912r8222J5513j6802n7299n9797f2649A02309N1738a21639
9329c9283l33936K4245a26887I4773b71767b0835k41450A73415d6338B86275c83435
9317e3750B56081e8144j12891k6756i5780B0389b03386k4183B0605a23103B00593
9305A18467a11508M9956E5562c3417E2353f1522C7778N8571J77107g3372c6485
9293f5407j96693f9079n7117B07177n606b59913b2996l48595J30817C23956a10811
9281a17498d7026B175b46983i3401A09362C0011O1989h286A79937a39298C52134
9269a42188c1515A97870i6670B19988F0458a42615F5539K0386i0221r9083O4242
9258a25062L0029k29000a25834p244A35891g3955n1102M4829N392L1466j82239
$$ y = [-96569, -150431, -43912, -142134, -126621, -143423, -200722, -260519, -62649, 102309, 154047, -121639, -39283, -373219, -348974, -126887, 94773, -271767, -20835, -262285, 173415, -46338, 286275, -383435, -53750, 256081, -58144, -171035, -197791, -95780, 20389, -203386, -227569, 20605, -123103, 200593, 118467, -111508, -61552, 55562, -33417, 52353, -61522, 37778, 96349, 273456, -73372, -36485, -65407, -262100, -69079, -126196, 207177, 201571, -259913, -22996, -371591, -240774, 323956, -110811, -117498, -47026, 2175, -246983, -93401, 109362, 30011, 92000, -8286, 179937, -139298, 352134, -142188, -31515, 197870, -96670, 219988, 60458, -142615, 65539, 85925, -90221, -189304, -125062, -95033, -324033, -125834, -133078, 135891, -73955, -125057, -80228, -74836, -43370, -225609]
9247b25609D8044K6880a70403A52808f4945l08559J72683k9975n7891J16028f1592
9235A82489H2240d16227h9472k83935h1349b8730E9713a32047k26541G8816j6583
9224F2233J09380h7500B65660i9395k35159a17960j8858n9811A72135b93981a5051
9212c69194I1860Q788c03075e332k3402m60988C2237c57475M2017a51597I2799
9200b09268B8865b92091h6540l80513a20990I711K2536a91500H2661h5652B53878
9188b08092j18459D4729a26200j1299j54578h350C39979f06A86475k1791F6263
9176G7008h613A47486h5181B28160h4927H5914C143R9227a08233n3028j53654
9165c14915D0663c32270g6706D3868N2026B1909K16170a2069C6825b94539J28203
$$ y = [-225609, 48044, 74924, -170403, 152808, -64945, -373504, -200821, -230796, -288687, -172659, -61592, 182489, 82240, -416227, -89472, -373407, -81349, -28730, 59713, -132047, -358588, 78816, 62233, 171613, -87500, 265660, -99395, -334554, -117960, -136818, -196629, 172135, -293981, -15051, -369194, 91860, 100648, -303075, -5332, -28734, -489722, 32237, -357475, -315458, -151597, 92799, -209268, 28865, -292091, -86540, -467053, -120990, 9711, 32247, -191500, 82661, -85652, 253878, -208092, -326551, 44729, -126200, -137499, -292077, -8350, 339979, -606, 186475, 164684, 66263, 77008, -8613, 147486, -85181, 228160, -84927, 85914, 3143, 102370, -108233, -161261, -314915, 40663, -332270, -76706, 43868, 95894, 21909, 238079, -12069, 36825, -294539, -166336]
9154a66336L46N7352A40145a23533C1658h9740Q031B07299a05344A72396h5552
9142A85868a49151O0411B263J69603q3976M0496a67672L3069q7518n1768K007
9131b71882b8280C20384H9966a03797a4557k02451J00369e774n84B41885b0856
9119A23024Q2942d2166j46738C0205a10364I6170c54827a12829C0276a45803j10486
9108b56289o1694B0430a8598k80230J12308l1601j25234a6539k04134c8800A41393
9096A76558O3975A05197K41715o5807a14623B68617b39990q0234b7859m640A39512
9084b12580a1500L889j35379O50C4339A0043a0988r2651c5675B03745b68803c7334
9071f4601e153j45961j55207E5726J57741F2087a32581j19859A24673n4352a09759
$$ y = [-166336, -165990, -108638, 140145, -123533, 31658, -89740, -81709, 207299, -105344, 172396, -85552, 185868, -149151, -88740, 2263, 171866, 87890, 128386, -167672, -134603, -222121, -273889, -271882, -28280, 320384, 89966, -103797, -14557, -217008, -116639, -5774, -6358, 241885, -20856, 123024, 205966, -42166, -188904, 30205, -110364, 96170, -354827, -112829, 30276, -145803, -256289, -317983, 20430, -18598, -298828, -186520, -218121, -343355, -16539, -220673, -38800, 141393, 176558, 240533, 105197, 346912, 281105, -114623, 268617, -239990, -320224, -27859, -32499, 139512, -212580, -11500, -7611, -142990, -142340, 34339, 10043, -10988, -103639, -35675, 203745, -268803, -37334, -64601, -5153, -151114, -306321, 55726, 213467, 62087, -132581, -252440, 124673, 70321, -109759]
9059d7775j99549k8957R393g0279l50427D3114d6763j1947j28420I2897Q003g4895
9046A40671J43796B7976K00303P4695b5770n8406K9774K3873I4992a09474q9164
9035a98638G6111J37384j2254b23959C4001f971j89443k6417D4226b25900Q1920
9024a43980M4438j01361f1171G071a86471E6083a26627C6757b34852P6457D2708
9012b74212A28696E8396d9094I3705b6164p2067g121I2397c76413a53513A5032
9000f4389H7774R0034m4764j8156A7237b19011L0910h2554j00723N0166F9588
8988b75225H9759O1519h5301p7321a8965C2915a8790j62065A1593b39748a6439
8976g5905k05615J40020B74811f8437B8776A3791a55878l8375j06883j1284B23593
$$ y = [-47775, -247324, -276281, -266888, -70279, -420706, 43114, -46763, -58710, -187130, 92897, 100900, -74895, 140671, 284467, 27976, 228279, 302974, -25770, -84176, -54402, -30529, 94992, -109474, -198638, 76111, 213495, 201241, -223959, 34001, -6971, -196414, -222831, 44226, -225900, -143980, -99542, -200903, -61171, 7071, -186471, 56083, -126627, 36757, -234852, -158395, 42708, -274212, 128696, 58396, -49094, 93705, -26164, -98231, -7121, 92397, -376413, -153513, 15032, -64389, 87774, 177808, 133044, 114888, 17237, -219011, -188101, -82554, -183277, -133111, 69588, -275225, 89759, 151278, -85301, -162622, -18965, 32915, -18790, -180855, 11593, -239748, -16439, -75905, -281520, -141500, 274811, -68437, 28776, 13791, -155878, -194253, -301136, -312420, 223593]
8964C40893A29741b41195A41038c1237A72366c13323A43920a14647o4454a1715
8953A6771N9044a48179F7859J20395E0313a54074D88K20504a63712D5423O7455
8942A12878k1754J93318i9833l40827h1807j45008A85053d51237a35567j19940
8932b55507R0277p8479l6349A99311c11415J44554l9911a8359k33706D0400a79607
8920B66654Q7156J73889J097900F05832b60134B2548i4261j7524G9760O8307g5487
8908b2595o4053b5438l7831m3986j54860B6203K69647b54546H8802m2505O2115
8897A08412C4189K79946a5663A5766D871J11304L2616J50800a55703A34629D7740
8885a6156r1363M6247G45a81891A11124a11998k3494I364a88859c4978N914k73356
$$ y = [340893, 129741, -241195, 141038, -31237, 172366, -313323, 143920, -114647, -179101, -11715, 16771, 75815, -148179, 67859, 188254, 50313, -154074, 488, 220992, -163712, 45423, 112878, 91124, 284442, -99833, -440660, -81807, -226815, 185053, -451237, -135567, -255507, -165230, -243709, -280058, 199311, -311415, -166861, -206772, -18359, -252065, 40400, -179607, 266654, 353810, 527699, 1625599, 605832, -260134, 22548, -94261, -111785, 79760, 148067, -75487, -22595, -86648, -25438, -63269, -107255, -262115, 26203, 295850, -254546, 88802, 46297, 108412, 34189, 314135, -15663, 15766, 4871, 116175, 148791, 299591, -155703, 134629, 47740, -16156, -107519, -61272, 745, -181891, 111124, -111998, -135492, 9364, -188859, -34978, -29064, -302420]
8873c02420A44848m207A9727J04119J10248L1790B881R6728a67328F501a2564
8861b59564G0802h6806A5657J12614a85793R0946n0806j02059J2657P0470o4693
8850b29278A92967c45437h2199A55006a49221r7148B68865E6823J9036P6121o0801
8839I1179B118a32531M6110m3651C23168a7317o6291A12051K788M35541H5428
$$ y = [-302420, 144848, 140641, 19727, 123846, 234094, 265884, 2881, 99609, -167328, 6501, -12564, -259564, 70802, -86806, 15657, 128271, -185793, -94847, -145653, -247712, -235055, -164585, -229278, 192967, -345437, -82199, 155006, -149221, -246369, 268865, 56823, 75859, 151980, 91179, 2118, -132531, -86421, -130072, 323168, -17317, -83608, 112051, 114839, 550380, 85428]
$$ [...]
##END NTUPLES=NMR SPECTRUM
##END=
