##TITLE=NES1003_10334_9231133_xLDj0crgvG
##JCAMPDX= 6.0         $$ Bruker NMR JCAMP-DX V2.0
##DATA TYPE= NMR SPECTRUM
##DATA CLASS= NTUPLES
##ORIGIN= BRUKER
##OWNER= Administrator
$$ 1.72 TOPSPIN		Version 2.1
$$ 2015-06-17 23:04:13.362 -0700  Administrator@X
$$ Compression mode = diff/dup
##.OBSERVE FREQUENCY= 400.02188249412
##.OBSERVE NUCLEUS= ^1H
##.ACQUISITION MODE= SIMULTANEOUS (DQD)
##.ACQUISITION SCHEME= undefined
##.AVERAGES= 64
##.DIGITISER RES= 22
##SPECTROMETER/DATA SYSTEM= spect
##.PULSE SEQUENCE= noesygpps1d.comp
##.SOLVENT NAME= COFFEE_meoh
##.SHIFT REFERENCE= INTERNAL, COFFEE_meoh, 1, 14.96307
##AUDIT TRAIL= $$ (NUMBER, WHEN, WHO, WHERE, PROCESS, VERSION, WHAT)
$$ ##TITLE= Audit trail, TOPSPIN		Version 2.1
$$ ##JCAMPDX= 5.01
$$ ##ORIGIN= Bruker BioSpin GmbH
$$ ##OWNER= Administrator
$$ $$ E:\/data/COFFEE/nmr/NES1003_10334_9231133_xLDj0crgvG/12/pdata/1/auditp.txt
$$ ##AUDIT TRAIL=  $$ (NUMBER, WHEN, WHO, WHERE, PROCESS, VERSION, WHAT)
(   1,<2015-06-17 23:04:08.144 -0700>,<Administrator>,<X>,<go>,<TOPSPIN 2.1>,
      <created by zg
	started at 2015-06-17 22:52:38.737 -0700,
	POWCHK enabled, PULCHK disabled,
       configuration hash MD5:
       21 0F 79 D6 B3 7B B4 F6 88 20 88 DB 03 48 BD 9F
       data hash MD5: 64K
       93 26 5D 3A A9 77 A4 7A F0 91 B4 34 50 9B 50 F8>)
(   2,<2015-06-17 23:04:11.300 -0700>,<Administrator>,<X>,<proc1d>,<TOPSPIN 2.1>,
      <Start of raw data processing
       efp LB = 0.3 FT_mod = 6 PKNL = 1 PHC0 = 0 PHC1 = 0 SI = 128K 
       data hash MD5: 128K
       1B 36 CB CD 05 CF 6C 26 CF 44 4B 25 42 E8 C4 01>)
(   3,<2015-06-17 23:04:12.175 -0700>,<Administrator>,<X>,<proc1d>,<TOPSPIN 2.1>,
      <pk PHC0 = -85.06714 PHC1 = 0 
       data hash MD5: 128K
       86 44 4D 88 5D 6A 65 10 BE E5 6A FA 49 9E 33 2B>)
(   4,<2015-06-17 23:04:12.550 -0700>,<Administrator>,<X>,<proc1d>,<TOPSPIN 2.1>,
      <abs ABSG = 1 
       data hash MD5: 128K
       C4 06 FC 8E DB A9 61 13 10 85 4D 74 70 97 DC DE>)
(   5,<2015-06-17 23:04:12.644 -0700>,<Administrator>,<X>,<proc1d>,<TOPSPIN 2.1>,
      <abs ABSG = 2 
       data hash MD5: 128K
       FA 19 EA AB 30 63 5E 5C C6 2F 34 0B 65 0E 70 F7>)
(   6,<2015-06-17 23:04:12.722 -0700>,<Administrator>,<X>,<proc1d>,<TOPSPIN 2.1>,
      <abs ABSG = 3 
       data hash MD5: 128K
       04 CE 15 56 0A 80 6A 2B 65 C7 39 69 31 E8 FE 0E>)
(   7,<2015-06-17 23:04:12.816 -0700>,<Administrator>,<X>,<proc1d>,<TOPSPIN 2.1>,
      <abs ABSG = 4 
       data hash MD5: 128K
       88 50 5A 69 B4 E2 93 5C 5D FA D3 ED E4 D6 12 E1>)
(   8,<2015-06-17 23:04:12.909 -0700>,<Administrator>,<X>,<proc1d>,<TOPSPIN 2.1>,
      <abs ABSG = 5 
       data hash MD5: 128K
       0F 86 90 91 43 C4 32 96 77 8E E6 72 20 23 1D A7>)
$$ ##END=
$$ 
$$ $$ hash MD5
$$ $$ 90 3C 31 D5 B4 46 B3 BD 9A 07 CC A2 1B FB 83 1C
##$RELAX= 
##$RELAX= 
##$RELAX= 
##$RELAX= 
##$RELAX= 
##$RELAX= 
##$RELAX= 
##$RELAX= 
$$ Bruker specific parameters
$$ --------------------------
##$DU= <E:\>
##$EXPNO= 12
$$ [...]
##$TP07= 0
##$TPNAME0= <>
##$TPNAME1= <>
##$TPNAME2= <>
##$TPNAME3= <>
##$TPNAME4= <>
##$TPNAME5= <>
##$TPNAME6= <>
##$TPNAME7= <>
##$TPOAL= (0..7)
0.5 0.5 0.5 0.5 0.5 0.5 0.5 0.5
##$TPOFFS= (0..7)
0 0 0 0 0 0 0 0
##$TUNHIN= 0
##$TUNHOUT= 0
##$TUNXOUT= 0
##$USERA1= <user>
##$USERA2= <user>
##$USERA3= <user>
##$USERA4= <user>
##$USERA5= <user>
##$V9= 5
##$VALIST= <valist>
##$VCLIST= <CCCCCCCCCCCCCCC>
##$VD= 0
##$VDLIST= <DDDDDDDDDDDDDDD>
##$VPLIST= <PPPPPPPPPPPPPPP>
##$VTLIST= <TTTTTTTTTTTTTTT>
##$WBST= 2048
##$WBSW= 25
##$XGAIN= (0..3)
0 0 0 0
##$XL= 0
##$YL= 0
##$YMAX_a= 7080347
##$YMIN_a= -14989754
##$ZGOPTNS= <>
##$ZL1= 120
##$ZL2= 120
##$ZL3= 120
##$ZL4= 120
##$ABSF1= 14.96307
##$ABSF2= -5.595112
##$ABSG= 5
##$ABSL= 3
##$ALPHA= 0
##$AQORDER= 0
##$ASSFAC= 0
##$ASSFACI= 0
##$ASSFACX= 0
##$ASSWID= 0
##$AUNMP= <proc_prof1d_extract.lims>
##$AXLEFT= 0
##$AXNAME= <>
##$AXNUC= <1H>
##$AXRIGHT= 0
##$AXTYPE= 0
##$AXUNIT= <>
##$AZFE= 0.1
##$AZFW= 0.1
##$BCFW= 0
##$BC_mod= 0
##$BYTORDP= 0
##$COROFFS= 0
##$CY= 15
##$DATMOD= 1
##$DC= 0
##$DFILT= <>
##$DTYPP= 0
##$F1P= 0
##$F2P= 0
##$FCOR= 0.5
##$FTSIZE= 131072
##$FT_mod= 6
##$GAMMA= 0
##$GB= 0
##$INTBC= 1
##$INTSCL= 1
##$ISEN= 128
##$LB= 0.3
##$LEV0= 0
##$LPBIN= 0
##$MAXI= 10000
##$MC2= 0
##$MEAN= 0
##$ME_mod= 0
##$MI= 0
##$NCOEF= 0
##$NC_proc= -2
##$NLEV= 6
##$NOISF1= 0
##$NOISF2= 0
##$NSP= 0
##$NTH_PI= 0
##$NZP= 0
##$OFFSET= 14.96307
##$PC= 1
##$PHC0= -85.06714
##$PHC1= 0
##$PH_mod= 1
##$PKNL= yes
##$PPARMOD= 0
##$PPDIAG= 0
##$PPIPTYP= 0
##$PPMPNUM= 2147483647
##$PPRESOL= 1
##$PSCAL= 4
##$PSIGN= 0
##$PYNMP= <proc.py>
##$REVERSE= no
##$SF= 400.020008809818
##$SI= 131072
##$SIGF1= 0
##$SIGF2= 0
##$SINO= 400
##$SIOLD= 131072
##$SPECTYP= <>
##$SREGLST= <1H.CDCl3>
##$SSB= 0
##$STSI= 131072
##$STSR= 0
##$SW_p= 8223.68421052631
##$SYMM= 0
##$S_DEV= 0
##$TDeff= 65536
##$TDoff= 0
##$TI= <>
##$TILT= no
##$TM1= 0
##$TM2= 0
##$TOPLEV= 0
##$USERP1= <user>
##$USERP2= <user>
##$USERP3= <user>
##$USERP4= <user>
##$USERP5= <user>
##$WDW= 1
##$XDIM= 131072
##$YMAX_p= 394139673
##$YMIN_p= -11246
##$CURPLOT= <Network HP LaserJet P1505>
##$CURPRIN= <$Network HP LaserJet P1505>
##$DFORMAT= <normdp>
##$LAYOUT= <+/1D_H.xwp>
##$LFORMAT= <normlp>
##$PFORMAT= <normpl>
##$SURQMSG= 1
$$ End of Bruker specific parameters
$$ ---------------------------------
##NTUPLES= NMR SPECTRUM
##VAR_NAME=  FREQUENCY,     SPECTRUM/REAL,   SPECTRUM/IMAG
##SYMBOL=    X,             R,               I
##VAR_TYPE=  INDEPENDENT,   DEPENDENT,       DEPENDENT
##VAR_FORM=  AFFN,          ASDF,            ASDF
##VAR_DIM=   131072,        131072,          131072
##UNITS=     HZ,            ARBITRARY UNITS, ARBITRARY UNITS
##FACTOR=    0.0627417313425164, 1,          1
##FIRST=     8223.62146879497, -2286,        -52043
##LAST=      0,             166,             -53417
##MIN=       0,             -11246,          0
##MAX=       8223.62146879497, 394139673,    0
$$ Real data points
##PAGE= N=1
##DATA TABLE= (X++(R..R)), XYDATA
$$ [...]
61030H52932O947P746P796P074O620O862P367P982Q812R389R431J0032J2424J5809
$$ 852932 859879 867625 875421 882495 889115 895977 903344 911326 920138 929527 938958 948990 961414 977223
61016I77223J8303J9871K2296K6328L0930L5416M0126M4904M9066N3077N7967
$$ 977223 995526 1015397 1037693 1064021 1094951 1130367 1170493 1215397 1264463 1317540 1375507
61005A375507O2858O5685O6788O9184P4703Q2501R2001J04156J18825J33974J48800
$$ 1375507 1438365 1504050 1570838 1640022 1714725 1797226 1889227 1993383 2112208 2246182 2394982
60994B394982J64874J83125K03199K27237K60414L05612L61169M25912N01893
$$ 2394982 2559856 2742981 2946180 3173417 3433831 3739443 4100612 4526524 5028417
60985E028417N89637O86660P95457R27295J092711J295936J547183J865699K239209
$$ 5028417 5618054 6304714 7100171 8027466 9120177 10416113 11963296 13828995 16068204
60976A6068204K568974K682631K442039J857570J094143L65283j74219m50129
$$ 16068204 18637178 21319809 23761848 25619418 26713561 27078844 26904625 26454496
60968B6454496m38587j69513K30772N42703N53662J86399m61018j192520j826440
$$ 26454496 26015909 25846396 26077168 26619871 27173533 27359932 26898914 25706394 23879954
60959B3879954k255316k445850k421154k244396j993279j728496j479521j255126
$$ 23879954 21624638 19178788 16757634 14513238 12519959 10791463 9311942 8056816
60951H056816j058197q88829p42876o16026n08095m20152l50094k94121k50268
$$ 8056816 6998619 6109790 5366914 4750888 4242793 3822641 3472547 3178426 2928158
60942B928158k17209j91660j70108j51843j37530j25937j14714j03360r2933q3541
$$ 2928158 2710949 2519289 2349181 2197338 2059808 1933871 1819157 1715797 1622864 1539323
60932A539323p4499o6422o0806n7689n5592n3677n2210n1007m9105m6135m2665
$$ 1539323 1464824 1398402 1337596 1279907 1224315 1170638 1118428 1067421 1018316 972181 929516
60921I29516l9144l5561l2092k9040k6109k2803j9391j6620j4635j2977j1456
$$ 929516 890372 854811 822719 793679 767570 744767 725376 708756 694121 681144 669688
60910F69688j0071q398o081l758k489k252j976j108k25N0p3k5L07N67M30l4m06
$$ 669688 659617 651219 645138 641380 638891 636639 634663 633555 633330 633380 633307 633282 633589 634156 634586 634552 634146
60893F34146m51o03j508k936l779l553l160l588m556n239n652o359p213p620p763
$$ 634146 633695 633092 631584 628648 624869 621316 618156 614568 610012 604773 599121 592762 585549 577929 570166
60878E70166q356r156q974p441n774n211n477n354m225k479p12Q66K282L512M458
$$ 570166 561810 552654 543680 536239 530465 525254 519777 514423 510198 507719 507007 507873 510155 513667 518125
60863E18125N135N754O539P414Q056Q413Q877R804J1007J2059J2900J3846J5063
$$ 518125 523260 529014 535553 542967 551023 559436 568313 578117 589124 601183 614083 627929 642992
60850F42992J6364J7472J8170J8261J7632J6316J4357J1791Q965O619N264M574
$$ 642992 659356 676828 694998 713259 730891 747207 761564 773355 782320 788939 794203 798777
60838G98777L810K733J767J269J084P98P8j320l471o011q216r575j0167j0367
$$ 798777 802587 805320 807087 808356 809440 810238 810316 808996 805525 799514 791298 781723 771556 761189
60824G61189j0426j0485j0820j1654j2710j3236j2732j1507j0315r452q585p507
$$ 761189 750763 740278 729458 717804 705094 691858 679126 667619 657304 647852 639267 631760
60812F31760o535n875n018l403j509m97o65q95k6J790L422M063L787L085K441
$$ 631760 625225 619350 614332 610929 609420 608923 608258 607363 607337 609127 612549 616612 620399 623484 625925
60797F25925K188K396K770K861K441J634P88L17M39Q82J073P73M03N19J185K052
$$ 625925 628113 630509 633279 636140 638581 640215 641003 641320 641759 642641 643714 644487 644890 645409 646594 648646
60781F48646K919L928N247O772Q147R054R497R821J0380J1152J1833J2185J2068
$$ 648646 651565 655493 660740 667512 675659 684713 694210 704031 714411 725563 737396 749581 761649
60768G61649J1250R593P555O032N416N128M294K675P18r83k042k369k270k259
$$ 761649 772899 782492 790047 796079 801495 806623 810917 813592 814310 813327 811285 808916 806646 804387
60754H04387k521k714k556k328k501l069l653m157m861n933p201q458r612j0492
$$ 804387 801866 799152 796596 794268 791767 788698 785045 780888 776027 770094 762893 754435 744823 734331
60740G34331j0818j0565j0110r813r588r088q282p619p491p698p636p064o385
$$ 734331 723513 712948 702838 693025 683437 674349 666067 658448 650957 643259 635623 628559 622174
60727F22174o071n942n390m208k895k078j842j767j390n76M70J479K392L251L755
$$ 622174 616103 610161 604771 600563 597668 595590 593748 591981 590591 590015 590485 591964 594356 597607 601362
60712F01362L347K036Q45P74J489J733J020J16l34p72j809l113m057m905o377
$$ 601362 604709 606745 607590 608364 609853 611586 612606 612722 612388 611616 609807 606694 602637 597732 591355
60697E91355q273r442r348q735q479q454q027p228o726o735o646n904m816m094
$$ 591355 583082 573640 564292 555557 547078 538624 530597 523369 516643 509908 503262 497358 492542 488448
60683D88448l855l543k811j995j453r48q8Q96J397J397J595K479L687M512M644
$$ 488448 484593 481050 478239 476244 474791 473843 473755 474651 476048 477445 479040 481519 485206 489718 494362
60668D94362M273L835L826M594N950P222P819P607O784N789N364O129P757R054
$$ 494362 498635 502470 506296 510890 516840 524062 531881 539488 546272 552061 557425 563554 571311 580365
60654E80365R217Q694Q425Q623Q820Q801Q850R182R575R578Q818P298N690N055
$$ 580365 589582 598276 606701 615324 624144 632945 641795 650977 660552 670130 678948 686246 691936 696991
60640F96991N739O743O780N804M827M308L561K037L21o87j081j730l031m530n728
$$ 696991 702730 709473 716253 722057 726884 731192 734753 736790 737111 736424 735343 733613 730582 726052 720324
60625G20324o672p636q639r460r902r899r559r146q842q449p548o071m468l215
$$ 720324 713652 706016 697377 687917 678015 668116 658557 649411 640569 632120 624572 618501 614033 610818
60611F10818k311j429k77J357L569N980P629P795O916O197O237O551O484O039
$$ 610818 608507 607078 606801 608158 611727 617707 625336 633131 640047 646244 652481 659032 665516 671555
60597F71555N458M581L130J425J91k18o4K22L50J33l97q78r88r43j306k233l214
$$ 671555 677013 681594 684724 686149 686340 686122 686058 686280 686630 686763 686366 685488 684500 683557 682251 680018 676804
60580F76804l703l796m166n390p273q851r221q501p720p547p566p132o519o507
$$ 676804 673101 669305 665139 659749 652476 643625 634404 625903 618183 610636 603070 595938 589419 582912
60566E82912p017o973n721l969k960l050l406l008j686j80P70J302K165L560M756
$$ 582912 575895 568922 563201 559232 556272 553222 549816 546808 545122 544942 545712 547014 549179 552739 557495
60551E57495N085M950N247O179P252Q254R526J1323J3599J6366J9649K3007K5864
$$ 557495 562580 567530 572777 578956 586208 594462 603988 615311 628910 645276 664925 687932 713796
60538G13796K8420L1561L5696M0162M3901M6108M6148M3511L8209L0640K0960
$$ 713796 742216 773777 809473 849635 893536 939644 985792 1029303 1067512 1098152 1119112
60527A119112R239l547j5345k4349l0032l2707l2712l0476k6792k2409j7572j2384
$$ 1119112 1128351 1124804 1109459 1085110 1055078 1022371 989659 959183 932391 909982 892410 880026
60515H80026p350l241m83J095K111L256M748O185P185Q047R346J1070J2874J5035
$$ 880026 872676 869435 868952 870047 872158 875414 880162 886347 893532 901579 910925 921995 934869 949904
60501I49904J8323K2830K7797L2848L8452M4956N1987N9120O6220P2744P7650
$$ 949904 968227 991057 1018854 1051702 1090154 1135110 1187097 1246217 1312437 1385181 1462831
60490A462831Q0623Q2542Q4304Q6074Q8390R3102J02250J16513J35430J58460
$$ 1462831 1543454 1625996 1710300 1796374 1884764 1977866 2080116 2196629 2332059 2490519
60480B490519J84984K13544K41473K64636K77266K73223K48723K03773J41002
$$ 2490519 2675503 2889047 3130520 3395156 3672422 3945645 4194368 4398141 4539143
60471D539143O4446j9754j03149j77404k36958k78869l01646l06062k96334k78339
$$ 4539143 4603589 4583835 4480686 4303282 4066324 3787455 3485809 3179747 2883413 2605074
60461B605074k56286k32089k07193j83161j60571j39202j19565j02790q8814p6316
$$ 2605074 2348788 2116699 1909506 1726345 1565774 1426572 1307007 1204217 1115403 1039087
60451A039087o4800n5262m8258m2726l7429l2347k7893k3873k0040j6808j4537
$$ 1039087 974287 919025 870767 828041 790612 758265 730372 706499 686459 669651 655114
60440F55114j2898j1569j0899j1126j1623j1584j0930r962q700p213o009n446
$$ 655114 642216 630647 619748 608622 596999 585415 574485 564523 555823 548610 542601 537155
60428E37155n156m619l881l207k519j730j157j050j138j155j330j698j512j13
$$ 537155 531999 527380 523499 520292 517773 516043 514886 513836 512698 511543 510213 508515 507003 506890
60414E06890J905L288L647L621L635L350K554J752J544J854K200K375K575K934
$$ 506890 508795 512083 515730 519351 522986 526336 528890 530642 532186 534040 536240 538615 541190 544124
60400E44124L257L269K961K650K685L134L720M023L807L226K807K944L307L062
$$ 544124 547381 550650 553611 556261 558946 562080 565800 569823 573630 576856 579663 582607 585914 588976
60386E88976J899N47r3oJ72J37l4m85j388k203k093j214o28p25p18j61J63m00
$$ 588976 590875 591422 591329 591323 591495 591632 591598 591113 589725 587522 585429 584215 583587 582862 582144 581983 582146 581746
60368E81746j080p74K49R17J148J840L182M265M524M566N105N959O541O783P017
$$ 581746 580666 579892 580141 581058 582206 584046 587228 591493 596017 600583 605688 611647 618188 624971 631988
60353F31988P329P459P149O339N242M380M188M396M152L018J560O12K86N1l85
$$ 631988 639317 646776 653925 660264 665506 669886 674074 678470 682622 685640 687200 687812 688098 688149 687764
60338F87764p22n66P0Q39J443J852K189K496K561K161J452R91J155J686J955J626
$$ 687764 687042 686476 686546 687385 688828 690680 692869 695365 697926 700087 701539 702530 703685 705371 707326 708952
60322G08952Q53p0j006j976l066m367n753o745o889o308n591n092m659m172l909
$$ 708952 709805 709735 708729 706753 703687 699320 693567 686822 679933 673625 668034 662942 658283 654111 650202
60307F50202m051m143l531k191p63J71M89L04j80n77m97J0M64M81J01m17p74o34
$$ 650202 646151 642008 638477 636286 635523 635694 636183 636487 636307 635730 635233 635243 635707 636188 636289 635872 635098 634464
60289F34464J19R96J260Q07L32L68O39O66O08R81J831K702L339L910M483M724
$$ 634464 634583 635579 636839 637646 637978 638346 638985 639651 640259 641240 643071 645773 649112 653022 657505 662229
60273F62229M348L655L341L802M720N455N773O025O553P193P642Q038Q825J0136
$$ 662229 666577 670232 673573 677375 682095 687550 693323 699348 705901 713094 720736 728774 737599 747735
60259G47735J1708J3251J4472J4997J4904J5219J6979J9788K2232K3825K5597
$$ 747735 759443 772694 787166 802163 817067 832286 849265 869053 891285 915110 940707
60248I40707K8357L1555L4526L7817M2136M6871N0890N4428N8905O4971P1808
$$ 940707 969064 1000619 1035145 1072962 1115098 1161969 1212859 1267287 1326192 1391163 1462971
60237A462971P8341Q4171Q9258R3568R7215J00241J02105J02055R9984R6317R1048
$$ 1462971 1541312 1625483 1714741 1808309 1905524 2005765 2107870 2209925 2309909 2406226 2497274
60226B497274Q3712P4367O3793N2568M0666K8198J5756L771p834j8914k8687l6415
$$ 2497274 2580986 2655353 2719146 2771714 2812380 2840578 2856334 2860105 2852271 2833357 2804670 2768255
60214B768255m2056m5749m7157m5807m1886l6224k9537k1944j3219l320P354J8224
$$ 2768255 2726199 2680450 2633293 2587486 2545600 2509376 2479839 2457895 2444676 2441356 2448710 2466934
60202B466934K9057M0038N1234O2320P2983Q3259R3006J01429J07653J11465J12843
$$ 2466934 2495991 2536029 2587263 2649583 2722566 2805825 2898831 3000260 3107913 3219378 3332221
60191C332221J11082J05324R5899Q4283P1531N7491M1704K4382O273j1799k8998
$$ 3332221 3443303 3548627 3644526 3728809 3800340 3857831 3899535 3923917 3930190 3918391 3889393
60180C889393m4642n8526p0565q0065q5958q7991q6936q3448p7385o8605n7731
$$ 3889393 3844751 3786225 3715660 3635595 3549637 3461646 3374710 3291262 3213877 3145272 3087541
60169C087541m5684l2928j9672o299O772J9310L1064M1694N1182N9741O6950P1523
$$ 3087541 3041857 3008929 2989257 2982958 2989730 3009040 3040104 3081798 3132980 3192721 3259671 3331194
60157C331194P2395O9660O4135N6313M6352L4697K2187R667k244j3085k2492l0112
$$ 3331194 3403589 3473249 3537384 3593697 3640049 3674746 3696933 3706600 3704356 3691271 3668779 3638667
60145C638667l5437l7985l7673l4771k9437k1643j1490Q34J5285L1616M8843O5967
$$ 3638667 3603230 3565245 3527572 3492801 3463364 3441721 3430231 3431065 3446350 3477966 3526809 3592776
60133C592776Q3364J02509J23954J46339J67944J88469K08683K28983K49030K68206
$$ 3592776 3676140 3778649 3902603 4048942 4216886 4405355 4614038 4843021 5092051 5360257
60123E360257K85706L00538L12129L20509L25306L24999L18103L04733K86152
$$ 5360257 5645963 5946501 6258630 6579139 6904445 7229444 7547547 7852280 8138432
60114H138432K62891K34275J99824J60274J16991P1081K3488k4662p2281j18548
$$ 8138432 8401323 8635598 8835422 8995696 9112687 9183768 9207256 9182594 9110313 8991765
60104H991765j62511k02679k37365k65435k86319k99326l03410k98163k84861
$$ 8991765 8829254 8626575 8389210 8123775 7837456 7538130 7234720 6936557 6651696
60095F651696k65997k43507k17936j89568j59745j30220j01524p2995m4487j7159
$$ 6651696 6385699 6142192 5924256 5734688 5574943 5444723 5343199 5270204 5225717 5208558
60085E208558P695K9815M9455O6371P9808Q9065R3574R2817Q6667P5641O0561
$$ 5208558 5216253 5246068 5295523 5361894 5441702 5530767 5624341 5717158 5803825 5879466 5940027
60074E940027M2359K2408K434j6431l4186n1211o7370q2272r5967j08728j20383
$$ 5940027 5982386 6004794 6007228 5990797 5956611 5905400 5838030 5755758 5659791 5551063 5430680
60063E430680j30323j38108j43657j46938j47726j45608j40163j31466j20498
$$ 5430680 5300357 5162249 5018592 4871654 4723928 4578320 4438157 4306691 4186193
60054D186193j08641r6472q3492o9072n3275l6526j9290k330J3405K7827M2012
$$ 4186193 4077552 3981080 3897588 3828516 3775241 3738715 3719425 3717095 3730500 3758327 3800339
60043C800339N6782P1451Q4595R5647J04912J12334J17053J18168J15295J08377
$$ 3800339 3857121 3928572 4013167 4108814 4213726 4326060 4443113 4561281 4676576 4784953
60033D784953R7512Q3029O5433M5360K3757J805j9780m1070o2106q2095r9843
$$ 4784953 4882465 4965494 5030927 5076287 5100044 5101849 5082069 5040999 4978893 4896798 4796955
60022D796955j14673j26375j34486j38301j37617j33021j25472j15769j04299
$$ 4796955 4682282 4555907 4421421 4283120 4145503 4012482 3887010 3771241 3666942
60013C666942r1047p6022n9836m3431k7165j0687O046K2348L7852N3218O9187
$$ 3666942 3575895 3499873 3440037 3396606 3369441 3358754 3364800 3387148 3425000 3478218 3547405
60002C547405Q5607J02021J18441J34632J49279J60975J69476J74763J75459J69676
$$ 3547405 3633012 3735033 3853474 3988106 4137385 4298360 4467836 4642599 4818058 4987734
59992D987734J57414J40625J20786R7764P1395M2880J3868j4818m2848o9578r4239
$$ 4987734 5145148 5285773 5406559 5504323 5575718 5618598 5632466 5617648 5574800 5505222 5410983
59981E410983j16268j34687j47793j54313j54711j50656j43339j32821j18939
$$ 5410983 5294715 5160028 5012235 4857922 4703211 4552555 4409216 4276395 4157456
59972D157456j02307q4243o5902m7654k9304j0822P256K4305M0263N5488P0112
$$ 4157456 4055149 3970906 3905004 3857350 3828046 3817224 3824480 3848785 3889048 3944536 4014648
59961D014648Q3780R5950J06010J13161J16695J16511J13139J07127R8746Q8260
$$ 4014648 4098428 4194378 4300388 4413549 4530244 4646755 4759894 4867021 4965767 5054027
59951E054027P6238O3410N0453L7891K6013J4952N093k663p267q173n383J097
$$ 5054027 5130265 5193675 5244128 5282019 5308032 5322984 5328077 5325414 5318147 5309974 5304591 5305688
59939E305688J1465K5869M4153O5916R0619J17629J46326J76108K06296K36260
$$ 5305688 5317153 5343022 5387175 5453091 5543710 5661339 5807665 5983773 6190069 6426329
59929F426329K65706K94324L20889L43041L58346L65142L62055L47234L18845
$$ 6426329 6692035 6986359 7307248 7650289 8008635 8373777 8735832 9083066 9401911
59920I401911K76221K20172J52695P7120j908p9531j51949k16211k69369l09038
$$ 9401911 9678132 9898304 10050999 10128119 10126211 10046680 9894731 9678520 9409151 9100113
59910I100113l34834l48217l50756l43399l27559l05747k80347k52434k22330
$$ 9100113 8765279 8417062 8066306 7722907 7395348 7089601 6809254 6556820 6334490
59901F334490j90814j59137j28216r8347o9544m1679j4454J2332L8435O3290Q6410
$$ 6334490 6143676 5984539 5856323 5757976 5688432 5646753 5632299 5644631 5683066 5746356 5832766
59890E832766J07528J26367J42250J53967J60071J59513J51857J36807J13841
$$ 5832766 5940294 6066661 6208911 6362878 6522949 6682462 6834319 6971126 7084967
59881G084967Q2853M5093L053m0575q3550j23764j58937j87040k07122k19660
$$ 7084967 7167820 7212913 7215966 7175391 7091841 6968077 6809140 6622100 6414978 6195318
59871F195318k26022k27364k24014k16317k05905j95310j85858j76819j67290
$$ 6195318 5969296 5741932 5517918 5301601 5095696 4900386 4714528 4537709 4370419
59862D370419j58090j50548j44090j36527j26812j16043j05461r4753q3042p0534
$$ 4370419 4212329 4061781 3917691 3781164 3654352 3538309 3432848 3338095 3255053 3184519
59852C184519n8337m7328l7896l0372k5009k1788k0659k1782k5125l0074l5724
$$ 3184519 3126182 3078854 3040958 3010586 2985577 2963789 2943130 2921348 2896223 2866149 2830425
59841B830425m1265m5977m9212n0670n0451m8660m5364m0977l6181l1221k5745
$$ 2830425 2789160 2743183 2693971 2643301 2592850 2544190 2498826 2457849 2421668 2390447 2364702
59830B364702j9516j2803n831J536R219J6439K2354K6846L0403L3571L6888M0933
$$ 2364702 2345186 2332383 2326552 2328088 2337307 2353746 2376100 2402946 2433349 2466920 2503808 2544741
59818B544741M5943N1434N6471O0030O1035N8502N2242M3315L3410K3818J5083
$$ 2544741 2590684 2642118 2698589 2758619 2819654 2878156 2930398 2973713 3007123 3030941 3046024
59807C046024P362P99m326p505q164o063j541M787J2438K1243L1361M3147N6788
$$ 3046024 3053386 3054185 3049859 3042354 3034190 3028127 3026586 3031373 3043811 3065054 3096415 3139562 3196350
59794C196350P1965Q8166J05401J24332J45608J69360J95364K23278K52462K81750
$$ 3196350 3268315 3356481 3461882 3586214 3731822 3901182 4096546 4319824 4572286 4854036
59784D854036L09307L32191L45638L43166L18255K66965J90303R5154o985j03453
$$ 4854036 5163343 5495534 5841172 6184338 6502593 6769558 6959861 7055015 7048030 6944577
59774F944577j84180k43525k79918k94906k92508k78103k56577k31019k03050
$$ 6944577 6760397 6516872 6236954 5942048 5649540 5371437 5114860 4883841 4680791
59765D680791j74007j45536j19235r5989p5562n6949l9280k2561p353O065J7952
$$ 4680791 4506784 4361248 4242013 4146024 4070462 4013513 3974233 3951672 3944319 3950384 3968336
59754C968336K8766L9135N0082O2520P6320R0391J03981J17509J31934J47784
$$ 3968336 3997102 4036237 4086319 4148839 4225159 4315550 4419531 4537040 4668974 4816758
59744D816758J65009J83367K02658K22883K44364K67458K92068L17847L44883
$$ 4816758 4981767 5165134 5367792 5590675 5835039 6102497 6394565 6712412 7057295
59735G057295L73638M03961M34628M64158M91465N15332N33659N43900N44251
$$ 7057295 7430933 7834894 8269522 8733680 9225145 9740477 10274136 10818036 11362287
59726A1362287N34182N14098M85013M48725M08263L67906L32403L05650K89884
$$ 11362287 11896469 12410567 12895580 13344305 13752568 14120474 14452877 14758527 15048411
59717A5048411K85915K93525L11221L36060L64668L94419M23008M47087M62420
$$ 15048411 15334326 15627851 15939072 16275132 16639800 17034219 17457227 17904314 18366734
59708A8366734M65673M55431M31333L93255L41882K79512K09677J36344O3719
$$ 18366734 18832407 19287838 19719171 20112426 20454308 20733820 20943497 21079841 21143560
59699B1143560l927o2932j10551j44625j63573j67099j56244j32142r5276m6326
$$ 21143560 21139633 21076701 20966150 20821525 20657952 20490853 20334609 20202467 20107191 20060865
59689B0060865J2779P9392J51396K27512L06671L87632M68888N48439O23776O92303
$$ 20060865 20073644 20153036 20304432 20531944 20838615 21226247 21695135 22243574 22867350 23559653
59679B3559653P51335P97161Q24376Q26675P98251P34631O33224M94372L22349
$$ 23559653 24310988 25108149 25932525 26759200 27557451 28292082 28925306 29419678 29742027
59670B9742027J25292q5646k97290m95859o69079q08063r07918r67443r88820
$$ 29742027 29867319 29781673 29484383 28988524 28319445 27511382 26603464 25636021 24647201
59661B4647201r77155r39747q85621q25518p71144p32914p17291p25231p52057
$$ 24647201 23670046 22730299 21844678 21019160 20248016 19515102 18797811 18072580 17320523
59652A7320523p88565q23609q47628q55129q44829q18423p79488p32515o81627
$$ 17320523 16531958 15708349 14860721 14005592 13160763 12342340 11562852 10830337 10148710
59643A0148710o29736n78698n29721m83283m39290l97862l59731l25402k94492
$$ 10148710 9518974 8940276 8410555 7927272 7487982 7090120 6730389 6404987 6110495
59634F110495k66335k40719k17412j95557j74356j54119j35757j19429j04473
$$ 6110495 5844160 5603441 5386029 5190472 5016116 4861997 4726240 4606811 4502338
59625D502338r0483p7696o6304n6200m7549m0871l6382l3717l2559l3092l5595
$$ 4502338 4411855 4334159 4267855 4211655 4164106 4123235 4086853 4053136 4020577 3987485 3951890
59614C951890l9985m5868n2768o0056o6957p2771p7079p9746q0887q0745p9433
$$ 3951890 3911905 3866037 3813269 3753213 3686256 3613485 3536406 3456660 3375773 3295028 3215595
59603C215595p6798p2740o7553o1761n5669m9257m2454l5360k8215k1336j4978
$$ 3215595 3138797 3066057 2998504 2936743 2881074 2831817 2789363 2754003 2725788 2704452 2689474
59592B689474r147l630J742O982J2099J7071K1574K5029K7109K7969K7889K7034
$$ 2689474 2680327 2676697 2678439 2685421 2697520 2714591 2736165 2761194 2788303 2816272 2844161 2871195
59580B871195K5714K4557K4082K4361K5257K6844K9379L3090L8131M4476N1695
$$ 2871195 2896909 2921466 2945548 2969909 2995166 3022010 3051389 3084479 3122610 3167086 3218781
59569C218781N9150O6594P4386Q3022R2723J03502J15273J27758J40568J53500
$$ 3218781 3277931 3344525 3418911 3501933 3594656 3698158 3813431 3941189 4081757 4235257
59559D235257J66511J79452J92164K04631K16435K26239K32604K35334K35215
$$ 4235257 4401768 4581220 4773384 4978015 5194450 5420689 5653293 5888627 6123842
59550F123842K32428K26252K16459K03827J88880J71448J52140J32795J14202
$$ 6123842 6356270 6582522 6798981 7002808 7191688 7363136 7515276 7648071 7762273
59541G762273R4296P0235M1964J2633j4206l6675n4086o5923p1698p1217o4571
$$ 7762273 7856569 7926804 7968768 7981401 7967195 7930520 7876434 7810511 7738813 7667596 7603025
59530G603025n2189l4872j3331J2130M1117P2556J04944J36701J65671J88759
$$ 7603025 7550836 7515964 7502633 7514763 7555880 7628436 7733380 7870081 8035752 8224511
59520H224511K02896K06266J98050J77511J44349R9856M6832j1745p3394j35633
$$ 8224511 8427407 8633673 8831723 9009234 9153583 9253439 9300271 9288526 9215132 9079499
59510I079499j95639k50591k97822l34764l59598l72137l73668l65833l50201
$$ 9079499 8883860 8633269 8335447 8000683 7641085 7268948 6895280 6529447 6179246
59501F179246l28714l03692k76978k49482k21747j94551j68705j44558j21850
$$ 6179246 5850532 5546840 5269862 5020380 4798633 4604082 4435377 4290819 4168969
59492D168969r9971p8415n7162l6695j7452O49J8129L5604N3527P1873Q9902J06741
$$ 4168969 4068998 3990583 3933421 3896726 3879274 3879923 3898052 3933656 3987183 4059056 4148958 4255699
59480D255699J22441J37929J53545J68189J80395J89723J96340J99688J98394
$$ 4255699 4378140 4516069 4669614 4837803 5018198 5207921 5404261 5603949 5802343
59471E802343J91293J77898J57961J31303R8226N9727J7399k6683p0240j11340
$$ 5802343 5993636 6171534 6329495 6460798 6559024 6618751 6636150 6609467 6539227 6427887
59461F427887j48552j80547k06098k24875k37644k45151k47370k44325k37064
$$ 6427887 6279335 6098788 5892690 5667815 5430171 5185020 4937650 4693325 4456261
59452D456261k27112k15442k02641j89464j76377j62975j48782j34373j20935
$$ 4456261 4229149 4013707 3811066 3621602 3445225 3282250 3133468 2999095 2878160
59443B878160j09060r8594q9320q0932p2746o4266n5861m8137m0973l3956k7289
$$ 2878160 2769100 2670506 2581186 2500254 2427508 2363242 2307381 2259244 2218271 2184315 2157026
59432B157026k1501j6536j1994p818l954J17M565Q433J0759J1941J2968J3986
$$ 2157026 2135525 2118989 2106995 2099177 2095223 2095340 2099905 2108338 2119097 2131038 2144006 2157992
59420B157992J5002J7186K1495K6253K8104K5801K1377J7269J4109J1933J1718
$$ 2157992 2172994 2190180 2211675 2237928 2266032 2291833 2313210 2330479 2344588 2356521 2368239
59409B368239J4446J9807K7032L6069M6792N7518O5490O8921O8312O6005O4723
$$ 2368239 2382685 2402492 2429524 2465593 2512385 2569903 2635393 2704314 2772626 2838631 2903354
59398B903354O6118P0405P7392Q7480J01036J17201J34382J52083J71279J92898
$$ 2903354 2969472 3039877 3117269 3204749 3305785 3422986 3557368 3709451 3880730 4073628
59388D073628K16827K42602K70074K99149L29736L62221L96963M32938M67712
$$ 4073628 4290455 4533057 4803131 5102280 5432016 5794237 6191200 6624138 7091850
59379G091850M98955N25052N44014N53150N50626N36628N12558M80044M41327
$$ 7091850 7590805 8115857 8659871 9213021 9763647 10300275 10812833 11292877 11734204
59370A1734204L99538L57517L16836K78484K43781K13557J86884J61408J34767
$$ 11734204 12133742 12491259 12808095 13086579 13330360 13543917 13730801 13892209 14026976
59361A4026976J05209P1225L1473j4830o7569j25558j86542k47694l06393l60311
$$ 14026976 14132185 14203410 14234883 14220053 14152484 14026926 13840384 13592690 13286297 12925986
59351A2925986m07014m44303m71342m88894m98034m99104m92181m78100m58502
$$ 12925986 12518972 12074669 11603327 11114433 10616399 10117295 9625114 9147014 8688512
59342H688512m35050m08769l80009l48933l16342k83804k52691k23320j95566
$$ 8688512 8253462 7844693 7464684 7115751 6799409 6515605 6262914 6039594 5844028
59333E844028j69930j47172j27226j09528r4286q2239p3196o6000o0308n7090
$$ 5844028 5674098 5526926 5399700 5290172 5195886 5113647 5040451 4974451 4914143 4857053
59323D857053n6951n8950o1725o4807o8298p2081p5916p9550q2256q3020q1626
$$ 4857053 4800102 4741152 4679427 4614620 4546322 4474241 4398325 4318775 4236519 4153499 4071873
59312D071873p8821p5113p0347o4721n9087n3666m7529m0150l2369k5080j7879
$$ 4071873 3993052 3917939 3847592 3782871 3723784 3670118 3622589 3582439 3550070 3524990 3507111
59301C507111j0021j795O054J3624K1621L0316L9609M9589O0240P1089Q1938R3323
$$ 3507111 3497090 3495295 3501349 3514973 3536594 3566910 3606519 3656108 3716348 3787437 3869375 3962698
59289C962698J05506J17578J28439J38180J47557J56540J64256J69863J72684
$$ 3962698 4068204 4185782 4314221 4452401 4599958 4756498 4920754 5090617 5263301
59280E263301J71845J66744J57518J44082J25106R9020O6068K8606j0415m8424
$$ 5263301 5435146 5601890 5759408 5903490 6028596 6127616 6193684 6222290 6211875 6163451
59270F163451q3084j12503j36070j54423j68276j77778j83024j84608j83322j79704
$$ 6163451 6080367 5967864 5831794 5677371 5509095 5331317 5148293 4963685 4780363 4600659
59260D600659j74053j66763j58412j49565j40409j30563j19538j07503r5401q4121
$$ 4600659 4426606 4259843 4101431 3951866 3811457 3680894 3561356 3453853 3358452 3274331
59250C274331p3766o3792n3590m2842l1764k1034j1171j792Q068J8956L0778M3498
$$ 3274331 3200565 3136773 3083183 3040341 3008577 2987543 2976372 2974580 2982648 3001604 3032382 3075880
59238C075880N7276P1941Q7207J03635J22403J43709J66350J89349K13129K38490
$$ 3075880 3133156 3205097 3292304 3395939 3518342 3662051 3828401 4017750 4230879 4469369
59228D469369K65291K92740L19983L45525L66850L81484L87902L84669L69558
$$ 4469369 4734660 5027400 5347383 5692908 6059758 6441242 6829144 7213813 7583371
59219G583371L40583K97479K41456J74156R7921J6471o5843j45364k18936k83046
$$ 7583371 7923954 8221433 8462889 8637045 8734966 8751437 8685594 8540230 8321294 8038248
59209H038248l34396l71370l94024m02968l99229l85120l63999l38736l10901
$$ 8038248 7703852 7332482 6938458 6535490 6136261 5751141 5387142 5048406 4737505
59200D737505k81432k51412k22016j94223j68730j45809j25385j07398r1888p8417
$$ 4737505 4456073 4204661 3982645 3788422 3619692 3473883 3348498 3241100 3149212 3070795
59190C070795o5918n3673m2097l2029k3623j6422j0079m296J503P728J3979J9573
$$ 3070795 3004877 2951204 2909107 2877078 2853455 2837033 2826954 2822658 2824161 2831889 2845868 2865441
59178B865441K4425K8856L2765L5686L7430L8063L7491L5570L2405K8061K2341
$$ 2865441 2889866 2918722 2951487 2987173 3024603 3062666 3100157 3135727 3168132 3196193 3218534
59167C218534J5388P956M75p499j6156k4426l1169l6824m2527m7954n1462n2490
$$ 3218534 3233922 3241878 3242353 3234854 3218698 3194272 3163103 3126279 3083752 3035798 2984336 2931846
59155B931846n2325n2145n1490m9322m5625m1284l6959l2762k8591k4251j9526
$$ 2931846 2879521 2827376 2775886 2726564 2680939 2639655 2602696 2569934 2541343 2517092 2497566
59144B497566j4524r669n128m64M743J0215J5287J9754K4065K8650L3418L8087
$$ 2497566 2483042 2473373 2468245 2467781 2472524 2482739 2498026 2517780 2541845 2570495 2603913 2642000
59132B642000M2839M8186N4197O0286O6034P1794P8016Q4295Q9756R4141R7773
$$ 2642000 2684839 2733025 2787222 2847508 2913542 2985336 3063352 3147647 3237403 3331544 3429317
59121C429317J00663J02455J03153J02909J01156R7143R1445Q5633Q0129P3805
$$ 3429317 3529980 3632435 3735588 3838497 3939653 4036796 4128241 4213874 4294003 4367808
59111D367808O6317N9284N4223N0715M7867M6379M7567N1212N5869O0668O5251
$$ 4367808 4434125 4493409 4547632 4598347 4646214 4692593 4740160 4791372 4847241 4907909 4973160
59100D973160O8369O8126O3428N3948L8964J7720r079l9378p1326j03555j34132
$$ 4973160 5041529 5109655 5173083 5227031 5265995 5283715 5274636 5235258 5163932 5060377 4926245
59089D926245j60757j82190j98376k09073k13628k12348k06821j98450j87750
$$ 4926245 4765488 4583298 4384922 4175849 3962221 3749873 3543052 3344602 3156852
59080C156852j75449j63072j51697j41003j30169j19199j08723r9087r0177q1829
$$ 3156852 2981403 2818331 2666634 2525631 2395462 2276263 2167540 2068453 1978276 1896447
59070A896447p3946o6515n9796n4221m9839m6058m2187l8039l3942l0308k7307
$$ 1896447 1822501 1755986 1696190 1641969 1592130 1546072 1503885 1465846 1431904 1401596 1374289
59059A374289k4799k2592k0695j9084j7295j4773j1796r459q338p773p000o277
$$ 1374289 1349490 1326898 1306203 1287119 1269824 1255051 1243255 1233796 1225458 1217685 1210685 1204408
59047A204408o254o742p092p347p982q679q446o991n104l474j850L18L039N832
$$ 1204408 1198154 1191412 1184320 1176973 1168991 1160312 1151866 1144875 1139771 1136297 1134447 1134765 1137804 1143636
59033A143636Q314J0474J2450J4085J4749J3909J1874R553P378N105K826J309
$$ 1143636 1151950 1162424 1174874 1188959 1203708 1217617 1229491 1239044 1246422 1251527 1254353 1255662
59021A255662R21J080J293J893L091M211M755N293O357P265P177O507O047N418
$$ 1255662 1256583 1257663 1258956 1260849 1263940 1268151 1272906 1278199 1284556 1291821 1298998 1305505 1311552 1316970
59007A316970L757J402o13k284m431o973q956j0141j1160j2024j1946j0767r398
$$ 1316970 1320727 1322129 1321516 1319232 1314801 1307828 1298872 1288731 1277571 1265547 1253601 1242834 1233436
58994A233436q577q276q311q459p922n904k847r9J764L287M799N869O250O327
$$ 1233436 1224859 1216583 1208272 1199813 1191891 1185987 1183140 1183041 1184805 1188092 1192891 1198760 1205010 1211337
58980A211337O468O790P624R202J0831J1488J1348J1704J3208J5152J6654J7585
$$ 1211337 1217805 1224595 1232219 1241421 1252252 1263740 1275088 1286792 1300000 1315152 1331806 1349391
58968A349391J8192J8818K0073K2357K4997K6806K7568K8093K8782K9178K9024
$$ 1349391 1367583 1386401 1406474 1428831 1453828 1480634 1508202 1536295 1565077 1594255 1623279
58957A623279K8701K8370K7727K6902K6667K7427K8764L0239L1950L4101L6717
$$ 1623279 1651980 1680350 1708077 1734979 1761646 1789073 1817837 1848076 1880026 1914127 1950844
58946A950844L9813M3245M6491M9269N2157N5767N9694O3239O6768P1209P6479
$$ 1950844 1990657 2033902 2080393 2129662 2181819 2237586 2297280 2360519 2427287 2498496 2574975
58935B574975Q1797Q7328R4084J02203J10760J19407J28853J39560J51353J64356
$$ 2574975 2656772 2744100 2838184 2940387 3051147 3170554 3299407 3438967 3590320 3754676
58925C754676J78989J94779K10648K26702K44388K64528K86452L09376L33345
$$ 3754676 3933665 4128444 4339092 4565794 4810182 5074710 5361162 5670538 6003883
58916F003883L58505L84764M12482M42091M72596N01771N28264N52188N73084
$$ 6003883 6362388 6747152 7159634 7601725 8074321 8576092 9104356 9656544 10229628
58907A0229628N88554N95530N91735N75398N44803M98884M37505L60849K69794
$$ 10229628 10818182 11413712 12005447 12580845 13125648 13624532 14062037 14422886 14692680
58898A4692680J67235N7995n2986j61338k62392l51504m26041m85695n30429n59610
$$ 14692680 14859915 14917910 14864924 14703586 14441194 14089690 13663649 13177954 12647525 12087915
58888A2087915n73781n75536n67728n52089n30353n05089m78188m49883m20375
$$ 12087915 11514134 10938598 10370870 9818781 9288428 8783339 8305151 7855268 7434893
58879G434893l91290l64306l39393l15630k92992k72174k53370k36172k20120
$$ 7434893 7043603 6679297 6339904 6024274 5731282 5459108 5205738 4969566 4749446
58870D749446k04593j88891j73153j58505j45597j33713j21963j10553j00224
$$ 4749446 4544853 4355962 4182809 4024304 3878707 3744994 3623031 3512478 3412254
58861C412254r1130q2906p5150o7360n9153n0998m3911l8073l2602k6945k1397
$$ 3412254 3321124 3238218 3163068 3095708 3036555 2985557 2941646 2903573 2870971 2844026 2822629
58850B822629j6039j0337m278J433O746J2488J8730K4388K9104L4045L9972M6006
$$ 2822629 2806590 2796253 2791975 2793408 2800154 2812642 2831372 2855760 2884864 2918909 2958881 3004887
58838C004887N1187N6025O1441O7496P4049Q1498Q9937R8751J07871J18173J29777
$$ 3004887 3056074 3112099 3173540 3241036 3315085 3396583 3486520 3585271 3693142 3811315 3941092
58827C941092J41499J52965J65746J81121J98243K15846K34432K55157K77824
$$ 3941092 4082591 4235556 4401302 4582423 4780666 4996512 5230944 5486101 5763925
58818E763925L01561L26499L53191L81201M09748M38864M68511M97255N23154
$$ 5763925 6065486 6391985 6745176 7126377 7536125 7974989 8443500 8940755 9463909
58809I463909N45107N61984N71387N70673N58464N33679M94022M37199L63310
$$ 9463909 10009016 10571000 11142387 11713060 12271524 12805203 13299225 13736424 14099734
58800A4099734K74793J74660O6277m5715j55954k59790l53388m33196m96784n43900
$$ 14099734 14374527 14549187 14615464 14569749 14413795 14154005 13800617 13367421 12870637 12326737
58790A2326737n75588n92763n96615n89643n74786n53892n28122m99179m68818
$$ 12326737 11751149 11158386 10561771 9972128 9397342 8843450 8315328 7816149 7347331
58781G347331m37678m05858l74322l44458l16782k91310k68764k50061k34859
$$ 7347331 6909653 6503795 6129473 5785015 5468233 5176923 4908159 4658098 4423239
58772D423239k21702k09408j97395j85148j72475j59928j48031j36541j25251
$$ 4423239 4201537 3992129 3794734 3609586 3437111 3277183 3129152 2992611 2867360
58763B867360j14877j06045r8143r0264q2617p5873o9774o3591n7386n1588m6001
$$ 2867360 2752483 2646438 2548295 2458031 2375414 2299541 2229767 2166176 2108790 2057202 2011201
58752B011201m0416l5571l2102k9186k5620k1766j8980j7519j6438j5333j4735
$$ 2011201 1970785 1935214 1903112 1873926 1848306 1826540 1807560 1790041 1773603 1758270 1743535
58741A743535j4900j5434j6102j6991j7937j8696j9499k0566k1420k1514k1126
$$ 1743535 1728635 1713201 1697099 1680108 1662171 1643475 1623976 1603410 1581990 1560476 1539350
58730A539350k0878k0863k1016k1758k3401k5447k7334k9180l1037l2251l2440
$$ 1539350 1518472 1497609 1476593 1454835 1431434 1405987 1378653 1349473 1318436 1286185 1253745
58719A253745l2234l2086l1347k9590k7765k6771k5921k4170k1868j9953j8354
$$ 1253745 1221511 1189425 1158078 1128488 1100723 1073952 1048031 1023861 1001993 982040 963686
58708I63686j6640j5356j5046j4856j3728j2188j1359j1000j0195r192q762q510
$$ 963686 947046 931690 916644 901788 888060 875872 864513 853513 843318 834126 825364 816854
58696H16854p565o332n683n092l501j479n62q68j224j301j736k473k809k826l088
$$ 816854 809289 802957 797274 792182 788681 787202 786640 785772 784548 783247 781511 779038 776229 773403 770315
58681G70315l188k305p27Q34K769N500P577P111M740K875K267J673Q16J147L331
$$ 770315 767127 764822 764095 764929 767698 773198 780775 787886 792626 795501 797768 799441 800257 801404 804735
58666H04735O157Q401R778R757P467L333r46m509p774j0584j1748j0946r360p940
$$ 804735 810892 819293 829071 838828 846295 849628 848682 844173 836399 825815 814067 803121 793761 785821
58652G85821o480m817l337j959o5K163L807M802O133Q146J0164J1883J3727J5688
$$ 785821 779341 774524 771187 769228 769163 771326 775133 779935 786068 794214 804378 816261 829988 845676
58638H45676J7233J8514K0268K2456K4473K6615K9731L3453L6502L8833M1713
$$ 845676 862909 881423 901691 924147 948620 975235 1004966 1038419 1074921 1113754 1155467
58627A155467M5613M9849N4452O0402O7657P4805Q1286Q8228R6529J05723J15192
$$ 1155467 1201080 1250929 1305381 1365783 1433440 1508245 1589531 1677759 1774288 1880011 1995203
58616A995203J24964J34741J43623J51306J58257J64159J67495J66977J62076
$$ 1995203 2120167 2254908 2398531 2549837 2708094 2872253 3039748 3206725 3368801
58607C368801J51985J35529J12505Q3948N0951J4621k2726n7955q8999j15192
$$ 3368801 3520786 3656315 3768820 3852768 3903719 3918340 3895614 3837659 3748660 3633468
58597C633468j35820j49963j57885j60956j60046j55441j48202j39821j30454
$$ 3633468 3497648 3347685 3189800 3028844 2868798 2713357 2565155 2425334 2294880
58588B294880j19247j06586r4275q3329p3395o4391n6822n0281m3630l6972l1574
$$ 2294880 2175633 2069047 1974772 1891443 1818048 1753657 1696835 1646554 1602924 1565952 1534378
58577A534378k7571k3756j9934j7480j7032j7501j7871j8080j7839j6511j4728
$$ 1534378 1506807 1483051 1463117 1445637 1428605 1411104 1393233 1375153 1357314 1340803 1326075
58566A326075j4166j5149j6388j7460j9581k3207k6904k9309l0506l0815l0011
$$ 1326075 1311909 1296760 1280372 1262912 1243331 1220124 1193220 1163911 1133405 1102590 1072579
58555A072579k8320k6564k4754k2289j9753j8643j8914j8835j7719j6681j6312
$$ 1072579 1044259 1017695 992941 970652 950899 932256 913342 894507 876788 860107 843795
58544H43795j5777j4800j4240j4108j3263j1722j0949j1136j0648q982p793p928
$$ 843795 828018 813218 798978 784870 771607 759885 748936 737800 727152 718170 710377 702449
58532G02449q021p168o499o716o548n267m435n324o631o605n667n128m920m394
$$ 702449 694428 687260 680761 674045 667497 662230 657795 652471 645840 639235 633568 628440 623520 619126
58518F19126l930m022l925k747r33N48J445J802J486J004J415K699L568L595L903
$$ 619126 615196 611174 607249 604502 603569 604117 605562 607364 608850 609854 611269 613968 617536 621131 625034
58503F25034N035N939N872N520N423N148M832N556P227Q095P373O369O005N241
$$ 625034 630069 636008 641880 647400 652823 657971 662803 668359 675586 683681 691054 697423 703428 708669
58489G08669L217R25n40j607k841l771m242n127o615p555p539p693q498q784p964
$$ 708669 711886 712811 712271 710664 707823 704052 699810 694683 688068 680513 672974 665281 656783 647999 640035
58474F40035p169p052o710n821n561o256o407n368m584m874m848l498j926j048
$$ 640035 632866 625814 619104 613283 607722 601466 595059 589691 585107 580233 575385 571887 569961 568913
58460E68913k3J473J979R40J56P71J274M12m35J56J057P72Q5K96R35J232J884
$$ 568913 568890 570363 572342 573282 573438 574209 575483 575895 575460 575616 576673 577445 577530 577826 578761 579993 581877
58443E81877L309M208L790L375L944M314L589L010L381L151J225p84j376j716
$$ 581877 585186 589394 593184 596559 600503 604817 608406 611416 614797 617948 619173 618389 617013 615297
58429F15297k978l733k590j041r06j217m14O53P03Q06K210L617L538L308M699
$$ 615297 612319 608586 605996 604955 604049 602832 602418 603071 603774 604580 606790 610407 613945 617253 621952
58414F21952O570O965O564O924P164N725L669K973L131K594J958K500L132K108
$$ 621952 628522 635487 642051 648975 656139 661864 665533 668506 671637 674231 676189 678689 681821 683929
58400F83929M01J61J089J464J475K434L879M520M827N856O836O699O556P819R385
$$ 683929 684330 684491 685580 687044 688519 690953 694832 699352 704179 710035 716871 723570 730126 737945 747330
58385G47330R648R570J0604J1246R055M664N61k737n980q212p892n850l887j752
$$ 747330 756978 766548 777152 788398 797453 802117 802678 799941 793961 785749 777857 772007 768120 766368
58371G66368J395M112M653M331N403P045O928N450M759M894M543M335N650P323
$$ 766368 767763 771875 776528 780859 786262 793307 800235 805685 810444 815338 819881 824216 829866 837189
58357H37189P237O147O311P366P245O074N507N251L984K592K807L675L106J884
$$ 837189 844426 850573 856884 864250 871495 877569 883076 888327 892311 894903 897710 901385 904491 906375
58343I06375K318L978M658M597N760P755Q438P924Q217R483J0273J0718J1969
$$ 906375 908693 912671 917329 921926 927686 935441 943879 951803 960020 969503 979776 990494 1002463
58330A002463J3286J3179J2480J2895J3658J3096J2168J2821J4185J4163J3283
$$ 1002463 1015749 1028928 1041408 1054303 1067961 1081057 1093225 1106046 1120231 1134394 1147677
58319A147677J3274J3376J2069J0706J1323J2537J1881J0480J0949J2477J2574
$$ 1147677 1160951 1174327 1186396 1197102 1208425 1220962 1232843 1243323 1254272 1266749 1279323
58308A279323J1965J2921J4509J4423J3799J5210J7519J7953J7563J9231K1957
$$ 1279323 1291288 1304209 1318718 1333141 1346940 1362150 1379669 1397622 1415185 1434416 1456373
58297A456373K2667K2109K3247K5274K5125K3591K4036K6219K7291K7587K9514
$$ 1456373 1479040 1501149 1524396 1549670 1574795 1598386 1622422 1648641 1675932 1703519 1733033
58286A733033L2134L2908L3398L6846M1604M3563M3708M6344N1062N3551N3379
$$ 1733033 1765167 1798075 1831473 1868319 1909923 1953486 1997194 2043538 2094600 2148151 2201530
58275B201530N3786N4642N2806M8848M6323M5079M2285L9090L9025M0918M0878
$$ 2201530 2255316 2309958 2362764 2411612 2457935 2503014 2545299 2584389 2623414 2664332 2705210
58264B705210M0118M3017M8607N2090N3671N7556O3325O6903O9007P3689P9669
$$ 2705210 2745328 2788345 2836952 2889042 2942713 3000269 3063594 3130497 3199504 3273193 3352862
58253C352862Q2307Q3133Q7744R5249R9820J01791J06854J14892J20495J24025
$$ 3352862 3435169 3518302 3606046 3701295 3801115 3902906 4009760 4124652 4245147 4369172
58243D369172J31124J41331J48593J53032J60808J72189J81488J88873K00205
$$ 4369172 4500296 4641627 4790220 4943252 5104060 5276249 5457737 5646610 5846815
58234E846815K15092K27350K37383K51503K69214K84318K98177L18074L42929
$$ 5846815 6061907 6289257 6526640 6778143 7047357 7331675 7629852 7947926 8290855
58225H290855L65197L86230M14343M48491M80488N12511N54690O06003O56428
$$ 8290855 8656052 9042282 9456625 9905116 10385604 10898115 11452805 12058808 12715236
58216A2715236P07544P70941Q46797R25538J010224J114226J237291J369029J515906
$$ 12715236 13422780 14193721 15040518 15966056 16976280 18090506 19327797 20696826 22212732
58207B2212732J697853J918688K169884K463636K829841L280872L815773M458673
$$ 22212732 23910585 25829273 27999157 30462793 33292634 36573506 40389279 44847952
58199D4847952N250640O201312P292824Q531663R948183J1554999J3376631J5516327
$$ 44847952 50098592 56299904 63592728 72124391 82072574 93627573 107004204 122520531
58191A22520531J8109252K1216674K4864363K9095781L3624186L7197376L7580454
$$ 122520531 140629783 161846457 186710820 215806601 249430787 286628163 324208617
58184C24208617L2730745K2338765Q262827o511545j9311148k8523515l3627415
$$ 324208617 356939362 379278127 387540954 381029409 361718261 333194746 299567331
58177B99567331l5004607l3666706l0795416k7295107k3679231k0227479j7096848
$$ 299567331 264562724 230896018 200100602 172805495 149126264 128898785 111801937
58170A11801937j4319336j1851487r676300p802058o184154m739839l430417k236279
$$ 111801937 97482601 85631114 75954814 68152756 61968602 57228763 53798346 51562067
58162E1562067j070818J38462J234072J813587J539021M43478j096938k633220
$$ 51562067 50491249 50629711 51863783 53677370 55216391 55659869 54562931 51929711
58154E1929711l844555m569669m785642m594419m168748l661996l160833k702962
$$ 51929711 48085156 43515487 38729845 34135426 29966678 26304682 23143849 20440887
58146B0440887k303825j962261j667632j414545j203385j028851q80451p53374
$$ 20440887 18137062 16174801 14507169 13092624 11889239 10860388 9979937 9226563
58138I226563o48426n63215m92570m35054l90972l56796l28430l06185k90341
$$ 9226563 8578137 8014922 7522352 7087298 6696326 6339530 6011100 5704915 5414574
58129E414574k76241k59689k42543k27342k11611j93021j74762j60097j46613
$$ 5414574 5138333 4878644 4636101 4408759 4197148 4004127 3829365 3669268 3522655
58120C522655j31363j16759j06257r9027r3721r2347r5522r8770r8284r5750r3364
$$ 3522655 3391292 3274533 3168276 3069249 2975528 2883181 2787659 2688889 2590605 2494855 2401491
58109B401491q9183q1872p4810p0786o7293o1620n5922n2737m9978m5005l9563
$$ 2401491 2312308 2230436 2155626 2084840 2017547 1955927 1900005 1847268 1797290 1752285 1712722
58098A712722l6348l4451l2320l1445l3088l4957l4827l4057l4200l3728l1338
$$ 1712722 1676374 1641923 1609603 1578158 1545070 1510113 1475286 1441229 1407029 1373301 1341963
58087A341963k8909k8051k7330k5709k4996k6022k6362k4761k3681k4592k4833
$$ 1341963 1313054 1285003 1257673 1231964 1206968 1180946 1154584 1129823 1106142 1081550 1056717
58076A056717k2340j9387j8424j8173j7099j6586j7325j6591j2866r386r260j0639
$$ 1056717 1034377 1014990 996566 978393 961294 944708 927383 910792 897926 888540 879280 868641
58064H68641j0363r011q473p851n798m039m701o554p446p945r296j0321r702q816
$$ 868641 858278 849267 840794 832943 827145 823106 818405 811851 804405 796460 787164 776843 767141 758325
58050G58325r069q984p089n153n180n730m635l071l322m584m433k846j504o86
$$ 758325 749256 740272 733183 728030 722850 717120 712485 709414 706092 701508 697075 694229 692725 692039
58036F92039K19N96j75q11k9J139J153M29j05j035k807m045l764l285l775m084
$$ 692039 692258 692854 692679 691868 691839 692978 694131 694560 694455 693420 690613 686568 682804 679519 675744 671660
58020F71660l257k823m043n197m424l021l101l907l484k218j744j915j699j598
$$ 671660 668403 665580 661537 656340 651916 648895 645794 641887 638403 636185 634441 632526 630827 629229
58006F29229k415l055k289j329j996l614m363m445n276o688p519q009r161j0624
$$ 629229 626814 623759 621470 620141 618145 614531 610168 605723 600447 593759 586240 578231 569070 558446
57992E58446j1402j1781j2465j2791j1765r779p571m734j108J839K990L477M638
$$ 558446 547044 535263 522798 510007 498242 488463 480892 476158 475050 476889 479879 483356 487994
57979D87994N705N603N275N910O424N297L484K895L197K741J575J005J023O28
$$ 487994 493699 499302 504577 510487 516911 522208 525692 528587 531784 534525 536100 537105 538128 538756
57965E38756j66q56j956l840n141m648l648m013n022m654l036j946j624q19N59
$$ 538756 538590 537734 535778 531938 526797 522149 518501 514488 509466 504812 501776 499830 498206 497387 497946
57950D97946J457J944L040M451M852M255L864L890L487K633K033J329n41l378
$$ 497946 499403 501347 504387 508838 513690 517945 521809 525699 529186 531819 533852 535181 534640 531262
57936E31262n886p624r072j0059r983r326r237r747r967r719r473r027p828o250
$$ 531262 525376 517752 508680 498621 488638 479312 470075 460328 450361 440642 431169 422142 414314 408064
57922D08064n006l802j993j08R02J320K059L006L587M283N808P385P689P081P047
$$ 408064 403058 399256 397263 397155 398057 399377 401436 404442 408029 412312 418120 425505 433194 440275 447322
57907D47322P849Q471Q597Q756Q756P792O039M577L776L096K385J834R88r20l675
$$ 447322 455171 463642 472239 480995 489751 497543 503582 508159 511935 515031 517416 519250 520238 519318 515643
57892E15643o302q271r478r585q538p233o503o115n676n526n586m608k134P6L73
$$ 515643 509341 501070 491592 482007 473469 466236 459733 453618 447942 442416 436830 432222 430088 430164 430537
57877D30537k33J99J467K126K447L862O096P404P408P346P585P261O286N577N178
$$ 430537 430304 430503 431970 434096 436543 440405 446501 453905 461313 468659 476244 483505 489791 495368 500546
57862E00546M216K737J681R73l11j953k711k528k611l234l453l225l734n211o324
$$ 500546 504762 507499 509180 510153 509842 507889 505178 502650 500039 496805 493352 490127 486393 481182 474858
57847D74858o206n436m591l446k077j203r74p69m41n12r94j354j726k652l676
$$ 474858 468652 463216 458625 455179 453102 451899 450925 450156 449715 449203 448209 446855 445129 442477 438801
57832D38801l773l200l337m589o013p108q218r140r106q449q435r061q806p085
$$ 438801 435028 431828 428491 423902 417889 410781 402563 393423 384317 375868 367433 358372 349566 342481
57818C42481n239m452m255l881l582l743l864l296k124p76M99J473K096K894M384
$$ 342481 337242 332790 328535 324654 321072 317329 313465 310169 308045 307269 307768 309241 311337 314231 318615
57803C18615O094P265Q182R544J0699J0249Q338O667N970N223L781K612K661L414
$$ 318615 324709 331974 340156 349700 360399 370648 378986 385653 391623 396846 400627 403239 405900 409314
57789D09314L887L872L551K875J881Q04m85k331m466o227p558q820r743r808r448
$$ 409314 413201 417073 420624 423499 425380 426184 425699 423368 418902 412675 405117 396297 386554 376746 367298
57774C67298r514r682q832o975n265m139l062k053j678j454j90J841K969K682
$$ 367298 357784 348102 339270 332295 327030 322891 319829 317776 316098 314644 314454 316295 319264 321946
57760C21946K245K393K439K192K631L916M680M332M155N074O088O074N533N345
$$ 321946 324191 326584 329023 331215 333846 337762 342442 346774 350929 356003 362091 368165 373698 379043
57746C79043N310N154N517O656P416O827N609M949M824M664M571M716M544L779
$$ 379043 384353 389507 395024 401680 409096 415923 421532 426481 431305 435969 440540 445256 449800 453579
57732D53579L312M030N484O649P276P685Q098Q848J0372J2277J3446J3683J4115
$$ 453579 456891 460921 466405 473054 480330 488015 496113 504961 515333 527610 541056 554739 568854
57719E68854J5359J6599J7194J7804J8919J9795J9988K0523K2245K4303K5751
$$ 568854 584213 600812 618006 635810 654729 674524 694512 715035 737280 761583 787334
57708G87334K7409L0541L4734L8710M2473M7025N2499N8124O3662O9585P6144
$$ 787334 814743 845284 880018 918728 961201 1008226 1060725 1118849 1182511 1252096 1328240
57697A328240Q3353R1468J00576J10199J20162J31016J42733J53863J63084J70473
$$ 1328240 1411593 1503061 1603637 1713836 1833998 1965014 2107747 2261610 2424694 2595167
57687B595167J75958J77472J72277J59477J39821J13755Q1521M4894P156k8578
$$ 2595167 2771125 2948597 3120874 3280351 3420172 3533927 3615448 3660342 3667498 3638920
57677C638920n9990q5026j02398j12397j15972j13183j03756q8628o9459m7287
$$ 3638920 3578930 3493904 3391506 3279109 3163137 3049954 2946198 2857570 2788111 2740824
57667B740824k3849m252L997m000k7072n9285r3175j21662j39397j44554j39344
$$ 2740824 2716975 2712723 2716720 2712720 2685648 2626363 2533188 2411526 2272129 2127575 1988231
57656A988231j27852j13255r7164q0723o5331n2149m1279l1710k2238j2618l648
$$ 1988231 1860379 1747124 1649960 1569237 1503906 1451757 1410478 1378768 1356530 1343912 1340264
57645A340264L983J0584J6939K3400K9937L6690M3856N1348N9129O7571P6966
$$ 1340264 1344247 1354831 1371770 1395170 1425107 1461797 1505653 1557001 1616130 1683701 1760667
57634A760667Q6925R6843J06634J16423J25795J34028J40724J45564J47607J45377
$$ 1760667 1847592 1944435 2051069 2167492 2293287 2427315 2568039 2713603 2861210 3006587
57624C006587J37576J23358J02443P5496M4079R795k5960o1010r2184j17211j36138
$$ 3006587 3144163 3267521 3369964 3445460 3489539 3499334 3473374 3412364 3320180 3202969 3066831
57613C066831j49971j58530j61069j58395j52815j45879j37582j27922j17885
$$ 3066831 2916860 2758330 2597261 2438866 2286051 2140172 2002590 1874668 1756783
57604A756783j08496r9789r1290q2795p4419o6551n9774n4336m9625m4844m0150
$$ 1756783 1648287 1548498 1457208 1374413 1299994 1233443 1173669 1119333 1069708 1024864 984714
57593I84714l6296l3318l0482k7490k4851k2804k0896j8803j6770j4964j3187
$$ 984714 948418 915100 884618 857128 832277 809473 788577 769774 753004 738040 724853
57582G24853j1486j0273r596q971q209p661p358o724n535m346l524k598j149L59
$$ 724853 713367 703094 693498 684527 676318 668657 661299 654575 649040 644694 641170 638572 637423 637782
57568F37782J294J935L044M648O029O827P539Q758J0378J1819J2788J3638J4943
$$ 637782 639076 641011 644055 648703 654732 661559 669098 677856 688234 700053 712841 726479 741422
57555G41422J6874J9048K0973K2515K3969K5791K8377L1848L5948M0294M4853
$$ 741422 758296 777344 798317 820832 844801 870592 898969 930817 966765 1007059 1051912
57544A051912M9951N5631O1389O6838P2316P8513Q5681R3490J01364J08580J14355
$$ 1051912 1101863 1157494 1218883 1285721 1358037 1436550 1522231 1615721 1717085 1825665 1940020
57533A940020J18280J20416J20472J17163J08920R5124P6244N3035K6332k409
$$ 1940020 2058300 2178716 2299188 2416351 2525271 2620395 2696639 2749674 2776006 2773597
57523B773597l1010n7273p9694r7579j10859j19687j24082j24089j20420j14468
$$ 2773597 2742587 2685314 2605620 2508041 2397182 2277495 2153413 2029324 1908904 1794436
57513A794436j07301r9065q9758q0117p1103o2924n5263m8177m2077l7017l2682
$$ 1794436 1687135 1588070 1498312 1418195 1347092 1284168 1228905 1180728 1138651 1101634 1068952
57502A068952k8891k5432k1688j7233j2614q771n779k863M25L857P204J0509J3682
$$ 1068952 1040061 1014629 992941 975708 963094 954323 948544 945681 946106 949963 957167 967676 981358
57489I81358J6655J9848K3742K7972L1798L5402L9814M5392N1391N7239O3361
$$ 981358 998013 1017861 1041603 1069575 1101373 1136775 1176589 1221981 1273372 1330611 1393972
57478A393972P0279P7761Q5296R2741R9921J06139J10524J12447J11276J06193
$$ 1393972 1464251 1542012 1627308 1720049 1819970 1926109 2036633 2149080 2260356 2366549
57468B366549R6607Q2339O3273L9479J2049j6760m4651p0244r2644j10695j23240
$$ 2366549 2463156 2545495 2608768 2648247 2660296 2643536 2598885 2528641 2435997 2325302 2202062
57457B202062j30000j31759j29808j25357j19224j11854j03642r5155q6800p8557
$$ 2202062 2072062 1940303 1810495 1685138 1565914 1454060 1350418 1255263 1168463 1089906
57447A089906p0429o3007n6960n2012m7186m2070l7135l2763k8786k5289k2898
$$ 1089906 1019477 956470 899510 847498 800312 758242 721107 688344 659558 634269 611371
57436F11371k1715k0711j8915j6639j4826j3626j2358j0668q985p871p484p693
$$ 611371 589656 568945 550030 533391 518565 504939 492581 481913 472928 465057 457573 449880
57424D49880q276q842q897q105o539m654l154k550k743l132l292l300l351l331
$$ 449880 441604 432762 423865 415760 409221 404567 401413 398863 396120 392988 389696 386396 383045 379714
57410C79714l053k619k255j916j422q56n12m23k10L94J055J129N04j34l8O90J286
$$ 379714 376661 374042 371787 369871 368449 367593 367081 366658 366448 366842 367897 369026 369530 369396 369358 370048 371334
57393C71334J365J269J323J279Q77M81O07J141J541J631J674J768J684J262N84
$$ 371334 372699 373968 375291 376570 377447 377928 378535 379676 381217 382848 384522 386290 387974 389236 389820
57378C89820j67p24q33n96m35m33j21O11R93N23K5O82K294L646M263M689N099
$$ 389820 389653 388929 388096 387500 387065 386632 386511 387122 388115 388638 388663 389345 391639 395285 399548 404237 409336
57361D09336M950M260L960M479N030M874M404M317M488M365L956L683L665L699
$$ 409336 414286 418546 422506 426985 432015 436889 441293 445610 450098 454463 458419 462102 465767 469466
57347D69466L725L832M074M480N020N421N396N152N244N848O610P250P798Q119
$$ 469466 473191 477023 481097 485577 490597 496018 501414 506566 511810 517658 524268 531518 539316 547435
57333E47435P947P467P236P367P441P399P631Q085Q131P745P847Q915J0141J0596
$$ 547435 555382 562849 570085 577452 584893 592292 599923 608008 616139 623884 631731 640646 650787 661383
57319F61383J0601J1105J2318J3637J4558J5055J5354J5821J6810J8164J9270
$$ 661383 671984 683089 695407 709044 723602 738657 754011 769832 786642 804806 824076
57308H24076J9872K0478K1587K2977K4154K5006K5679K6310K7157K8449K9764
$$ 824076 843948 864426 886013 908990 933144 958150 983829 1010139 1037296 1065745 1095509
57297A095509L0246K9793K9381K9705L0192K9892K8595K6481K3403J9330J4903
$$ 1095509 1125755 1155548 1184929 1214634 1244826 1274718 1303313 1329794 1353197 1372527 1387430
57286A387430J0725O564K052k336n785q176r852j0706j0350q901o825m267j295
$$ 1387430 1398155 1404719 1406771 1404435 1398650 1390474 1380622 1369916 1359566 1350665 1343840 1339573 1338278
57273A338278J490L477M959O789R180J1616J3808J5961J8128J9992K1417K2694
$$ 1338278 1339768 1343245 1348204 1354993 1364173 1375789 1389597 1405558 1423686 1443678 1465095 1487789
57261A487789K4097K5679K7437K9317L1085L2587L4005L5557L7114L8373L9251
$$ 1487789 1511886 1537565 1565002 1594319 1625404 1657991 1691996 1727553 1764667 1803040 1842291
57250A842291L9801M0120M0607M1860M3913M5918M7067M7498M7877M8567M9567
$$ 1842291 1882092 1922212 1962819 2004679 2048592 2094510 2141577 2189075 2236952 2285519 2335086
57239B335086N0794N1878N2196N1878N2303N4972O0024O6355P2666P7832Q0872
$$ 2335086 2385880 2437758 2489954 2541832 2594135 2649107 2709131 2775486 2848152 2925984 3006856
57228C006856Q1498Q0573P9318P8307P7623P7508P7974P8211P7222P4809P1362
$$ 3006856 3088354 3168927 3248245 3326552 3404175 3481683 3559657 3637868 3715090 3789899 3861261
57217C861261O7123O2440N8220N5192N3094N1449N0775N1875N4317N6731N8559
$$ 3861261 3928384 3990824 4049044 4104236 4157330 4208779 4259554 4311429 4365746 4422477 4481036
57206D481036O0388O2570O4658O6348O8005O9996P2217P4419P6331P7458P7473
$$ 4481036 4541424 4603994 4668652 4735000 4803005 4873001 4945218 5019637 5095968 5173426 5250899
57195E250899P6792P6059P5243P3924P2338P1184P0457O9414O7740O5907O4298
$$ 5250899 5327691 5403750 5478993 5552917 5625255 5696439 5766896 5836310 5904050 5969957 6034255
57184F034255O2695O0736N8163N4789N0945M7813M6297M5731M4740M3301M2798
$$ 6034255 6096950 6157686 6215849 6270638 6321583 6369396 6415693 6461424 6506164 6549465 6592263
57173F592263M3893M5567M6688M7402M8402M9664N0587N0875N0749N0545N0267
$$ 6592263 6636156 6681723 6728411 6775813 6824215 6873879 6924466 6975341 7026090 7076635 7126902
57162G126902M9357M7054M3432L9825L7488L6099L4240L1130K6945K1794J5481
$$ 7126902 7176259 7223313 7266745 7306570 7344058 7380157 7414397 7445527 7472472 7494266 7509747
57151G509747Q229N43p659j6697k5821l3161l7071l6773l2334k5509k0144j9625
$$ 7509747 7517976 7518519 7510860 7494163 7468342 7435181 7398110 7361337 7329003 7303494 7283350 7263725
57139G263725k3320k7070k7599k5035k0971j6278j1974j0222j2621j8319k5105
$$ 7263725 7240405 7213335 7185736 7160701 7139730 7123452 7111478 7101256 7088635 7070316 7045211
57128G045211l1626l7455m1845m3831m3224m0601l6697l2474k9224k7779k7954
$$ 7045211 7013585 6976130 6934285 6890454 6847230 6806629 6769932 6737458 6708234 6680455 6652501
57117F652501k9154l0715l1178k8204k0354q466N323J9300L2482M4412N6003P0002
$$ 6652501 6623347 6592632 6561454 6533250 6512896 6504430 6509753 6529053 6561535 6605947 6661950 6731952
57105F731952Q9326J15118J47116J85695K32676K90519L61630M48410N53290O78573
$$ 6731952 6821278 6936396 7083512 7269207 7501883 7792402 8154032 8602442 9155732 9834305
57095I834305Q26272R97525J191652J406072J637424J882216K136255K393822
$$ 9834305 10660577 11658102 12849754 14255826 15893250 17775466 19911721 22305543
57087B2305543K647213K885108L089841L237449L304058L276470L159424K971943
$$ 22305543 24952756 27837864 30927705 34165154 37469212 40745682 43905106 46877049
57079D6877049K731540K436161K060331J573832R70038K79812m39624j128170
$$ 46877049 49608589 52044750 54105081 55678913 56648951 56928763 56489139 55360969
57071E5360969j740156k250088k651770k953354l168140l305653l369405l360913
$$ 55360969 53620813 51370725 48718955 45765601 42597461 39291808 35922403 32561490
57063C2561490l283711l144469k953329k723985k471903k211326j953991j709460
$$ 32561490 29277779 26133310 23179981 20455996 17984093 15772767 13818776 12109316
57055A2109316j484682j282937j104532r48852q14996p01107o04628n23369m55282
$$ 12109316 10624634 9341697 8237165 7288313 6473317 5772210 5167582 4644213 4188931
57046D188931l97615l47717l04511k67895k36891k09805j85901j65383j47740
$$ 4188931 3791316 3443599 3139088 2871193 2634302 2424497 2238596 2073213 1925473
57037A925473j31831j17550j05697r6039q7177p8595p1193o5295n9806n3923m8208
$$ 1925473 1793642 1676092 1570395 1474356 1387179 1308584 1237391 1172096 1112290 1058367 1010159
57026A010159m3316l8996l4971l1561k8707k5658k2196j8992j6178j2811q354
$$ 1010159 966843 927847 892876 861315 832608 806950 784754 765762 749584 736773 728419
57015G28419l333J990Q181J5319K2719L0694M0805N3448O7526Q4007J06833J36287
$$ 728419 725086 727076 735257 750576 773295 803989 844794 898242 965768 1049775 1156608 1292895
57003A292895J62075J67081J40044Q4009J2949n7382j15083j53072j69246j66918
$$ 1292895 1454970 1622051 1762095 1846104 1859053 1801671 1686588 1533516 1364270 1197352
56993A197352j53199j35173j16878r9389q2767o7320n3289m0368k8150j6902p399
$$ 1197352 1044153 908980 792102 692713 609946 542626 489337 448969 420819 403917 396518
56982C96518j59M635O554N081O57n010j0085j3678j5649j6002j5061j3660j2488
$$ 396518 396359 400994 407548 412629 413286 408276 398191 384513 368864 352862 337801 324141 311653
56969C11653j1347r539o825l614n01J998L579M556N941Q606J2428J6545K0236
$$ 311653 300306 290767 283942 280328 279827 281825 285404 289960 295901 304507 316935 333480 353716
56956C53716K2943K3645K1035J4581N196n313j5004k2147k5553k5272k2831k0122
$$ 353716 376659 400304 421339 435920 441116 435803 420799 398652 373099 347827 324996 304874
56944C04874j7818j5116j1189o538k558Q1K115M674Q037J1651J5012J8191K1628
$$ 304874 287056 271940 260751 254213 251655 251736 253851 258525 266562 278213 293225 311416 333044
56931C33044K5589K9453L1328K8799K0758Q534m998j7204k6489l2073l3894l2830
$$ 333044 358633 388086 419414 448213 468971 477505 472507 455303 428814 396741 362847 330017
56919C30017l0246k7151k3971k0926j8061j5134j2068r412p784o900n896m493
$$ 330017 299771 272620 248649 227723 209662 194528 182460 173048 165264 158364 152468 147975
56907A47975l173k133r65M87J701K223K259K191K076J911J938K319K911L550M315
$$ 147975 144802 142669 141704 142191 143892 146115 148374 150565 152641 154552 156490 158809 161720 165270 169585
56892A69585N334O633Q207R936J1506J2782J4103J5632J6566J5648J2452P548
$$ 169585 174919 181552 189759 199695 211201 223983 238086 253718 270284 285932 298384 305932
56880C05932J648m543r744j2543j2816j1771j0353q377n533k234R52L915O581
$$ 305932 307580 303037 293293 280750 267934 256163 245810 237433 231900 229666 230618 234533 241114
56867B41114Q772J0945J4155J8695K3602K8230L3272L9334M5073M7758M5232L6761
$$ 241114 249886 260831 274986 293681 317283 345513 378785 418119 463192 510950 556182 592943
56855E92943K2873N697j0959k3386l0285l2833l2577l0103k5654j9988j4031q164
$$ 592943 615816 621513 610554 587168 556883 524050 491473 461370 435716 415728 401697 393533
56843C93533k238L892J0116J6220K2193K8362L5215M3076N2022O1703P0643P5613
$$ 393533 391295 395187 405303 421523 443716 472078 507293 550369 602391 664094 734737 810350
56831H10350P2542N9004L6086P953k0095m3363n8888o6138o6786o3257n7268m9682
$$ 810350 882892 941896 977982 985935 965840 922477 863589 797451 730665 667408 610140 560458
56819E60458m1194l2628k4574j7108r962k801M505J1740J8569K5078L1928L9728
$$ 560458 519264 486636 462062 444954 434992 432191 436696 448436 467005 492083 524011 563739
56807E63739M8023N4573N5631M7798L0654P787j5271l4295m7538n4722n6287n3720
$$ 563739 611762 666335 721966 769764 800418 808205 792934 758639 711101 656379 600092 546372
56795E46372m9111m3625l7102k9618k2437j6770j2335p961l146J723O264J0560
$$ 546372 497261 453636 416534 386916 364479 347709 335374 327413 324267 325990 332254 342814
56783C42814J4994J9975K5386K9874L1171K7651J9359P522o113j9091k8657l3418
$$ 342814 357808 377783 403169 433043 464214 491865 511224 518746 512633 493542 464885 431467
56771D31467l4303l3210l1150k8321k5132k2123j9189j5927j2606r997q370p336
$$ 431467 397164 363954 332804 304483 279351 257228 238039 222112 209506 199509 191139 183803
56759A83803o602o115n644m856l821k944k431k248k363k590k431j649q27p35j351
$$ 183803 177201 171086 165442 160586 156765 153821 151390 149142 146779 144189 141758 140109 139282 138547 137196
56744A37196j952k126k072j993j684q95J75Q58N23o98j769j697p26l1j51m28k72
$$ 137196 135244 133118 131046 129053 127369 126474 126649 127507 128030 127332 125563 123866 123140 123109 122958 122530 122258
56727A22258j15n54j213j277o41J59Q02J292J498J220N70j68q22j191j040n85
$$ 122258 122143 121589 120376 119099 118458 118617 119419 120711 122209 123429 123999 123831 123009 121818 120778 120193
56711A20193m89r13j219r57n51m43l10J32K80m47j508j958j779j575j342n79O19
$$ 120193 119704 118791 117572 116615 116064 115621 115311 115443 115723 115276 113768 111810 110031 108456 107114 106535 107154
56694A07154J596K092K311K204J538O02L0kK00M73Q02R53P70N94P53R38P19L14
$$ 107154 108750 110842 113153 115357 116895 117497 117527 117525 117725 118198 119000 119953 120723 121317 122070 123008 123727 124041
56676A24041J64J44j1pL57L08r89k851l605k695j217l54k32m69q23j044q49l99
$$ 124041 124205 124349 124338 124331 124688 124996 124007 121156 117551 114856 113639 113285 113053 112584 111761 110717 109868 109469
56658A09469k52o45j209j448j116k45P30J075M74n06j123j285j245r23k48K99
$$ 109469 109217 108572 107363 105915 104799 104554 105284 106359 106833 106327 105204 103919 102674 101751 101503 101802
56642A01802K68k4k3J16l1k73k25j69n04p41j27J024J727J794J782J726J169L57
$$ 101802 102070 102046 102023 102139 102108 101835 101610 101441 100937 100196 100069 101093 102820 104614 106396 108122 109291 109648
56624A09648J27N50Q35O28L56J95j45m90k36N78J192J343J537J921J967J529J192
$$ 109648 109775 110325 111160 111788 112144 112339 112194 111704 111468 112046 113238 114581 116118 118039 120006 121535 122727
56607A22727J244J226Q28L27r0n71r44o67J77P49O15K78K44L26J99k7j15l0K40
$$ 122727 123971 125197 126025 126352 126262 125691 124747 124080 124257 125006 125621 125899 126143 126469 126668 126641 126526 126496 126736
56588A26736O26P53L76k6K02Q67J272J447J970K692K802K289K088K498K641J967
$$ 126736 127362 128115 128491 128465 128667 129534 130806 132253 134223 136915 139717 142006 144094 146592 149233 151200
56572A51200J204J209J839K574L374M285M911M971M863N076N463N615N522N450
$$ 151200 152404 153613 155452 158026 161400 165685 170596 175567 180430 185506 190969 196584 202106 207556
56558B07556N470N404N091M540M028L989M507M984M770L854K585J062o10j849
$$ 207556 213026 218430 223521 228061 232089 236078 240585 245569 250339 254193 256778 257840 257230 255381
56544B55381k220k229k671l506m189m709n290n492m789l819l759m579n188n227
$$ 255381 253161 250932 248261 244755 240566 235857 230567 225075 220286 216467 212708 208129 202941 197714
56530A97714n322n597n382m575l931l694l308k702k589l054l202k647k101k026
$$ 197714 192392 186795 181413 176838 172907 169213 165905 163203 160614 157560 154358 151711 149610 147584
56516A47584j903j387j007j126j264r79n51k84q2Mk86o07k50N65P12j58j096j300
$$ 147584 145681 144294 143287 142161 140897 139918 139367 139083 139001 139005 138719 138112 137862 138427 139139 138981 137885 136585
56498A36585r43k43R67K337K923K607K298K324J923Q81K77P76J575J788J761K069
$$ 136585 135642 135399 136366 138703 141626 144233 146531 148855 150778 151659 151936 152712 154287 156075 157836 159905
56482A59905K398K333K237K424K426J958J678K109K700K807K797L329M247N039
$$ 159905 162303 164636 166873 169297 171723 173681 175359 177468 180168 182975 185772 189101 193348 198387
56468A98387N596N916N732N129M783M894M704L705K587K193K298K011Q82q91k693
$$ 198387 203983 209899 215631 220760 225543 230437 235141 238846 241433 243626 245924 247935 248817 247926 245233
56453B45233l590k973j470m66m19n22j76K74N43R18J341J229O21K82K76k53j412
$$ 245233 241643 238670 237200 236734 236315 235793 235617 235891 236434 237352 238693 239922 240543 240825 241101 240848 239436
56436B39436k167k176k499l667m589m332l582l238k886j915r53r30j558j908j783
$$ 239436 237269 235093 232594 228927 224338 220006 216424 213186 210300 208385 207432 206502 204944 203036 201253
56421B01253j579j479j608k200k935k936k070j314j315j547j486j420j542j366
$$ 201253 199674 198195 196587 194387 191452 188516 186446 185132 183817 182270 180784 179364 177822 176456
56407A76456p50l15k61N5Q06J252J158J230J563J234J00n87j86L92N17Q89J826
$$ 176456 175706 175391 175130 175185 175991 177243 178401 179631 181194 182428 182528 181941 181755 182147 182664 183553 185379
56390A85379K340J948J607J786J433J53n56K58J221Q85M6J21Q66J402J899K575
$$ 185379 187719 189667 191274 193060 194493 194646 194090 194348 195569 196454 196500 196621 197487 198889 200788 203363
56374B03363K534J400N76J118J928J791J540K243K922K255J069Q94J345J204Q28
$$ 203363 205897 207297 207873 208991 210919 212710 214250 216493 219415 221670 222739 223633 224978 226182 227010
56359B27010J169J611J088K94N14J303J552J731K711L481K608J047Q74J961K521
$$ 227010 228179 229790 230878 231172 231686 232989 234541 236272 238983 242464 245072 246119 246993 248954 251475
56344B51475K269K437L061K979K244K125K782L200L263L760M483M474M021M288
$$ 251475 253744 256181 259242 262221 264465 266590 269372 272572 275835 279595 284078 288552 292573 296861
56330B96861N124N238M455L895M009M274M559M993M822L280J243K78L41L00J23
$$ 296861 301985 307223 311678 315573 319582 323856 328415 333408 338230 341510 342753 343031 343372 343672 343795
56315C43795N57J122N89q01j612j419r14k28Q54J522Q45l14l11P12J356J494K082
$$ 343795 344352 345474 346063 345262 343650 342231 341317 341089 341943 343465 344310 343996 343685 344397 345753 347247 349329
56298C49329K881K727J863J730K538L220L560M261N054M964M393M760O195P555
$$ 349329 352210 354937 356800 358530 361068 364288 367848 372109 377163 382127 386520 391280 397475 405030
56284D05030Q576R909J1324J1968J2232J3242J4733J5624J6287J8012K0476K2191
$$ 405030 413606 423515 434839 446807 459039 472281 487014 502638 518925 536937 557413 579604
56272E79604K3228K5126K8167L1188L3986L7570M1992M6276N0481N5556O1261
$$ 579604 602832 627958 656125 687313 721299 758869 800861 847137 897618 953174 1014435
56261A014435O6460P1310P6771Q2209Q6023Q8432R1038R3693R4441R2624Q9315
$$ 1014435 1080895 1152205 1228976 1311185 1397208 1485640 1576678 1670371 1764812 1857436 1946751
56250A946751Q4683P7720O8728N9378M9984L9480K8352J8752J1216L940m029j1395
$$ 1946751 2031434 2109154 2177882 2237260 2287244 2326724 2355076 2373828 2385044 2388984 2384955 2373560
56238B373560j7023k1345k4845k7481l0048l3860l8687m3220m7650n3433o0330
$$ 2373560 2356537 2335192 2310347 2282866 2252818 2218958 2180271 2137051 2089401 2035968 1975638
56227A975638o6337p0660p4187p6865p7437p6135p4807p4007p2531p0148o7894
$$ 1975638 1909301 1838641 1764454 1687589 1610152 1534017 1459210 1385203 1312672 1242524 1174630
56216A174630o5410o1020n4966m9523m5351m0763l5292l0795k8113k5670k2491
$$ 1174630 1109220 1048200 993234 943711 898360 857597 822305 791510 763397 737727 715236
56205G15236j9776j8301j6905j4762j2673j1149r531p843p066o896n721l464j901
$$ 715236 695460 677159 660254 645492 632819 621670 612139 604296 597230 590334 584613 581149 579248
56192E79248j516p92P95J917K223L126M924N986N719N616O475P270P527Q104Q921
$$ 579248 577732 576940 577735 579652 581875 585001 589925 595911 601630 607246 613721 620991 628518 636622 645543
56177F45543Q715P698P570Q335Q109O651N839O075N587M094L673N016O210O342
$$ 645543 654258 661956 669526 677861 685970 692621 698460 704535 710122 714216 717889 722905 729115 735457
56163G35457O916Q543R643R604R911J1069J1757J1966J3502J6297J8027J8541
$$ 735457 742373 750916 760559 770163 780074 791143 802900 814866 828368 844665 862692 881233
56151H81233K0735K5723L0992L5014L9684M6535N4302O2147P1501Q2800R3991
$$ 881233 901968 927691 958683 993697 1033381 1079916 1134218 1196365 1267866 1350666 1444657
56140A444657J04261J15554J28575J40792J50046J56319J58251J52244J37647
$$ 1444657 1548918 1664472 1793047 1933839 2083885 2240204 2398455 2550699 2688346
56131B688346J19106J01601Q6608P4823O8106O5740O2547N3864L9553K1441P89
$$ 2688346 2807452 2909053 2995661 3070484 3138590 3204330 3266877 3320741 3360294 3381735 3382524
56120C382524j9494l4456m2209m6457n1735n9494p0604q7059j08175j28876j44544
$$ 3382524 3363030 3328574 3286365 3239908 3188173 3128679 3058075 2971016 2862841 2733965 2589421
56109B589421j54470j58595j55350j45292j32555j19829j05897r0501p6994o7209
$$ 2589421 2434951 2276356 2121006 1975714 1843159 1723330 1617433 1526932 1449938 1382729
56099A382729n8429m8719m0593l5964l2097k6406k0892j7901j5686j2117q719
$$ 1382729 1324300 1275581 1234988 1199024 1166927 1140521 1119629 1101728 1086042 1073925 1065206
56088A065206p128n583k746q85j425j478J200M022M288L891N205O564O025N557
$$ 1065206 1058078 1052495 1049749 1048864 1047439 1045961 1047161 1051183 1055471 1059362 1064567 1071131 1077156 1082713
56074A082713P217R154R556J0336J2842J4364J3047J1867J3353J4974J4202J3331
$$ 1082713 1089930 1099084 1108640 1118976 1131818 1146182 1159229 1171096 1184449 1199423 1213625 1226956
56062A226956J4664J5874J4958J4768J7545K0026J9333J8540K0746K2887K1447
$$ 1226956 1241620 1257494 1272452 1287220 1304765 1324791 1344124 1362664 1383410 1406297 1427744
56051A427744J9314K0519K2952K2810K1797K3371K6092K7083K7992L1169L4191
$$ 1427744 1447058 1467577 1490529 1513339 1535136 1558507 1584599 1611682 1639674 1670843 1705034
56040A705034L4423L4652L8011M1818M2644M2759M5240M7703M7422M7443N0753
$$ 1705034 1739457 1774109 1812120 1853938 1896582 1939341 1984581 2032284 2079706 2127149 2177902
56029B177902N3802N2870N1399N3630N6579N5980N4604N6764O0206O1421O3163
$$ 2177902 2231704 2284574 2335973 2389603 2446182 2502162 2556766 2613530 2673736 2735157 2798320
56018B798320O8472P3321P3757P4070P9007Q4511Q5599Q6513R2950J00967J04357
$$ 2798320 2866792 2940113 3013870 3087940 3166947 3251458 3337057 3423570 3516520 3617487 3721844
56007C721844J06363J12986J21231J25526J29222J37862J47653J52821J57729
$$ 3721844 3828207 3941193 4062424 4187950 4317172 4455034 4602687 4755508 4913237
55998D913237J68895J81887J89354J95152K06702K20341K28835K36367K50846
$$ 4913237 5082132 5264019 5453373 5648525 5855227 6075568 6304403 6540770 6791616
55989F791616K68302K80701K92299L11943L36125L56652L77857M08595M44547
$$ 6791616 7059918 7340619 7632918 7944861 8280986 8637638 9015495 9424090 9868637
55980I868637M76815N10441N55308O06844O55901P09025P77590Q56162R34634
$$ 9868637 10345452 10855893 11411201 12018045 12673946 13382971 14160561 15016723 15951357
55971A5951357J021859J132534J261267J396658J550241J742597J972427K231420
$$ 15951357 16973216 18105750 19367017 20763675 22313916 24056513 26028940 28260360
55963B8260360K538118K922803L392078L946288M617338N445413O431475P558343
$$ 28260360 30798478 33721281 37113359 41059647 45676985 51122398 57553873 65112216
55955F5112216Q841986J0313485J1980333J3875073J6114029J8826917K2066962
$$ 65112216 73954202 84267687 96248020 110123093 126237122 145064039 167131001
55948A67131001K5878037L0297891L4914851L8264086L8009469L2262979K1019862
$$ 167131001 193009038 223306929 258221780 296485866 334495335 366758314 387778176
55941C87778176O361497q676011k1456646l0419584l5130335l6099102l4440392
$$ 387778176 394139673 385463662 364007016 333587432 298457097 262357995 227917603
55934B27917603l1364190k7759770k4124510k0717495j7665563j4985234j2639007
$$ 227917603 196553413 168793643 144669133 123951638 106286075 91300841 78661834
55927G8661834j0611200q903691p484728o296773n305107m495640l836415l283334
$$ 78661834 68050634 59146943 51662215 45365442 40060335 35564695 31728280 28444946
55919B8444946k816687k435833k124803j856161j621956j429547j272046j131182
$$ 28444946 25628259 23192426 21067623 19211462 17589506 16159959 14887913 13756731
55911A3756731j004114r00263q15850p36616o61806o01631n54267n07571m60630
$$ 13756731 12752617 11852354 11036504 10299888 9638082 9036451 8482184 7974613 7513983
55902G513983m22606l92853l62030l30391l06177k88063k67131k44051k27202
$$ 7513983 7091377 6698524 6336494 6006103 5699926 5411863 5144732 4900681 4673479
55893D673479k15812k01445j84258j71953j64331j54169j41711j33602j28975
$$ 4673479 4457667 4256222 4071964 3900011 3735680 3581511 3439800 3306198 3177223
55884C177223j20827j09827j02968r9941r4134q5847q1391q0305p6240o9521o6377
$$ 3177223 3056396 2946569 2843601 2743660 2649526 2563679 2482288 2401983 2325743 2256222 2189845
55873B189845o6680o4446n9661n7732n8015n4615m7982m4242m3485l9764l2459
$$ 2189845 2123165 2058719 1999058 1941326 1883311 1828696 1780714 1736472 1692987 1653223 1620764
55862A620764k6790k3452j8485j3280j3973k0514k6382k9355l2801l6361l5453
$$ 1620764 1593974 1570522 1552037 1538757 1524784 1504270 1477888 1448533 1415732 1379371 1343918
55851A343918l0497k7086k6283k3861j9571j7969j9564k0136j9409k1510k6125
$$ 1343918 1313421 1286335 1260052 1236191 1216620 1198651 1179087 1158951 1139542 1118032 1091907
55840A091907k8059k6528k6303k8631k9392k7431k6441k7276k6310k2845k0528
$$ 1091907 1063848 1037320 1011017 982386 952994 925563 899122 871846 845536 822691 802163
55829H02163k0137j8375j4979j3671j4784j4239j1210r591j0585j0807r184q787
$$ 802163 782026 763651 748672 735001 720217 705978 694768 685177 674592 663785 654601 645814
55817F45814j0246j0137p490n518n344m421k493k718n379o759n689n153o099n877
$$ 645814 635568 625431 617941 612423 607079 602658 600165 597447 592068 585309 579620 574467 568368 562491
55803E62491m169m174o293o894m972l950n179n735m548m607o917q181o790n568
$$ 562491 558322 554148 547855 540961 535989 532039 526860 521125 516577 511970 505053 496872 490082 484514
55789D84514o196o310m442k753k533k033r64k150o338j0139j1462j2372j4351
$$ 484514 478318 472008 467566 464813 462280 460247 459283 457133 450795 440656 429194 416822 402471
55776D02471j5317j3822j1911j1318j0836r601r086r729r444p534o299o948p544
$$ 402471 387154 373332 361421 350103 339267 329666 320580 310851 301407 293873 287574 280626 273082
55763B73082o831o313o899p059o045n349n521n055l732l438m480m975m905o647
$$ 273082 266251 259938 253039 245980 239935 234586 229065 224010 220278 216840 212360 207385 202480 195833
55749A95833j0232j2386j1694j0444r853p987m254j441j023o52J418L291L209
$$ 195833 185601 173215 161521 151077 141224 133237 128983 127542 126519 125867 127285 130576 133785
55736A33785K571K833K872J808J074J497J530M28l7R77J500L08q90q20r05k148
$$ 133785 136356 139189 142061 143869 144943 146440 147970 148398 148361 149338 150838 151146 150256 149436 148531 146383
55720A46383k950k150j223j415j621j029q50j541j281Q48L035L890M416N308N364
$$ 146383 143433 141283 140060 138645 137024 135995 135145 133604 132323 133171 136206 140096 144512 149820 155184
55705A55184M400M418N998O765N466M257M806N347M016K051J140M23j350l238
$$ 155184 159584 164002 170000 176765 182231 186488 191294 196641 200657 202708 203848 204271 202921 199683
55691A99683m072m621n629o048n196m336m259l802k406j500j609r67J157K791
$$ 199683 195611 190990 185361 179313 174117 169781 165522 161720 159314 157814 156205 155238 156395 159186
55677A59186K785K962M554N614M472K806K636K985K248J334J620K120J456N39
$$ 159186 161971 164933 169487 175101 179573 182379 185015 188000 190248 191582 193202 195322 196778 197317
55663A97317P28J289J124R37J400J289j50j184l41R40P83j76p40j759m087o081
$$ 197317 198045 199334 200458 201395 202795 204084 203934 202750 202409 203349 204132 203956 203216 201457 197370 191289
55647A91289n994n083n495o730o931o169n728n488m640l808m042m770m928m908
$$ 191289 185295 180212 174717 167987 161056 154887 149159 143671 139031 135223 131181 126411 121483 116575
55633A16575n416n660m757l519l033k801k134j795k414k906k416k032k647k950
$$ 116575 111159 105499 100742 97223 94190 91389 89255 87460 85046 82140 79724 77692 75045 72095
55619G2095j728l04l71j110r14l55q77j952k068j380j059j024n25L9q8m49m04
$$ 72095 70367 70063 69692 68582 67668 67313 66436 64484 62416 61036 59977 58953 58428 58467 58379 57930 57526
55602E7526m71r99j030j79N9j189k248j575m59o50j211l97R77R97P9jO65O61J01
$$ 57526 57055 56056 55026 54847 54906 53717 51469 49894 49435 48785 47574 47177 48154 49151 49230 49229 49894 50555 50656
55583E0656J97P16N23j4L08J149J223P29Q70J546J749J676K288L358L910M026
$$ 50656 50853 51569 52092 52078 52386 53535 54758 55487 56357 57903 59652 61328 63616 66974 70884 74910
55567G4910M276M179L080J765J287J082R8j185j851k481l900n118m787l701l508
$$ 74910 79186 83365 86445 88210 89497 90579 90677 89492 87641 85160 81260 76142 71355 67654 64146
55552F4146l896l470k450k005j745n30R50R86j38n44K41J045J428K021K697K710
$$ 64146 60250 56780 54330 52325 50580 50050 51000 51986 51848 51304 51545 52590 54018 56039 58736 61446
55536F1446K381K582K853K161J066R49J530J448Q97J302K531K845J665K20o60
$$ 61446 63827 66409 69262 71423 72489 73438 74968 76416 77313 78615 81146 83991 85656 85876 85216
55521H5216j383k179k687l028l569l833l247k598k947l589l086j889j740k777
$$ 85216 83833 81654 78967 75939 72370 68537 65290 62692 59745 56156 53070 51181 49441 46664
55507D6664l483l338l238l328k697j438q59j258j459q87l36l20l04K7J85j21o81
$$ 46664 43181 39843 36605 33277 30580 29142 28283 27025 25566 24679 24343 24023 23719 23746 23931 23810 23129
55490B3129j418k178k177r87K95L78k80m51l81j118k110j762k11P13L69k3K37
$$ 23129 21711 19533 17356 16369 16664 17042 16762 16311 15930 14812 12702 10940 10729 11442 11811 11788 12025
55473A2025L58j38n29l67k20m49o86p83r60r72m40Nn38j470j270J06J139J106
$$ 12025 12383 12245 11716 11349 11129 10680 9994 9211 8251 7279 6839 6844 6306 4836 3566 3672 4811 5917
55455E917Q48J000J079P36L95K48j07p28j092r98o68j07O92J173R86Q38J346J623
$$ 5917 6765 7765 8844 9580 9975 10223 10116 9388 8296 7298 6630 6523 7215 8388 9374 10212 11558 13181
55437A3181N44j168j847j357q22l80O92J950K026R57K09L06L56N1J03N06K93n34
$$ 13181 13725 12557 10710 9353 8531 8151 8843 10793 12819 13776 13985 14291 14647 14698 14801 15307 15600 15066
55419A5066p90j32L96K62J90N88Q62P46Q48J396J811J803J673J365N31m37p63
$$ 15066 14276 14144 14540 14802 14992 15580 16442 17188 18036 19432 21243 23046 24719 26084 26615 26178 25415
55402B5415o09o95q21l67J06m22j436j476o60n44j434j969j492q16l42M48J324
$$ 25415 24806 24111 23290 22923 23029 22607 21171 19695 19035 18491 17057 15088 13596 12780 12438 12886 14210
55385A4210J215K14k60K15N09J23j29L1k10q54p79J29M83k18p25k98J14j80l80
$$ 14210 15425 15639 15379 15594 16103 16226 16097 16128 15918 15064 14285 14414 14897 14679 13954 13656 13770 13590 13210
55366A3210K06R55J240J341J325O72l48o49l16p59k214l028k312j245q60m99L14
$$ 13210 13416 14371 15611 16952 18277 18949 18601 17952 17636 16877 14663 11635 9323 8078 7218 6719 7033
55349G033N72k94j010n07K47j3p10n68L15J017J261J096J73j326k159j551l97
$$ 7033 7605 7311 6301 5794 6041 6028 5318 4750 5065 6082 7343 8439 8612 7286 5127 3576 3179
55332C179J14O3K1r8l81k33N35J021O54K20M53P69M33o4R6P72J427J973K149J296
$$ 3179 3293 3356 3377 3279 2898 2665 3200 4221 4875 5095 5548 6317 6750 6686 6782 7554 8981 10954 13103 14399
55312A4399k78r82r8R44O82l06o76n18o57q58l90K91J36o74r09j19R21J428J263
$$ 14399 14121 13139 13041 13985 14667 14361 13685 13167 12510 11652 11262 11553 11689 11015 10106 9987 10908 12336 13599
55293A3599O23r1l80k03r2k56k28J56J82o58j796k393k265j532k61J050J541J236
$$ 13599 14222 14131 13751 13548 13456 13200 12972 13128 13310 12652 10856 8463 6198 4666 4405 5455 6996 8232
55275H232J089J303Q26o82j791j294n3L60j54o46p59o53j10R63J767J535P28K98
$$ 8232 9321 10624 11450 10768 8977 7683 7630 7990 7836 7190 6431 5778 5668 6631 8398 9933 10661 10959
55257A0959L46M37N69Q67R02L65k05k00J23K24J05j32p10j341j076J72R09O8j301
$$ 10959 11305 11742 12311 13178 14080 14445 14240 14040 14163 14387 14492 14360 13650 12309 11233 11405 12314 12382 11081
55238A1081j580r04n40p64q23m91j83N5M21N19q4q39q11k0P89J287J529J262M03
$$ 11081 9501 8597 8057 7293 6470 5979 5796 5851 6272 6791 6707 5868 5057 5037 5826 7113 8642 9904 10307
55219A0307k50L1O32M15n15r93n89pJ86J76K27K51K10K31L17L69M08L99J96nK51
$$ 10307 10057 10088 10720 11135 10620 9627 9038 9031 9217 9393 9620 9871 10081 10312 10629 10998 11406 11805 12001 11996 12247
55198A2247Q11P77j84j138j169o56m53n31l12K31O83R26J017Q41M73K97K27l33
$$ 12247 13058 13835 13651 12513 11344 10688 10235 9704 9392 9623 10306 11232 12249 13090 13563 13860 14087 13754
55180A3754j207j167J77J397J202K93L2L17K35j04k7R4n40j507j719j288j192
$$ 13754 12547 11380 11557 12954 14156 14449 14481 14798 15033 14929 14902 14996 14456 12949 11230 9942 8750
55163H750j364q92P2L50j98l62L43Q35K93m71k49R08J906J923J053N1l07N4M26
$$ 8750 7386 6494 6566 6916 6718 6356 6699 7534 7827 7356 7107 8015 9921 11844 12897 12948 12641 12695 13121
55144A3121J94l91p72r29j064q71M5J299K145K461K583K462J936J493J775K483
$$ 13121 13315 12924 12152 11223 10159 9288 9333 10632 12777 15238 17821 20283 22219 23712 25487 27970
55128B7970K730K447K367K620K352J022o70j548j176j71M30J35n22n90K2M12j7
$$ 27970 30700 33147 35514 38134 40486 41508 40838 39290 38114 37943 38373 38508 37986 37396 37418 37830 37813
55111C7813q01j368j854k384k398j599p58o31p30k41M91N67R9l8L05M92K43j67
$$ 37813 37012 35644 33790 31406 29008 27409 26651 26020 25290 25049 25540 26107 26206 26168 26473 26965 27208 27041
55093B7041o54j199j298n64M48R48J061J315J493J146P94J213J928J851J115P98
$$ 27041 26387 25188 23890 23326 23774 24722 25783 27098 28591 29737 30531 31744 33672 35523 36638 37436
55077C7436R74O30m49j237j140o92k81M08J329J671J134M45J93Q7j57k23R6M22
$$ 37436 38410 39040 38591 37354 36214 35522 35241 35649 36978 38649 39783 40228 40421 40508 40351 40128 40224 40646
55059D0646M77M44L15k68j135j412o83L15O92M99L60N63Q84J024R05P61R66J476
$$ 40646 41123 41567 41882 41614 40479 39067 38384 38699 39391 39890 40250 40813 41697 42721 43626 44387 45353 46829
55041D6829J674J163M72L44O04M97l4l49k66k76n49o01j69M44R90J500J710J132
$$ 46829 48503 49666 50138 50482 51086 51583 51549 51200 50934 50658 50109 49508 49339 49783 50773 52273 53983 55115
55023E5115o9r32p98o8L70k3j164k425k893k151p99J28K33j66p56j333j504j028
$$ 55115 55046 54114 53316 53248 53618 53595 52431 50006 47113 44962 44163 44291 44524 44358 43602 42269 40765 39737
55005C9737l03O7J08J32N6k48k54N16J367J161Kq56q17m68k69O4O42R83Q67O88
$$ 39737 39434 39501 39609 39741 39797 39549 39295 39811 41178 42339 42341 41485 40668 40200 39931 39995 40637 41620 42487 43175
54985D3175O09K37m17n99J78J359K080K107J734J270R07P42P06Q14J339K364L364
$$ 43175 43784 44021 43604 43005 43183 44542 46622 48729 50463 51733 52640 53382 54088 54902 56241 58605 61969
54968F1969L802L933M413N299O137O812P574Q456R389J0561J1873J2432J1559
$$ 61969 65771 69704 74117 79416 85553 92365 99939 108395 117784 128345 140218 152650 164209
54955A64209R854Q231O379L440k25l465o190r128j1830j2826j1967j0811j0276
$$ 164209 174063 182294 188673 192113 191888 188423 182233 173105 161275 148449 136482 125671 115395
54942A15395r634q415p491p348o962n572m093l580l419k510j276j016j760k188
$$ 115395 105761 97346 89855 82507 75545 69973 65880 62300 58881 56371 55095 54079 52319 50131
54928E0131j416J41J678K787L362L377L020K697K915M008N765P380Q267Q841R803
$$ 50131 48715 48856 50534 53321 56683 60060 63080 65777 68692 72700 78465 85845 94112 102953 112756
54913A12756J0732J0372Q468O197M393K423n37l994o758q392r261r634r480q892
$$ 112756 123488 133860 142328 148525 152918 155341 154804 150810 144052 135660 126399 116765 107285 98393
54899I8393q084p172o327n840n701n405m465k913j236j19r8r66j615j174k28j8
$$ 98393 90309 83137 76810 70970 65269 59864 55399 52486 51250 51131 51033 50067 48452 47278 47050 47032
54883D7032o01p86p0O17M58j01l62n07r38j352j225p13l28k30l06n28p69p64o38
$$ 47032 46431 45645 45575 46192 46650 46549 46187 45680 44742 43390 42165 41452 41124 40894 40588 40060 39291 38527 37889
54864C7889r47j771k277j653j02J364J826J040l15j033o07P0r7o70l53Q10J322
$$ 37889 36942 35171 32894 31241 31139 32503 34329 35369 35054 34021 33414 33484 33387 32717 32364 33174 34496
54847C4496N92j87q9J51k92p61l32M71N42Mj15M51R71R42N80K77K40M93P89P61
$$ 34496 35088 34901 34812 34963 34671 33910 33578 34049 34591 34595 34480 34931 35902 36844 37424 37701 37941 38434 39223 39984
54827C9984N00N12Q24Q36M17L12R44J624J627J224J007R33Q32J083J980K985L550
$$ 39984 40484 40996 41820 42656 43073 43385 44329 45953 47580 48804 49811 50744 51576 52659 54639 57624 61174
54810F1174L994M888O073P063P859Q611R070R120R245R667R685Q572O553M125
$$ 61174 65168 70056 76129 83192 91051 99662 108732 117852 127097 136764 146449 155021 161574 165699
54796A65699J252j905m292n180n417o234p312p370o256n152m819m886m888m834
$$ 165699 166951 165046 160754 155574 150157 143923 136611 129241 122985 117833 113014 108128 103240 98406
54782I8406m665m059l010j936j135o16l39r5N21J482K064J932J967L153N031O259
$$ 98406 93741 89682 86672 84736 83601 82985 82646 82551 83072 84554 86618 88550 90517 93670 98701 104960
54766A04960O434O377O758P501Q425R534J0531J0938J0796J0560J0302R670Q503
$$ 104960 111394 117771 124529 132030 140455 149989 160520 171458 182254 192814 203116 212786 221289
54753B21289O880M702K015m76k041k932l967n254o197o724p477q646r592r893
$$ 221289 228169 232871 234886 234410 232369 229437 225470 220216 214019 207295 199818 191172 181580 171687
54739A71687r936j0177j0437j0271r525q302o810n454m623m293m095l821l475
$$ 171687 161751 151574 141137 130866 121341 113039 106229 100775 96152 91859 87764 83943 80468
54726H0468l014k466k107k077j917j155j65K61L9j69l7Q3m9k05k64m82r37j277
$$ 80468 77454 74988 72881 70804 68887 67732 67567 67828 67867 67698 67661 67744 67695 67490 67226 66744 65807 64530
54708F4530j273j120r60n62J88Q67R67N51K47N43J263J731J483P79K33Kk40m98
$$ 64530 63257 62137 61177 60615 60803 61670 62637 63188 63435 63978 65241 66972 68455 69234 69467 69469 69229 68731
54690F8731k82M78J000O68k8k36Q0L85O09J047J519J537J239J265J735K059J849
$$ 68731 68449 68927 69927 70595 70567 70331 70411 70796 71405 72452 73971 75508 76747 78012 79747 81806 83655
54673H3655J308P17K55L48J368K839L659L347K528J919J495R90O34Q68J657K478
$$ 83655 84963 85680 85935 86283 87651 90490 94149 97496 100024 101943 103438 104428 105062 105930 107587 110065
54657A10065K927L031L037L119L274L470L792M342N022N638O259P166Q346R418
$$ 110065 112992 116023 119060 122179 125453 128923 132715 137057 142079 147717 153976 161142 169488 178906
54643A78906J0222J1095J2297J3596J4625J5186J4870J2976R276M371j039o653
$$ 178906 189128 200223 212520 226116 240741 255927 270797 283773 293049 297420 296381 289728
54631B89728j1821j5240j6265j5918j5594j5320j4285j2612j1293j0608r842q592
$$ 289728 277907 262667 246402 230484 214890 199570 185285 172673 161380 150772 140930 132338
54619A32338p230n988m661l385k648k327j686o02J41L0n73j274k131k906k866
$$ 132338 125108 119120 114459 111074 108426 106099 104413 103811 103952 103982 103409 102135 100004 97098 94232
54604I4232j909j148j589k804l495l080k115j502j638k207k464j933r96m86o13
$$ 94232 92323 91175 89586 86782 83287 80207 78092 76590 74952 72745 70281 68348 67352 66866 66253
54589F6253p39l69J40J18n81j533k191k129j284j58M89M32R2k30p44j534k049
$$ 66253 65514 65145 65285 65403 64822 63289 61098 58969 57685 57527 58016 58448 58540 58310 57566 56032 53983
54572E3983j693p07Q6K57J34J96M37N13L87N53J416K567K998K244R33J8k33j24
$$ 53983 52290 51583 51669 51926 52060 52256 52693 53206 53593 54146 55562 58129 61127 63371 64304 64322 64089 63965
54554F3965J61N92Q59O12R7k4M39J015J276J275J267J415J806K377K791K882L105
$$ 63965 64126 64718 65577 66189 66286 66262 66701 67716 68992 70267 71534 72949 74755 77132 79923 82805 85910
54537H5910M024N369O176O017N503N433N957O766P559P983P561O058L773J285
$$ 85910 89934 95303 101479 107496 112999 118432 124389 131155 138714 146697 154258 160316 164089 165374
54523A65374r85k888m486n870o910p252o791o067n708n633n228m340l610l653
$$ 165374 164389 161501 157015 151145 144235 136983 130192 124125 118417 112784 107556 103216 99606 95953
54509I5953m249m536l799k151n42Qn39j151r52k05K72K89J86o0p65j630j805j049
$$ 95953 91704 87168 83369 81218 80676 80684 80145 78994 78042 77837 78109 78398 78584 78524 77759 76129 74324 73275
54491G3275q6M31O25P88P57L08k98o68p90q50q14n13j2M12N62M83L71L61L99K92
$$ 73275 73189 73620 74245 75033 75790 76098 75800 75132 74342 73492 72678 72165 72153 72565 73127 73610 73981 74342 74741 75033
54471G5033J8k12k78k69k16j5J35k59j129j525q15K63M76k82j066j326j321j234
$$ 75033 75051 74839 74561 74292 74076 74061 74196 73937 72808 71283 70468 70731 71207 70925 69859 68533 67212 65978
54453F5978q56l15j63m62n40M4Q96J425J405Q30j79j107j324r33p45j073j203
$$ 65978 65122 64807 64644 64182 63642 63686 64582 66007 67412 68242 68063 66956 65632 64699 63954 62881 61678
54436F1678m79O55J213R11L45J01J28N3j97k97o0J02l05r32p77M07J559J678J143
$$ 61678 61199 61854 63067 63978 64323 64424 64552 64605 64408 64111 64051 64153 63848 62916 62139 62546 64105 65783 66926
54417F6926R34J146J152Q04N14L69K16L39J045J770J767J420J719K479K548J813
$$ 66926 67860 69006 70158 70962 71476 71845 72061 72400 73445 75215 76982 78402 80121 82600 85148 86961
54401H6961J451J866J951J059K27N23J332J398O69O5kJ38J68j4m94j164j630j825
$$ 86961 88412 90278 92229 93288 93515 94038 95370 96768 97437 97502 97500 97638 97806 97792 97298 96134 94504 92679
54383I2679k185k786k961k272j348j068j396j681j651j536j504j524j596j610
$$ 92679 90494 87708 84747 82475 81127 80059 78663 76982 75331 73795 72291 70767 69171 67561
54369F7561j358q74m59j45L72R75J002K50n22n81j00L82P66J092J085O45L07N61
$$ 67561 66203 65329 64870 64725 65097 66072 67074 67324 66802 66221 66121 66503 67269 68361 69446 70091 70398 70959
54351G0959J155J619K001K517K864K628K009J582J573J827K169K349J960R51j58
$$ 70959 72114 73733 75734 78251 81115 83743 85752 87334 88907 90734 92903 95252 97212 98163 98005
54336I8005r52j616k293k555k026j139o41o14o59o51q38j345k103k980l599l444
$$ 98005 97053 95437 93144 90589 88563 87424 86783 86169 85510 84859 84021 82676 80573 77593 73994 70550
54320G0550k573j806j739j940j689j030m97k25J9J59j08p18j278j612j755j660
$$ 70550 67977 66171 64432 62492 60803 59773 59276 59051 59070 59229 59121 58403 57125 55513 53758 52098
54304E2098j309r63q60q72q17q08q95p23mQ95J331J096M77j76n66n30l08m09q65
$$ 52098 50789 49826 48966 48094 47277 46469 45574 44851 44847 45742 47073 48169 48646 48470 47904 47374 47066 46657 45792
54285D5792j042n54J00K74L1k10l72n28m42P0O73R43R18P92M88N4n7L56P76P55
$$ 45792 44750 44196 44296 44570 44601 44391 44019 43491 43049 43119 43792 44735 45653 46445 46933 46987 46930 47286 48062 48817
54265D8817O12P39Q13M80K06N14R03N88l8J07J043J626J253N72K89K15j27p09
$$ 48817 49429 50168 50981 51461 51667 52181 53084 53672 53634 53741 54784 56410 57663 58235 58524 58739 58612 57903
54247E7903j198j446j453j178o29P3P41J036O05l68r80o06K29N08M9m47n50n01
$$ 57903 56705 55259 53806 52628 51999 52072 52813 53849 54454 54086 53106 52500 52729 53237 53286 52839 52289 51788
54229E1788m87k95J36M22K85K5J32O65J126Q75j78j256j318k63Q82J228R96Q18
$$ 51788 51301 51006 51142 51564 51849 51874 52006 52671 53797 54672 54494 53238 51920 51657 52539 53767 54763 55581
54211E5581O25Lq21j179r48n62j65M57J134J325R23L73p4n41q87o91m3L18k3o06
$$ 55581 56206 56209 55388 54209 53261 52699 52534 52991 54125 55450 56373 56746 56672 56131 55244 54553 54510 54828 54805 54199
54191E4199q20p46r16j540k226k357j614l20P09Q77M60K64O63J141R52J8q62p55
$$ 54199 53379 52633 51717 50177 47951 45594 43980 43660 44369 45246 45706 45970 46633 47774 48726 48744 47882 47127
54173D7127M11J659J920J178L60J41L12L91K67J9l60p14p18m15k44k68j9N40O58
$$ 47127 47538 49197 51117 52295 52655 52796 53108 53499 53766 53785 53425 52711 51993 51578 51334 51066 51047 51587 52245
54154E2245l7p99q53n15m62n71m06k42n59r71p61q6K80K45L37O28P12O20O83O33
$$ 52245 52208 51409 50556 50041 49579 49008 48602 48360 47801 46830 46069 45983 46263 46508 46845 47473 48185 48805 49488 50121
54134E0121q4j164j633j287q92r01r30o61l20l5L99Q88R93P03N50O87O71L29L2
$$ 50121 50037 48873 47240 45953 45061 44160 43230 42569 42249 42214 42613 43501 44494 45197 45747 46434 47105 47434 47466
54115D7466n5k66o59p07q7P50J165R90M17k79p69q22n43j04N75J422J745R26n43
$$ 47466 47411 47145 46486 45779 45692 46442 47607 48597 49014 48735 47966 47144 46601 46497 47072 48494 50239 51165 50622
54096E0622j512j607j433j382j162n89kL58O10P70O82N01M98M01k08r27q76r7
$$ 50622 49110 47503 46070 44688 43526 42937 42935 43293 43903 44673 45355 45856 46354 46755 46547 45620 44744 44647
54078D4647M37L56L30P34R89O86L25L36L04j94p13n92P5O64P73M07m1J48J344
$$ 44647 45084 45440 45770 46504 47493 48179 48504 48840 49144 48950 48237 47645 47720 48384 49157 49564 49523 49671 51015
54059E1015K712K887J709M95K56O05Q21R67J316J619J725K104K981L625L330K535
$$ 51015 53727 56614 58323 58818 59074 59679 60500 61467 62783 64402 66127 68231 71212 74837 78167 80702
54043H0702K146K282K406K226J833J330J064J612K893L847L769L457M139N669
$$ 80702 82848 85130 87536 89762 91595 92925 93989 95601 98494 102341 106110 109567 113706 119375
54029A19375O748O670N910N136M522M068L781L444K842K252K167K459K380J522
$$ 119375 126123 132793 138703 143839 148361 152429 156210 159654 162496 164748 166915 169374 171754 173276
54015A73276K95o53j086j140j037j045j447k276l141l551l424l169l184l342l220
$$ 173276 173571 172918 171832 170692 169655 168610 167163 164887 161746 158195 154771 151602 148418 145076 141856
54000A41856k843k787l266l614l181k376k078k303k279j765j315j142p58k5M09
$$ 141856 139013 136226 132960 129346 126165 123789 121711 119408 117129 115364 114049 112907 112149 112124 112533
53985A12533J29m08p47j136j762k113j766j120p12m51j92l23r53j204l24R59J254
$$ 112533 112662 112254 111507 110371 108609 106496 104730 103610 102898 102447 102255 101932 100979 99775 99451 100410 101664
53968A01664M16l90m41k93o85j469j924j665r39l12j04k6M92J426J914J312J35
$$ 101664 102080 101690 101249 100956 100271 98802 96878 95213 94274 93962 93858 93832 94324 95750 97664 98976 99111
53951I9111m84j18P35J477J890J862J375Q16P90J435K259K756K919L082L469M030
$$ 99111 98627 98509 99244 100721 102611 104473 105848 106664 107454 108889 111148 113904 116823 119905 123374 127404
53935A27404M472M504M119L636L306L020K542J935J544J595J947K211K103J756
$$ 127404 131876 136380 140499 144135 147441 150461 153003 154938 156482 158077 160024 162235 164338 166094
53921A66094J645K066K783L333L604L810M063M299M525M715M646M338M445N423
$$ 166094 167739 169805 172588 175921 179525 183335 187398 191697 196222 200937 205583 209921 214366 219789
53907B19789O498O355M935L518K804K049O04p77j024l52J17j55q60j670k512l312
$$ 219789 226287 232642 237577 241095 243899 245948 246552 245775 244751 244399 244516 244361 243501 241831 239319 236007
53891B36007m011m693n268n413n241n445o231o729o178n140m688m900n027m819
$$ 236007 231996 227303 222035 216622 211381 205936 199705 192976 186798 181658 176970 172070 167043 162224
53877A62224m638m491l987l263l057l626m299m325l639k711k080k086k623l102
$$ 162224 157586 153095 149108 145845 142788 139162 134863 130538 126899 124188 122108 120022 117399 114297
53863A14297l033k553k145j945j796j669j625j462j022o72r58j789k446k391j696
$$ 114297 111264 108711 106566 104621 102825 101156 99531 98069 97047 96375 95417 93628 91182 88791 87095
53848H7095p65k4K08o1m23n34n30o49p14m52j12k24q07j245j048l20M83R94J075
$$ 87095 86330 86306 86514 86453 86030 85496 84966 84317 83603 83151 83039 82815 82008 80763 79715 79395 79878 80872 81947
53829H1947P93K52n34j471k111k011j319n89O8R79J961K210J536Q50Q87J255J428
$$ 81947 82740 82992 82458 80987 78876 76865 75546 74957 75025 76004 77965 80175 81711 82561 83448 84703 86131
53812H6131J758K584L153K692J901K132L323M130L973L643L781L978L747L340
$$ 86131 87889 90473 93626 96318 98219 100351 103674 107804 111777 115420 119201 123179 126926 130266
53798A30266L166L126K989K807K700K680K842L215L390K857J792R76P82Q41P33
$$ 130266 133432 136558 139547 142354 145054 147734 150576 153791 157181 160038 161830 162806 163588 164429 165162
53783A65162M40N7l53n44k92P9p0q42j663k105k319k568k798k821k571k190k071
$$ 165162 165602 165659 165306 164762 164470 164549 164479 163637 161974 159869 157550 154982 152184 149363 146792 144602 142531
53766A42531k613l538l846l014j920j809k572k978k442j668j451j777k228k519
$$ 142531 139918 136380 132534 129520 127600 125791 123219 120241 117799 116131 114680 112903 110675 108156
53752A08156k418j857j297j306j701j803j531j360j246o10L79O12l86j653k096
$$ 108156 105738 103881 102584 101278 99577 97774 96243 94883 93637 93027 93406 94018 93632 91979 89883
53737H9883j795j373q68l4Q06J085Q45N54L16j73q77j246q52M0P22Q36Q68J547
$$ 89883 88088 86715 85847 85813 86619 87704 88549 89103 89419 89246 88369 87123 86271 86311 87033 87869 88737 90284
53719I0284K689L095K088O60K64P99P94l63j625j886j380q49l59L62J105J473
$$ 90284 92973 96068 98156 98816 99080 99879 100673 100310 98685 96799 95419 94570 94211 94573 95678 97151
53703I7151J585J790K006J828J103P1p84q32K17J741K701K929L245L939M032K706
$$ 97151 98736 100526 102532 104360 105463 105534 104750 103918 104135 105876 108577 111506 114751 118690 122722 125428
53687A25428P12n49p79p16o86k45P91J861K373K341K153K104K253K373K142J632
$$ 125428 126140 125591 124812 124096 123410 123165 123956 125817 128190 130531 132684 134788 137041 139414 141556 143188
53671A43188J443J983K776K871J923M84o82j186r87k95M19O71M16O7K4K64M36
$$ 143188 144631 146614 149390 152261 154184 154668 153986 152800 151813 151518 151937 152608 153024 153091 153115 153379 153815
53654A53815K64k16p26j029j106j048q48m47Q7O17J075J335J097K70o33r24n81
$$ 153815 154079 153863 153137 152108 151002 149954 149106 148659 148746 149363 150438 151773 152870 153140 152507 151583 151002
53637A51002j73oJ52M22N35M44N15Q15P69L0q35j037n62J6M29Q20J219J432J358
$$ 151002 150829 150823 150975 151397 151932 152376 152891 153706 154475 154505 153670 152633 152071 152087 152516 153336 154555 155987 157345
53618A57345J112Q34P00Q89J278J424J172R35J100J410J442J340J557K047K319
$$ 157345 158457 159291 159991 160880 162158 163582 164754 165689 166789 168199 169641 170981 172538 174585 176904
53603A76904K227K156K382K830L441M267N024N067M214L217L028L716M437M448
$$ 176904 179131 181287 183669 186499 189940 194207 199231 204298 208512 211729 214757 218473 222910 227358
53589B27358L832L197K918K869K779K600K462K485K703L060L356L330K945K485
$$ 227358 231190 234387 237305 240174 242953 245553 248015 250500 253203 256263 259619 262949 265894 268379
53575B68379K238K207K232K168J849J108J68k81J90J117J582J221M84M5K63R62
$$ 268379 270617 272824 275056 277224 279073 280181 280349 280068 280258 281375 282957 284178 284662 284707 284970 285932
53559B85932J441R52l47j291j176q41j459k645k885j777n46j81l40n18j008j886
$$ 285932 287373 288325 287978 286687 285511 284670 283211 280566 277681 275904 275358 275177 274837 274319 273311 271425
53543B71425k209j225L00R92N59k39p81q57k07J136K332K464J768J306J513J873
$$ 271425 269216 267991 268291 269283 269842 269603 268822 267965 267758 268894 271226 273690 275458 276764 278277 280150
53527B80150J966K025K319K646K715K543K335K325K747L628M617N411O164P089
$$ 280150 282116 284141 286460 289106 291821 294364 296699 299024 301771 305399 310016 315427 321591 328680
53513C28680P806P732P043O637P040P968R041J0299J1716J2784J3109J3024J3211
$$ 328680 336486 344218 351261 357898 364938 372906 381947 392246 403962 416746 429855 442879 456090
53500D56090J3868J4614J5141J5548J6093J6871J7848J8936J9941K0632K1037
$$ 456090 469958 484572 499713 515261 531354 548225 566073 585009 604950 625582 646619
53489F46619K1529K2374K3227K3428K2882K2320K2384K2866K3163K3165K3133
$$ 646619 668148 690522 713749 737177 760059 782379 804763 827629 850792 873957 897090
53478H97090K2995K2468K1819K1716K2253K2818K3158K3697K4439K4417K2885
$$ 897090 920085 942553 964372 986088 1008341 1031159 1054317 1078014 1102453 1126870 1149755
53467A149755K0512J8678J7901J7594J7100J6315J5471J4866J4653J4544J3830
$$ 1149755 1170267 1188945 1206846 1224440 1241540 1257855 1273326 1288192 1302845 1317389 1331219
53456A331219J2216J0325Q983Q232P510O507N247L578J276j391l861o012q117
$$ 1331219 1343435 1353760 1362743 1370975 1378485 1384992 1390239 1393817 1395093 1393702 1389841 1383829 1375712
53443A375712j0129j1613j2499j3319j4460j5636j6369j6645j6865j7374j8199
$$ 1375712 1365583 1353970 1341471 1328152 1313692 1298056 1281687 1265042 1248177 1230803 1212604
53432A212604j9095j9777k0209k0618k1121k1466k1410k1167k1069k0948k0285
$$ 1212604 1193509 1173732 1153523 1132905 1111784 1090318 1068908 1047741 1026672 1005724 985439
53421I85439j9015j7689j6732j5901j4652j2748j0442q297o964o683o887o524
$$ 985439 966424 948735 932003 916102 901450 888702 878260 869963 862999 856316 849429 842905
53409H42905n092l072j209M50K342M453O144P090P897R360J1385J3174J4407J5558
$$ 842905 837813 834741 833532 833982 836324 840777 846921 854011 861908 871268 882653 895827 910234 925792
53395I25792J6956J8200J8936J9576K0670K2006K3099K4126K5549K7054K7962
$$ 925792 942748 960948 979884 999460 1020130 1042136 1065235 1089361 1114910 1141964 1169926
53384A169926K8537K9804L1915L3928L5462L7289L9707M1664M2374M2692M3752
$$ 1169926 1198463 1228267 1260182 1294110 1329572 1366861 1406568 1448232 1490606 1533298 1577050
53373A577050M5125M5701M5718M6416M7860M8648M7945M6536M5509M4833M3805
$$ 1577050 1622175 1667876 1713594 1760010 1807870 1856518 1904463 1950999 1996508 2041341 2085146
53362B085146M2113L9958L7515L4798L1819K8665K5521K2619J9991J7238J3933
$$ 2085146 2127259 2167217 2204732 2239530 2271349 2300014 2325535 2348154 2368145 2385383 2399316
53351B399316J0089O100K327j030l900o545r563j3251j7262k1218k5356l0051
$$ 2399316 2409405 2415505 2417832 2416802 2412902 2406357 2396794 2383543 2366281 2345063 2319707 2289656
53339B289656l5004l9460m2997m5566m7099m7634m7608m7375m6728m5475m4154
$$ 2289656 2254652 2215192 2172195 2126629 2079530 2031896 1984288 1936913 1890185 1844710 1800556
53328A800556m3372m2786m1574l9813l8414l7812l7647l7590l7605l7344l6299
$$ 1800556 1757184 1714398 1672824 1633011 1594597 1556785 1519138 1481548 1443943 1406599 1370300
53317A370300l4653l3072l1558k9486k6898k4703k3245k1737j9543j7071j4930
$$ 1370300 1335647 1302575 1271017 1241531 1214633 1189930 1166685 1144948 1125405 1108334 1093404
53306A093404j3094j1509j0672j0867j1443j1529j0969r972q503o667n177m656
$$ 1093404 1080310 1068801 1058129 1047262 1035819 1024290 1013321 1003349 994846 988179 983002 978346
53294I78346m814m899m629m122l244j734K02J972L152L674L715L780M516O031
$$ 978346 973532 968633 964004 959882 956638 954904 955106 957078 960230 963904 967619 971399 975915 981946
53280I81946P751R283J1001J3215J5303J6394J6670J7185J8489K0049K1151K1649
$$ 981946 989697 998980 1009981 1023196 1038499 1054893 1071563 1088748 1107237 1127286 1148437 1170086
53268A170086K1773K1637K1238K0601J9765J8733J7444J5780J3752J1756J0380
$$ 1170086 1191859 1213496 1234734 1255335 1275100 1293833 1311277 1327057 1340809 1352565 1362945
53257A362945R737R245Q419P461O699N700L621M79k577m417n089n642p094r628
$$ 1362945 1372682 1381927 1390346 1397807 1404506 1410206 1413827 1414306 1411729 1407312 1402223 1396581 1389487 1379859
53243A379859j2632j5332j7438j9140k0622k1848k2905k4088k5351k6040k5709
$$ 1379859 1367227 1351895 1334457 1315317 1294695 1272847 1249942 1225854 1200503 1174463 1148754
53232A148754k4878k4364k4103k3357k2064k1057k0727k0315j9125j7691j6956
$$ 1148754 1123876 1099512 1075409 1052052 1029988 1008931 988204 967889 948764 931073 914117
53221I14117j6735j5977j4515j3572j4150j5611j6457j6061j4987j3872j2705
$$ 914117 897382 881405 866890 853318 839168 823557 807100 791039 776052 762180 749475
53210G49475j1299r831q601p606o703n998n752o028o606p238p799q251q611q898
$$ 749475 738176 728345 719744 712138 705435 699437 693685 687657 681051 673813 666014 657763 649152 640254
53196F40254r053r020q966r122r402r433r196r212r745j0183r745q686q135q683
$$ 640254 631201 622181 613215 604093 594691 585258 576062 566850 557105 546922 537177 528491 520356 511673
53182E11673r638r999r664r394r738j0405j0702j0356r769r492r586r658r522
$$ 511673 502035 492036 482372 472978 463240 452835 442133 431777 422008 412516 402930 393272 383750
53169C83750r439r631r816r555q847q056p404o836o356o064n947n850n683n408
$$ 383750 374311 364680 354864 345309 336462 328406 321002 314166 307810 301746 295799 289949 284266 278858
53155B78858m955m361l871l629l426l098k879l056l416l586l621l746l716l134
$$ 278858 273903 269542 265671 262042 258616 255518 252639 249583 246167 242581 238960 235214 231498 228364
53141B28364k322k110k696l414l761l900l958l640k854k128j949k137k289k332
$$ 228364 226042 223932 221236 217822 214061 210161 206203 202563 199709 197581 195632 193495 191206 188874
53127A88874k299k003j368p39m22k59K8L45M44L12L2l24m50J70J495K580K568
$$ 188874 186575 184572 183204 182465 182043 181784 181812 182157 182601 182913 182945 182621 182171 182341 183836 186416 188984
53110A88984J731J058J005J128Q20m6j168k107k499k313j883j579j524j705k069
$$ 188984 190715 191773 192778 193906 194726 194680 193512 191405 188906 186593 184710 183131 181607 179902 177833
53095A77833k360k253j857j746k114k353j958j482j899l159m127l943k950k050
$$ 177833 175473 173220 171363 169617 167503 165150 163192 161710 159811 156652 152525 148582 145632 143582
53081A43582j734j961k482k939k886k218j422j150j473j823j685j204q74q03n69
$$ 143582 141848 139887 137405 134466 131580 129362 127940 126790 125317 123494 121809 120605 119731 118928 118359
53066A18359Q1O74M90m58j292j224m01K95J45p86j770k036j432n46l7J8l6p9l24
$$ 118359 118440 119114 119604 119146 117854 116630 116229 116524 116669 115883 114113 112077 110645 110099 110062 110080 110044 109965 109641
53047A09641p47r52p56m85m99o98p67o29m41l29l26l46j70K84N94K24n86r01l13
$$ 109641 108894 107942 107186 106701 106202 105504 104737 104108 103667 103338 103012 102666 102496 102780 103374 103598 103012 102111 101798
53028A01798L96L05l96p86n37k11l11o77r35r89r17o47o1O57J023O97n3n34l73
$$ 101798 102194 102499 102103 101317 100780 100569 100258 99581 98646 97657 96740 96093 96032 96689 97712 98409 98356 97822 97449
53009I7449J3Ol51n29m49n82r52q55M9R79J031M47J69M74Q11Q06O53M94J37m45
$$ 97449 97462 97468 97117 96588 96139 95557 94605 93750 93799 94778 95809 96256 96425 96899 97710 98516 99169 99663 99800 99355
52989I9355r26j088r86n86K12J023J087K58o03o80k68k30o89q92k83Q59K072L271
$$ 99355 98429 97341 96355 95769 95981 97004 98091 98349 97746 97066 96798 96568 95879 94987 94704 95563 97635 100906
52971A00906M385M896M389L306K481K042J455P93J039K628M373M678L471K112
$$ 100906 105291 110187 114576 117882 120363 122405 123860 124653 125692 128320 132693 137371 140842 142954
52957A42954J532J364R80M49J44L4j91o93j426k159k419j852q31k57n06j056j285
$$ 142954 144486 145850 146830 147279 147423 147457 147266 146573 145147 142988 140569 138717 137886 137629 137123 136067 134782
52940A34782j154q66m31P2L48L29L69N72M69k44j122j557j468j052l37N00Q96
$$ 134782 133628 132762 132331 132403 132751 133080 133449 134021 134490 134246 133124 131567 130099 129047 128710 129210 130106
52923A30106O38L28O15J201J330Q36J97k43m54m43l27m40p64o15M60J773K212
$$ 130106 130744 131072 131687 132888 134218 135054 135251 135008 134554 134111 133784 133344 132580 131965 132425 134198 136410
52906A36410J610P23J29j23L8O85J413J666J566J661J897J628P21j67n52o05n30
$$ 136410 138020 138743 138872 138749 138787 139472 140885 142551 144117 145778 147675 149303 150024 149857 149305 148700 148170
52889A48170j75M04P44O34M31M43N04M30L87M90N26M10M57Q41J127P62k22j223
$$ 148170 147995 148399 149143 149777 150208 150651 151155 151585 151972 152462 152988 153398 153855 154696 155823 156585 156363 155140
52871A55140j626j177j46P89J050P74N80O81O61K61p9J58P78J152J093R92J172
$$ 155140 153514 152337 152191 152980 154030 154804 155384 156065 156726 156987 156908 157066 157844 158996 160089 161081 162253
52854A62253J502J708J833K122K553K739K495K258K594L235L183K060Q26N99J129
$$ 162253 163755 165463 167296 169418 171971 174710 177205 179463 182057 185292 188475 190535 191361 191960 193089
52839A93089J163J67j026j377q40k52m32j506k727k975j903n65l64j415k520k809
$$ 193089 194252 194419 193393 192016 191176 190924 190492 188986 186259 183284 181381 180816 180452 179037 176517 173708
52823A73708k647k724l005l045k741k275j750j337j383j872k145j668q61n96j039
$$ 173708 171061 168337 165332 162287 159546 157271 155521 154184 152801 150929 148784 147116 146255 145659 144620
52808A44620j498j378q36m30m45p22r45r45q28q36j046j276j308j169j101j268
$$ 144620 143122 141744 140908 140478 140033 139311 138366 137421 136593 135757 134711 133435 132127 130958 129857 128589
52792A28589j541j611j289p45l27k19l42o69j225j688j427l26P24P82M4n12n96
$$ 128589 127048 125437 124148 123403 123076 122857 122515 121846 120621 118933 117506 117180 117904 118686 118730 118218 117622
52775A17622q35j493j814j166j54J31m46j047j142j067j271j618j738j669j729
$$ 117622 116787 115294 113480 112314 112160 112291 111845 110798 109656 108589 107318 105700 103962 102293 100564
52760A00564j918j865j404q86o95p39p42q94j588k566k851j947n87J47P1j79k05
$$ 100564 98646 96781 95377 94491 93796 93057 92315 91421 89833 87267 84416 82469 81882 82029 82100 81921 81716
52743H1716j74k67m30o22p76n81J91J101J392R09J79m07r09j332j478j456j618
$$ 81716 81542 81275 80845 80223 79447 78866 79057 80158 81550 82459 82638 82231 81322 79990 78512 77056 75438
52726G5438j836j462m30L46J15o91j095q82n87n56n44k87O8K11L7k52l58j52K03
$$ 75438 73602 72140 71710 72056 72171 71480 70385 69503 68916 68360 67816 67529 67597 67808 67845 67593 67235 67083 67286
52707F7286M53N19M67K96nk68k32N3L14M86P72J235J662J892J957J909J796J817
$$ 67286 67739 68258 68725 69021 69016 68748 68516 68569 68883 69369 70141 71376 73038 74930 76887 78796 80592 82409
52689H2409K087K314K074J400O49q6r43j689j840j477j202j219j183j099j477
$$ 82409 84496 86810 88884 90284 90933 90847 89904 88215 86375 84898 83696 82477 81294 80195 78718
52674G8718k318k754k249j365p95l85J83M72j8p88q95l37Q6L9p0q4l88j047j419
$$ 78718 76400 73646 71397 70032 69237 68852 69035 69507 69489 68701 67806 67469 67555 67594 67524 67440 67052 66005 64586
52655F4586r97j51L35J83j69j41L95J011J198R01N12L32L91Q08J859L295M131
$$ 64586 63589 63438 63773 63956 63787 63646 64041 65052 66250 67151 67663 67995 68386 69194 71053 74348 78479
52638G8479L593K086O05m72j439k293k535k036j416j267j453j510j379j353j471
$$ 78479 82072 84158 84763 84291 82852 80559 78024 75988 74572 73305 71852 70342 68963 67610 66139
52623F6139j374q16n7M02M10L48O34J195J600J600J286P67Q1n56q02o34l78j66
$$ 66139 64765 63949 63892 64294 64704 65052 65686 66881 68481 70081 71367 72134 72215 71659 70857 70223 69845 69679
52605F9679K27P92J019N98k4j78K01P20J179J554J637J265Q13Q11J143J122M98
$$ 69679 69906 70698 71717 72315 72291 72113 72314 73034 74213 75767 77404 78669 79482 80293 81436 82558 83056
52588H3056j72k42K79R41J338J273P12n8m74j48O76J357J547J450J373J225P94
$$ 83056 82884 82642 82921 83862 85200 86473 87185 87127 86653 86505 87181 88538 90085 91535 92908 94133 94927
52571I4927L53N28J359J986J737J106J036J453J389N23l53n97n15n19l27L69J143
$$ 94927 95280 95808 97167 99153 100890 101996 103032 104485 105874 106397 106044 105447 104932 104413 104086 104455 105598
52554A05598J510J672J929J907J278O64Q07J203P75k96o78PM79k86j496j721q68
$$ 105598 107108 108780 110709 112616 113894 114558 115365 116568 117343 117047 116369 116376 116855 116569 115073 113352 112484
52537A12484j25k47p54q50m28m3j40n97r07p07p8N87R28P19r2j200j855j373Q7
$$ 112484 112359 112112 111358 110508 110080 110037 109897 109300 108393 107686 107608 108195 109123 109842 109750 108550 106695 105322 105409
52518A05409J495J869J293Q00J266K340K748J690j38j298j246p27n41n65l49n8
$$ 105409 106904 108773 110066 110866 112132 114472 117220 118910 118772 117474 116228 115501 114960 114395 114046 113988
52502A13988j57n23n82k39m2l44q03q42l18L42N34N1n87o37m1M68M32L16O82J242
$$ 113988 113831 113308 112726 112487 112445 112101 111298 110456 110138 110480 111014 111065 110478 109841 109800 110268 110700 111016 111698 112940
52482A12940J366J080Q06M77k02q44p83l01l78j036j087M9J302J321J39j144j665
$$ 112940 114306 115386 116192 116669 116467 115623 114840 114539 114161 113125 112038 112087 113389 114710 114849 113705 112040
52465A12040j182J78J779K512J785K67r49j606k097k377j983j024k68l3K14Q77
$$ 112040 110858 111036 112815 115327 117112 117379 116430 114824 112727 110350 108367 107343 107075 107042 107256 108133
52449A08133J435J142J52n89l79N94J552J813J193N9r34j313j101o85m41m77o18
$$ 108133 109568 110710 110862 110273 109894 110488 112040 113853 115046 115105 114171 112858 111757 111072 110631 110154 109536
52432A09536n71j86K63K09n41j320j199j40Q26Q32K60J22O49J075Q27L36L60R61
$$ 109536 108965 108779 109042 109251 108710 107390 106191 106051 106877 107709 107969 108091 108740 109815 110642 110978 111338 112299
52414A12299J494J411P44j9l80k10J32J95L3J40P35J379J503J037L97oJ8L79P54
$$ 112299 113793 115204 115948 115929 115549 115339 115471 115666 115699 115839 116574 117953 119456 120493 120890 120884 120902 121281 122035
52395A22035Q42P98J030J467J480Q11J41K95J201K065K341K081J579J083Q07Q39
$$ 122035 122877 123675 124705 126172 127652 128463 128604 128899 130100 132165 134506 136587 138166 139249 140056 140895
52379A40895J087J483J965K226J890J208R95J485J821J256L02o0J93L12N8j29
$$ 140895 141982 143465 145430 147656 149546 150754 151749 153234 155055 156311 156613 156553 156746 157058 157116 156987
52363A56987j4K55P58J690K654K889K311J629J389J558K012K634K948K476J516
$$ 156987 156973 157228 157986 159676 162330 165219 167530 169159 170548 172106 174118 176752 179700 182176 183692
52348A83692Q78P73P52O91Q49R14J38j236j858j053J51N27K63L33R29J382J280
$$ 183692 184570 185343 186095 186786 187635 188549 188687 187451 185593 184540 184691 185218 185481 185814 186743 188125 189405
52331A89405Q69N34M40N80Q05J003J340K007K665K692K152J813J995K183K093
$$ 189405 190274 190808 191248 191828 192633 193636 194976 196983 199648 202340 204492 206305 208300 210483 212576
52316B12576K244K938L531L471L254L560M093M219M136M417M888N018N075N762
$$ 212576 214820 217758 221289 224760 228014 231574 235667 239886 244022 248439 253327 258345 263420 269182
52302B69182O913P661P852Q148Q690Q799Q312Q127Q917J0115J0785J0836J0806
$$ 269182 276095 283756 291608 299756 308446 317245 325557 333684 342601 352716 363501 374337 385143
52289C85143J0948J1157J1444J1828J2011J1671J1069J0889J1421J2241J2755
$$ 385143 396091 407248 418692 430520 442531 454202 465271 476160 487581 499822 512577
52278E12577J2772J2477J2056J1613J1335J1435J1811J1939J1365J0231R097Q236
$$ 512577 525349 537826 549882 561495 572830 584265 596076 608015 619380 629611 638708 646944
52266F46944P419O443N516M928M631M404M212M085L812L115K081J124N45L05J80
$$ 646944 654363 660806 666322 671250 675881 680285 684497 688582 692394 695509 697590 698714 699259 699564 699744
52251F99744q6o86j599k469k792k329j310k85L12N18P24J140J522J663J883K629
$$ 699744 699658 698972 697373 694904 692112 689783 688473 688188 688500 689018 689742 690882 692404 694067 695950 698579
52235F98579L685M444M867N570O805Q091R044R820J0435J0476J0001R864J0423
$$ 698579 702264 706708 711575 717145 723950 732041 741085 750905 761340 771816 781817 791681 802104
52222H02104J0753J0059R119R179R908R889Q818P767P232O436N009L836L502L071
$$ 802104 812857 822916 832035 841214 851122 861011 869829 877596 884828 891264 896273 900109 903611 906682
52208I06682J491o03j760j864k228l635n364o345o441o307o535p292q399r378
$$ 906682 908173 907570 905810 903946 901718 898083 892719 886374 879933 873626 867091 859799 851400 842022
52194H42022r695r264q585q196q013p500o447n338m828n000n342n394n188m958
$$ 842022 832327 823063 814478 806282 798269 790769 784322 778984 774156 769156 763814 758420 753232 748274
52180G48274m721m345l867l484l261l095k933k833k791k770k843l082l269l058
$$ 748274 743553 739208 735341 731857 728596 725501 722568 719735 716944 714174 711331 708249 704980 701922
52166G01922k536k250k521k939k901k425k094k245k579k692k685k953l497l763
$$ 701922 699386 697136 694615 691676 688775 686350 684256 682011 679432 676740 674055 671102 667605 663842
52152F63842l336k536k102k345k845l028k751k283j966k049k634l457l998m047
$$ 663842 660506 657970 655868 653523 650678 647650 644899 642616 640650 638601 635967 632510 628512 624465
52138F24465m006m326m711m433l445k669k889l737m169l780l223l328m088m735
$$ 624465 620459 616133 611422 606989 603544 600875 597986 594249 590080 586300 583077 579749 575661 570926
52124E70926m556l536k257j380j231j703k409k974l261l373l372l059k211j014
$$ 570926 566370 562834 560577 559197 557966 556263 553854 550880 547619 544246 540874 537815 535604 534590
52110E34590k9M60Q30J659K949M076M506M359M188M367M859N473O099O712P271
$$ 534590 534561 535021 535851 537510 540459 544535 549041 553400 557588 561955 566814 572287 578386 585098 592369
52095E92369P806Q519R620J0991J2210J3031J3663J4387J5109J5612J6072J6902
$$ 592369 600175 608694 618314 629305 641515 654546 668209 682596 697705 713317 729389 746291
52083G46291J8023J8803J8886J8686J8742J8894J8533J7463J6129J5016J4136
$$ 746291 764314 783117 802003 820689 839431 858325 876858 894321 910450 925466 939602
52072I39602J3175J1939J0542R290Q369P694P060O390N650M550K701K51k010l386
$$ 939602 952777 964716 975258 984548 992917 1000611 1007671 1014061 1019711 1024261 1026962 1027213 1025203 1021817
52058A021817l954m228m502m808n321o274p509q533r068r255r251q959q239p259
$$ 1021817 1017863 1013635 1009133 1004325 999004 992730 985221 976688 967620 958365 949114 940155 931916 924657
52044I24657o476o230o339o082m888l081j712j397j650j577r28j6J048K413L899
$$ 924657 918181 911951 905612 899530 894642 891561 889849 888452 886802 885225 884297 884281 885329 887742 891641
52029H91641M955N346N419N559N741N763N551N099M411L673L169K909K529J800
$$ 891641 896596 901942 907361 912920 918661 924424 929975 935074 939485 943158 946327 949236 951765 953565
52015I53565R77N10N62Q47Q51J72j175k789m295n655o974q204r357j0732j2475
$$ 953565 954542 955052 955614 956461 957312 957484 956309 953520 949225 943570 936596 928392 919035 908303 895828
52000H95828j4047j4782j4933j5473j6706j7847j8298j8584j9522k0949k1992
$$ 895828 881781 866999 852066 836593 819887 802040 783742 765158 745636 724687 702695
51989G02695k2259k2045k1609k0928k0146j9656j9585j9707j9871k0093k0092
$$ 702695 680436 658391 636782 615854 595708 576052 556467 536760 516889 496796 476704
51978D76704j9338j7804j6220j5230j4635j3840j2854j2248j2242j2278j1703
$$ 476704 457366 439562 423342 408112 393477 379637 366783 354535 342293 330015 318312
51967C18312j0538r305q338p607p027o582o156n535m783m230l943l557k867k279
$$ 318312 307774 298469 290131 282524 275497 268915 262759 257224 252441 248211 244268 240711 237844 235565
51953B35565k233k427k194j556j179j252j157o18m05j206k394k748k146j619j786
$$ 235565 233332 230905 228711 227155 225976 224724 223567 222949 222544 221338 218944 216196 214050 212431 210645
51938B10645k146k100j851j828j973k123k546l409m109l910l023k338k156j931
$$ 210645 208499 206399 204548 202720 200747 198624 196078 192669 188560 184650 181627 179289 177133 175202
51924A75202j329q12q69j270j424j119o26l32n02j043j364q90O6M47k17j206j666
$$ 175202 173873 173061 172192 170922 169498 168379 167753 167421 166919 165876 164512 163622 163688 164135 163918 162712 161046
51907A61046j715j816j715r14J52M90N2j73K66N97J07q44j517j787j826j470o79
$$ 161046 159331 157515 155800 154886 155038 155528 155580 155407 155673 156270 156377 155533 154016 152229 150403 148933 148254
51890A48254r4l47j057j348j105j001j297j483j181p22n12l69L1M82M90J8m12
$$ 148254 148160 147813 146756 145408 144303 143302 142005 140522 139341 138619 138107 137738 137769 138251 138741 138759 138347
51873A38347l52J69Q42J355J438R30Q0m53k24M31Q39R38J302K062K488K104J582
$$ 138347 137995 138164 139006 140361 141799 142729 142809 142356 142132 142563 143402 144340 145642 147704 150192 152296 153878
51856A53878J793K377K239J344Q53J305J738J222K32j68J66N97P33N84J26m73
$$ 153878 155671 158048 160287 161631 162484 163789 165527 166749 166981 166813 166979 167576 168309 168893 169019 168546
51840A68546o06j1N14J35o53o34L10J059R47N76O61J071J362J475J453J181Q80
$$ 168546 167940 167929 168443 168578 167925 167291 167601 168660 169607 170183 170844 171915 173277 174752 176205 177386 178266
51823A78266J146J991K418J663L47l03n5K24ok66P1Q36J287R89J88n34p63m57
$$ 178266 179412 181403 183821 185484 185831 185528 185473 185697 185691 185425 185496 186332 187619 188608 188796 188262 187499 187042
51805A87042P9L82K07j62o7P70J732J855R67Mo4P77J812K497K695K410J875J667
$$ 187042 187121 187503 187710 187548 187481 188251 189983 191838 192805 192809 192745 193522 195334 197831 200526 202936 204811 206478
51787B06478K079K489K068J106Q24J718K793K933K264J683J577J704K036K817
$$ 206478 208557 211046 213114 214220 215044 216762 219555 222488 224752 226435 228012 229716 231752 234569
51773B34569L801M109L185J503J05l99k12O8n6p71j959l194l841l452k216q82
$$ 234569 238370 242479 245664 247167 247272 246873 246661 246729 246673 245902 243943 240749 236908 233456 231240 230358
51757B30358n4L19O31R96J121P80O2p31j231j116m23K53L09j59m92l97k32k86
$$ 230358 230304 230623 231254 232250 233371 234151 234213 233482 232251 231135 230712 230965 231274 231115 230623 230226 229994 229708
51739B29708k62K09Q67J093O66n6o84j121j411j520j384j083q29q09j005j210
$$ 229708 229446 229655 230522 231615 232281 232225 231541 230420 229009 227489 226105 225022 224193 223384 222379 221169
51723B21169j246j122r46q25q75j222j747k055j915j581j387j238r02o68j068
$$ 221169 219923 218801 217855 217030 216155 214933 213186 211131 209216 207635 206248 205010 204108 203440 202372
51708B02372j925k362j995j554j824k519k754k344j929j894j777j078j16L02p3
$$ 202372 200447 198085 196090 194536 192712 190193 187439 185095 183166 181272 179495 178417 178301 178603 178530
51693A78530n65l79N12J421J824J940K339L311M776O606Q523R720R076O193K017
$$ 178530 177965 177586 178098 179519 181343 183283 185622 188933 193709 200315 208838 218558 227634 233827 235844
51678B35844j790m207n386n976o222n850m762l508k851l009l490l715l530l101
$$ 235844 234054 229847 224461 218485 212263 206413 201651 198143 195292 192283 188793 185078 181548 178447
51664A78447k581k099j836j859j952j748j106l01J00l40j318j841j271l08k34
$$ 178447 175866 173767 171931 170072 168120 166372 165266 164965 165065 164725 163407 161566 160295 159987 159753
51649A59753j174j873j513q35q17j115p72J43O67M50L2k32n39q52q09m69l57n72
$$ 159753 158579 156706 155193 154358 153541 152426 151654 151797 152464 152914 152946 152714 152175 151323 150514 150045 149688 149116
51631A49116o25l61k02l83o30q14j080j247q24J3L87k9n23m66j50k0J06M35N52
$$ 149116 148491 148130 147928 147545 146915 146101 145021 143774 142950 142963 143350 143321 142798 142332 142182 142162 142268 142703 143255
51612A43255M3p29j114j064r84j002r12n53Q6Q57J354J203P10O46J163J568J419
$$ 143255 143298 142569 141455 140391 139407 138405 137493 136940 137026 137883 139237 140440 141150 141796 142959 144527 145946
51595A45946J140J150J186J013J041J522J853J483R04Q95J257J229P41L88M22
$$ 145946 147086 148236 149422 150435 151476 152998 154851 156334 157238 158133 159390 160619 161360 161748 162170
51580A62170O14Q73J134R38K6q05m36R60J984J805J127J044J660K219K097J369
$$ 162170 162784 163657 164791 165729 165755 164950 164514 165474 167458 169263 170390 171434 173094 175313 177410 178779
51564A78779O23M67J014J751K089J964J710J558J579J887K438K756K310J195J9
$$ 178779 179402 179869 180883 182634 184723 186687 188397 189955 191534 193421 195859 198615 200925 202120 202139
51549B02139p33r30n61K28R38J055O08M8l53o01o40l50O3J77o3k19N0N47P77M36
$$ 202139 201406 200476 199915 200143 201081 202136 202744 202792 202439 201838 201198 200848 200911 201088 201025 200806 200856 201403 202180 202616
51529B02616l20r98j138p05q0L64N10L66K9j68Q9M98L46n05j298j360r28n97m49
$$ 202616 202296 201298 200160 199455 199375 199739 200249 200615 200644 200476 200565 201063 201409 200904 199606 198246 197318 196721 196272
51510A96272k39N1L32O79R99Q68K13l21k46M6O2J46Q40J822K300K167J819J233
$$ 196272 196033 196084 196416 197095 198094 198962 199175 198854 198608 198654 198716 198862 199702 201524 203824 205991 207810 209043
51492B09043J92q65j226j041j032j160o29O68J797K109K035K232K673K893K610
$$ 209043 209235 208370 207144 206103 205071 203911 203282 203950 205747 207856 209891 212123 214796 217689 220299
51477B20299J879J100R00J484K173K166J623J290J226Q94L68M01J083J525J189
$$ 220299 222178 223278 224178 225662 227835 230001 231624 232914 234140 235034 235402 235803 236886 238411 239600
51462B39600N83K01k40r82j493j215n33k83p81j710k581k978k739k303k423l301
$$ 239600 240183 240384 240144 239162 237669 236454 235921 235638 234857 233147 230566 227588 224849 222546 220123 216822
51446B16822m317m846m843m483l737k659j644j071j033j437j998k152j640j097
$$ 216822 212505 207659 202816 198333 194596 191937 190293 189222 188189 186752 184754 182602 180962 179865
51432A79865j340k033j995r73k7J57J55M63M82k71r86p32o6k41j261j963j870
$$ 179865 178525 176492 174497 173524 173497 173654 173809 174272 174754 174483 173497 172765 172699 172458 171197 169234 167364
51415A67364j764k278k961l069k602k105j984k196k397k261j848j660k118k980
$$ 167364 165600 163322 160361 157292 154690 152585 150601 148405 146008 143747 141899 140239 138121 135141
51401A35141l515l218k240j171n38m26m40k16P2j00q79j804k368k452k108j416
$$ 135141 131626 128408 126168 124997 124459 124033 123593 123377 123449 123349 122470 120666 118298 115846 113738 112322
51385A12322p00m56p31r75p63k90Q8K62J55m46j384k011k013j814j777j500n86
$$ 112322 111622 111166 110435 109460 108697 108407 108495 108757 108912 108466 107082 105071 103058 101244 99467 97967 97381
51368I7381L67L98m51j204j247q73n19j57L37O98N58j7m79k82N24J236J192N78
$$ 97381 97748 98146 97695 96491 95244 94371 93852 93695 94032 94730 95288 95271 94792 94510 95034 96270 97462 98040
51350I8040K25N61J074J109O74J79k09n19n69j55N55J226J749K105K083J607J078
$$ 98040 98265 98826 99900 101009 101683 101862 101653 101134 100565 100410 100965 102191 103940 106045 108128 109735 110813
51333A10813R26R42O03j40p88r96r18r06j182j728k228k218j643j063r80j179
$$ 110813 111739 112681 113284 113144 112356 111360 110442 109536 108354 106626 104398 102180 100537 99474 98494 97315
51317I7315j159r35r48j285j549j488j255j021p46m04j07N7M6k14o52q64m55M68
$$ 97315 96156 95221 94273 92988 91439 89951 88696 87675 86929 86525 86418 86475 86521 86307 85655 84791 84336 84804
51299H4804J355J720J389M85n66j174j169j090j481k038j927q92M46J376J724
$$ 84804 86159 87879 89268 89753 89187 88013 86844 85754 84273 82235 80308 79416 79862 81238 82962
51284H2962J664J405J172J122J119Q86N04M21Q52J473J790J513O04p50j978k393
$$ 82962 84626 86031 87203 88325 89444 90330 90834 91255 92107 93580 95370 96883 97487 96737 94759 92366
51268I2366j872j032n18l85l92o27j263j837j419J72J726J854O93k18Q9Q29P02
$$ 92366 90494 89462 88944 88559 88167 87540 86277 84440 83021 83193 84919 86773 87466 87248 87337 88166 88868
51251H8868k93j077j143j045j194j139m40N45J196J424J469J370J142R51P91L87
$$ 88868 88575 87498 86355 85310 84116 82977 82537 83082 84278 85702 87171 88541 89683 90634 91425 91812
51235I1812j35j00O30J074M45m52j54J383K636K485J399M85J99L53P55J311J796
$$ 91812 91677 91577 92207 93281 93726 93274 93120 94503 97139 99624 101023 101508 101707 102060 102815 104126 105922
51218A05922J911J563R56M01L4l49r44j361q50N91J815J782R03M22P62J252J335
$$ 105922 107833 109396 110352 110753 110787 110438 109494 108133 107283 107874 109689 111471 112374 112796 113558 114810 116145
51201A16145J155Q56J94p21j107m19Q09J520J298N82k3l40n81q78j058r16p11
$$ 116145 117300 118156 118350 117629 116522 116103 116912 118432 119730 120312 120289 119949 119368 118490 117432 116516 115805
51184A15805j004j800k283j857j082r26j324j339o63o7k06p61j125j250j324j210
$$ 115805 114801 113001 110718 108861 107779 106853 105529 104190 103527 103460 103254 102493 101368 100118 98794 97584
51168I7584p32j43J70K28L00M93P30R44J007P44K26j79k90l71o39q92q76p55p93
$$ 97584 96852 96709 96879 97107 97407 97900 98630 99574 100581 101325 101551 101372 101082 100711 100072 99180 98304 97549 96756
51149I6756q80o80k28O1j54p92j438j536p78M95J365J185K42o01q46p09o02o17
$$ 96756 95876 95196 94968 95029 94875 94083 92645 91109 90331 90826 92191 93376 93618 93017 92171 91462 90860 90243
51131I0243n82m42m34q04j401j606r07M13J413J458Q31K83J39K29M06P63J240
$$ 90243 89661 89219 88785 87981 86580 84974 84067 84480 85893 87351 88182 88465 88604 88833 89239 90002 91242
51114I1242J466J202O86L67L90N53O38N68L69K43N77J547K627K941K329J599J394
$$ 91242 92708 93910 94596 94963 95353 95906 96544 97112 97481 97724 98301 99848 102475 105416 107745 109344 110738
51097A10738J291O38j14J05J255J968J416M23J28L46J36n59q71m17J84L02P1k7
$$ 110738 112029 112667 112553 112658 113913 115881 117297 117720 117848 118194 118330 117771 116900 116483 116667 116969 117040 117013
51079A17013K11O84J205J571J700J690J607J321Q08L85L02K86m5m98o17m24l47
$$ 117013 117224 117908 119113 120684 122384 124074 125681 127002 127810 128195 128497 128783 128738 128240 127623 127199 126852
51062A26852n02o60p53q82r30p72p08j005j202o98J10K86r0O0J033J695J150N2
$$ 126852 126350 125690 124937 124055 123125 122353 121645 120640 119438 118740 118850 119136 119046 119106 120139 121834 122984 123036
51044A23036m12j1P15J390J874J939J621J393J420J177M00k13K4O39P40M08M02
$$ 123036 122624 122613 123328 124718 126592 128531 130152 131545 132965 134142 134542 134329 134353 134992 135732 136140 136542
51027A36542Q48J205J343J631K039K102J834J812K178K447K369K221K053J576
$$ 136542 137390 138595 139938 141569 143608 145710 147544 149356 151534 153981 156350 158571 160624 162200
51013A62200J034J263K436L567L796L462L255L087K612K241K682L747M610N062
$$ 162200 163234 164497 166933 170500 174296 177758 181013 184100 186712 188953 191635 195382 199992 205054
50999B05054N623O388O788O678O703P217P662P544P327P702Q619R703J1126J3199
$$ 205054 210677 217065 223853 230531 237234 244451 252113 259657 266984 274686 283305 293008 304134 317333
50985C17333J5427J7031J8233K0058K2773K5451K7458K9352L1872L4814L7637
$$ 317333 332760 349791 368024 388082 410855 436306 463764 493116 524988 559802 597439
50974E97439M0463M3699M7054M9807N1828N3520N4822N5030N3758N1458M8833
$$ 597439 637902 681601 728655 778462 830290 883810 938632 993662 1047420 1098878 1147711
50963A147711M6144M3181L9531L4790K9003K2899J7312J2220O832Q46m790q705
$$ 1147711 1193855 1237036 1276567 1311357 1340360 1363259 1380571 1392791 1399623 1400469 1395679 1386974
50951A386974j0521j1118j1608j2196j2140j0836q779p254p012p671q585r823
$$ 1386974 1376453 1365335 1353727 1341531 1329391 1318555 1309776 1302522 1295510 1287839 1279254 1269431
50939A269431j1830j4551j7515k0657k4300k8373l2261l5486l8035l9965m1268
$$ 1269431 1257601 1243050 1225535 1204878 1180578 1152205 1119944 1084458 1046423 1006458 965190
50928I65190m2200m3127m3893m3817m2524m0297l7573l4603l1736k9306k7026
$$ 965190 922990 879863 835970 792153 749629 709332 671759 637156 605420 576114 549088
50917E49088k4142k0555j7207j4957j3538j2115j0382q597o949n408m035k951
$$ 549088 524946 504391 487184 472227 458689 446574 436192 427595 420646 415238 411203 408252
50905D08252k095j366q81q09j054j307j294q19K11J580K782L367L230K574J890
$$ 408252 406157 404791 403910 403101 402047 400740 399446 398627 398838 400418 403200 406567 409797 412371 414261
50890D14261J849K769M155N180N676O120O704P105P280P676Q423R009R252R761
$$ 414261 416110 418879 423034 428214 433890 440010 446714 453819 461099 468775 477198 486207 495459 505220
50876E05220J0889J2096J2966J4173J6501J9497K2118K4271K6710K9686L2835
$$ 505220 516109 528205 541171 555344 571845 591342 613460 637731 664441 694127 726962
50865G26962L6327M0896M6554N2332N7739O3554P0572P8319Q5717R2549R9441
$$ 726962 763289 804185 850739 903071 960810 1024364 1094936 1173255 1258972 1351521 1450962
50854A450962J06549J13013J17929J21313J23747J25243J24804J21146J13632
$$ 1450962 1557511 1670524 1788453 1909766 2033513 2158756 2283560 2404706 2518338
50845B518338J02512Q8535P2712N6219M0008K4351R113n338j7867k7437l3908
$$ 2518338 2620850 2709385 2782097 2838316 2878324 2902675 2911788 2906450 2888583 2861146 2827238
50834B827238l7751l9292l8598l5800l1149k4905j7685j0822o005m404o251j1082
$$ 2827238 2789487 2750195 2711597 2675797 2644648 2619743 2602058 2591236 2585231 2580827 2574576 2563494
50822B563494j8088k6400l5450m5134n5458o6099p6467q5973r4017r9903j03197
$$ 2563494 2545406 2519006 2483556 2438422 2382964 2316865 2240398 2154425 2060408 1960505 1857308
50811A857308j04121j03299j01031r7097r1307q4064p6279o8796o1914n5426m9061
$$ 1857308 1753187 1649888 1548857 1451760 1360453 1276389 1200110 1131314 1069400 1013974 964913
50800I64913m2775l6625l0575k4766j9667j5521j1706p389k825P49K751L993N367
$$ 964913 922138 885513 854938 830172 810505 794984 783278 775889 773064 773813 776564 780557 785924
50787G85924O552O774O205N678N385M770L626K382J286O5j394k651l395l895m544
$$ 785924 792476 799250 805455 811133 816518 821288 824914 827296 828582 828647 827253 824602 821207 817312 812768
50772H12768n240n561n389n079n108n617o319o846p159p476p799p784p236o390
$$ 812768 807528 801967 796578 791499 786391 780774 774455 767609 760450 752974 745175 737391 730155 723765
50758G23765n521m548l238j508P57L765P354J0868J3916J6961K0683K5019K9363
$$ 723765 718244 713696 710458 708950 709707 713472 720826 731694 745610 762571 783254 808273 837636
50745H37636L3443L7575M2210M7642N3835O0123O5462O9561P3364P7747Q2051
$$ 837636 871079 908654 950864 998506 1052341 1112464 1177926 1247487 1320851 1398598 1480649
50734A480649Q4666Q4745Q2456P7949P1151O2665N3546M3835L2338J8410L206
$$ 1480649 1565315 1650060 1732516 1810465 1881616 1944281 1997827 2041662 2074000 2092410 2095616
50723B095616j1328k3959l4181m1519m5701m7120m6424m3843l9424l3733k7673
$$ 2095616 2084288 2060329 2026148 1984629 1938928 1891808 1845384 1801541 1762117 1728384 1700711
50712A700711k1736j5933j0536o379m319m621o975j0909j6086k2376k9744l7970
$$ 1700711 1678975 1663042 1652506 1646127 1641808 1637187 1630212 1619303 1603217 1580841 1551097 1513127
50700A513127m6262n3227n7530n8912n8488n7685n6813n4946n1312m6364m1232
$$ 1513127 1466865 1413638 1356108 1297196 1238708 1181023 1124210 1069264 1017952 971588 930356
50689I30356l6514l2087k7764k3622j9628j5512j1127o660k430J374M812Q229
$$ 930356 893842 861755 833991 810369 790741 775229 764102 757442 755012 756386 761198 769427
50677G69427J2037J6288K0561K4401K7641L0127L1578L2057L2191L2403L2279
$$ 769427 781464 797752 818313 842714 870355 900482 932060 964117 996308 1028711 1060990
50666A060990L1254K9572K7900K6260K4020K0943J7540J4316J1285Q243N087J907
$$ 1060990 1092244 1121816 1149716 1175976 1199996 1220939 1238479 1252795 1264080 1272323 1277410 1279317
50654A279317r07k713l316l342l404l150j899J00J959L565N731Q844J2247J5194
$$ 1279317 1278410 1275697 1272381 1269039 1265635 1262485 1260586 1260686 1262645 1266210 1271941 1280785 1293032 1308226
50640A308226J7557J9381K0513K0965K0911K0193J8507J6207J4047J2058R587
$$ 1308226 1325783 1345164 1365677 1386642 1407553 1427746 1446253 1462460 1476507 1488565 1498152
50629A498152O645M175K635J446M04M23K153M769P102R092J1184J2942J3416J2370
$$ 1498152 1504797 1508972 1511607 1513053 1513457 1513880 1516033 1520802 1527904 1536996 1548180 1561122 1574538 1586908
50615A586908J0167O814K208k879p120j0048j2310j4480j6395j7782j8901k0295
$$ 1586908 1597075 1603889 1606097 1603218 1596098 1586050 1573740 1559260 1542865 1525083 1506182 1485887
50603A485887k2309k4989k8095l1233l4118l6841l9583m2253m4592m6357m7219
$$ 1485887 1463578 1438589 1410494 1379261 1345143 1308302 1268719 1226466 1181874 1135517 1088298
50592A088298m6755m4994m2614m0246l7848l5143l2281k9548k6775k3679k0548
$$ 1088298 1041543 996549 953935 913689 875841 840698 808417 778869 752094 728415 707867
50581G07867j7947j5820j3569j0995q517o474m709k965j163P46K724M477N764
$$ 707867 689920 674100 660531 649536 641019 634545 629836 626871 625708 626454 629178 633655 639419
50568F39419O982Q847J1450J4091J6203J7988J9838K1695K3284K4676K6244K8248
$$ 639419 646401 655248 666698 680789 696992 714980 734818 756513 779797 804473 830717 858965
50556H58965L0795L3907L7250L9961M1198M0945L9909L8613L6909L4585L2009
$$ 858965 889760 923667 960917 1000878 1042076 1083021 1122930 1161543 1198452 1233037 1265046
50545A265046K9812K8165K6938K6424K7245K9297L1538L3208L4735L6849L9316
$$ 1265046 1294858 1323023 1349961 1376385 1403630 1432927 1464465 1497673 1532408 1569257 1608573
50534A608573M1421M3362M6107M9849N3628N6688N9301O1768O3482O3610O2165
$$ 1608573 1649994 1693356 1739463 1789312 1842940 1899628 1958929 2020697 2084179 2147789 2209954
50523B209954N9751N6635N2586M7250M0306L1576K1460J0866L34j0391k1496l2307
$$ 2209954 2269705 2326340 2378926 2426176 2466482 2498058 2519518 2530384 2530718 2520327 2498831 2466524
50511B466524m1915n0109n7052o2452o5762o6989o6597o4710o1006n5439m8473
$$ 2466524 2424609 2374500 2317448 2254996 2189234 2122245 2055648 1990938 1929932 1874493 1826020
50500A826020m0737l2872k5694j9858j5298j1258o982k211K749P203J0507J2620
$$ 1826020 1785283 1752411 1726717 1706859 1691561 1680303 1673321 1671110 1673859 1681062 1691569 1704189
50488A704189J3951J4428J3101Q984J963p454j8640l0639m1981n1536n9204o5225
$$ 1704189 1718140 1732568 1745669 1754653 1756616 1749162 1730522 1699883 1657902 1606366 1547162 1481937
50476A481937o9209p0673p0052o8246o5422o1251n6141n1206m6985m3100l9219
$$ 1481937 1412728 1342055 1272003 1203757 1138335 1077084 1020943 969737 922752 879652 840433
50465H40433l5459l1740k7707k3473j9655j6486j3669j1183r322p768n648k954
$$ 840433 804974 773234 745527 722054 702399 685913 672244 661061 651739 643971 638323 635369
50453F35369q48o9K07J263L301N602P548Q934R799J0577J1886J3675J5087J5689
$$ 635369 634521 634452 634659 635922 639223 644825 652373 661307 671106 681683 693569 707244 722331 738020
50439G38020J6203J7360J8771J9690K0350K1496K2987K4001K4467K5257K6784
$$ 738020 754223 771583 790354 810044 830394 851890 874877 898878 923345 948602 975386
50428I75386K8403K9526L0517L1996L3903L5650L6861L7540L7869L8233L9186
$$ 975386 1003789 1033315 1063832 1095828 1129731 1165381 1202242 1239782 1277651 1315884 1355070
50417A355070M0956M3040M4660M5510M5803M5604M4448M1787L7630L2589K7305
$$ 1355070 1396026 1439066 1483726 1529236 1575039 1620643 1665091 1706878 1744508 1777097 1804402
50406A804402K1985J6533J0914N148j024q160j6527k5520l3913m0825m6408n1466
$$ 1804402 1826387 1842920 1853834 1858982 1857958 1849798 1833271 1807751 1773838 1733013 1686605 1635139
50394A635139n6498o1147o4621o6455o6649o5259o2223n7798n2757m7784m2833
$$ 1635139 1578641 1517494 1452873 1386418 1319769 1254510 1192287 1134489 1081732 1033948 991115
50383I91115l7422l1473k5443j9694j4155q729l594J097N517R817J3683J6487
$$ 991115 953693 922220 896777 877083 862928 854199 850605 851702 857219 867036 880719 897206
50371H97206J7811J7642J6123J3359R406M393j362p319j2895j7706k1649k4723
$$ 897206 915017 932659 948782 962141 971547 975940 974578 967259 954364 936658 915009 890286
50359H90286k6983k8528k9430k9585k8864k7456k5827k4267k2703k1007j9311
$$ 890286 863303 834775 805345 775760 746896 719440 693613 669346 646643 625636 606325
50348F06325j7817j6481j5034j3267j1223r260p844p082o404n071l028j035K75
$$ 606325 588508 572027 556993 543726 532503 523243 515399 508317 501913 496842 493814 492779 493054
50335D93054J116K084L275M283M892N299N739O185O648P399Q656J0136J1172J1308
$$ 493054 494170 496254 499529 503812 508704 514003 519742 525927 532575 539974 548630 558766 569938 581246
50321E81246J0821J0571J1271J2777J4196J4764J4641J4691J5425J6307J6359
$$ 581246 592067 602638 613909 626686 640882 655646 670287 684978 700403 716710 733069
50310G33069J5388J4382J4420J5380J6113J5817J4797J3680J2463J0801Q872P270
$$ 733069 748457 762839 777259 792639 808752 824569 839366 853046 865509 876310 885182 892452
50298H92452O092M882L476K291J461M04j407l728o116q764j2083j5698j8581k0109
$$ 892452 898544 903426 906902 909193 910654 911058 909651 905923 899807 891043 878960 863262 844681 824572
50284H24572k0454j9970j8890j7782j7475j8122j8762j8320j6842j5257j4194
$$ 824572 804118 784148 765258 747476 730001 711879 693117 674797 657955 642698 628504
50273F28504j3526j2888j2141j1216j0021q697p618o970o625o514o720o947o372
$$ 628504 614978 602090 589949 578733 568712 560015 552397 545427 538802 532288 525568 518621 512249
50260E12249m532k144n18j64m34m79n8O66J602K678L647M328M805N261N743O251
$$ 512249 507717 505573 505055 504891 504457 503978 503920 504586 506188 508866 512513 516841 521646 526907 532650 538901
50244E38901O769P046O639N468M074L075K578K374K365K434K143J114l77j605
$$ 538901 545670 552716 559355 564823 568897 571972 574550 576924 579289 581723 583866 584980 584603 582998
50230E82998k273k788l623m675n430n527n114m671m533m531m293l863l670l792
$$ 582998 580725 577937 574314 569639 564209 558682 553568 548897 544364 539833 535540 531677 528007 524215
50216E24215l625k707j421m23L34J303K384K919K749K479K672L273M001M755N400
$$ 524215 520590 517883 516462 516039 516373 517676 520060 522979 525728 528207 530879 534152 538153 542908 548308
50201E48308N693N614N367M912L985K734J815J552J525J202N65k85j553l345n204
$$ 548308 554001 559615 564982 569894 573879 576613 578428 579980 581505 582707 583272 582987 581434 578089 572885
50186E72885o583p470q179q789r250r687j0092r980q936p326n956n120m472l827
$$ 572885 566302 558832 550653 541864 532614 522927 512835 502855 493919 486593 480637 475517 471045 467218
50172D67218l412l298l113k560j755r41k37J24k81j493k813l404l169k778k805
$$ 467218 463806 460508 457395 454835 453080 452139 451902 452026 451745 450252 447439 444035 440866 438088 435283
50157D35283l134l208k726j918j306j210j526j917k186k323k284j866j037k46
$$ 435283 432149 428941 426215 424297 422991 421781 420255 418338 416152 413829 411545 409679 408642 408396
50143D08396j11o70j166q37K45J344J957K187K263K175K017K226L079M116M554
$$ 408396 408285 407615 406449 405612 405857 407201 409158 411345 413608 415783 417800 420026 423105 427221 431775
50128D31775M193L560L179L026K809K444K092J919J959K133K324K400K194J553
$$ 431775 435968 439528 442707 445733 448542 450986 453078 454997 456956 459089 461413 463813 466007 467560
50114D67560O35P4M84J609K428K430K301K903L990M641M737N116O323P962R471
$$ 467560 468195 468269 468753 470362 472790 475220 477521 480424 484414 489055 493792 498908 505231 513193 522664
50099E22664J0760J1900J2837J3788J5301J7652K0578K3923K7966L2792L7873
$$ 522664 533424 545324 558161 571949 587250 604902 625480 649403 677369 710161 748034
50088G48034M2702M7369N2148N6951O1492O5473O8206O8655O6373O1954N6135
$$ 748034 790736 838105 890253 947204 1008696 1074169 1142375 1211030 1277403 1339357 1395492
50077A395492M9123M1384L4395K9560K6690K4570K2779K1867K1710K0772J7434
$$ 1395492 1444615 1485999 1520394 1549954 1576644 1601214 1623993 1645860 1667570 1688342 1705776
50066A705776J1273K784p489j9026l1014m2424n2118n8922o2152o2376o1111n9286
$$ 1705776 1717049 1719833 1712344 1693318 1662304 1619880 1567762 1508840 1446688 1384312 1323201 1263915
50054A263915n6461n1919m6070m0152l4834k9877k5178k1338j8854j7218j5399
$$ 1263915 1207454 1155535 1109465 1069313 1034479 1004602 979424 958086 939232 922014 906615
50043I06615j3042j0711q941p557o190n059m728n231n994o644p334q078q387p986
$$ 906615 893573 882862 873921 866364 860174 855115 850387 845156 839162 832518 825184 817106 808719 800733
50029H00733p449p473p827p689o976o566p088q048q498q124p287o291n113l740
$$ 800733 793284 785811 777984 770295 763319 756753 749665 741617 733119 724995 717708 711417 706304 702564
50015G02564k399j265k48Q46J947K725K953K794K678K961L778N081O611P845Q284
$$ 702564 700165 698900 698652 699498 701445 704170 707123 709917 712595 715556 719334 724415 731026 738871 747155
50000G47155P990P575P536P726P655P099O230N351M718M388M151L741L318L453
$$ 747155 755145 762720 770256 777982 785637 792736 798966 804317 809035 813423 817574 821315 824633 828086
49986H28086M347N455O187O678P425Q505R678J1154J3578J7268K1951K7218L2784
$$ 828086 832433 837888 844075 850753 858178 866683 876361 887515 901093 918361 940312 967530 1000314
49973A000314L8334M3774M9631N6592O4484P2224P8879Q4075Q7262Q7455Q4298
$$ 1000314 1038648 1082422 1132053 1188645 1253129 1325353 1404232 1488307 1575569 1663024 1747322
49962A747322P8757P2176O5121N7813N1212M6674M4554M3866M3475M2888M1653
$$ 1747322 1826079 1898255 1963376 2021189 2072401 2119075 2163629 2207495 2250970 2293858 2335511
49951B335511L8531L1791K0340M499j4041l2915n0098o4600p6349q5423r1690
$$ 2335511 2374042 2405833 2426173 2430672 2416631 2383716 2333618 2269018 2192669 2107246 2015556
49940B015556r5256r6842r7328r6923r5073r1325q6155q0741p5916p1479o6637
$$ 2015556 1920300 1823458 1726130 1629207 1534134 1442809 1356654 1275913 1199997 1128518 1061881
49929A061881o1001n4978m9185m3748l8413l3240k8802k5666k3850k2862k2088
$$ 1061881 1000880 945902 896717 852969 814556 781316 752514 726848 702998 680136 658048
49918F58048k0981j9180j6759j4371j2844j2463j2792j3172j3277j3064j2512
$$ 658048 637067 617887 601128 586757 573913 561450 548658 535486 522209 509145 496633
49907D96633j1602j0492r460q646q031p623p478p473p270o625n634m655l981l676
$$ 496633 485031 474539 465079 456433 448402 440779 433301 425828 418558 411933 406299 401644 397663 393987
49893C93987l572l377k877k094j238n31j41j79n49q21n45J77P03N88J58J25P26
$$ 393987 390415 387038 384161 382067 380829 380298 380157 379978 379429 378608 378063 378240 378943 379531 379689 379814 380540
49876C80540J474J741J417J042J290K374L798M819N105M985M996N389O111P056
$$ 380540 382014 383755 385172 386214 387504 389878 393676 398495 403600 408585 413581 418970 425081 432137
49862D32137Q161R344J0569J1886J3394J5149J7144J9383K1915K4894K8511L2594
$$ 432137 440298 449642 460211 472097 485491 500640 517784 537167 559082 583976 612487 645081
49850F45081L6500L9777M2962M7234N2927N8783O2996O4643O3816O0736N5415
$$ 645081 681581 721358 764320 811554 864481 923264 986260 1050903 1114719 1175455 1230870
49839A230870M8153L9841L1652K4653J9668J7073J6592J7463J8708J9196J7689
$$ 1230870 1279023 1318864 1350516 1375169 1394837 1411910 1428502 1445965 1464673 1483869 1501558
49828A501558J3285N855m273j6813l1218m5976n8879o8345p4210p7051p7201p4715
$$ 1501558 1514843 1520698 1516425 1499612 1468394 1422418 1363539 1295194 1220984 1143933 1066732 992017
49816I92017o9948o3733n6964n0279m4106l8732l4202l0258k6495k2769j9457
$$ 992017 922069 858336 801372 751093 706987 668255 634053 603795 577300 554531 535074
49805E35074j7113j5745j4591j2892j0825r343r022r400r535q918p737o412n171
$$ 535074 517961 502216 487625 474733 463908 454565 445543 436143 426608 417690 409953 403541 398370
49792C98370m063l157k603k507k718k916k930k901k994l028k614j611m08L17J50
$$ 398370 394307 391150 388547 386040 383322 380406 377476 374575 371581 368553 365939 364328 363920 364237 364387
49777C64387o53j246r72o3N79M92J67K54O43P80O05N93R40J285J265R36N90M94
$$ 364387 363734 362488 361516 361453 362032 362524 362691 362945 363588 364368 364973 365566 366506 367791 369056 369992 370582 371076
49759C71076Q02J341J536J028L19L12J138J965K089J670J191P88M53M07Q03J374
$$ 371076 371878 373219 374755 375783 376102 376414 377552 379517 381606 383276 384467 385255 385708 386115 386918 388292
49743C88292J729J812J800J742J565J257R11P46J063J876K546K288J167P4m08
$$ 388292 390021 391833 393633 395375 396940 398197 399108 399854 400917 402793 405339 407627 408794 408868 408460
49728D08460n47o09k40P40J627J750J585K052K978L214K333J237Q49R75Q62L25
$$ 408460 407913 407304 407064 407804 409431 411181 412766 414818 417796 421010 423343 424580 425429 426404 427266 427591
49712D27591j67j51M16J251J940K153J869J283N55j50m31R4J126J771J495P25
$$ 427591 427424 427273 427689 428940 430880 433033 434902 436185 436740 436590 436159 436253 437379 439150 440645 441370
49696D41370J96M1j51n61q89q16m10J5J69q3p20j537k225k542k411j974j491j135
$$ 441370 441566 441607 441456 440895 440006 439190 438780 438795 438964 438881 438161 436624 434399 431857 429446 427472 425981 424846
49678D24846q22l76Q8J68k86q53j040q93q21r10q73o97q40j492j974j379L05K042
$$ 424846 424024 423648 423736 423904 423618 422765 421725 420832 420011 419101 418228 417531 416691 415199 413225 411846 412151 414193
49660D14193K803K457J599Q22L67K79N11Q82J097R69N63P9l24n74n89l13J91P48
$$ 414193 416996 419453 421052 421874 422241 422520 423031 423913 425010 425979 426542 426621 426297 425723 425134 424821 425012 425760
49642D25760J240J686K059K156J900J646J931K750L376L145K253J488J333J604
$$ 425760 427000 428686 430745 432901 434801 436447 438378 441128 444504 447649 449902 451390 452723 454327
49628D54327J890J986J817J421J080J211J869K521K531J777P81K63O40J706K803
$$ 454327 456217 458203 460020 461441 462521 463732 465601 468122 470653 472430 473211 473474 474114 475820 478623
49613D78623L425L657L866M117M238M348M742N266N435N332N685O751P733P861
$$ 478623 482048 485705 489571 493688 497926 502274 507016 512282 517717 523049 528734 535485 543218 551079
49599E51079P496P471P847Q039P934P995Q409Q893R345R980J0767J1431J2087
$$ 551079 558575 566046 573893 581932 589866 597861 606270 615163 624508 634488 645255 656686 668773
49586F68773J3198J4745J6080J6886J7637J8797K0097K1033K1667K2427K3449
$$ 668773 681971 696716 712796 729682 747319 766116 786213 807246 828913 851340 874789
49575H74789K4531K5599K6820K8284K9841L1249L2383L3381L4584L6172L7874
$$ 874789 899320 924919 951739 980023 1009864 1041113 1073496 1106877 1141461 1177633 1215507
49564A215507L9201M0027M0661M1380M2196M3074M4022M4834M5042M4364M2969
$$ 1215507 1254708 1294735 1335396 1376776 1418972 1462046 1506068 1550902 1595944 1640308 1683277
49553A683277M1233L9374L7406L5154L2385K9063K5490K1878J7936J3269Q139
$$ 1683277 1724510 1763884 1801290 1836444 1868829 1897892 1923382 1945260 1963196 1976465 1984604
49542A984604L292r16m703q162j1037j3326j5453j7559j9156j9821j9760j9356
$$ 1984604 1987896 1986980 1982277 1974115 1963078 1949752 1934299 1916740 1897584 1877763 1858003 1838647
49530A838647j8683j7696j6446j4791j2434r597p052n105l046j44L412P037J0600
$$ 1838647 1819964 1802268 1785822 1771031 1758597 1749000 1741948 1736843 1733797 1733653 1737065 1744102 1754702
49517A754702J4040J6736J8136J8716J9469K0628K1620K2175K2527K2655K2174
$$ 1754702 1768742 1785478 1803614 1822330 1841799 1862427 1884047 1906222 1928749 1951404 1973578
49506A973578K1111J9973J8831J7066J4293J0928P421L554j050o149j1096j5629
$$ 1973578 1994689 2014662 2033493 2050559 2064852 2075780 2083201 2086755 2085705 2079556 2068460 2052831
$$ [...]
##END NTUPLES=NMR SPECTRUM
##END=
