##TITLE=NES1004_878015019_9232700_nB64FBqrWS
##JCAMPDX= 6.0         $$ Bruker NMR JCAMP-DX V2.0
##DATA TYPE= NMR SPECTRUM
##DATA CLASS= NTUPLES
##ORIGIN= BRUKER
##OWNER= Administrator
$$ 1.72 TOPSPIN		Version 2.1
$$ 2015-06-17 16:47:47.878 -0700  Administrator@X
$$ Compression mode = diff/dup
##.OBSERVE FREQUENCY= 400.02188249412
##.OBSERVE NUCLEUS= ^1H
##.ACQUISITION MODE= SIMULTANEOUS (DQD)
##.ACQUISITION SCHEME= undefined
##.AVERAGES= 8
##.DIGITISER RES= 22
##SPECTROMETER/DATA SYSTEM= spect
##.PULSE SEQUENCE= zg30
##.SOLVENT NAME= COFFEE_meoh
##.SHIFT REFERENCE= INTERNAL, COFFEE_meoh, 1, 14.98509
##AUDIT TRAIL= $$ (NUMBER, WHEN, WHO, WHERE, PROCESS, VERSION, WHAT)
$$ ##TITLE= Audit trail, TOPSPIN		Version 2.1
$$ ##JCAMPDX= 5.01
$$ ##ORIGIN= Bruker BioSpin GmbH
$$ ##OWNER= Administrator
$$ $$ E:\/data/COFFEE/nmr/NES1004_878015019_9232700_nB64FBqrWS/10/pdata/1/auditp.txt
$$ ##AUDIT TRAIL=  $$ (NUMBER, WHEN, WHO, WHERE, PROCESS, VERSION, WHAT)
(   1,<2015-06-17 16:47:40.519 -0700>,<Administrator>,<X>,<go>,<TOPSPIN 2.1>,
      <created by zg
	started at 2015-06-17 16:46:34.253 -0700,
	POWCHK enabled, PULCHK disabled,
       configuration hash MD5:
       21 0F 79 D6 B3 7B B4 F6 88 20 88 DB 03 48 BD 9F
       data hash MD5: 64K
       DF C7 84 DC A6 8F 95 C3 38 52 61 B1 C0 58 05 6A>)
(   2,<2015-06-17 16:47:43.847 -0700>,<Administrator>,<X>,<proc1d>,<TOPSPIN 2.1>,
      <Start of raw data processing
       efp LB = 0 FT_mod = 6 PKNL = 1 PHC0 = 0 PHC1 = 0 SI = 32K 
       data hash MD5: 32K
       74 D1 A3 43 A6 F3 57 D1 4C 98 21 53 1B D9 4F FE>)
(   3,<2015-06-17 16:47:44.128 -0700>,<Administrator>,<X>,<proc1d>,<TOPSPIN 2.1>,
      <pk PHC0 = 93.24097 PHC1 = 0 
       data hash MD5: 32K
       96 10 55 89 2F F7 3E 03 98 48 12 05 56 9C E0 1D>)
(   4,<2015-06-17 16:47:44.253 -0700>,<Administrator>,<X>,<proc1d>,<TOPSPIN 2.1>,
      <abs ABSG = 1 
       data hash MD5: 32K
       4F E0 00 BB 34 35 A4 60 16 41 D1 20 20 50 1B 39>)
(   5,<2015-06-17 16:47:44.316 -0700>,<Administrator>,<X>,<proc1d>,<TOPSPIN 2.1>,
      <abs ABSG = 2 
       data hash MD5: 32K
       AE C8 25 E5 E6 D3 E7 3B 11 63 9B F3 68 EE 36 A9>)
(   6,<2015-06-17 16:47:44.378 -0700>,<Administrator>,<X>,<proc1d>,<TOPSPIN 2.1>,
      <abs ABSG = 3 
       data hash MD5: 32K
       6C 73 AF 59 51 C7 94 7D 96 3D F1 88 7E 44 4E DE>)
(   7,<2015-06-17 16:47:44.425 -0700>,<Administrator>,<X>,<proc1d>,<TOPSPIN 2.1>,
      <abs ABSG = 4 
       data hash MD5: 32K
       04 50 4E CB 6E 8C 27 76 32 CE 21 AF C6 18 64 8B>)
(   8,<2015-06-17 16:47:44.487 -0700>,<Administrator>,<X>,<proc1d>,<TOPSPIN 2.1>,
      <abs ABSG = 5 
       data hash MD5: 32K
       E2 A9 BF C2 55 9E 0F C5 59 61 53 72 5F 4F 1F DF>)
$$ ##END=
$$ 
$$ $$ hash MD5
$$ $$ 86 9F D2 9B B0 1D BA 5D A8 98 B2 E9 2A A8 63 9D
##$RELAX= 
##$RELAX= 
##$RELAX= 
##$RELAX= 
##$RELAX= 
##$RELAX= 
##$RELAX= 
$$ Bruker specific parameters
$$ --------------------------
##$DU= <E:\>
##$EXPNO= 10
##$NAME= <NES1004_878015019_9232700_nB64FBqrWS>
$$ [...]
150 150 150 150 150 150 150 150
##$TP07= 0
##$TPNAME0= <>
##$TPNAME1= <>
##$TPNAME2= <>
##$TPNAME3= <>
##$TPNAME4= <>
##$TPNAME5= <>
##$TPNAME6= <>
##$TPNAME7= <>
##$TPOAL= (0..7)
0.5 0.5 0.5 0.5 0.5 0.5 0.5 0.5
##$TPOFFS= (0..7)
0 0 0 0 0 0 0 0
##$TUNHIN= 0
##$TUNHOUT= 0
##$TUNXOUT= 0
##$USERA1= <user>
##$USERA2= <user>
##$USERA3= <user>
##$USERA4= <user>
##$USERA5= <user>
##$V9= 5
##$VALIST= <valist>
##$VCLIST= <CCCCCCCCCCCCCCC>
##$VD= 0
##$VDLIST= <DDDDDDDDDDDDDDD>
##$VPLIST= <PPPPPPPPPPPPPPP>
##$VTLIST= <TTTTTTTTTTTTTTT>
##$WBST= 2048
##$WBSW= 25
##$XGAIN= (0..3)
0 0 0 0
##$XL= 0
##$YL= 0
##$YMAX_a= 626727
##$YMIN_a= -524955
##$ZGOPTNS= <>
##$ZL1= 120
##$ZL2= 120
##$ZL3= 120
##$ZL4= 120
##$ABSF1= 14.98509
##$ABSF2= -5.573092
##$ABSG= 5
##$ABSL= 3
##$ALPHA= 0
##$AQORDER= 0
##$ASSFAC= 0
##$ASSFACI= 0
##$ASSFACX= 0
##$ASSWID= 0
##$AUNMP= <proc_prof1d_extract_pilot.lims>
##$AXLEFT= 0
##$AXNAME= <>
##$AXNUC= <1H>
##$AXRIGHT= 0
##$AXTYPE= 0
##$AXUNIT= <>
##$AZFE= 0.1
##$AZFW= 0.1
##$BCFW= 0
##$BC_mod= 0
##$BYTORDP= 0
##$COROFFS= 0
##$CY= 15
##$DATMOD= 1
##$DC= 0
##$DFILT= <>
##$DTYPP= 0
##$F1P= 0
##$F2P= 0
##$FCOR= 0.5
##$FTSIZE= 32768
##$FT_mod= 6
##$GAMMA= 0
##$GB= 0
##$INTBC= 1
##$INTSCL= 1
##$ISEN= 128
##$LB= 0
##$LEV0= 0
##$LPBIN= 0
##$MAXI= 10000
##$MC2= 0
##$MEAN= 0
##$ME_mod= 0
##$MI= 0
##$NCOEF= 0
##$NC_proc= -8
##$NLEV= 6
##$NOISF1= 0
##$NOISF2= 0
##$NSP= 0
##$NTH_PI= 0
##$NZP= 0
##$OFFSET= 14.98509
##$PC= 1
##$PHC0= 93.24097
##$PHC1= 0
##$PH_mod= 1
##$PKNL= yes
##$PPARMOD= 0
##$PPDIAG= 0
##$PPIPTYP= 0
##$PPMPNUM= 2147483647
##$PPRESOL= 1
##$PSCAL= 4
##$PSIGN= 0
##$PYNMP= <proc.py>
##$REVERSE= no
##$SF= 400.02
##$SI= 32768
##$SIGF1= 0
##$SIGF2= 0
##$SINO= 400
##$SIOLD= 32768
##$SPECTYP= <>
##$SREGLST= <1H.CDCl3>
##$SSB= 0
##$STSI= 32768
##$STSR= 0
##$SW_p= 8223.68421052631
##$SYMM= 0
##$S_DEV= 0
##$TDeff= 65536
##$TDoff= 0
##$TI= <>
##$TILT= no
##$TM1= 0
##$TM2= 0
##$TOPLEV= 0
##$USERP1= <user>
##$USERP2= <user>
##$USERP3= <user>
##$USERP4= <user>
##$USERP5= <user>
##$WDW= 1
##$XDIM= 32768
##$YMAX_p= 431936155
##$YMIN_p= -610755
##$CURPLOT= <Network HP LaserJet P1505>
##$CURPRIN= <$Network HP LaserJet P1505>
##$DFORMAT= <normdp>
##$LAYOUT= <+/1D_H.xwp>
##$LFORMAT= <normlp>
##$PFORMAT= <normpl>
##$SURQMSG= 1
$$ End of Bruker specific parameters
$$ ---------------------------------
##NTUPLES= NMR SPECTRUM
##VAR_NAME=  FREQUENCY,     SPECTRUM/REAL,   SPECTRUM/IMAG
##SYMBOL=    X,             R,               I
##VAR_TYPE=  INDEPENDENT,   DEPENDENT,       DEPENDENT
##VAR_FORM=  AFFN,          ASDF,            ASDF
##VAR_DIM=   32768,         32768,           32768
##UNITS=     HZ,            ARBITRARY UNITS, ARBITRARY UNITS
##FACTOR=    0.250966925370066, 1,           1
##FIRST=     8223.43324360094, -153690,      -126648
##LAST=      0,             -194712,         -200149
##MIN=       0,             -610755,         0
##MAX=       8223.43324360094, 431936155,    0
$$ Real data points
##PAGE= N=1
##DATA TABLE= (X++(R..R)), XYDATA
$$ [...]
$$ plain form
19487 108453 -235812 -93621 31670 -93193 -147475 314814 -44825 -265563 -21190 -164900 18697
19475 -280962 -40951 65914 313241 -76267 213679 -311616 49884 171902 -172178 -145553
19465 -145553 -35653 -229580 -324534 24294 -56396 91397 170339 -193964 -151526 -69636 99785
19453 -28805 -170105 106570 -271003 -124497 59379 -180788 100721 19670 -22448 -68875
19443 -68875 -154015 320153 469519 -98479 -291218 -198697 -270014 -372397 -117743 -184557 -284645
19432 -284645 46627 -344394 -293035 210908 -303151 -38858 -215991 120645 37141 80048
19422 80048 13714 -24830 41036 -176530 69009 36665 -146811 -87724 13298 35189 326733
19411 326733 -92462 -188237 -333390 -54582 -202744 225121 90967 103673 -18149 -492 -338549
$$ packed form
19487A08453b35812i3621C1670i3193n4282C14814d4825k20738b1190j43710A8697
19475b80962d0951F5914K47327g6267B13679c11616D9884J22018a72178K6625
19465a45553c5653j93927r4954B4294e6396I1397P8942a93964M2438f9636I9785
19453b8805j41300A06570b71003a24497E9379a80788A00721A9670b2448m6427
19443f8875q5140C20153J49366i8479j92739R2521p1317j02383a17743o6814j00088
19432b84645D6627c44394N1359B10908c03151c8858j77133A20645C7141M2907
19422H0048A3714b4830D1036a76530F9009l2344a46811N9087A3298K1891K91544
19411C26733i2462r5775j45153e4582j48162B25121I0967J2706a8149d92l38057
$$ plain form
19400 -338549 -11202 53996 136104 -111149 -61229 49128 -20071 16073 61849 71071 -277878
19388 -230192 -228434 310435 136967 -154299 98445 -464523 71110 -212049 -232424 -2408 -66361
19377 -66361 409624 33329 -74983 223286 -214233 271355 -233662 -52461 -212724 -134467
19367 -134467 285610 -81931 81103 -82773 177930 -187445 -85201 -171282 -157699 -203762 -234439
19356 -234439 195423 -177059 -141930 -401902 -355759 -139435 257677 -420088 123618 -241870
19345 -243288 -194131 27113 -10727 -174699 -242630 -114607 -27144 208060 -198838 -188714 -56115
19333 -117028 -434656 48373 32754 -186146 67730 161893 -358125 -100611 -35948 -235209
19323 -235209 224915 -31102 -227770 174940 -1554 123643 -52869 33789 172195 -80222 -343953
$$ packed form
19400c38549a1202E3996Q2108a11149M9920D9128b0071A6073M5776R222b77878
19388b30192J758C10435A36967a54299I8445d64523G1110b12049k0375b408o3953
19377f6361D09624C3329g4983B23286b14233B71355b33662e2461j60263P8257
19367a34467B85610h1931H1103h2773A77930a87445h5201q6081J3583m6063l0677
19356b34439A95423a77059L5129k59972M6143a39435B57677d20088A23618b41870
19345b43288M9157B7113a0727j63972o7931a14607b7144B08060a98838J0124e6115
19333a17028l17628D8373j5619a86146F7730R4163c58125a00611c5948j99261
19323b35209B24915c1102j96668A74940a554A23643e2869C3789J38406h0222k63731
$$ plain form
19312 -343953 -133371 -207100 -173726 -154307 -216456 -291602 -155402 36151 -71803 -157938 148953
19300 -83679 -131083 107060 39151 18470 -5998 -192157 126769 19153 -502277 20914 11581
19289 11581 -9083 214325 -23783 -144231 -185565 484 -201469 -340303 -321372 -38030 9659 96109
19277 96109 30261 -157607 24530 116426 80076 -164339 29389 -247008 90848 317928 -239709
19265 -41827 -196077 280617 -21675 55039 -183781 177733 -151078 -299399 -50499 -213584
19255 -213584 24552 -41983 275045 85365 330726 -170889 216470 -360275 -120161 -200204
19245 -200204 -117036 -84187 13286 -101079 -141242 -41456 283102 31534 183321 -179793 -218691
19234 -218691 86499 16775 -208554 -119502 -192596 -267755 -214111 8614 362412 198368 -28547
$$ packed form
19312c43953a33371p3729L3374J9419o2149p5146J36200C6151g1803q6135A48953
19300h3679m7404A07060C9151A8470e998j86159A26769A9153e02277B0914r333
19289A1581i083B14325b3783j20448m1334D84b01469j38834J8931c8030I659Q6450
19277I6109C0261a57607B4530R1896l6350a64339B9389b47008I0848K27080b39709
19265d1827j54250B80617b1675E5039a83781A77733a51078j48321e0499j63085
19255b13584B4552d1983B75045H5365K45361a70889B16470c60275a20161q0043
19245b00204Q3168L2849A3286a01079m0163d1456B83102C1534J51787a79793l8898
19234b18691H6499A6775b08554Q9052p3094p5159N3644H614L53798j64044b8547
$$ plain form
19222 103764 40838 -293887 147861 89011 -70396 29077 -113241 -68860 -144768 -126091 -151738
19211 -151738 -342558 -285244 -162135 115963 -105547 -2304 232487 113246 -94454 56724
19200 -214555 16530 -129207 -241688 -52557 -89539 -255043 -170104 -160740 362303 -112262 250222
19188 -221268 -130051 30000 184373 -163101 -26496 71390 -192978 -175996 -184806 -1512 13925
19176 -142195 -127249 60606 -108193 -198401 -74079 148594 151574 -73435 11105 82967 -12166
19164 -421286 -269336 121232 -39633 152149 75961 -174211 5447 -180507 -127785 -23974 275025
19152 38373 140647 -144669 49944 -221209 186424 18501 175482 -193622 -1398 -123281
19142 -123281 355560 -202065 166200 41619 -29445 -143212 57161 98329 558 -49401 252453
$$ packed form
19222A03764D0838b93887A47861n8850g0396B9077a13241M4381p5908J8677k5647
19211a51738j90820N7314J23109A15963a05547b304B32487A13246i4454E6724
19200b14555A6530a29207j12481e2557l6982j65504Q4939R364C62303a12262B50222
19188b21268R1217C0000J54373a63101b6496G1390a92978J6982q810a512A3925
19176a42195J4946F0606a08193r0208g4079A48594K980g3435A1105P1862a2166
19164d21286J51950A21232c9633A52149G5961a74211E447a80507N2722b3974B75025
19152C8373J02274a44669D9944b21209A86424A8501J56981a93622a398j21883
19142a23281C55560b02065A66200D1619b9445j13767E7161M1168E58d9401B52453
$$ plain form
19130 -296824 77342 133615 -62811 78748 62188 -281015 -136591 -246461 -287523 -107940 -247073
19119 -247073 -93450 -83489 -176448 439827 80875 175389 -343176 -84066 -242693 -51426 -381638
19108 -381638 -156616 -189910 40836 12454 277648 -236737 -197398 71913 -68257 143430 -135284
19096 -192079 104017 -84542 -179087 -74547 -463024 82092 -55493 67497 250418 57309 -17475
19084 -143143 -186461 38678 -216532 -112584 -240220 -202060 -8133 -37247 -103222 -10063 109803
19072 -240001 -177967 -304546 -228503 -283791 -297988 -112202 6310 -50644 -202730 -95040 -374618
19061 -374618 -62437 116240 -306480 -230871 -142976 113650 -235474 -6859 175048 -235370
19050 230 -218280 -188396 -79964 165161 198092 -116584 -231802 36701 -206034 -540177 23977
$$ packed form
19130b96824G7342N6273f2811G8748j6560b81015a36591j09870m1062a07940j39133
19119b47073i3450R961r2959D39827H0875R4514c43176h4066j58627e1426l30212
19108c81638a56616l3294D0836A2454K65194b36737L9339G1913f8257A43430a35284
19096a92079A04017h4542r4545g4547l88477H2092e5493F7497J82921E7309a7475
19084a43143m3318C8678b16532J03948j27636L8160h133k9114o5975a0063A09803
19072b40001O2034j26579P6043n5288j4197a12202F310e0644j52086i5040k79578
19061c74618f2437A16240c06480P5609Q7895A13650b35474f859A75048b35370
19050B30b18280K9884g9964A65161L2931a16584j15218C6701b06034l34143B3977
$$ plain form
19038 94474 -96318 19344 46032 116329 -281294 -47128 11858 33209 -27094 78986 -287167
19026 36631 439328 105726 23968 14812 -248072 36081 -257095 101435 -34855 125249 143056
19015 143056 13479 -234199 -16152 331304 74700 155904 -6773 -196725 91745 105644 302812
19004 302812 -169378 60260 47608 -317421 -208887 -61020 214621 81828 -13560 83215 -45703
18992 224331 237644 -101612 -97235 -185735 108797 -91628 91612 133093 222698 63523 -73032
18980 -32167 -136670 -48035 -113470 -265738 79335 217017 511735 -182499 174039 133873
18970 133873 -81357 -137797 -192191 -203059 292585 -126839 262420 300580 103311 180882 34522
18958 65830 -59278 146381 -246992 -67401 -13123 14771 124102 121672 95373 -152790 203979
$$ packed form
19038I4474i6318A9344K6688P0297b81294d7128A1858K1351b7094G8986b87167
19026C6631M02697A05726B3968r156b48072C6081b57095A01435c4855A25249J7807
19015A43056A3479b34199a6152C31304G4700Q1204f773j89952I1745J3899J97168
19004C02812a69378F0260j2652c17421J08534f1020B14621H1828a3560H3215d5703
18992B24331J3313a01612M377q8500A08797i1628I1612M1481Q9605F3523g3032
18980c2167j04503d8035o5435j52268G9335J37682K94718a82499A74039m0166
18970A33873h1357n6440n4394j0868B92585a26839B62420L8160A03311P7571C4522
18958F5830e9278A46381b46992f7401a3123A4771J09331k430k6299a52790B03979
$$ plain form
18946 -170092 -128934 36267 -68351 -106856 42724 -110843 237801 -84734 -81737 82800 -271121
18934 -48673 -284541 -110804 253315 -32929 -108131 212491 -282995 -56395 -204681 -128294
18924 -128294 68667 -4813 249061 -226494 -54092 126074 -308162 126608 -11896 -18276 244349
18912 95270 83317 148148 83925 49698 -96796 149094 5360 130202 8698 -61760 -400103
18901 -400103 -111564 198045 151057 170182 -140814 -30322 -25571 -160221 32700 152403 -90851
18889 118331 -10522 -354221 -43026 -31319 -127813 -59166 87272 -103798 -805 -278242 -359889
18878 -359889 92183 -22301 -132741 -208289 -144152 -246566 -194576 -313591 -94664 -7314 270162
18866 -282450 118945 -257506 -153371 -42215 124071 -131799 20096 -77312 -47692 -95488
$$ packed form
18946a70092M1158C6267f8351l8505D2724a10843B37801h4734K997H2800b71121
18934d8673k35868a10804B53315c2929p5202B12491b82995e6395j48286P6387
18924a28294F8667d813B49061b26494e4092A26074c08162A26608a1896o380B44349
18912I5270j1953O4831o4223l4227i6796A49094E360J24842H698f1760l38343
18901d00103a11564A98045m6988J9125a40814c0322M751j34650C2700J19703i0851
18889A18331a0522l43699d3026J1707r6494e9166H7272a03798h05k77437q1647
18878c59889I2183b2301j10440p5548O4137j02414N1990j19015i4664g314B70162
18866b82450A18945b57506J04135d2215A24071a31799B0096g7312K9620m7796
$$ plain form
18856 -95488 -230853 5616 -133543 -112267 153780 -67921 -92084 29462 101520 -170337 -442462
18845 -442462 -283169 194565 -156836 -220899 -26976 -137065 149349 -157785 337095 -299136
18834 -5012 -36222 -23278 -248326 -4809 145501 228942 -250467 65450 183469 150975 -124461
18822 -64860 -269462 184720 56764 -52381 130846 309141 235829 142731 67335 114177 -17262
18810 536 -23877 101809 41999 202499 -55794 61305 -42249 -15447 88658 99296 -230604
18798 -270764 -175255 -19858 -106490 -345092 -236466 131679 49731 -36188 -115636 -73739 323382
18786 189122 43893 50248 2898 -50479 129450 -106502 61118 -122085 -345427 45786 -101727
18774 225689 -52263 -146542 46977 -145354 -87797 241717 -137742 -127314 -108242 -159185 194602
$$ packed form
18856i5488j35365E616a33543K1276A53780f7921k4163B9462P2058a70337k72125
18845d42462J59293A94565a56836o4063b6976j10089A49349a57785C37095b99136
18834e012l1210J2944k25048d809A45501Q3441b50467F5450J18019l2494a24461
18822f4860k04602A84720E6764e2381A30846J78295p3312r3098F7335M6842a7262
18810E36b3877A01809D1999J60500e5794F1305d2249a5447H8658J0638b30604
18798b70764R5509a9858q6632k38602J08626A31679D9731c6188p9448M1897C23382
18786A89122D3893O355B898e0479A29450a06502F1118a22085k23342D5786a01727
18774B25689e2263r4279D6977a45354N7557B41717a37742J0428J9072n0943A94602
$$ plain form
18762 -396480 -34856 -339501 -161088 -89016 -114829 -79341 -237549 296344 166819 -222805
18751 33997 -61754 193976 -294280 227778 -1634 -169953 -67883 175945 188183 -218843 10306
18739 -271042 -76679 -157404 -205031 -315445 -66121 215442 203612 221963 -105959 220556 -226744
18727 -146868 -89296 25945 172944 -13760 -408983 -265049 -280064 128317 44267 -241839
18716 -184256 -133373 -112124 -356 -282455 -196879 -314192 294625 -170945 -35586 -73904 -17483
18704 18326 95798 -271827 -85267 193199 -114957 -207888 88323 30331 -28188 58715 16723
18692 -400728 -7413 22723 10963 51011 -16878 12220 -228278 21898 -56866 20270 -121001
18680 -24172 -113827 -302680 -10114 195358 -211210 226022 -30040 190283 -106689 58522
$$ packed form
18762c96480c4856l04645a61088P2072k5813L5488j58208B96344j29525b22805
18751C3997f1754A93976b94280B27778a634j68319f7883A75945J2238b18843A0306
18739b71042g6679q0725m7627j10414f6121B15442j1830J8351a05959B20556b26744
18727a46868N7572B5945J46999a3760l95223J43934j5015A28317D4267b41839
18716a84256N0883K1249c56k82099Q5576j17313B94625a70945c5586l8318a7483
18704A8326P7472b71827h5267A93199a14957r2931H8323C0331b8188E8715A6723
18692d00728g413B2723A0963M0048a6878A2220b28278B1898e6866B0270a21001
18680b4172q9655j88853a0114A95358b11210B26022c0040A90283a06689E8522
$$ plain form
18669 162026 264354 -144119 -126898 -111880 70222 -235617 -67425 95478 -118342 129445
18658 -138823 49837 -59070 370027 86089 -119643 166208 -210579 -1614 -296325 199764
18647 -56805 -148582 62556 45989 -287198 -92519 146101 -233559 14185 107939 77232 173986
18636 173986 -15216 173096 -90708 123705 -36754 -197576 48113 242820 192501 -167695
18625 -83308 208580 -111353 -317075 -210371 -183128 -114804 -163526 280741 23516 13658 -181530
18613 269786 -179529 -374916 88417 329229 -255330 125861 -147386 260663 -312368 17536
18602 -108715 -144032 95544 59544 235862 -167659 -3964 -259107 -207273 54117 -278177 61094
18590 -299992 -223436 -140214 -99175 -99778 -38829 20827 -54027 -224944 -180822 -209285 -133323 104165
$$ packed form
18669A62026J02328a44119J7221J5018G0222b35617f7425I5478a18342A29445
18658a38823D9837e9070C70027H6089a19643A66208b10579a614k94711A99764
18647e6805r1777F2556j6567b87198i2519A46101b33559A4185R3754l0707R6754
18636A73986a5216A73096i0708A23705c6754j60822D8113J94707n0319a67695
18625h3308B08580a11353k05722J06704K7243O8324m8722B80741B3516r858a81530
18613B69786a79529j95387H8417K40812b55330A25861a47386B60663c12368A7536
18602a08715l5317I5544l6000J76318a67659c964k55143N1834E4117b78177F1094
18590b99992P6556Q3222M1039o03c8829B0827e4027j70917M4122k8463P5962A04165
$$ plain form
18577 145728 -150101 -125713 -121671 -178892 111 -297509 10108 -49986 -6720 -134018 -171375 241265
18564 64812 -117412 -289579 -87322 232946 72073 -236640 289946 -487270 90615 15398
18553 -224099 72174 277612 -188233 34355 -133469 166735 74381 -81725 -152591 -11391 522955
18541 105701 -93365 -330111 -68575 -352286 -95495 -187051 -295493 -11058 -260787 115265
18530 -54976 -152499 -57986 -117737 4510 -229882 -248787 -121778 21708 -305569 -202214 14143
18518 -83104 45775 -57190 -191462 -247126 110553 -251275 338149 69941 -166016 237254
18507 19223 -281729 -622 10354 19880 157283 -86591 12913 87765 -242916 -76887 -271960
18496 -271960 154867 138090 -137784 -309888 84889 -21532 -84323 12407 -5986 -263113 267257
$$ packed form
18577A45728a50101K4388M042n7221A11b97509A0108d9986f720j27298l7357B41265
18564F4812a17412j72167h7322B32946G2073b36640B89946d87270I0615A5398
18553b24099G2174K05438a88233C4355a33469A66735G4381h1725p0866a1391E22955
18541A05701i3365k36746f8575k83711i5495r1556j08442a1058k49729A15265
18530e4976r7523e7986n9751D510b29882j8905a21778B1708c05569J03355A4143
18518h3104D5775e7190j34272n5664A10553b51275C38149F9941a66016B37254
18507A9223b81729f22A0354R526J37403h6591A2913P4852b42916g6887j95073
18496b71960A54867j6777a37784j72104H4889b1532o2791A2407e986k57127B67257
$$ plain form
18484 71134 -63448 -328635 -26798 287747 174297 -187664 80279 -54492 -105809 -12794 231454
18472 21184 312550 -15902 157561 -113228 -193213 -168764 -193257 -15568 -294163 -160412 -172669
18461 -172669 207341 100942 -165253 7163 32911 2621 -184036 -258320 -93082 80468 145539
18450 145539 250 -349125 12958 -158870 -83186 -165583 -22654 180565 3780 135738 -91434
18438 103045 -148672 -122171 -200409 288786 199269 -62009 63430 34419 51290 -169640 -487410
18427 -487410 86764 -115258 -33572 -163343 -122447 -19327 -347532 -285271 -108416 -117276 -92099
18416 -92099 92336 39632 54787 372958 -228480 -45054 -280873 183340 -13734 362770 -64548
18404 188645 -216539 -123313 -124883 -131724 -50356 -152130 -405058 -138584 -149660 -121284 -26294
$$ packed form
18484G1134f3448k65187b6798B87747j13450a87664H0279e4492n1317a2794B31454
18472B1184K91366a5902A57561a13228p9985K4449k4493a5568k78595J33751j2257
18461a72669B07341A00942a65253G163K5748B621a84036p4284i3082H0468O5071
18450A45539B50c49125A2958a58870P5684q2397b2654A80565C780J31958i1434
18438A03045a48672K6501p8238B88786q9517f2009F3430k9011J6871a69640l17770
18427d87410H6764a15258c3572j29771M0896a9327l28205O2261a08416q860K5177
18416i2099I2336C9632J5155L18171b28480d5054k35819A83340a3734C62770f4548
18404A88645b16539R3226j570o841e0356j01774k52928a38584j1076K8376b6294
$$ plain form
18392 -133689 -198702 -95186 210690 171060 311209 -323597 -96169 861 219779 -139712 499312
18380 125858 7976 -73805 264849 156826 -256430 -119992 82675 -190347 -11963 -184904
18370 -184904 -79243 -304285 5135 -198680 303449 169923 261601 -269767 -84457 270614
18359 -62668 -179929 25346 16675 186751 93099 213189 51576 27787 162025 -84567 9177
18347 -47922 -71098 288805 -176917 -77612 -176851 -38993 -109435 140849 190479 -252562 15413
18335 -8265 -297924 41378 182817 100273 -28594 -91255 -160635 -41653 -269303 297290 154302
18324 154302 -75193 -255923 -97533 -103168 -32428 52567 87276 67976 183493 -29203 -86175
18313 -86175 -55428 81636 136549 -200811 234217 176158 -302350 -8758 93105 262673 190551
$$ packed form
18392a33689o5013i5186B10690l9630J40149c23597i6169H61K18918a39712D99312
18380A25858G976g3805B64849j08023b56430a19992H2675a90347a1963j72941
18370a84904g9243k25042E135a98680C03449j33526R1678b69767h4457B70614
18359f2668j17261B5346q671J70076I3099J20090E1576k3789J34238h4567I177
18347d7922k3176B88805a76917g7612r9239c8993p0442A40849M9630b52562A5413
18335h265k89659D1378J41439q2544b8594o2661o9380d1653k27650B97290j42988
18324A54302g5193j80730i7533n635c2428E2567L4709j9300J15517b9203n6972
18313h6175L0747H1636N4913b00811B34217n8059c02350h758I3105J69568p2122
$$ plain form
18302 190551 -54529 213366 134433 11814 55636 -45764 132278 -258696 93045 -2537 -422127
18291 -422127 16317 162345 -197171 95904 138358 19479 75861 -19374 -78658 224544 97762
18279 -192649 71070 84894 -296356 -183593 57996 348071 -181697 283495 -24515 462465
18268 -317803 -30777 74616 -171388 -23512 3337 -176679 49543 -180877 -32337 -2937 4010
18256 248057 125453 81780 159993 104231 -193147 55328 227784 -172242 -394795 -45609
18245 -263330 42335 6603 -89650 9198 -163325 50465 -206787 -319154 73129 -65479 119293
18233 102294 202454 -168022 77392 280232 -99839 363322 49903 83489 -194866 -100560
18223 -100560 -340715 -6635 -225691 141626 -16396 83043 -146369 112387 36223 114673 64449
$$ packed form
18302A90551e4529B13366p8933A1814M3822d5764A32278b58696I3045b537m19590
18291d22127A6317J46028a97171I5904M2454A9479N6382a9374n9284B24544I7762
18279a92649G1070J3824b96356J12763E7996K90075a81697B83495b4515D62465
18268c17803c0777G4616a71388b3512C337a76679D9543a80877c2337b937D010
18256B48057j22604m3673P8213n5762a93147E5328J72456a72242k22553d5609
18245b63330D2335F603h9650I198a63325E0465b06787j12367G3129f5479A19293
18233A02294J00160a68022G7392K02840i9839C63322D9903L3586a94866R4306
18223a00560k40155f635k19056A41626a6396H3043a46369A12387C6223P8450n0224
$$ plain form
18212 64449 -110657 -260567 90273 -291570 70397 -257137 230875 -129595 -111721 -3210 -273694
18201 -273694 -66654 -259981 -26882 -18177 76820 -3165 231026 128074 97879 -377630 179565
18189 76478 -179815 -208819 -130717 122015 -217947 -110539 43745 -416043 111369 112394 38843
18177 -149101 -295209 -294034 -86038 -198644 -149857 86929 64479 -304318 -109284 -37259 73385
18165 -178300 124731 -153359 41107 -153571 -337519 111188 -46760 -502095 -89804 -25368
18154 -104172 281102 -46789 -154654 -62846 -401806 318090 -144578 258441 -166987 -278187
18144 -278187 -59180 -332152 37419 -79121 -230510 -206431 182349 -97580 -2500 -189857 83953
18132 -35073 324657 246406 279690 -125720 -145951 62488 61017 -72250 -33205 -213907 120527
$$ packed form
18212F4449a10657j49910I0273b91570G0397b57137B30875a29595J7874c210k70484
18201b73694f6654j93327b6882Q705G6820c165B31026j02952l0195c77630A79565
18189G6478a79815k9004P8102A22015b17947J07408D3745d16043A11369J025C8843
18177a49101j46108J175h6038j12606M8787H6929k2450c04318a09284c7259G3385
18165a78300A24731a53359D1107a53571j83948A11188d6760m55335h9804b5368
18154a04172B81102d6789j07865f2846l38960C18090a44578B58441a66987j11200
18144b78187e9180k72972C7419g9121j51389K4079A82349i7580b500j87357H3953
18132c5073C24657p8251L3284a25720k0231F2488j471g2250c3205j80702A20527
$$ plain form
18120 -35082 -83255 -149501 123412 -33933 183948 37811 -197390 7304 14456 -23973 -17741 201305
18107 161428 97908 -21759 -147074 115532 -176644 188770 -339418 319425 37997 -22724
18096 154897 101530 92972 301160 -286369 38286 97440 122925 -19843 65252 54780 131966
18085 131966 -157656 121205 -277789 -75656 -76604 -266752 258306 96791 -381193 15320 -142751
18073 86257 -296484 -141461 -277917 -197060 -214982 103074 325030 -190200 -105474 -299829
18063 -299829 163883 -37461 148530 89810 -174641 -301515 -109843 106694 57802 105387
18053 105387 -215970 -88254 -138574 -395594 -236626 -43677 54896 152059 193197 239586 -318091
18041 -178908 -25028 82814 -43235 -26406 24851 27415 46392 -3609 109539 -198599 -130317
$$ packed form
18120c5082m8173o6246A23412c3933A83948C7811a97390G304P152b3973O232B01305
18107A61428o3520b1759j25315A15532a76644A88770c39418C19425C7997b2724
18096A54897n3367q558K08188b86369C8286N9154K5485a9843F5252j0472P7186
18085A31966a57656A21205b77789g5656r48j90148B58306I6791c81193A5320a42751
18073H6257b96484a41461j36456Q0857j7922A03074K21956a90200Q4726j94355
18063b99829A63883c7461A48530n8720a74641j26874a09843A06694m8892M7585
18053A05387b15970h8254n0320k57020J58968d3677E4896R7163M1138M6389c18091
18041a78908b5028H2814d3235J6829B4851K564J8977c609A09539a98599O8282
$$ plain form
18030 -130317 -143973 30247 189341 49200 54509 -262595 245179 443814 -124704 -18517 -381
18018 97387 206439 -208059 61884 341526 -16505 83962 70967 -153744 -47288 83912 -148396
18006 33463 110132 144084 -118418 221812 145845 -119501 135981 -209618 -165112 65476 219214
17995 219214 -270312 91532 13964 74056 -56097 -30933 94064 -365829 -364308 213742 94947
17983 139774 -52666 -25043 -46435 -136153 -237025 -64528 156452 -457040 232111 272140 -4597
17971 5252 20063 -28126 283237 123525 74381 103645 55820 -21707 -96723 -61366 120006
17959 -135037 -529799 18393 -196474 102118 -178446 73800 14822 -174672 -25352 176204
17948 105094 151840 107651 -158291 81610 -132274 -40929 -79034 -502824 -177037 30392 306307
$$ packed form
18030a30317j3656C0247J59094D9200N309b62595B45179J98635a24704a8517c81
18018I7387J09052b08059F1884K79642a6505H3962j2995a53744d7288H3912a48396
18006C3463P6669L3952a18418B21812p5967a19501A35981b09618M4506F5476J53738
17995B19214b70312I1532A3964O0092e6097K5164I4064c65829J521B13742I4947
17983A39774e2666b5043k1392q9718j00872f4528A56452d57040B32111M0029d597
17971E252J4811b8126B83237A23525m9144K9264m7825b1707p5016L5357A20006
17959a35037l94762A8393a96474A02118a78446G3800A4822a74672b5352A76204
17948A05094M6746m4189a58291H1610a32274d0929l8105m23790a77037C0392K75915
$$ plain form
17937 306307 154263 307398 403858 -101753 -73189 61915 71946 -100300 36778 -42328 -34678
17926 -34678 88011 108762 -284957 5851 -209130 -183054 -27408 97188 -23894 46309 127541
17915 127541 -100135 -141589 -4645 21945 160689 135997 50830 -70544 233853 -85395 -270573
17904 -270573 -82790 5906 -156479 52592 -221466 -106057 -411841 143403 89949 65064 73220
17893 73220 -6549 -234605 -365998 -154474 -167998 -170325 170661 -154198 -75104 5517 243985
17882 243985 -143404 -165637 -140492 -57641 2788 44214 -244121 232454 -235838 -15875 234684
17870 66230 140001 -284103 46224 3115 -11904 -287639 -164044 163543 -143121 160684 -147689
17858 81165 -207919 -53607 317568 259880 145931 -129717 32255 199874 -259429 9709 -92953
$$ packed form
17937C06307j52044J53135R6460a01753K8564F1915J0031a00300C6778d2328P650
17926c4678H8011K0751b84957E851b09130K6076b7408I7188b3894D6309Q1232
17915A27541a00135m1454d645B1945J38744k4692E0830g0544B33853h5395j85178
17904b70573h2790E906a56479E2592b21466a06057l05784A43403n3454k4885Q156
17893G3220f549k28056j31393a54474j3524k327A70661a54198g5104E517K38468
17882B43985a43404k2233K5145e7641B788M1426b44121B32454b35838a5875B34684
17870F6230P3771b84103D6224C115a1904k75735J23595A63543a43121A60684a47689
17858H1165b07919e3607C17568n7688j13949a29717C2255J67619b59429I709i2953
$$ plain form
17846 19527 -68044 323904 18851 70788 35738 -38762 -77091 -320746 84978 7866 101060
17835 101060 -96769 -16 235466 -85010 -108456 112127 189552 -442040 51172 102373 23064
17823 -59502 -220948 348399 -153858 35164 190758 -934 -171772 139149 64721 -136075 224222
17811 14074 203785 -58610 25891 -19578 100917 106935 457863 23779 230624 -174366 126420
17799 -14360 266772 67336 -268591 128208 28055 -57749 7626 -291361 -97167 28763 -18480
17787 -41962 -269687 181182 456462 -5010 -81216 -545529 215405 74302 -98545 125744 -1064
17775 -62859 -928 46007 69099 173551 -150517 46181 459601 176355 83271 42505 314852
17764 314852 152099 199194 71481 138376 -80405 29487 176373 -23202 9255 48039 3898
$$ packed form
17846A9527f8044C23904A8851N1937l5050c8762l8329k43655H4978G866R3194
17835A01060i6769a6B35466h5010k3446A12127P7425d42040E1172N1201B3064
17823e9502j61446C48399a53858C5164J55594i34j70838A39149F4721a36075B24222
17811A4074J89711e8610B5891a9578A00917O018L50928B3779K06845a74366A26420
17799a4360B66772F7336b68591A28208B8055e7749G626b91361i7167B8763a8480
17787d1962k27725A81182K75280e010p6206m64313B15405G4302i8545A25744a064
17775f2859i28D6007K3092J04452a50517D6181M13420A76355H3271m0766K72347
17764C14852A52099M7095G1481O6895h0405B9487J46886b3202I255L8784C898
$$ plain form
17752 -78283 -74602 -157992 6744 -208204 379269 123535 217418 292227 195867 -111103 -245757
17741 -245757 -53284 -5580 -57251 31851 -169161 254858 431272 -82420 -201976 48097 151644
17730 151644 -43046 -136695 122422 5843 6808 -15954 103551 102617 -272638 -109765 185627
17718 131847 220332 283236 -36028 179942 236405 -182098 -328121 -44372 -1072 152254 132929
17707 132929 186925 122172 109836 130555 67668 305966 -137131 -93407 -17412 62747 -244822
17695 -91720 137570 -96686 24339 -40104 40926 225698 309130 86627 1381 199996 -365556
17683 -60279 -244371 -276135 359780 -272019 45106 -157563 -1688 161368 109935 175463 -183191
17671 -45401 83739 127325 -123069 -145450 -35578 458919 -110584 222940 118542 47373 -68137
$$ packed form
17752g8283L681q3390F744b08204C79269A23535R3883P4809r6360a11103j34654
17741b45757e3284e580n1671C1851a69161B54858J76414h2420j19556D8097J03547
17730A51644d3046r3649A22422E843R65a5954A03551r34b72638a09765A85627
17718A31847Q8485O2904c6028A79942N6463a82098j46023d4372a072A52254j9325
17707A32929N3996o4753j2336K0719o2887K38298a37131M3724a7412F2747b44822
17695i1720A37570i6686B4339d0104D0926J84772Q3432H6627A381J98615c65556
17683f0279j84092l1764C59780b72019D5106a57563a688A61368n1433O5528a83191
17671d5401H3739M3586a23069k2381c5578D58919a10584B22940j04398D7373f8137
$$ plain form
17659 244174 -3728 -20857 -356980 184923 -38828 -2781 73613 291960 178678 151128 -75581
17647 -70327 -389 147066 1230 -281738 65689 -125386 287272 113769 30222 207962 -211046
17635 -194746 148909 248012 385541 152765 -136312 124884 -92047 150952 97756 2290
17624 -27904 -55378 228253 -16992 -54241 207729 37867 6819 26229 -76276 325653 -60950
17612 55595 37282 149638 203320 116136 105142 39740 75641 276413 51429 -156196 91680
17600 10652 26494 -67715 182632 -66589 -75278 233547 267087 -229966 308927 4921 167868
17589 167868 331592 235 -13432 228292 -30995 5573 125499 123359 168527 155668 142749 162427
17577 162427 201536 199485 -132675 -56130 45608 39039 379106 -276058 131960 87775 39980
$$ packed form
17659B44174c728j7129l36123A84923c8828b781G3613K18347j13282k7550g5581
17647g0327c89A47066A230b81738F5689a25386B87272A13769C0222J77740b11046
17635a94746A48909R9103J37529A52765a36312A24884i2047A50952n3196B290
17624b7904k7474B28253a6992l7249B07729C7867F819J9410g6276C25653f0950
17612E5595j8313J12356N3682q7184j0994C9740L5901K00772E1429a56196I1680
17600A0652J5842f7715A82632f6589q689B33547L3540b29966C08927D921J62947
17589A67868J63724B35a3432B28292c0995E573J19926k140M5168j2859j2919J9678
17577A62427L9109k051a32675e6130D5608o569L40067b76058A31960m4185C9980
$$ plain form
17565 158108 164785 356976 74192 259176 69665 385171 60518 -128507 31402 -55515 251468
17553 21886 49936 175666 49785 -154922 264717 -309853 89871 196099 106155 289470
17543 289470 214731 -294585 102710 331515 -35566 105117 308260 229520 52159 248360
17533 248360 59233 -202040 151366 201630 -136352 -259203 108913 311812 172973 256617
17523 256617 534991 743389 616428 528543 604969 484378 299063 324033 358973 406945
17513 406945 399144 459651 231285 303020 2050 325705 521498 386223 736067 447850 244349
17502 244349 380534 86329 383379 212450 -219545 259449 70080 545 -15609 346861 175940
17491 175940 185089 523685 94022 318458 67223 275992 197311 117975 -84538 438144 36849
$$ packed form
17565A58108O677J92191G4192J84984F9665L15506F0518a28507C1402e5515B51468
17553B1886K8050J25730D9785a54922B64717c09853H9871J06228q9944J83315
17543B89470p4739b94585A02710K28805c5566A05117K03143p8740E2159J96201
17533B48360E9233b02040A51366N0264a36352j22851A08913K02899j38839Q3644
17523B56617K78374K08398j26961q7885P6426j20591j85315K4970L4940M7972
17513D06945p801O0507k28366P1735B050L23655J95793j35275L49844k88217k03501
17502B44349J36185H6329K97050j70929b19545B59449G0080E45a5609C46861j70921
17491A75940R149L38596I4022K24436F7223K08769p8681p9336h4538D38144C6849
$$ plain form
17479 268128 63037 -5454 59761 320987 28558 360765 306339 301635 -67532 383399 294673
17468 294673 273134 317105 -97037 89599 451368 360605 130554 97450 508204 244381 -48087
17456 395820 158829 226038 125323 74755 89153 302956 283657 277235 246154 416465 440837
17445 440837 212973 -243146 118006 -150029 97367 181377 223858 330316 104242 -83844
17434 463101 19626 223912 88066 -333802 189671 357105 346119 66993 -52293 185788
17423 434360 109996 227203 310463 248708 472393 139260 53138 484560 32049 276008
17413 276008 47409 37600 -194246 58111 52691 -81373 173938 163475 66890 120658 75798
17402 75798 96551 262056 -191595 128880 76805 161914 356496 33927 410315 195581
$$ packed form
17479B68128F3037e454E9761K61226B8558L32207n4426m704f7532C83399q8726
17468B94673k1539M3971i7037H9599L61769r0763A30554l3104M10754B44381d8087
17456C95820A58829O7209j00715n0568J4398K13803j9299o422l1081J70311K4372
17445D40837B12973b43146A18006a50029I7367Q4010M2481J06458A04242h3844
17434D63101A9626K04286H8066c33802A89671J67434j0986F6993e2293A85788
17423D34360A09996J17207Q3260o1755K23685A39260E3138M31422C2049K43959
17413B76008D7409r809a94246E8111n420h1373A73938j0463F6890N3768m4860
17402G5798K0753J65505a91595A28880n2075Q5109J94582C3927L76388A95581
$$ plain form
17391 -173467 74466 -162863 154269 -107199 306138 135881 147420 252034 88875 132124
17381 132124 217728 137014 -25185 91568 163552 177309 172914 174049 -101516 99659 123063 331269
17369 331269 124161 -42850 143311 192940 168704 251782 287369 134584 242933 -218518
17358 -121584 65065 -18192 262020 97993 294874 512594 329581 280231 398315 284792
17348 284792 319333 354031 317618 330474 236281 133174 381426 150035 144835 -15112 78033
17336 318086 156034 37348 109307 9618 363749 -163179 39524 144047 84827 225444 101286
17324 406020 201630 320699 236746 418736 111714 53779 262211 314667 270673 340521
17314 340521 -105325 346271 365853 62134 249635 190604 278362 167911 64030 -81871 422037
$$ packed form
17391a73467G4466a62863A54269a07199C06138A35881J1539J04614H8875M3249
17381A32124Q5604q0714b5185I1568P1984J3757m395J135a01516I9659K3404K08206
17369C31269A24161d2850A43311M9629k4236Q3078L5587A34584J08349b18518
17358a21584F5065a8192B62020I7993J96881K17720j83013m9350J18084j13523
17348B84792L4541L4698l6413J2856r4193j03107K48252A50035n200a5112G8033
17336C18086A56034C7348P1959I618L54131a63179C9524J04523n9220J40617A01286
17324D06020B01630J19069q3953J81990A11714E3779K08432N2456m3994O9848
17314C40521a05325C46271J9582F2134J87501n9031Q7758j10451F4030h1871D22037
$$ plain form
17302 100866 -149944 398457 177299 388232 473331 308795 148855 450846 217759 141736
17292 141736 160317 56355 -276270 348007 223737 453766 361704 -77839 271932 205821
17282 205821 275971 281337 300884 327731 -1231 174724 609772 90059 478517 179530 313550
17271 313550 121987 -72818 325752 228420 291203 222322 -34066 26445 472589 446926 273742
17260 273742 176613 137071 141864 189881 379333 297112 245626 522228 265078 219535 455930
17249 455930 -187027 133206 224012 -21578 518900 186016 98954 101696 341737 415239 290778
17238 290778 512127 207499 107964 270370 318741 12048 205050 137620 152405 242018 -2934
17226 536138 106404 434150 445031 160729 -6747 296070 551822 401289 117301 318329
$$ packed form
17302A00866a49944C98457A77299K10933Q5099j64536A48855L01991B17759p6023
17292A41736J8581E6355b76270C48007j24270K30029r2062g7839B71932o6111
17282B05821P0150N366J9547K6847a231A74724M35048I0059L88458A79530J34020
17271C13550A21987g2818C25752r7332O2783o8881c4066B6445M46144k5663j73184
17260B73742r7129l9542M793M8017J89452q2221n1486K76602k57150m5543K36395
17249D55930a87027A33206R0806b1578E18900A86016q7062K742K40041P3502j24461
17238B90778K21349B07499r9535J62406M8371A2048J93002o7430J4785Q9613b934
17226E36138A06404L27746J0881A60729f747B96070K55752j50533A17301K01028
$$ plain form
17216 318329 30581 453442 360023 223888 288895 541668 128585 353014 153608 283178
17206 283178 276226 262681 9382 299619 390183 184552 434872 554250 507176 476318 588313
17195 588313 382852 164302 413046 360588 182310 238696 475214 501773 284442 422253
17185 422253 168358 231177 187604 510738 472667 237599 216948 201617 243615 496704 485497
17174 485497 424160 228392 827295 -57599 314009 663988 486670 238580 269818 422270
17164 422270 386986 385392 392454 402258 875183 330632 246796 500177 573143 625666 299830
17152 325394 537325 749018 513294 319625 397732 419404 193200 287560 267628 506995
17142 506995 224832 466653 274500 603047 720908 494307 373117 772790 859555 338076
$$ packed form
17216C18329C0581M22861r3419j36135O5007K52773A28585K24429A53608J29570
17206B83178o952j3545I382K90237R0564A84552K50320J19378m7074l0858J11995
17195E88313k05461A64302K48744n2458j78278N6386K36518K6559k17331J37811
17185D22253A68358O2819m3573L23134l8071k35068k0651j5331M1998K53089j1207
17174D85497o1337j95768N98903e7599C14009L49979j77318B38580L1238J52452
17164D22270l5284j594P062R804M72925C30632q3836K53381P2966N2523B99830
17152C25394K11931K11693k35724j93669P8107K1672A93200R4360j9932K39367
17142E06995B24832K41821j92153L28547J17861k26601j21190L99673Q6765C38076
$$ plain form
17131 456158 262181 748034 189561 522787 724546 448235 327627 211865 737260 437458
17121 437458 515347 585305 800071 769797 711450 243645 549188 730968 496923 838586
17111 838586 410138 412810 782320 509711 530463 948172 327153 640764 545455 225577
17100 644478 710446 667474 835536 603774 510531 793312 679709 527854 636297 474091
17090 474091 728249 725055 830413 484933 615911 587797 530926 313606 651774 829610
17080 829610 608743 612140 696774 278161 750182 745759 727630 278309 332096 727944 537650
17069 537650 716944 608620 705688 980506 977658 799329 1081308 615426 649956 682522
17059 682522 317558 664186 841182 664474 608199 695715 857425 663426 871704 565233
$$ packed form
17131D56158j93977M85853A89561L33226K01759k76311j20608j15762N25395k99802
17121D37458P7889O9958K14766l0274n8347B43645L05543J81780k34045L41663
17111H38586D10138K672L69510k72609K0752M17709C27153L13611r5309B25577
17100F44478O5968m2972J68062k31762r3243K82781j13603j51855J08443j62206
17090D74091K54158l194J05358l45480J30978k8114n6871k17320L38168J77836
17080H29610k20867L397Q4634B78161M72021m423j8129B78309N3787L95848j90294
17069E37650J79294j08324R7068K74818k848j78329K81979m65882L4530L2566
17059F82522C17558L46628J76996j76708n6275Q7516J61710j93999K08278l06471
$$ plain form
17049 565233 838920 768501 480772 1009775 860389 892233 607007 750161 953655 883025
17039 883025 649782 821341 860431 988807 1064999 845073 966806 725388 927662 841589
17029 841589 1075433 1053280 935286 960962 1109544 1164259 760438 732323 1035762 1126532
17019 1126532 1216215 778290 666499 962884 1134258 798788 857462 962528 823793 986217
17009 986217 1294202 1207892 1170761 1060124 887154 974650 781397 1130902 896775 1054911
16999 1054911 951394 993100 1144732 1114829 1197953 1275563 913571 1284989 1234542 1133173
16989 1133173 854045 1059421 1133947 1255031 1226629 856926 1198985 1256383 1512769 1445892
16979 1445892 1329687 1200123 1111612 1354228 1363319 1513748 1442473 1687037 1489294 1497377
$$ packed form
17049E65233K73687p0419k87729N29003j49386L1844k85226J43154K03494p0630
17039H83025k33243J71559L9090J28376P6192k19926J21733k41418K02274q6073
17029H41589K33844k2153j17994K5676J48582N4715m03821k8115L03439R0770
17019A126532Q9683m37925j11791K96385J71374l35470N8674J05066j38735J62424
17009I86217L07985q6310l7131j10637j72970Q7496j93253L49505k34127J58136
16999A054911j03517M1706J51632k9903Q3124P7610l61992L71418n0447j01369
16989A133173k79128K05376P4526J21084k8402l69703L42059N7398K56386o6877
16979A445892j16205j29564q8511K42616R091J50429p1275K44564j97743Q083
$$ plain form
16969 1497377 1529743 1618634 1500132 1627602 1653031 1731460 1579083 1806301 1433496 1797213
16959 1797213 1415702 1558694 1615743 1862373 1638100 1610213 1704901 1709007 1897233 1526849
16949 1526849 1821950 1907436 2053091 1626233 1663485 1814706 2063830 1943630 1886848 2520060
16939 2520060 2006814 1973572 1798901 2389093 1918753 2284312 2399396 2105024 2284847 2181447
16929 2181447 2205420 2086075 2224506 2395297 2269346 2607928 2301425 2945417 2555420 2431405
16919 2431405 2626766 2572577 2325385 2552200 2550729 2527796 2677893 2708201 2782889 3109736
16909 3109736 2990059 3204415 2852440 2669141 3144113 2920264 2897623 3318427 2995813 2878227
16899 2878227 3353935 3327373 3610970 3600385 3396894 3625055 3766607 3483325 3737875 3467167
$$ packed form
16969A497377L2366Q8891j18502J27470K5429P8429j52377K27218l72805L63717
16959A797213l81511J42992N7049K46630k24273k7887R4688M106J88226l70384
16949A526849K95101Q5486J45655m26858L7252J51221K49124j20200n6782O33212
16939B520060n13246l3242j74671N90192m70340L65559J15084k94372J79823j03400
16929B181447K3973j19345J38431J70791j25951L38582l06503O43992l89997j24015
16919B431405J95361n4189k47192K26815j471k2933J50097L0308P4688L26847
16909C109736j19677K14356l51975j83299M74972k23849k2641M20804l22614j17586
16899B878227M75708k6562K83597j0585k03491K28161J41552k83282K54550k70708
$$ plain form
16889 3467167 3598576 4261070 3923931 3978945 3790191 4191569 4353804 4152085 4257358 4147036
16879 4147036 4457390 4420979 4056123 4565356 4587643 4953718 4805840 4798119 5078985 4883510
16869 4883510 5139153 5260351 5384405 5033734 5278497 5441761 5425084 5614654 5960100 5818534
16859 5818534 5848913 6020500 5851719 6303135 6656733 6303262 6848778 6886882 6947256 7297170
16849 7297170 7349465 6972359 7283172 7520240 7696822 7827626 7864421 8211587 8623369 8306352
16839 8306352 8650364 8631505 8969562 9019955 9215032 9491232 10068375 9928252 9972845 9852598
16829 9852598 10555718 10820164 10890989 11328493 11752172 11754149 11725655 12337941 12655480 12868084
16819 12868084 13267133 13601371 13868807 14481065 14636134 14925920 15127875 15309049 15774809
$$ packed form
16889C467167J31409O62494l37139N5014j88754M01378J62235k01719J05273j10322
16879D147036L10354l6411l64856N09233K2287L66075j47878p721K80866j95475
16869D883510K55643J21198J24054l50671K44763J63264j6677J89570L45446j41566
16859E818534L0379J71587j68781M51416L53598l53471N45516L8104O0374L49914
16849G297170N2295l77106L10813K37068J76582J30804L6795L47166M11782l17017
16839H306352L44012j8859L38057N0393J95077K76200N77143j40123M4593j20247
16829I852598P03120K64446P0825M37504M23679J977k8494O12286L17539K12604
16819A2868084L99049L34238K67436O12258J55069K89786K01955J81174M65760
$$ plain form
16810 15774809 16545069 16876036 17225113 17438451 18066180 18746171 18924894 19712896 20227535
16801 20227535 20650115 21172146 21847398 22539684 23097749 23990479 24390790 25295845 26020307
16792 26020307 26888831 27613047 28255778 29039661 30191117 31107268 31967648 32924774 33714177
16783 33714177 35006253 36038128 37611168 38248760 39805035 40908263 42670653 43568156
16775 43568156 45239984 46806832 48399052 49741405 51535656 53104452 54957917 56781973
16767 56781973 58645918 60707898 62169911 64273296 66168694 68347197 70061272 72410343
16759 72410343 74591218 76637315 78781744 80729683 82818127 84844914 86684693 88529311
16751 88529311 90726948 92335604 94133960 95629979 96998114 98273188 99511791 100533626
$$ packed form
16810A5774809P70260L30967L49077K13338O27729O79991J78723P88002N14639
16801B0227535M22580N22031O75252O92286N58065Q92730M00311R05055P24462
16792B6020307Q68524P24216O42731P83883J151456R16151Q60380R57126P89403
16783C3714177J292076J031875J573040O37592J556275J103228J762390Q97503
16775D3568156J671828J566848J592220J342353J794251J568796J853465J824056
16767E6781973J863945K061980J462013K103385J895398K178503J714075K349071
16759G2410343K180875K046097K144429J947939K088444K026787J839779J844618
16751H8529311K197637J608656J798356J496019J368135J275074J238603J021835
$$ plain form
16743 100533626 100925038 101784192 102271779 102311656 102409494 102316406 102013233 101355438 100411129 99574951
16733 99574951 98270979 97360106 96030580 94857408 93176747 91414536 89710351 87851716
16725 87851716 85739344 83953987 82097481 80070973 77931134 75837179 74249394 71915344
16717 71915344 69572377 67848861 66110901 64046938 62417319 60159809 58781601 56929884
16709 56929884 55320352 53448824 52323534 50372803 49165967 47597765 46391197 45173076
16701 45173076 43823962 42386973 41150510 39638047 38778801 37876940 36747064 35817416
16693 35817416 34784198 33625648 33071742 31814884 31001755 30057079 29414788 28471331 28032082
16684 28032082 27253000 26536797 25938605 25524818 24416786 24349980 23451951 22868352 22388732
$$ packed form
16743A00533626L91412Q59154M87587L9877R7838r3088l03173o57795r44309q36178
16733I9574951j303972r10873j329526j173172j680661j762211j704185j858635
16725H7851716k112372j785357j856506k026508k139839k093955j587785k334050
16717G1915344k342967j723516j737960k063963j629619k257510j378208j851717
16709E6929884j609532j871528j125290j950731j206836j568202j206568j218121
16701D5173076j349114j436989j236463j512463q59246r01861j129876r29648
16693C5817416j033218j158550n53906j256858q13129r44676o42291r43457m39249
16684B8032082p79082p16203n98192m13787j108032o6806q98029n83599m79620
$$ plain form
16675 22388732 22005493 21050288 20974373 20233137 19697546 19434334 18816417 18391310 18174345
16666 18174345 17884246 17623401 17200274 16459893 16012292 15911410 15411234 15360583 14918425
16657 14918425 14573491 14515348 14101441 13819199 13852812 13610767 12902687 13074730 12630425 12417463
16647 12417463 12158575 12218119 11709891 11702204 11621027 11409157 11277081 10894424 10528136 10546873
16637 10546873 10316451 10082917 9829707 9762693 9654689 9394903 9311026 9278368 9338458 9026063
16627 9026063 8541866 8616838 8364026 8349771 8445807 8298219 8334609 7996096 7829111 7771671
16617 7771671 7664900 7556048 7539245 7583382 7399875 7452655 7276999 6838433 6887620 6941900
16607 6941900 6579176 6704157 6736882 6482437 6706781 6329436 6041802 6192047 6134895 6265345
$$ packed form
16675B2388732l83239r55205p5915p41236n35591k63212o17917m25107k16965
16666A8174345k90099k60845m23127p40381m47601j00882n00176n0651m42158
16657A4918425l44934n8143m13907k82242L3613k42045p08080J72043m44305k12962
16647A2417463k58888N9544n08228p687q1177k11870j32076l82657l66288J8737
16637A0546873k30422k33534k53210o7014j08004k59786q3877l2658O0090l12395
16627I026063m84197P4972k52812j4255R6036j47588L6390l38513j66985n7440
16617G771671j06771j08852j6803M4137j83507N2780j75656m38566M9187N4280
16607F941900l62724J24981L2725k54445K24344l77345k87634J50245n7152J30450
$$ plain form
16597 6265345 5936835 5641193 5907032 5593960 5912074 5661768 5668932 5366787 5482619 5593898
16587 5593898 5483098 5356564 5281940 5164422 5315921 5257146 4953471 5002439 4643072 4762568
16577 4762568 5022336 4621166 4895274 4647814 4481476 4771791 4285983 4317272 4407522 4157752
16567 4157752 4497154 4239990 4338057 4272455 4115323 4067610 4087078 3951179 4071139 3726932
16557 3726932 4084826 3916548 3739950 3802538 3949159 4056046 3951774 3798410 3678873 3903294
16547 3903294 3867460 3398756 3292812 3561213 3401290 3466099 3395977 3554465 3335538 3052381
16537 3052381 3466183 3481635 3191732 3247206 3492082 3158826 3102903 3362584 3205943 3035512
16527 3035512 2934509 3029367 2833062 3034062 3349798 3156469 2871075 2950190 2905150 2946965
$$ packed form
16597F265345l28510k95642K65839l13072L18114k50306P164l02145J15832J11279
16587E593898j10800j26534p4624j17518J51499n8775l03675M8968l59367J19496
16577D762568K59768m01170K74108k47460j66338K90315m85808L1289R0250k49770
16567D157752L39402k57164R8067o5602j57132m7713J9468j35899J19960l44207
16557C726932L57894j68278j76598O2588J46621J06887j04272j53364j19537K24421
16547C903294l5834m68704j05944K68401j59923O4809p0122J58488k18927k83157
16537C052381M13802J5452k89903N5474K44876l33256n5923K59681j56641j70431
16527C035512j01003R4858j96305K01000L15736j93329k85394P9115m5040M1815
$$ plain form
16517 2946965 2842347 2674187 3270701 2546664 2847430 3251744 2727532 2629521 2711620 2615849
16507 2615849 2908234 2699772 2792629 3029636 2970132 3072625 2652910 2964630 2816853 2552957
16497 2552957 2596933 2991639 2916957 2593526 2298311 2523887 2375543 2578426 2626937 2572032
16487 2572032 2495859 2565746 2606227 2554922 2332713 2927230 2317475 2427033 2552806 2473872
16477 2473872 2310967 2688431 2410095 2413423 2187556 2524417 2299092 2509931 2530995 2524209
16467 2524209 2405493 2159165 2569634 2102961 2300224 2652398 2104622 2083113 2330297 2338506
16457 2338506 2340905 2452903 2093461 2017130 2319029 2361587 2288047 2083559 2203792 2288555
16447 2288555 2229946 2132096 2112654 2484837 2341035 2062000 2127473 2139996 2213810 2194840 1843165
$$ packed form
16517B946965j04618j68160N96514p24037L00766M04314n24212r8011Q2099r5771
16507B615849K92385k08462R2857K37007n9504J02493m19715L11720j47777k63896
16497B552957M3976L94706p4682l23431k95215K25576j48344K02883M8511n4905
16487B572032p6173O9887M0481n1305k22209N94517o09755J09558J25773p8934
16477B473872j62905L77464k78336L328k25867L36861k25325K10839K1064o786
16467B524209j18716k46328M10469m66673J97263L52174n47776k1509K47184Q209
16457B338506K399J11998l59442p6331L01899M2558p3540k04488J20233Q4763
16447B288555n8609r7850j9442L72183j43802k79035O5473J2523P3814j8970l51675
$$ plain form
16436 1843165 2171073 2114077 2041086 2110920 1867037 2103556 2247443 2171675 2290511 2226917
16426 2226917 2304116 1891544 2089738 2004363 2169700 2249932 1764900 1962705 2035793 2121101
16416 2121101 2156970 1887639 1890234 2047471 2142587 2018079 1959339 1731876 2080192 2147144
16406 2147144 2187277 1755071 2014958 1972052 1991442 2076275 2041623 1891169 1741592 2047398
16396 2047398 1521107 2196304 2008022 1735514 1992384 1854259 1870535 1814067 2221584 1890052
16386 1890052 1808304 1706557 1449270 1477247 1606176 1989146 1701194 1838129 1817293 1921817
16376 1921817 1863965 1814194 1654857 1610752 1844703 1568377 1846902 1812519 1909426 1908335 1936772
16365 1936772 1848590 1802648 1718823 1731481 1635030 1641607 1632501 1746587 1854216 2114152 2187662
$$ packed form
16436A843165L27908n6996p2991O9834k43883K36519J43887p5768J18836o3594
16426B226917P7199m12572J98194q5375J65337Q0232m85032J97805P3088Q5308
16416B121101L5869k69331K595J57237R5116j24508n8740k27463L48316O6952
16406B147144M0133m32206K59887m2906J9390Q4833l4652j50454j49577L05806
16396B047398n26291O75197j88282k72508K56870j38125J6276n6468M07517l31532
16386A890052q1748j01747k57287K7977J28929L82970k87952J36935k0836J04524
16376A921817n7852m9771j59337m4105K33951k76326K78525l4383R6907j091K8437
16365A936772q8182m5942q3825J2658r6451O577r106J14086J07629K59936P3510
$$ plain form
16354 2187662 1750505 1663182 1903756 1590500 1781005 1370561 1787895 1728023 1431596 1608105
16344 1608105 1589535 1488814 1421872 1574331 1783701 1146581 1880093 1584231 1579115 1887972
16334 1887972 1924211 1793189 1682856 1637767 1334205 1830547 1383885 1353704 1667883 1455510
16324 1455510 1522554 1446400 1517207 1528075 1637557 1646459 1547911 1491554 1714972 1461180 1540128
16313 1540128 1461432 1530889 1713026 1573699 1385705 1483283 1437151 1502609 1580161 1608768 1526770
16302 1526770 1578893 1794864 1249206 1572213 1358238 1773288 1667983 1731165 1598904 1287416
16292 1287416 1486117 1148432 1198026 1717182 1427797 1339781 1444565 1487799 1208994 1539211
16282 1539211 1577256 1237808 1278116 1416944 1454494 1347634 1226262 1244076 1292678 1548111
$$ packed form
16354B187662m37157q7323K40574l13256J90505m10444M17334n9872k96427J76509
16344A608105j8570j00721o6942J52459K09370o37120P33512k95862n116L08857
16334A887972L6239j31022j10333m5089l03562M96342m46662l0181L14179k12373
16324A455510O7044p6154P0807J0868J09482Q902r8548n6357K23418k53792P8948
16313A540128p8696O9457J82137j39327j87994R7578m6132O5458P7552K8607q1998
16302A526770N2123K15971n45658L23007k13975M15050j05305O3182j32261l11488
16292A287416J98701l37685M9594N19156k89385q8016J04784M3234k78805L30217
16282A539211L8045l39448M0308J38828L7550j06860j21372J7814M8602K55433
$$ plain form
16272 1548111 1504299 1570888 1236817 1346494 1185266 1312819 1366112 1091736 1348417 1390423
16262 1390423 1447609 1255859 1232894 1358896 1285771 1045146 1366776 962554 1329022 1456202
16252 1456202 1134992 1362028 1452563 1328723 1008297 816115 1205156 1000503 1209469 1341614
16242 1341614 1032001 1252887 1505350 1190691 970889 1134755 1378741 1105030 1094941 1211081
16232 1211081 1241946 1181893 1143987 1074024 1214019 807918 1302646 877857 1070392 1204015
16222 1204015 1278172 1040766 1163638 1160430 893457 1082708 1217395 916371 1160366 1123897
16212 1123897 1015621 791301 941074 892451 913347 801410 851709 949683 851240 863648
16202 863648 1010147 1188580 852725 725058 919062 762296 1007498 922070 1153966 952799
$$ packed form
16272A548111m3812O6589l34071J09677j61228J27553N3293k74376K56681M2006
16262A390423N7186j91750k2965J26002p3125k40625L21630m04222L66468J27180
16252A456202l21210K27036R0535j23840l20426j92182L89041k04653K08966J32145
16242A341614l09613K20886K52463l14659k19802J63866K43986k73711j0089J16140
16232A211081L0865o0053l7906o9963J39995m06101M94728m24789J92535J33623
16222A204015P4157k37406J22872l208k66973J89251J34687l01024K43995l6469
16212A123897j08276k24320J49773m8623K0896j11937N0299R7974r8443J2408
16202H63648J46499J78433l35855j27667J94004j56766K45202q5428K31896k01167
$$ plain form
16192 952799 984530 1103756 950170 919511 961589 700715 844847 748848 699023 813554
16182 813554 990328 966599 1006990 945110 869832 876865 803110 932673 810614 614798 445637
16171 445637 363397 999210 909263 622791 756781 638816 732624 670163 366152 1002310
16161 1002310 532864 1028717 815163 618189 767108 781774 842650 711838 843405 523796
16151 523796 913920 544664 685875 715274 609418 607080 941278 222187 759850 472872
16141 472872 776019 437102 469084 415840 604574 462761 532876 466007 549839 360353
16131 360353 513347 703220 536150 353295 973392 723421 758154 496606 789273 742092
16121 742092 512790 481220 463765 687518 458284 429913 398722 531620 426906 325267
$$ packed form
16192I52799L1731J19226j53586l0659M2078k60874J44132r5999m9825J14531
16182H13554J76774k3729M0391o1880p5278P033p3755J29563j22059j95816j69161
16171D45637q2240O35813q9947k86472J33990j17965R3808o2461l04011O36158
16161A002310m69446M95853k13554j96974J48919J4666O0876j30812J31567l19609
16151E23796L90124l69256J41211K9399j05856k338L34198B22187N37663k86978
16141D72872L03147l38917L1982n3244J88734j41813P0115o6869Q3832j89486
16131C60353J52994J89873j67070j82855O20097k49971L4733k61548K92667m7181
16121G42092k29302l1570j7455K23753k29234k8371l1191J32898j04714j01639
$$ plain form
16111 325267 715055 240519 265058 269306 457797 705077 350069 666732 235445 249189
16101 249189 287671 221859 409510 579412 208559 538583 314564 309013 171190 317566
16091 317566 452756 437049 856627 395738 46623 192239 632644 461426 391404 475984
16081 475984 215345 586943 347497 367703 511739 433555 -20418 269749 250118 -85696
16070 313423 592678 521774 225896 181403 307447 10528 429788 189890 242148 20596
16059 303140 538594 284322 360377 259378 342254 517758 130839 158214 353472 126217
16048 305079 54606 374808 450536 570792 252798 109648 337438 85916 -138167 409552
16037 312789 405821 280398 6272 322095 309227 137991 574702 393536 276748 388174
$$ packed form
16111C25267L89788B40519K4539M248J88491K47280C50069L16663B35445J3744
16101B49189L8482o5812J87651J69902B08559L30024k24019n551j37823J46376
16091C17566J35190j5707M19578C95738D6623J45616M40405j71218p0022Q4580
16081D75984B15345L71598k39446K0206J44036p8184b0418B69749j9631h5696
16070C13423K79255p0904B25896m4493J26044A0528M19260A89890N2258B0596
16059C03140K35454k54272P6055j00999Q2876J75504A30839K7375J95258A26217
16048C05079E4606L20202P5728J20256B52798A09648K27790H5916a38167D09552
16037C12789R3032j25423F272L15823j2868A37991M36711j81166j16788J11426
$$ plain form
16027 388174 8912 -238510 280169 170069 174989 95492 510740 -55280 99792 50797 183906
16016 183906 278161 251207 474240 84496 370280 445970 154705 13676 202434 429308
16006 429308 256864 420797 110052 25851 -48921 22093 262401 185052 289321 31091
15995 18254 7969 102413 509343 264929 29661 295160 673788 345275 633430 901088
15985 901088 1047597 1083477 428160 151599 292462 177778 -162035 25406 218833 75054
15974 505803 146266 23563 196281 244710 -50738 101778 -5667 -25933 -28306 392200 26971
15962 117948 13366 290680 58979 80611 159357 -2690 -31237 96766 399261 169795 -11982
15950 329061 -34418 157694 48055 546353 112107 76739 282636 61268 110830 -89665 -93083
$$ packed form
16027C88174H912b38510B80169j10100M920p9497M15248e5280I9792m8995J33109
16016A83906R4255k6954K23033H4496K85784P5690A54705A3676J88758K26874
16006D29308j72444J63933A10052B5851d8921B2093K40308p7349J04269C1091
15995A8254G969R4444M06930k44414B9661K65499L78628l28513K88155K67658
15985I01088J46509L5880D28160A51599J40863j14684a62035B5406J93427G5054
15974E05803A46266B3563J72718M8429e0738A01778e667k0266k373C92200B6971
15962A17948A3366K77314E8979K1632P8746b690k8547I6766L02495A69795a1982
15950C29061c4418A57694D8055M98298A12107l5368K05897F1268M9562h9665l418
$$ plain form
15939 -93083 342964 221642 240971 228744 -156851 178153 -225490 471565 70666 -95836
15928 287523 314555 -18103 -48816 -179821 47063 -92665 -336674 418816 -89049 -11478 -109386
15917 -109386 -26785 232225 302892 -16278 -18426 72317 198072 197012 -89033 -143490 -62217
15905 -103177 132596 315887 -92845 -234244 278632 173032 -22027 96114 -28369 -160054
15895 -160054 -63224 134717 13570 71195 -130273 -86525 -174048 255065 -40166 31461 50658
15884 50658 61999 113261 -34606 -67183 -115293 -189807 101971 -55013 24608 -164994 201226
15872 -128662 34203 328266 -101274 -188957 24960 152813 141283 -236368 160734 24663
15861 81483 271994 -288145 266950 -172724 155981 20529 136995 -47873 -58322 -149227
$$ packed form
15939i3083C42964j21322J9329j2227a56851A78153b25490D71565G0666i5836
15928B87523K7032a8103l0713j31005D7063i2665k44009D18816h9049a1478r7908
15917a09386b6785B32225P0667a6278k148G2317J25755j060h9033n4457f2217
15905a03177A32596J83291i2845j41399B78632j05600b2027I6114b8369j31685
15895a60054f3224A34717A3570N7625a30273M3748q7523B55065d0166C1461J9197
15884E0658J1341N1262c4606l2577m8110p4514A01971e5013B4608a64994B01226
15872a28662C4203K94063a01274q7683B4960J27853j1530b36368A60734B4663
15861H1483J90511b88145B66950a72724A55981B0529J16466d7873j0449r0905
$$ plain form
15851 -149227 -60978 -99796 -30402 -125008 -14892 504250 104677 -83276 117 135246 -209108
15839 -50610 -425024 -162255 -189754 142519 105884 -29726 202055 -170280 83943 285992
15829 285992 1832 -230685 261341 -26085 130890 -394935 107121 200390 21854 -305686
15818 44437 -228636 287064 -125631 -141066 -162910 -67601 255962 -178150 -2548 -75289 324407
15806 -254585 -93921 -180785 307061 78511 32919 183989 -79442 61017 48660 258438 -193375
15794 -159458 42393 416172 243406 20283 -200429 131828 287266 70366 -21572 -296929
15784 -296929 -120103 -234291 -33162 197486 -41831 185628 199194 163877 158234 -90643 255231
15772 76645 -70749 -200391 197957 -33324 49771 -10955 374093 84643 270496 -10859 -319890
$$ packed form
15851a49227f0978l8818c0402r4606a4892E04250A04677h3276A17J35129b09108
15839e0610l74414a62255k7499A42519l6635b9726B02055a70280H3943K02049
15829B85992A832b30685B61341b6085A30890c94935A07121R3269B1854c05686
15818D4437b28636B87064a25631j5435k1844f7601B55962a78150b548p2741C24407
15806b54585i3921q6864C07061G8511C2919J51070g9442F1017j2357K09778a93375
15794a59458D2393L73779j72766B0283b00429A31828J55438G0366b1572k75357
15784b96929a20103j14188c3162A97486d1831A85628J3566l5317n643i0643B55231
15772G6645g0749j29642A97957c3324D9771a0955C74093H4643J85853a0859l09031
$$ plain form
15761 -319890 251875 128090 -324215 232960 152525 110885 12606 -207795 -108745 137080
15750 5209 240802 97175 113719 193719 313019 73745 -16481 -38707 105522 -106755 -109427
15739 -109427 -64161 272778 153897 101538 305062 199364 -40209 -263285 -27738 183146
15728 -146820 100462 -64242 -99859 85890 -62790 -246458 -28809 -25239 -22585 -63064 39724
15716 32627 -472303 -258600 -7738 284093 -41401 -67588 -66091 374376 -249634 -154519 -60966
15704 166390 -69939 22493 -356680 213960 94893 93806 72349 -222080 -88360 -132985 97739
15692 -448414 273836 -95736 -146814 -33364 156337 -222494 -399078 -37038 146189 268329
15682 268329 175168 41407 -93993 95449 362927 44845 151765 96445 61404 968 -48180
$$ packed form
15761c19890B51875j23785c24215B32960q0435m1640A2606b07795R9050A37080
15750E209K35593I7175J6544Q0000J19300G3745a6481k2226A05522a06755k672
15739a09427M5266B72778j18881n2359K03524j05698d0209k23076b7738A83146
15728a46820A00462f4242l5617H5890f2790j83668b8809L570K654m0479C9724
15716C2627d72303K13703g738B84093d1401k6187J497C74376b49634R5115f0966
15704A66390f9939B2493c56680B13960I4893j087k1457b22080h8360m4625I7739
15692d48414B73836i5736n1078c3364A56337b22494j76584c7038A46189J22140
15682B68329r3161D1407i3993I5449K67478D4845J06920n5320l5041I68d8180
$$ plain form
15670 34450 118042 -243305 17041 13796 83724 -284874 -183596 -137401 -143358 -262991 366834
15658 -227162 142902 -281491 -179226 -46558 -178459 374 46967 322080 91442 -101949 -81029
15647 -81029 -6698 -75400 -22322 -244321 199924 -27481 245939 -291975 -435303 35204 -88678
15635 -192900 -240642 -3797 115601 134441 51620 -82276 225371 87576 -66358 -112743 141875
15623 -178179 208782 -30865 -8245 -72010 59593 1695 -74310 145415 134178 -233308 -288217
15612 -288217 22788 313578 -152725 26588 -33251 245971 -95799 147376 -152556 -177859
15602 -177859 40532 191983 71688 -70687 305056 270746 -84032 -147555 -175405 75886 48896
15591 48896 113524 -404834 140968 52749 -238963 -95688 185541 -61164 25320 -120742 7819
$$ packed form
15670C4450Q3592b43305A7041l245O9928b84874J01278M6195n957j19633C66834
15658b27162A42902b81491J02265d6558j31901C74M6593K75113I1442a01949K0920
15647h1029f698o8702b2322k21999A99924b7481B45939b91975j43328C5204h8678
15635a92900m7742c797A15601J8840E1620h2276B25371H7576f6358m6385A41875
15623a78179B08782c0865h245o3765E9593A695g4310A45415j1237b33308n4909
15612b88217B2788K90790a52725B6588c3251B45971i5799A47376a52556k5303
15602a77859D0532J51451G1688g0687C05056l4310h4032o3523k7850G5886k6990
15591D8896O4628d04834A40968E2749b38963i5688A85541f1164B5320a20742G819
$$ plain form
15579 218572 -224022 -210511 -87692 -247270 -207527 -50557 57285 133633 -453136 177510 245208
15568 245208 36855 19076 -146818 -45632 141443 -96065 -261333 214359 -233817 232628
15557 -36412 38118 215533 164548 -190380 169378 46986 -216472 -254678 148743 -378183
15546 163968 21288 -63994 203967 -356058 -82288 -177631 355841 -15786 258345 257329 -9814
15534 172114 96160 -69738 -157389 95538 123215 85086 -310418 -183254 42158 137576 335530
15523 335530 -245 -44492 -63560 -34657 204604 -326603 35291 116500 230698 170010 -188184
15511 373328 -84646 173838 -240298 17376 -87624 -2505 -175635 -15262 -124613 -18919 271772
15499 -204593 176695 54100 -241186 14347 -1505 45909 -131413 -125910 -141479 -147834 -361726
$$ packed form
15579B18572b24022J3511h7692j59578L9743e0557E7285P6348d53136A77510O7698
15568B45208C6855j7779a46818d5632A41443i6065j65268B14359b33817B32628
15557c6412C8118J77415n0985a90380A69378D6986b16472l8206A48743c78183
15546A63968B1288f3994B03967c56058h2288r5343C55841a5786B58345j016i814
15534A72114p5954f9738q7651I5538K7677l8129c10418J27164D2158R5418J97954
15523C35530b45m4247j9068K8903B04604c26603C5291Q1209J14198o0688a88184
15511C73328h4646A73838b40298A7376h7624b505j73130a5262j09351a8919B71772
15499b04593A76695E4100b41186A4347a505D5909a31413N503j5569o355k13892
$$ plain form
15488 -361726 -316334 150267 3337 -119733 -6288 104325 206176 89581 -246573 352971 -24869
15476 16741 124540 534158 165950 92258 312678 -125392 -171180 79331 -80239 136509
15465 50947 -65934 -128786 323981 -299803 144588 -75008 259605 218669 267247 -28191 -233571
15454 -233571 -113529 -50411 71395 155256 -46624 -25465 135562 -11274 -201419 209926 327976
15443 327976 683369 364733 258964 375620 355633 49082 90788 134336 -78465 57016 103358
15432 103358 -46486 -28963 78200 -105563 -14673 -67768 4604 87834 153283 15292 11336 372681
15420 372681 -278536 -27671 396165 -63372 4492 -355467 30171 104976 -112600 227838 -197670
15408 -113324 -27372 104629 -121803 99415 239196 146429 188756 -260737 -369071 188461
$$ packed form
15488c61726M5392A50267C337a19733f288A04325J01851H9581b46573C52971b4869
15476A6741J07799M09618A65950p3692K20420a25392m5788G9331h0239A36509
15465E0947f5934o2852C23981b99803A44588g5008B59605m0936M8578b8191k05380
15454b33571a13529e0411G1395Q3861d6624K1159A35562a1274j90145B09926J18050
15443C27976L55393l18636j05769J16656j9987D9082M1706M3548g8465E7016M6342
15432A03358d6486J7523G8200a05563a4673n3095D604Q3230O5449A5292l956L61345
15420C72681b78536b7671C96165f3372D492c55467C0171P4805a12600B27838a97670
15408a13324b7372A04629a21803I9415J39781r2767M2327b60737j08334A88461
$$ plain form
15397 235334 141580 -92438 -76408 271947 237069 -39967 76790 -165791 -18007 8836 211141
15386 211141 -24348 -30988 -59464 112812 72272 124133 -10402 19171 -166652 302356 172893
15375 172893 -423728 129698 111400 -86886 167788 5876 292729 111690 -143518 57658
15364 136657 16071 112491 93518 397500 -124426 -181129 -70730 53577 7124 287291 303982
15353 303982 247227 -152432 -109140 -132693 139630 -127804 141645 -49405 358595 -138328
15342 38122 344986 163110 290050 -89079 257651 -318326 108664 -129648 48753 89714
15332 89714 79875 -138550 210849 246085 100165 167606 -27071 76659 43880 8929 161953
15321 161953 169337 153267 -143526 269481 -101087 -242816 -127983 -37326 266271 -38090
$$ packed form
15397B35334r3754i2438J6030B71947l4878c9967G6790a65791a8007H836K02305
15386B11141b4348o640k8476A12812m0540N1861a0402A9171a66652C02356j29463
15375A72893d23728A29698j8298h6886A67788E876K86853A11690a43518E7658
15364A36657A6071R6420j8973L03982a24426n6703g0730E3577G124K80167J6691
15353C03982n6755a52432M3292k3553A39630a27804A41645d9405C58595a38328
15342C8122L06864A63110J26940h9079B57651c18326A08664a29648D8753M0961
15332H9714r839a38550B10849L5236A00165O7441b7071G6659l2779H929J53024
15321A61953P384j6070a43526B69481a01087j41729J14833c7326B66271c8090
$$ plain form
15310 121507 216269 29430 90095 260423 -5777 411497 91547 -190907 2982 137465 -137392
15298 60550 269655 105527 64185 -18002 -13396 70645 18504 110327 238853 179047 -170647
15286 -184919 -224713 31452 36363 -224559 -64637 19623 -121249 29085 234692 -344499 169990
15274 -114014 178477 125340 125624 -177636 148056 327277 63602 -338631 61768 -245151 95994
15262 19274 -16708 100504 88351 -147569 -67704 -102264 -30695 -36050 129043 174293 61117
15250 394140 -89740 306160 -122238 257740 312690 96196 76970 170861 -114278 -106193 -137131
15239 -137131 -146627 359860 96254 221977 44650 -141193 35620 -404071 19177 -86420 138570
15227 -106443 228615 21820 201410 88842 47926 -233495 -184438 174683 -79085 176993
$$ packed form
15310A21507R4762B9430O0665J70328e777D11497I1547a90907B982J34483a37392
15298F0550K09105A05527m1342a8002M606G0645A8504R1823J28526n9806a70647
15286a84919l9794C1452M911b24559f4637A9623a21249B9085K05607c44499A69990
15274a14014A78477n3137K84a77636A48056J79221F3602c38631F1768b45151I5994
15262A9274a6708A00504j2153a47569f7704l4560c0695n355A29043M5250F1117
15250C94140h9740C06160a22238B57740N4950I6196j9226R3891a14278Q085l0938
15239a37131r496C59860I6254J25723D4650a41193C5620d04071A9177h6420A38570
15227a06443B28615B1820J79590H8842m0916b33495M9057A74683g9085A76993
$$ plain form
15216 -138698 -112704 -80763 -108595 111792 244385 173818 -7099 -105999 -133669 -273902 265528
15204 -72904 -197526 -32327 379380 -340217 140330 78753 129654 288089 87639 80772 72518
15193 72518 -240602 69293 86433 -75640 -100074 -47291 190099 456900 42534 139489 -148571
15181 -587 -92942 217036 144212 278079 -84310 -102315 93525 155849 60643 134959 276588
15170 276588 -56894 33590 195778 80019 10445 -220061 160202 175051 -17104 245160 -161428
15158 133051 242208 -167618 90715 -63651 -57987 31566 75387 15466 109388 71681 -103441
15146 -88998 -1399 -33382 -143364 125125 -102526 603221 -120424 223909 -26091 148680
15135 235518 85 145162 98356 92956 33790 147040 45443 -7291 -81706 -180980 -40164 -163867
$$ packed form
15216a38698K5994L1941k7832A11792J32593p0567g099r8900k7670j40233B65528
15204g2904j24622c2327C79380c40217A40330o1577N0901J58435H7639o867q254
15193G2518b40602F9293J7140g5640k4434d7291A90099K66801D2534R6955a48571
15181e87r2355B17036p2824J33867h4310j8005I3525O2324F0643P4316J41629
15170B76588e6894C3590J62188H0019A0445b20061A60202J4849a7104B45160a61428
15158A33051J09157a67618I0715f3651N664C1566M3821A5466R3922l7707a03441
15146h8998a399l1983j09982A25125a02526F03221a20424B23909b6091A48680
15135B35518H5J45077m6806n400C3790J13250D5443g291p4415r9274d0164j23703
$$ plain form
15123 -163867 326530 322016 124892 114573 1696 208089 -53105 263126 186768 71354 97913
15112 97913 49549 36751 8469 113271 138215 346774 23720 65420 170901 53666 -100454
15100 195077 -49959 279004 268469 -26417 80236 222607 188818 183296 -140021 181042 14993
15088 -159970 232342 28579 15275 233643 173681 116921 356772 359995 -128608 317240 80239
15076 174411 236251 -264692 28333 120748 134444 126154 178295 283474 75827 527933 3046
15064 124387 -53803 188161 7514 178145 -191725 -124093 -11234 241169 328999 164065 238940
15053 238940 86025 178281 185365 108991 -52761 93462 250243 321760 252219 336977 -29375
15041 283762 223041 164085 6110 -81806 66257 98655 206567 -18067 381421 23764 306516
$$ packed form
15123a63867C26530m514A24892j0319A696K06393e3105B63126p6358G1354K6559
15112I7913m8364j2798H469J04802K4944K08559B3720M1700J05481E3666a00454
15100A95077d9959B79004j0535b6417H0236J42371l3789n522a40021A81042A4993
15088a59970B32342B8579j3304K18368n9962n6760K39851L223a28608C17240H0239
15076A74411O1840b64692B8333R2415J3696q290N2141J05179G5827M52106C046
15064A24387e3803A88161G514J70631a91725O7632a1234B41169Q7830A64065P4875
15053B38940H6025R2256P084p6374e2761I3462J56781P1517o9541Q4758b9375
15041B83762o0721n8956F110h1806F6257L2398J07912a8067C81421B3764K82752
$$ plain form
15030 306516 425937 69464 479417 894796 386631 437073 761801 144024 -16217 238005
15019 -134710 659566 283870 93780 189363 333356 533122 271386 173441 284714 311454
15009 311454 225116 271574 383097 302197 530962 656510 258439 22179 -114048 -108280 69058
14997 1029 137062 653341 443318 540284 293337 -42767 150498 54603 23426 447694 419714
14986 419714 -13320 629778 306508 103164 378186 541099 162637 495900 545736 364131
14976 364131 591491 460628 625783 211569 390629 80633 254301 444243 131737 501329
14966 501329 262801 623760 581621 8866 336440 532351 173996 397785 265221 512438
14956 512438 95359 292998 583724 305017 468034 223402 310244 541609 604913 449391
$$ packed form
15030C06516J19421F9464M09953M15379C86631N0442L24728A44024a6217B38005
15019a34710F59566B83870I3780R5583J43993J99766k61736r7945J11273K6740
15009C11454q6338M6458J11523q0900K28765J25548B58439B2179a14048N768F9058
14997A029J36033N16279k10023R6966k46947d2767A50498E4603B3426M24268k7980
14986D19714a3320F29778C06508A03164K75022J62913A62637L33263M9836j81605
14976C64131K27360j30863J65155B11569J79060H0633J73668J89942A31737L69592
14966E01329k38528L60959m2139H866L27574J95911A73996K23789j32564K47217
14956E12438I5359J97639K90726k78707J63017B23402Q6842K31365O3304j55522
$$ plain form
14946 449391 14068 709744 363880 58105 489818 -186744 310738 312502 284931 426471
14936 426471 578244 532022 448642 286085 478511 1010707 848842 756440 651146 547257
14926 547257 1007511 911168 694976 655161 811606 831356 873986 981789 1384080 1240192
14916 1240192 1286883 930499 1032898 716079 803119 597682 681429 557740 481775 148649
14905 314944 43565 143962 401119 245732 366673 563628 335960 265118 674740 305886
14894 157860 185021 205279 653205 401064 770309 675940 362440 170001 786731 346494
14883 199320 808270 586306 397949 90691 415848 570644 132200 429898 408244 629772
14873 629772 313133 665008 428937 248223 602225 176049 389084 484524 162582 417961
$$ packed form
14946D49391A4068O95676l45864E8105M31713a86744C10738J764k7571J41540
14936D26471J51773m6222q3380j62557J92426N32196j61865r2402j05294j03889
14926E47257M60254r6343k16192l9815J56445J9750M2630J07803M02291j43888
14916A240192M6691l56384J02399l16819Q7040k05437Q3747j23689p5965A48649
14905C14944D3565J00397K57157j55387J20941J96955k27668p0842M09622C05886
14894A57860K7161K0258M47926k52141L69245r4369l13500A70001O16730C46494
14883A99320O08950k21964j88357I0691L25157J54796A32200K97698k1654K21528
14873F29772C13133L51875k36071j80714L54002A76049K13035R5440A62582K55379
$$ plain form
14863 417961 526206 326258 499780 279327 390485 97082 112035 388143 605555 322138
14853 322138 266823 570646 346296 507494 496800 768110 279342 502618 182150 438227
14843 438227 889479 624514 663233 1096146 1013675 1043162 960163 817612 927445 683083
14833 683083 386713 406122 499559 625672 316268 640697 746302 664856 798516 465882
14823 465882 347592 376150 709070 430254 620190 345557 492570 137863 604546 521334
14813 521334 482171 294534 663195 526774 358676 520953 469616 514761 648150 417868
14803 417868 615600 487307 482318 667694 913483 648341 365715 462026 166397 612778
14793 612778 852813 712937 562056 562036 522601 719147 597000 391777 383675 382731 163576
$$ packed form
14863D17961J08245j99948J73522k20453J11158I7082J4953K76108K17412k83417
14853C22138n5315L03823k24350J61198j0694K71310B79342K23276A82150K56077
14843D38227M51252k64965L8719M32913q2471K9487q2999j42551J09833k44362
14833F83083k96370J9409R3437J26113l09404L24429J05605q1446J33660l32634
14823D65882j18290K8558L32920k78816J89936k74633J47013A37863M66683q3212
14813E21334l9163j87637L68661j36421j68098J62277n1337M5145J33389k30282
14803D17868J97732j28293m989J85376K45789k65142k82626R6311A66397M46381
14793F12778K40035j39876j50881k0l9435J96546j22147k05223q102r44A63576
$$ plain form
14781 552121 512208 341440 499612 600098 629993 481856 646806 296612 321325 656170
14771 656170 663364 699122 701140 782301 692783 569040 959087 816003 553204 553234 268002
14759 440423 696100 474129 576650 593764 534808 769422 341823 574161 595726 334749
14749 334749 277832 642137 800651 655309 421423 1146927 464008 327996 584072 777342
14739 777342 740176 660822 564998 631454 541879 997145 806078 519043 732931 872491
14729 872491 977545 1150637 708284 925089 810119 1145848 779210 1212304 1325252 1336583
14719 1336583 1209805 885843 912351 901383 946773 888122 843564 879803 948850 698614 1105255
14708 1105255 1072938 754232 965982 716959 1080286 875400 1028367 824042 674470 1159641
$$ packed form
14781E52121l9913j70768J58172J00486K9895j48137J64950B96612K4713L34845
14771F56170P194L5758K018Q1161q9518j23743L90047j43084k62799L0B68002
14759D40423K55677k21971J02521J7114n8956K34614C41823K32338K1565k60977
14749C34749n6917L64305J58514j45342k33886P25504D64008j36012K56076J93270
14739G77342l7166p9354r5824O6456q9575M55266j91067k87035K13888J39560
14729H72491J05054J73092m42353K16805j14970L35729l66638M33094J12948J1331
14719A336583j26778l23962K6508j0968M5390n8651m4558L6239O9047k50236M06641
14708A105255l2317l18706K11750k49023L63327k04886J52967k04325j49572M85171
$$ plain form
14698 1159641 1097241 1392681 1116017 1043533 1170709 945626 924714 652741 817398 954416
14688 954416 965517 744128 850661 769772 820709 813316 1058528 709967 842694 1200721
14678 1200721 953323 1031780 937731 931547 531247 933499 870511 979941 920933 586796
14668 586796 1089936 647300 967404 1072227 698564 641800 1185974 1107029 1040805 1087707
14658 1087707 1072030 958667 1093246 1051581 860266 943238 1046876 1007159 876166 1662916
14648 1662916 1237329 1334391 1141040 1228943 1187093 1050963 865643 1130589 1106709 1164155
14638 1164155 1469339 1163671 1061726 810169 1300296 1296980 1615264 1014195 1452932 1184906
14628 1184906 1320991 1356691 1223808 1501457 1290053 1314651 1105532 1472352 1195301 1907275
$$ packed form
14698A159641o2400K95440k76664p2484J27176k25083k0912k71973J64657J37018
14688I54416J1101k21389J06533q0889N0937p393K45212l48561J32727L58027
14678A200721k47398P8457r4049o184m00300M02252o2988J09430n9008l34137
14668E86796N03140m42636L20104J04823l73663n6764N44174p8945o6224M6902
14658A087707j5677j13363J34579m1665j91315Q2972J03638l9717j30993P86750
14648A662916m25587R7062j93351Q7903m1850j36130j85320K64946k3880N7446
14638A164155L05184l05668j01945k51557M90127l316L18284o01069M38737k68026
14628A184906J36085L5700j32883K77649k11404K4598k09119L66820k77051P11974
$$ plain form
14618 1907275 1170947 1224375 1328540 1024389 1539767 1364353 1722159 1481935 1375274 1523921
14608 1523921 1374304 1260807 1406339 1493591 1781133 1366929 1333296 1596394 1245282 1533383
14598 1533383 1548168 1481772 1465572 1583281 1469063 1441140 1801126 1532637 1805209 1848938
14588 1848938 1866421 2096201 1940516 1666052 1609543 1784239 1752342 2187112 1661343 1572539
14578 1572539 1981021 1848583 1897472 1889259 1811890 2290831 2082934 2259929 2123289 2223013
14568 2223013 2338008 2142835 2473876 2262989 2301797 2565982 2319403 2567524 2094783 2651523
14558 2651523 2956104 2646646 2968566 3287183 3672388 4073780 4399948 5310500 6627242
14549 6627242 8891468 12965757 20325257 31323604 31604122 17768497 9310291 5149459
$$ packed form
14618A907275p36328N3428J04165l04151N15378j75414L57806k40224j06661J48647
14608A523921j49617j13497J45532Q7252K87542m14204l3633K63098l51112K88101
14598A533383J4785o6396j6200J17709j14218k7923L59986k68489K72572M3729
14588A848938J7483K29780j55685k74464n6509J74696l1897M34770n25769q8804
14578A572539M08482j32438M8889q213p7369M78941k07897J76995j36640R9724
14568B223013J14995j95173L31041k10887L8808K64185k46579K48121m72741N56740
14558B651523L04581l09458L21920L18617L85205M01392L26168R10552J316742
14549F627242K264226M074289P359500J0998347K80518j3835625q458206m160832
$$ plain form
14541 5149459 3620236 3001467 2702954 2163671 1981439 1963656 1967115 2238490 1817563 1758331
14531 1758331 2276514 2177836 2062743 2005612 2188769 2383054 2343599 2022130 2284013 2350388
14521 2350388 2288418 2214055 2471731 2324724 2354106 2632480 2775201 2527519 2192199 2393934
14511 2393934 2560892 2592651 2785329 2472576 2629676 2556993 2611478 2966504 2880494 2824229
14501 2824229 3126641 2787024 2774324 3336121 2894675 3042639 3211668 3118991 3295325 3518303
14491 3518303 3132103 3122600 3482758 3442084 3386980 3511321 3437383 3611991 3380850 3543474
14481 3543474 3616648 3823276 3929455 3842271 3723356 3915470 3912151 3975462 3823827 3758069
14471 3758069 3988146 4334704 4077563 4462935 4374802 4271748 4457082 4581192 4732614 4480933
$$ packed form
14541E149459j529223o18769k98513n39283j82232j7783L459K71375m20927n9232
14531A758331N18183r8678j15093n7131J83157J94285l9455l21469K61883O6375
14521B350388o1970p4363K57676j47007K9382K78374J42721k47682l35320K01735
14511B393934J66958L1759J92678l12753J57100p2683N4485L55026q6010n6265
14501B824229L02412l39617j2700N61797m41446J47964J69029r2677J76334K22978
14491C518303l86200r503L60158m0674n5104J24341p3938J74608k31141J62624
14481C543474P3174K06628J06179q7184j18915J92114l319O3311j51635o5758
14471C758069K30077L46558k57141L85372q8133j03054J85334J24110J51422k51681
$$ plain form
14461 4480933 4454893 4578258 4606574 4858112 5035992 4666763 5031637 5380788 4754208 5075270
14451 5075270 4730309 5328827 5256713 5330671 5474861 5341857 5693281 5657626 6007210 5580117
14441 5580117 5826075 5815505 6053282 5935217 5975352 6135573 6120921 6524409 6720566 6490430
14431 6490430 6557390 6605325 6644829 6917344 6926229 7129495 7255752 7334813 7167214 7396525
14421 7396525 7228063 7851504 7886449 7881867 8047380 8269001 8340541 8112116 8366158 8320408
14411 8320408 8708462 8673099 9167832 9244914 9223119 9837507 9440950 9587504 9640365 10270575
14401 10270575 10116852 10086985 10267117 10675435 11036032 10857233 10954890 11398196 11213414 11598548
14391 11598548 11926371 11801872 12331090 12327438 12690847 12591770 13096891 13605333 13708450 13726610
$$ packed form
14461D480933k6040J23365K8316K51538J77880l69229L64874L49151o26580L21062
14451E075270l44961N98518p2114P3958J44190j33004L51424l5655L49584m27093
14441E580117K45958j0570K37777j18065M0135J60221j4652M03488J96157k30136
14431F490430O6960M7935L9504K72515Q885K03266J26257P9061j67599K29311
14421G396525j68462O23441L4945m582J65513K21621P1540k28425K54042m5750
14411H320408L88054l5363M94733P7082k1795O14388l96557J46554N2861O30210
14401A0270575j53723k9867J80132M08318L60597j78799R7657M43306j84782L85134
14391A1598548L27823j24499N29218l652L63409r9077N05121N08442J03117J8160
$$ plain form
14381 13726610 14173344 14481756 14566516 15072581 15276813 15389417 15650559 16164113 16568740
14372 16568740 16797886 17062966 17501532 17602709 17994071 18404634 18724843 19445223 19785092
14363 19785092 20201562 20266879 20766153 21183603 21920853 22044389 22557495 22879251 23689315
14354 23689315 24164597 24823865 25692630 25935188 26553908 27264359 28006496 28443719 29476811
14345 29476811 30393969 31103537 31766612 32621233 33528245 34311648 35317874 36362576 37467760
14336 37467760 38191671 39454838 40749487 41912112 43202917 44379120 45806612 47284523
14328 47284523 48404579 50123784 51827190 53583031 55669942 57467572 59303310 61294875
14320 61294875 63624602 65356874 68029121 70442716 73430746 75815750 78933526 82230224
$$ packed form
14381A3726610M46734L08412Q4760N06065K04232J12604K61142N13554M04627
14372A6568740K29146K65080M38566J01177L91362M10563L20209P20380L39869
14363A9785092M16470O5317M99274M17450P37250J23536N13106L21756Q10064
14354B3689315M75282O59268Q68765K42558O18720P10451P42137M37223J033092
14345B9476811R17158P09568O63075Q54621R07012P83403J006226J044702J105184
14336C7467760P23911J263167J294649J162625J290805J176203J427492J477911
14328D7284523J120056J719205J703406J755841K086911J797630J835738J991565
14320F1294875K329727J732272K672247K413595K988030K385004L117776L296698
$$ plain form
14312 82230224 85250530 88559252 92162222 95963495 100245774 104199935 108753057 113288021
14304 113288021 118528820 123373374 129458074 135509437 141348864 148131794 155416552 162315031
14296 162315031 170351334 178422286 187199629 196454974 205803050 216266167 226540663 237378968
14288 237378968 248817230 260701534 273042634 285812918 298976966 312151335 325796648
14281 325796648 339621893 353104534 366504013 379343004 391325390 402724767 412382521
14274 412382521 420033188 424726251 427857903 429593188 431269951 431936155 430164297 427636910
14266 427636910 422924925 415984250 407093945 396661466 384685904 372302654 358516477
14259 358516477 344807268 330725361 316583962 302337607 288589506 275212507 262174599
$$ packed form
14312H2230224L020306L308722L602970L801273M282279L954161M553122M534964
14304A13288021N240799M844554O084700O051363N839427O782930P284758O898479
14296A62315031Q036303Q070952Q777343R255345R348076J0463117J0274496J0838305
14288B37378968J1438262J1884304J2341100J2770284J3164048J3174369J3645313
14281C25796648J3825245J3482641J3399479J2838991J1982386J1399377R657754
14274D12382521P650667M693063L131652J735285J676763O66204j771858k527387
14266D27636910m711985o940675q890305j0432479j1975562j2383250j3786177
14259C58516477j3709209j4081907j4141399j4246355j3748101j3376999j3037908
$$ plain form
14252 262174599 249783053 237756816 226513146 214999256 205079830 194977416 185945259
14245 185945259 177356229 168772464 161064651 153501228 146731684 140124617 133712041 127995474
14237 127995474 122665319 117031650 112330028 107459306 103091359 99019638 95432441 91380200
14229 91380200 88035938 84320608 81336335 78140078 75339563 72597610 70256536 67978220
14221 67978220 65325276 63181015 61032643 58990476 57109681 54847134 53286820 52140863
14213 52140863 50400172 48785021 47394005 45829633 44843362 43101246 42343544 41049223
14205 41049223 40180163 39114977 37870421 36685020 35604264 35090414 33900612 33477911
14197 33477911 32152643 31325767 30464910 29966019 29286078 28242426 27758472 26764120 26400193
$$ packed form
14252B62174599j2391546j2026237j1243670j1513890r919426j0102414r032157
14245A85945259q589030q583765p707813p563423o769544o607067o412576n716567
14237A27995474n330155n633669m701622m870722m367947m071721l587197m052241
14229I1380200l344262l715330k984273l196257k800515k741953k341074k278316
14221F7978220k652944k144261k148372k042167j880795k262547j560314j145957
14213E2140863j740691j615151j391016j564372r86271j742116p57702j294321
14205D1049223q69060j065186j244556j185401j080756n13850j189802m22701
14197C3477911j325268q26876q60857m98891o79941j043652m83954r94352l63927
$$ plain form
14188 26400193 25743973 25032252 24630407 23910888 23510415 22992459 22697788 22195225 21549149
14179 21549149 21232423 20282930 20370766 19433037 19558347 19000439 18493964 18122146 18132224 17635931
14169 17635931 17226016 17024712 16667160 16392629 15722907 15564913 15365883 14971117 14771065
14160 14771065 14639881 14446797 13923404 13986370 13659349 13128991 13124784 12835359 12446415 12486406
14150 12486406 12295623 11902841 11689268 11758214 11565992 11317087 11075582 11315323 10623278
14141 10623278 10302340 10610231 10303601 10133348 9931223 9973323 9660568 9638835 9199178 9012829
14131 9012829 9296646 9274375 9134189 8415945 8675290 8574668 8271011 8159348 8255668 8082041
14121 8082041 7917525 7889747 7710046 7500762 7451093 7269577 7517322 7081672 7127874 7130703
$$ packed form
14188B6400193o56220p11721m01845p19519m00473n17956k94671n02563o46076
14179B1549149l16726r49493Q7836r37729J25310n57908n06475l71818J0078m96293
14169A7635931m09915k01304l57552k74531o69722j57994j99030l94766k00052
14160A4771065j31184j93084n23393O2966l27021n30358m207k89425l88944L9991
14150A2486406j90783l92782k13573O8946j92222k48905k41505K39741o92045
14141A0623278l20938L07891l06630j70253k02125M2100l12755k1733m39657j86349
14131I012829K83817k2271j40186p18244K59345j00622l03657j11663R6320j73627
14121H082041j64516k7778j79701k09284m9669j81516K47745m35650M6202K829
$$ plain form
14111 7130703 6816252 7075479 6504114 6418865 6488849 6676270 6425542 6513449 6486810 6227756
14101 6227756 6024676 6054532 5886794 5847621 5789147 5760274 6010402 5767491 5516438 5589453
14091 5589453 5263698 5558101 5373938 5314049 5201479 5124208 5183056 5102025 5057997 4860166
14081 4860166 5000698 4933644 4973462 4725947 4467005 4600186 4512206 4531260 4750216 4411427
14071 4411427 4483368 4553009 4476928 4240668 4250288 4086654 4108123 4367784 4201912 4069905
14061 4069905 3923267 4131797 4068346 4333920 3805030 3927078 3680924 3938508 3595139 3779514
14051 3779514 3741301 3624339 3902455 3717672 3528493 3348643 3376237 3105628 3106635 3341328
14041 3341328 3422515 3386347 3416311 3336950 3325935 3149615 3268699 3468568 2936832 3490591
$$ packed form
14111G130703l14451K59227n71365q5249O9984J87421k50728Q7907k6639k59054
14101F227756k03080K9856j67738l9173n8474k8873K50128k42911k51053P3015
14091E589453l25755K94403j84163n9889j12570p7271N8848q1031m4028j97831
14081D860166J40532o7054L9818k47515k58942J33181q7980J9054K18956l38789
14071D411427P1941O9641p6081k36260R620j63634K1469K59661j65872j32007
14061D069905j46638K08530o3451K65574n28890J22048k46154K57584l43369J84375
14051C779514l8213j16962K78116j84783j89179j79850K7594k70609J007K34693
14041C341328Q1187l6168K9964p9361j1015j76320J19084J99869n31736N53759
$$ plain form
14031 3490591 3107143 3196619 3323665 2964463 3082734 2887108 3248338 2873647 2670188 2743475
14021 2743475 2918498 2694209 2574817 2625894 3078214 2482724 2524344 2747532 2566982 2521515
14011 2521515 2603842 2670059 2610098 2523854 2464404 2085318 2483891 2285647 2525170 2255053
14001 2255053 2210320 2217863 2245483 2550464 2340074 2400434 2334208 2410177 2456529 2718116 2948089
13990 2948089 3699251 5259663 8137137 14592939 25592941 34051459 25315189 14914461
13982 14914461 9466602 6870583 5170764 4825180 3972925 3223205 3422593 3428176 2792836
13973 2792836 2776247 2841838 2778330 2911167 2367883 2304995 2738337 2684937 2583319 1966725
13963 1966725 2113329 2184039 2533971 2350257 2505937 2169911 2274823 1769607 2418499 2207608
$$ packed form
14031C490591l83448Q9476J27046l59202J18271j95626L61230l74691k03459P3287
14021B743475J75023k24289j19392N1077M52320n95490M1620K23188j80550m5467
14011B521515Q2327O6217n9961q6244n9450l79086L98573j98244K39523k70117
14001B255053m4733P543K7620L04981k10390O0360o6226P5969M6352K61587K29973
13990B948089P51162J560412K877474O455802J1000002Q458518q736270j0400728
13982A4914461n447859k596019j699819l45584q52255p49720J99388N583o35340
13973B792836j6589O5591o3508J32837n43284o2888M33342n3400j01618o16594
13963A966725J46604P0710L49932j83714J55680l36026J04912n05216O48892k10891
$$ plain form
13953 2207608 1724382 2035624 1783817 1864586 1847074 2001848 1875231 1981915 2174011 1759642
13943 1759642 2244106 2052779 2029467 1892792 1898365 1887660 1619327 1442911 2017921 1494313
13933 1494313 1867930 1893824 1445520 1657363 1751709 1785437 1688071 1529391 1861148 1661539
13923 1661539 1617859 1820734 1709444 1709144 1425185 1779434 1550172 1416136 1554521 1433029
13913 1433029 1545497 1739442 1680672 1376074 1538717 1405308 1468193 1504525 917078 1748759
13903 1748759 1341363 1422555 1343353 1052069 1307362 1369250 1287576 1374165 1377684 1421225 1481634
13892 1481634 1201333 1528405 1273052 1240019 1410916 1474835 1364090 1520278 1358480 1117595
13882 1117595 1248049 1207508 1386981 1303844 1443931 1450313 1163668 1449165 1200935 883709
$$ packed form
13953B207608m83226L11242k51807Q0769j7512J54774j26617J06684J92096m14369
13943A759642M84464j91327k3312j36675N573j0705k68333j76416N75010n23608
13933A494313L73617K5894m48304K11843R4346L3728r7366j58680L31757j99609
13923A661539m3680K02875j11290l00k83959L54249k29262j34036J38385j21492
13913A433029J12468J93945n8770l04598J62643j33409O2885L6332n87447Q31681
13903A748759m07396Q1192p9202k91284K55293O1888q1674Q6589L519M3541O0409
13892A481634k80301L27072k55353l3033J70897O3919j10745J56188j61798k40885
13882A117595J30454m0541J79473q3137J40087O382k86645K85497k48230l17226
$$ plain form
13872 883709 1249503 1444726 1043673 1391655 1268431 1195858 714462 875166 1272774 1132547
13862 1132547 994066 1102310 1075175 1283676 1176971 1257219 1054454 1333440 1083836 987938
13852 987938 1102554 1099115 1015728 623468 1080927 963829 1077838 1015391 1231282 779569
13842 779569 1154122 1272061 773306 1397715 1164106 880217 967704 1167679 957074 848607
13832 848607 801677 1232146 933721 1141526 835888 1013021 588313 1243300 928685 771327
13822 771327 884378 919537 736907 897135 819987 680558 699503 648988 765285 1140488
13812 1140488 765793 1259800 931343 914595 595249 1171283 594980 572136 1022630 780648
13802 780648 704060 903248 935711 990222 305722 781738 620274 563072 1211662 919464
$$ packed form
13872H83709L65794J95223m01053L47982j23224p2573m81396J60704L97608j40227
13862A132547j38481J08244k7135K08501j06705Q0248k02765K78986k49604r5898
13852I87938J14616l439q3387l92260M57459j17098J14009o2447K15891m51713
13842G79569L74553J17939m98755O24409k33609k83889Q7487J99975k10605j08467
13832H48607m6930M30469k98425K07805l05638J77133m24708O54987l14615j57358
13822G71327J13051L5159j82630J60228p7148j39429J8945n0515J16297L75203
13812A140488l74695M94007l28457j6748l19346N76034n76303k2844M50494k41982
13802G80648p6588J99188L2463N4511C05722M76016j61464n7202O48590k92198
$$ plain form
13792 919464 784348 830387 641253 936501 749254 543381 964350 684337 908353 684022
13782 684022 1144264 842754 697606 1170052 604809 590664 622606 927460 787772 855918
13772 855918 802576 463715 985057 634041 826562 577319 1053248 838120 740309 360741
13761 679409 675249 721782 561095 450358 832521 607084 855146 698931 558478 640680
13751 640680 592441 912486 520303 656730 488649 729676 655517 535315 712161 784121
13741 784121 776310 476174 409208 554705 711435 491636 650730 630916 709983 447186
13731 447186 751047 702545 445741 619476 558324 561165 462919 585637 690449 280594
13720 624511 860257 565875 603216 559301 681940 617181 728345 411640 673686 562657
$$ packed form
13792I19464j35116M6039j89134K95248j87247k05873M20969k80013K24016k24331
13782F84022M60242l01510j45148M72446n65243j4145L1942L04854j39688O8146
13772H55918n3342l38861N21342l51016J92521k49243M75929k15128r7811C60741
13761F79409m160M6533j60687j10737L82163k25437K48062j56215j40453Q2202
13751F40680m8239L20045l92183J36427j68081K41027p4159j20202J76846P1960
13741G84121p811l00136o6966J45497J56730k19799J59094j9814P9067k62797
13731D47186L03861m8502k56804J73735o1152K841r8246J22718J04812B80594
13720F24511K35746k94382L7341m3915J22639o4759J11164l16705K62046j11029
$$ plain form
13710 562657 721024 704425 509917 974748 478736 646361 674102 659532 681504 717879
13700 717879 316099 369085 471465 771420 619119 497507 739582 381575 493065 635953
13690 635953 530944 646481 426803 374593 736550 431123 893374 311758 391595 556576
13680 556576 354040 519540 803640 851164 445103 368863 606498 504888 666084 604778
13670 604778 280115 597849 401619 457123 410614 729616 805272 413306 246010 291208
13660 291208 359209 297602 363290 288610 682007 416669 572550 326918 520758 281471
13650 281471 656982 530125 183366 701156 280746 403976 370223 437830 348710 236718
13640 236718 475241 270785 466217 303969 538592 682142 424621 365809 594023 559159
$$ packed form
13710E62657J58367j6599j94508M64831D78736J67625K7741j4570K1972L6375
13700G17879C16099N2986J02380K99955j52301j21612K42075l58007J11490J42888
13690F35953j05009J15537k19678n2210L61957l05427M62251C11758P9837J64981
13680E56576k02536J65500K84100M7524m06061p6240K37635j01610J61196o1306
13670F04778B80115L17734j96230N5504m6509L19002P5656l91966j67296M5198
13660B91208O8001o1607O5688p4680L93397k65338J55881k45632J93840k39287
13650B81471L75511j26857A83366N17790B80746J23230l3753O7607q9120j11992
13640B36718K38523k04456J95432j62248K34623J43550k57521n8812K28214l4864
$$ plain form
13630 559159 266177 371690 554842 372802 610506 156236 649189 548289 427458 239883
13620 239883 337459 480494 760595 179260 444010 396149 702530 192701 449704 315002
13610 315002 532568 547433 717771 596460 401064 571371 576895 330040 364610 237433
13600 237433 471301 624469 293116 484902 617183 54198 483765 261953 522513 288132
13590 288132 -35749 362256 193848 235188 257651 378991 376044 597930 247143 545159
13580 545159 332166 586044 55211 445432 430390 66682 320264 301340 363336 118820
13569 433351 420813 473296 312667 165016 47940 219412 360491 293004 172825 455245
13559 455245 278984 380777 228345 444017 451645 515817 348048 182230 321172 139546
$$ packed form
13630E59159B66177J05513J83152j82040K37704A56236M92953j00900j20831j87575
13620B39883R7576J43035K80101A79260K64750m7861L06381A92701K57003j34702
13610C15002K17566J4865J70338j21311j95396J70307N524k46855L4570j27177
13600B37433K33868J53168B93116J91786J32281E4198M29567k21812K60560k34381
13590B88132c5749C62256j68408M1340K2463J21340k947K21886B47143K98016
13580E45159k12993K53878E5211L90221j5042F6682K53582j8924O1996A18820
13569D33351j2538N2483j60629j47651D7940J71472J41079o7487j20179K82420
13559D55245j76261J01793j52432K15672P628O4172j67769j65818J38942A39546
$$ plain form
13548 564338 138722 152284 555438 573491 413007 200655 537541 433588 474788 207715
13537 368043 679938 535033 418924 309021 207788 402295 357970 49741 545537 310453
13527 310453 206991 73465 119702 443900 323385 86115 369233 817506 725207 256189
13516 177540 191714 304706 -112813 232270 155811 296859 -47580 527844 314913 322242
13506 322242 411335 332981 288615 164338 -123143 241452 211178 125978 239337 437899
13496 437899 142988 191448 385778 264710 638595 259282 292982 315519 228556 408587
13486 408587 -3593 309572 251730 443354 390744 35559 523892 198885 38948 26874 31704
13475 31704 159818 412002 325471 25034 -7388 239216 -4830 259632 7269 243157 383789
$$ packed form
13548E64338A38722J3562M03154J8053j60484B00655L36886j03953M1200B07715
13537C68043L11895j44905j16109j09903j01233J94507m4325D9741M95796k35084
13527C10453j03462G3465M6237L24198j20515H6115K83118M48273r2299B56189
13516A77540J4174J12992a12813B32270p6459J41048d7580E27844k12931P329
13506C22242Q9093p8354m4366j24277a23143B41452l0274q5200J13359J98562
13496D37899A42988M8460J94330j21068L73885B59282L3700K2537q6963J80031
13486D08587c593C09572n7842J91624n2610C5559M88333A98885C8948j2074M830
13475C1704J28114K52184q6531B5034g388B39216d830B59632G269K35888J40632
$$ plain form
13464 383789 235718 215182 236190 294307 507920 43079 345270 274729 340179 285116 378556
13453 378556 24145 191495 143110 146746 152835 164735 128033 503774 667125 -18125 287409
13441 86288 151922 42906 -286034 2487 360475 79072 156607 83643 459067 107685 209185
13430 209185 369634 320480 107621 -20316 347599 527953 76791 260619 362444 121787
13419 -14578 370502 -61896 239187 318353 270676 312679 118140 201692 319849 381645 279647
13408 279647 223321 147908 103398 304557 281547 89976 334717 -64061 -40736 297266 382779
13397 382779 290587 -6582 90561 106063 32765 40248 89676 231488 -204699 370005 295495
13386 295495 647357 417797 232914 8418 81484 376351 179146 329451 491220 38804
$$ packed form
13464C83789j48071k0536K1008N8117K13613D3079L02191p0541O5450n5063R3440
13453C78556B4145J67350m8385L636O089J1900l6702L75741J63351a8125B87409
13441H6288O5634D2906b86034B487L57988G9072P7535p2964L75424A07685J01500
13430B09185J60449m9154A07621b0316C47599J80354G6791J83828J01825A21787
13419a4578C70502f1896B39187P9166m7677M2003A18140Q3552J18157O1796j01998
13408B79647n6326p5413m4510K01159k3010H9976K44741f4061K3325B97266Q5513
13397C82779r2192f582I0561J5502C2765P483M9428J41812b04699C70005p4510
13386B95495L51862k29560j84883H418P3066K94867A79146J50305J61769C8804
$$ plain form
13375 255555 168598 176722 138505 615473 222903 454196 -122265 436748 -160584 104652
13364 23951 136551 251162 127841 187387 385271 94109 110096 493546 395687 -6528 -314840
13353 -314840 177267 28683 624784 150049 201117 308341 30376 -44212 112874 -78564
13342 293922 -4060 526435 296853 507187 301878 309862 -293710 248294 480687 91327
13331 431063 180390 89678 132220 103053 373360 125884 192871 106385 -17970 424757 214694
13320 214694 -83424 27074 102581 109674 146424 309735 257880 159249 278052 147237 90258
13309 90258 225401 195244 261 -34992 276182 4726 299708 232689 159483 -49085 404451
13297 481485 126693 -45977 359205 170354 83844 244059 20634 105120 84666 179908 74741
$$ packed form
13375B55555q6957Q124l8217M76968B22903K31293a22265D36748a60584A04652
13364B3951J12600J14611j23321N9546J97884I4109J5987L83450r7859f528l08312
13353c14840A77267B8683N96101A50049N1068J07224C0376d4212A12874g8564
13342B93922d060E26435k29582K10334k05309P984b93710B48294K32393I1327
13331D31063A80390H9678M2542k9167K70307A25884O6987q6486a7970D24757k10063
13320B14694h3424B7074P5507P093L6750J63311n1855r8631J18803j30815n6979
13309I0258J35143l0157B61c4992B76182D726K94982o7019p3206d9085D04451
13297D81485A26693d5977C59205A70354H3844J60215B0634Q4486k0454R5242G4741
$$ plain form
13285 315926 20183 385010 -37712 -4560 227238 451219 68573 24614 33360 151859 75716
13273 221643 276234 -43603 26603 270814 -48607 -6000 249931 412884 240029 -288007 147595
13261 -47929 54696 457393 61984 118908 359348 232705 -103216 51804 -227054 9152 170107
13250 170107 -70049 151952 89110 160577 203609 200739 99526 213451 -97788 -145690 150387
13238 233202 -25000 -203913 380293 341815 449433 330763 205074 104914 95739 316371
13228 316371 144418 -79818 547578 315844 -89326 144495 -114941 10293 88513 -66243
13217 92801 266593 -9622 -466697 18415 460601 179036 258993 -92225 -61879 320244 125812
13205 52878 180702 -34103 415638 182543 -82714 90937 49201 50760 -87088 -12738 309624
$$ packed form
13285C15926B0183L64827c7712d560B27238K23981F8573B4614Q746J18499G5716
13273B21643N4591d3603B6603K44211d8607f000B49931J62953j72855b88007A47595
13261d7929E4696M02697F1984N6924K40440j26643a03216E1804b27054I152J60955
13250A70107g0049A51952o2842P1467M3032k870I9526J13925i7788m7902A50387
13238B33202b5000j78913C80293l8478J07618j18670j25689j00160r175K20632
13228C16371A44418g9818E47578k31734h9326A44495a14941A0293P8220f6243
13217I2801J73792i622m57075A8415M42186A79036P9957i2225L0346C20244A25812
13205E2878J27824c4103D15638A82543h2714I0937m1736J559h7088a2738C09624
$$ plain form
13193 103135 184919 -158327 269553 20378 -126869 71658 241957 -3741 48297 266211 256497
13182 256497 -48298 394240 -4755 256598 406465 -357143 -175780 184142 -97140 -11348
13171 183484 181849 307213 212874 288458 8621 -94852 413430 -31950 112387 67500 180323
13160 180323 99933 93035 219522 263632 -57723 -226068 185535 28598 211651 81356 104572
13149 104572 89375 163400 -99380 122075 311518 -233113 40944 8432 -3349 359869 96000
13137 -51951 173366 136960 214693 -114856 424029 165007 119128 124464 330182 42049 37154
13126 37154 125384 219848 -269498 198938 -211721 -164625 291553 249411 177188 -136312 -322230
13115 -322230 101068 132190 96062 28316 113511 -9202 99437 137646 300015 -81730 -220028
$$ packed form
13193A03135Q1784a58327B69553B0378a26869G1658J70299c741D8297K17914r714
13182B56497d8298C94240d755B56598J49867c57143a75780A84142i7140a1348
13171A83484j635J25364r4339P5584H621i4852D13430c1950A12387m4887J12823
13160A80323q0390o898J26487M4110e7723j68345A85535B8598J83053H1356K3216
13149A04572j5197P4025i9380A22075J89443b33113D0944H432c349C59869I6000
13137e1951A73366l6406P7733a14856D24029A65007m5879N336K05718D2049m895
13126C7154Q8230R4464b69498A98938b11721M7096B91553m2142p2223a36312j85918
13115c22230A01068L1122l6128B8316Q5195i202I9437L8209J62369h1730j38298
$$ plain form
13104 -220028 -35410 65880 16280 -45723 336413 155066 232404 -30969 365243 -51110 205830
13092 -52462 279337 335824 229466 -29677 -29852 19698 121771 306952 226525 174522 462207
13081 462207 256897 -66172 -77906 15493 282279 120008 72247 -21770 228323 -57232 218387
13069 -72293 78418 33285 -165565 143202 -4191 21888 246024 128042 300152 8539 -265040
13057 115124 -98370 420384 113556 69224 118729 438380 63723 393423 -99494 256145
13046 217351 122596 344456 -217800 -62661 -255052 46881 376993 -141455 21648 176578
13036 176578 189892 23399 62059 123165 263724 154412 -44016 -82493 127200 3344 238141
13025 238141 -58068 -22042 441248 -65860 91004 61545 8453 -359912 93293 97710 -176601
$$ packed form
13104b20028c5410F5880A6280d5723C36413A55066P7338c0969C65243e1110B05830
13092e2462B79337N6487j06358b9677j75A9698J02073J85181q0427n2003K87685
13081D62207k05310f6172j1734A5493K66786A20008m7761b1770B28323e7232B18387
13069g2293G8418C3285a65565A43202d191B1888K24136j17982J72110H539b65040
13057A15124i8370D20384A13556m4332M9505L19651F3723L29700i9494B56145
13046B17351r4755K21860b17800f2661j92391D6881L30112a41455B1648J54930
13036A76578J3314B3399L8660O1106J40559j09312d4016l8477A27200C344K34797
13025B38141e8068b2042D41248f5860I1004k9459H453c59912I3293M417a76601
$$ plain form
13013 203324 123638 -14698 116651 102786 -113807 98102 89489 -207934 -353319 15764 190020
13002 190020 -170724 -355457 30756 5061 88980 318608 31118 -56131 195783 232378 24207
12990 -74036 54678 184986 -2009 -183313 122568 52338 -311193 127030 39355 -133924 28606
12978 18716 93288 423169 -330106 272506 -73472 253831 -147397 -125908 -94081 133197
12967 -47717 -3859 193223 337522 355861 95480 126180 152970 25951 -31621 25518 -110526
12955 231900 35837 142147 98867 -195310 26720 373401 118559 74192 50941 -116614
12944 230562 221223 240575 165899 30103 29666 333500 204971 -83506 348184 -128381 -116148
12933 -116148 58214 -125721 183378 230219 -12458 302143 319770 -34030 148387 63180 287725
$$ packed form
13013B03324p9686a4698A16651j3865a13807I8102q613b07934j45385A5764J74256
13002A90020a70724j84733C0756E061Q3919K29628C1118e6131A95783L6595B4207
12990g4036E4678J30308b009j81304A22568E2338c11193A27030C9355a33924B8606
12978A8716P4572L29881c30106B72506g3472B53831a47397K1489L1827A33197
12967d7717c859A93223J44299J8339I5480L0700K6790B5951c1621B5518a10526
12955B31900C5837J06310m3280a95310B6720L46681A18559m4367k3251a16614
12944B30562r339J9352p4676C0103m37L03834j28529h3506C48184a28381J2233
12933a16148E8214a25721A83378M6841a2458C02143J7627c4030A48387F3180K24545
$$ plain form
12922 287725 220113 45890 179065 168845 4002 38152 99469 107029 132984 108816 248087
12911 248087 46396 51078 76571 111694 21853 132033 135529 -100623 -57369 45960 86721
12900 86721 83984 152269 418552 -64117 -47812 -155884 -47150 181488 31835 215814 70106
12888 285771 398848 -34252 28154 80929 339391 226700 29950 136571 62994 178314
12878 178314 -230300 -24375 -167687 60953 -59036 272960 -248497 18035 3359 254333 -79988
12866 132698 26869 83416 -74026 72801 -191146 301288 255906 165937 -92778 221249 -146032
12854 -17056 67357 207322 17798 318211 -351933 224331 87193 -36942 153679 97455 185199
12843 185199 68456 317719 131807 -5205 30681 212247 -14208 231275 -318134 12953 -159745
$$ packed form
12922B87725o7612D5890J33175j0220D002L4150O1317P560K5955k4168J39271
12911B48087D6396M682K5493L5123B1853J10180L496a00623M3254D5960M0761
12900H6721k737O8285K66283f4117J6305j08072d7150A81488C1835J83979G0106
12888B85771J13077c4252B8154N2775K58462j12691B9950J06621F2994J15320
12878A78314b30300b4375j43312F0953e9036B72960b48497A8035C359K50974g9988
12866A32698B6869N6547g4026G2801a91146C01288m5382q9969i2778B21249a46032
12854a7056F7357J39965A7798L00413c51933B24331H7193c6942A53679n6224Q7744
12843A85199F8456K49263A31807e205C0681J81566a4208B31275c18134A2953a59745
$$ plain form
12831 127794 232020 68643 129337 145226 -69398 196091 -183792 258447 -1 17131 -58805
12819 141984 -16602 11917 -95048 -23763 -86659 -226602 126828 -114162 316302 -159720
12808 35293 -86350 -43592 40644 237978 -493825 -15241 200343 -106558 3599 114176 72072
12797 72072 102836 -181550 -18968 -164103 -45421 -247959 6941 160010 9357 23165 -207145
12785 -204369 -399159 -101556 232551 -261108 140720 -81189 -16401 -131603 -96254 -383186
12775 -383186 90642 135006 -19597 -157979 -82944 299616 75401 -174337 111827 31084 -172881
12763 216713 207178 -36261 -52451 -311548 -113071 162530 -3208 158062 78274 -39533 118918
12751 47287 -300221 68340 81857 63565 220959 96763 131850 247644 -247863 37796 136096
$$ packed form
12831A27794J04226F8643O0694J5889f9398A96091a83792B58447aA7131e8805
12819A41984a6602A1917i5048b3763o2896j39943A26828a14162C16302a59720
12808C5293h6350M2758D0644J97334d93825a5241B00343a06558C599J10577m2104
12797G2072L0764a81550a8968j45135d5421k02538F941J53069I357J3808b07145
12785b04369j94790a01556B32551b61108A40720h1189a6401j15202L5349k86932
12775c83186I0642M4364a9597j38382P5035B99616G5401a74337A11827C1084a72881
12763B16713r535c6261j6190k59097a13071A62530c208A58062G8274c9533A18918
12751D7287c00221F8340J3517j8292J57394I6763L5087J15794b47863C7796R8300
$$ plain form
12740 136096 -219695 211776 201707 -31193 175215 99018 127325 195085 139776 -74185 4119
12728 38948 -414923 111624 39379 61844 72489 170125 204529 -363008 186546 149188 -331978
12716 -216165 2537 110732 146964 29157 164314 340402 220868 289307 -121747 249877
12705 524785 194582 -250587 115215 20289 81815 -169821 -282793 -66727 180390 -64121
12694 167288 303995 38499 236062 -259843 446047 -101689 -137778 -168073 -2459 156616
12683 156413 99869 -116845 -171018 -36303 297324 358948 27801 -77744 28892 29659 291949
12672 291949 -12752 -78654 -211413 -124684 -1438 140359 89643 152976 -66834 111102 74289
12661 74289 -149771 -53517 320228 -122223 -70789 -222148 3646 455829 102764 774 36897
$$ packed form
12740A36096b19695B11776j0069c1193A75215p6197K8307O7760n5309g4185D119
12728C8948d14923A11624C9379K2465J0645R7636L4404c63008A86546l7358c31978
12716b16165B537J08195L6232B9157J35157J76088j19534O8439a21747B49877
12705E24785A94582b50587A15215B0289O1526a69821j12972f6727A80390f4121
12694A67288J36707C8499J97563b59843D46047a01689l6089l0295b459A56616
12683A56413n6544a16845n4173c6303B97324O1624B7801g7744B8892P67K62290
12672B91949a2752o5902j32759Q6729a438A40359n0716O3333f6834A11102l6813
12661G4289a49771e3517C20228a22223N1434j51359C646M52183A02764G74L6123
$$ plain form
12650 36897 50197 210069 324277 38825 -21781 -18642 251811 107479 187640 188390 36433
12638 5821 5974 -45928 -287889 318839 35005 71928 17986 61053 204662 49665 166258
12627 166258 181733 153062 189590 42712 169777 316305 245621 -108517 171293 -206099
12616 -378629 200300 -68341 -320849 -212153 250418 209650 133893 -222624 -169456 79428
12605 46435 637342 85129 -18171 187637 149098 -223310 154846 101677 -12291 -77832 -3055
12593 50777 173282 -217241 -165334 9501 83007 -94021 307509 51342 -160410 -297751 -187312
12582 -187312 218298 51108 210996 -130772 166732 -227449 49628 156257 -278816 365000
12571 -254052 4423 559231 69130 178891 -117604 5757 76154 -175370 259503 -24217 -98275
$$ packed form
12650C6897J3300J59872J14208C8825b1781L139B51811A07479Q0161P50C6433
12638E821J53d5928k41961C18839C5005L6923A7986M3067J43609D9665J16593
12627A66258J5475k8671L6528D2712J27065J46528p0684a08517A71293b06099
12616c78629B00300f8341k52508J08696B50418m0768p5757b22624N3168G9428
12605D6435N90907H5129a8171A87637l8539b23310A54846n3169a2291o5541c055
12593E0777J22505b17241N1907I501P3506i4021C07509E1342a60410j37341J10439
12582a87312B18298E1108J59888a30772A66732b27449D9628J06629b78816C65000
12571b54052D423N54808F9130J09761a17604E757P0397a75370B59503b4217p4058
$$ plain form
12560 -98275 52224 22376 -313010 46478 151282 -122216 -127651 263740 -10703 -47580 118239
12548 218038 95399 10122 314972 209448 145709 240577 -180407 184607 -346926 -54219
12537 45636 69563 -6071 -84226 145287 244681 -304466 -82396 96514 274635 -54133 63917
12525 363485 29532 166719 306649 186777 211181 160046 -79759 358267 -260046 -189784
12515 -189784 -97481 188365 87192 155542 152257 -174704 198449 309923 65061 49296 -277647
12503 293689 479 70835 -61555 95368 -48749 13546 78463 81923 -169505 -6649 194687 -139585
12490 -42661 95509 190824 4146 156100 -78858 237634 33003 -45898 -129628 -44215 -167336
12479 -167336 10312 282305 -184407 -32170 -27416 -34311 345993 45834 -16670 30463 -222253
$$ packed form
12560i8275E2224B2376c13010D6478J04804a22216n435B63740a0703l6877A18239
12548B18038I5399A0122L04850j05524o3739R4868a80407A84607c46926e4219
12537D5636K3927f071p8155A45287R9394c04466h2396I6514J78121e4133F3917
12525C63485B9532J37187J39930j19872K4404n1135g9759C58267b60046P0262
12515a89784R2303A88365H7192O8350l285a74704A98449J11474F5061j5765b77647
12503B93689D79P0356f1555I5368d8749A3546O4917L460a69505f649A94687a39585
12490d2661I5509R5315D146J51954g8858B37634C3003d5898q3730d4215j23121
12479a67336A0312K71993a84407c2170M754o895C45993D5834a6670C0463b22253
$$ plain form
12467 93518 -13557 -95781 336975 -98035 -149622 111467 -38113 131314 204528 -48994 11384
12455 9494 79217 79979 66045 -344682 -123728 -299029 -94826 -193123 77818 35019 50027 197431
12443 197431 21860 45492 110713 -373211 -293934 303266 -418581 -94376 53204 249448 311408
12432 311408 29976 -158223 64135 8189 -307836 172700 138548 -163762 -70492 -165658 -25470
12420 -134001 7174 491419 261994 -168480 127302 -191348 16246 -23702 -44202 -132407 177411
12408 -204202 110809 135736 48291 74852 -37820 48858 181163 -80807 -237763 15063 2638
12396 -297240 40157 178956 -194464 204123 -26884 -29616 -236613 31595 -277298 -83787 -199383
12385 -199383 199687 178742 -49465 93480 -64711 39651 -221368 534503 -62351 256859 -99395
$$ packed form
12467I3518a3557q2224C36975i8035n1587A11467c8113A31314P3214d8994A1384
12455I494O9723P62j3934c44682a23728j75301i4826r8297G7818C5019J5008J47404
12443A97431B1860K3632O5221c73211P9277C03266d18581i4376E3204J96244O1960
12432C11408B9976a58223F4135H189c07836A72700l4152a63762g0492r5166b5470
12420a34001G174M84245k29425a68480A27302a91348A6246b3702k0500q8205A77411
12408b04202A10809K4927D8291K6561c7820D8858J32305h0807j56956A5063B638
12396b97240D0157J38799a94464B04123b6884k732k06997C1595b77298h3787j15596
12385a99383A99687k0945d9465I3480f4711C9651b21368E34503f2351B56859i9395
$$ plain form
12373 -22423 222553 39450 -52599 200235 372306 -137484 227964 75948 -163519 103800
12362 55 414730 -188086 121959 15146 169368 218670 33277 68262 173586 -21805 108925
12350 -170752 301811 193809 119141 113306 115607 106229 58285 19640 81296 19791 214029
12339 214029 21867 -56284 -120588 -69232 -27066 98828 19285 -178804 -157358 217649 -190253
12327 132513 50580 -43348 30224 36306 14322 -75557 148124 91407 -172106 14934 -45962
12315 106976 244909 142984 -198048 -97701 -22208 177118 165157 -25282 -193842 352678
12304 76820 76777 20094 60463 120018 -277292 37952 -74570 21162 70737 -367398 -58136 57866
12291 231536 197427 349593 -8868 42577 -39480 182960 583 207167 134480 -159500 -154878
$$ packed form
12373b2423B22553C9450e2599B00235J72071a37484B27964G5948a63519A03800
12362E5M14675a88086A21959A5146J54222M9302C3277L4985J05324b1805A08925
12350a70752C01811j08002p4668n835K301r378m7944A9640O1656A9791J94238
12339B14029B1867e6284o4304N1356b7066I8828A9285a78804K1446B17649a90253
12327A32513E0580d3348C0224O082A4322g5557A48124n6717a72106A4934d5962
12315A06976J37933j01925a98048i7701b2208A77118j1961b5282j68560C52678
12304G6820m3B0094M0369N9555b77292C7952g4570B1162M9575c67398e8136E7866
12291B31536l4109J52166h868D2577c9480A82960E83K06584p2687a59500M622
$$ plain form
12280 -154878 -37352 126840 319691 -92001 -35371 -29533 5612 -281143 29611 -116182 -94862
12269 -94862 -83581 177403 -230840 63744 76323 -85584 -192121 129723 -172522 -147558 89936
12257 -467368 234164 145498 176990 404060 -376738 296629 165319 403316 209014 49825
12246 231270 -113583 117892 -58797 132237 11399 -125614 -66553 141540 39561 146968
12236 146968 -271394 359025 420897 54907 -32663 -41522 64188 266067 -250943 -95142 233889
12224 -38224 48894 426505 605840 -107508 141461 49249 405109 251696 -126188 -211863
12214 -211863 -88598 143181 468594 40039 154265 304341 75330 81557 145890 73554 86336
12203 86336 -58955 203227 66653 262239 197683 260613 429384 -94696 385502 66185 174334
$$ packed form
12280a54878c7352A26840J92851i2001c5371N838E612b81143B9611a16182K1320
12269i4862J1281A77403b30840F3744J2579h5584j06537A29723a72522K4964H9936
12257d67368B34164q8666L1492K27070c76738B96629j31310K37997j94302D9825
12246B31270a13583A17892e8797A32237A1399a25614N9061A41540C9561J07407
12236A46968b71394C59025O1872E4907c2663q859F4188K01879b50943i5142B33889
12224c8224D8894L77611J79335a07508A41461D9249L55860j53413a26188q5675
12214b11863h8598A43181L25413D0039J14226J50076G5330O227O4333p2336J2782
12203H6336e8955B03227F6653J95586o4556O2930J68771i4696C85502F6185J08149
$$ plain form
12192 174334 218889 -216714 -1589 145528 102844 122669 -27684 177069 -159116 -8449 336422
12180 -295457 246106 223334 343184 100428 312155 -25418 125183 272199 -11212 392921
12169 144698 52171 -299464 73862 12879 -52805 225738 102535 -112508 171018 -139181
12158 197692 63596 32485 84844 -157016 164291 -52329 247244 77262 95011 -144105 234990
12146 -204274 62664 -404404 -52965 -219569 190033 219972 90353 113189 -78418 212740 241412
12135 241412 290551 28844 -384418 137706 -8923 272200 95931 208989 4006 -92616 263544
12123 324082 155349 189153 10834 58713 138418 30181 -203186 216870 -111470 -40042 358545
12111 1951 -102089 242183 -280747 18061 -17138 115928 236408 -48445 157041 -26157 33715
$$ packed form
12192A74334M4555b16714a589A45528m2684J9825b7684A77069a59116h449C36422
12180b95457B46106k2772J19850A00428K11727b5418A25183J47016a1212C92921
12169A44698E2171b99464G3862A2879e2805B25738A02535a12508A71018a39181
12158A97692F3596l1111N2359a57016A64291e2329B47244G7262J7749a44105B34990
12146b04274F2664d04404e2965j66604A90033K9939I0353K2836g8418B12740K8672
12135B41412M9139B8844c84418A37706h923B72200I5931J13058D006i2616B63544
12123C24082A55349L3804A0834M7879P9705C0181b03186B16870a11470d0042C58545
12111A951a02089B42183b80747A8061a7138A15928J20480d8445A57041b6157C3715
$$ plain form
12099 94745 318504 187726 66604 27286 -252087 28855 141420 292244 121365 -89568
12088 -296765 -253760 -321226 283702 29994 -94458 -17000 154517 -28727 -99863 49803 2772
12076 -94655 -29875 -192860 141776 -241003 -141417 162640 378575 -111867 66903 5357 -248260
12064 -173768 140499 78106 203974 69718 -107444 -5556 -49200 -248285 -108331 -92311 13164
12052 206508 262634 -116120 -72705 120245 110682 -108640 32893 203957 -298775 21813 9157
12040 61987 173888 101036 -144223 102897 -305166 117268 44662 -108534 -28931 36149
12029 -156258 10277 45515 -266061 102930 -8849 151141 -49881 -20982 -7477 -100578 -62875
12018 -62875 174828 28859 252274 288887 20083 399368 23360 3706 -8279 186906 -302217
$$ packed form
12099I4745K23759j30778F6604B7286b52087B8855J12565J50824A21365h9568
12088b96765M3005o7466B83702B9994i4458a7000A54517b8727p1136D9803B772
12076i4655b9875j62985A41776b41003R9586A62640K15935a11867F6903E357b48260
12064a73768A40499o2393J25868F9718a07444e556m3644j99085a08331J6020A3164
12052B06508N6126a16120M3415A20245r563a08640C2893J71064b98775B1813I157
12040F1987J11901p2852a44223A02897c05166A17268D4662a08534b8931C6149
12029a56258A0277L5238b66061A02930h849A51141d9881b0982g477r3101L7703
12018f2875A74828B8859K23415L6613B0083L79285B3360C706h279A86906c02217
$$ plain form
12006 -246519 25051 -308096 -158821 225611 155338 102228 -38893 69233 -76287 -117196 -342693
11995 -342693 -15880 58689 214621 189385 151042 -114039 -160365 -79246 141055 -181833 -183360
11984 -183360 -64019 -5887 83645 -224134 -88342 -183056 102728 -83675 -108771 -71794 215081
11972 -140275 2625 -386185 -190940 36775 176445 128626 173948 -80886 93171 -280171 -6387
11960 -144055 167639 461564 97855 -98211 -194635 5379 -157656 8211 -213455 58587 -127749
11948 505772 -46023 7541 -276368 37346 75403 -301950 4930 495308 -88909 -184549 -19360
11936 47493 -76440 -15037 -32124 -5167 -10625 304126 228256 5462 -149258 -242354 -222434 -14389
11923 303543 -334659 -177469 -121329 -210117 -51449 -16923 154206 -157596 334325 -14799
$$ packed form
12006b46519B5051c08096J49275B25611p0273n3110c8893F9233g6287m0909k25497
11995c42693a5880E8689J55932k5236l8343a14039m6326g9246A41055a81833j527
11984a83360f4019e887H3645b24134h8342r4714A02728h3675k5096L6977B15081
11972a40275B625c86185a90940C6775J39670m7819M5322h0886I3171b80171f387
11960a44055A67639K93925I7855i8211r6424E379a57656H211b13455E8587a27749
11948E05772d6023G541b76368C7346L8057c01950D930M90378h8909r5640a9360
11936D7493g6440a5037j7087e167n458C04126p5870E462a49258r3096J9920a4389
11923C03543c34659J57190N6140q8788e1449a6923A54206a57596C34325a4799
$$ plain form
11912 99523 64561 -44561 152166 -72201 169403 -297417 -7014 171350 -242708 -174447 2378
11900 -26846 -14671 -356043 215692 122604 -245083 154046 128844 59144 -20811 131943 -183248
11888 -299025 -113675 -109762 128117 -254546 -260583 -154 167721 -322159 111530 -202604 -88719
11876 -141681 99945 191478 -145026 -153558 74152 -345525 287185 -16455 139137 97050 53518
11865 53518 223266 -1742 -50560 -134461 -197574 -146810 -163942 -360507 242427 77541 192868
11854 192868 4980 -37128 -60747 -56324 125277 -232828 22692 -4226 40624 179287 59195
11842 -231957 17220 136326 -69640 -45150 -197338 -154669 19345 -260408 153552 -392043
11831 -104168 -9576 195644 69912 -92814 -85963 -35888 3267 56675 90500 -31858 25351 27396
$$ packed form
11912I9523l4962d4561A52166g2201A69403b97417g014A71350b42708O8261B378
11900b6846J2175l41372B15692r3088b45083A54046k5202E9144b0811A31943a83248
11888b99025a13675L913A28117b54546o037a54A67721c22159A11530b02604h8719
11876a41681I9945R1533a45026q532G4152c45525B87185a6455A39137m2087m3532
11865E3518J69748a742m8818q3901o3113N0764j7132j96565B42427G7541J15327
11854A92868D980c7128k3619M423A25277b32828B2692d226D0624J38663E9195
11842b31957A7220J19106f9640K4490j52188M2669A9345b60408A53552c92043
11831a04168i576A95644F9912i2814O851c5888C267N3408L3825c1858B5351K045
$$ plain form
11819 27396 -25582 -157070 85395 4224 -358248 -418613 -213739 -12456 250606 -16443 -70167
11808 -70167 106435 -67718 -190148 -229486 94468 233942 85907 278037 173993 47545 210523
11797 210523 323484 152896 155740 175857 -80804 -181844 114240 -29948 -301725 -198487
11787 -198487 -371613 -143218 55211 177817 34867 26815 121116 356946 -139923 -115956 106956
11775 4369 121977 294242 -20936 -67361 188381 -286548 -81001 -65888 120623 -193728 42886
11763 -122854 -100927 -262104 -227953 180533 -67076 -121464 -29476 148405 -71792 -466549 70000
11751 -400144 169277 -108399 -179505 -30919 199047 137265 -179858 111215 61245 -207452
11740 212580 -86784 221621 150240 143555 108406 -78843 123765 95306 -48489 95976 78917
$$ packed form
11819B7396b5582j31488H5395D224c58248o0365K04874a2456B50606a6443n3724
11808g0167A06435f7718j22430l9338I4468J39474H5907J92130j04044D7545J62978
11797B10523J12961A52896K844K0117h0804j01040A14240b9948k71777J03238
11787a98487j73126a43218E5211J22606C4867q052R4301K35830a39923K3967A06956
11775D369J17608J72265b0936m6425A88381b86548h1001J5113A20623a93728D2886
11763a22854K1927j61177L4151A80533f7076n4388b9476A48405g1792l94757G0000
11751d00144A69277a08399p1106c0919A99047o1782a79858A11215m9970b07452
11740B12580h6784B21621p1381o685l5149g8843A23765k8459d8489I5976j7059
$$ plain form
11729 78917 383917 193820 58310 160332 -86159 254224 181560 -88780 523 216858 46535
11717 -383038 -187271 -89650 -54515 53265 201531 120327 -83452 -150049 234809 69576 -32667
11705 423050 -53922 253410 -165532 118438 -260226 -100681 72878 -258927 383650 -114829
11694 188879 614401 78442 -87966 -88242 -85220 -30892 -161290 5349 246272 102581 -74753
11682 -213745 16772 -108230 -208140 -201561 -40889 735741 160601 -155534 -2714 -65091 -144224
11671 -144224 253973 170180 129538 -257476 -186349 207201 -37624 -195219 -226257 147987
11660 -69385 -37506 -89023 -142330 118891 134628 -5735 -197525 -47414 96627 -282026 -46789
11648 -7298 -5607 15297 -190160 -340441 -132308 345705 -156542 176785 109001 12481 61009
$$ packed form
11729G8917L05000j90097E8310J02022h6159B54224p2664h8780E23K16335D6535
11717c83038a87271h9650L5135E3265J48266q1204h3452o6597B34809F9576c2667
11705D23050e3922B53410a65532A18438b60226a00681G2878b58927C83650a14829
11694A88879M25522G8442h7966k76L022c0892j30398E349K40923A02581g4753
11682b13745A6772a08230r9910O579d0889G35741A60601a55534b714o2377p9133
11671a44224B53973q3793m0642b57476P1127B07201c7624j57595l1038A47987
11660f9385L1879n1517n3307A18891J5737e735j91790d7414I6627b82026d6789
11648g298J691A5297a90160j50281a32308C45705a56542A76785o7784A2481M8528
$$ plain form
11637 61009 -233609 -18129 -199617 97248 -176402 181726 -156712 -336078 -23646 238824
11626 -166202 94915 -92219 -61440 80844 180615 -79432 -41315 198523 -224365 -187922 -126041
11615 -126041 -172064 -5217 90447 -90010 -19009 133545 147545 14290 -134756 -90293 66312
11603 -72793 -143654 -60190 112698 -59439 -18450 214862 52920 -210079 65552 -54182 -154788
11592 -154788 -89622 346119 -68272 287321 83097 -55788 9815 380515 45003 101203 193355
11581 193355 -366214 -93612 98295 158755 -46042 115484 -74776 414713 162016 199455 76976
11569 -51355 154237 115717 82245 92796 131622 -17396 151838 410407 25601 -277765 220719
11557 157613 173432 31825 116733 109593 -115235 323859 -134270 91485 116609 -464982 -67203
$$ packed form
11637F1009b33609a8129j81488I7248a76402A81726a56712j79366b3646B38824
11626a66202I4915i2219L0779H0844R9771g9432L8117A98523b24365L6443O1881
11615a26041m6023e217I0447i0010a9009A33545J4000A4290a34756M4463F6312
11603g2793p0861f0190A12698e9439a8450B14862E2920b10079F5552e4182j00606
11592a54788O5166C46119f8272B87321H3097e5788I815L70700D5003N6200R2152
11581A93355c66214i3612I8295O0460d6042A15484g4776D14713A62016L7439G6976
11569e1355A54237l8520l3472J0551L8826a7396A51838K58569B5601b77765B20719
11557A57613J5819C1825Q4908p140a15235C23859a34270I1485K5124d64982f7203
$$ plain form
11545 -257789 169894 271364 52295 82567 78901 -89875 50947 271396 -243541 -120460 211687
11533 -62913 139177 274658 95298 49329 -132285 278402 208644 139158 -410660 365382
11522 133333 -133916 -35793 11879 178792 75565 126636 -148611 30979 -164156 -106026 -28773
11510 -279677 63049 30443 386076 -121341 65906 31268 -8643 -36278 221834 -311970 85414
11498 64766 338193 -125778 108952 88302 170011 32100 -35818 -110706 74751 420431 149496
11486 -161760 114372 -28124 2508 223482 282074 327875 315391 -120257 253479 152343 238536
11475 238536 156306 28723 164578 234603 171738 43260 190478 -322630 310920 -436118
11464 25645 140702 156937 190956 117920 297665 32603 40302 -79705 120521 -44487 31031
$$ packed form
11545b57789A69894J01470E2295L0272l666h9875E0947K20449b43541a20460B11687
11533f2913A39177J35481I5298m5969a32285B78402o9758o9486d10660C65382
11522A33333a33916c5793A1879J66913G5565N1071a48611C0979a64156N8130b8773
11510b79677F3049C0443L55633a21341F5906C1268h643k7635B21834c11970H5414
11498F4766K73427a25778A08952k0650Q1709C2100c5818p4888G4751L45680A49496
11486a61760A14372b8124B508K20974N8592M5801j2484a20257B53479j01136Q6193
11475B38536q2230B8723J35855P0025o2865D3260J47218c22630C10920d36118
11464B5645J15057J6235L4019p3036J79745C2603P699g9705A20521d4487C1031
$$ plain form
11452 -34547 3017 331068 330721 207303 237695 -16933 267666 128831 -12499 16924 6262 -179315
11439 64861 169062 109882 -67247 52153 103486 291746 -31332 96629 -209912 -100229 129654
11427 412687 -65955 -82639 -19337 -118235 -30822 14151 -74431 -24172 -156338 -255162 -47822
11415 -77410 -201024 -214303 46277 -86135 164409 -7920 81001 30663 256524 185141 75478
11403 -170074 127204 105187 -274809 -10650 23389 -233713 228142 159309 -128233 163921
11392 6031 129181 -138841 -87896 49229 110667 -117772 121541 -172484 -206007 -473256 -188026
11380 -101358 265 -183933 -134447 71307 -116661 7471 103394 157902 -62513 -170397 -12328
11368 -42709 40478 -34855 -355412 -275884 -486384 74047 69430 -134426 -185138 92988 168328
$$ packed form
11452c4547C017L28051l47j23418L0392a6933B67666A28831a2499A6924F262a79315
11439F4861J04201n9180f7247E2153N1333J88260c1332I6629b09912a00229A29654
11427D12687f5955j6684a9337r8898c0822A4151g4431b4172j32166r8824d7822
11415g7410j23614j3279D6277h6135A64409g920H1001C0663K25861p1383G5478
11403a70074A27204k2017b74809a0650B3389b33713B28142o8833a28233A63921
11392F031J23150a38841N0945D9229O1438a17772A21541a72484l3523k67249a88026
11380a01358B65a83933M9486G1307a16661G471R5923N4508f2513j07884a2328
11368d2709D0478c4855l20557P9528k10500G4047m617a34426n0712I2988P5340
$$ plain form
11357 168328 -135286 -84049 189595 17878 224238 24055 54690 31809 -296656 192451
11346 -48699 158580 25482 45113 11508 17591 -116523 96315 449205 -183043 178845 -442951
11334 389000 -232041 41518 -323594 -84877 421955 -170991 -85575 -259201 -158205 43599
11323 -6724 -63255 192047 137014 -186125 375355 -2364 289103 -7380 -100429 -97997 108977
11311 -169382 -325553 -181225 -144786 16813 -121286 -248158 -11961 -184415 -20180 -76531
11301 -76531 -127720 -75784 -58964 -229080 26102 145107 11203 204606 -64829 3760 86985
11290 86985 335452 149550 1772 -197363 -78474 28904 -148103 -72026 86159 -416247 -123156
11278 210812 30189 -274645 251993 75368 -137888 -197515 127511 -414959 -87618 -183665
$$ packed form
11357A68328a35286N1237A89595A7878K06360B4055L0635k2881b96656A92451
11346d8699A58580B5482J9631A1508O083a16523I6315L52890a83043A78845d42951
11334C89000b32041D1518c23594h4877D21955a70991Q5416j73626J00996D3599
11323f724n6531A92047n5033a86125C75355b364B89103g380r3049K432A08977
11311a69382j56171J44328L6439A6813a21286j26872a1961j72454b0180n6351
11301g6531n1189N1936J6820j70116B6102J19005A1203J93403f4829C760Q3225
11290H6985K48467A49550A772a97363g8474B8904a48103g2026H6159d16247a23156
11278B10812C0189b74645B51993G5368a37888n9627A27511d14959h7618r6047
$$ plain form
11268 -183665 72821 -177468 339819 -94349 -113729 12312 -27932 -111282 310978 -217152 -108300
11256 138557 -103683 -150348 78274 320437 68695 -100395 -238258 -26734 23867 174895
11246 174895 -10078 77163 134491 -355777 -14928 318961 -2399 -269876 -2289 200295 303355
11235 303355 -11988 171051 -55421 -238468 -85458 -67336 -147889 -376915 -275132 -87431 -204014
11224 -204014 95606 -83799 -340649 -210598 -422833 121195 117692 107301 -333640 102083
11213 197433 25995 -12022 181477 -228197 -150696 126338 -95645 -123841 237558 273781 123607
11201 -60515 -38305 86058 226302 76432 95209 -291489 -40083 -133767 -4180 -34809 -73532
11190 -73532 90407 -14508 -297715 29766 -249523 -53525 -110565 -465405 71831 234856 -232724
$$ packed form
11268a83665G2821a77468C39819i4349j9380A2312b7932q3350C10978b17152a08300
11256A38557a03683m6665G8274K42163F8695a00395j37863b6734B3867J51028
11246A74895a0078G7163N7328c55777a4928C18961b399k67477b289B00295J03060
11235C03355a1988A71051e5421j83047h5458J8122q0553k29026J01783h7431j16583
11224b04014I5606h3799k56850J30051k12235A21195l503j0391c33640A02083
11213A97433B5995a2022A81477b28197P7501A26338i5645k8196B37558L6223A23607
11201f0515K2210H6058J40244G6432J8777b91489d0083r3684d180l0629l8723
11190g3532I0407a4508k83207B9766b49523e3525n7040l54840G1831J63025b32724
$$ plain form
11178 139846 -178029 -94855 -290382 96318 -44542 242075 -215626 -282460 -111748 301034
11167 306744 -99385 -61377 39878 -62296 -236586 -57349 -32425 109069 -201838 144887 -312899
11155 108390 169580 -50415 224826 15502 97013 -260366 -47987 -81108 142580 -153353 198571
11143 34238 -113524 86987 -162055 240331 62364 -335731 -227888 -56397 -362732 -340335
11133 -340335 16637 -269998 26 142114 276104 23773 -118582 -151335 -245745 -71913 -338424
11122 -338424 -142641 -347379 -42945 -22167 -275034 145439 -27856 -33926 256717 276825 118265
11110 321020 -118653 403275 157081 -16479 19821 236306 167054 165590 -70403 230161 150285
11099 150285 -9108 365641 236278 145311 219232 34618 490912 69839 223119 -160644 96366
$$ packed form
11178A39846a78029Q3174j95527I6318d4542B42075b15626o6834a11748C01034
11167C06744i9385L8008C9878f2296j74290e7349K4924A09069b01838A44887c12899
11155A08390O1190e0415B24826A5502Q1511b60366d7987l3121A42580a53353A98571
11143C4238a13524H6987a62055B40331F2364c35731J07843e6397l06335K2397
11133c40335A6637b69998B6J42088J33990B3773a18582l2753r4410g1913k66511
11122c38424a42641k04738d2945K0778k52867A45439b7856o070B56717K0108A18265
11110C21020a18653D03275A57081a6479A9821K16485o9252j464g0403B30161p9876
11099A50285i108C65641j29363r0967P3921C4618M56294F9839J53280a60644I6366
$$ plain form
11087 92497 50800 93132 70842 -138370 4620 377385 90254 -140832 -77045 148575 124834
11076 124834 -202225 -35098 26303 22303 -290930 -90757 86448 340985 370637 -102874 99161
11064 142727 301831 117559 -43601 18720 217465 542909 403390 215881 67492 263834
11054 263834 508220 307213 537136 250141 553669 499892 883665 382561 265300 475045
11044 475045 895695 441660 306505 110760 484066 473941 587011 788224 613183 468820
11034 468820 307561 547208 538900 318933 179416 413693 658428 467536 215672 420041
11024 420041 574819 631012 507271 454424 574465 366917 462607 66561 136239 245823
11014 245823 446981 561740 135762 40734 163425 594592 474093 358139 418608 176960
$$ packed form
11087I2497m1697M2332k2290a38370D620L72765I0254a40832O3787A48575k3741
11076A24834b02225c5098B6303m000b90930i0757H6448K54537K9652a02874I9161
11064A42727J59104A17559d3601A8720J98745L25444j39519j87509F7492J96342
11054B63834K44386k01007K29923B50141L03528n3777L83773C82561j17261K09745
11044D75045M20650D41660j35155A10760L73306j0125J13070K01213j75041j44363
11034D68820j61259K39647q308k19967j39517K34277K44735j90892B15672K04369
11024D20041J54778N6193j23741n2847J20041k07548R5690F6561O9678J09584
11014B45823K01158J14759A35762D0734J22691M31167j20499j15954O0469A76960
$$ plain form
11003 298785 249094 379487 186419 509423 329111 -25193 -74973 197647 385651 255355
10993 255355 412611 226074 664633 243232 551898 408628 523013 634493 352999 364082
10983 364082 489444 638519 431085 763262 632811 922950 963210 678003 727864 891434
10973 891434 1200854 1252452 1339356 1409078 1441183 1239058 1694328 1697770 1626221 1411909 1292469
10962 1292469 1020301 989568 977969 685811 953992 1189568 929639 1282192 936402 927424
10952 927424 1041292 982792 817146 905353 740651 504591 790782 511778 362584 202463
10942 202463 318638 320270 492200 84360 -114867 -33726 10941 -64715 -126792 68251 411871
10931 411871 -29282 -91556 195914 29079 6539 136335 -59048 -313083 165396 59072 31620
$$ packed form
11003B98785m9691J30393A86419L23004j80312b5193m9780A97647J88004j30296
10993B55355J57256j86537M38559B43232L08666j43270J14385J11480k81494J1083
10983C64082J25362J49075k07434L32177j30451K90139M0260k85207M9861J63570
10973H91434L09420N1598Q6904O9722L2105k02125M55270L442p1549k14312j19440
10962A292469k72168l0733j1599k92158K68181K35576k59929L52553l45790q978
10952I27424J13868n8500j65646Q8207j64702k36060K86191k79004j49194j60121
10942B02463J16175J632J71930H4360a14867c3726A0941f4715o2077F8251L43620
10931D11871b9282o2274A95914B9079F539J29796e9048k54035A65396E9072k7452
$$ plain form
10920 31620 342613 -83411 7690 -80554 48214 124602 -182991 268422 -36326 -105569 -205942
10909 -205942 172509 -33431 -7997 -157864 -21699 -120610 -140244 -88362 6172 83114 15511
10897 119024 -339257 447479 205328 -346824 -17746 184558 80760 -144122 8677 -153828
10886 -64229 -304778 -113384 -253660 -209119 -10615 -29776 -169899 215701 308017 -233637
10875 -63185 341722 71359 -146190 16326 162701 75415 143853 -248653 -348840 -51747 -106244
10864 -106244 -33454 -135018 -131032 170187 302153 266751 -239316 -61135 -5461 -384516 139264
10852 -74131 -52506 -82539 -38370 139507 220960 -307344 -59469 -209027 208495 -111256 -64698
10841 -64698 -154106 -220941 202019 -212664 -359979 87703 -26035 -127891 183657 -246053
$$ packed form
10920C1620L10993h3411G690h0554D8214P6388a82991B68422c6326o9243j00373
10909b05942A72509c3431g997j49867b1699r8911j9634N1882F172P6942A5511
10897A19024c39257D47479B05328c46824a7746A84558H0760a44122H677a53828
10886f4229k40549a13384j40276M4541a0615j9161j40123B15701R2316b33637
10875f3185C41722G1359a46190A6326J46375G5415O8438b48653j00187e1747n4497
10864a06244c3454j01564L986A70187J31966l5402b39316f1135e461l79055A39264
10852g4131K1625l0033c8370A39507Q1453c07344e9469j49558B08495a11256M6558
10841f4698q9408o6835B02019b12664j47315H7703b6035j01856A83657b46053
$$ plain form
10830 116719 -17454 -14456 -63750 257903 106279 15377 151336 -1552 -375667 244693 -271352
10818 -94911 -222569 -189621 -329771 -134311 -190452 14466 199691 23994 -28054 45208 -276160
10806 -78022 -161049 45348 46702 -279911 205725 108367 -98126 -14600 -265367 -2262 252607
10794 154319 -162575 -116128 3070 471780 -143924 30204 243011 -135538 -347322 -69148
10783 -108118 -112834 -189552 10146 -296876 -137781 144834 116654 -131410 113425 24916 138462
10772 138462 -215178 291922 344857 -102222 79518 -4560 225585 40380 -4650 145940 -121886
10760 46709 -50833 -19371 55536 -361004 -130326 129878 -233496 -143620 79164 9459 -152663
10748 -142938 -15746 -178229 -43961 42028 -79016 32143 175029 -283557 -131933 -345991
$$ packed form
10830A16719a7454K998m9294B57903A06279A5377J35959a552l74115B44693b71352
10818i4911j27658L2948j40150a34311n6141A4466J85225B3994b8054D5208b76160
10806g8022q3027D5348J354b79911B05725r7358i8126a4600k50767b262B52607
10794A54319a62575M6447C070M68710a43924C0204K12807a35538k11784f9148
10783a08118m716p6718A0146b96876a37781A44834k8180a31410A13425B4916J13546
10772A38462b15178B91922N2935a02222G9518d560B25585D0380d650A45940a21886
10760D6709e0833a9371E5536c61004a30326A29878b33496Q9876G9164I459a52663
10748a42938a5746j62483d3961D2028g9016C2143J42886b83557a31933k14058
$$ plain form
10738 -345991 -284929 91725 386066 -133054 -36908 118770 -203910 102783 -55939 -131182
10728 -131182 -122181 269111 106409 135 81444 -957 -167132 208109 -142902 -73508 -18026
10716 -239446 6145 115362 192052 -23518 177630 206871 -244131 35582 67612 -215651 89968
10704 199895 -258484 -99873 92164 -317540 -9665 182400 93721 51478 -51528 13408 50931
10693 50931 -208242 50928 -37327 226951 -34336 125708 92491 -274123 25580 -55728 116381
10681 190691 -304328 -31991 -29352 94170 68721 238416 76957 64070 -184054 -259046 -254848
10670 -254848 -208108 418708 -44665 35492 -70083 -103271 -282429 64756 -318095 124591 -113323
10658 -248233 -27553 -143287 168669 271170 -19397 263334 -212988 -199878 -24765 -171399
$$ packed form
10738c45991O1062I1725K94341a33054c6908A18770b03910A02783e5939p5243
10728a31182R001B69111A06409A35Q1309i57j66175B08109a42902O9394a8026
10716b39446F145J09217P6690b3518A77630K9241b44131C5582L2030b15651H9968
10704A99895b58484i9873I2164c17540i665A82400q8679m2243e1528A3408L7523
10693E0931b08242E0928c7327B26951c4336A25708l3217b74123B5580e5728A16381
10681A90691c04328c1991K639I4170k5449J69695G6957j2887a84054p4992M198
10670b54848M6740D18708d4665C5492g0083l3188j79158F4756c18095A24591a13323
10658b48233b7553j15734A68669J02501a9397B63334b12988J3110b4765j46634
$$ plain form
10648 -171399 -131128 175326 343512 -222196 -52694 179425 -348500 -195859 -219542 -34625
10637 -32752 -170419 -121593 -101562 -92065 120360 -307321 -1886 152053 -8391 119919 23411
10625 -110946 88971 -18623 353860 -125527 -345645 -271308 -76147 -200706 -99667 44804 -143260
10613 -90516 -11765 -323393 162133 -234664 173526 -89987 119759 -90049 -18102 142646
10602 88457 -23635 -14461 35744 -72065 -29738 -363855 -34900 -13353 -242713 -47540 -9603 -263345
10590 -263345 11172 66544 103427 58725 -246598 102601 -37341 -204568 -89824 -78272 -175537
10579 -175537 -123504 198075 -332735 101869 174756 -57763 333129 9696 215507 -331184
10568 -452648 -287452 -162974 67713 363550 -74154 -2199 140171 162372 -201764 -214765 172466
$$ packed form
10648a71399M0271A75326J68186b22196e2694A79425c48500J52641k3683c4625
10637c2752j37667M8826K0031R497A20360c07321a886A52053h391A19919B3411
10625a10946H8971a8623C53860a25527k20118P4337g6147j24559i9667D4804a43260
10613i0516a1765l11628A62133b34664A73526h9987A19759i0049a8102A42646
10602H8457b3635R174C5744g2065b9738l34117c4900a3353k29360d7540i603k53742
10590b63345A1172N5372L6883m4702b46598A02601c7341j67227h9824J1552r7265
10579a75537N2033A98075c32735A01869P2887e7763C33129I696K05811c31184
10568d52648J65196J24478F7713K95837g4154b199A40171K2201b01764j3001A72466
$$ plain form
10556 126923 -142460 -118236 71803 -184233 16221 112182 -29245 -215742 -2821 -207303 -99845
10544 234803 -196433 2944 -73392 13300 -126538 -301356 131711 132810 -144538 45948 -252147
10532 -20525 95234 -160000 86584 -298952 93720 -112120 -238229 -263156 -220902 -31340 -175009
10521 -175009 -14707 -427280 -186238 -178560 -350532 103484 -226034 -16495 122789 65977
10511 65977 7758 -9564 -34238 -133522 -136451 -57063 -90907 56487 -209102 -87635 -56613 129683
10498 -255219 132038 87989 -37455 60571 128768 -122863 99003 -120161 171230 -494 -12156
10487 -12156 -92542 41677 -8013 -337679 -57944 89230 176319 506679 534499 182045 438705
10476 438705 -162537 203122 -196357 244482 69952 -75010 -257812 -128372 -114598 -165916
$$ packed form
10556A26923a42460K4224G1803a84233A6221R5961b9245j86497b821k04482i9845
10544B34803a96433B944g3392A3300a26538j74818A31711J099a44538D5948b52147
10532b0525I5234a60000H6584b98952I3720a12120j26109k4927M2254c1340j43669
10521a75009a4707m12573a86238P678j71972A03484b26034a6495A22789n6812
10511F5977G758i564k4674r9284k929e7063l3844E6487b09102h7635L1022A29683
10498b55219A32038m4049c7455F0571O8197a22863I9003a20161A71230d94j1662
10487a2156q0386D1677h013l29666e7944H9230Q7089L30360K7820A82045K56660
10476D38705a62537B03122a96357B44482F9952g5010j82802a28372J3774n1318
$$ plain form
10466 -165916 169207 -122619 119124 -162116 -132861 -140263 -88538 245861 -44232 8469 -17293
10454 -437 -219053 -191535 -53087 -563278 33087 125274 236759 16460 98554 -212725 -19715
10442 -99505 167145 -443996 -273423 -161987 131833 -172166 -41110 -159565 307615 -164448
10431 -108378 -101790 361529 458379 -150642 -96838 115069 -112688 -89168 -271963 70367 -227466
10419 -376551 -166439 -364642 -164725 67430 100136 -45457 83017 199196 481209 208605
10408 -95144 -98623 -132641 -76983 80331 354142 -180214 137198 244770 -56484 29396 -23134
10396 -139109 151768 129274 106986 95506 -289961 44023 243691 216495 30327 44565 117366
10385 117366 43391 379328 -143990 62705 45340 -418584 283884 -48745 2189 -48375 219375
$$ packed form
10466a65916A69207a22619A19124a62116K9255p402N1725B45861d4232H469a7293
10454d37k18616K7518e3087n10191C3087R2187J11485A6460Q2094b12725a9715
10442i9505A67145d43996J70573J11436A31833a72166d1110j18455C07615a64448
10431a08378O588C61529R6850a50642N3804A15069a12688K3520j82795G0367b27466
10419c76551a66439j98203a64725F7430L2706d5457H3017J16179K82013B08605
10408i5144l479l4018N5658H0331K73811a80214A37198J07572e6484B9396b3134
10396a39109A51768k2494k2288j1480b89961D4023J99668k7196C0327J4238P2801
10385A17366D3391L35937a43990F2705j7365d18584B83884d8745B189d8375B19375
$$ plain form
10373 268538 181458 -7879 253264 189535 115970 351312 3200 86516 27354 -68583 207516
10361 51657 235157 120778 13803 180706 277865 109552 -165212 65931 -159197 537967
10350 239226 270641 271223 337689 43171 204970 229258 -137836 -91454 73761 224946 272668
10339 272668 187544 257562 20366 118166 247087 333 312801 -102954 201249 342185 216930
10328 216930 245045 314909 -289054 -233371 -388021 19800 412075 126440 253740 4332 33127
10317 33127 304805 41395 302082 187336 490677 -91710 131191 277980 117783 26667
10306 190443 -97900 366620 47873 177886 -46631 244781 -56898 -152478 -48922 43470 15536
10294 -244285 9021 -164169 -133118 -234473 -35324 42174 -177364 27578 213616 -73478 6021
$$ packed form
10373B68538q7080g879B53264o3729p3565K35342C200Q3316B7354f8583B07516
10361E1657J83500j14379A3803J66903R7159A09552a65212F5931a59197E37967
10350B39226L1415N82O6466D3171J61799K4288a37836M6382G3761J51185M7722
10339B72668q5124P0018B0366R7800J28921C33L12468a02954B01249J40936j25255
10328B16930K8115O9864b89054N5683j54650A9800L92275A26440J27300D332K8795
10317C3127K71678D1395K60687j14746L03341i1710A31191J46789A17783B6667
10306A90443i7900C66620D7873J30013d6631B44781e6898r5580d8922D3470A5536
10294b44285I021a64169L1051j01355c5324D2174a77364B7578J86038g3478F021
$$ plain form
10282 -76546 -60821 160794 -209330 25041 -43894 -50728 -185716 -104202 -11433 360307 -116545
10270 121291 -207130 -369487 -201819 193436 144344 -205027 -355421 75045 163875 149873
10260 149873 148038 -20256 285063 34332 22456 283067 89208 -26454 232584 35927 -173553
10248 -60936 12068 -354415 8631 202098 -100139 -13854 -193241 523300 -148460 -392467
10238 -392467 116878 52597 -422309 247044 15910 -181982 -37146 -172504 115778 -222868
10227 -88292 -153955 -502691 -95337 -168488 -147723 -116096 35893 -164525 -58245 146164 -180279
10215 -119349 20866 -71112 -77008 -27136 -195007 -81044 -115090 -20634 88399 -258686 -13559
10203 -12152 -98766 -140333 -112139 -535123 -20842 -218725 68302 -230125 218921 -323813 -68762
$$ packed form
10282g6546J5725A60794b09330B5041d3894o834j34988Q1514a1433C60307a16545
10270A21291b07130j62357J67668A93436m9092b05027j50394G5045Q8830j4002
10260A49873j835b0256B85063C4332j1876K60611H9208b6454B32584C5927a73553
10248f0936A2068c54415H631J93467a00139a3854j79387E23300a48460k44007
10238c92467A16878E2597d22309B47044A5910a81982c7146j35358A15778b22868
10227h8292o5663l48736i5337p3151K0765L1627C5893a64525e8245A46164a80279
10215a19349B0866g1112n896b7136j67871h1044l4046b0634H8399b58686a3559
10203a2152q6614m1567K8194m22984b0842j97883F8302b30125B18921c23813f8762
$$ plain form
10191 14768 124563 35240 23987 -174397 -78502 331393 -162220 24697 -317251 -36198 -203024
10180 -203024 163917 -237934 32646 -79492 -116629 -75200 -90603 73999 -97039 -48694 162398
10168 -452845 -458944 -10197 -110495 -245286 -182960 -206526 -80564 -117902 -189698 -240826 62124
10156 116539 30365 -93475 -32299 -153776 107282 13933 -28879 44027 249915 -76198 92450
10144 -128022 -42507 -168434 -112645 -75280 -448589 -27699 133636 143167 236897 -211598 -116750
10133 -116750 285385 -156977 28362 74627 -155583 -154646 -20209 -306061 26243 -27185 -361397
10122 -361397 235276 -36323 243191 -156423 -846 -110700 -164080 101666 -151904 46299 -169927
10110 -146443 23084 -296962 -137535 71643 78013 -78507 -129800 -88013 536351 185711 -209121
$$ packed form
10191A4768J09795C5240j1253a74397g8502C31393a62220B4697c17251c6198j66826
10180b03024A63917b37934C2646g9492l7137M1429j5403G3999i7039M8345A62398
10168d52845o099a0197j00298j34791O2326k3566h0564l7338p1796n1128F2124
10156A16539C0365i3475c2299j21477A07282A3933b8879D4027K05888g6198I2450
10144a28022d2507j25927N5789L7365l73309b7699A33636R531R3730b11598R4848
10133a16750B85385a56977B8362M6265a55583R37b0209k85852B6243b7185l34212
10122c61397B35276c6323B43191a56423h46j09854n3380A01666a51904D6299a69927
10110a46443B3084b96962a37535G1643O370g8507n1293M1787E36351A85711b09121
$$ plain form
10098 443224 -304129 224864 19418 -262292 -41617 -203045 351781 137164 -77717 -64494
10088 -64494 55078 -15764 -117718 -193281 -93766 7689 -83405 50133 -19365 58666 190976
10077 190976 -228860 -57201 -319785 -213026 -211111 -355737 -87346 -185495 -98492 -4136 -64172
10066 -64172 275616 -265893 -63390 162368 63419 125459 -61926 -234997 83022 -212193 -126414
10055 -126414 72677 9100 86041 -80971 -286475 19051 -99298 96180 170643 -372457 -175926
10043 85564 -66216 -264567 -409631 -65309 -84384 -73219 -144603 -156559 -48719 -179074 -115421
10032 -115421 -82155 -211786 -82692 -355565 -4627 -229562 -331431 -207055 107779 -469218
10021 -118210 -375307 114929 -156665 21165 79346 -223426 164229 253253 183278 104524
$$ packed form
10098D43224c04129B24864A9418b62292d1617j61428C51781A37164g7717J3223
10088f4494E5078a5764j01954p5563i3766G689h3405E0133a9365E8666J32310
10077A90976b28860e7201k62584J06759J915j44626h7346r8149Q7003d136o0036
10066f4172B75616b65893f3390A62368F3419O2040f1926j73071H3022b12193Q5779
10055a26414G2677I100P6941h0971k05504A9051i9298I6180P4463c72457a75926
10043H5564f6216j98351j45064f5309j9075J1165p1384j1956d8719j30355O3653
10032a15421L3266j29631h2692k72873d627k24935j01869J24376A07779d69218
10021a18210k57097A14929a56665B1165N8181b23426A64229Q9024o9975p8754
$$ plain form
10011 104524 10680 3161 -46288 -332505 -216692 -120449 307422 -290767 -239436 59368 -147242
9999 -226612 -59912 139692 -73117 -49293 6534 -223393 -277134 -210296 137019 67248 31528
9987 22029 29501 -64452 174989 110640 -133624 -300304 -158135 -43551 -63541 92652 -349285
9975 -21189 -310964 -101823 11097 -197059 -21199 -39819 4584 -169629 167162 -80302 236432
9963 76435 -347584 -99057 329766 -137440 20908 -328475 -150833 -279124 -216201 137848
9952 -353714 63000 -67354 -424690 -170842 164996 163985 -115951 -33159 70166 -41362 -179428
9941 -179428 73685 -95082 123940 130551 -423750 124315 -94209 543677 -442643 -140409 -286396
9930 -286396 -89957 -115960 -288223 -290666 -323970 -191279 55549 -132237 16944 167145 -191816
$$ packed form
10011A04524A0680C161d6288k86217J15813R6243C07422b90767N1331E9368a47242
9999b26612e9912A39692g3117K3824F534b23393n3741O6838A37019F7248C1528
9987B2029P472f4452A74989o4349a33624j66680J42169d3551j9990I2652c49285
9975b1189k89775a01823A1097a97059b1199j8620D584a69629A67162h0302B36432
9963G6435c47584i9057C29766a37440B0908c28475a50833j28291O2923A37848
9952c53714F3000f7354l57336a70842A64996j011a15951c3159G0166d1362j38066
9941a79428G3685i5082A23940O611d23750A24315i4209E43677d42643a40409j45987
9930b86396h9957k6003j72263k443l3304J32691E5549a32237A6944J50201a91816
$$ plain form
9918 -100759 190278 67011 -477909 -218563 -63468 -209575 -202281 -121031 290188 -45123 -222170
9907 -222170 -33819 128 -340392 150479 -153132 -44465 -204245 -143411 -36507 -164079 -229951
9896 -229951 -287475 -123533 -70981 -120318 -172107 -228222 46471 -77109 -145749 -212358 -35011
9884 -235101 284729 13937 -115180 -16926 -193980 89898 -269594 188465 -235345 -65297
9873 -208642 -274989 -345681 -31699 74311 -181762 -62330 17240 90808 -155430 114523 -62926
9861 -100900 154636 -179185 -131832 -9367 135845 403137 98381 -243615 -404475 8670 -254271
9849 123927 -136015 16285 89965 -222514 97279 48097 -210916 -110603 50532 -231466 -290242
9838 -290242 -85232 112087 160728 -17893 -77728 -324852 397753 -98688 -14049 -15296 -254734
$$ packed form
9918a00759A90278F7011d77909b18563f3468j46107P294Q1250B90188d5123j77047
9907b22170c3819A28c40392A50479a53132d4465j59780O0834c6507j27572o5872
9896b29951n7524a23533N2552m9337n1789n6115D6471g7109o8640o6609c5011
9884b35101B84729A3937a15180a6926j77054H9898b69594A88465b35345f5297
9873b08642o6347p0692c1699G4311a81762f2330A7240P3568a55430A14523f2926
9861a00900A54636a79185M7353i367A35845K67292I8381b43615j60860H670b54271
9849A23927a36015A6285P3680b22514I7279D8097b10916J00313E0532b31466n8776
9838b90242h5232A12087M8641a7893n9835k47124C97753i8688a4049j247k39438
$$ plain form
9827 -254734 -99142 -278414 -594 -25929 -151664 -264056 -259659 194326 -321457 219948 -195508
9815 99024 -8959 -22909 -215461 93344 44205 -282757 -39117 -337269 -56100 -345740 -73112
9803 211875 66494 -206301 47476 49429 -24957 -112080 -120911 -173187 -111594 96610 124343 -16272
9790 51900 -312064 -382469 -235854 -49892 258079 -7138 254209 78471 191922 -259702 -215820
9779 -215820 -116368 -170491 -3634 -264492 -44114 36290 -20345 31564 -265253 -125928 -138375
9768 -138375 26643 123404 -345212 51541 -352992 -29222 93174 -142632 -165795 -234913 119446
9756 -159971 -246883 180383 44080 46036 -62759 4256 157222 -17946 -30032 230264 162989
9745 162989 40974 -200536 -112771 -163705 67769 -264188 356947 -76911 -451524 -209931 -29561
$$ packed form
9827b54734i9142j79272e94k5335j25735j12392M397A94326c21457B19948a95508
9815I9024h959j3950j92552I3344D4205b82757c9117k98152e6100k89640g3112
9803B11875F6494b06301D7476J953b4957q7123q831n2276O1593I6610K7733a6272
9790E1900c12064p0405J46615d9892B58079g138B54209G8471J13451b59702M3882
9779b15820R9452n4123c634k60858d4114C6290b0345C1564b65253a25928j2447
9768a38375B6643R6761c45212E1541c52992b9222I3174a42632k3163o9118A19446
9756a59971q6912A80383D4080J956f2759D256J52966a7946j2086B30264o7275
9745A62989D0974b00536Q7765n0934F7769b64188C56947g6911l74613b09931b9561
$$ plain form
9733 -119016 -148692 -61453 -44057 52126 161745 -200120 107507 -54087 -67510 310704 -2726
9721 -30080 48799 -32988 -119865 326561 -243274 -272036 350007 -135974 -131904 -210553 -431123
9710 -431123 30949 -60476 42272 -124344 136288 -157240 -36259 -47831 -170941 -224187 280053
9698 121159 -44897 -282416 -12626 99741 160176 167540 3448 -65515 -49008 -30264 120188 -207322
9685 47368 -54512 -201239 -230604 193339 -208041 -127193 -138207 -70003 9856 64120 -56218
9673 -225414 -83411 -550650 149315 3026 -250635 113111 -451749 49729 229744 135253 -224743
9661 111099 -160711 200646 122879 -186403 -250607 -8718 -176325 -69565 -5671 232229 -92826
9649 -252496 -130267 -78342 -278634 -277542 -46427 159861 -21512 -8039 -74141 -41682 -139157
$$ packed form
9733a19016k9676f1453J7396E2126J09619b00120A07507e4087j3423C10704b726
9721c0080D8799c2988q6877C26561b43274k8762C50007a35974M070p8649k20570
9710d31123C0949f0476D2272a24344A36288a57240c6259j1572j23110n3246B80053
9698A21159d4897k37519a2626I9741O0435P364C448f5515J6507J8744A20188b07322
9685D7368e4512j46727k9365A93339b08041Q0848j1014O8204I856N4264e6218
9673b25414h3411m67239A49315C026b50635A13111d51749D9729J80015r4491b24743
9661A11099a60711B00646p7767a86403o4204h718j67607f9565e671B32229i2826
9649b52496J22229N1925k00292J092d6427A59861b1512h039o6102L2459r7475
$$ plain form
9638 -139157 -314822 25653 -446737 36300 69934 -71983 -43043 -58813 -375243 -82143 -81146
9627 -81146 50869 114531 -132862 38735 53934 57502 -185289 22016 -261169 -210376 152360
9615 132269 86658 240277 2718 185267 -234723 -123959 -127267 -157145 -72858 -75660 -61571
9604 -61571 38141 84080 -228155 -221258 -26111 -162076 -289516 210240 5164 -71045 -325581
9593 -325581 126227 -194452 -178708 2155 -96937 -33068 101257 172102 -27936 -226624 -186069
9582 -186069 195923 -103268 -11011 -5702 -145746 -280484 -198893 -188898 -81789 10919 41634
9571 41634 -27986 39206 -19053 37211 -219334 -155089 -183518 -124179 -247943 87029 253276
9560 253276 135155 -65107 160666 43497 -106634 146926 -325121 -293825 38836 86638 -425732
$$ packed form
9638a39157j75665B5653d46737C6300L3634g1983K8940j5770l16430h2143R97
9627h1146E0869O3662a32862C8735J5199L568a85289B2016b61169N0793A52360
9615A32269m5611J53619B718J82549b34723J10764l308k9878g2858k802J4089
9604f1571C8141M5939b28155O897b6111j35965j27440B10240E164g1045k54536
9593c25581A26227a94452J5744B155i6937c3068A01257P0845b7936j98688M0555
9582a86069A95923a03268a1011N309j40044j34738Q1591R995h1789A0919L0715
9571D1634b7986C9206a9053C7211b19334O4245k8429N9339j23764H7029J66247
9560B53276j18121f5107A60666D3497a06634A46926c25121L1296C8836M7802d25732
$$ plain form
9548 168102 -257526 -40500 -102605 136287 -57703 -151800 51581 122200 53267 -125955 212144
9536 -232557 -60565 -320231 -263081 -249268 28437 -74531 -140619 -29108 393970 -116738 33686
9524 -184141 24729 -238278 -280226 -364908 -343427 -275614 -114102 -41786 -304871 -167252 94217
9512 -29046 -242676 -174593 -31268 -219375 -12599 154732 102866 -61272 65008 105865 -228567
9500 -352585 244801 51515 151177 7329 -254036 -58381 -216859 -44143 291910 -361239 -114890
9488 205985 434013 49898 -17213 -173476 14937 -112102 14347 2199 -310790 -405790 -403610
9477 -403610 6497 -162386 -18670 -45312 105011 -148441 -36328 18314 -43424 292095 -87203
9465 -330387 -65332 -185187 -42682 -245749 34930 -77096 -45670 -79809 -96141 -313311 -168961
$$ packed form
9548A68102b57526d0500o2105A36287e7703r4097E1581P0619E3267a25955B12144
9536b32557f0565k59666N7150J3813B8437g4531o6088b9108C93970a16738C3686
9524a84141B4729b38278m1948q4682K1481O7813a14102d1786k63085J37619I4217
9512b9046k13630O8083c1268j88107a2599A54732n1866f1272F5008M0857b28567
9500c52585B44801E1515R9662G329b54036e8381j58478d4143B91910c61239a14890
9488B05985K28028D9898a7213j56263A4937a12102A4347B199c10790r5000K180
9477d03610F497a62386a8670k6642A05011a48441c6328A8314d3424B92095h7203
9465c30387f5332j19855d2682k03067C4930g7096L1426l4139j6332k17170J44350
$$ plain form
9454 -168961 -159199 -133763 257396 390127 12266 238138 178427 -324366 -44335 6600 -165621
9442 -103386 234296 12763 77128 -60464 251128 2181 -6402 -44296 142407 192603 220477
9431 220477 -318245 124406 -32405 13293 -74853 -141207 5013 210443 -137378 -124489 -189452
9420 -189452 194699 177395 12987 -34268 -71178 32147 -216821 428 114028 -111601 101233
9408 -36527 -28414 -50479 -259956 -305547 -127604 -140214 185605 -108103 -9889 -463577 233824
9396 -135791 -273016 -151954 -257828 235024 -115236 -89330 138156 -55863 -51555 214686
9385 -34505 -135022 -166622 24215 41998 -39755 -30975 -180426 -79537 -3354 -14563 60918 -260275
9372 82177 -114981 102251 91142 145780 -253932 83182 -228289 -175553 117419 -141865 -183941
$$ packed form
9454a68961R762K5436B57396J32731A2266K25872n9711c24366d4335F600a65621
9442a03386B34296A2763O4365f0464B51128B181f402l7894A42407N0196K7874
9431B20477c18245A24406c2405A3293g4853o6354E013K05430a37378J2889o4963
9420a89452A94699j7304A2987c4268l6910C2147b16821D28J13600a11601A01233
9408c6527Q113k2065k09477m5591a27604j2610A85605a08103i889m53688B33824
9396a35791j37225J21062j05874B35024a15236K5906A38156e5863M308B14686
9385c4505j00517l1600B4215J7783c9755Q780j49451g9537c354j1209F0918b60275
9372H2177a14981A02251j1109N4638b53932H3182b28289N2736A17419a41865m2076
$$ plain form
9361 -183941 -234339 -19886 176310 -154384 -51610 -90769 -252138 -311354 57756 -410388 -120517
9349 143057 -5895 -66592 -373941 171044 51599 81300 46924 -242466 21495 272665 -120597
9337 -193201 166040 80956 -171852 94543 -182397 47464 -315613 199497 -25555 -43703 -6915
9325 -3790 153853 -361991 -160181 -102771 4389 -310222 -7678 -171135 305256 91251 -52871
9313 -33137 -129209 -16603 -72933 -71604 -15520 105210 -109358 279030 112576 -339940 -260818
9302 -260818 -69739 -74278 -42282 112282 -84066 110898 61982 184700 376210 155043 -83352
9290 -182597 73263 -365068 -42591 134757 -186134 -269665 75197 -131499 -10271 -169237 -55629
9278 323133 -395784 -93580 -257725 -332218 -148249 -208196 -419703 -180593 82724 -130964
$$ packed form
9361a83941n0398a9886A76310a54384e1610l9159j61369n9216E7756d10388a20517
9349A43057e895o0697l07349A71044E1599K9701l4376b42466B1495K51170a20597
9337a93201A66040H0956a71852I4543a82397D7464c15613A99497b5555j8148f915
9325c790A53853c61991a60181N7410D389c10222g678j63457C05256I1251e2871
9313c3137r6072a6603n6330J329a5520A05210a09358B79030A12576c39940P9122
9302b60818f9739m539L1996A12282h4066A10898m8916J22718J91510A55043h3352
9290a82597G3263c65068d2591A34757a86134q3531G5197a31499a0271j58966e5629
9278C23133c95784i3580j64145p4493a48249n9947k11507a80593H2724a30964
$$ plain form
9267 175940 73380 151697 110699 1672 124306 -273381 -182219 -256566 110221 -246412 -105326
9255 88160 -267937 -35614 -204378 193700 -66137 -266378 -60413 56682 72021 -136210 -78169
9244 -78169 -15865 70841 -17658 -28559 -167636 -66951 -63423 -110256 245578 -198715 -183243
9233 -183243 -18283 -60691 -306738 400823 -286617 -126493 -233191 -89940 -232893 319719
9222 -33850 -5680 -87294 -62119 -168700 180265 -190591 38339 70558 59779 -93491 -247522
9211 -247522 73864 54552 2556 -127219 -314366 -55526 333048 -25563 205176 -125588 -263261
9200 -263261 29279 -155831 -75592 90912 -342828 -504931 -38685 59811 131098 -84939 301687
9188 -63507 201926 -88070 -65873 -217871 -215119 -86030 -98887 280919 13489 -78873 -187285
$$ packed form
9267A75940G3380P8317m0998A672J22634b73381R1162p4347A10221b46412a05326
9255H8160b67937c5614j68764A93700f6137k00241f0413E6682J5339a36210N8041
9244g8169a5865G0841a7658j0901j39077f6951L528m6833B45578a98715J5472
9233a83243a8283m2408k46047D00823b86617a26493j06698h9940j42953C19719
9222c3850e680q1614K5175j06581A80265a90591C8339L2219j0779i3491j54031
9211b47522G3864j9312B556a27219j87147e5526C33048b5563B05176a25588j37673
9200b63261B9279a55831g5592I0912c42828j62103c8685E9811P1287h4939C01687
9188f3507B01926h8070K2197j51998K752h6030j2857B80919A3489g8873j08412
$$ plain form
9177 -187285 -191036 401300 247349 28513 -8964 -67245 -56385 -366450 106459 219766 -131789
9165 14314 315119 -56407 -356032 41671 33803 47567 -20901 241139 -51480 -191367 -243173
9154 -243173 110118 -188059 -157935 143727 -191926 -210578 -17505 -110822 179604 -152994
9143 110421 61425 52875 61378 -149955 -113453 52338 -43013 -28794 -223992 -82288 -300186
9132 -300186 113373 -253758 30418 -305062 131058 23117 177279 -52480 15547 -66579 56156
9120 -427792 -215910 -266505 95392 -136374 -8558 -319599 -45035 239714 -13552 -61910 45414
9108 253196 -22877 -203880 112645 -132436 -253161 -63413 -112944 52896 -211217 1145 -51555
9096 -75496 8282 85193 -89555 162833 -207768 -388617 121215 -5907 -144953 -67159 -65415
$$ packed form
9177a87285l751D01300j53951B8513h964n8281J0860l10065A06459J13307a31789
9165A4314L00805e6407k99625D1671p868J3764b0901B41139e1480j39887n1806
9154b43173A10118a88059L0124A43727a91926j8652a7505r3317A79604a52994
9143A10421m8996q550Q503a49955L6502E2338d3013J4219j95198h2288k17898
9132c00186A13373b53758C0418c05062A31058B3117J54162e2480A5547f6579E6156
9120d27792K11882n0595I5392a36374h558l11041d5035B39714a3552m8358D5414
9108B53196b2877j81003A12645a32436j20725f3413m9531E2896b11217A145e1555
9096g5496H282P6911h9555A62833b07768j80849A21215e907j39046f7159J744
$$ plain form
9085 -65415 114904 236673 236078 -120257 -82099 50448 31235 37667 162771 -249299 89521
9073 -209117 282444 171529 -217665 -115891 -223608 201817 64107 52011 22413 -21338
9062 -122886 77914 112297 -460603 -196542 -338167 -93026 -5919 44506 -204144 -303819 313303
9050 -255281 -158435 -118966 -209826 -33692 -126279 -11065 -109227 -215126 -10052 26752 -416227
9038 67930 -41742 -3173 -237645 227347 138733 -17962 82022 -100536 78560 -43044 -13386
9026 74466 115080 108874 -169861 -21569 29127 -141933 -21168 -357920 -27350 122094 77427
9015 77427 18170 32942 -92827 -48709 165472 -87128 -111149 184460 -30851 -269194 22588
9003 -53564 172827 31740 -236612 240619 174572 -9043 -83347 67786 -250265 113581 131719
$$ packed form
9085f5415A14904J21769n95a20257L8158E0448j9213O432J25104b49299H9521
9073b09117B82444j10915b17665J01774j07717B01817F4107j2096B2413b1338
9062a22886G7914L4383d60603a96542j41625i3026e919D4506b04144r9675C13303
9050b55281R6846L9469r0860c3692r2587a1065r8162j05899a0052B6752d16227
9038F7930d1742c173k34472B27347q8614a7962H2022a00536G8560d3044a3386
9026G4466M0614o206a69861b1569B9127a41933b1168l36752b7350A22094m4667
9015G7427A8170J4772i2827M4118A65472h7128k4021A84460c0851k38343B2588
9003e3564A72827C1740b36612B40619o6047i043p4304F7786b50265A13581J8138
$$ plain form
8992 131719 -62741 -129280 -65032 12240 -149212 263636 -186786 -227355 -106870 -117103 371432
8980 -101745 155451 127715 -384585 217006 -387093 166387 177569 139316 -330277 -206577
8970 -206577 -127005 -75232 106712 -5795 -163327 -284781 172690 -51231 -82871 -122671 -337144
8959 -337144 -92911 164257 -376989 25005 -154321 -195787 -138090 -78627 -373685 14223 153412
8948 153412 254825 47098 -138261 62047 357240 3687 65312 51173 77945 170337 46811
8936 17590 -216893 -47901 -330498 56013 130850 -271657 -12820 -70084 -75126 332464 84639
8924 -14985 169939 285329 286362 -43008 644535 1525774 876731 314551 269360 131665 81046
8913 81046 -203492 127547 85475 -239361 -207406 203971 -295657 -227865 -77457 -331067 -104939
$$ packed form
8992A31719f2741o6539O4248A2240a49212B63636a86786m0569a06870j0233C71432
8980a01745A55451k7736c84585B17006c87093A66387J1182l8253c30277J23700
8970b06577P9572N1773A06712e795j57532j21454A72690e1231l1640l9800k14473
8959c37144i2911A64257c76989B5005a54321m1466N7697N9463k95058A4223J39189
8948A53412J01413D7098a38261F2047K95193C687O1625j4139K6772R2392D6811
8936A7590b16893d7901k82597E6013P4837b71657a2820n7264n042C32464H4639
8924a4985A69939J15390J033d3008F44535Q81239o49043C14551m5191A31665n0619
8913H1046b03492A27547m2072b39361L1955B03971b95657O7792g7457k53610a04939
$$ plain form
8901 24794 -322020 -224047 -122128 -94517 -62427 -101518 -34361 27964 1776 232661 294831
8890 294831 -120751 -88015 -28922 142699 -107059 -21920 -118492 34533 -221775 155242 -25540
8878 -42704 78576 -177402 -289937 -242119 -217718 157148 -272595 94780 -76188 120616 53752
8866 -132364 60820 86546 -30159 -46815 -34369 -124966 -326543 145182 -106286 83612 58260
8855 58260 -186326 71179 29185 47365 -84282 -104100 -271648 -222100 141801 6028 -157319
$$ packed form
8901B4794c22020R7973J01919K7611L2090l9091c4361B7964A776K30885O2170
8890B94831a20751L2736b8922A42699a07059b1920r6572C4533b21775A55242b5540
8878d2704G8576a77402j12535M7818K4401A57148b72595I4780g6188A20616E3752
8866a32364F0820K5726c0159j6656J2446r0597k01577A45182a06286H3612k5352
8855E8260a86326G1179B9185J8180h4282j9818j67548M9548A41801F028a57319
$$ [...]
##END NTUPLES=NMR SPECTRUM
##END=
