##TITLE=NES1004_878015019_9232700_nB64FBqrWS
##JCAMPDX= 6.0         $$ Bruker NMR JCAMP-DX V2.0
##DATA TYPE= NMR SPECTRUM
##DATA CLASS= NTUPLES
##ORIGIN= BRUKER
##OWNER= Administrator
$$ 1.72 TOPSPIN		Version 2.1
$$ 2015-06-17 17:00:52.878 -0700  Administrator@X
$$ Compression mode = diff/dup
##.OBSERVE FREQUENCY= 400.02188249412
##.OBSERVE NUCLEUS= ^1H
##.ACQUISITION MODE= SIMULTANEOUS (DQD)
##.ACQUISITION SCHEME= undefined
##.AVERAGES= 64
##.DIGITISER RES= 22
##SPECTROMETER/DATA SYSTEM= spect
##.PULSE SEQUENCE= noesygpps1d.comp
##.SOLVENT NAME= COFFEE_meoh
##.SHIFT REFERENCE= INTERNAL, COFFEE_meoh, 1, 14.96258
##AUDIT TRAIL= $$ (NUMBER, WHEN, WHO, WHERE, PROCESS, VERSION, WHAT)
$$ ##TITLE= Audit trail, TOPSPIN		Version 2.1
$$ ##JCAMPDX= 5.01
$$ ##ORIGIN= Bruker BioSpin GmbH
$$ ##OWNER= Administrator
$$ $$ E:\/data/COFFEE/nmr/NES1004_878015019_9232700_nB64FBqrWS/12/pdata/1/auditp.txt
$$ ##AUDIT TRAIL=  $$ (NUMBER, WHEN, WHO, WHERE, PROCESS, VERSION, WHAT)
(   1,<2015-06-17 17:00:47.144 -0700>,<Administrator>,<X>,<go>,<TOPSPIN 2.1>,
      <created by zg
	started at 2015-06-17 16:49:17.081 -0700,
	POWCHK enabled, PULCHK disabled,
       configuration hash MD5:
       21 0F 79 D6 B3 7B B4 F6 88 20 88 DB 03 48 BD 9F
       data hash MD5: 64K
       12 E2 EE D3 81 38 2C DA C5 08 C7 87 76 4A 15 4A>)
(   2,<2015-06-17 17:00:50.800 -0700>,<Administrator>,<X>,<proc1d>,<TOPSPIN 2.1>,
      <Start of raw data processing
       efp LB = 0.3 FT_mod = 6 PKNL = 1 PHC0 = 0 PHC1 = 0 SI = 128K 
       data hash MD5: 128K
       9B 96 7B 7D 6B 61 88 FE 27 E8 88 25 66 EE 48 C9>)
(   3,<2015-06-17 17:00:51.675 -0700>,<Administrator>,<X>,<proc1d>,<TOPSPIN 2.1>,
      <pk PHC0 = -84.32007 PHC1 = 0 
       data hash MD5: 128K
       2C 01 F8 0B 87 56 D4 2F 8A 70 DB 1C 1B 7C 7B B3>)
(   4,<2015-06-17 17:00:52.066 -0700>,<Administrator>,<X>,<proc1d>,<TOPSPIN 2.1>,
      <abs ABSG = 1 
       data hash MD5: 128K
       40 12 6A 51 81 06 03 74 1C D2 F7 FA 52 F0 10 D9>)
(   5,<2015-06-17 17:00:52.159 -0700>,<Administrator>,<X>,<proc1d>,<TOPSPIN 2.1>,
      <abs ABSG = 2 
       data hash MD5: 128K
       BE AB B8 B4 A3 3F 67 C5 C0 E9 37 99 53 6A 47 87>)
(   6,<2015-06-17 17:00:52.237 -0700>,<Administrator>,<X>,<proc1d>,<TOPSPIN 2.1>,
      <abs ABSG = 3 
       data hash MD5: 128K
       8E 0D 3C 45 8A F7 A2 F7 5A EE E1 C0 F5 82 BB BB>)
(   7,<2015-06-17 17:00:52.331 -0700>,<Administrator>,<X>,<proc1d>,<TOPSPIN 2.1>,
      <abs ABSG = 4 
       data hash MD5: 128K
       25 4D 0E 0C 52 43 A3 AA C4 1C BB C4 D1 FE 3C AD>)
(   8,<2015-06-17 17:00:52.425 -0700>,<Administrator>,<X>,<proc1d>,<TOPSPIN 2.1>,
      <abs ABSG = 5 
       data hash MD5: 128K
       53 E8 A1 32 71 E0 A0 28 7D 07 4F B5 AF AD A4 9C>)
$$ ##END=
$$ 
$$ $$ hash MD5
$$ $$ 05 20 BC 2C 5B E0 63 46 B7 A5 A7 83 ED 55 97 42
##$RELAX= 
##$RELAX= 
##$RELAX= 
##$RELAX= 
##$RELAX= 
##$RELAX= 
##$RELAX= 
##$RELAX= 
$$ Bruker specific parameters
$$ --------------------------
##$DU= <E:\>
##$EXPNO= 12
$$ [...]
##$TP07= 0
##$TPNAME0= <>
##$TPNAME1= <>
##$TPNAME2= <>
##$TPNAME3= <>
##$TPNAME4= <>
##$TPNAME5= <>
##$TPNAME6= <>
##$TPNAME7= <>
##$TPOAL= (0..7)
0.5 0.5 0.5 0.5 0.5 0.5 0.5 0.5
##$TPOFFS= (0..7)
0 0 0 0 0 0 0 0
##$TUNHIN= 0
##$TUNHOUT= 0
##$TUNXOUT= 0
##$USERA1= <user>
##$USERA2= <user>
##$USERA3= <user>
##$USERA4= <user>
##$USERA5= <user>
##$V9= 5
##$VALIST= <valist>
##$VCLIST= <CCCCCCCCCCCCCCC>
##$VD= 0
##$VDLIST= <DDDDDDDDDDDDDDD>
##$VPLIST= <PPPPPPPPPPPPPPP>
##$VTLIST= <TTTTTTTTTTTTTTT>
##$WBST= 2048
##$WBSW= 25
##$XGAIN= (0..3)
0 0 0 0
##$XL= 0
##$YL= 0
##$YMAX_a= 6021121
##$YMIN_a= -11836423
##$ZGOPTNS= <>
##$ZL1= 120
##$ZL2= 120
##$ZL3= 120
##$ZL4= 120
##$ABSF1= 14.96258
##$ABSF2= -5.595602
##$ABSG= 5
##$ABSL= 3
##$ALPHA= 0
##$AQORDER= 0
##$ASSFAC= 0
##$ASSFACI= 0
##$ASSFACX= 0
##$ASSWID= 0
##$AUNMP= <proc_prof1d_extract.lims>
##$AXLEFT= 0
##$AXNAME= <>
##$AXNUC= <1H>
##$AXRIGHT= 0
##$AXTYPE= 0
##$AXUNIT= <>
##$AZFE= 0.1
##$AZFW= 0.1
##$BCFW= 0
##$BC_mod= 0
##$BYTORDP= 0
##$COROFFS= 0
##$CY= 15
##$DATMOD= 1
##$DC= 0
##$DFILT= <>
##$DTYPP= 0
##$F1P= 0
##$F2P= 0
##$FCOR= 0.5
##$FTSIZE= 131072
##$FT_mod= 6
##$GAMMA= 0
##$GB= 0
##$INTBC= 1
##$INTSCL= 1
##$ISEN= 128
##$LB= 0.3
##$LEV0= 0
##$LPBIN= 0
##$MAXI= 10000
##$MC2= 0
##$MEAN= 0
##$ME_mod= 0
##$MI= 0
##$NCOEF= 0
##$NC_proc= -2
##$NLEV= 6
##$NOISF1= 0
##$NOISF2= 0
##$NSP= 0
##$NTH_PI= 0
##$NZP= 0
##$OFFSET= 14.96258
##$PC= 1
##$PHC0= -84.32007
##$PHC1= 0
##$PH_mod= 1
##$PKNL= yes
##$PPARMOD= 0
##$PPDIAG= 0
##$PPIPTYP= 0
##$PPMPNUM= 2147483647
##$PPRESOL= 1
##$PSCAL= 4
##$PSIGN= 0
##$PYNMP= <proc.py>
##$REVERSE= no
##$SF= 400.020009003435
##$SI= 131072
##$SIGF1= 0
##$SIGF2= 0
##$SINO= 400
##$SIOLD= 131072
##$SPECTYP= <>
##$SREGLST= <1H.CDCl3>
##$SSB= 0
##$STSI= 131072
##$STSR= 0
##$SW_p= 8223.68421052631
##$SYMM= 0
##$S_DEV= 0
##$TDeff= 65536
##$TDoff= 0
##$TI= <>
##$TILT= no
##$TM1= 0
##$TM2= 0
##$TOPLEV= 0
##$USERP1= <user>
##$USERP2= <user>
##$USERP3= <user>
##$USERP4= <user>
##$USERP5= <user>
##$WDW= 1
##$XDIM= 131072
##$YMAX_p= 348020083
##$YMIN_p= -10780
##$CURPLOT= <Network HP LaserJet P1505>
##$CURPRIN= <$Network HP LaserJet P1505>
##$DFORMAT= <normdp>
##$LAYOUT= <+/1D_H.xwp>
##$LFORMAT= <normlp>
##$PFORMAT= <normpl>
##$SURQMSG= 1
$$ End of Bruker specific parameters
$$ ---------------------------------
##NTUPLES= NMR SPECTRUM
##VAR_NAME=  FREQUENCY,     SPECTRUM/REAL,   SPECTRUM/IMAG
##SYMBOL=    X,             R,               I
##VAR_TYPE=  INDEPENDENT,   DEPENDENT,       DEPENDENT
##VAR_FORM=  AFFN,          ASDF,            ASDF
##VAR_DIM=   131072,        131072,          131072
##UNITS=     HZ,            ARBITRARY UNITS, ARBITRARY UNITS
##FACTOR=    0.0627417313425164, 1,          1
##FIRST=     8223.62146879497, -1714,        -38445
##LAST=      0,             -850,            -39631
##MIN=       0,             -10780,          0
##MAX=       8223.62146879497, 348020083,    0
$$ Real data points
##PAGE= N=1
##DATA TABLE= (X++(R..R)), XYDATA
$$ [...]
63503A70982o90r83j061m70O85J746K191K113J976K161K724L436L948M094M084
63488A96936M284M730N008M708L949L304L096K939K154P52k87o7J075J904J802
63473B36287J463J819K802L603L833L786L726L574L361L353L554L478K750J659
63459B79048Q65P75J370K432L669M717N319N520N694O320P647R433J1065J2166
63445C56040J3055J4356J6240J8252J9796K0415J9667J7343J3934J0333O860L105
63433E29396r95m447o111n973m982l960l176k773k940l602m441n309o363p748
63419D66576r411j1135j2560j3307j3397j3328j3389j3114j1940j0187q779q053
63407C27976p427o323m841l365k075j049l61J62R02J923K881L553M081M552M871
$$ y = [170982, 170292, 169309, 168248, 167778, 168463, 170209, 172400, 174513, 176489, 178650, 181374, 184810, 188758, 192852, 196936, 201220, 205950, 210958, 215666, 219615, 222919, 226015, 228954, 231108, 231860, 231573, 231506, 232581, 234485, 236287, 237750, 239569, 242371, 245974, 249807, 253593, 257319, 260893, 264254, 267607, 271161, 274639, 277389, 279048, 279913, 280688, 282058, 284490, 288159, 292876, 298195, 303715, 309409, 315729, 323376, 332809, 343874, 356040, 369095, 383451, 399691, 417943, 437739, 458154, 477821, 495164, 509098, 519431, 526291, 529396, 528401, 523954, 517843, 511870, 506888, 502928, 499752, 496979, 494039, 490437, 485996, 480687, 474324, 466576, 457165, 446030, 433470, 420163, 406766, 393438, 380049, 366935, 354995, 344808, 336029, 327976, 320549, 314226, 309385, 306020, 303945, 302896, 302535, 302697, 303599, 305522, 308403, 311956, 316037, 320589, 325460]
63392C25460N179N915P108Q248R133J0315J2141J3958J4852J4864J4826J5245
63380D57244J5868J6121J5430J3325R922O073K610m08l131n108n822n717n698
63367E10709n714m929l327j924j209o23j39r80l745o935q601q795r023r764j0004
63352D34997r190q158p721p540o951o005n103m249l382k851k988l555m138m800
63338C58366n776o843p512p721p811p910p720o902n478l909k939l047l875m421
63324B76502m108l325k640j985j138m95o31j227j316n85K85O30N21K85M0r1J47
63307B60869O82J013R00P10Q45J154J223Q21j14j458k589k659j709r09j206k112
63291B55461k504k140j703j555j380j007p75q71r59p10k31K63P53J181J264Q42
$$ y = [325460, 330639, 336554, 343662, 351910, 361043, 371358, 383499, 397457, 412309, 427173, 441999, 457244, 473112, 489233, 504663, 517988, 527910, 533983, 536593, 536185, 533054, 527946, 522124, 516407, 510709, 504995, 500066, 496739, 494815, 493606, 492983, 492844, 491864, 488119, 481184, 472583, 463788, 454765, 445001, 434997, 425807, 417649, 409928, 402388, 395437, 389432, 384329, 380080, 376698, 373847, 370859, 367304, 363166, 358366, 352590, 345747, 338235, 330514, 322703, 314793, 307073, 300171, 294693, 290784, 287845, 284798, 280923, 276502, 272394, 269069, 266429, 264444, 263306, 262811, 262180, 260953, 259637, 259052, 259337, 259967, 260488, 260773, 260813, 260722, 260869, 261551, 262564, 263464, 264174, 265019, 266173, 267396, 268217, 268103, 266645, 264056, 261397, 259688, 258779, 257573, 255461, 252957, 250817, 249114, 247559, 246179, 245172, 244397, 243526, 242567, 241857, 241626, 241889, 242642, 243823, 245087, 245929]
63275B45929J74l03l81k08j61m88r13p13L92J589J727O94m56p58j34J086K661
63258B49737M116M669L990K696J685J355J750K899M449N545N789N917O838Q277
63244C09712R240R533R930J0848J1907J2911J4265J5968J7143J7181J6676J6503
63232D71817J6584J6424J6331J7009J8117J8325J7097J5460J4623J4530J4371
63221F50688J3892J3558J3695J4108J4363J3940J2265R167N334J770j317m646
63209G56817q763j3272j7283k0219k1938k2518k2253k1562k0591j9114j7055j4869
63197E37380j2972j1202r192p071n176l273p85K171M636O002O843Q158J0170J2263
63183E37952J3847J4840J5409J5628J5505J5083J4453J3703J2920J2178J1552
$$ y = [245929, 246103, 245800, 245419, 245211, 245050, 244562, 243649, 242936, 243328, 244917, 246644, 247338, 246882, 246124, 245990, 247076, 249737, 253853, 258522, 262512, 265208, 266893, 268248, 269998, 272897, 277346, 282891, 288680, 294597, 301435, 309712, 318952, 328485, 338415, 349263, 361170, 374081, 388346, 404314, 421457, 438638, 455314, 471817, 488401, 504825, 521156, 538165, 556282, 574607, 591704, 607164, 621787, 636317, 650688, 664580, 678138, 691833, 705941, 720304, 734244, 746509, 755676, 761010, 762780, 761463, 756817, 748054, 734782, 717499, 697280, 675342, 652824, 630571, 609009, 588418, 569304, 552249, 537380, 524408, 513206, 504014, 496943, 491767, 488494, 487709, 489880, 494516, 500518, 507361, 515519, 525689, 537952, 551799, 566639, 582048, 597676, 613181, 628264, 642717, 656420, 669340, 681518, 693070]
63172F93070J1065J0601R897Q851P729O695N265K641j176n091q110j0453j3063
63159G17921j6178j9001k0732k1396k1525k1435k1068k0273j8969j7252j5489
63148E04603j4115j3133j1991j0224q123o453n579n155m716m195l722l206k518
63135D11473j889j738k014k125j696j105r70j355j743j722j328q30m67l97n84
63120C91510o76l52K19N38N29P31J619K928L971M330M028L242K232J488J585K644
63104D20566M048M771M216K801J628J376J597J395O39P5K01O81J049J431K070
63089D48544K636K673K442K661L431M067M019L457K840K428K425L062M224N301
63075D94210N779N848O107O827P725Q438Q952R529J0327J1199J1894J2417J3134
$$ y = [693070, 704135, 714736, 724633, 733484, 741213, 747908, 753173, 755814, 754638, 749547, 741437, 730984, 717921, 701743, 682742, 662010, 640614, 619089, 597654, 576586, 556313, 537344, 520092, 504603, 490488, 477355, 465364, 455140, 447017, 440564, 434985, 429830, 425114, 420919, 417197, 413991, 411473, 409584, 407846, 405832, 403707, 402011, 400906, 399936, 398581, 396838, 395116, 393788, 392958, 392491, 392094, 391510, 390834, 390482, 390701, 391239, 391768, 392499, 394118, 397046, 401017, 405347, 409375, 412617, 414849, 416337, 417922, 420566, 424614, 429385, 433601, 436402, 438030, 439406, 441003, 442398, 443037, 443112, 443313, 443994, 445043, 446474, 448544, 451180, 453853, 456295, 458956, 462387, 466454, 470473, 473930, 476770, 479198, 481623, 484685, 488909, 494210, 499989, 505837, 511944, 518771, 526496, 534934, 543886, 553415, 563742, 574941, 586835, 599252, 612386]
63062F12386J4476J6601J9318K2185K4664K6387K7503K8636L0259L2222L4015
63051H88652L5408L6548L7497L8002L7806L7010L6054L5349L4932L4374L3281
63040A284913L1935L1252L1839L3259L4423L4485L3105L0197K5851K0392J4028
63029A605679O604j872j0634j8682k5843l2681l9370m5236m9544n2079n2876n1998
63017A231468m9788m6771m3084l8530l3388k8364k3549j8224j2249o746k730K73
63005I28318L383O740R771J2553J5704J9025K1448K2535K3036K3596K3848K3263
62993A133220K2143K1195K0598K0065J9466J8817J7864J6112J3223R163M152j370
62981A314648o958j2598j8633k5037l1091l6128m0282m4047m7310m9356m9845
$$ y = [612386, 626862, 643463, 662781, 684966, 709630, 736017, 763520, 792156, 822415, 854637, 888652, 924060, 960608, 998105, 1036107, 1073913, 1110923, 1146977, 1182326, 1217258, 1251632, 1284913, 1316848, 1348100, 1379939, 1413198, 1447621, 1482106, 1515211, 1545408, 1571259, 1591651, 1605679, 1612283, 1610411, 1599777, 1581095, 1555252, 1522571, 1483201, 1437965, 1388421, 1336342, 1283466, 1231468, 1181680, 1134909, 1091825, 1053295, 1019907, 991543, 967994, 949770, 937521, 930775, 928045, 928318, 931701, 938441, 948212, 960765, 976469, 995494, 1016942, 1039477, 1062513, 1086109, 1109957, 1133220, 1155363, 1176558, 1197156, 1217221, 1236687, 1255504, 1273368, 1289480, 1302703, 1311866, 1316018, 1314648, 1307690, 1295092, 1276459, 1251422, 1220331, 1184203, 1143921, 1099874, 1052564, 1003208, 953363]
62970I53363m9213m7979m6106m3322l9860l6442l3608l1260k8949k6446k3944
62959E46234k1788k0038j8418j6648j4815j3366j2615j2274j1585j0140q423p297
62947C78827o914o506n480m259l671l821m098m137m047l787l059k110j826k554
62933C22558l400l337k574k062j985j602o17J77p3j161k165k511k306j924j650
62918B95368j645j944k420k855l023k740j966r78k10J66L22M57N10L06k21r52
62902B78175j560j583q35J83O21J85o06j133j285j219j001q05r95j582j954j636
62886B62970j002p27q30q49o83n34k89K94Q53P85L17L56J066J550J287R25J154
62869B66643J633J713J543J569J587J184P02Q15J311J321O16j20l91l92l28o7
$$ y = [953363, 904150, 856171, 810065, 766743, 726883, 690441, 656833, 625573, 596624, 570178, 546234, 524446, 504408, 485990, 469342, 454527, 441161, 428546, 416272, 404687, 394547, 386124, 378827, 371913, 365407, 359927, 355668, 351997, 348176, 344078, 339941, 335894, 332107, 329048, 326938, 325112, 322558, 319158, 315821, 313247, 311185, 309200, 307598, 306981, 307158, 307085, 305924, 303759, 301248, 298942, 297018, 295368, 293723, 291779, 289359, 286504, 283481, 280741, 278775, 277797, 277587, 277753, 278075, 278532, 279042, 279348, 279127, 278175, 276615, 275032, 274197, 274380, 275001, 275186, 274580, 273447, 272162, 270943, 269942, 269137, 268142, 266560, 264606, 262970, 261968, 261241, 260411, 259562, 258879, 258345, 258056, 258350, 259203, 259988, 260305, 260661, 261727, 263277, 264564, 265489, 266643, 268276, 269989, 271532, 273101, 274688, 275872, 276574, 277389, 278700, 280021, 280637, 280517, 280126, 279734, 279406, 279339]
62853B79339L44N62N87Q20J165Q64l60j597j802j067k86Q2L24P95J468K084K276
62836B85598J681M08o92p01L26J428J881J866J923K111K159K082K250K771L241
62821C08332L243K882K569K446K352K292K511L076L702M206M716N221N367N078
62807C57993N017N821P163Q192Q732R419J0664J2203J3757J5383J7003J8279J9293
62794E08919K0778K3225K6266K9339L2570L6492M1163M6006N0360N3975N7095
62783I26188O0213O3490O6296O7639O7078O4773O0698N4526M6536L7792K8915
62772A544144J9396Q719k564j3478k3764l3443m1920m8498n3460n7604o0863o2390
62760A174275o1945o0279n8099n5559n2802n0056m7079m3395l9393l6239l4371
$$ y = [279339, 279683, 280245, 280832, 281652, 282817, 283681, 283321, 281724, 279922, 278855, 278569, 278651, 278975, 279770, 281238, 283322, 285598, 287279, 287687, 286995, 286294, 286620, 288048, 289929, 291795, 293718, 295829, 297988, 300070, 302320, 305091, 308332, 311575, 314457, 317026, 319472, 321824, 324116, 326627, 329703, 333405, 337611, 342327, 347548, 352915, 357993, 363010, 368831, 375994, 384186, 392918, 402337, 413001, 425204, 438961, 454344, 471347, 489626, 508919, 529697, 552922, 579188, 608527, 641097, 677589, 718752, 764758, 815118, 869093, 926188, 986401, 1049891, 1116187, 1183826, 1250904, 1315677, 1376375, 1430901, 1477437, 1515229, 1544144, 1563540, 1572259, 1569695, 1556217, 1532453, 1499010, 1457090, 1408592, 1355132, 1297528, 1236665, 1174275, 1112330, 1052051, 993952, 938393, 885591, 835535, 788456, 745061, 705668, 669429, 635058]
62749F35058l2803l0404k7128k3586k0106j6872j4361j2940j2277j1739j1174
62738D21668j0753j0263r158p337n444m217l723l346k504j234k1R00J811K949
62724C69328M034M690N066N568O206O814P719R431J1740J3872J5625J7639K0222
62711D97954K2796K4856K6792K9202L1977L4667L7303M0253M3478M6471M8808
62700H84557N0337N0935N0372M8365M4762L9848L4342K8609K1953J3392L265o764
62688A263973j5539k3402l0923l7604m2611m6027m8505n0140n0616n0021m8691
62677H19894m6570m3631m0545l8032l5745l2792k9194k5891k3340k1124j8997
62666D64033j7295j6069j4746j3006j1266r949q935q078p558p368p083o538o140
$$ y = [635058, 602255, 571851, 544723, 521137, 501031, 484159, 469798, 456858, 444581, 432842, 421668, 410915, 400652, 391494, 384157, 378713, 374496, 370773, 367427, 364923, 363689, 363668, 364568, 366379, 369328, 373362, 378052, 383118, 388686, 394892, 401706, 409425, 418856, 430596, 444468, 460093, 477732, 497954, 520750, 545606, 572398, 601600, 633577, 668244, 705547, 745800, 789278, 835749, 884557, 934894, 985829, 1036201, 1084566, 1129328, 1169176, 1203518, 1232127, 1254080, 1267472, 1270737, 1263973, 1248434, 1225032, 1194109, 1156505, 1113894, 1067867, 1019362, 969222, 918606, 868585, 819894, 773324, 729693, 689148, 651116, 615371, 582579, 553385, 527494, 504154, 483030, 464033, 446738, 430669, 415923, 402917, 391651, 381702, 372767, 364689, 357131, 349763, 342680, 336142, 330002]
62653C30002o148o107n543m678m033l638l198k698k407k397k534k733k922k827
62639B78139k186j153k85j8l09p51r86j036j194j502j564r97JR70J800K608L148
62622B74685L056K672K890L891M707M546L950M082N287O908Q292R334J0185J0986
62608C55471J1952J3236J4695J6040J7255J8650K0542K2998K5826K8555L0602
62597E75822L1747L2261L2356L1640K9516K6015K1827J7496J2917P739J943m127
62585H17152j0017j5349j9866k3451k6083k7755k8480k8433k7979k7493k7082
62574E55164k6483k5264k3283k0907j8709j6960j5517j4167j2811j1348r712q151
62562C51852p151o850o776o435n930n731n970o277o186n531m507l562l137l261
$$ y = [330002, 323854, 317747, 312204, 307526, 303493, 299855, 296657, 293959, 291552, 289155, 286621, 283888, 280966, 278139, 275953, 274800, 274515, 274497, 274188, 273437, 272451, 271415, 270221, 268719, 267155, 266158, 266159, 267129, 268929, 271537, 274685, 277741, 280413, 283303, 287194, 291901, 296447, 300397, 304479, 309766, 316674, 324966, 334300, 344485, 355471, 367423, 380659, 395354, 411394, 428649, 447299, 467841, 490839, 516665, 545220, 575822, 607569, 639830, 672186, 703826, 733342, 759357, 781184, 798680, 811597, 819336, 821279, 817152, 807135, 791786, 771920, 748469, 722386, 694631, 666151, 637718, 609739, 582246, 555164, 528681, 503417, 480134, 459227, 440518, 423558, 408041, 393874, 381063, 369715, 360003, 351852, 344701, 337851, 331075, 324640, 318710, 312979, 307009, 300732, 294546, 289015, 284508, 280946, 277809, 274548]
62548B74548l500l467l211k928k539j869j038k69N91J801L038L557L224K872L327
62533B74137M500N723O667P498Q398R437J0782J2546J4385J5768J6779J8198K0481
62520D25299K3052K4962K6024K6789K7558K7937K7462K6088K3888K0729J6673
62509F96461J2294Q134M036n25n532j0336j4395j7665k0232k2051k3162k3742
62497E83285k3833k3368k2488k1476k0188j8193j5664j3613j2794j2692j2131
62486C86845j0648q794p216o012n048m420m347m724n062m916m377l945l851l678
62472C09807k928j801r23l86L27J335J995J895J576J773K449L195M066N254O270
62457C33904O389N759N275N281N223M709M129L872L568K546P49j264l003m369
$$ y = [274548, 271048, 267581, 264370, 261442, 258903, 257034, 255996, 255727, 256318, 258119, 261157, 264714, 267938, 270810, 274137, 278637, 284360, 291027, 298525, 306923, 316360, 327142, 339688, 354073, 369841, 386620, 404818, 425299, 448351, 473313, 499337, 526126, 553684, 581621, 609083, 635171, 659059, 679788, 696461, 708755, 716889, 720925, 720400, 714868, 704532, 690137, 672472, 652240, 630189, 607027, 583285, 559452, 536084, 513596, 492120, 471932, 453739, 438075, 424462, 411668, 398976, 386845, 376197, 367403, 360187, 354175, 349127, 344707, 340360, 335636, 330574, 325658, 321281, 317336, 313485, 309807, 306879, 305078, 304155, 303769, 304096, 305431, 307426, 309321, 310897, 312670, 315119, 318314, 322380, 327634, 333904, 340293, 346052, 351327, 356608, 361831, 366540, 370669, 374541, 378109, 380655, 381404, 380140, 377137, 372768]
62443C72768n441o160o360o071n750n961o634o975o423n462m989n024m704l520
62429B93294j961p84j70J84N42J005J588K199K724L162L536L754L863M292N351
62414C22579O595P195O945O435O266O646P572Q731R288Q673P581P275P730P616
62400D27127O404N280N286N716N296L974K512J049o02j926k278k122k352k642
62386D50722j843K3J594K263L056M928P353R408J1229J3541J6310J8825K0878
62373E58287K3100K6114K9732L3056L5188L6023L6235L6314L5722L3498K9619
62362I12888K5054K0488J5802J1063P053M205J786j153m581q015j1624j5861k0198
62349I36907k3364k4907k5698k6672k7699k8052k7393k5967k4191k2366k0682
$$ y = [372768, 367327, 361167, 354807, 348736, 342986, 337025, 330391, 323416, 316993, 311531, 306542, 301518, 296814, 293294, 291333, 290549, 290379, 290563, 291105, 292110, 293698, 295897, 298621, 301783, 305319, 309073, 312936, 317228, 322579, 329174, 336369, 343314, 349749, 356015, 362661, 370233, 378964, 388252, 396925, 404506, 411781, 419511, 427127, 433531, 438811, 444097, 449813, 455109, 459083, 461595, 462644, 462042, 460116, 457838, 455716, 453364, 450722, 448879, 448902, 450496, 452759, 455815, 460743, 468096, 477504, 488733, 502274, 518584, 537409, 558287, 581387, 607501, 637233, 670289, 705477, 741500, 777735, 814049, 849771, 883269, 912888, 937942, 958430, 974232, 985295, 992348, 996553, 998339, 997186, 992605, 984590, 972966, 957105, 936907, 913543, 888636, 862938, 836266, 808567, 780515, 753122, 727155, 702964, 680598, 659916]
62338F59916j9195j7844j6567j5323j4036j2735j1651j0968j0511r918r064q133
62326E03971p246o328n294m127k775j257J07R34J268J546J944K167K010J771J892
62311D90583K339K622K265J156l39j524j860j594j615k403l390l682l221k722
62297D76615k599k516k092j525j165q53j35J006K023K454K397K313K582L306M381
62282D86192N600O792P930R078J0264J1484J2872J4637J6756J8907K0814K2603
62270F43929K4646K7081K9572L1515L2397L2050L0636K8399K5398K1552J6997
62259I44172J2213P715L674J5l344o460r434j2271j4829j7057j9119k0985k2143
62246H42147k2158k1314k0241j8934j6842j4009j1341r456p859n809l543j972
$$ y = [659916, 640721, 622877, 606310, 590987, 576951, 564216, 552565, 541597, 531086, 521168, 512104, 503971, 496725, 490397, 485103, 480976, 478201, 476944, 477051, 477985, 479253, 480799, 482743, 484910, 486920, 488691, 490583, 492922, 495544, 497809, 498965, 498626, 497102, 495242, 493648, 492033, 489630, 486240, 482558, 479337, 476615, 474016, 471500, 469408, 467883, 466718, 465865, 465730, 466736, 468759, 471213, 473610, 475923, 478505, 481811, 486192, 491792, 498584, 506514, 515592, 525856, 537340, 550212, 564849, 581605, 600512, 621326, 643929, 668575, 695656, 725228, 756743, 789140, 821190, 851826, 880225, 905623, 927175, 944172, 956385, 964100, 967774, 967789, 964445, 957985, 948551, 936280, 921451, 904394, 885275, 864290, 842147, 819989, 798675, 778434, 759500, 742658, 728649, 717308, 707852, 699993, 694184, 690641, 688669]
62234F88669j404j232p84NQ18J443J887K348L074M040M828N054M828M551M407
62219G22532M358M517N087N944O599O666O199N601N382N784O447O675O368O348
62205H04507P240Q440Q885Q573Q475R017R601R821J0166J1129J2389J3383J3993
62192I35619J4270J4063J3480J3071J3081J3053J2708J2638J3483J5011J6651
62181A087128J8434K0581K2734K4422K5898K7520K8637K8132K5948K3087K0182
62170A352703J7068J3773J0828Q429O167L930K159R70k07j728l263m512n608o501
62156A394208o823o682o676o671n603l210r22p1p1N62J958K985L176L229L623
62141A373012L978L897L522K963K050J027O23J046J555J496J236J559K475L174
$$ y = [688669, 687265, 686033, 685249, 685254, 686072, 687515, 689402, 691750, 694824, 698864, 703692, 708746, 713574, 718125, 722532, 726890, 731407, 736494, 742438, 749037, 755703, 761902, 767503, 772885, 778669, 785116, 791791, 798159, 804507, 811747, 820187, 829072, 837645, 846120, 855137, 864738, 874559, 884725, 895854, 908243, 921626, 935619, 949889, 963952, 977432, 990503, 1003584, 1016637, 1029345, 1041983, 1055466, 1070477, 1087128, 1105562, 1126143, 1148877, 1173299, 1199197, 1226717, 1255354, 1283486, 1309434, 1332521, 1352703, 1369771, 1383544, 1394372, 1402801, 1408968, 1412898, 1415057, 1416027, 1415820, 1414092, 1410829, 1406317, 1400709, 1394208, 1387385, 1380703, 1374027, 1367356, 1361753, 1358543, 1357621, 1357550, 1357479, 1358041, 1359999, 1362984, 1366160, 1369389, 1373012, 1376990, 1380887, 1384409, 1387372, 1389422, 1390449, 1391072, 1392118, 1393673, 1395169, 1396405, 1397964, 1400439, 1403613]
62127A403613L061K414J992K139K395K047J014ml93k32P0M13P79Q45M32Q6M06
62110A421077R92Q29k24j259j667j769j835j418k74Q80J210R09P86J149J675K092
62094A423153K357K443K474K829L555L986L542K732K607L396M354M951N443O147
62080A473969O860P323P744Q363Q881Q690P564N755L543Q81k444o406j0473j3848
62066A506402j6090j7465j8500j9353j9901k0385k1407k3194k5181k6604k7196
62055A271126k7089k6406k5252k3942k2782k1745k0649j9572j8693j7847j6614
62044A030535j4972j3375j2055j0715r189q028p845q329q493p958p362p308p540
62031I07366p520p343p504p991q282q177q035q082p997p427o561n954n962o452
$$ y = [1403613, 1406674, 1409088, 1411080, 1413219, 1415614, 1417661, 1418675, 1418671, 1418278, 1418046, 1418116, 1418529, 1419308, 1420153, 1420585, 1420671, 1421077, 1422069, 1422898, 1422674, 1421415, 1419748, 1417979, 1416144, 1414726, 1414452, 1415332, 1416542, 1417451, 1418237, 1419386, 1421061, 1423153, 1425510, 1427953, 1430427, 1433256, 1436811, 1440797, 1444339, 1447071, 1449678, 1453074, 1457428, 1462379, 1467822, 1473969, 1480829, 1488152, 1495896, 1504259, 1513140, 1521830, 1529394, 1535149, 1538692, 1539573, 1537129, 1530723, 1520250, 1506402, 1490312, 1472847, 1454347, 1434994, 1415093, 1394708, 1373301, 1350107, 1324926, 1298322, 1271126, 1244037, 1217631, 1192379, 1168437, 1145655, 1123910, 1103261, 1083689, 1064996, 1047149, 1030535, 1015563, 1002188, 990133, 979418, 970229, 962201, 954356, 946027, 937534, 929576, 922214, 914906, 907366, 899846, 892503, 884999, 877008, 868726, 860549, 852514, 844432, 836435, 829008, 822447, 816493, 810531, 804079]
62017H04079o865o600n605m548m049l778k964j801j533k723m214m533l768l208
62003G47890l485m035m367m839n887p154p881p769p152o607o532o829o873o172
61989F62308n081m465m534m599m195l803l955m198l629k249r92m45k39J73P22
61974F20819J069J259J614K192K734L105L474M106N135O468P698Q238P883P236
61960F83030P279Q365R942J1299J2289J3150J3989J4811J5819J7250J9029K0903
61948H47155K2799K4741K6525K7994K9482L1406L3413L4616L4826L4965L5931
61937A183853L7617L9326M0666M1706M2735M4344M7133N0932N4846N8608O3199
61926A704965O9475P6852Q4328R2238J01741J12794J24014J34579J45103J56336
$$ y = [804079, 797214, 790614, 785009, 780461, 776412, 772634, 769670, 767869, 766336, 763613, 759399, 754866, 751098, 747890, 744405, 740370, 736003, 731164, 725277, 718123, 710242, 702473, 695321, 688714, 682182, 675353, 668480, 662308, 657227, 652762, 648228, 643629, 639434, 635631, 631676, 627478, 623849, 621600, 620608, 620163, 619924, 620097, 620819, 621888, 623147, 624761, 626953, 629687, 632792, 636266, 640372, 645507, 651975, 659673, 667911, 675794, 683030, 690309, 698674, 708616, 719915, 732204, 745354, 759343, 774154, 789973, 807223, 826252, 847155, 869954, 894695, 921220, 949214, 978696, 1010102, 1043515, 1078131, 1112957, 1147922, 1183853, 1221470, 1260796, 1301462, 1343168, 1385903, 1430247, 1477380, 1528312, 1583158, 1641766, 1704965, 1774440, 1851292, 1935620, 2027858, 2129599, 2242393, 2366407, 2500986, 2646089, 2802425]
61916B802425J68114J79939J91540K02362K11380K18002K22266K23636K20467
61907D640131K11391J96426J75916J49296J15918P6648L3576j1431n6777j00069
61897E431025j38343j69731j94200k12408k24544k30583k31009k26891k19438
61888C583878k09750j98649j86657j74154j61601j49355j37488j26006j15192
61879B125026j05365r6459q8157q0349p3117o6406o0095n4202m8740m3518l8500
61868A370118l4072l0387k6755k2375j7498j3134r605o298k909m9J804L134M567
61855A216541N830O208N709N065M692M190L024J300k44r48q17n06o50j203j476
61840A246715q02R16L181N219O451O899P094P349P308O438M798K866Q22j290k818
$$ y = [2802425, 2970539, 3150478, 3342018, 3544380, 3755760, 3973762, 4196028, 4419664, 4640131, 4851522, 5047948, 5223864, 5373160, 5489078, 5565726, 5599302, 5587871, 5531094, 5431025, 5292682, 5122951, 4928751, 4716343, 4491799, 4261216, 4030207, 3803316, 3583878, 3374128, 3175479, 2988822, 2814668, 2653067, 2503712, 2366224, 2240218, 2125026, 2019661, 1923202, 1835045, 1754696, 1681579, 1615173, 1555078, 1500876, 1452136, 1408618, 1370118, 1336046, 1305659, 1278904, 1256529, 1239031, 1225897, 1216292, 1209994, 1207085, 1207036, 1208840, 1211974, 1216541, 1222371, 1228579, 1234288, 1239353, 1244045, 1248235, 1251259, 1252559, 1252315, 1251367, 1250550, 1250044, 1249394, 1248191, 1246715, 1245913, 1246829, 1250010, 1255229, 1261680, 1268579, 1275673, 1283022, 1290330, 1296768, 1301566, 1304432, 1305254, 1303964, 1301146]
61825A301146k722q95J448L125M194N489P425R849J2612J5642J8636K1268K3691
61812A420908K6467K9976L4144L8625M3022M7050N0819N4838N9539O4859P0481
61801A940728P6353Q2718Q9820R7812J06781J16616J26985J37794J49496J62685
61791C087788J77448J93349K09989K27291K45373K64438K84661L05868L27275
61782E323480L47680L65917L80906L91405L96006L93287L81760L59795L25952
61773H666188K79652K21608J53717P8727j31p9421j55585k25079k84852l33037
61763H321787l69042l93015m05562m08120m03022l92561l78050l60028l39244
61754D873143l16974k94549k72895k52429k33090k14529j96659j79977j65059
$$ y = [1301146, 1298424, 1297529, 1298977, 1302102, 1306296, 1311785, 1319210, 1329059, 1341671, 1357313, 1375949, 1397217, 1420908, 1447375, 1477351, 1511495, 1550120, 1593142, 1640192, 1691011, 1745849, 1805388, 1870247, 1940728, 2017081, 2099799, 2189619, 2287431, 2394212, 2510828, 2637813, 2775607, 2925103, 3087788, 3265236, 3458585, 3668574, 3895865, 4141238, 4405676, 4690337, 4996205, 5323480, 5671160, 6037077, 6417983, 6809388, 7205394, 7598681, 7980441, 8340236, 8666188, 8945840, 9167448, 9321165, 9399892, 9399761, 9320340, 9164755, 8939676, 8654824, 8321787, 7952745, 7559730, 7154168, 6746048, 6343026, 5950465, 5572415, 5212387, 4873143, 4556169, 4261620, 3988725, 3736296, 3503206, 3288677, 3092018, 2912041, 2746982]
61745B746982j51857j39810j28570j18263j09059j00859r3408q6445p9748p3317
61735A665646o7458o2446n8139n4154n0291m6553m2916l9452l6401l3827l1400
61724A142609k8960k6994k5922k5184k3781k1676j9911j9191j9091j8797j8050
61713H95052j7080j6225j5839j6049j6322j5844j4583j3389j2788j2327j1474
61702G33132j0495r870r494r091q908r242r688r636r228r076r189r009q424p905
61688F03877p603p121o376n915o046o395o668p168q006q445p852o873o687p244
61674E05478p265o214n219n381o041n708m294l194l160l320k769j985j863k144
61660D46921j888j062m46k42J02O00N05l17r08o37j92m56j212j709j872k084k292
$$ y = [2746982, 2595125, 2455315, 2326745, 2208482, 2099423, 1998564, 1905156, 1818711, 1738963, 1665646, 1598188, 1535742, 1477603, 1423449, 1373158, 1326605, 1283689, 1244237, 1207836, 1174009, 1142609, 1113649, 1086655, 1060733, 1035549, 1011768, 990092, 970181, 950990, 931899, 913102, 895052, 877972, 861747, 845908, 829859, 813537, 797693, 783110, 769721, 756933, 744606, 733132, 722637, 712767, 703273, 694182, 685274, 676032, 666344, 656708, 647480, 638404, 629215, 620206, 611782, 603877, 596274, 589153, 582777, 576862, 570816, 564421, 557753, 550585, 542579, 534134, 526282, 519409, 512722, 505478, 498213, 491999, 486780, 481399, 475358, 469650, 465356, 462162, 459002, 455682, 452913, 450928, 449065, 446921, 445033, 443971, 443525, 443283, 443385, 443985, 444490, 444173, 443265, 442628, 442436, 441980, 440768, 439059, 437187, 435103, 432811]
61643D32811k221k134k435k795k559j869j466j449j152l88J71J53J56P58J484
61628D17065J376K31j224k236k609k496k051j417q99q78j387j869j680r72o70
61613C98284j245j932j703p43k10o59j479j988k221k374k238j655j011p58q34
61598C77234j004j257j442r93K72J480J568P27K69R63K192K954L100L185L498
61583C92746L809L985M315N117O215P116P590P874Q325R087J0154J1438J2589
61570D90360J3076J2813J2555J3213J4788J6378J7275J7601J7795J7921J7702
61559F61477J6927J5576J3909J2539J2041J2228J2251J1653J0944J0763J0887
61548H01195J0654R994R474R363R277Q765P763O472N144M100L510L089K326J132
$$ y = [432811, 430590, 428456, 426021, 423226, 420667, 418798, 417332, 415883, 414731, 414343, 414514, 414667, 414823, 415581, 417065, 418441, 418672, 417448, 415212, 412603, 410107, 408056, 406639, 405740, 404862, 403475, 401606, 399926, 398954, 398284, 397039, 395107, 393404, 392661, 392451, 391792, 390313, 388325, 386104, 383730, 381492, 379837, 378826, 378068, 377234, 376230, 374973, 373531, 372538, 372810, 374290, 375858, 376585, 376854, 377817, 380009, 382963, 386063, 389248, 392746, 396555, 400540, 404855, 409972, 416187, 423303, 430893, 438767, 447092, 456179, 466333, 477771, 490360, 503436, 516249, 528804, 542017, 556805, 573183, 590458, 608059, 625854, 643775, 661477, 678404, 693980, 707889, 720428, 732469, 744697, 756948, 768601, 779545, 790308, 801195, 811849, 821843, 831317, 840680, 849957, 858722, 866485, 872957, 878101, 882201, 885711, 888800, 891126, 892258]
61534H92258j21j251k515l963m944m731l428j923r01k53M90J532K776M208N952
61519H83186P990J0086J2055J3965J5973J8237K0962K4251K7805L1146L4347L8084
61507A138087M2606M7177N1190N5375O0923O7629P3994P9361Q4652R0572R6176
61496A887742J00088J02239J03441J03832J02814R9998R5112Q7331P5935O1666
61486B820198M6306L0831J4986j129j6195k8959l9442m8248n5277n9880o1942
61475B601249o2251o1891o1569o1300o0452n8364n5119n1497m8066m4704m1163
61464A994873l7593l4185l0598k6175k0569j4113p738k562R61L625O822J0993
61452A843741J5177J8261K0180K1572K2800K3892K5000K6359K7922K9511L1154
$$ y = [892258, 892137, 890886, 888371, 884408, 879464, 874733, 871305, 869382, 868481, 868228, 868718, 870250, 873026, 877234, 883186, 891176, 901262, 913317, 927282, 943255, 961492, 982454, 1006705, 1034510, 1065656, 1100003, 1138087, 1180693, 1227870, 1279060, 1334435, 1395358, 1462987, 1536981, 1616342, 1700994, 1791566, 1887742, 1987830, 2090069, 2193510, 2297342, 2400156, 2500154, 2595266, 2682597, 2758532, 2820198, 2866504, 2897335, 2912321, 2911192, 2894997, 2866038, 2826596, 2778348, 2723071, 2663191, 2601249, 2538998, 2477107, 2415538, 2354238, 2293786, 2235422, 2180303, 2128806, 2080740, 2036036, 1994873, 1957280, 1923095, 1892497, 1866322, 1845753, 1831640, 1823902, 1821340, 1822301, 1825926, 1832748, 1843741, 1858918, 1877179, 1897359, 1918931, 1941731, 1965623, 1990623, 2016982, 2044904, 2074415, 2105569]
61441B105569L2862L4339L5293L5809L5918L5046L2425K8102K3044J8285J4331
61430B431023J1336R294P963O885N682M229K559P35j193l218n238o855p629p679
61416B447894p738q394r677j1594j4438j8104k1495k3378k3657k3175k2517k1628
61404B242099k0372j8743j6573j3832j1246r797r477r260q481p470o583n395l420
61391B101450q88J725M567Q145J2490J7139K1849K6866L2563L9136M6538N4408
61379B365988O2213O9674P7025Q4572R2139R9163J05180J10022J13633J15845
61369C295454J16188J13857J08079R8728Q6356P1426N3868L3646J1620j0457l0817
61358C947948m8427o3161p5564q6377r5979j04192j10541j14612j16247j15795
$$ y = [2105569, 2138431, 2172770, 2208063, 2243872, 2279790, 2314836, 2347261, 2375363, 2398407, 2416692, 2431023, 2442359, 2451653, 2459616, 2466501, 2472183, 2476412, 2478971, 2479706, 2478513, 2475295, 2470057, 2463202, 2455573, 2447894, 2440156, 2431762, 2422085, 2410491, 2396053, 2377949, 2356454, 2333076, 2309419, 2286244, 2263727, 2242099, 2221727, 2202984, 2186411, 2172579, 2161333, 2151536, 2142059, 2132799, 2124318, 2116848, 2110265, 2104870, 2101450, 2100562, 2102287, 2106854, 2114999, 2127489, 2144628, 2166477, 2193343, 2225906, 2265042, 2311580, 2365988, 2428201, 2497875, 2574900, 2659472, 2751611, 2850774, 2955954, 3065976, 3179609, 3295454, 3411642, 3525499, 3633578, 3732306, 3818662, 3890088, 3943956, 3977602, 3989222, 3978765, 3947948, 3899521, 3836360, 3760796, 3674419, 3578440, 3474248, 3363707, 3249095, 3132848, 3017053]
61348C017053j14095j11855j08873j04463r8708r2686q7068q1255p4484o7201
61338B076365o0416n4103m7323l9852l2689k6742k1791j7078j2183p047j677L622
61326A759086Q311J2252J5942J9730K3194K5653K6922K7111K6028K3322J9111
61315A986662J4026Q744L890J78j852k357k059j610j242r55o00J64J539L099L936
61300B011563L508K122N24q13j901l089m755o885q793r666r594r716j0985j3075
61286A938445j4944j6166j7173j8182j8611j7794j5870j3541j1307r303p729o885
61274A770940o854p538r061j1750j5452j9190k1762k2668k2244k1060j9417j7406
61262A576538j5074j2419r374n953k325J366N245R543J4208J8781K2736K5967
$$ y = [3017053, 2902958, 2791103, 2682230, 2577767, 2479059, 2386373, 2299305, 2218050, 2143566, 2076365, 2015949, 1961846, 1914523, 1874671, 1841982, 1815240, 1793449, 1776371, 1764188, 1757141, 1755464, 1759086, 1767397, 1779649, 1795591, 1815321, 1838515, 1864168, 1891090, 1918201, 1944229, 1967551, 1986662, 2000688, 2009432, 2013322, 2013500, 2011648, 2009291, 2007232, 2005622, 2004380, 2003425, 2002825, 2002989, 2004528, 2007627, 2011563, 2015071, 2017193, 2017717, 2016904, 2015003, 2011914, 2007159, 2000274, 1991481, 1981815, 1972221, 1962505, 1951520, 1938445, 1923501, 1907335, 1890162, 1871980, 1853369, 1835575, 1819705, 1806164, 1794857, 1785554, 1777825, 1770940, 1764086, 1756548, 1747487, 1735737, 1720285, 1701095, 1679333, 1656665, 1634421, 1613361, 1593944, 1576538, 1561464, 1549045, 1539671, 1533718, 1531393, 1532759, 1538004, 1547547, 1561755, 1580536, 1603272, 1629239]
61250A629239K8869L2030L5855M0450M5630N0997N6053O0342O3558O5398O5324
61239B173745O2518N6351M7096L6136K5044J4297L177q780k0554l0494l8288m5225
61227B275023n2226n8409o2262o3647o3636o2683o0090n5554n0294m6017m3370
61216A656835m1841m0698l9417l7638l5330l2860l0405k7519k3943k0661j9393
61205A307130k0762k3435k5331k5342k3792k1646j9641j8016j6751j5835j5241
61194A081338j4714j3933j3047j2733j3338j4179j4221j3351j2362j1806j1485
61183I36169j1206j1196j1430j1196r931q065o507n581m933m188l131j567M07
61170H47645K183L308M224N752P859R617J0281R626P291K757l460r512j3791j6333
$$ y = [1629239, 1658108, 1690138, 1725993, 1766443, 1812073, 1863070, 1919123, 1979465, 2043023, 2108421, 2173745, 2236263, 2292614, 2339710, 2375846, 2400890, 2415187, 2418364, 2409584, 2389030, 2358536, 2320248, 2275023, 2222797, 2164388, 2102126, 2038479, 1974843, 1912160, 1852070, 1796516, 1746222, 1700205, 1656835, 1614994, 1574296, 1534879, 1497241, 1461911, 1429051, 1398646, 1371127, 1347184, 1326523, 1307130, 1286368, 1262933, 1237602, 1212260, 1188468, 1166822, 1147181, 1129165, 1112414, 1096579, 1081338, 1066624, 1052691, 1039644, 1026911, 1013573, 999394, 985173, 971822, 959460, 947654, 936169, 924963, 913767, 902337, 891141, 881210, 873145, 866638, 861057, 856124, 851936, 848805, 847238, 847645, 849828, 853136, 857360, 863112, 870971, 880588, 890869, 900495, 907786, 910543, 907083, 897571, 883780, 867447]
61156H67447j8029j8999j8696j7254j5745j4876j4297j3453j2487j1835j1503
61145G00273j1158j0709j0289r945r630r363r071q517p731p251p520q130q187
61132E82772p359o170n189m423l629k738j725m44J043K302L057L652M548N509
61118E71206N680M451J976j171m421p314r506j0944j1786j2125j1913j1221j0327
61105D92585r405q445p579p167p317p535p250o548o003n886n873n619n192m831
61091C97935m577m378m316m385m208l381k097j088q36j057j070n07N15J674K683
61076C70907L340L638L843M223M670M760M301L657L429L932N049O399P526Q020
61062D37694P700O749N592M607M027L886L924L581K414O69p51j054l69L30J51
$$ y = [867447, 849418, 830419, 811723, 794469, 778724, 763848, 749551, 736098, 723611, 711776, 700273, 689115, 678406, 668117, 658172, 648542, 639179, 630108, 621591, 613860, 606609, 599089, 590959, 582772, 575413, 569243, 564054, 559631, 556002, 553264, 551539, 551095, 552138, 554440, 557497, 561149, 565697, 571206, 576886, 581337, 583313, 582142, 577721, 570407, 560901, 549957, 538171, 526046, 514133, 502912, 492585, 483180, 474735, 467156, 459989, 452672, 445137, 437887, 431339, 425336, 419450, 413577, 407958, 402766, 397935, 393358, 388980, 384664, 380279, 376071, 372690, 370593, 369505, 368669, 367612, 366542, 366035, 366550, 368224, 370907, 374247, 377885, 381728, 385951, 390621, 395381, 399682, 403339, 406768, 410700, 415749, 422148, 429674, 437694, 445394, 452143, 457735, 462342, 466369, 470255, 474179, 477760, 480174, 480843, 480092, 479038, 478669, 478999, 479150]
61047D79150r19k103k596k157j145k17j8q29k270l485l895l713l365k637q84J788
61031D50705M185N273N419N881P292R200J0954J2476J4004J5644J7463J9690K2598
61018F00784K6294L0834L6346M2918N0653N9932P1257Q4404R7709J08130J11761
61007A321022J04537Q3986N2069J6624j1478k4355k1303p700R142K2506K6255
60996A571305J5420j0677m5857p9116j00788j07602j02707r1729p8943o6159n3801
60985H49346m2282l2339k4456j8334j3232q806n311l005j712j099j046j410j809
60972F94505j990k281l158m556n946o987p715q190q469q884r785j0948j1702j1820
60958E92074j1787j2020j2292j2214j1855j1609j1663j1906j2031j1566j0186
$$ y = [479150, 478231, 476128, 473532, 471375, 470230, 470013, 469995, 469166, 466896, 463411, 459516, 455803, 452438, 449801, 448917, 450705, 454890, 460163, 465582, 471463, 478755, 487955, 498909, 511385, 525389, 541033, 558496, 578186, 600784, 627078, 657912, 694258, 737176, 787829, 847761, 919018, 1003422, 1101131, 1209261, 1321022, 1425559, 1509545, 1561614, 1578238, 1566760, 1542405, 1521102, 1513402, 1522544, 1545050, 1571305, 1586725, 1576048, 1530191, 1451075, 1350287, 1242685, 1139978, 1048249, 969306, 903147, 849346, 807064, 774725, 750269, 731935, 718703, 709897, 704586, 701581, 699869, 698770, 697724, 696314, 694505, 692515, 690234, 687076, 682520, 676574, 669587, 661872, 653682, 645213, 636329, 626544, 615596, 603894, 592074, 580287, 568267, 555975, 543761, 531906, 520297, 508634, 496728, 484697, 473131, 462945]
60947D62945q243o669n938n436m263k376m91R64K231L606M920N824O236O358O301
60932D65969N918N041L937L321L612M191L942K645J321Q22O90n3j395k442k776
60917D94743k843k997k998k711k580k931l380l347k869k466k442k688l012l314
60903D54165l533l725m128m858n635n991n830n581n770o475p178p221o428n327
60889C76485m606m336l943k986j764q90l91M14K098M331O158P044P424Q109R287
60874D02434J0441J1147J1503J1617J1097R511P162M869L137J957J381J669K704
60861D90629L770M242M083L408J942n48l487n657o234n423m099l030k502k373
60847D74721k447k719l282l988m497m770n302o466p786q260p464o002m679l642
$$ y = [462945, 454702, 448033, 442095, 436659, 432396, 430020, 429529, 430493, 432724, 436330, 441250, 447074, 453310, 459668, 465969, 471887, 476928, 480865, 484186, 487798, 491989, 495931, 498576, 499897, 500719, 501409, 501356, 499961, 497519, 494743, 491900, 488903, 485905, 483194, 480614, 477683, 474303, 470956, 468087, 465621, 463179, 460491, 457479, 454165, 450632, 446907, 442779, 437921, 432286, 426295, 420465, 414884, 409114, 402639, 395461, 388240, 381812, 376485, 371879, 367543, 363600, 360614, 358850, 357960, 357569, 357983, 360081, 364412, 370570, 377614, 385038, 393147, 402434, 412875, 424022, 435525, 447142, 458239, 467750, 474912, 479781, 482918, 484875, 486256, 487925, 490629, 494399, 498641, 502724, 506132, 508074, 507526, 504039, 498382, 492148, 486725, 482626, 479596, 477094, 474721, 472274, 469555, 466273, 462285, 457788, 453018, 447716, 441250, 433464, 425204, 417740, 411738, 407059, 403417]
60833D03417k633j754j454j803k246k318k191k245k403k308k020j968k216k230
60819C73628j613o81m0J59K58M99P44O91K15m81r26p49m2P63J443K125K762K912
60801C81667K337J528J183J384J698J849J909J966K075K318K593K592K355K457
60787D09911L021L094J829M7n30L59J104M28j012j768j429o24J03O21Q34O48K23
60770D16859j92m44l67J51P74R15N80M17O07M65m05j316j470j032m97K44J283
60753D16572J757P84j032k174k216k195k936m062m849n142n074m640l949l357
60739C77487l052k849k472j695l52J258K267K179J758K129L149L715L573L581
60725C90676L968L725K275N92k33n81j466k839l842m222m453m727m788m681m756
$$ y = [403417, 400784, 399030, 397576, 395773, 393527, 391209, 389018, 386773, 384370, 382062, 380042, 378074, 375858, 373628, 372015, 371334, 371294, 371453, 371711, 372210, 372954, 373645, 373860, 373379, 372453, 371704, 371662, 372425, 373868, 375993, 378755, 381667, 384004, 385532, 386715, 388099, 389797, 391646, 393555, 395521, 397596, 399914, 402507, 405099, 407454, 409911, 412932, 416026, 417855, 417902, 417372, 417731, 418835, 419263, 418251, 416483, 415054, 414430, 414533, 415154, 415988, 416636, 416859, 416667, 416223, 415856, 416007, 416781, 417696, 418276, 418693, 419300, 419765, 419360, 418044, 416574, 415542, 415045, 415289, 416572, 418329, 419113, 418081, 415907, 413691, 411496, 408560, 404498, 399649, 394507, 389433, 384793, 380844, 377487, 374435, 371586, 369114, 367419, 367067, 368325, 370592, 372771, 374529, 376658, 379807, 383522, 387095, 390676, 394644, 398369, 400644, 401236, 401003, 400422, 398956, 396117, 392275, 388053, 383600, 378873, 374085, 369404, 364648]
60710C64648m994m988m626m183l775l331l059l273l700l677l097k593k539k499
60696C14314j937j029l91l18o10r26r80n83K23J112J776K220K621K978L086K890
60680C24446K661K646K698K418J761J238J407K220L125L696L970M168M383M546
60666C65383M474L984L280L143M286O362Q081Q573Q195P781P590P439P395P623
60652D53589P759P124N612L877K551J616P12l45j423k295k821l057l165l173k965
60637D63596k617k534k904l260l047k476k325k796l140k618j489p13q75j685k418
60622D28699k607k322j916j653j529j362r17j4J226K194K151J089n4l48R6L74
60606D23107p9j021j918k459k510j959q45N17J688K273K003R90k00r05r30n53
$$ y = [364648, 359654, 354666, 350040, 345857, 342082, 338751, 335692, 332419, 328719, 325042, 321945, 319352, 316813, 314314, 312377, 311348, 310957, 310639, 310029, 309103, 308123, 307540, 307763, 308875, 310651, 312871, 315492, 318470, 321556, 324446, 327107, 329753, 332451, 334869, 336630, 337868, 339275, 341495, 344620, 348316, 352286, 356454, 360837, 365383, 369857, 373841, 377121, 380264, 384550, 390912, 398993, 407566, 415761, 423542, 431132, 438571, 445966, 453589, 461348, 468472, 474084, 477961, 480512, 482128, 482840, 482495, 481072, 478777, 475956, 472899, 469734, 466561, 463596, 460979, 458445, 455541, 452281, 449234, 446758, 444433, 441637, 438497, 435879, 434390, 433677, 432802, 431117, 428699, 426092, 423770, 421854, 420201, 418672, 417310, 416393, 416379, 417605, 419799, 421950, 423039, 422985, 422637, 422733, 423107, 423028, 422007, 420089, 417630, 415120, 413161, 412316, 412833, 414521, 416794, 418797, 419787, 419587, 418682, 417752, 417199]
60590D17199j33R1lk43j36N19J102P77l03j055q42k26%j05Q4O93J268J532J717
60571D21936K072K411K355J849J292J145J373J451J023M40L24O99R91R63J125
60556D41449J962L195M120M482M650N162O349Q210J0297J1971J3027J4002J5549
60543E44425J7643J9679K1209K2272K3073K3551K3270K1527J7778J2180N680o72
60531G51615o418j1549j5856j8775j9843j9126j7262j5162j3443j1978j0119p600
60519E84484n024l170k082j204j20J240K987N226P645R762J1672J4115J7488K1207
60505F64226K4229K5942K6224K5000K2098J7605J2076O341J136l087o038p417
60493H08335p059n253k592O96M988J0520J6741K2904K8993L5483M2316M8886N5145
$$ y = [417199, 417066, 417157, 417154, 416911, 416775, 417294, 418396, 419173, 418870, 417815, 416973, 416747, 416747, 416642, 416726, 417419, 418687, 420219, 421936, 424008, 426419, 428774, 430623, 431915, 433060, 434433, 435884, 436907, 437347, 437671, 438370, 439361, 440324, 441449, 443411, 446606, 450726, 455208, 459858, 465020, 471369, 479579, 489876, 501847, 514874, 528876, 544425, 562068, 581747, 602956, 625228, 648301, 671852, 695122, 716649, 734427, 746607, 752287, 751615, 745197, 733648, 717792, 699017, 679174, 660048, 642786, 627624, 614181, 602203, 592084, 584484, 579460, 576290, 574208, 573004, 572884, 574124, 577111, 582337, 589982, 599744, 611416, 625531, 643019, 664226, 688455, 714397, 740621, 765621, 787719, 805324, 817400, 823741, 824877, 821790, 815752, 808335, 801276, 796023, 793431, 794127, 799115, 809635, 826376, 849280, 878273, 913756, 956072, 1004958, 1060103]
60480A060103O1881O9624P7903Q6010R3812J01198J07052J09269J05618R4341
60470A966811P4670M7626J6125j6425m7639p5975r9478j15873j24113j25140j20803
60459A379786j12659j02102r0835q0341p0974o2231n3846m6153l9480l3759k8914
60448F58492k5168k2534k0365j7852j4949j2403j0758r673q477p067n931n381
60436D97934n217n157n129n064m699l909k938k108j485j050r33j114j198q51l34
60421D56748j90m98p87o36n1O97J255J297Q62N11P01J174J411J647K574M021M821
60404D75557M441L912M486O001P333P955Q198Q298Q142P889P820P536O260M275
60390E68103L078L510M464M242K728J359J163J653J796J325P57N37O58Q79R92
$$ y = [1060103, 1121984, 1191608, 1269511, 1355521, 1449333, 1550531, 1657583, 1766852, 1872470, 1966811, 2041481, 2089107, 2105232, 2088807, 2041168, 1965193, 1865715, 1749842, 1625729, 1500589, 1379786, 1267127, 1165025, 1074190, 993849, 922875, 860644, 806798, 760645, 721165, 687406, 658492, 633324, 610790, 590425, 572573, 557624, 545221, 534463, 524790, 516313, 509246, 503315, 497934, 492717, 487560, 482431, 477367, 472668, 468759, 465821, 463713, 462228, 461178, 460245, 459131, 457933, 457082, 456748, 456558, 456060, 455273, 454637, 454586, 455283, 456538, 457835, 458697, 459208, 459909, 461083, 462494, 464141, 466715, 470736, 475557, 479998, 483910, 488396, 494397, 501730, 509685, 517883, 526181, 534323, 542212, 550032, 557568, 563828, 568103, 571181, 574691, 579155, 583397, 586125, 587484, 588647, 590300, 592096, 593421, 594178, 594715, 595373, 596252, 597244]
60375E97244Q95O58N84R94J831K608K862K622K322K256K378K598L023L700M302
60360F30877M456M215M006M079M278M296L908K965J544J16p98j251j735k373k709
60345F55874k554k483l004l643l486k496j677j865k873l941m626n012n385n952
60331F06877o678p224p150o331n168m286m092m524n132n403n145m642m330m400
60317E32372m721m996m866m031k650j473j208j722k143j816q82Q8O88Q52P48O66
60301E04906P70Q42M70l59j146j406j208r76r87j184j297j060m86P2K48J26J72
60284D97497O55J403K123K676L010L168L355L622L459K310O65p5P27K033K461
60269E29089K025J819K381L226L857M329M720M816M632M666N289O286P114P377
$$ y = [597244, 598139, 598797, 599381, 600375, 602206, 604814, 607676, 610298, 612620, 614876, 617254, 619852, 622875, 626575, 630877, 635333, 639548, 643554, 647633, 651911, 656207, 660115, 663080, 664624, 664740, 663942, 662691, 660956, 658583, 655874, 653320, 650837, 647833, 644190, 640704, 638208, 636531, 634666, 631793, 627852, 623226, 618214, 612829, 606877, 600199, 592975, 585825, 579494, 574326, 570040, 565948, 561424, 556292, 550889, 545744, 541102, 536772, 532372, 527651, 522655, 517789, 513758, 511108, 509635, 508427, 506705, 504562, 502746, 501864, 501952, 502640, 503492, 504240, 504906, 505676, 506518, 506988, 506629, 505483, 504077, 502869, 501893, 500906, 499722, 498425, 497365, 496879, 496951, 497199, 497325, 497497, 498152, 499555, 501678, 504354, 507364, 510532, 513887, 517509, 520968, 523278, 523943, 523868, 524595, 526628, 529089, 531114, 532933, 535314, 538540, 542397, 546726, 551446, 556262, 560894, 565560, 570849, 577135, 584249, 591626]
60255E91626O950O053N366N537O406P110P200P299Q271J0088J1864J2855J3127
60242F99752J3295J3901J5087J6710J8722K1269K4295K7274K9698L1893L4800
60231I46696L8816M3221M7156N0745N4838N9723O4579O8279P0513P1964P3341
60220A589871P4408P4132P1823O7900O3180N7701N0828M2496L3673K5336J7496
60209B168844R645J743n770j2566j8578k3630k7378k9536k9921k8445k5328k1156
60197A957924j6419j1130n130J425Q223J5227K2635L0518L8811M7374N5809O3509
60185B208776P0252P6341Q1641Q4845Q4512Q0603P4249O6140N6044M3989L0876
60174B958268J7490L760j0443k4361l6888m7637n6906o4859p1212p5506p7222
$$ y = [591626, 598576, 604629, 609995, 615532, 621938, 629048, 636248, 643547, 651818, 661906, 673770, 686625, 699752, 713047, 726948, 742035, 758745, 777467, 798736, 823031, 850305, 880003, 911896, 946696, 985512, 1028733, 1075889, 1126634, 1181472, 1241195, 1305774, 1374053, 1444566, 1516530, 1589871, 1664279, 1738411, 1810234, 1878134, 1941314, 1999015, 2049843, 2092339, 2126012, 2151348, 2168844, 2178489, 2180232, 2174462, 2161896, 2143318, 2119688, 2092310, 2062774, 2032853, 2004408, 1979080, 1957924, 1941505, 1930375, 1925245, 1926670, 1934893, 1950120, 1972755, 2003273, 2042084, 2089458, 2145267, 2208776, 2279028, 2355369, 2437010, 2521855, 2606367, 2686970, 2761219, 2827359, 2883403, 2927392, 2958268, 2975758, 2979518, 2969075, 2944714, 2907826, 2860189, 2803283, 2738424, 2667212, 2591706, 2514484]
60163B514484p5855p1422o4842n7322m9372m0698l0981k0407r430J719J3029K4346
60151B133249L4998M3960N0555N4934N7524N8049N5693N0350M3088L4874K5528
60140B642802J4640L100p216j5244k1401k6394l0140l2059l1827k9361k4632j7804
60128B424464r347L42J1125K2801L4937M7310O0140P3552Q7087J00224J13153
60117B965788J26521J40443J54219J67102J78898J89505J98186K03773K05650
60108D530085K04190J99915J92332J80128J62757J41480J18358R4267O8494M0410
60098E932416J0939j8057m5471p1464r6352j19561j39799j55938j67522j74602
60088D954589j77414j76230j71421j63529j53122j40558j26008j09839r2849p5968
$$ y = [2514484, 2438629, 2367207, 2302365, 2245043, 2195671, 2154973, 2123992, 2103585, 2094155, 2095874, 2108903, 2133249, 2168247, 2212207, 2262762, 2317696, 2375220, 2433269, 2488962, 2539312, 2582400, 2617274, 2642802, 2657442, 2660542, 2653326, 2638082, 2616681, 2590287, 2560147, 2528088, 2496261, 2466900, 2442268, 2424464, 2415117, 2415459, 2426584, 2449385, 2484322, 2531632, 2591772, 2665324, 2752411, 2852635, 2965788, 3092309, 3232752, 3386971, 3554073, 3732971, 3922476, 4120662, 4324435, 4530085, 4734275, 4934190, 5126522, 5306650, 5469407, 5610887, 5729245, 5823512, 5892006, 5932416, 5943355, 5925298, 5879827, 5808363, 5712011, 5592450, 5452651, 5296713, 5129191, 4954589, 4777175, 4600945, 4429524, 4265995, 4112873, 3972315, 3846307, 3736468, 3643619, 3567651]
60078C567651n9764m4345k9642j5606k276J0072K0845K9506L6080M1007M4326
60067C597854M5385M3611L9349L3519K6507J7873P395m029j4991k4964l4591m4482
60055C688436n4115o2366o8876p4338p9347q3474q5799q6027q4703q2420p9138
60044B847833p4389o7834n9607n0230m0287l0040j9310p842M227J6404K8307L9888
60032B587120N1169O1969P1944Q0708Q7785R2589R4601R3518Q9134Q1399P0657
60021C462593N7696M3285K7799J1443n257k1543l6972n1581o5355p7702q7597
60010C256809r4249r7540r7905r5821r1405q4605p5794o5989n6233m6777l7105
59999B413386k6798j6068n313N501J6675K8193L9787N1501O3652P6044Q7682R7708
$$ y = [3567651, 3507887, 3463542, 3433900, 3418294, 3416018, 3426090, 3446935, 3476441, 3512521, 3553528, 3597854, 3643239, 3686850, 3726199, 3759718, 3786225, 3804098, 3811493, 3807464, 3792473, 3767509, 3732918, 3688436, 3634321, 3571955, 3503079, 3428741, 3349394, 3265920, 3180121, 3094094, 3009391, 2926971, 2847833, 2773444, 2705610, 2646003, 2595773, 2555486, 2525446, 2506136, 2498294, 2502521, 2518925, 2547232, 2587120, 2638289, 2700258, 2772202, 2852910, 2940695, 3033284, 3127885, 3221403, 3310537, 3391936, 3462593, 3520289, 3563574, 3591373, 3602816, 3597559, 3576016, 3539044, 3487463, 3422108, 3344406, 3256809, 3162560, 3065020, 2967115, 2871294, 2779889, 2695284, 2619490, 2553501, 2497268, 2450491, 2413386, 2386588, 2370520, 2365207, 2370708, 2387383, 2415576, 2455363, 2506864, 2570516, 2646560, 2734242, 2831950]
59987B831950J06300J14056J20468J23671J22055J15702J05806R3037P7279N9029
59977C869353M0146K2471N986j0938k9360m8351o5880q0579r2188j00671j05556
59966C404433j06324j03078r6579q7741p7245o5474n2703l9355k6085j3431j371
59955B735047J0600K2716L4414M4741N3273O0372O6560P1771P5338P6503P4986
59944C326321P1149O5797N9699N3140M5918L7794K8966K0097J1995N270J88l210
59932C723124m793m148p89N355J3868K4296L6517N0473O5771Q1800R8191J14861
59920D204526J31599J47868J63005J76298J86797J93460J95637J93127J85591
59911E777908J72322J52887J27752R7839O3819K6465j2371m9932q3984j13596
$$ y = [2831950, 2938250, 3052306, 3172774, 3296445, 3418500, 3534202, 3640008, 3733045, 3810324, 3869353, 3909499, 3931970, 3937956, 3927018, 3897658, 3849307, 3783427, 3702848, 3610660, 3509989, 3404433, 3298109, 3195031, 3098452, 3010711, 2933466, 2867992, 2815289, 2775934, 2749849, 2736418, 2735047, 2745647, 2768363, 2802777, 2847518, 2900791, 2961163, 3027723, 3099494, 3174832, 3251335, 3326321, 3397470, 3463267, 3522966, 3576106, 3622024, 3659818, 3688784, 3708881, 3720876, 3726146, 3726334, 3723124, 3718331, 3714183, 3713394, 3718749, 3732617, 3756913, 3793430, 3843903, 3909674, 3991474, 4089665, 4204526, 4336125, 4483993, 4646998, 4823296, 5010093, 5203553, 5399190, 5592317, 5777908, 5950230, 6103117, 6230869, 6328708, 6392527, 6418992, 6406621, 6356689, 6272705, 6159109]
59901F159109j38282j57066j69113j74954j76239j74090j68304j58445j45134
59892D697482j29760j13268r5844p7725n9666m2358k5744r348O949K2746L7616
59881D211080N1420O4108P5578Q5680R4025R9634J01153R7798Q9864P8078O2674
59870E111092M3622K1604j769k4937m7109o7845q6446j02192j14945j24960j32269
59859D473846j36751j38717j38885j37564j34381j29109j22329j14845j06749
59850C314516r7608q7546p7609o8888o1586n5226m9490m4538m0519l7121l3897
59839B660488l0844k8423k6796k5321k3197k0549j8568j8299j9552k1171k2213
59828B405555k2499k2295k1896k1530k1152k0220j8052j4649j0776p083l496K30
$$ y = [6159109, 6020827, 5863761, 5694648, 5519694, 5343455, 5169365, 5001061, 4842616, 4697482, 4567722, 4454454, 4358610, 4280885, 4221219, 4178861, 4153117, 4143769, 4150718, 4173464, 4211080, 4262500, 4326608, 4402186, 4487866, 4581891, 4681525, 4782678, 4880476, 4970340, 5048418, 5111092, 5154714, 5176318, 5174549, 5149612, 5102503, 5034658, 4948212, 4846020, 4731075, 4606115, 4473846, 4337095, 4198378, 4059493, 3921929, 3787548, 3658439, 3536110, 3421265, 3314516, 3216908, 3129362, 3051753, 2982865, 2921279, 2866053, 2816563, 2772025, 2731506, 2694385, 2660488, 2629644, 2601221, 2574425, 2549104, 2525907, 2505358, 2486790, 2468491, 2448939, 2427768, 2405555, 2383056, 2360761, 2338865, 2317335, 2296183, 2275963, 2257911, 2243262, 2232486, 2225403, 2221907, 2222137]
59816B222137L801O705R004J1226J3537J5432J6384J6379J5837J5160J4405J3120
59804B373127J0680P153L663J355J45q63j707j218J355N309R771J5210K2680L2050
59790B478710M2089N2264O3314P5936Q9929J05075J21948J41050J61749J82706
59780C514770K02738K20274K32155K33929K21665J93223J48330Q8932K0284m9113
59770E027187j10234j57039j87733k03227k05338j96541j80408j60935j40918
59761C484814j21211j01715q2723o5045m9164l4940k2174j0965j236P648J6362
59750C019651K4851L2560L9406M6116N3438O1349O9318P7133Q5180R4001J03845
59739C706848J14707J26568J39443J53335J68285J84369K01614K19920K39176
$$ y = [2222137, 2225938, 2232643, 2241647, 2252873, 2266410, 2281842, 2298226, 2314605, 2330442, 2345602, 2360007, 2373127, 2383807, 2390960, 2394623, 2395978, 2396123, 2395260, 2393553, 2392335, 2393690, 2398999, 2408770, 2423980, 2446660, 2478710, 2520799, 2573063, 2636377, 2712313, 2802242, 2907317, 3029265, 3170315, 3332064, 3514770, 3717508, 3937782, 4169937, 4403866, 4625531, 4818754, 4967084, 5056016, 5076300, 5027187, 4916953, 4759914, 4572181, 4368954, 4163616, 3967075, 3786667, 3625732, 3484814, 3363603, 3261888, 3179165, 3114120, 3064956, 3030016, 3007842, 2996877, 2995641, 3003289, 3019651, 3044502, 3077062, 3116468, 3162584, 3216022, 3277371, 3346689, 3423822, 3509002, 3603003, 3706848, 3821555, 3948123, 4087566, 4240901, 4409186, 4593555, 4795169, 5015089, 5254265]
59730E254265K59361K80382L01769L22605L41841L58498L71518L79542L81075
59721H250856L75023L61128L40108L13513K83480K52404K22671J96441J75412
59712A0771036J60527J51777J48248J48338J50121J51857J52478J51517J48499
59703A2134398J42604J33193J20502J05496Q9046P1593N3643L6243K0735Q239
59693A2915692n23n129n327q58Q557K2874M1416O3392Q8745J18008J50947J85876
59681A3583670K20767K54677K87437L18295L45576L67665L83442L91474L89446
59672A6542449L74979L46851L05061K50037J82291J03109J5416p6205j66524k50846
59662A7626618l25495l87460m34221m64348m78221m77838m66058m46439m23644
$$ y = [5254265, 5513626, 5794008, 6095777, 6418382, 6760223, 7118721, 7490239, 7869781, 8250856, 8625879, 8987007, 9327115, 9640628, 9924108, 10176512, 10399183, 10595624, 10771036, 10931563, 11083340, 11231588, 11379926, 11530047, 11681904, 11834382, 11985899, 12134398, 12277002, 12410195, 12530697, 12636193, 12725239, 12796832, 12850475, 12886718, 12907453, 12915692, 12915169, 12910040, 12904713, 12903855, 12912412, 12935286, 12976702, 13040094, 13128839, 13246847, 13397794, 13583670, 13804437, 14059114, 14346551, 14664846, 15010422, 15378087, 15761529, 16153003, 16542449, 16917428, 17264279, 17569340, 17819377, 18001668, 18104777, 18120193, 18043988, 17877464, 17626618, 17301123, 16913663, 16479442, 16015094, 15536873, 15059035, 14592977, 14146538, 13722894]
59653A3722894m03282l90795l90315m03919m30780m66301n02754n31936n48096
59644I654716n49104n35974n11938m81277m47707m13276l78867l45461l14281
59635E676831k85870k59829k35743k13788j94131j76348j59845j44481j30312
59626C876484j17079j04462r2606q1923p2469o4059n6846n1119m6478m1922l7094
59615C110427l2931l0577k9990l0148l0382l0941l2242l4149l6245l8354m0469
59604B743999m2352m3585m3954m3601m2715m1244l8974l5863l2294k8871k5929
59593B324617k3288k0669j8157j6000j3959j1408q218n119k721n72K280N926R425
59580B222137J1995J3923J5981J8453K1032K3439K5758K8236L0987L3912L6813
$$ y = [13722894, 13319612, 12928817, 12538502, 12134583, 11703803, 11237502, 10734748, 10202812, 9654716, 9105612, 8569638, 8057700, 7576423, 7128716, 6715440, 6336573, 5991112, 5676831, 5390961, 5131132, 4895389, 4681601, 4487470, 4311122, 4151277, 4006796, 3876484, 3759405, 3654943, 3562337, 3480414, 3407945, 3343886, 3287040, 3235921, 3189443, 3147521, 3110427, 3077496, 3046919, 3016929, 2986781, 2956399, 2925458, 2893216, 2859067, 2822822, 2784468, 2743999, 2701647, 2658062, 2614108, 2570507, 2527792, 2486548, 2447574, 2411711, 2379417, 2350546, 2324617, 2301329, 2280660, 2262503, 2246503, 2232544, 2221136, 2212918, 2207799, 2205078, 2204506, 2206786, 2212712, 2222137, 2234132, 2248055, 2264036, 2282489, 2303521, 2326960, 2352718, 2380954, 2411941, 2445853, 2482666]
59569B482666L9589M2370M5457M9093N3377N8293O3691O9249P4698Q0092Q5663
59558C144238R1349R6784J01815J06800J12109J17509J22191J25346J26635J26128
59548D270904J23697J18399J08629R3576P4685N5254L8140K3986J1695P7j1426
59537D907616k2993l4488m5221n4384o1922o8504p4499p9329q2095q2304p9844
59526D222033p4669o7033n7759m7725l6998k4825j0558N686K3290M1729O0718
59515D033889P9977R9214J18305J37062J54639J69359J79498J84146J83095J75966
59505E515150J61869J40225J11637P7763M0455J288l8195p6209j10815j40303
59495E682865j63441j79569j88614j91042j87764j79881j68329j53665j36384
$$ y = [2482666, 2522255, 2564625, 2610082, 2659175, 2712552, 2770845, 2834536, 2903785, 2978483, 3058575, 3144238, 3235587, 3332371, 3434186, 3540986, 3653095, 3770604, 3892795, 4018141, 4144776, 4270904, 4394601, 4513000, 4621629, 4715205, 4789890, 4845144, 4883284, 4907270, 4918965, 4919042, 4907616, 4884623, 4850135, 4804914, 4750530, 4688608, 4620104, 4545605, 4466276, 4384181, 4301877, 4222033, 4147364, 4080331, 4022572, 3974847, 3937849, 3913024, 3902466, 3908152, 3931442, 3973171, 4033889, 4113866, 4213080, 4331385, 4468447, 4623086, 4792445, 4971943, 5156089, 5339184, 5515150, 5677019, 5817244, 5928881, 6006644, 6047099, 6048387, 6010192, 5933983, 5823168, 5682865, 5519424, 5339855, 5151241, 4960199, 4772435, 4592554, 4424225, 4270560, 4134176]
59486D134176j17379r7900p8936o0819m3487k6892j1037M023J7970L0234M0515
59475C790468M9057N6135O1382O3952O3234N9141N1875M1682K8839J3634l487
59464D275912k1626l9552n6439p2194q6752r9424j09495j17137j23009j27052
59454C423232j28561j27506j24987j22047j18639j14176j08543j02166r5433q8556
59444B292618q1808p5494o9735o4368n9066n3549m7897m2624l8099l3947k9431
59433A696600k4452j9603j5219j0954o508k112J999O010J0078J4003J7504K0128
59421A687474K0541J6930R169K6o728r318q472n584j438L442Q398J2877J6225
59408A743542J7234J4813R504L602n81k086q74K881Q448J4296J9172K3207K7418
$$ y = [4134176, 4016797, 3918897, 3839961, 3779142, 3735655, 3708763, 3697726, 3701749, 3719719, 3749953, 3790468, 3839525, 3895660, 3957042, 4020994, 4084228, 4143369, 4195244, 4236926, 4265765, 4279399, 4275912, 4254286, 4214734, 4158295, 4086101, 3999349, 3899925, 3790430, 3673293, 3550284, 3423232, 3294671, 3167165, 3042178, 2920131, 2801492, 2687316, 2578773, 2476607, 2381174, 2292618, 2210810, 2135316, 2065581, 2001213, 1942147, 1888598, 1840701, 1798077, 1759978, 1726031, 1696600, 1672148, 1652545, 1637326, 1626372, 1619864, 1617752, 1619751, 1625761, 1635839, 1649842, 1667346, 1687474, 1708015, 1724945, 1734114, 1734140, 1727412, 1718094, 1709622, 1704038, 1702600, 1706042, 1714440, 1727317, 1743542, 1760776, 1775589, 1785093, 1788695, 1788114, 1786028, 1785154, 1788035, 1796483, 1810779, 1829951, 1853158, 1880576]
59395A880576L2286L7458M2553M7581N2582N7495O2491O7955P3970Q0242Q6718
59384B521907R3851J01944J10554J18902J26812J34978J44380J55725J69298J84956
59374C863307K02241K20834K41036K63384K87568L12076L35224L56225L74808
59365F456703L90044M00178M03551L99272L87173L67855L42915L14333K83255
59356I745279K49830K14349J77743J40627J02642O3305K2832j8659o1961j07655
59346A0528332j54608k00664k44664k86575l25629l59600l86350m05039m15434
59337G749769m17101m10155l96096l77060l54608l29815l04025k78637k54311
59328D627961k31086k09178j89030j70641j53510j37413j22683j09506r7422q5910
$$ y = [1880576, 1912862, 1950320, 1992873, 2040454, 2093036, 2150531, 2213022, 2280977, 2354947, 2435189, 2521907, 2615758, 2717702, 2828256, 2947158, 3073970, 3208948, 3353328, 3509053, 3678351, 3863307, 4065548, 4286382, 4527418, 4790802, 5078370, 5390446, 5725670, 6081895, 6456703, 6846747, 7246925, 7650476, 8049748, 8436921, 8804776, 9147691, 9462024, 9745279, 9995109, 10209458, 10387201, 10527828, 10630470, 10693775, 10716607, 10697948, 10635987, 10528332, 10373724, 10173060, 9928396, 9641821, 9316192, 8956592, 8570242, 8165203, 7749769, 7332668, 6922513, 6526417, 6149357, 5794749, 5464934, 5160909, 4882272, 4627961, 4396875, 4187697, 3998667, 3828026, 3674516, 3537103, 3414420, 3304914, 3207492, 3121582]
59318C121582p5224o6186n9163n3558m8447m3545l9275l5954l3273l0697k8119
59307B608141k5823k3982k2473k1126j9825j8484j7150j5999j4915j3317j0866
59296B404181q185o138m430j694K770Q009J2556J6014J9005K2113K5406K8750
59284B518357L1958L4701L6728L8030L8530L7717L5043L0556K4771J7973J0004
59273B854368Q49q900j8278k6578l3744m0134m5853n0470n3569n5449n6793n7771
59261B407678n8006n7508n6879n6300n5057n2627m9653m7118m4940m2188l8446
59250A848956l4215l0136k6416k3014j9713j6081j1891p542l533L02M464Q792
59238A689973J2595J5790J9105K2973K6975L0658L4286L8367M3001M8095N3811
$$ y = [3121582, 3046358, 2980172, 2921009, 2867451, 2819004, 2775459, 2736184, 2700230, 2666957, 2636260, 2608141, 2582318, 2558336, 2535863, 2514737, 2494912, 2476428, 2459278, 2443279, 2428364, 2415047, 2404181, 2395996, 2389858, 2385428, 2383734, 2386504, 2394513, 2407069, 2423083, 2442088, 2464201, 2489607, 2518357, 2550315, 2585016, 2621744, 2659774, 2698304, 2736021, 2771064, 2801620, 2826391, 2844364, 2854368, 2855217, 2846317, 2828039, 2801461, 2767717, 2727583, 2681730, 2631260, 2577691, 2522242, 2465449, 2407678, 2349672, 2292164, 2235285, 2178985, 2123928, 2071301, 2021648, 1974530, 1929590, 1887402, 1848956, 1814741, 1784605, 1758189, 1735175, 1715462, 1699381, 1687490, 1679948, 1676415, 1676717, 1681181, 1689973, 1702568, 1718358, 1737463, 1760436, 1787411, 1818069, 1852355, 1890722, 1933723, 1981818, 2035629]
59227B035629O0367O7743P5977Q5343R5923J07237J18767J30656J43507J57668
59217C078817J73029J89296K06001K22244K36755K48389K56360K59986K58353
59208E129230K50326K34888K11524J80392J42231R8204M9919o51n1374j00152
59198F144537j44818j83231k13842k36210k50778k58181k58985k53860k43671
59189D100961k29533k13106j96404j80680j65614j50315j35035j20992j08570
59180B600712r6811q5117p4325o5317n7466m9551m1670l5097l0419k6863k3579
59169B014497k0629j8424j6911j5728j4733j4086j3930j4171j4384j4097j3402
59158A844002j3110j3718j4437j3969j2295j0865j0727j1319j1603j1647j2208
$$ y = [2035629, 2095996, 2163739, 2239716, 2325059, 2420982, 2528219, 2646986, 2777642, 2921149, 3078817, 3251846, 3441142, 3647143, 3869387, 4106142, 4354531, 4610891, 4870877, 5129230, 5379556, 5614444, 5825968, 6006360, 6148591, 6246795, 6296714, 6296063, 6244689, 6144537, 5999719, 5816488, 5602646, 5366436, 5115658, 4857477, 4598492, 4344632, 4100961, 3871428, 3658322, 3461918, 3281238, 3115624, 2965309, 2830274, 2709282, 2600712, 2503901, 2418784, 2344459, 2279142, 2221676, 2172125, 2130455, 2095358, 2064939, 2038076, 2014497, 1993868, 1975444, 1958533, 1942805, 1928072, 1913986, 1900056, 1885885, 1871501, 1857404, 1844002, 1830892, 1817174, 1802737, 1788768, 1776473, 1765608, 1754881, 1743562, 1731959, 1720312, 1708104]
59147A708104j3261j3965j4065j4323j5269j6333j6700j6505j6480j6730j6573
59136A537900j5660j4613j4248j4541j4685j4003j2502j0691r192q412q218p813
59124A393322o225l150P57M450P244R057J0278J1499J3120J4965J6400J7002J6949
59111A505668J6568J5776J4353J2586J1269J0861J0973J0818J0068R192Q964R778
59099A646874J1360J3176J5046J7221J9836K2654K5451K8395L1641L4783L7233
59088A903670L9046M0800M2544M3541M3247M1998M0213L7484L3108K7198K0480
59077B313329J3115M609m946j4402k2769l0273l7624m4638n0298n3973n5955n6897
59065A959278n7241n7201n6718n5385n2891m9679m6673m4233m1943l9511l7278
$$ y = [1708104, 1694843, 1680878, 1666813, 1652490, 1637221, 1620888, 1604188, 1587683, 1571203, 1554473, 1537900, 1522240, 1507627, 1493379, 1478838, 1464153, 1450150, 1437648, 1426957, 1417765, 1409353, 1401135, 1393322, 1387097, 1383947, 1384704, 1389154, 1396398, 1405455, 1415733, 1427232, 1440352, 1455317, 1471717, 1488719, 1505668, 1522236, 1538012, 1552365, 1564951, 1576220, 1587081, 1598054, 1608872, 1618940, 1628132, 1637096, 1646874, 1658234, 1671410, 1686456, 1703677, 1723513, 1746167, 1771618, 1800013, 1831654, 1866437, 1903670, 1942716, 1983516, 2026060, 2069601, 2112848, 2154846, 2195059, 2232543, 2265651, 2292849, 2313329, 2326444, 2331053, 2326107, 2311705, 2288936, 2258663, 2221039, 2176401, 2126103, 2072130, 2016175, 1959278, 1902037, 1844836, 1788118, 1732733, 1679842, 1630163, 1583490, 1539257, 1497314, 1457803, 1420525]
59054A420525l5402l3261l0222k6614k3261k0340j7379j4305j1696r970q804p633
59042A181638o359n398n258o129p633r094j0249j1512j3229j4890j5644j5398
59030A060845j4787j4133j3119j1604j0057q937q225p706p214o446n183l877l276
59017I46281l258k807j562m53k43l05L19J439K224K668L347M213M748N134O134
59002I67879P776R275J0324J1421J2805J4016J4890J5906J7139J7773J7253J6186
58990A132643J5413J4814J3699J1856R627P333N217L577K411J253j51j343j830
58977A214519j794j628j161j33R87J505J617K165L350M537N368O197P324Q622
58963A251475J0117J2064J4064J5021J4633J4136J4761J5986J6262J5120J3572
$$ y = [1420525, 1385123, 1351862, 1321640, 1295026, 1271765, 1251425, 1234046, 1219741, 1208045, 1198075, 1189271, 1181638, 1175279, 1169881, 1164623, 1158494, 1150861, 1141767, 1131518, 1120006, 1106777, 1091887, 1076243, 1060845, 1046058, 1031925, 1018806, 1007202, 997145, 988208, 979983, 972277, 965063, 958617, 953434, 949557, 946281, 943023, 940216, 938654, 938201, 937958, 937653, 937972, 939411, 941635, 944303, 947650, 951863, 956611, 961745, 967879, 975655, 984930, 995254, 1006675, 1019480, 1033496, 1048386, 1064292, 1081431, 1099204, 1116457, 1132643, 1148056, 1162870, 1176569, 1188425, 1198052, 1205385, 1210602, 1214179, 1216590, 1217843, 1217692, 1216349, 1214519, 1212725, 1211097, 1209936, 1209803, 1210790, 1212295, 1213912, 1216077, 1219427, 1223964, 1229332, 1235529, 1242853, 1251475, 1261592, 1273656, 1287720, 1302741, 1317374, 1331510, 1346271, 1362257, 1378519, 1393639, 1407211]
58952A407211J2534J1920J1434J1278J1518J1575J1020J0440J0751J1850J2719
58941A534250J2815J2777J3553J5399J7913K0721K3722K6879L0127L3419L6684
58930A778259L9753M2475M4854M6941M8683M9985N0899N1594N2220N2989N4343
58919B312995N6842O0756O5797P1342P7006Q3012Q9874R7637J05512J12572J18768
58908C252113J25005J32092J39943J47956J55873J63995J72762J82467J93108
58899D665314K04166K14618K23611K30975K36823K40770K42163K40917K37560
58890F736917K32289K24600K14032K00728J84883J66150J44077J18844R1140O1517
58880H375177L0302j956l4398o6111r6249j24069j49211j71773j91733k08429
$$ y = [1407211, 1419745, 1431665, 1443099, 1454377, 1465895, 1477470, 1488490, 1498930, 1509681, 1521531, 1534250, 1547065, 1559842, 1573395, 1588794, 1606707, 1627428, 1651150, 1678029, 1708156, 1741575, 1778259, 1818012, 1860487, 1905341, 1952282, 2000965, 2050950, 2101849, 2153443, 2205663, 2258652, 2312995, 2369837, 2430593, 2496390, 2567732, 2644738, 2727750, 2817624, 2915261, 3020773, 3133345, 3252113, 3377118, 3509210, 3649153, 3797109, 3952982, 4116977, 4289739, 4472206, 4665314, 4869480, 5084098, 5307709, 5538684, 5775507, 6016277, 6258440, 6499357, 6736917, 6969206, 7193806, 7407838, 7608566, 7793449, 7959599, 8103676, 8222520, 8313660, 8375177, 8405479, 8403523, 8369125, 8303014, 8206765, 8082696, 7933485, 7761712, 7569979, 7361550]
58870G361550k21099k29793k35357k38518k39545k38684k36288k32192k25755
58861E264319k16985k07129j97548j88223j78116j66831j55267j44547j34872
58852C674801j25713j16607j07417r8244q9490q1703p4911o8328o1237n4007m7689
58841B749455m2575l7859l2880k8040k4034k0676j7136j3093q969n084j237K783
58829B520655O890J1101J5690K0601K5192K9003L2490L6543M1460M6853N2346
58818B838824N7863O3248O8207P2875P7930Q3973R1067R9071J07984J17582J27116
58807C805740J35996J44660J54210J65098J76614J87771J98231K08126K17409
58798E393855K25881K33490K40099K44981K47003K45331K39694K30045K16376
$$ y = [7361550, 7140451, 6910658, 6675301, 6436783, 6197238, 5958554, 5722266, 5490074, 5264319, 5047334, 4840205, 4642657, 4454434, 4276318, 4109487, 3954220, 3809673, 3674801, 3549088, 3432481, 3325064, 3226820, 3137330, 3055627, 2980716, 2912388, 2851151, 2797144, 2749455, 2706880, 2669021, 2636141, 2608101, 2584067, 2563391, 2546255, 2533162, 2524193, 2519109, 2517872, 2520655, 2527545, 2538646, 2554336, 2574937, 2600129, 2629132, 2661622, 2698165, 2739625, 2786478, 2838824, 2896687, 2959935, 3028142, 3101017, 3178947, 3262920, 3353987, 3453058, 3561042, 3678624, 3805740, 3941736, 4086396, 4240606, 4405704, 4582318, 4770089, 4968320, 5176446, 5393855, 5619736, 5853226, 6093325, 6338306, 6585309, 6830640, 7070334, 7300379, 7516755]
58789G516755J98815J77376J51622J21131Q6595M9863J2584k4687o1561r6655
58779H131838j28274j56125j81436k05121k26442k43809k56381k64489k68772
58770F200989k69420k66288k59488k49851k38719k27232k15740k04019j91959
58761D078273j79720j67377j54887j42576j31171j20974j11343j01542r1919q3635
58751B793129p7111p1284o4794n7664n1169m6088m1672l6762l1538k7407k5203
58740B262437k4236k3466k2909k3218k4300k5210k5300k4735k3741k2219k0374
58729B002729j9143j9484k1486k4482k7665l0420l2473l4048l5675l7492l9067
58718A681294m0106m0908m1859m2805m3347m3402m3036m2169m0811l9298l7697
$$ y = [7516755, 7715570, 7892946, 8044568, 8165699, 8252294, 8302157, 8314741, 8290054, 8228493, 8131838, 8003564, 7847439, 7666003, 7460882, 7234440, 6990631, 6734250, 6469761, 6200989, 5931569, 5665281, 5405793, 5155942, 4917223, 4689991, 4474251, 4270232, 4078273, 3898553, 3731176, 3576289, 3433713, 3302542, 3181568, 3070225, 2968683, 2876764, 2793129, 2716018, 2644734, 2579940, 2522276, 2471107, 2425019, 2383347, 2346585, 2315047, 2287640, 2262437, 2238201, 2214735, 2191826, 2168608, 2144308, 2119098, 2093798, 2069063, 2045322, 2023103, 2002729, 1983586, 1964102, 1942616, 1918134, 1890469, 1860049, 1827576, 1793528, 1757853, 1720361, 1681294, 1641188, 1600280, 1558421, 1515616, 1472269, 1428867, 1385831, 1343662, 1302851, 1263553, 1225856]
58707A225856l5376l1770k7413k3422k0109j6850j3385j0487r136r560j1240j3388
58695A003720j5210j6250j6771j7405j8271j8847j8815j8398j7655j6066j3357
58684H16675j0154p328n030k973j158L45K033M498P403R716J1089J2239J3784
58671H51139J5437J6680J7631J8708J9891K0744K0807J9550J6418J1550O036P79
58659A035370m583j0855j7537k2999k6368k8264k9356k9271k7521k4646k1567
58648G92403j8453j5053j1702r028o962m967l062j652n02J043K795L787L820L940
58634G36407M869O021O585O722P025P563Q255R412J1092J2495J2954J3050J3735
58621H56185J4817J5426J5767J7075J9792K2879K5330K7314K9427L1666L3763
$$ y = [1225856, 1190480, 1158710, 1131297, 1107875, 1087766, 1070916, 1057531, 1047044, 1037908, 1028348, 1017108, 1003720, 988510, 972260, 955489, 938084, 919813, 900966, 882151, 863753, 846098, 830032, 816675, 806521, 799193, 794163, 791190, 790032, 790377, 792410, 796908, 804311, 814027, 825116, 837355, 851139, 866576, 883256, 900887, 919595, 939486, 960230, 981037, 1000587, 1017005, 1028555, 1034591, 1035370, 1030787, 1019932, 1002395, 979396, 953028, 924764, 895408, 866137, 838616, 813970, 792403, 773950, 758897, 747195, 738167, 731205, 726238, 723176, 721524, 721022, 722065, 724860, 728647, 732467, 736407, 741276, 747297, 753882, 760604, 767629, 775192, 783447, 792859, 803951, 816446, 829400, 842450, 856185, 871002, 886428, 902195, 919270, 939062, 961941, 987271, 1014585, 1044012, 1075678, 1109441]
58610A109441L5872L8374M1391M4872M8799N2873N6546N9750O3159O7135P0863
58599A689075P3202P4183P4899P5860P6081P4073O9227O1936N2755M2031L0250
58588B393572J8215O502m992j6540k7643l7050m3914m8505n1560n3241n3139n1101
58576B030604m7598m3465l9626l6835l5066l3225l0191k6258k2984k1404k0926
58565A673026k0284j9029j7788j7456j8537k0965k4090k7035k9301l0935l1973
58554A415633l2163l1461l0362k9269k7939k6019k3847k2119k1000k0323k0516
58543A130615k2511k6337l0445l2947l3245l2075l0208k7792k4930k2318k0734
58532H27073k0075j9353j7826j5867j4400j3688j3026j1710r885q321p528p375
$$ y = [1109441, 1145313, 1183687, 1225078, 1269950, 1318749, 1371622, 1428168, 1487918, 1551077, 1618212, 1689075, 1762277, 1836460, 1911359, 1987219, 2063300, 2137373, 2206600, 2268536, 2321291, 2363322, 2393572, 2411787, 2418289, 2413297, 2396757, 2369114, 2332064, 2288150, 2239645, 2188085, 2134844, 2081705, 2030604, 1983006, 1939541, 1899915, 1863080, 1828014, 1794789, 1764598, 1738340, 1715356, 1693952, 1673026, 1652742, 1633713, 1615925, 1598469, 1579932, 1558967, 1534877, 1507842, 1478541, 1447606, 1415633, 1383470, 1352009, 1321647, 1292378, 1264439, 1238420, 1214573, 1192454, 1171454, 1151131, 1130615, 1108104, 1081767, 1051322, 1018375, 985130, 953055, 922847, 895055, 870125, 847807, 827073, 806998, 787645, 769819, 753952, 739552, 725864, 712838, 701128, 691243, 682922, 675394, 668019]
58520F68019p364p037o224n141m238l754l352k436q30R08K033K451K840L859N302
58505F45036O327O550O499O782P142O914O200N883O345O838O613O041O079O888
58491G36137P666P725P179O517N911N207M190K713P79j307l084m392n597p206
58477G62438r273j1211j2262j2168j1503j1238j1753j2346j1951j0401q698p907
58465F31727q008q116p589o552n432m423l572k998k748k618k414k212k132j937
58451E70976j282k85N76J162J903L163M674N833O323O288O148O359P035P678P606
58436F34157O832O121N968O010N716N064M154K737Q03r39j907k527l405m093l755
58421F60936k760k324k623k563j640p28m71j55J055K726L874M310M360L966L021
$$ y = [668019, 660655, 653618, 647394, 642253, 638015, 634261, 630909, 628473, 627643, 628551, 630584, 633035, 635875, 639734, 645036, 651363, 657913, 664412, 671194, 678336, 685250, 691450, 697333, 703678, 710516, 717129, 723170, 729249, 736137, 743803, 751528, 758707, 765224, 771135, 776342, 780532, 783245, 784024, 782717, 779633, 775241, 769644, 762438, 753165, 741954, 729692, 717524, 706021, 694783, 683030, 670684, 658733, 648332, 639634, 631727, 623719, 615603, 608014, 601462, 596030, 591607, 588035, 585037, 582289, 579671, 577257, 575045, 572913, 570976, 569694, 569409, 569985, 571147, 573050, 576213, 580887, 586720, 593043, 599331, 605479, 611838, 618873, 626551, 634157, 640989, 647110, 653078, 659088, 664804, 669868, 674022, 676759, 677562, 676623, 674716, 672189, 668784, 664691, 660936, 658176, 655852, 653229, 650666, 649026, 648298, 647827, 647672, 648727, 651453, 655327, 659637, 663997, 667963, 670984]
58406F70984K199K424L637M879N427N303M849M420M314M468M411L974L763M388
58392G29440N559O535P137P728Q445R161R920J0704J0921R916P828N327K637l77
58378H30881l345n440o347o367n569l775j458L26J194J867K937M026M649N135
58364H18714O092P393Q444R024R325R341Q864Q011P298P129P494Q125Q743R135
58350I33132R182Q867Q259P590P262P598Q431R198R436R167Q772Q723R321J0397
58336A055335J1317J1640J1721J2263J3294J4017J3850J3130J2590J2595J3108
58325A194860J4002J5031J5791J6120J6390J7099J8309J9691K0889K1490K1013
58314A390685J9437J7695J7049J7771J8743J8746J7880J7370J8012J9247J9963
$$ y = [670984, 673183, 675607, 679244, 684123, 689550, 694853, 699702, 704122, 708436, 712904, 717315, 721289, 725052, 729440, 734999, 741534, 748671, 756399, 764844, 774005, 783925, 794629, 805550, 815466, 823294, 828621, 831258, 830881, 827536, 822096, 815749, 809382, 803813, 800038, 798580, 798906, 800100, 801967, 804904, 808930, 813579, 818714, 824806, 832199, 840643, 849667, 858992, 868333, 877197, 885208, 892506, 899635, 907129, 915254, 923997, 933132, 942314, 951181, 959440, 967030, 974292, 981890, 990321, 999519, 1008955, 1018122, 1026894, 1035617, 1044938, 1055335, 1066652, 1078292, 1090013, 1102276, 1115570, 1129587, 1143437, 1156567, 1169157, 1181752, 1194860, 1208862, 1223893, 1239684, 1255804, 1272194, 1289293, 1307602, 1327293, 1348182, 1369672, 1390685, 1410122, 1427817, 1444866, 1462637, 1481380, 1500126, 1518006, 1535376, 1553388, 1572635, 1592598]
58303A592598J9920J9950K0783K2181K3401K4138K4653K5216K5921K6946K8536
58292A854243L0524L2212L3006L3149L3625L5325L8217M1387M3945M5892M7967
58281B269492N0723N3979N7227O0154O2596O4320O5235O5536O5395O4655O3126
58270B942438O0999N8667N6358N4209N2462N1269N0564N0443N1444N3938N7501
58259C540292O1258O4810O8501P2912P8353Q4621R1018R6904J02465J08515J15289
58248D484938J21974J27970J33901J40718J48407J56356J64514J73117J81808
58239E833703J90142J98744K08749K20205K32197K44615K58573K74860K92979
58230G954767L12182L32470L54228L77609M02770M30177M60312M93508N30137
$$ y = [1592598, 1612518, 1632468, 1653251, 1675432, 1698833, 1722971, 1747624, 1772840, 1798761, 1825707, 1854243, 1884767, 1916979, 1949985, 1983134, 2016759, 2052084, 2090301, 2131688, 2175633, 2221525, 2269492, 2320215, 2374194, 2431421, 2491575, 2554171, 2618491, 2683726, 2749262, 2814657, 2879312, 2942438, 3003437, 3062104, 3118462, 3172671, 3225133, 3276402, 3326966, 3377409, 3428853, 3482791, 3540292, 3601550, 3666360, 3734861, 3807773, 3886126, 3970747, 4061765, 4158669, 4261134, 4369649, 4484938, 4606912, 4734882, 4868783, 5009501, 5157908, 5314264, 5478778, 5651895, 5833703, 6023845, 6222589, 6431338, 6651543, 6883740, 7128355, 7386928, 7661788, 7954767, 8266949, 8599419, 8953647, 9331256, 9734026, 10164203, 10624515, 11118023, 11648160]
58221A1648160N70617O15326O64962P20646P83171Q52724R30143J017891J118751
58212A8922391J234151J365122J514550J687219J888322K123641K400809K728444
58204C3864649L114065L564206M085354M681616N351628O092469O911029P833248
58196G5498264Q903320J0174011J1693655J3494469J5585237J7944730K0503365
58189A73797051K3105730K5467571K7151859K7581204K6108913K2189439J5653051
58182C41054818O965265k743754j1997176j9494518k4524357k7048278k7496610
58175B34715390k6478925k4572869k2228749j9754200j7338540j5088819j3058760
58168I6194528j1266175r705767q360848p210356o230680n397379m688577m086339
$$ y = [11648160, 12218777, 12834103, 13499065, 14219711, 15002882, 15855606, 16785749, 17803640, 18922391, 20156542, 21521664, 23036214, 24723433, 26611755, 28735396, 31136205, 33864649, 36978714, 40542920, 44628274, 49309890, 54661518, 60753987, 67665016, 75498264, 84401584, 94575595, 106269250, 119763719, 135348956, 153293686, 173797051, 196902781, 222370352, 249522211, 277103415, 303212328, 325401767, 341054818, 348020083, 345276329, 333279153, 313784635, 289260278, 262212000, 234715390, 208236465, 183663596, 161434847, 141680647, 124342107, 109253288, 96194528, 84928353, 75222586, 66861738, 59651382, 53420702, 48023323, 43334746, 39248407]
58160C9248407l574947l139798k768347k450424k177262j941295j736875j559697
58152A9899762j405389j269771j150167j044970r51981q68621p93541p26504o66679
58143A1022139o12572n63578n20005m81345m46094m13553l84300l58411l34725
58134F907556l12395k91864k73521k56592k40253k24893k11344j99525j88610
58125D708559j78091j68035j58619j49924j41971j34591j27507j20703j14370
58116C414748j08482j02865r7659r3120q8982q4725q0498p6974p4142p1126o7531
58105B468644o4056o1292n8715n5558n2011m8793m5993m3119m0101l7574l6162
58094A925270l5986l6699l7653l8078l7618l6624l5640l4700l3496l2107l1092
$$ y = [39248407, 35673460, 32533662, 29765315, 27314891, 25137629, 23196334, 21459459, 19899762, 18494373, 17224602, 16074435, 15029465, 14077484, 13208863, 12415322, 11688818, 11022139, 10409567, 9845989, 9325984, 8844639, 8398545, 7984992, 7600692, 7242281, 6907556, 6595161, 6303297, 6029776, 5773184, 5532931, 5308038, 5096694, 4897169, 4708559, 4530468, 4362433, 4203814, 4053890, 3911919, 3777328, 3649821, 3529118, 3414748, 3306266, 3203401, 3105742, 3012622, 2923640, 2838915, 2758417, 2681443, 2607301, 2536175, 2468644, 2404588, 2343296, 2284581, 2229023, 2177012, 2128219, 2082226, 2039107, 1999006, 1961432, 1925270, 1889284, 1852585, 1814932, 1776854, 1739236, 1702612, 1666972, 1632272, 1598776, 1566669, 1535577]
58083A535577l0805l0989l1223l1476l1914l2338l2231l1421l0403k9641k8837
58072A194299k7286k4996k2819k1305k0012j8412j6899j6180j5968j5200j3544
58061I81678j1900j1128j1064j1109j1237j1813j2758j3419j3200j2062j0566
58050H51422r504r356r838j0138r771r061q721r059r758j0238j0089r275q090
58037G28524o875n816n057m789m932m935m331l508l428m367n469n758n220m528
58023F59511m091l775l349k752k023j322j005j311j991k412k126j243k56M13P42
58008F33010J063J600K094K115J744J637K214L116L711L850L748L351K385R62
57994F66600l49j242k030l049m012m274l616k427j176K9J344K866M513O099P388
$$ y = [1535577, 1504772, 1473783, 1442560, 1411084, 1379170, 1346832, 1314601, 1283180, 1252777, 1223136, 1194299, 1167013, 1142017, 1119198, 1097893, 1077881, 1059469, 1042570, 1026390, 1010422, 995222, 981678, 969778, 958650, 947586, 936477, 925240, 913427, 900669, 887250, 874050, 861988, 851422, 841918, 832562, 822724, 812586, 802815, 793754, 785033, 775974, 766216, 755978, 745889, 736614, 728524, 721649, 715833, 710776, 705987, 701055, 696120, 691789, 688281, 684853, 680486, 675017, 669259, 664039, 659511, 655420, 651645, 648296, 645544, 643521, 642199, 641194, 639883, 637892, 635480, 633354, 632111, 631855, 632268, 633010, 634073, 635673, 637767, 639882, 641626, 643263, 645477, 648593, 652304, 656154, 659902, 663253, 665638, 666600, 666251, 665009, 662979, 659930, 655918, 651644, 648028, 645601, 644425, 644454, 645798, 648664, 653177, 659276, 666664]
57979F66664Q235Q709Q984Q968Q231O518M238K069R4k248n239q261j0503j1876
57965F84583j2899j3730j3947j3241j1911j0458q984p241n097k753n36J386L094
57952E88266M750O297P376P665P244O471N534M289K476K0k842n564p585q847r925
57937F05625j1351j2869j3742j3609j2663j0986q403n208k440r94o69n81k25K64
57923E12149P02J176J584J300l41l210o222q178q698q249p332o035m489l260k714
57908D58183k274j005J014K655L203L103K930K372R53q36j983k360k783l722m684
57893D54766n119n277n801o774p542p364o127m393k935k060j470q28k29Q5L10
57878C99242R79K279L798M994N648N866N945O242O794P037O298M692L139K290
$$ y = [666664, 674899, 683608, 692592, 701560, 709791, 716309, 720547, 722616, 722710, 720462, 715223, 706962, 696459, 684583, 671684, 657954, 644007, 630766, 618855, 608397, 599413, 592172, 587075, 584322, 583786, 585172, 588266, 593016, 599313, 606689, 614354, 621598, 628069, 633603, 637892, 640368, 640388, 637546, 631982, 624397, 615550, 605625, 594274, 581405, 567663, 554054, 541391, 530405, 522002, 516794, 514354, 513360, 512691, 512110, 511885, 512149, 512851, 514027, 515611, 516911, 516570, 513360, 507138, 498960, 490262, 482013, 474681, 468646, 464157, 460897, 458183, 455909, 454904, 455918, 458573, 461776, 464879, 467809, 470181, 471134, 470298, 468315, 465955, 463172, 459450, 454766, 449647, 444370, 438569, 431795, 424253, 416889, 410762, 406369, 403434, 401374, 399904, 399076, 398847, 398932, 399242, 400221, 402500, 406298, 411292, 416940, 422806, 428751, 434993, 441787, 448824, 455122, 459814, 462953, 465243]
57864D65243J755O60j299l656n726p099p734p930q169q742r466r847r435q042
57850C80513n856l528j863j111o73K66J914L863N618O850P305P003O502O494O979
57835D20276P282O987O402N879N089L413P51k511o142j0134j4099j7063j8136
57822C87994j7205j4975j2542j0776r810q939p410n334l548k476j568q4K007M242
57808B99576O295P928Q667Q338P769Q235J0024J2231J4076J5730J7473J8802J9030
57795D54174J8248J6984J5159J2249Q353M398J026j997n098q140j0703j2697j4324
57782D77632j5708j6864j7784j8294j8076j7122j5889j4747j3519j1975j0472
57771C07182r562r085q237o663m944l845l405l064k397j430m09M61J085J457J626
$$ y = [465243, 466998, 467658, 466359, 462703, 456977, 449878, 442144, 434214, 426045, 417303, 407837, 397990, 388555, 380513, 374657, 371129, 369266, 368155, 367482, 367748, 369662, 373525, 379143, 385993, 393298, 400301, 406803, 413297, 420276, 427558, 434545, 440947, 446826, 451915, 455328, 456079, 453568, 447426, 437292, 423193, 406130, 387994, 370789, 355814, 343272, 332496, 322686, 313747, 306337, 301003, 297455, 294979, 293411, 293327, 295334, 299576, 305871, 313799, 322466, 330804, 338573, 346808, 356832, 369063, 383139, 398869, 416342, 435144, 454174, 472422, 489406, 504565, 516814, 525167, 529565, 530591, 528594, 523496, 515356, 504653, 491956, 477632, 461924, 445060, 427276, 408982, 390906, 373784, 357895, 343148, 329629, 317654, 307182, 297620, 288535, 280298, 273635, 268691, 264846, 261441, 258377, 255980, 254550, 254141, 254602, 255687, 257144, 258770]
57756B58770J641J568J556J748K139K670L321L987M370M280M043M192M758N278
57742C04321N520N675N699N160M104L440L815M642M869M367L768L341K940K913
57728C64574L831N201N579M499L312L436M596N564N983O388O853O784O076N509
57714D38185N700O470P439Q658J0185J1655J2708J3490J4265J4864J5002J4930
57702E73551J5199J5767J5990J5655J5544J6572J8726K1339K4245K7926L2481
57691G92995L7068M0879M4127M7620N1715N6316O1553O7638P4179Q0471Q6605
57680A441166R3378J00906J08315J15121J21975J29371J36570J42880J49211J57159
57670B696052J66725J75935J82060J81396J67675J32962P2799q331r6565j74219
$$ y = [258770, 260411, 261979, 263535, 265283, 267422, 270092, 273413, 277400, 281770, 286050, 290093, 294285, 299043, 304321, 309841, 315516, 321215, 326375, 330479, 333919, 337734, 342376, 347245, 351612, 355380, 358721, 361661, 364574, 368405, 373606, 379185, 383684, 386996, 390432, 395028, 400592, 406575, 412963, 419816, 426600, 432676, 438185, 443885, 450355, 457794, 466452, 476637, 488292, 501000, 514490, 528755, 543619, 558621, 573551, 588750, 604517, 620507, 636162, 651706, 668278, 687004, 708343, 732588, 760514, 792995, 830063, 870942, 915069, 962689, 1014404, 1070720, 1132273, 1199911, 1274090, 1354561, 1441166, 1534544, 1635450, 1743765, 1858886, 1980861, 2110232, 2246802, 2389682, 2538893, 2696052, 2862777, 3038712, 3220772, 3402168, 3569843, 3702805, 3775604, 3767273, 3670708, 3496489]
57660C496489k27680k52624k53739k39828k18558j94572j70595j48471j28851
57651A661571j11239r5165q0966o9067n9178n0619m3046l6364l0379k4915j9931
57640A040702j5251j0599o100k231J015M325P970J1230J3516J5485J8263K2003
57628A100328K5998K9914L3977L8083M1585M4254M6674M9468N2591N5575N8091
57617A576538N9952O0831O0240N7779N3344M7152L9434L0175J9323P281n148j7421
57605A989480k9418m0703n0276n7480o2675o6505o8958o9787o9388o8353o6547
57594A339390o3539n9825n6596n4160n1542m7844m3323l8830l4930l1881k9758
57583H27162k8210k6538k4483k2466k0876j9520j8046j6434j4777j3056j1441
$$ y = [3496489, 3268809, 3016185, 2762446, 2522618, 2304060, 2109488, 1938893, 1790422, 1661571, 1550332, 1455167, 1374201, 1305134, 1245956, 1195337, 1152291, 1115927, 1085548, 1060633, 1040702, 1025451, 1014852, 1008752, 1006521, 1007536, 1011861, 1019831, 1031061, 1044577, 1060062, 1078325, 1100328, 1126326, 1156240, 1190217, 1228300, 1269885, 1314139, 1360813, 1410281, 1462872, 1518447, 1576538, 1636490, 1697321, 1757561, 1815340, 1868684, 1915836, 1955270, 1985445, 2004768, 2012049, 2006901, 1989480, 1960062, 1919359, 1869083, 1811603, 1748928, 1682423, 1613465, 1543678, 1474290, 1405937, 1339390, 1275851, 1216026, 1159430, 1105270, 1053728, 1005884, 962561, 923731, 888801, 856920, 827162, 798952, 772414, 747931, 725465, 704589, 685069, 667023, 650589, 635812, 622756, 611315]
57572F11315j0294r669r143q420p596o628n269l736k789k585k169q24P65J474
57558E44432J412J590K260K720K764L225M716O622P819P949P596P616Q545J0278
57544F19544J2098J3304J4002J4986J6702J8748K0615K2361K4258K6178K7905
57533H30701K9771L2393L5810L9304M2132M4116M5540M6793M8142M9567N0679
57522A294948N1058N0610M9360M6995M3064L7686L1424K4304J5522M760o730j7004
57510A625997k5306l2353l8849m4439m8335n0341n0844n0336m9306m8203m6999
57499A140686m5100m2095l8375l4617l0963k7224k3600k0594j8257j6120j3833
57488H29908j1426q962o473m212k370n11K058N268Q208J0305J1940J3689J5613
$$ y = [611315, 601021, 591352, 582209, 573789, 566193, 559565, 554296, 550560, 547771, 545186, 543017, 542193, 542958, 544432, 545844, 547434, 549694, 552414, 555178, 558403, 563119, 569741, 577560, 585509, 593105, 600721, 609266, 619544, 631642, 644946, 658948, 673934, 690636, 709384, 729999, 752360, 776618, 802796, 830701, 860472, 892865, 928675, 967979, 1010111, 1054227, 1099767, 1146560, 1194702, 1244269, 1294948, 1346006, 1396616, 1445976, 1492971, 1536035, 1573721, 1605145, 1629449, 1644971, 1649731, 1643001, 1625997, 1600691, 1568338, 1529489, 1485050, 1436715, 1386374, 1335530, 1285194, 1235888, 1187685, 1140686, 1095586, 1053491, 1015116, 980499, 949536, 922312, 898712, 878118, 859861, 843741, 829908, 818482, 809520, 803047, 798835, 796465, 795954, 798012, 803280, 811488, 821793, 833733, 847422, 863035]
57475H63035J7621J9891K2409K4744K6798K9304L2901L7069M0705M3414M5550
57464A203441M7218M8074M8089M7683M6937M5268M2078L7294L1162K3939J5947
57453A637130P431j792j1968k2563l2221l9902m5624m9878n2759n4073n3968n3011
57441A226802n1710n0213m8435m6167m3325m0138l6986l3958l0883k7934k5668
57430G91385k4156k2561k0134j7331j5317j4438j3852j2672j0891r059p585o600
57418F16789o106n923n738n353m765l941k895j971j649j845j870j292m80O1L89
57403E73411P13P36Q8q27j114n29L19R17J429K093K720L075L296L561L736L683
57387E97307L571L550L439L146L072L571M248M392M023L863M231M612M543M369
$$ y = [863035, 880656, 900547, 922956, 947700, 974498, 1003802, 1036703, 1073772, 1114477, 1157891, 1203441, 1250659, 1298733, 1346822, 1394505, 1441442, 1486710, 1528788, 1566082, 1597244, 1621183, 1637130, 1644561, 1642769, 1630801, 1608238, 1576017, 1536115, 1490491, 1440613, 1387854, 1333781, 1279813, 1226802, 1175092, 1124879, 1076444, 1030277, 986952, 946814, 909828, 875870, 844987, 817053, 791385, 767229, 744668, 724534, 707203, 691886, 677448, 663596, 650924, 640033, 630974, 623389, 616789, 610683, 604760, 599022, 593669, 588904, 584963, 582068, 580097, 578448, 576603, 574733, 573441, 572961, 573022, 573411, 574124, 574860, 574948, 574121, 573007, 572478, 572797, 573714, 575143, 577236, 579956, 583031, 586327, 589888, 593624, 597307, 600878, 604428, 607867, 611013, 614085, 617656, 621904, 626296, 630319, 634182, 638413, 643025, 647568, 651937]
57373F51937M609M982M665L513K443K416L332M323M945N577O569P482P625P082
57359G21500O652O804P206P400P417P428P310O971O762P088P786Q355Q598Q640
57345H25917Q485Q040P444O966O714O800P553R004J0346J0676J0194R967J0387
57332I38493J0666J0141R320R181R945J1045J1917J2382J2488J2359J2165J1983
57320A072085J1931J2351J3487J4923J5880J6220J6591J7299J7781J7618J7368
57309A243534J7794J8825J9908K0938K2063K2993K3301K3211K3265K3423K3215
57298A482470K2632K2037K1352K0216J8876J7921J7046J5113J1875Q674O805N879
57286A670896M508K148m12k123k628k229j485q33l84j1L49P62J609L322N556P142
$$ y = [651937, 656546, 661528, 666193, 669706, 672149, 674565, 677897, 682220, 687165, 692742, 699311, 706793, 714418, 721500, 728152, 734956, 742162, 749562, 756979, 764407, 771717, 778688, 785450, 792538, 800324, 808679, 817277, 825917, 834402, 842442, 849886, 856852, 863566, 870366, 877919, 886923, 897269, 907945, 918139, 928106, 938493, 949159, 959300, 968620, 977801, 987746, 998791, 1010708, 1023090, 1035578, 1047937, 1060102, 1072085, 1084016, 1096367, 1109854, 1124777, 1140657, 1156877, 1173468, 1190767, 1208548, 1226166, 1243534, 1261328, 1280153, 1300061, 1320999, 1343062, 1366055, 1389356, 1412567, 1435832, 1459255, 1482470, 1505102, 1527139, 1548491, 1568707, 1587583, 1605504, 1622550, 1637663, 1649538, 1658212, 1665017, 1670896, 1675404, 1677552, 1677140, 1675017, 1672389, 1670160, 1668675, 1667842, 1667458, 1667447, 1667796, 1668558, 1670167, 1673489, 1679045, 1686187]
57270A686187P402P103P580R114J0768J1654J1757J1509J1235J1163J1446J1885
57258A808803J2009J1769J1772J2467J3385J3719J3514J3621J4359J4878J4339
57247A954635J3264J3010J3981J5169J5596J5510J5659J6044J6178J6178J6721
57236B121945J7813J8537J8293J7697J7721J8436J9141J9360J9242J9044J8815
57225B326044J8580J8496J8663J9061J9610K0125K0248J9780J9070J8771J9078
57214B537526J9505J9528J9233J9078J9215J9340J9191J8820J8388J7904J7430
57203B745158J7250J7638J8438J9166J9545J9766K0162K0797K1506K2110K2553
57192B964089K2875K3164K3409K3349K2660K1463K0387K0018K0386K1160K2032
$$ y = [1686187, 1693589, 1700692, 1708272, 1717386, 1728154, 1739808, 1751565, 1763074, 1774309, 1785472, 1796918, 1808803, 1820812, 1832581, 1844353, 1856820, 1870205, 1883924, 1897438, 1911059, 1925418, 1940296, 1954635, 1967899, 1980909, 1994890, 2010059, 2025655, 2041165, 2056824, 2072868, 2089046, 2105224, 2121945, 2139758, 2158295, 2176588, 2194285, 2212006, 2230442, 2249583, 2268943, 2288185, 2307229, 2326044, 2344624, 2363120, 2381783, 2400844, 2420454, 2440579, 2460827, 2480607, 2499677, 2518448, 2537526, 2557031, 2576559, 2595792, 2614870, 2634085, 2653425, 2672616, 2691436, 2709824, 2727728, 2745158, 2762408, 2780046, 2798484, 2817650, 2837195, 2856961, 2877123, 2897920, 2919426, 2941536, 2964089, 2986964, 3010128, 3033537, 3056886, 3079546, 3101009, 3121396, 3141414, 3161800, 3182960, 3204992]
57181C204992K2669K2707K2229K2070K3018K4674K5584K4640K1960J8347J4435
57170C447325J0574P171M632L100K382K042J530N29p44j800k527l292m271n194
57156C461457n927o812p946q605q073o828o206o813p882q438q475q621r011r137
57142C352683q693q029p617p434p180o774o346n825n014m074l494l448l594l789
57128C271372m484n944p462p972p321o199m917l009k31K862N761Q801J2634J7283
57114C271174K2246K7236L2400L8090M4874N3487O4288P6908R0921J06734J25479
57103C953837J48148J75313K07554K45705K90515L42278M00686M64825N33538
57094F762399O06234O83224P64822Q50015R36230J020070J097720J164586J215077
$$ y = [3204992, 3227661, 3250368, 3272597, 3294667, 3317685, 3342359, 3367943, 3392583, 3414543, 3432890, 3447325, 3457899, 3465070, 3469702, 3472802, 3475184, 3477226, 3478756, 3479285, 3478541, 3476741, 3474214, 3470922, 3466651, 3461457, 3455530, 3448718, 3440772, 3432167, 3424094, 3417266, 3411060, 3404247, 3396365, 3387927, 3379452, 3370831, 3361820, 3352683, 3343990, 3335961, 3328344, 3320910, 3313730, 3306956, 3300610, 3294785, 3289771, 3285697, 3282203, 3278755, 3275161, 3271372, 3266888, 3260944, 3253482, 3245510, 3238189, 3231990, 3227073, 3224064, 3223833, 3226695, 3232456, 3241257, 3253891, 3271174, 3293420, 3320656, 3353056, 3391146, 3436020, 3489507, 3553795, 3630703, 3721624, 3828358, 3953837, 4101985, 4277298, 4484852, 4730557, 5021072, 5363350, 5764036, 6228861, 6762399, 7368633, 8051857, 8816679, 9666694, 10602924, 11622994, 12720714, 13885300, 15100377]
57085A5100377J243123J243054J210513J143431J042449R10221P50222N66461
57077B3209851L64085J49504p0308k88344m97471o90612q61714j006518j122286
57068A9186187j207236j260590j283076j277026j245953j194034j125816j046050
57060I546406r59573q70907p83579o99726o20630n47578m81901m24145l73756
57051C784611l29755k91457k58355k29757k04907j83312j64636j48454j34274
57042A839704j21710j10509j00525r1772q4241p7627p1528o5974o1310n7403n3454
57031I43651m9031m4740m1442l9077l6895l4538l2245l0118k7971k5887k4256
57020E57451k2995k1532j9776j8491j8195j8249j7675j6522j5675j5491j5336
$$ y = [15100377, 16343500, 17586554, 18797067, 19940498, 20982947, 21893168, 22643390, 23209851, 23573936, 23723440, 23653132, 23364788, 22867317, 22176705, 21314991, 20308473, 19186187, 17978951, 16718361, 15435285, 14158259, 12912306, 11718272, 10592456, 9546406, 8586833, 7715926, 6932347, 6232621, 5611991, 5064413, 4582512, 4158367, 3784611, 3454856, 3163399, 2905044, 2675287, 2470380, 2287068, 2122432, 1973978, 1839704, 1717994, 1607485, 1506960, 1415188, 1330947, 1253320, 1181792, 1115818, 1054508, 997105, 943651, 894620, 849880, 808438, 769361, 732466, 697928, 665683, 635565, 607594, 581707, 557451, 534456, 512924, 493148, 474657, 456462, 438213, 420538, 404016, 388341, 372850, 357514]
57009C57514j4650j3756j3303j3360j3447j3241j2760j2060j1165j0300r780r548
56997B10144r159q392p571p047o604n755m483l289k380j235P44L360N715P168
56983A71216P970Q754R561R630Q217N554K749P33m87j477k514l323l499k899j646
56968B08539j23J125J811K330L403N158O879P918Q494R277J0384J1245J1264J0276
56954B97980Q434N993L245K57l183o993j0193j1471j0618q815p339o356n405m375
56940B41161l402k108P3K821N019O202P266R213J1782J3819J4604J4137J2339
56927C32926Q822L700j988o984j0686j3150j4606j5250j5322j5001j4233j2895
56915B25333j1024q937p089n918n498n353m778l606k429j839j697j464j026p81
$$ y = [357514, 342864, 329108, 315805, 302445, 288998, 275757, 262997, 250937, 239772, 229472, 219692, 210144, 200985, 192593, 185022, 177975, 171371, 165616, 161133, 157844, 155464, 154229, 154973, 158333, 164048, 171216, 179186, 187940, 197501, 207131, 215348, 220902, 223651, 224384, 223897, 222420, 219906, 216583, 213084, 210185, 208539, 208416, 209541, 211352, 213682, 217085, 222243, 229122, 237040, 245534, 254811, 265195, 276440, 287704, 297980, 306414, 312407, 315652, 315909, 312726, 305733, 295540, 284069, 273451, 264636, 257297, 250941, 245536, 241161, 237759, 235651, 235724, 238545, 243564, 249766, 257032, 266245, 278027, 291846, 306450, 320587, 332926, 341748, 345448, 343460, 336476, 325790, 312640, 298034, 282784, 267462, 252461, 238228, 225333, 214309, 205372, 198283, 192365, 186867, 181514, 176736, 173130, 170701, 168862, 167165, 165701, 164675, 163894]
56901A63894q91r56n64J84R10J468J957K415K819L354M295N502O350O445O317
56886B03499O954Q528R946R934Q247N548K415q62l647m990m693l746l214l091
56872B30828k634j433L35K439M735O933Q835J0684J2810J5074J7136J9049K0935
56859C45726K2171K1736J9410J5863J1424N689j189p686j2139j4235j4730j4137
56847C77903j2495j0067p389m590j361K340O111R756J3584J7835K2267K6524L0574
56834D70992L4349L7143L7671L4844K8474J9253Q249l470j4751k4223l0653l3653
56822E64225l3839l2198k9307k5354k0532j5227r862m830m55L246O718J0535J4799
56809D27919J9008K2480K4714K5341K3940K0089J3659N053m777j4568k2993k8904
$$ y = [163894, 163003, 162047, 161483, 161667, 162577, 164045, 166002, 168417, 171236, 174590, 178885, 184387, 190737, 197182, 203499, 210453, 218981, 228927, 238861, 247108, 252656, 255071, 254209, 250562, 245572, 240879, 237133, 233919, 230828, 228194, 226761, 227096, 229535, 234270, 241203, 250038, 260722, 273532, 288606, 305742, 324791, 345726, 367897, 389633, 409043, 424906, 436330, 442019, 440830, 433144, 421005, 406770, 392040, 377903, 365408, 355341, 347952, 343362, 342001, 344341, 350452, 360208, 373792, 391627, 413894, 440418, 470992, 505341, 542484, 580155, 614999, 643473, 662726, 670975, 667505, 652754, 628531, 597878, 564225, 530386, 498188, 468881, 443527, 422995, 407768, 397906, 393076, 392621, 395867, 402585, 413120, 427919, 446927, 469407, 494121, 519462, 543402, 563491, 577150, 582203, 577426, 562858, 539865, 510961]
56797E10961l1588l1145k8567k5150k1701j8354j5062j1954r116o398l621p65
56785C07540K183N300Q442J1145J2940J3571J2769J0265O247J447l521q577j3511
56772C66240j7420j9384j9563j8962j8224j7214j5743j4054j2444j0881r249p619
56760A85483o136m918m115l756l519l036k470k356k664k616j704n58l21j277k469
56745A43568k690j686k98M37L23N9K73P64R00N69K22J25M1j33l1N66J171J153
56727A45333O13K59M27P31O55J73l90q51j232j432j211n90m7j3k71k03K82M69
56709A42702j90j152j307l10J005J588J166K12o41j002q37m03M0N07J121J735
56693A44234K008J831J368P37Om72k69M41Q96O77K54K68P20J173J416J486J315
$$ y = [510961, 479373, 448228, 419661, 394511, 372810, 354456, 339394, 327440, 318324, 311926, 308305, 307540, 309723, 315023, 323465, 334610, 347550, 361121, 373890, 384155, 390402, 391849, 388328, 379751, 366240, 348820, 329436, 309873, 290911, 272687, 255473, 239730, 225676, 213232, 202351, 193102, 185483, 179347, 174429, 170314, 166558, 163039, 160003, 157533, 155177, 152513, 149897, 148193, 147635, 147314, 146037, 143568, 140878, 139192, 138894, 139331, 139654, 139713, 139986, 140750, 141650, 142219, 142441, 142566, 142607, 142474, 142443, 143009, 144180, 145333, 145946, 146205, 146632, 147363, 148018, 148191, 147801, 146950, 145718, 144286, 143075, 142485, 142438, 142425, 142154, 141951, 142233, 142702, 142512, 141360, 140053, 139743, 140748, 142336, 143502, 143714, 143073, 142071, 141234, 140831, 140871, 141378, 142499, 144234, 146242, 148073, 149441, 150178, 150184, 149712, 149443, 149884, 150780, 151457, 151711, 151979, 152699, 153872, 155288, 156774, 158089]
56676A58089R10O76J087J931K400J947Q19k89q61q02l88q4j79n35p31n59k15l2
56658A63184j56n31r95j318j315r96o38n35p12r26j007j078j349j730j833j381
56642A46684m95M43J070J115N51j98m64o6M27M79L17M34O60L76l77q01m19L48
56624A50084R11J163J140O80r2n46l19Q4j9n61r68j055j044r77o34nO28J071J264
56605A50805J187R90J080J602K072J944J367R24P64O24M73N60P92P65M57K93L51
56588A67050J67l97o70m5J056J550R64m9m56Q8R19J106N07k9L27J336K019J924
56570A77367J596J756K416L085L487L795M331N159N922O053N394M543M268M542
56556B33714M630M179L725L774L933L413K131P35l23j167j974k552k683k539k594
$$ y = [158089, 158999, 159675, 160762, 162693, 165093, 167040, 167859, 167570, 166709, 165907, 165519, 165435, 165256, 164721, 163990, 163431, 163216, 163184, 163028, 162497, 161502, 160184, 158869, 157873, 157235, 156700, 155988, 155062, 154055, 152977, 151628, 149898, 148065, 146684, 146189, 146632, 147702, 148817, 149368, 149170, 148706, 148640, 149067, 149546, 149863, 150297, 150957, 151333, 150956, 150155, 149736, 150084, 150995, 152158, 153298, 153978, 153886, 153340, 153021, 153105, 153086, 152525, 151557, 150502, 149458, 148481, 147847, 147842, 148470, 149541, 150805, 151992, 152982, 154062, 155664, 157736, 159680, 161047, 161971, 162735, 163359, 163832, 164392, 165184, 165949, 166406, 166699, 167050, 167217, 166820, 166150, 166105, 167161, 168711, 169675, 169626, 169170, 169258, 170177, 171283, 171790, 171761, 172088, 173424, 175443, 177367, 178963, 180719, 183135, 186220, 189707, 193502, 197833, 202992, 208914, 214967, 220361, 224904, 229172, 233714, 238344, 242523, 246248, 250022, 253955, 257368, 259499, 260234, 259911, 258744, 256770, 254218, 251535, 248996, 246402]
56541B46402l184m266n427o093n880m947l950l509l709m069l968l152j908p92
56527A91548j48J21K68K80l1o01j015j019q88j009j265j244j010j184k017k860
56511A77926k935k324j751j608j687j776j877j843j398o88k90m39p33p79o58m84
56495A56656o7N65Q71M66k54p09r20j182j338j074o34m90m83k3Q72J525J603J512
56477A56896J572J551J252J015J216J693J946J788J564J830K806L927M094K788
56463A85938Q85j14K98J208J509J049M68L06N34O26L8j104j873j484l05N57O84
56446A89220O85J113J665J740J189K89n65r22n97j41m63j643k711k871k386j933
56430A81669j666j364j003o71k96M5l3o76j395j569j072q4J173K233K408J578
$$ y = [246402, 243218, 238952, 233525, 227432, 221552, 216605, 212655, 209146, 205437, 201368, 197400, 194248, 192340, 191548, 191400, 191521, 191789, 192069, 192038, 191437, 190422, 189403, 188515, 187506, 186241, 184997, 183987, 182803, 180786, 177926, 174991, 172667, 170916, 169308, 167621, 165845, 163968, 162125, 160727, 160039, 159749, 159310, 158577, 157798, 157140, 156656, 156589, 157154, 158025, 158491, 158237, 157528, 156608, 155426, 154088, 153014, 152380, 151890, 151407, 151384, 152256, 153781, 155384, 156896, 158468, 160019, 161271, 162286, 163502, 165195, 167141, 168929, 170493, 172323, 175129, 179056, 183150, 185938, 186823, 186709, 187007, 188215, 189724, 190773, 191241, 191547, 192081, 192707, 192745, 191641, 189768, 188284, 187979, 188536, 189220, 189905, 191018, 192683, 194423, 195612, 195901, 195336, 194414, 193817, 193676, 193213, 191570, 188859, 185988, 183602, 181669, 180003, 178639, 177636, 176965, 176669, 176714, 176681, 176005, 174610, 173041, 171969, 171885, 173058, 175291, 177699, 179277]
56414A79277N37J29L91Q83J335J586J464J283J804L106M092L910L235L200L650
56399B09882L546K780K292K393K220J138k84j144j322j320j469j695j739j410
56385B13868q51n21o34p62n07j95k82l35M52J815K527K094J387J233J316J060
56369B21665P27R15J500J888J932J919J814J223J50o92n80M26J512J923J706J533
56353B39561J768J998J729J234J169J551J818J774J769J873J698J290J344K086
56339B62662K719K578K135K143K385K143J617J785K857L751L447K227J248J209
56325B94906J848K493K818K968L159L362L494L691M110M445M115L164K468K696
56311C39737L385L566L067K638K809L228L227K639J835J185P24K52l39q24p87
$$ y = [179277, 179814, 179943, 180334, 181217, 182552, 184138, 185602, 186885, 188689, 191795, 195887, 199797, 203032, 206232, 209882, 213428, 216208, 218500, 220893, 223113, 224251, 223967, 222823, 221501, 220181, 218712, 217017, 215278, 213868, 213017, 212496, 211862, 211100, 210593, 210398, 210116, 209781, 210233, 212048, 214575, 216669, 218056, 219289, 220605, 221665, 222392, 223307, 224807, 226695, 228627, 230546, 232360, 233583, 233733, 233041, 232461, 232887, 234399, 236322, 238028, 239561, 241329, 243327, 245056, 246290, 247459, 249010, 250828, 252602, 254371, 256244, 257942, 259232, 260576, 262662, 265381, 267959, 270094, 272237, 274622, 276765, 278382, 280167, 283024, 286775, 290222, 292449, 293697, 294906, 296754, 299247, 302065, 305033, 308192, 311554, 315048, 318739, 322849, 327294, 331409, 334573, 337041, 339737, 343122, 346688, 349755, 352393, 355202, 358430, 361657, 364296, 366131, 367316, 368040, 368292, 367953, 367129, 366342]
56296C66342r4R24J900K834L789M385M194L606L711N040O862Q148Q840R662J0883
56281D41026J1912J2257J2243J2501J3138J3821J4512J5647J7617K0370K3540
56270F08584K6693K9535L2171L5214L9226M4021M8902N3673N8895O4833P0700
56259A112447P5471P9143Q2585Q6265Q9628R1703R1812Q9645Q5209P8873P1108
56248B033889O1982N1290L9314K7139J5883N815l647j3110k2522l1226l8641m4892
56236B081274n0643n6177o0963o4434o6900o9110p1023p1754p0945o9466o8295
56225A361564o7202o5168o1819n7830n3913m9982m5592m0853l6489l3042l0352
56214H19322k7953k5766k4018k2578k0847j8549j6204j4472j3319j2217j0863
$$ y = [366342, 366248, 367172, 369072, 371906, 375695, 380080, 384274, 387880, 391591, 396631, 403493, 411641, 420481, 430143, 441026, 452938, 465195, 477438, 489939, 503077, 516898, 531410, 547057, 564674, 585044, 608584, 635277, 664812, 696983, 732197, 771423, 815444, 864346, 918019, 976914, 1041747, 1112447, 1187918, 1267061, 1349646, 1435911, 1525539, 1617242, 1709054, 1798699, 1883908, 1962781, 2033889, 2095871, 2147161, 2186475, 2213614, 2229497, 2235312, 2231665, 2218555, 2196033, 2164807, 2126166, 2081274, 2030631, 1974454, 1913491, 1849057, 1782157, 1713047, 1642024, 1570270, 1499325, 1429859, 1361564, 1294362, 1229194, 1167375, 1109545, 1055632, 1005650, 960058, 919205, 882716, 849674, 819322, 791369, 765603, 741585, 719007, 698160, 679611, 663407, 648935, 635616, 623399, 612536]
56203F12536r274p488n682m438m154m288l853k644j324l09O12J397J426N65k35
56188E72847kJ092K203K978L648M358N065N912P083Q375R365J0017J0630J1293
56174F54864J1801J2112J2559J3439J4677J6021J7351J8706K0011K0949K1231
56163H33721K1091K1302K2460K4387K6507K8727L1553L5426M0417M6584N4205
56152A186380O3529P4705Q8067J04113J23083J44713J68135J91321K10775K22572
56142B577393K24058K14366J93993J65331J33630J05661Q6001P4843O9383O6047
56132C910706O0882M9789L0751N984j9224l9999n4104o2077o6909p3432q6228
56121C656139j07065j34138j63302j89435k07531k14386k10032j97105j78699
$$ y = [612536, 603262, 595774, 590092, 585654, 581500, 577212, 573359, 570715, 569391, 569082, 569694, 571091, 572517, 573082, 572847, 572845, 573937, 576140, 579118, 582766, 587124, 592189, 598101, 605184, 613559, 622924, 632941, 643571, 654864, 666665, 678777, 691336, 704775, 719452, 735473, 752824, 771530, 791541, 812490, 833721, 854812, 876114, 898574, 922961, 949468, 978195, 1009748, 1045174, 1085591, 1132175, 1186380, 1249909, 1324614, 1412681, 1516794, 1639877, 1784590, 1952725, 2144046, 2354821, 2577393, 2801451, 3015817, 3209810, 3375141, 3508771, 3614432, 3700433, 3775276, 3844659, 3910706, 3971588, 4021377, 4052128, 4058112, 4038888, 3998889, 3944785, 3882708, 3815799, 3742367, 3656139, 3549074, 3414936, 3251634, 3062199, 2854668, 2640282, 2430250, 2233145, 2054446]
56112B054446j57211j34701j13063r3383p5866o0601m7914l7861k9896k3241j7197
56101A263512j1292n625r56K162M184N830O900O702N474M311L613K668R98q80
56087A287601k398l616m556m700l817k575j665q68L68J920L165L920M653N850
56073A283282P570R498J1190J2434J3460J4651J5920J6767J6988J7039J7460J8315
56061A454574J9254J9880J9957J9616J9444J9978K1077K2151K3010K3940K4994
56050A687875K5816K6348K7024K8051K9129L0172L1669L3875L6211L8002L9428
56039B033600M1166M3344M5384M6768M7485M7801M7995M8336M9059N0279N1987
56028B553204N4099N6458N8882O1269O3604O5895O8165P0494P2915P5429P8219
$$ y = [2054446, 1897235, 1762534, 1649471, 1556088, 1480222, 1419621, 1371707, 1333846, 1303950, 1280709, 1263512, 1252220, 1246595, 1245639, 1247801, 1251985, 1257815, 1264715, 1271417, 1276891, 1281202, 1284815, 1287483, 1288481, 1287601, 1285203, 1281587, 1277031, 1272331, 1268514, 1265939, 1264274, 1263406, 1263774, 1265694, 1268859, 1272779, 1277432, 1283282, 1290852, 1300350, 1311540, 1323974, 1337434, 1352085, 1368005, 1384772, 1401760, 1418799, 1436259, 1454574, 1473828, 1493708, 1513665, 1533281, 1552725, 1572703, 1593780, 1615931, 1638941, 1662881, 1687875, 1713691, 1740039, 1767063, 1795114, 1824243, 1854415, 1886084, 1919959, 1956170, 1994172, 2033600, 2074766, 2118110, 2163494, 2210262, 2257747, 2305548, 2353543, 2401879, 2450938, 2501217, 2553204, 2607303, 2663761, 2722643, 2783912, 2847516, 2913411, 2981576, 3052070, 3124985, 3200414, 3278633]
56017C278633Q1662Q5826R0134R3835R6796R9603J02992J07371J12623J18126
56007D267601J23249J28049J33232J39174J45494J51926J58930J66870J75296
55998E589821J83811J93023K03655K15304K27211K39810K54142K70090K86663
55989G663530L04006L23536L45812L69788L94704M21399M51104M83966N19599
55980A1277444N58263O00745O47659O99429P56701Q20496Q92337R74260J068241
55971A8295575J175721J298349J439025J601707J790684K011101K269867K575006
55963C2457035K934363L355863L848177M419847N078458N832705O695574P685315
55955G2307337Q825638J0147303J1686950J3478292J5538822J7855922K0365483
$$ y = [3278633, 3360295, 3446121, 3536255, 3630090, 3726886, 3826489, 3929481, 4036852, 4149475, 4267601, 4390850, 4518899, 4652131, 4791305, 4936799, 5088725, 5247655, 5414525, 5589821, 5773632, 5966655, 6170310, 6385614, 6612825, 6852635, 7106777, 7376867, 7663530, 7967536, 8291072, 8636884, 9006672, 9401376, 9822775, 10273879, 10757845, 11277444, 11835707, 12436452, 13084111, 13783540, 14540241, 15360737, 16253074, 17227334, 18295575, 19471296, 20769645, 22208670, 23810377, 25601061, 27612162, 29882029, 32457035, 35391398, 38747261, 42595438, 47015285, 52093743, 57926448, 64622022, 72307337, 81132975, 91280278, 102967228, 116445520, 131984342, 149840264, 170205747]
55948A70205747K2915469K5224586K6858356K7240788K5726989K1778783J5243373
55941C35194091O607972k985020j2068824j9374375k4228215k6619811k6989899
55934B29535919k5943726k4046715k1735357j9305815j6939555j4738641j2753748
55927I4072362j1001387r476287q162000p037466o079650n265684m574974l989286
55919C8485628l491759l067527k704943k394766k128458j898424j699099j526216
55911A9574436j375406j242695j125739j023083r32506q51401p78298p12746o54013
55902A0878549o01058n53328n10450m71568m36049m04290l76622l52039l29162
55893F843983l07859k88509k70381k52401k35093k19973k07085j94916j82798
$$ y = [170205747, 193121216, 218345802, 245204158, 272444946, 298171935, 319950718, 335194091, 341802063, 338817043, 326748219, 307373844, 283145629, 256525818, 229535919, 203592193, 179545478, 157810121, 138504306, 121564751, 106826110, 94072362, 83070975, 73594688, 65432688, 58395222, 52315572, 47049888, 42474914, 38485628, 34993869, 31926342, 29221399, 26826633, 24698175, 22799751, 21100652, 19574436, 18199030, 16956335, 15830596, 14807513, 13875007, 13023606, 12245308, 11532562, 10878549, 10277491, 9724163, 9213713, 8742145, 8306096, 7901806, 7525184, 7173145, 6843983, 6536124, 6247615, 5977234, 5724833, 5489740, 5269767, 5062682, 4867766, 4684968]
55884D684968j71668j62244j54039j46662j40487j35353j29884j23111j15805
55875C405715j09386j04217r9652r5139r0559q6017q1858p8526p5906p3219p0002
55864B441234o6755o4177o2160o0103n7875n5881n4286n2682n0663m8368m6412
55853A821872m5249m4640m3607m1146l7177l2744k9102k6546k4327k1802j9392
55842A456140j8072j7966j7979j7106j5591j4267j3164j1653r811q671q830r763
55830A293267j0916j2571j4921j7104j8155j8465j9322k1171k3213k4653k5494
55819A087282k5975k6003k5419k4358k2991k1336j9487j7782j6519j5613j4607
55808H57192j3017j0712q068n675l833k403j138R7J323K400K937K762K403K438
$$ y = [4684968, 4513300, 4351056, 4197017, 4050355, 3909868, 3774515, 3644631, 3521520, 3405715, 3296329, 3192112, 3092460, 2997321, 2906762, 2820745, 2738887, 2660361, 2584455, 2511236, 2441234, 2374479, 2310302, 2248142, 2188039, 2130164, 2074283, 2019997, 1967315, 1916652, 1868284, 1821872, 1776623, 1731983, 1688376, 1647230, 1610053, 1577309, 1548207, 1521661, 1497334, 1475532, 1456140, 1438068, 1420102, 1402123, 1385017, 1369426, 1355159, 1341995, 1330342, 1320531, 1311860, 1303030, 1293267, 1282351, 1269780, 1254859, 1237755, 1219600, 1201135, 1181813, 1160642, 1137429, 1112776, 1087282, 1061307, 1035304, 1009885, 985527, 962536, 941200, 921713, 903931, 887412, 871799, 857192, 844175, 833463, 825395, 819720, 815887, 813484, 812346, 812443, 813766, 816166, 819103, 821865, 824268, 826706]
55794H26706K261K44m405j0566j6396k0832k3534k4200k2963k0912j9220j7936
55782F48247j6447j4743j3362j2303j0949r069p179n873n404n749o468o736o280
55769E27685o035p018q737r692r397q814q727q778q487q271q778r916j1053j1749
55755D02233j1891j1540j1027j0809j0927j0964j0671j0261r899r365q439p226
55743B79214n931m651l568k861k351j625p14j67k77o87r29r47q40n46p1K84K42
55726B53575k15r31j686k140k053j749j906k727l663m079l873l286k534j773j126
55711B19834n80r6J85J33l3oJ05M7R7P42J739K244K019J682J561J159K51l70O9
55692B30782J210K207K969L960N137N923O091N956N660M963L804K598J688Q72
$$ y = [826706, 828967, 829211, 824806, 814240, 797844, 777012, 753478, 729278, 706315, 685403, 666183, 648247, 631800, 617057, 603695, 591392, 580443, 571374, 564195, 558322, 552918, 547169, 540701, 533965, 527685, 521650, 514632, 505895, 496203, 486806, 477992, 469265, 460487, 452000, 443729, 434951, 425035, 413982, 402233, 390342, 378802, 367775, 356966, 346039, 335075, 324404, 314143, 304244, 294879, 286440, 279214, 273283, 268632, 265064, 262203, 259852, 258227, 257513, 257346, 257069, 256382, 255453, 254506, 253666, 253120, 253049, 253333, 253575, 253360, 252429, 250743, 248603, 246550, 244801, 242895, 240168, 236505, 232426, 228553, 225267, 222733, 220960, 219834, 219254, 219158, 219343, 219476, 219443, 219437, 219542, 219589, 219686, 220428, 222167, 224411, 226430, 228112, 229673, 230832, 231083, 230713, 230782, 231992, 234199, 237168, 241128, 246265, 252188, 258279, 264235, 269895, 274858, 278662, 281260, 282948, 283820]
55678B83820l16j979l676m855n449n899o551p104o980o164n301m926m883m643
55664B15094l875k641j366o52p50j118q99P1J144J775K081K381K785L351M064
55649B21445M446L869K552J495J102O05o16j944k444k266k195k405k538k668l172
55634B15266l761l618k590j447q83q94j245j865k615l226l652m099m602n026n506
55619A70237o295p086p039n810m113k919k445k217j895j674j892k443k750k384
55605A19275j705j584k303l035k854j940j295j332j501j348j195j408j555r90
55591I5230Q8P20M28k29m31n5M01O34Q77J419K127K664L018L468M066M471M473
55574A23369M350M460M622M226K896Q42j455l660n566o869p249o731n857n285
$$ y = [283820, 283504, 281525, 277849, 272994, 267545, 261646, 255095, 247991, 241011, 234847, 229546, 224620, 219737, 215094, 211219, 208578, 207212, 206560, 205810, 204692, 203793, 203864, 205008, 206783, 208864, 211245, 214030, 217381, 221445, 225891, 229760, 232312, 233807, 234909, 235514, 234898, 232954, 230510, 228244, 226049, 223644, 221106, 218438, 215266, 211505, 207887, 205297, 203850, 202967, 202073, 200828, 198963, 196348, 193122, 189470, 185371, 180769, 175743, 170237, 163942, 156856, 149817, 144007, 139894, 136975, 134530, 132313, 130418, 128744, 126852, 124409, 121659, 119275, 117570, 115986, 113683, 110648, 107794, 105854, 104559, 103227, 101726, 100378, 99183, 97775, 96220, 95230, 95318, 96038, 96466, 96237, 95806, 95751, 96152, 96786, 97663, 99082, 101209, 103873, 106891, 110359, 114425, 118896, 123369, 127719, 132179, 136801, 141027, 143923, 144765, 143310, 139650, 134084, 127215, 119966, 113235, 107378, 102093]
55560A02093n107m772l854k705k023j942j966j761j528j457j359j065q11q40j034
55545F9869j181j351j655j901j849j545j143o72k26n8j41NO10J153J049N00J69
55528F1633J88J87P0J29M69Q84J271J639J793J531J149J103J248J099P97J091
55512G6281K114K980K965K457K308K665K945K649J745M96o78j330j357j181j319
55497I3740j840k416k817l136l565m080m383m225l757l406l254k825j799o87l15
55482E1235p61j340j642j923k350k519k056j232n98l48l76n44o45m07J01M01K67
55465C5263O5J41J87k84j139j741j705j084q0R82J539J247N01L3j4j24m94o96
55447C2597m36j25l08q19r79n21Q3K90J51J36M09N92L05k35n12m46m14n30l35
$$ y = [102093, 96986, 92214, 88360, 85655, 83632, 81690, 79724, 77963, 76435, 74978, 73619, 72554, 71743, 70903, 69869, 68688, 67337, 65682, 63781, 61932, 60387, 59244, 58572, 58346, 58288, 58147, 58152, 58762, 59915, 60964, 61464, 61633, 61821, 62008, 62078, 62207, 62676, 63560, 64831, 66470, 68263, 69794, 70943, 72046, 73294, 74393, 75190, 76281, 78395, 81375, 84340, 86797, 89105, 91770, 94715, 97364, 99109, 99605, 98927, 97597, 96240, 95059, 93740, 91900, 89484, 86667, 83531, 79966, 75886, 71503, 67278, 63521, 60115, 56861, 54036, 52237, 51550, 51235, 50474, 49134, 47492, 45569, 43219, 40700, 38644, 37412, 36814, 36466, 36090, 35546, 34901, 34494, 34595, 34996, 35263, 35328, 35469, 35656, 35372, 34233, 32492, 30787, 29703, 29623, 30605, 32144, 33391, 33892, 33925, 33911, 33787, 33293, 32597, 32161, 32036, 31728, 30909, 29930, 29409, 29492, 29782, 29933, 30069, 30478, 31070, 31375, 31140, 30628, 30182, 29768, 29238, 28903]
55428B8903M37J198J172M99M2Q0m2p39j372j164m14n3k40k53K18M85jo65o05P3
55408B7559M43J38k70k50m2q7l10l62j59J69N42Q20P25K84J7K61N71L46k07l25
55388B9863J77P15Q45P51O79N69M13L66L01k12j113j631j330q11q91j464j782
55371B5445j532j032n53j54J4j68l71j39L11K72l85r14p75l26j31l8L90R15P66
55352B1595k09j166j194l06P61J402J545J378J028N96K10q7l23m16j54L91O47
55335B5698J40p82j197p11R3M82M35L39K40o4m16m25j66j02k56j73J09j62j240
55316B1842k066j525p8P29K69n19n79nN58R73J437J720J372N84J05K45M43O9p53
55297B4821j366j354q86l40O5L07L88K86P5q2j33k48m89n57j22N06N86J0m10n5
$$ y = [28903, 29340, 30538, 31710, 32209, 32251, 32331, 32289, 31550, 30178, 29014, 28600, 28547, 28307, 28054, 28272, 28757, 28756, 28091, 27486, 27559, 28002, 28140, 27870, 27620, 27578, 27491, 27181, 26819, 26660, 26829, 27371, 28191, 28916, 29200, 29217, 29478, 30049, 30395, 30188, 29863, 30040, 30755, 31600, 32351, 33030, 33599, 34012, 34378, 34679, 34467, 33354, 31723, 30393, 29582, 28691, 27227, 25445, 23913, 22881, 22328, 22174, 22188, 22020, 21649, 21510, 21821, 22093, 21708, 20794, 20019, 19693, 19562, 19524, 19914, 20829, 21595, 21386, 20220, 19026, 18720, 19481, 20883, 22428, 23806, 24834, 25430, 25640, 25553, 25230, 24814, 24660, 25051, 25698, 25838, 25056, 23859, 23148, 23241, 23723, 24158, 24497, 24737, 24673, 24257, 23832, 23666, 23564, 23308, 23135, 23244, 23082, 21842, 19776, 18251, 18173, 18902, 19171, 18652, 18073, 18068, 18626, 19599, 21036, 22756, 24128, 24712, 24817, 25062, 25505, 25574, 24821, 23455, 22101, 21215, 20875, 20940, 21247, 21635, 21921, 21996, 21914, 21781, 21533, 21044, 20487, 20365, 20871, 21457, 21467, 21057, 21002]
55277B1002N04L15n55j192j231j157j149o89L05Q69K51q60j146l72M99P08M18
55260A6520J16q4l25o58r91j171j023n06J42O06P94Q07P06N20L15J15q7j06L14
55241A6004R68J144M80n03j084j187j082p33j07L24K04R1P33J683J739P70K1K89
55223A9754Q55P30N7l73l48k46k40j59J15N70J113J375Q98j04o94l63J87J9p28
55204B2418j142q64m13k52k31r2Q1rm62j024j182o47J84N06J28k05J47P76Q85
55185A8602M75J91J69o2n98q21l23M89R63Q99M88J3j76J55O81O64r0q51r03m36
55165A9529r0Q3N74J401J844J361L52l87n66n11n32o68r51j459j942j863j095
55148A5080k28J15P7K21O48R38R16Q33P14J80p94j499j280l48N65J055J165R90
$$ y = [21002, 21506, 21821, 21266, 20074, 18843, 17686, 16537, 15848, 16153, 17022, 17273, 16413, 15267, 14895, 15394, 16102, 16520, 16636, 16552, 16227, 15569, 14578, 13407, 12384, 11878, 12020, 12626, 13420, 14227, 14933, 15453, 15768, 15883, 15796, 15690, 16004, 16972, 18116, 18596, 18093, 17009, 15822, 14740, 14007, 13900, 14224, 14428, 14519, 15252, 16935, 18674, 19444, 19465, 19754, 20609, 21339, 21396, 21023, 20675, 20429, 20189, 20030, 20145, 20715, 21828, 23203, 24101, 23997, 23303, 22940, 23127, 23146, 22418, 21276, 20412, 19999, 19747, 19516, 19424, 19505, 19496, 19034, 18010, 16828, 16181, 16365, 16871, 16999, 16794, 16941, 17717, 18602, 19077, 19268, 19437, 19375, 18777, 17956, 17633, 18122, 19085, 19984, 20472, 20485, 20309, 20464, 21145, 21809, 21719, 20868, 19965, 19529, 19439, 19522, 20096, 21497, 23341, 24702, 25054, 24667, 24101, 23590, 23058, 22390, 21439, 19980, 18038, 16175, 15080, 14852, 14967, 15044, 15265, 15913, 16851, 17767, 18600, 19314, 19494, 18700, 17201, 15921, 15573, 16138, 17193, 18358, 19348]
55130A9348O12K24l4k40l78j18O80J518J724J313R38J079J635K210K453K245J884
55113C7093J915K444K812K438J687J297J157M81q32j840j859j400j345j777k073
55098D0198j808j089l06P4k82j151j741j429m74L27M86J20m46r08r33l16O08J081
55080C2011O50l37j105j214q10k49K78P66J189J423J296P22j49q52q95k39O24
55063C3109J153J241R92L81m95j072q08k1L97K16J49O15R09K53r18j410q23R8
55045C3966N42M32J78J70N89J248J612J372R41R68J425J695J502J264J402J853
55029E1159K374K801K914K485J679J030Q56R73J034Q31K47n92j134q50%N38L82
55012F6727Q3J97M45K08n44j168j088m01J38l28j842l354l651k718j613j028n67
$$ y = [19348, 19960, 20184, 20150, 19910, 19532, 19414, 20094, 21612, 23336, 24649, 25587, 26666, 28301, 30511, 32964, 35209, 37093, 39008, 41452, 44264, 46702, 48389, 49686, 50843, 51324, 50492, 48652, 46793, 45393, 44048, 42271, 40198, 38390, 37301, 36995, 37069, 36787, 35636, 33895, 32466, 31992, 32319, 32805, 32925, 32479, 31571, 30638, 30322, 30930, 32011, 32661, 32324, 31219, 30005, 29195, 28946, 29224, 29990, 31179, 32602, 33898, 34620, 34471, 33619, 32724, 32485, 33109, 34262, 35503, 36495, 36876, 36381, 35309, 34501, 34480, 34877, 35093, 35242, 35857, 36766, 37019, 36101, 34691, 33868, 33966, 34508, 34940, 35118, 35288, 35877, 37125, 38737, 40109, 41050, 42018, 43443, 45138, 46640, 47904, 49306, 51159, 53533, 56334, 59248, 61733, 63412, 64442, 65298, 66271, 67305, 68136, 68383, 67791, 66657, 65807, 65807, 66345, 66727, 66810, 67007, 67452, 67660, 67116, 65948, 64860, 64459, 64597, 64269, 62427, 59073, 55422, 52704, 51091, 50063, 49496]
54995D9496K52R91Q45j81j207j408o42N81J424J248K24p08p60J4J037J876K287
54978E5369K042J150J03m90m44O4Q48J716K347K522K416K403K668L140L673M135
54962H3662M547N179O228P378Q159Q816J0272J2866J5701J7654J8559J8871J8572
54949B36464J7076J3964R427M062j322n947r494j2154j4095j5248j5738j5957
54937A91038j5796j4637j2548j0752j0071r658q328o528n604n521m836k993j153
54924H2613l56j43M03J290K103K946M073N176N835O372P506R415J1604J3546J5020
54909A67403J5984J6479J6474J5627J3424R758N170K95m526r015j2738j5472j7327
54896B01536j8334j8165j6717j4560j2480j0792r366q004o577n115l971l542l609
$$ y = [49496, 49748, 50739, 51584, 51403, 50196, 48788, 48146, 48727, 50151, 51399, 51623, 50915, 50155, 50169, 51206, 53082, 55369, 57411, 58561, 58664, 58174, 57730, 57794, 58642, 60358, 62705, 65227, 67643, 70046, 72714, 75854, 79527, 83662, 88209, 93388, 99616, 106994, 115153, 123969, 134241, 147107, 162808, 180462, 199021, 217892, 236464, 253540, 267504, 276931, 280993, 279671, 273724, 264230, 252076, 237981, 222733, 206995, 191038, 175242, 160605, 148057, 137305, 127234, 117576, 109248, 102720, 97116, 91595, 86759, 83766, 82613, 82257, 82114, 82517, 83807, 85910, 88856, 92929, 98105, 103940, 110312, 117818, 127233, 138837, 152383, 167403, 183387, 199866, 216340, 231967, 245391, 255149, 260319, 260614, 256088, 247073, 234335, 218863, 201536, 183202, 165037, 148320, 133760, 121280, 110488, 101122, 93118, 86541, 81426, 77455, 73913, 70304]
54883G0304l399k592j707j179p05LM73K87M2N86J614K032J563R91P36K95o32j420
54865F7292j503j269j360j654j610j271j160j401j637j784k209k964l423k971
54851D1076j777n84R2K17k9m87q72q26k82L70O81N85L30J05j8P4M20P34O19R7
54831D0525l56m35l09j79J02O62J176J228R15P17Q46J082J197J209J236J372J679
54814E2667K046K131J778J408J691K815M354N800O924P698Q275R090J0493J2303
54800A29473J4013J5447J6718J7534J7233J5707J3624J1315Q091L305k398p547
54788B52515j1276j3586j4524j4069j2816j1806j1296j0463q759o878n792n334
54776A25916m557l229k112j689j437p33J79O22N76P10J424K433L369M273N264
$$ y = [70304, 66905, 64313, 62606, 61427, 60722, 60725, 61198, 61485, 61527, 62113, 63727, 65759, 67322, 68313, 69049, 69344, 68712, 67292, 65789, 64520, 63160, 61506, 59896, 58625, 57465, 56064, 54427, 52643, 50434, 47470, 44047, 41076, 39299, 38715, 38807, 39024, 38995, 38508, 37636, 36810, 36528, 36898, 37579, 38164, 38494, 38599, 38581, 38655, 39075, 39809, 40428, 40525, 40169, 39734, 39425, 39246, 39348, 40010, 41186, 42414, 43329, 44046, 44892, 45974, 47171, 48380, 49616, 50988, 52667, 54713, 56844, 58622, 60030, 61721, 64536, 68890, 74690, 81614, 89312, 97587, 106677, 117170, 129473, 143486, 158933, 175651, 193185, 210418, 226125, 239749, 251064, 259155, 262460, 260062, 252515, 241239, 227653, 213129, 199060, 186244, 174438, 163142, 152679, 143920, 137042, 131250, 125916, 121359, 118130, 116018, 114329, 112892, 112159, 112338, 112960, 113536, 114246, 115670, 118103, 121472, 125745, 131009]
54761A31009O188O988Q137J0177J2890J5426J7279J8628J9619J9785J8601J6210
54749C00937J3220J0001O609L246L34j872l389m320m991o125q364j1432j4194
54736B79660j5812j6463j6830j7210j7391j7051j5963j4103j1859r931q727p974
54724A10346p160o181n255m449l676l051k825k988l199l160k789k108j243n20
54710F1742k69m35n54j83O78J546J726R25k56p21r0P56P60J5n36n42n89j110j704
54691F1159j813j462r81m77K1L34M68P87J476K124K237J862J381R97Q77J424K767
54674G3181M112M245K867R71j80j87M22Q11M58n09j334j229j18J225J910J752
54658H8397J301J174J416J589J443J355J915L170M539N576O386P197P868Q151
$$ y = [131009, 137197, 144185, 152322, 162499, 175389, 190815, 208094, 226722, 246341, 266126, 284727, 300937, 314157, 324158, 330767, 334013, 334347, 332475, 329086, 324766, 319775, 313650, 305286, 293854, 279660, 263848, 247385, 230555, 213345, 195954, 178903, 162940, 148837, 136978, 127047, 118320, 110346, 103186, 97005, 91750, 87301, 83625, 80574, 77749, 74761, 71562, 68402, 65613, 63505, 62262, 61742, 61473, 61038, 60484, 60301, 60979, 62525, 64251, 65176, 64920, 64199, 64109, 64865, 65625, 65640, 65104, 64562, 63973, 62863, 61159, 59346, 57884, 56903, 56426, 56447, 56781, 57249, 58036, 59512, 61636, 63873, 65735, 67116, 68113, 68990, 70414, 73181, 77293, 81538, 84405, 85376, 85196, 85009, 85431, 86242, 86700, 86191, 84857, 83628, 83510, 84735, 86645, 88397, 89698, 90872, 92288, 93877, 95320, 96675, 98590, 101760, 106299, 111875, 118261, 125458, 133326, 141477]
54644A41477Q219Q570R510J0973J2669J4258J5514J6675J8342K0786K3518K5774
54632C26285K7124K7183K5119K0104J2263K773o922j5556k2089k5990k7590k7588
54620C15116k6269k3704k0657j8414j7413j6712j5184j2762j0186q049o502n493
54608A33771m855m375m092m268m760m879m155k994k154j930k153k640l118l044
54594H4354k086p32J26J85j63n63r82j304j191o17n5J17Q2K18M83M76Mo36r92
54575G6724r14p13q45j421k007k034j402n66k9J29J05n0m69j075j420j158n66
54558F2289l06n81q19m24L99R36R63R48J218J380R93L85L26R51J516J391R31R87
54540G3483J737K398K209J427R75J315K065K859L944N595P309Q312Q701R354J0613
$$ y = [141477, 149696, 158266, 167776, 178749, 191418, 205676, 221190, 237865, 256207, 276993, 300511, 326285, 353409, 380592, 405711, 425815, 438078, 440851, 433929, 418373, 396284, 370294, 342704, 315116, 288847, 265143, 244486, 226072, 208659, 191947, 176763, 164001, 153815, 145766, 139264, 133771, 128916, 124541, 120449, 116181, 111421, 106542, 102387, 99393, 97239, 95309, 93156, 90516, 87398, 84354, 82268, 81536, 81662, 81847, 81684, 81121, 80139, 78835, 77644, 77027, 76972, 77089, 77171, 77389, 77872, 78348, 78352, 77716, 76724, 75810, 75097, 74252, 72831, 70824, 68790, 67388, 66822, 66793, 66922, 67027, 66977, 66508, 65433, 64013, 62855, 62289, 61983, 61402, 60583, 60159, 60558, 61494, 62457, 63405, 64623, 66003, 66996, 67381, 67707, 68658, 70174, 71565, 72496, 73483, 75220, 77618, 79827, 81254, 82229, 83544, 85609, 88468, 92412, 98007, 105316, 113628, 122329, 131683, 142296]
54525A42296J1731J1953J1555J1348J1421J0975R264O355K904n16l772o963r877
54512B08674j1856j2395j1838j1036j0332r333p843o420n688n550n489n282m916
54499A00696m193l008j821j260j352j600j667j551j213o34k03m39j204j689j291
54484G7571k43O94Q97K62o94j213j081q87j106j227m73Q39J536J221P31O91N79
54467G8097j83j058j116l83K99M94M30K55j44o10p07l96r0M8L51R52J336R79Q5
54448G8639o69q99p06k50L94R63R81K14r14j612j432n84L87J086J394J374J189
54431G9555J019Q70N21j81r94j443j258n70K64Q23P47J10m18j83N89R85O12J71
54413H1219N25J575K540K994L100K971K461J685J244J644K696L648L756K728Q65
$$ y = [142296, 154027, 165980, 177535, 188883, 200304, 211279, 220543, 226898, 229802, 229286, 225514, 218551, 208674, 196818, 184423, 172585, 161549, 151217, 141884, 134041, 127621, 121933, 116383, 110894, 105612, 100696, 96503, 93495, 91674, 90414, 89062, 87462, 85795, 84244, 83031, 82397, 82194, 81755, 80551, 78862, 77571, 77328, 78022, 78919, 79181, 78487, 77274, 76193, 75306, 74200, 72973, 72500, 73339, 74875, 76096, 76827, 77518, 78097, 77914, 76856, 75740, 75357, 75656, 76150, 76580, 76835, 76691, 76081, 75374, 74978, 74888, 74936, 75287, 76239, 77575, 78554, 78639, 77970, 77071, 76365, 76115, 76509, 77472, 78453, 78667, 77753, 76141, 74709, 74125, 74512, 75598, 76992, 78366, 79555, 80574, 81444, 81965, 81784, 80790, 79347, 78089, 77519, 77783, 78606, 79353, 79463, 79045, 78862, 79451, 80436, 81048, 81219, 81744, 83319, 85859, 88853, 91953, 94924, 97385, 99070, 100314, 101958, 104654, 108302, 112058, 114786, 115651]
54398A15651j039k195k310j654o87J51M29l9q54j310j273j385k091k858k810j923
54382I3803j039p54q64j026j327j869k275k109j574j265j331j303q77m36n68j250
54366G3936j817j708j051m35j84k8L88R20J152J173J606K589L271K850J824J411
54350H5897J922K518K632K684K997K918J782J14r79j234j266j480j805k275k939
54335I1486l235k447r81k22p85j781k201k236k555l004k897k198j576j427j513
54320F2428j501j290r37o88r49j708k206j790q35k80k89k75j29m59j338j771j060
54303D4923P9M79J76J54P54J221R06J47l64m58l65j56K08M86L07k62n73k9J232
54284D8865K379K608J867Q99M73O32P90N16N1j44m3k2k51m71m28k79l46n88n70
$$ y = [115651, 114612, 112417, 110107, 108453, 107766, 107917, 108346, 108307, 107453, 106143, 104870, 103485, 101394, 98536, 95726, 93803, 92764, 92010, 91146, 90120, 88793, 86924, 84649, 82540, 80966, 79701, 78370, 77067, 76190, 75754, 75186, 73936, 72119, 70411, 69360, 68925, 68741, 68713, 69101, 70021, 71173, 72346, 73952, 76541, 79812, 82662, 84486, 85897, 87819, 90337, 92969, 95653, 98650, 101568, 103350, 103464, 102485, 101251, 99985, 98505, 96700, 94425, 91486, 88251, 85804, 84823, 84601, 83816, 82035, 79834, 77598, 75043, 72039, 69142, 66944, 65368, 63941, 62428, 60927, 59637, 58700, 58012, 57063, 55355, 53149, 51359, 50524, 50244, 49955, 49680, 49551, 49092, 47754, 45983, 44923, 45002, 45481, 45657, 45811, 46565, 47786, 48692, 48839, 48475, 48017, 47652, 47496, 47704, 48190, 48497, 48235, 47662, 47633, 48865, 51244, 53852, 55719, 56618, 57091, 57723, 58513, 59029, 59080, 58936, 58893, 58871, 58620, 58149, 57721, 57442, 57096, 56508, 55938]
54265E5938j9P20R26K71p00j058n10K48M39K50N57J604K471K189R94L7pM84Q86
54246F5720J106J312J316Q12N1k49J44N20Q1r20j444j082o98j244k320k588j537
54229E8980k03J99k75o48m20l0l7m83j084j568j695j317o42j66k00o00j025j299
54211D7487j444j521j498j202n15K87N86J42m23l36K58N35K74J92P88J513J593
54194D6716J148R06J105J242Q71J66l83m80k59j26l44p13q14o31o13r33j111o78
54176D5069P3M43K10k44n68p42q18p83o69n63m88n12p97j309j646j537j223r95
54158C2901o11J95R26P60j68p57l98K57L58P7J90Q74J489J475R23K77j46k84k03
54139C8135m0Q5J49K31L93N78N97L82J65K90O85P87K40m83n63J50R30J007L00
$$ y = [55938, 55919, 56639, 57565, 57836, 57136, 56078, 55568, 55816, 56255, 56505, 57062, 58666, 61137, 63326, 64320, 64357, 64350, 64834, 65720, 66826, 68138, 69454, 70266, 70317, 70068, 70212, 70732, 70813, 69893, 68449, 67367, 66669, 65425, 63105, 60517, 58980, 58777, 58976, 58701, 58053, 57633, 57603, 57566, 57083, 55999, 54431, 52736, 51419, 50777, 50611, 50411, 49811, 48786, 47487, 46043, 44522, 43024, 41822, 41307, 41594, 42180, 42322, 41899, 41563, 41821, 42356, 42630, 42822, 43610, 45123, 46716, 47864, 48770, 49875, 51117, 51988, 52154, 51771, 51291, 51032, 50906, 50562, 49849, 49035, 48404, 47791, 46858, 45747, 45069, 45142, 45585, 45795, 45551, 44983, 44241, 43423, 42640, 41971, 41408, 40920, 40408, 39611, 38302, 36656, 35119, 33896, 32901, 32290, 32485, 33411, 34171, 34003, 33246, 32848, 33105, 33463, 33540, 33730, 34604, 36093, 37568, 38491, 38768, 38622, 38338, 38135, 38095, 38180, 38329, 38560, 38953, 39531, 40128, 40510, 40675, 40965, 41650, 42437, 42677, 42194, 41631, 41781, 42711, 43718, 44018]
54120D4018o09j015o48M0K37k73p64n77j15j55m12J35J477K225J528L16m3M84
54102D5849J013J175J191R66K88l67k65L79O05J89p1L02P32O08J78k7MP6L31Q25
54082E3981J045N33k55l89L03J062J229R68P82P70O24J48m45p25m54J92P31P99
54064F0899M21rm7M64J167J381Q02M4J46J356K686K997K264J422J099J050Q86
54047G9028Q41J438K642L748M136L861L460L304L304L165K758K177J543R58O10
54032A16973O77J052J295J115P73P68J159J397R76j1j044j846k646l774n035n669
54016A06160n059l471k010j620k175k709k530j912j616j938k410k361j631p10
54002G4008k34l63o82p04n03n44r41j161p67j68j45o98r52l72M18M61j85n42o3
$$ y = [44018, 43409, 42394, 41746, 41786, 42023, 41750, 40986, 40409, 40294, 40139, 39727, 39862, 41339, 43564, 45092, 45408, 45365, 45849, 46862, 48037, 49228, 50194, 50482, 50115, 49850, 50229, 50834, 51023, 50952, 51254, 51986, 52594, 52772, 52745, 52749, 52825, 53156, 53981, 55026, 55559, 55304, 54915, 55218, 56280, 57509, 58477, 59259, 60029, 60653, 60801, 60356, 59631, 59177, 59369, 60100, 60899, 61320, 61311, 61264, 61728, 62895, 64276, 65078, 65122, 65268, 66624, 69310, 72307, 74571, 75993, 77092, 78142, 79028, 79869, 81307, 83949, 87697, 91833, 95694, 99154, 102458, 105762, 108927, 111685, 113862, 115405, 116363, 116973, 117650, 118702, 119997, 121112, 121885, 122653, 123812, 125209, 126185, 126174, 125130, 123284, 120638, 116864, 111829, 106160, 101101, 97630, 95620, 94000, 91825, 89116, 86586, 84674, 83058, 81120, 78710, 76349, 74718, 74008, 73774, 73411, 72729, 72025, 71522, 70978, 70037, 68876, 68109, 67941, 67796, 67098, 66146, 65774, 66192, 66653, 66468, 65926, 65863]
53983F5863O63P38K6q81j453j601j434j026m78M6M06M78J68l30m49J44Q99Q43
53965F2622r0o98O7J692K704K442J587R79O89M90N34J016J669K053K174K235K144
53948H4309J806J682K351L597M518M678M532M599M844N130N678O638P687Q484
53934A50533R153R932J0652J0989J0878J0206Q558N908L184J436N63l12j356j826
53920B28498j482j251j946l060l499l077k620k781l314l547l143k366j896k281
53906A92235l377m362m496l801k905k385k451l017l825m530m921n035m988m814
53892A37328m563m346m125l735l241l011l156l229k845k286k102k310k466k355
53878I3558k118j759j135m84m34j214k238k690k293j421o47l36m19n24l98j63
$$ y = [65863, 66526, 67264, 67290, 66409, 64956, 63355, 61921, 60895, 60417, 60463, 60869, 61347, 61515, 61185, 60736, 60880, 61779, 62622, 62532, 61834, 61901, 63593, 66297, 68739, 70326, 71305, 71994, 72484, 73018, 74034, 75703, 77756, 79930, 82165, 84309, 86115, 87797, 90148, 93745, 98263, 102941, 107473, 112072, 116916, 122046, 127724, 134362, 142049, 150533, 159686, 169618, 180270, 191259, 202137, 212343, 220901, 226809, 229993, 231429, 231992, 231680, 230324, 228498, 227016, 225765, 223819, 220759, 217260, 214183, 211563, 208782, 205468, 201921, 198778, 196412, 194516, 192235, 188858, 184496, 180000, 176199, 173294, 170909, 168458, 165441, 161616, 157086, 152165, 147130, 142142, 137328, 132765, 128419, 124294, 120559, 117318, 114307, 111151, 107922, 105077, 102791, 100689, 98379, 95913, 93558, 91440, 89681, 88546, 88062, 87628, 86414, 84176, 81486, 79193, 77772, 77125, 76789, 76370, 75846, 75448, 75285]
53862G5285l5QP2K1k67n15l93n8J37K94O90J024P52K08L78J296J695P31p90j628
53842G8905j681j558j335p83k61l09n84l38K28K14l91n91j5M89K73j00Q9N61O56
53823G3469M75O30J236J883K299K469K313J864J582J955K866L716M051L789L080
53808A07677K387K352L092L808L754L298L359L888L795K636J470J454K167K070
53794A47207N32j306j928j275p44j378k634l221k850k487k849l430l417k958k811
53779A14451l135l428l439l354l149k575j908j785k121k019j142l25l02o38o44
53764H4487o18j253k282k697k164j284n67j9K42j10q52j207q61l89k82k82n6N1
53746F9857m80j437k125k231j964j562j098p07n24m33k22R4L63O15R40J127Q50
$$ y = [75285, 75250, 75258, 75330, 75351, 75084, 74569, 74176, 74118, 74255, 74549, 75239, 76263, 77015, 77223, 77601, 78897, 80592, 81323, 80533, 78905, 77224, 75666, 74331, 73548, 73287, 72978, 72394, 72056, 72284, 72498, 72107, 71516, 71501, 71990, 72263, 72163, 72252, 72813, 73469, 73944, 74574, 75810, 77693, 79992, 82461, 84774, 86638, 88220, 90175, 93041, 96757, 100808, 104597, 107677, 110064, 112416, 115508, 119316, 123070, 126368, 129727, 133615, 137410, 140046, 141516, 142970, 145137, 147207, 147739, 146433, 144505, 143230, 142486, 141108, 138474, 135253, 132403, 129916, 127067, 123637, 120220, 117262, 114451, 111316, 107888, 104449, 101095, 97946, 95371, 93463, 91678, 89557, 87538, 86396, 86071, 85769, 85131, 84487, 83869, 82616, 80334, 77637, 75473, 74189, 73622, 73603, 73845, 73735, 72883, 71676, 70815, 70426, 70144, 69862, 69806, 69857, 69377, 67940, 65815, 63584, 61620, 60058, 58960, 58253, 57729, 57296, 57074, 57168, 57531, 58146, 59086, 60213, 61063]
53729F1063J89k97j81M13R90J159Q46L52J32L29N58L86l0j41J54L06o9n89n98
53710F4972p5L98M54L91P63J706K780L315K922J764M44m30o54m33k9N08J267K177
53692H2240K923L258L300L364L396K887J555k0q50o07L3K51o2m00l68rM11O85
53674A01987P45O57N62N51O24P94R97R04R9j245k213k015r18J01N39P46J104J375
53656A05394J123M49j19k85k20j58j21LK20M11M40K54n3l10l57r5M68J123J440
53637A09607J091K74l62l71R4N51P41P38P03O67N66L34L4j19L0K75J76l48q35
53618A13846q87p37q36j078q71j3R59J505J745K143K701K887K309J305O44P54
53602A26376J311J708J808K010K559L113L211K921K627K346J778R90N47P81J341
$$ y = [61063, 61252, 60955, 60774, 61187, 62177, 63336, 64182, 64534, 64666, 64995, 65553, 65939, 65909, 65768, 65922, 66228, 66159, 65570, 64972, 64897, 65295, 65749, 66140, 66903, 68609, 71389, 74704, 77626, 79390, 79834, 79404, 78750, 78317, 78288, 78796, 80063, 82240, 85163, 88421, 91721, 95085, 98481, 101368, 102923, 102903, 102053, 101446, 101479, 101730, 101668, 101268, 100900, 100891, 101302, 101987, 102732, 103389, 103951, 104502, 105126, 105920, 106917, 107821, 107920, 106675, 104462, 102447, 101529, 101630, 102169, 102915, 104019, 105394, 106517, 106966, 106847, 106562, 106342, 106184, 106063, 106066, 106286, 106697, 107137, 107391, 107338, 107028, 106671, 106576, 107044, 108167, 109607, 110698, 110972, 110610, 110239, 110333, 110884, 111625, 112363, 113066, 113733, 114299, 114633, 114667, 114548, 114578, 114853, 115029, 114681, 113846, 112959, 112222, 111386, 110308, 109437, 109424, 110383, 111888, 113633, 115776, 118477, 121364, 123673, 124978, 125622, 126376, 127687, 129395, 131203, 133213, 135772, 138885, 142096, 145017, 147644, 149990, 151768, 152758, 153305, 154086, 155427]
53587A55427J663J585J265Q23L79J55K10L00K41K26M47O80O19M34N46R01R80N15
53569A67396k43r77j573j853j505n71M04R04Q93M88l38j470k355k474j926j176
53553A53624l66O64J754K336K121J448Q30M50K99L75O02P62Q82J293K034K472
53537A71580K038J138P47J134J586J521J206J082J010P77Q32J776L265M230M224
53522A98146L891L918M182M265M269M578N153N572N673N725N935O169O223O154
53508B69853O212O579P189P769Q113Q394R041J0224J1583J2610J3158J3398J3425
53495C97548J3189J2769J2464J2510J2828J3084J2980J2542J2168J2252J2770
53484E37104J3335J3747J4147J4589J4799J4666J4584J4867J5040J4298J2678
$$ y = [155427, 157090, 158675, 159940, 160763, 161142, 161297, 161507, 161807, 162048, 162274, 162721, 163401, 164020, 164454, 165000, 165901, 166881, 167396, 167153, 166176, 164603, 162750, 161245, 160674, 161078, 161982, 162875, 163363, 163025, 161555, 159200, 156726, 154800, 153624, 153258, 153922, 155676, 158012, 160133, 161581, 162411, 162861, 163160, 163535, 164137, 164899, 165781, 167074, 169108, 171580, 173618, 174756, 175503, 176637, 178223, 179744, 180950, 182032, 183042, 183819, 184651, 186427, 189692, 193922, 198146, 202037, 205955, 210137, 214402, 218671, 223249, 228402, 233974, 239647, 245372, 251307, 257476, 263699, 269853, 276065, 282644, 289833, 297602, 305715, 314109, 323150, 333374, 344957, 357567, 370725, 384123, 397548, 410737, 423506, 435970, 448480, 461308, 474392, 487372, 499914, 512082, 524334, 537104, 550439, 564186, 578333, 592922, 607721, 622387, 636971, 651838, 666878, 681176, 693854]
53473F93854J1219J0798J1211J1630J1665J1622J1808J1921J1280R723Q054P318
53461H22103P570P725O834N139L527K266R18o69j989k609k769l024l684m751o002
53446H30585p051p648q064q772r728j0359j0436j0367j0507j0661j0613j0611
53434G15768j0889j1186j1182j1092j1196j1124j0254q727p437o910o705o068
53422F02998m765l141j647n61O4L65N82R28J533K473L734N087O159O695O850P152
53406F34506Q001R118R756R708R742J0673J2127J2985J3009J3196J4308J5858
53394G72987J7061J8030J9320K0804K1918K2707K3748K5132K6304K6975K7487
53383A022473K8177K9014K9985L1183L2352L2921L2773L2460L2364L2069L0973
$$ y = [693854, 705073, 715871, 727082, 738712, 750377, 761999, 773807, 785728, 797008, 806731, 814785, 822103, 829673, 837398, 844232, 849371, 852898, 855164, 856082, 855413, 853424, 850815, 848046, 845022, 841338, 836587, 830585, 823534, 815886, 807822, 799050, 789322, 778963, 768527, 758160, 747653, 736992, 726379, 715768, 704879, 693693, 682511, 671419, 660223, 649099, 638845, 630118, 622681, 615771, 609066, 602998, 598233, 595092, 593445, 592884, 592948, 593313, 593895, 594823, 596356, 598829, 602563, 607650, 613809, 620504, 627354, 634506, 642507, 651625, 661381, 671089, 680831, 691504, 703631, 716616, 729625, 742821, 757129, 772987, 790048, 808078, 827398, 848202, 870120, 892827, 916575, 941707, 968011, 994986, 1022473, 1050650, 1079664, 1109649, 1140832, 1173184, 1206105, 1238878, 1271338, 1303702, 1335771, 1366744]
53372A366744K9148K7311K6045K5356K4810K3905K2386K0348J8061J5718J3473
53361A613305J1576J0167R035P869O626N263L236j74m904r991j4530j8359k1696
53348A597423k4583k6974k8893l0199l0573l0085k9406k9123k9137k9011k8589
53337A280850k7978k7183k6200k5242k4565k4200k4127k4448k4992k5064k4139
53326A002712k2699k1864k2036k2379k1808k0177j8303j6917j5882j4474j2354
53315G93819j0050q365p468o898o488o662p609q640q899q467q097q037p734o809
53301F83596n673m900m414l759k866k094j565r00J98J388K051K136K367L439N111
53286F74115O434O911P174Q212J0122J1893J2542J2153J1735J2128J3283J4473
$$ y = [1366744, 1395892, 1423203, 1449248, 1474604, 1499414, 1523319, 1545705, 1566053, 1584114, 1599832, 1613305, 1624881, 1635048, 1644083, 1651952, 1658578, 1663841, 1667077, 1666903, 1661999, 1652008, 1637478, 1619119, 1597423, 1572840, 1545866, 1516973, 1486774, 1456201, 1426116, 1396710, 1367587, 1338450, 1309439, 1280850, 1252872, 1225689, 1199489, 1174247, 1149682, 1125482, 1101355, 1076907, 1051915, 1026851, 1002712, 980013, 958149, 936113, 913734, 891926, 871749, 853446, 836529, 820647, 806173, 793819, 783769, 775404, 767936, 761038, 754550, 747888, 740279, 731639, 722740, 714273, 706176, 698139, 690405, 683596, 677923, 673023, 668609, 664850, 661984, 659890, 658325, 657425, 657623, 659011, 661062, 663198, 665565, 669004, 674115, 680549, 687460, 694634, 702846, 712968, 724861, 737403, 749556, 761291, 773419, 786702, 801175]
53274H01175J5015J4693J3715J2517J1600J1242J1176J0699R390P617O073N003
53262I29915M114L253K578K013J068n03k246l624m780o277q233j0227j1982j3660
53248H81409j5375j6821j7578j7663j7540j7715j8294j8907j8962j8112j6506
53237F87936j4661j3159j2430j2592j3327j4083j4533j4653j4419j3743j2946
53226E37390j2727j3238j3567j2800j1445j0923j1662j2459j2032j0469q694p173
53214D00201n766m537l877l824l890l686l369l394m089n474p189q576r133r019
53200C24378q825q857q935q899q848q733q199p163o172n732n578n147m533m354
53186B24403m686m825m328l666l541l982m540m953n160m965m296l528l118k989
$$ y = [801175, 816190, 830883, 844598, 857115, 868715, 879957, 891133, 901832, 911222, 918839, 924912, 929915, 934029, 937282, 939860, 941873, 942941, 942438, 940192, 936568, 931788, 925511, 917278, 907051, 895069, 881409, 866034, 849213, 831635, 813972, 796432, 778717, 760423, 741516, 722554, 704442, 687936, 673275, 660116, 647686, 635094, 621767, 607684, 593151, 578498, 564079, 550336, 537390, 524663, 511425, 497858, 485058, 473613, 462690, 451028, 438569, 426537, 416068, 407374, 400201, 394435, 389898, 386021, 382197, 378307, 374621, 371252, 367858, 363769, 358295, 351106, 342530, 333397, 324378, 315553, 306696, 297761, 288862, 280014, 271281, 263082, 255919, 249747, 244015, 238437, 233290, 228757, 224403, 219717, 214892, 210564, 206898, 203357, 199375, 194835, 189882, 184722, 179757, 175461, 171933, 168815, 165826]
53172A65826k803k626k729k826k252j013L8L23J86J11m5n39r87q01p8N13O73O73
53154A51644P37O79L31j48m42l70N6O17R84R80P22L20l40j255j909j777j077n97
53136A49155o37o69k34K97K15n25j263j458j189p95m37j45p0l38p12p85n29m02
53118A39479o75r99r27o53p46j263j727j925k127k340k116j423j049j493k079
53103A17937j846r89n57r73j646j980j942j624j015m25m04r43j326j064m78j31
53087A00594j45m17r34j541j755j279m85m3k74r51j570j621j044m63o34j383j539
53070H4516l57J368K070J118o17j774j735r42k28Q1M25J289K379K882K547J957
53054I4979J620J434J251J386J997K509K295J577J040Q62O83L36m4m22q14j000
$$ y = [165826, 163023, 160397, 157668, 154842, 152590, 151577, 151615, 151938, 152124, 152235, 152190, 151651, 150664, 149863, 149785, 150298, 150971, 151644, 152381, 153060, 153391, 153243, 152801, 152431, 152487, 153104, 154088, 155068, 155790, 156110, 155770, 154515, 152606, 150829, 149752, 149155, 148518, 147849, 147615, 147912, 148127, 147602, 146339, 144881, 143692, 142897, 142460, 142315, 142245, 141907, 141195, 140410, 139881, 139479, 138804, 137805, 136878, 136225, 135479, 134216, 132489, 130564, 128437, 126097, 123981, 122558, 121509, 120016, 117937, 116091, 115102, 114545, 113572, 111926, 109946, 108004, 106380, 105365, 104940, 104536, 103593, 102267, 101203, 100725, 100594, 100449, 100032, 99098, 97557, 95802, 94523, 94038, 93995, 93721, 92770, 91200, 89579, 88535, 88072, 87438, 86055, 84516, 84159, 85527, 87597, 88715, 88098, 86324, 84589, 83647, 83419, 83500, 83925, 85214, 87593, 90475, 93022, 94979, 96599, 98033, 99284, 100670, 102667, 105176, 107471, 109048, 110088, 110950, 111633, 111969, 111925, 111503, 110689, 109689]
53038A09689r19j088j912k767k582j419n14o11j090j181j112j451j952j917j343
53023H7831r62j170j593j738j538j133n38J59N34J66q13j693j852j329o37r2L97
53006G3999R15J200J009N48K35J71J57P5n6l20o87p06K2J061J457R62K65j37n86
52987G9584j321j746j275l96j4r2J73R53J557J572J378J344J290J029P87O83M10
52970H5916j30m18r0L62K63k17l80r3J01m6j10K93Q83J099P88K89J0L3R9o4l56
52949H8232m01j15Q5n8r7M50J167J162M40N7O38J489J663J252J004J045P98L2
52931I8843o82p64k97K24M71M95N13P01J013J230J224J049P56K80k12k53L80J192
52913A06163J567J567J664J813J461N64j00J23R57J704K064K111J837J274Q61
$$ y = [109689, 108770, 107682, 105770, 103003, 100421, 99002, 98488, 97877, 96787, 95606, 94494, 93043, 91091, 89174, 87831, 86869, 85699, 84106, 82368, 80830, 79697, 79159, 79318, 79852, 80018, 79205, 77512, 75660, 74331, 73694, 73602, 73999, 74914, 76114, 77123, 77671, 77906, 78077, 78234, 78309, 78253, 77933, 77246, 76540, 76562, 77623, 79080, 80042, 80307, 80170, 79584, 78263, 76517, 75242, 74846, 74832, 74740, 74913, 75866, 77423, 78995, 80373, 81717, 83007, 84036, 84823, 85506, 85916, 85786, 85368, 85278, 85640, 85903, 85686, 85306, 85213, 85314, 85268, 85158, 85451, 86334, 87433, 88221, 88510, 88520, 88553, 88652, 88588, 88232, 87831, 87716, 87801, 87743, 87646, 88096, 89263, 90425, 90865, 90922, 91560, 93049, 94712, 95964, 96968, 98013, 98811, 98843, 98161, 97397, 97100, 97324, 97795, 98290, 98803, 99504, 100517, 101747, 102971, 104020, 104776, 105056, 104844, 104591, 104971, 106163, 107730, 109297, 110961, 112774, 114235, 114799, 114699, 114822, 115779, 117483, 119547, 121658, 123495, 124769, 125630]
52898A25630J163K151L020K929J821M38m43p25q99j252j467j181p19q03j585k450
52882A25628k801k633k175j518q06l57l07m21n15p07r93r75l82N12J270J819K222
52865A16861K368K286K365K724K702J663N3j094j567k091k999l641l367k464j691
52850A12108j406j519j842k028j575m18O65P17l56j663k254j872r69k42j96q26
52834I6324j613j986j826j469j215r60m18L23O38j9j283j978j318J39J095J029
52818H5463O31O00O25N0r30j430j161q04r23j190j044n96k47J30Q52J462J039
52801H2527k91j087l90R03J186K35p30q45m83k11R4P16J375J582J297P64J45k89
52783H6498j1J156K492L024K559J708J093R48J268J778J923J337L77l36p29j214
$$ y = [125630, 126793, 128944, 131964, 134893, 136714, 137152, 136709, 135984, 135085, 133833, 132366, 131185, 130466, 129663, 128078, 125628, 122827, 120194, 118019, 116501, 115695, 115338, 115031, 114610, 114095, 113388, 112395, 111420, 111038, 111550, 112820, 114639, 116861, 119229, 121515, 123880, 126604, 129306, 130969, 131022, 129928, 128361, 126270, 123271, 119630, 116263, 113799, 112108, 110702, 109183, 107341, 105313, 103738, 103320, 103985, 104702, 104346, 102683, 100429, 98557, 97588, 97346, 97150, 96324, 94711, 92725, 90899, 89430, 88215, 87255, 86837, 87160, 87798, 87779, 86496, 84518, 83200, 83339, 84434, 85463, 86094, 86694, 87319, 87369, 86439, 85009, 83848, 83044, 82121, 80931, 79887, 79291, 79044, 79174, 80026, 81488, 82527, 82236, 81149, 80759, 81662, 82848, 83083, 82353, 81508, 81025, 80814, 80908, 81624, 82999, 84581, 85878, 86642, 86787, 86498, 86487, 87643, 90135, 93159, 95718, 97426, 98519, 99467, 100735, 102513, 104436, 105773, 106150, 105814, 105085, 103871]
52767A03871j928k514k704k541k062j312p56j028j983k473j540L64J688J330l24
52752H6088j813k041j279o59p77j110r90n47k11K29J225K305K297Q61r36j935
52736H0707k010j621j035m10j37l99p85q42p27q57j204j396j314j217j352j685
52720F3716j928j622n70O85J212P88J96J18K60N8k96k01K93O11O16O88Q99Q85
52702F6408O12M95N80L22m76j170j157p77p33r62p10L18J467J928J627J153R53
52685F9878R15O30n4q41j245r90k56M47O60L34j43l09ON99J109J244R93P12Q54
52666G4543J429J898J846J551J510J556J005k58j418j709j265p04k60K41Q03J155
52650H1923J067N51j22m58o1P73J159O50j30l00J41N15N98Q62J585K314K431J954
$$ y = [103871, 101943, 99429, 96725, 94184, 92122, 90810, 90054, 89026, 87043, 84570, 83030, 83394, 85082, 86412, 86088, 84275, 82234, 80955, 80296, 79519, 78409, 77419, 76872, 76661, 76890, 78115, 80420, 82717, 83578, 82642, 80707, 78697, 77076, 76041, 75631, 75494, 75095, 74310, 73468, 72741, 71884, 70680, 69284, 67970, 66753, 65401, 63716, 61788, 60166, 59596, 60281, 61493, 62281, 62477, 62595, 62855, 62913, 62617, 62416, 62709, 63320, 63936, 64624, 65523, 66408, 67020, 67515, 68095, 68417, 67941, 66771, 65614, 64837, 64104, 63142, 62432, 62750, 64217, 66145, 67772, 68925, 69878, 70793, 71423, 71369, 70528, 69283, 68293, 68037, 68484, 69144, 69478, 69335, 69026, 69032, 69631, 70740, 71984, 72977, 73689, 74543, 75972, 77870, 79716, 81267, 82777, 84333, 85338, 85080, 83662, 81953, 80688, 79984, 79724, 79965, 80768, 81923, 82990, 83541, 83419, 82961, 82900, 83673, 84832, 85482, 85352, 85052, 85193, 85708, 86306, 87168, 88753, 91067, 93498, 95452]
52632I5452J493J597K189K618K274J315N36M28O27N93M81P97J349J278K13j128
52616A12112j749j426p78n40r53j622j842j273l32K40J47l06q34j424j995k117
52600I5308j465k80P57J114P78K15J9M39J159J541J185K23p51j116o95N4N11O20
52582I9616Q73J431J716J166R2p03q28m16L09R50Q17k65j221p23J007K280K027
52565A08128R56L11L64N47M65O5n87j208j290p20j20j07n31q06p03l74N6M43N31
52546A05420L36K92N55N60p6o18r5J110J506N45n73n36L98J031R31P18Q23Q75
52528A13202M56j82o14r38j457j946j903j484j401j723j561m13Q00Q53q8q47j031
52511I9723j354k069k304j416j09N82O18N79N56K61j41k47k19n77j262j700j752
$$ y = [95452, 96945, 98542, 100731, 103349, 105623, 106938, 107474, 107902, 108529, 109122, 109603, 110400, 111749, 113027, 113240, 112112, 110363, 108937, 108159, 107619, 106666, 105044, 103202, 101929, 101597, 101837, 101984, 101678, 100844, 99420, 97425, 95308, 93843, 93563, 94320, 95434, 96212, 96427, 96446, 96885, 98044, 99585, 100770, 100993, 100242, 99126, 98431, 98485, 98996, 99616, 100489, 101920, 103636, 104802, 104894, 104191, 103363, 102947, 103256, 104206, 105023, 104758, 103537, 102814, 103821, 106101, 108128, 109084, 109395, 109759, 110306, 110771, 110836, 110249, 109041, 107751, 107031, 106911, 106804, 106273, 105467, 104764, 104390, 104446, 104889, 105420, 105756, 106048, 106603, 107163, 107087, 106469, 106374, 107484, 108990, 109535, 108962, 108426, 108824, 109855, 110786, 111504, 112327, 113202, 113658, 113476, 112862, 111924, 110467, 108521, 106618, 105134, 103733, 102010, 100449, 100036, 100836, 101689, 101601, 100754, 99723, 98369, 96300, 93996, 92580, 92471, 93053, 93671, 94250, 94806, 95067, 94926, 94679, 94460, 93883, 92621, 90921, 89169]
52494H9169j846k089j962j127P0J073J628J655J170N40L24N36N59J22j22N26J696
52477I1922K318J906J011L46O0m6q7j26l15o37p48m73k65o72j349j230L1J338
52459I2984J383K54q40j155j024q92o48j51K40K19J10L72Q34R83Q07Q20J297J873
52441I7466J983J460P11L27M94P31M65j80n51m56m45q08j023o16k1K6l92n37l8
52422I8596Q50J677J955J243k31j252p84O43J517J232O01L95L96J60p8R4M14K81
52404A07709k86n55JR65J325O14m51p55j86K40j21o59n81k10k88n81k73N20Q56
52385A07284N70N16J027J324Q70K22j2l5j03J53R81J865K281K413K456K030J004
52368A24846K33M63J159J269P23L33N18J029J624K180K336J841J103P47P83Q30
$$ y = [89169, 87323, 85234, 83272, 82145, 82215, 83288, 84916, 86571, 87741, 88281, 88605, 89141, 89700, 89822, 89700, 90226, 91922, 94240, 96146, 97157, 97503, 97563, 97517, 97430, 97304, 96989, 96352, 95604, 95131, 94866, 94194, 92845, 91615, 91646, 92984, 94367, 94621, 93781, 92626, 91602, 90710, 90062, 89911, 90151, 90370, 90480, 90852, 91686, 92669, 93476, 94296, 95593, 97466, 99449, 100909, 101620, 101947, 102441, 103172, 103637, 103457, 102906, 102450, 102005, 101197, 100174, 99558, 99537, 99563, 99171, 98634, 98596, 99446, 101123, 103078, 104321, 104090, 102838, 102054, 102697, 104214, 105446, 106047, 106442, 106838, 106998, 106920, 107014, 107428, 107709, 107423, 106868, 106869, 107834, 109159, 109773, 109322, 108567, 108381, 108621, 108500, 107841, 107260, 107050, 106762, 106181, 105908, 106428, 107284, 107854, 108370, 109397, 110721, 111591, 111813, 111801, 111766, 111663, 111816, 112797, 114662, 116943, 119356, 121812, 123842, 124846, 125079, 125542, 126701, 127970, 128693, 129026, 129544, 130573, 132197, 134377, 136713, 138554, 139657, 140404, 141187, 142017]
52352A42017Q96J248J720J895J774J649J508J288J350J943K444K097J327J332
52338A64488K416L653M285M405M210L609K946L037M046N116N636O060O926P831
52324B28664Q152Q217Q864J0071J0915J0884J0608J0997J2070J2986J3147J2921
52312C58496J3053J3571J3794J3498J3432J4218J5215J5281J4300J3080J2004
52301E09942J0702R162Q043P642P357O585N427M115K578R62j08l83m78r98j782
52286E68766k442l093l923m644m971n140n343n165m282l197k509j941q70N78J824
52271E23648K829L899M826N269N736P032Q761R569R115Q656R220J0267J0770J0664
52257F30261J0489J0228R496Q454P679P231O641N711M766L994L171K122R90j81
$$ y = [142017, 142913, 144161, 145881, 147776, 149550, 151199, 152707, 153995, 155345, 157288, 159732, 161829, 163156, 164488, 166904, 170557, 174842, 179247, 183457, 187066, 190012, 193049, 197095, 202211, 207847, 213907, 220833, 228664, 236816, 245033, 253897, 263968, 274883, 285767, 296375, 307372, 319442, 332428, 345575, 358496, 371549, 385120, 398914, 412412, 425844, 440062, 455277, 470558, 484858, 497938, 509942, 520644, 529806, 537849, 545491, 552848, 559433, 564860, 568975, 571553, 572515, 572407, 572024, 571546, 570548, 568766, 566324, 563231, 559308, 554664, 549693, 544553, 539210, 534045, 529763, 526566, 524057, 522116, 521246, 521824, 523648, 526477, 530376, 535202, 540471, 546207, 553239, 562000, 571569, 580684, 589340, 598560, 608827, 619597, 630261, 640750, 650978, 660474, 668928, 676607, 683838, 690479, 696190, 700956, 704950, 708121, 710243, 711233, 711052]
52243G11052j607l259m586n186n506o379p870r086r311q894q675q809q734q169
52229F14981p615p651q138q433q153p458o704o034n236l979k348j087r38j661
52215E39546k094j472k51O57J008J157J304J369J435J734K231K673K997L241L255
52200E58790K846K137J374N98p1j85L64P58J25j103j643j157o49r06j511j828
52184E57939j972k229k343k075j883k245k743k635j986j530j539j648j639j702
52170E29770j789j454n59L12M42k95j408k261k429j888j097p37j197k208l066
52155E10136l254k908k606k665k769k486j951j642j590j332o63N9M96O70N75L4
52139D88104p00q65j84N97P45N34P17J461K548M071N992P462P683P226P417Q455
$$ y = [711052, 709445, 706186, 701600, 696414, 690908, 684529, 676659, 667573, 658262, 649368, 640693, 631884, 623150, 614981, 607366, 599715, 591577, 583144, 574991, 567533, 560829, 554795, 549559, 545580, 543232, 542145, 541207, 539546, 537452, 535980, 535729, 536386, 537394, 538551, 539855, 541224, 542659, 544393, 546624, 549297, 552294, 555535, 558790, 561636, 563773, 565147, 565745, 565674, 565489, 565853, 566611, 566736, 565633, 563990, 562833, 562184, 561278, 559767, 557939, 555967, 553738, 551395, 549320, 547437, 545192, 542449, 539814, 537828, 536298, 534759, 533111, 531472, 529770, 527981, 526527, 525968, 526280, 526722, 526427, 525019, 522758, 520329, 518441, 517344, 516607, 515410, 513202, 510136, 506882, 503974, 501368, 498703, 495934, 493448, 491497, 489855, 488265, 486933, 486270, 486329, 486825, 487495, 488070, 488104, 487404, 486539, 486355, 486952, 487697, 488231, 488948, 490409, 492957, 497028, 503020, 510482, 518165, 525391, 532808, 541263]
52123E41263R302R518R954J1201J2519J3025J2972J3099J3450J3687J3937J4463
52111F88390J4888J4634J3844J3111J2552J1918J1333J1052J0596R166O964N156
52099H23604M259L454J951J76j048j870l004m386n209n301n538o592p917q537
52085G84042q382q180q325q367p758o591n368m369l465k376r63O35J986K789L336
52070G28644M303N822P148P600P542P856Q678R288R248Q953Q877Q903Q741Q444
52056H40047Q062P269N845M229L037K240J335J35j168k617m439o374p745q417
52042H41439r141j0540j2202j3234j3472j3615j4210j4966j5249j4933j4539j4531
52030F80807j4725j4476j3479j2244j1629j1907j2446j2438j1774j1065j0832
$$ y = [541263, 550565, 560083, 570037, 581238, 593757, 606782, 619754, 632853, 646303, 659990, 673927, 688390, 703278, 717912, 731756, 744867, 757419, 769337, 780670, 791722, 802318, 811484, 818448, 823604, 827863, 831317, 833268, 833444, 832396, 830526, 827522, 823136, 817927, 812626, 807088, 800496, 792579, 784042, 775660, 767480, 759155, 750788, 743030, 736439, 731071, 726702, 723237, 720861, 719898, 720533, 722519, 725308, 728644, 732947, 738769, 745917, 753517, 761059, 768915, 777593, 786881, 796129, 805082, 813959, 822862, 831603, 840047, 848109, 855378, 861223, 865452, 868489, 870729, 872064, 872199, 871031, 868414, 863975, 857601, 849856, 841439, 832298, 821758, 809556, 796322, 782850, 769235, 755025, 740059, 724810, 709877, 695338, 680807, 666082, 651606, 638127, 625883, 614254, 602347, 589901, 577463, 565689, 554624, 543792]
52019E43792j0890j0635r803q748p996p685p611p651p836q049p964p555p441q313
52005D25615r997j1471j1868j1340j0727j0618j0964j1428j1779j1917j1781j1384
51993B90341j0826j0140r231q167p278o783o444n870n163m754m590m025k887k075
$$ y = [543792, 532902, 522267, 512464, 503716, 495720, 488035, 480424, 472773, 464937, 456888, 448924, 441369, 433928, 425615, 415618, 404147, 392279, 380939, 370212, 359594, 348630, 337202, 325423, 313506, 301725, 290341, 279515, 269375, 260144, 251977, 244699, 237916, 231472, 225602, 220439, 215685, 211095, 207070, 204183, 202108]
$$ [...]
##END NTUPLES=NMR SPECTRUM
##END=
