##TITLE=NES1004_878015019_9232700_nB64FBqrWS
##JCAMPDX= 6.0         $$ Bruker NMR JCAMP-DX V2.0
##DATA TYPE= NMR SPECTRUM
##DATA CLASS= NTUPLES
##ORIGIN= BRUKER
##OWNER= Administrator
$$ 1.72 TOPSPIN		Version 2.1
$$ 2015-07-01 20:15:28.992 -0700  Administrator@X
$$ Compression mode = diff/dup
##.OBSERVE FREQUENCY= 400.02188249412
##.OBSERVE NUCLEUS= ^1H
##.ACQUISITION MODE= SIMULTANEOUS (DQD)
##.ACQUISITION SCHEME= undefined
##.AVERAGES= 8
##.DIGITISER RES= 22
##SPECTROMETER/DATA SYSTEM= spect
##.PULSE SEQUENCE= zg30
##.SOLVENT NAME= COFFEE_meoh
##.SHIFT REFERENCE= INTERNAL, COFFEE_meoh, 1, 14.98509
##AUDIT TRAIL= $$ (NUMBER, WHEN, WHO, WHERE, PROCESS, VERSION, WHAT)
$$ ##TITLE= Audit trail, TOPSPIN		Version 2.1
$$ ##JCAMPDX= 5.01
$$ ##ORIGIN= Bruker BioSpin GmbH
$$ ##OWNER= Administrator
$$ $$ E:\/data/COFFEE/nmr/NES1004_878015019_9232700_nB64FBqrWS/20/pdata/1/auditp.txt
$$ ##AUDIT TRAIL=  $$ (NUMBER, WHEN, WHO, WHERE, PROCESS, VERSION, WHAT)
(   1,<2015-07-01 20:15:21.508 -0700>,<Administrator>,<X>,<go>,<TOPSPIN 2.1>,
      <created by zg
	started at 2015-07-01 20:14:15.602 -0700,
	POWCHK enabled, PULCHK disabled,
       configuration hash MD5:
       21 0F 79 D6 B3 7B B4 F6 88 20 88 DB 03 48 BD 9F
       data hash MD5: 64K
       F1 DA B6 69 23 48 68 BE CD 41 4F 0B 91 E1 A9 8C>)
(   2,<2015-07-01 20:15:24.774 -0700>,<Administrator>,<X>,<proc1d>,<TOPSPIN 2.1>,
      <Start of raw data processing
       efp LB = 0 FT_mod = 6 PKNL = 1 PHC0 = 0 PHC1 = 0 SI = 32K 
       data hash MD5: 32K
       88 70 B3 7B 8E 20 D7 2B 92 3C 38 7C 7A 75 10 03>)
(   3,<2015-07-01 20:15:25.133 -0700>,<Administrator>,<X>,<proc1d>,<TOPSPIN 2.1>,
      <pk PHC0 = 96.29517 PHC1 = 0 
       data hash MD5: 32K
       7A 97 66 8C 9C 72 8F 0F B7 86 1F F4 58 59 44 B5>)
(   4,<2015-07-01 20:15:25.242 -0700>,<Administrator>,<X>,<proc1d>,<TOPSPIN 2.1>,
      <abs ABSG = 1 
       data hash MD5: 32K
       E8 E8 D7 17 67 4A 4E 30 D4 A1 C8 E3 6E 8E A8 25>)
(   5,<2015-07-01 20:15:25.305 -0700>,<Administrator>,<X>,<proc1d>,<TOPSPIN 2.1>,
      <abs ABSG = 2 
       data hash MD5: 32K
       A4 3F 48 07 91 73 C0 A5 69 89 3E 20 6A 2D 5E DC>)
(   6,<2015-07-01 20:15:25.367 -0700>,<Administrator>,<X>,<proc1d>,<TOPSPIN 2.1>,
      <abs ABSG = 3 
       data hash MD5: 32K
       32 8C FD 30 AA C9 B9 D4 36 3D 0A A3 9F 53 21 59>)
(   7,<2015-07-01 20:15:25.430 -0700>,<Administrator>,<X>,<proc1d>,<TOPSPIN 2.1>,
      <abs ABSG = 4 
       data hash MD5: 32K
       06 35 D2 13 7E 04 F9 A4 04 EA 18 45 12 B2 D1 CA>)
(   8,<2015-07-01 20:15:25.492 -0700>,<Administrator>,<X>,<proc1d>,<TOPSPIN 2.1>,
      <abs ABSG = 5 
       data hash MD5: 32K
       E0 A7 4F 47 C5 C1 A4 66 C6 5B 87 21 9F 12 AE AC>)
$$ ##END=
$$ 
$$ $$ hash MD5
$$ $$ 3B C9 7D 86 34 F7 5F E2 A5 17 1B A0 EC 01 AD 88
##$RELAX= 
##$RELAX= 
##$RELAX= 
##$RELAX= 
##$RELAX= 
##$RELAX= 
##$RELAX= 
$$ Bruker specific parameters
$$ --------------------------
##$DU= <E:\>
##$EXPNO= 20
##$NAME= <NES1004_878015019_9232700_nB64FBqrWS>
$$ [...]
150 150 150 150 150 150 150 150
##$TP07= 0
##$TPNAME0= <>
##$TPNAME1= <>
##$TPNAME2= <>
##$TPNAME3= <>
##$TPNAME4= <>
##$TPNAME5= <>
##$TPNAME6= <>
##$TPNAME7= <>
##$TPOAL= (0..7)
0.5 0.5 0.5 0.5 0.5 0.5 0.5 0.5
##$TPOFFS= (0..7)
0 0 0 0 0 0 0 0
##$TUNHIN= 0
##$TUNHOUT= 0
##$TUNXOUT= 0
##$USERA1= <user>
##$USERA2= <user>
##$USERA3= <user>
##$USERA4= <user>
##$USERA5= <user>
##$V9= 5
##$VALIST= <valist>
##$VCLIST= <CCCCCCCCCCCCCCC>
##$VD= 0
##$VDLIST= <DDDDDDDDDDDDDDD>
##$VPLIST= <PPPPPPPPPPPPPPP>
##$VTLIST= <TTTTTTTTTTTTTTT>
##$WBST= 2048
##$WBSW= 25
##$XGAIN= (0..3)
0 0 0 0
##$XL= 0
##$YL= 0
##$YMAX_a= 627413
##$YMIN_a= -525806
##$ZGOPTNS= <>
##$ZL1= 120
##$ZL2= 120
##$ZL3= 120
##$ZL4= 120
##$ABSF1= 14.98509
##$ABSF2= -5.573092
##$ABSG= 5
##$ABSL= 3
##$ALPHA= 0
##$AQORDER= 0
##$ASSFAC= 0
##$ASSFACI= 0
##$ASSFACX= 0
##$ASSWID= 0
##$AUNMP= <proc_prof1d_extract_pilot.lims>
##$AXLEFT= 0
##$AXNAME= <>
##$AXNUC= <1H>
##$AXRIGHT= 0
##$AXTYPE= 0
##$AXUNIT= <>
##$AZFE= 0.1
##$AZFW= 0.1
##$BCFW= 0
##$BC_mod= 0
##$BYTORDP= 0
##$COROFFS= 0
##$CY= 15
##$DATMOD= 1
##$DC= 0
##$DFILT= <>
##$DTYPP= 0
##$F1P= 0
##$F2P= 0
##$FCOR= 0.5
##$FTSIZE= 32768
##$FT_mod= 6
##$GAMMA= 0
##$GB= 0
##$INTBC= 1
##$INTSCL= 1
##$ISEN= 128
##$LB= 0
##$LEV0= 0
##$LPBIN= 0
##$MAXI= 10000
##$MC2= 0
##$MEAN= 0
##$ME_mod= 0
##$MI= 0
##$NCOEF= 0
##$NC_proc= -8
##$NLEV= 6
##$NOISF1= 0
##$NOISF2= 0
##$NSP= 0
##$NTH_PI= 0
##$NZP= 0
##$OFFSET= 14.98509
##$PC= 1
##$PHC0= 96.29517
##$PHC1= 0
##$PH_mod= 1
##$PKNL= yes
##$PPARMOD= 0
##$PPDIAG= 0
##$PPIPTYP= 0
##$PPMPNUM= 2147483647
##$PPRESOL= 1
##$PSCAL= 4
##$PSIGN= 0
##$PYNMP= <proc.py>
##$REVERSE= no
##$SF= 400.02
##$SI= 32768
##$SIGF1= 0
##$SIGF2= 0
##$SINO= 400
##$SIOLD= 32768
##$SPECTYP= <>
##$SREGLST= <1H.CDCl3>
##$SSB= 0
##$STSI= 32768
##$STSR= 0
##$SW_p= 8223.68421052631
##$SYMM= 0
##$S_DEV= 0
##$TDeff= 65536
##$TDoff= 0
##$TI= <>
##$TILT= no
##$TM1= 0
##$TM2= 0
##$TOPLEV= 0
##$USERP1= <user>
##$USERP2= <user>
##$USERP3= <user>
##$USERP4= <user>
##$USERP5= <user>
##$WDW= 1
##$XDIM= 32768
##$YMAX_p= 440731327
##$YMIN_p= -754874
##$CURPLOT= <Network HP LaserJet P1505>
##$CURPRIN= <$Network HP LaserJet P1505>
##$DFORMAT= <normdp>
##$LAYOUT= <+/1D_H.xwp>
##$LFORMAT= <normlp>
##$PFORMAT= <normpl>
##$SURQMSG= 1
$$ End of Bruker specific parameters
$$ ---------------------------------
##NTUPLES= NMR SPECTRUM
##VAR_NAME=  FREQUENCY,     SPECTRUM/REAL,   SPECTRUM/IMAG
##SYMBOL=    X,             R,               I
##VAR_TYPE=  INDEPENDENT,   DEPENDENT,       DEPENDENT
##VAR_FORM=  AFFN,          ASDF,            ASDF
##VAR_DIM=   32768,         32768,           32768
##UNITS=     HZ,            ARBITRARY UNITS, ARBITRARY UNITS
##FACTOR=    0.250966925370066, 1,           1
##FIRST=     8223.43324360094, -107193,      24360
##LAST=      0,             -239386,         -106322
##MIN=       0,             -754874,         0
##MAX=       8223.43324360094, 440731327,    0
$$ Real data points
##PAGE= N=1
##DATA TABLE= (X++(R..R)), XYDATA
$$ [...]
19470b42677e6868J5382k49970d9527j45193c2597j1506o6771k39585A05020J54463
$$ -242677 -56868 -41486 -291456 -49527 -194720 -32597 -44103 -110874 -350459 105020 259483
19459B59483G4013K54529A11961b34518K0544f405B58997b21262e8571F0895c43386
$$ 259483 74013 328542 111961 -234518 -213974 -6405 258997 -221262 -58571 60895 -343386
19447A60594a73505B7278c28691B00195c50735A44869d3166l1718C4551g1728
$$ 160594 -173505 27278 -328691 200195 -350735 144869 -43166 -74884 34551 -71728
19436b4364B23478d9556a0030j85286F0563a07892B93349b49770B5906J91583
$$ -24364 223478 -49556 -10030 -195316 60563 -107892 293349 -249770 25906 217489
19426B17489j05602c6324k12545E8801b09788O8606r4904h7220a5978A8516J33880
$$ 217489 111887 -36324 -248869 58801 -209788 -141182 -236086 -87220 -15978 18516 152396
19415A52396K03151a24412b5485B4572d5184A317c98972a65536B26457b0481j14161
$$ 152396 355547 -124412 -25485 24572 -45184 1317 -398972 -165536 226457 -20481 -134642
19404a34642k9674H557K74000a20814a1737j13820B0364a87797j5272A97391b60885
$$ -134642 -164316 8557 282557 -120814 -11737 -125557 20364 -187797 -203069 197391 -260885
19392b0924n4486H8197a48541F9171j1130b89941C9329e203I4214M0167b10566
$$ -20924 -75410 88197 -148541 69171 58041 -289941 39329 -5203 94214 134381 -210566
19380f3121p846D2952a08785D9228a73612j9771o1981J22157a1381C01801F2357
$$ -63121 -70967 42952 -108785 49228 -173612 -193383 -255364 -133207 -11381 301801 62357
19368B17135b3167p4975j10192b398j85000f3761j06016g1941J5227b3055j1064
$$ 217135 -23167 -98142 -208334 -2398 -187398 -63761 -169777 -71941 -56714 -23055 -34119
19357c4119H6881a31492p7919f1004H5549a90224h7789d025j86253j37933c1562
$$ -34119 86881 -131492 -209411 -61004 85549 -190224 -87789 -4025 -190278 -328211 -31562
19345a57971A5079a57199O4126j25138g1220b7364A85667b19801P8312M2058k26068
$$ -157971 15079 -157199 -93073 -218211 -71220 -27364 185667 -219801 -141489 -99431 -325499
19334c25499C8191N0955d8303B1930r702a27121A0025b279A64318l1057E230b01200
$$ -325499 38191 89146 -48303 21930 12228 -127121 10025 -2279 164318 133261 5230 -201200
19321a66810E5289d0500R180p5184j16069k68141E9441b40503J06063N1064E2038
$$ -166810 55289 -40500 -31320 -106504 -222573 -490714 59441 -240503 -134440 -83376 52038
19309I8729c6279q2490L7976n7016j4038j83417A24143k1271D0845q982L3250
$$ 98729 -36279 -118769 -80793 -137809 -151847 -335264 124143 102872 40845 31863 65113
19298F5113J3062b63003Q3015j08591e0731A5227P4374a20668l9089G2787O7480
$$ 65113 78175 -263003 -179988 -288579 -50731 15227 89601 -120668 -159757 72787 140267
19287A40267a05756d7102k92989J00612F8467J5643A9549a32907j09933J10410
$$ 140267 -105756 -47102 -340091 -239479 68467 84110 19549 -132907 -242840 -132430
19277a32430B9098J53524a23237j82832J39541a034j23766A84641a12195C05351
$$ -132430 29098 182622 -123237 -306069 -166528 -1034 -124800 184641 -112195 305351
19266A45761a11099C76162a25365n8670C999R5925b53374F3513b50083B12149
$$ 145761 -111099 376162 -125365 -184035 3999 99924 -253374 63513 -250083 212149
19255b58777Q2503A5182L86909a30120j16374P8529b464k8796o499j4609a9985
$$ -258777 -176274 15182 402091 -130120 -246494 -167965 -2464 -31260 -37759 -52368 -19985
19243a30123C87821a827A80759d1641a8707p4921a5855E5662a53457l492l01724
$$ -130123 387821 -1827 180759 -41641 -18707 -93628 -15855 55662 -153457 -156949 -458673
19232d58673K16289Q3202A60249b7832B43641D0727R9062b08683i4595B35730
$$ -458673 -242384 -159182 160249 -27832 243641 40727 139789 -208683 -94595 235730
19221G3445i1234m2091K8406J8237k71459D5761R1670e5499A73952d70207a32999
$$ 73445 -91234 -133325 -104919 -86682 -358141 45761 137431 -55499 173952 -470207 -132999
19209b20530A42040e386k56769a22519a4675A596d32489e8489m8759j37853p3810
$$ -220530 142040 -5386 -262155 -122519 -14675 1596 -432489 -58489 -107248 -245101 -318911
19198c18911C8710J49142b85137A67463i1224L0079j726D1334a52817H4101G621
$$ -318911 38710 187852 -285137 167463 -91224 -61145 -62871 41334 -152817 84101 7621
19186F0738R4601J5978a8306j70683A22148L7555a66809k94710a56900k4714G3093
$$ 60738 155339 171317 -18306 -188989 122148 159703 -166809 -461519 -156900 -181614 73093
19174A2229J02703a48896K7631F995L49229a55254H9787a93903f307B59810a72878
$$ 12229 114932 -148896 -121265 6995 356224 -155254 89787 -193903 -6307 259810 -172878
19162D3807O6597M8261M1693h3604j9194G1322f562C41385H3502b04940k19031
$$ 43807 110404 158665 200358 -83604 -102798 71322 -6562 341385 83502 -204940 -423971
19151d23971a40935b4574k18849l8974Q2602M5753A03955a05210n2701C3844a9642
$$ -423971 -140935 -24574 -243423 -282397 -199795 -154042 103955 -105210 -157911 33844 -19642
19139a0384j22291d2252j89542l0965C1948b09609B835K0019J78898n6331B2661
$$ -10384 -132675 -42252 -231794 -262759 31948 -209609 2835 22854 201752 145421 22661
19127a41443b9916F5100a08747B91599a1952m59581a86374c8650A19039K2010
$$ -141443 -29916 65100 -108747 291599 -11952 -471533 -186374 -38650 119039 141049
19117A41049K0511n0448f6703k1995a7438j48209M9236m00661B64686G6973f1766
$$ 141049 161560 111112 -66703 -88698 -17438 -165647 -116411 -517072 264686 76973 -61766
19105a95173A98586a05660k03762A58437a6329A22542a52034j01500h2676D7935
$$ -195173 198586 -105660 -309422 158437 -16329 122542 -152034 -253534 -82676 47935
19094c06881a14792B70644i8904j10627c2975l3981j47502A44787a54291j05812
$$ -306881 -114792 270644 -98904 -209531 -32975 -66956 -214458 144787 -154291 -260103
19084b60103A01683Q4579p6782a87659m3221b5637j50423B47154D6046b16904
$$ -260103 101683 186262 109480 -187659 -230880 -25637 -176060 247154 46046 -216904
19073a58181b5779P582k60770N4880A42268h0741A29281R4525b51742b2376q6942
$$ -158181 -25779 -18197 -278967 -224087 142268 -80741 129281 223806 -251742 -22376 -109318
19062a09318r0632B66688a490l4525j1169k27012a9715A23422c83247g2928I6524
$$ -109318 -199950 266688 -1490 -36015 -47184 -274196 -19715 123422 -383247 -72928 96524
19050B6176N1773i7563B09723A02779f0947n0712G1743a73675A00410b81018A22274
$$ 26176 77949 -97563 209723 102779 -60947 -111659 71743 -173675 100410 -281018 122274
19038a11743a6097j11816A82250k9279b7029j14493A98121c8586B2152N6971B0352
$$ -111743 -16097 -127913 182250 152971 -27029 -141522 198121 -38586 22152 79123 20352
19026H2602L4391K8832i2255j61379b0816A74729J68740a96326k59188A6495b90176
$$ 82602 116993 145825 -92255 -253634 -20816 174729 343469 -196326 -455514 16495 -290176
19014f0386A1078L3704j6918b57698i6018o6812E328J41302a90810f9516F8370
$$ -60386 11078 44782 27864 -257698 -96018 -162830 5328 146630 -190810 -69516 68370
19002a23612l6424I7611E190M0316c1373B13301R7656f8663j53208I5281k9294
$$ -123612 -160036 97611 5190 45506 -31373 213301 310957 -68663 -221871 95281 65987
18991F5987J07582d7010R366j07340d1428j21892G2500D100K49665P4066j47839
$$ 65987 173569 -47010 -37644 -144984 -41428 -163320 72500 4100 253765 327831 179992
18980A79992B4213J5864m745a43946B80617Q3749H6221B8625b21032G2888f5766
$$ 179992 24213 40077 35332 -143946 280617 364366 86221 28625 -221032 72888 -65766
18968H766b39682A03635a14888j78340a03710c6315B0207b44336j41613a87552
$$ 8766 -239682 103635 -114888 -293228 -103710 -36315 20207 -244336 -385949 -187552
18957G6309b40251g065D616b4812H3747k2087b15165A2433d8160B4719a19988
$$ 76309 -240251 -7065 4616 -24812 83747 61660 -215165 12433 -48160 24719 -119988
18945a1476k64837B77397J5743A12072a40922j83989a12955B32574b6072l7362
$$ -11476 -276313 277397 293140 112072 -140922 -324911 -112955 232574 -26072 -63434
18935f3434H5947l9418d3161j16024B78820C5319J48596J49440a80793N3209A2608
$$ -63434 85947 46529 -43161 -159185 278820 35319 183915 333355 -180793 -127584 12608
18923B4961a37481F795J77979P6485A9131b61970A74324a9552j44385I1163K0047
$$ 24961 -137481 6795 184774 261259 19131 -261970 174324 -19552 -163937 91163 111210
18912A11210M9574K59329F6337b00917q4736P1186A65987H677a46256L6325J6342
$$ 111210 160784 420113 66337 -200917 -285653 -214467 165987 8677 -146256 -109931 -93589
18901i3589A50649L4349b53573j22070c0915B53632a84354A17498c21196l3566
$$ -93589 150649 184998 -253573 -375643 -30915 253632 -184354 117498 -321196 -354762
18891c54762J0408A02777a22058B31167h6958j72935K0339E5707A5940b11261
$$ -354762 -344354 102777 -122058 231167 -86958 -259893 -239554 55707 15940 -211261
18880a99157J0118o8623h3837r2270I7413c43061A8618J00288a29157J0852d8954
$$ -199157 -189039 -257662 -83837 -176107 97413 -343061 18618 118906 -129157 -118305 -48954
18868a9528A16050K52780h2357p0512q6122a14114F0583g0381n9415H4964a6243
$$ -19528 116050 368830 -82357 -152869 -238991 -114114 60583 -70381 -129796 84964 -16243
18856i0617p9583J0724D976a33777j27666A07700J51401A24281c36953A25216
$$ -90617 -170200 -159476 4976 -133777 -261443 107700 259101 124281 -336953 125216
18845a65494e4424b2351A39122c1032r456p8115L7467A76669q1028b80673J3909
$$ -165494 -54424 -22351 139122 -31032 -40488 -118603 -81136 176669 95641 -280673 -266764
18834b66764A77280N7650b53455A43724j9405j5925J06629g0945J021A14905a79086
$$ -266764 177280 234930 -253455 143724 124319 108394 215023 -70945 -69924 114905 -179086
18822c77214h9088k39496B3406i3536j33303A13885b00469A64875P5372A1950
$$ -377214 -89088 -328584 23406 -93536 -226839 113885 -200469 164875 240247 11950
18811A91181a14968A03754b20547A15385a4930H115J42477b6608k1574B12420
$$ 191181 -114968 103754 -220547 115385 -14930 8115 150592 -26608 -48182 212420
18800b14907q6624P5851O9690A25747J00006a84509A5081b37984Q9992F3131K02547
$$ -214907 -301531 -225680 -155990 125747 225753 -184509 15081 -237984 -147992 63131 265678
18789B65678o2689e7429A49721b43115F4254b4346l54136Q4944D4578a60648q1876
$$ 265678 202989 -57429 149721 -243115 64254 -24346 -378482 -293538 44578 -160648 -242524
18778b42524P0727A28546b30442f0620F5006i3376A45002b02671B27360p8233
$$ -242524 -171797 128546 -230442 -60620 65006 -93376 145002 -202671 227360 149127
18768A49127p0439b81869B27395G3246a40896A8337c1904A3858a81735E1696b50146
$$ 149127 78688 -281869 227395 73246 -140896 18337 -31904 13858 -181735 51696 -250146
18756B04358e4338P547k97963a42925E4514a10733J1429A38816k101a03985l22257
$$ 204358 -54338 -46791 -344754 -142925 54514 -110733 -99304 138816 136715 -103985 -426242
18745d26242J56754c6105l4722m02179a93073p1678A54845a75527A25459H841
$$ -426242 -269488 -36105 -70827 -473006 -193073 -264751 154845 -175527 125459 8841
18734C6717N703a5745m3372n8142C9666Q3393c32843a49857j24602a1404j09110
$$ 36717 42420 -15745 -59117 -117259 39666 123059 -332843 -149857 -274459 -11404 -120514
18723a20514j19931a4242m9584r6346A0122M36012a6017l814k00288j5965J5056
$$ -120514 -240445 -14242 -63826 -160172 10122 446134 -16017 -19831 -220119 -236084 -221028
18712b21028l6042a2489j38733f0243j94348e9300r4326G5269b69445b8317k54807
$$ -221028 -257070 -12489 -151222 -60243 -254591 -59300 -153626 75269 -269445 -28317 -283124
18701b83124D6102c7477B77020d92269b27530j08542A41601M0821m8412C923c70696
$$ -283124 46102 -37477 277020 -492269 -227530 -336072 141601 182422 134010 3923 -370696
18689f2017K0686k38417F2528A2197K4225K65114e9604G8924J10119p3843l7934
$$ -62017 -41331 -279748 62528 12197 36422 301536 -59604 78924 189043 115200 77266
18678G7266i3741B19201G0635c21000i6041n3579g0975A68042J78284c18631q9153
$$ 77266 -93741 219201 70635 -321000 -96041 -149620 -70975 168042 346326 -318631 -407784
18667d07784a46444F9767J35517d5976A4571a52340F9509a41690h840A17640A4070
$$ -407784 -146444 69767 205284 -45976 14571 -152340 69509 -141690 -8840 117640 14070
18655c8547r8837b6605k00221j1205L7075a9312E0915g8263R851D4723a84973
$$ -38547 -137384 -26605 -226826 -238031 -200956 -19312 50915 -78263 -68412 44723 -184973
18643B29335b50308A43203f0844j52866R1757m6550L191d2629l3533j14511a9453
$$ 229335 -250308 143203 -60844 -213710 -121953 -168503 -165312 -42629 -76162 -190673 -19453
18631a19215k79345J51315n6008e5464A75789n1799K1020D2149M3250i5719l93796
$$ -119215 -398560 -247245 -303253 -55464 175789 123990 145010 42149 85399 -95719 -489515
18620d89515A08862c69901a22287o389L546C30030B1469b24399A19525a08104
$$ -489515 108862 -369901 -122287 -128676 -125130 330030 21469 -224399 119525 -108104
18609i873j5486A00037a68703k7263A18490i9837J985k39672Q8991o0401F8698
$$ -9873 -25359 100037 -168703 -195966 118490 -99837 -97852 -337524 -248533 -308934 68698
18597A01596a76541A76888b75112b1245j99876j38653c2279j65867C5383a79767
$$ 101596 -176541 176888 -275112 -21245 -221121 -359774 -32279 -198146 35383 -179767
18586e3561j77165d1937H5874g9526a9528p9386m5990A72585F1389a67073d8296
$$ -53561 -230726 -41937 85874 -79526 -19528 -98914 -144904 172585 61389 -167073 -48296
18574C01096b62377J13159C23932Q5258A71530O1191e9116D3387g3930B7747a6000
$$ 301096 -262377 -149218 323932 409190 171530 232721 -59116 43387 -73930 27747 -16000
18562G1598a24285p9522j03982n2025c0586m1696j17004h426k49613p9530a18869
$$ 71598 -124285 -203807 -307789 -359814 -30586 -72282 -189286 -8426 -258039 -337569 -118869
18550H376b44072B8169i431j32380c9337j93921A21340L0476a99924B17355e6389
$$ 8376 -244072 28169 -9431 -141811 -39337 -233258 121340 151816 -199924 217355 -56389
18538B29060D3508a96854l1777a4788j25372B18114a58649B3011K5419J7465f9820
$$ 229060 43508 -196854 -228631 -14788 -140160 218114 -158649 23011 48430 65895 -69820
18526c51194H6649g1564C50229b22723B9103b76981P2198h5909o4194a8701k01121
$$ -351194 86649 -71564 350229 -222723 29103 -276981 -204783 -85909 -150103 -18701 -219822
18515b19822B8850b29E0269d1248E8404O7797b80714J21706c368B43847G0176
$$ -219822 28850 -229 50269 -41248 58404 126201 -280714 -159008 -3368 243847 70176
18503A40267a28154M5971q4821A37562O6398a58730H5821N1513b27653M7636g8315
$$ 140267 -128154 -82183 -167004 137562 203960 -158730 85821 137334 -227653 -180017 -78315
18491A09555L3582c9611p5925a56k4074k82812G7180c9939q6341e314j66726G6127
$$ 109555 143137 -39611 -115536 -156 -24230 -307042 77180 -39939 -126280 -5314 -172040 76127
18478E4342c059B7887a06920r5139e4507H2730b18347g20r1718E9170o463F629
$$ 54342 -3059 27887 -106920 -202059 -54507 82730 -218347 -720 -92438 59170 52707 6629
18465A07603a16631p7666O5093c3263k55459n9642B66112b64001C772L82539b61322
$$ 107603 -116631 -194297 -129204 -33263 -288722 -348364 266112 -264001 3772 386311 -261322
18453D8879Q1663a54997n3198D4056c3005r7872B29358o8112j1164a64054f4566
$$ 48879 130542 -154997 -208195 44056 -33005 -130877 229358 161246 150082 -164054 -64566
18441A19512l8568L691R2380k1962a15402m01606K43459a31757D9142b598l72187
$$ 119512 80944 84635 177015 155053 -115402 -517008 -273549 -131757 49142 -2598 -374785
18430c74785J78690a72D1156a44321k12325A008d9077A42284c1270l67663B40183
$$ -374785 -196095 -172 41156 -144321 -356646 1008 -49077 142284 -31270 -398933 240183
18418h7062J9977A17372a52219M2202A42387c66081H8995g3430b5854j43642C56586
$$ -87062 -67085 117372 -152219 -110017 142387 -366081 88995 -73430 -25854 -169496 356586
18406D1826a59991f0573p2497M5908D1248a22925K6025k48066a66170K8829E8605
$$ 41826 -159991 -60573 -133070 -87162 41248 -122925 -96900 -344966 -166170 -137341 58605
18394A00095J33484P3318a23648c7916k41266A12937L88776a32670A63418c8067
$$ 100095 233579 306897 -123648 -37916 -279182 112937 501713 -132670 163418 -38067
18383e475k01998h2937E3886H23h4183D7199a04891A08182B0566P5666J40962
$$ -5475 -207473 -82937 53886 823 -84183 47199 -104891 108182 20566 96232 237194
18372B37194o0305J41745n1874B2872O3649a61307H2416J0996g7392C9814N6284
$$ 237194 176889 318634 266760 22872 86521 -161307 82416 93412 -77392 39814 96098
18361I6098a55563A82044B1126P8093e7752A80426b24918A44940M5336a67734
$$ 96098 -155563 182044 21126 99219 -57752 180426 -224918 144940 190276 -167734
18350b50247E1220c2937A36053b52815N5723D2639L6462e8656j54686j7963A311
$$ -250247 51220 -32937 136053 -252815 -197092 42639 79101 -58656 -213342 -231305 1311
18338D6252R770J20980L7420a42275A18051i381A14784j6518a65976e4181p4310
$$ 46252 56022 177002 214422 -142275 118051 -9381 114784 98266 -165976 -54181 -128491
18327a28491M269B90762j39851l675d71948C911a42581J4479I3230g8088j83401
$$ -128491 -124222 290762 150911 147236 -471948 3911 -142581 -128102 93230 -78088 -261489
18316b61489H9271a1563j65721b3984j14553D3851K38611d2600A38129O1099a66236
$$ -261489 89271 -11563 -177284 -23984 -138537 43851 282462 -42600 138129 199228 -166236
18304G0046d8017A44429P2116A00031a69445A63838k1598a62342E7474J9948J80608
$$ 70046 -48017 144429 216545 100031 -169445 163838 142240 -162342 57474 77422 258030
18293B58030b2936j32460M1766L7379O755r2927f5013q8663A03411r441D692J6713
$$ 258030 -22936 -155396 -113630 -76251 -69496 -162423 -65013 -153676 103411 93970 4692 21405
18281B1405L64811a19921j43186g6209B3183c9981r3830n3k89818b5842j54033
$$ 21405 386216 -119921 -263107 -76209 23183 -39981 -133811 -133864 -423682 -25842 -179875
18270a79875B07216F2491b43343A96062g0638D6697a6802I1518a33255C0792c56096
$$ -179875 207216 62491 -243343 196062 -70638 46697 -16802 91518 -133255 30792 -356096
18258c83911C0180a27595e9782o2512C52435a20995Q511j9658A9121a78677F8989
$$ -383911 30180 -127595 -59782 -122294 352435 -120995 -112484 -132142 19121 -178677 68989
18246b06185H9829a1016p7268j04698J565b6942k24204A52430b53990c872p1572
$$ -206185 89829 -11016 -88284 -192982 -191417 -26942 -251146 152430 -253990 -3872 -75444
18235g5444o1405A08283a85776k04151A26212P3893p3062d2100I4475a9588a44
$$ -75444 -136849 108283 -185776 -389927 126212 200105 127043 -42100 94475 -19588 -144
18223g9017A18852d9151o2728o5096Q8051G143J8195e3356p8030A13391a47206
$$ -79017 118852 -49151 -111879 -176975 -88924 7143 25338 -53356 -131386 113391 -147206
18211E811a28424G7746i1186l22638a65799L2401l8635n8057g8322e576k08618
$$ 5811 -128424 77746 -91186 -413824 -165799 -133398 -172033 -230090 -78322 -5576 -214194
18200b14194A67066e5582j35657A84149a81097g293m6929j30384A92796a66451
$$ -214194 167066 -55582 -191239 184149 -181097 -7293 -54222 -184606 192796 -166451
18189h9584A06034g5609k2811k85213a05330M451j40782d5605k7489n1289l226
$$ -89584 106034 -75609 -98420 -383633 -105330 -100879 -241661 -45605 -73094 -124383 -127609
18178a27609a3852A7181g7746B4633M5814J36856a49860J2268B71765b82287J35192
$$ -127609 -13852 17181 -77746 24633 70447 207303 -149860 -137592 271765 -282287 -147095
18167a47095A30046D0894J06899a23155b7168A27435o023C2061b58359A43702
$$ -147095 130046 40894 147793 -123155 -27168 127435 121412 32061 -258359 143702
18156C7302J00793J99924a1554j03273k95661E8391J3346A1250a11920a8071p9935
$$ 37302 138095 338019 -11554 -114827 -410488 58391 71737 11250 -111920 -18071 -98006
18145i8006k354K8496A95039i6466B4454r634b61853a13972A83127r334E8684
$$ -98006 -100360 -71864 195039 -96466 24454 14820 -261853 -113972 183127 173793 58684
18133e0169J2329k58657b7952G0757D294J12590a540k5165P124j8234F6989e3516
$$ -50169 -37840 -296497 -27952 70757 4294 116884 -1540 -26705 -19581 -37815 66989 -53516
18120b33981J15857j80401J47408A64156b01910E6526a3771A05183i0437G6293
$$ -233981 -118124 -298525 -151117 164156 -201910 56526 -13771 105183 -90437 76293
18109f2401B08854g7678j34063O3349A26870B827J94483b46479Q552F4879b43545
$$ -62401 208854 -77678 -211741 -148392 126870 2827 197310 -246479 -237927 64879 -243545
18097G3725j5067R5907i5768o7993j12997F7072J71528c46134c4561B6504J66165
$$ 73725 58658 154565 -95768 -163761 -276758 67072 238600 -346134 -34561 26504 192669
18086A92669e010n7551C9064d295r6401A97417h3577I4083O1522C2229a44357
$$ 192669 -5010 -62561 39064 -4295 -100696 197417 -83577 94083 155605 32229 -144357
18074b30237N6781A21887j2555P8509h6350a2995l30348F588e7467H8318a0321
$$ -230237 -173456 121887 109332 187841 -86350 -12995 -343343 6588 -57467 88318 -10321
18062A90909J91506b82881I886a70514c0312k81210A75448a56864C4884b66414
$$ 190909 382415 -282881 9886 -170514 -30312 -311522 175448 -156864 34884 -266414
18051a50189g0826C3527a69658A93438r4692d210B13994c15896a1209k9895B44673
$$ -150189 -70826 33527 -169658 193438 98746 -4210 213994 -315896 -11209 -41104 244673
18039b57373J20899C26882r5215a47286B11609q4769a60739A63947O320b17663
$$ -257373 -136474 326882 231667 -147286 211609 126840 -160739 163947 170267 -217663
18028a59243q2140q9379a48792p0020i6385J0015D378O3048J14701P5895B1366
$$ -159243 -241383 -330762 -148792 -218812 -96385 -86370 4378 67426 182127 258022 21366
18016a54782L7281A49286a01161G8340J18840H2141a13299L6498k24738a07759
$$ -154782 -117501 149286 -101161 78340 197180 82141 -113299 -76801 -301539 -107759
18005d2822j7262A40786E41J53936J53979D8328B3722a70404A18995P0998C8775
$$ -42822 -60084 140786 541 154477 308456 48328 23722 -170404 118995 189993 38775
17993G8067b89084A20329p437h0368j14121b5992A75769b16266A80736D9095J76222
$$ 78067 -289084 120329 112892 -80368 -194489 -25992 175769 -216266 180736 49095 225317
17982B25317n2587C6141j2706O1668P9269e9811G1450a20794B1792a99014A7562
$$ 225317 172730 36141 23435 85103 164372 -59811 71450 -120794 21792 -199014 17562
17970h1865p5451G3562j2887b561m1615E7443a18421c4068l3778K8986r7818j60816
$$ -81865 -157316 73562 60675 -2561 -44176 57443 -118421 -34068 -67846 -38860 -136678 -297494
17958b97494A53162k5002n3623J23922e6058D1686j1591K07563F4761e8268B12051
$$ -297494 153162 128160 74537 198459 -56058 41686 30095 237658 64761 -58268 212051
17946C5986L6291a01002A01054m4933j4030i1665E6860f2044A56646Q4319i9570
$$ 35986 72277 -101002 101054 56121 42091 -91665 56860 -62044 156646 240965 -99570
17934D7348e9925A27469P6613I6679a80523M9552D8533d68261E8165j0775b44225
$$ 47348 -59925 127469 204082 96679 -180523 -130971 48533 -468261 58165 47390 -244225
17922F2368d8326A86609J09606a52389c1111k20781e0056C8789K57258a7824A66460
$$ 62368 -48326 186609 296215 -152389 -31111 -251892 -50056 38789 296047 -17824 166460
17910b93081A32522a52589B36894B4801c89054g9846H1109a42885B12866D4305
$$ -293081 132522 -152589 236894 24801 -389054 -79846 81109 -142885 212866 44305
17899d9552a0972B46740d09896A18376a76597e9131A76079b75286j3767a03669
$$ -49552 -10972 246740 -409896 118376 -176597 -59131 176079 -275286 -289053 -103669
17888c2742m6958C69334A00319J97817j37651Q1115D4379J84152a74914e7430
$$ -32742 -79700 369334 100319 298136 160485 241600 44379 228531 -174914 -57430
17877B92914b94977A48872E8461J27864G529K3056c34113A61629a9929A84445
$$ 292914 -294977 148872 58461 186325 7529 30585 -334113 161629 -19929 184445
17866C5692b45806C37784E2763b8926D0442Q4940J35620I0492l0373f0578C5162
$$ 35692 -245806 337784 52763 -28926 40442 125382 261002 90492 60119 -60578 35162
17854a00530j25720A61380G7352a37556e7395I4564a23599E0948P4399m2759N2075
$$ -100530 -226250 161380 77352 -137556 -57395 94564 -123599 50948 125347 82588 134663
17843A34663L663o8242c659j22783j13509f5311B08346b43686K9399O3353N5961
$$ 134663 138326 70084 -3659 -126442 -239951 -65311 208346 -243686 -214287 -150934 -94973
17832i4973C31229j64297G4001a02270c1547B18614r204A01693J39238a60886
$$ -94973 331229 166932 74001 -102270 -31547 218614 209410 101693 240931 -160886
17821C8072N1307a0607B76582o7909L1556b40757A05634e3360r691A8439a39957
$$ 38072 89379 -10607 276582 208673 240229 -240757 105634 -53360 -63051 18439 -139957
17809e7981j20475e4778a4140G306b03292A80441b30809f9424o8388A28853J20276
$$ -57981 -178456 -54778 -14140 7306 -203292 180441 -230809 -69424 -137812 128853 249129
17798B49129a44476c383m997A53107E6318d635A83313a58181A38937K79750k05547
$$ 249129 -144476 -3383 -8380 153107 56318 -4635 183313 -158181 138937 418687 213140
17787B13140J57558a67809G5184a37621B3461e986B46647r8093L1725a58938k11230
$$ 213140 370698 -167809 75184 -137621 23461 -5986 246647 148554 180279 -158938 -370168
17776c70168f0290k15324A43491a47013A44106a97078B5576K24014K03115A09320
$$ -370168 -60290 -275614 143491 -147013 144106 -197078 25576 249590 452705 109320
17765B5618h2315j75195I6360J7890N5098l4475P4790F5597Q1705a08514n3864
$$ 25618 -82315 -257510 96360 114250 169348 134873 209663 65597 147302 -108514 -162378
17754a62378B35816A2902L69357j75618P3097b6558p5673B09362K46391A60386
$$ -162378 235816 12902 382259 206641 279738 -26558 -102231 209362 455753 160386
17743a50640d0227E48271k51027J247f9695B55698J09900F2525K32090j20082
$$ -150640 -40227 548271 297244 298491 -69695 255698 365598 62525 294615 174533
17733A74533b11819d2327c272o087j00480A20890Q8446j7295a49855B57527b5247
$$ 174533 -211819 -42327 -3272 -9359 -109839 120890 209336 192041 -149855 257527 -25247
17721B45257g726k8793l4167C40928i3866A17366J67140A29134c52696A34822
$$ 245257 -7726 -36519 -70686 340928 -93866 117366 284506 129134 -352696 134822
17710A04580c9690a534B31529c7935B09193c89A2449e3831j11161B59704a42896
$$ 104580 -39690 -1534 231529 -37935 209193 -389 12449 -53831 -164992 259704 -142896
17698B76923q7601j5478F7147J2574M7156E1676m396K40775a81133A5569K97728
$$ 276923 189322 173844 67147 79721 126877 51676 47280 288055 -181133 15569 313297
17687C13297j12144b7736A43537J51218j4316a81786P8625F5128k0013c6697C3316
$$ 313297 201153 -27736 143537 294755 280439 -181786 -103161 65128 45115 -36697 33316
17675A66485N7543j10241a05610M3212k03742A91501L1226G8521J75957M481A05601
$$ 166485 224028 113787 -105610 -62398 -266140 191501 222727 78521 254478 258959 105601
17663B46977J51357A73513g5935K2981B21946A0147J14019g6250C14830B3550
$$ 246977 398334 173513 -75935 -52954 221946 10147 124166 -76250 314830 23550
17652B27537R4220E7183b89268A29188J26599d3776M148A12373p839J73487A8056
$$ 227537 321757 57183 -289268 129188 255787 -43776 -39628 112373 104534 278021 18056
17640E5990O770a81535d4832k0419q959A5656P1053J54238J9331j3477h023o2918
$$ 55990 62760 -181535 -44832 -65251 -74210 15656 86709 240947 260278 246801 -8023 -70941
17628g0941B83808m1497p0849k9972n0120E081L7643J80672a35235C09203l3795
$$ -70941 283808 242311 171462 141490 91370 5081 42724 223396 -135235 309203 275408
17617B75408g3084n59B52378K5598j06625N5248F9824A2019i1123B16503N0565
$$ 275408 -73084 -73643 252378 277976 171351 226599 69824 12019 -91123 216503 267068
17606B67068j5519H2651L3040J07930P0245a13864A32754P4024m2888o5127h6245
$$ 267068 251549 82651 115691 223621 293866 -113864 132754 206778 163890 98763 -86245
17594B8343L0099K1736K29575q5784R8673m5392N0310A11960m5812J82968n0456
$$ 28343 58442 80178 309753 223969 322642 277250 327560 111960 66148 249116 198660
17583A98660k4030A2183a25188A42627B1076e1787B35473a84601j01499h9539
$$ 198660 174630 12183 -125188 142627 21076 -51787 235473 -184601 -286100 -89539
17572i6767A61911L46459A22945L18645G7072K82299p4160A9217L30598A07309
$$ -96767 161911 508370 122945 441590 77072 359371 285211 19217 349815 107309
17561B98199o9078j08433I348L71361f3573C39044j57847L20296B21937O7213
$$ 298199 229121 120688 9348 380709 -63573 339044 181197 501493 221937 289150
17551B89150j27452k9207l7110J73598P7974c3386E2265L16886r8022B9278a11794
$$ 289150 161698 132491 95381 268979 346953 -33386 52265 369151 271129 29278 -111794
17539E0300J76053Q994J71776A98901C8452h5608D80733h1738B4996L44174E7559
$$ 50300 226353 235347 407123 198901 38452 -85608 480733 -81738 24996 369170 57559
17527G375I52K01542H1799J27551K26817Q2813j6933j260j30430J20690r9955
$$ 7375 952 202494 81799 209350 436167 518980 502047 500787 370357 491047 391092
17516C91092j11151r5334n2114J56719l794A00311N88120l12022q5336M28896
$$ 391092 279941 184607 132493 289212 285418 100311 688431 376409 291073 719969
17506G19969l51841J65887j08779J68164A82258J72244A4591J36049a33073B07604
$$ 719969 368128 534015 425236 593400 182258 354502 14591 150640 -133073 207604
17495B85667O4856R8188j08175A21892A1021M02246F1141j2948N01167a32248
$$ 285667 350523 448711 340536 121892 11021 413267 61141 48193 549360 -132248
17484F8072k7482N3740L6474J34522B7892i8905b8376D42438O211B7732f1539
$$ 68072 40590 94330 130804 265326 27892 -98905 -28376 442438 448649 27732 -61539
17472A55659K72171B10550J46632A61604c0396A59286J09575g9687H9928C3685
$$ 155659 427830 210550 357182 161604 -30396 159286 268861 -79687 89928 33685
17461B76502o6951M5872L6025Q5405m5371B1905K09813G6102J10531K25434B7912
$$ 276502 209551 255423 291448 376853 331482 21905 231718 76102 186633 412067 27912
17449B79923j08765J38651J14556B06105p462L5993A01237J26366N3159M7449
$$ 279923 171158 309809 424365 206105 198643 234636 101237 227603 280762 328211
17439C28211A50129k1997L12522G9021O3281L57262A62001J77513l2977j48859
$$ 328211 150129 128132 440654 79021 142302 499564 162001 339514 306537 157678
17429A57678N4294K9584i5276B1523J02662o942L13954J4869A80625m617P3496
$$ 157678 211972 241556 -95276 21523 124185 117243 431197 446066 180625 176008 249504
17418B49504m3794p4091L90408j19974m417A61433o1829M2360J94822p6685e0840
$$ 249504 205710 131619 522027 402053 397636 161433 99604 141964 336786 260101 -50840
17406a30820B01469q2260L44377A35332o263J15152L0132K44796D0226R7917L55666
$$ -130820 201469 119209 463586 135332 129069 244221 274353 519149 40226 138143 493809
17395D93809A87430J11276A18166L96651k43485B7009a18236K1632B07340a83
$$ 493809 187430 298706 118166 514817 271332 27009 -118236 -96604 207340 -183
17384B39341n2592E8166R9062Q5662C6958L58476K4986H1987J46584G147K13669
$$ 239341 186749 58166 157228 242890 36958 395434 420420 81987 228571 7147 220816
17373B20816I0546K03773E7016J02171F0104A0376J14159O8691r4411J18620B0177
$$ 220816 90546 294319 57016 159187 60104 10376 124535 193226 98815 217435 20177
17361H5396J4844D0834d7668D2130K72999J29203A02387J02720G2526L42817j89021
$$ 85396 100240 40834 -47668 42130 315129 444332 102387 205107 72526 415343 226322
17350B26322a98349C38579m3825R606j46798J05927J086j5137H0036M77357A59315
$$ 226322 -198349 338579 294754 304360 157562 263489 264575 249438 80036 557393 159315
17338B83237J9182L04898k15334D9662J7372O6288J62790i7333C92014E8743B2860
$$ 283237 302419 607317 391983 49662 67034 133322 296112 -97333 392014 58743 22860
17326C83682j28404J48888a2478D64134A97716J48007J99624A67702O3866K12805
$$ 383682 255278 404166 -12478 464134 197716 345723 545347 167702 231568 444373
17316D44373j73396b04001C81175j09161J25015h4471C30631m9504j0231p0537
$$ 444373 270977 -204001 381175 272014 397029 -84471 330631 281127 270896 200359
17306B00359n5772M96570B29135K89777r1864A06126J48858C2917J93855N2707
$$ 200359 144587 641157 229135 518912 427048 106126 254984 32917 226772 279479
17296B79479b00706A75183J7856K35027H6742L48991i7649E4396K19476Q8354
$$ 279479 -200706 175183 193039 428066 86742 435733 -97649 54396 273872 362226
17286C62226p9231A39602j5915L33919a57605D30332A62597a8217A17856M9504
$$ 362226 282995 139602 123687 457606 -157605 430332 162597 -18217 117856 167360
17276A67360Q8352E5548M57128K9621B53151F9366K85730P5347a01828B86428
$$ 167360 255712 55548 512676 542297 253151 69366 355096 430443 -101828 286428
17265C38141L4084A45250m0535m4592Q2444Q4487F5605K43464j672G2015J78591
$$ 338141 372225 145250 104715 60123 142567 227054 65605 309069 307397 72015 250606
17254B50606n0124J27887a11157B97888d564j07245A83854H0030P375L98950A41480
$$ 250606 200482 328369 -111157 297888 -4564 -111809 183854 80030 87405 486355 141480
17242a9284B08855a51887C20662j26996q8503d3327C95450j71069a74420C62422
$$ -19284 208855 -151887 320662 193666 105163 -43327 395450 224381 -174420 362422
17231D90549C3659L3627P0374K01625h9472D98270j34816j34310d425D49357A29668
$$ 490549 33659 67286 137660 339285 -89472 498270 363454 229144 -4425 449357 129668
17219A47960k418M452A629M06637I9540P0362L96586B09635K74750n0253j34027
$$ 147960 145542 149994 1629 408266 99540 169902 566488 209635 484385 434132 300105
17208C00105N27642j71108r9913A91324L22334A83096o4130J38126J50429o7680
$$ 300105 827747 656639 556726 191324 513658 183096 118966 257092 407521 339841
17198C39841J69094j08057P5825j1698n2463A67681K30807j26432L4311K33468
$$ 339841 508935 400878 476703 465005 412542 167681 398488 272056 306367 539835
17188E39835j32408R0339B23281N3560q4466L09219k7647n6500Q3839j06887P1661
$$ 539835 407427 497766 223281 276841 192375 501594 473947 417447 501286 394399 466060
17177D66060J16575k43103J52561R2057k1665k52956O4395k3257A35173J01668
$$ 466060 582635 339532 492093 584150 562485 309529 373924 350667 135173 236841
17167B36841K23172j18235K4644r5148M0457p3056N18541l52071k0625J6002j68894
$$ 236841 460013 341778 366422 271274 311731 238675 757216 405145 384520 400522 231628
17156B31628L9262J49523J07799k23666k6848M3183K07432N8003B14513M93541
$$ 231628 270890 420413 528212 304546 277698 320881 528313 586316 214513 708054
17146G08054k66408A20386M36643j16222J9296K52565o8845B06363L0671O0994
$$ 708054 441646 120386 557029 440807 460103 712668 643823 206363 237034 298028
17136B98028K81557k74834K78415B16436J64115O4838L35068C60264L13781l04016
$$ 298028 579585 304751 583166 216436 380551 445389 780457 360264 674045 370029
17126C70029P3910j2891J61675k69202m988M49214O4935p5429j25022K51279m09292
$$ 370029 443939 431048 592723 323521 318533 767747 832682 757253 632231 883510 474218
17115D74218J83208j00892J75835G8072O02744j60180L12542j51545k7961l06121
$$ 474218 657426 556534 732369 78072 680816 520636 833178 681633 653672 347551
17105C47551K24957j78555K98446j28688K98715j73061k90568R5454J65679j88476
$$ 347551 572508 393953 692399 563711 862426 689365 398797 494251 659930 471454
17095D71454K73101l19330N975M90371l81591j88398J87381L56743j05096q1681
$$ 471454 744555 425225 431200 921571 539980 351582 538963 895706 790610 708929
17085G08929j1949j35048L77802l71823m2221O8097O8897r377J39857j04217K65460
$$ 708929 696980 561932 939734 567911 525690 593787 662684 653307 793164 688947 954407
17074I54407m13117j55958p4912O47426k26680J1556j47223k08211J97495J85403
$$ 954407 541290 385332 310420 957846 731166 742722 595499 387288 584783 770186
17064G70186M2251p4182L25913k25153Q3851j03716k67553j12168K94128k23648
$$ 770186 812437 738255 1064168 839015 922866 819150 551597 439429 733557 509909
17054E09909L34746n2550K08400p0651m6997m29231K56932k3195J34839N440J36653
$$ 509909 844655 792105 1000505 929854 882857 453626 710558 687363 822202 827642 964295
17043I64295K73159l48235k09484L31399k62116L22066k49915J86261j97826o7506
$$ 964295 1237454 889219 679735 1011134 749018 1071084 821169 1007430 809604 742098
17033G42098J47302J46673o2509j10524M8043p692J26900K6573D90047K92591
$$ 742098 889400 1036073 973564 863040 911083 903391 1030291 1056864 490047 782638
17023G82638L18213k65852j98044M34260k39498K20230j67444K51759j41500J51082
$$ 782638 1100851 834999 636955 1071215 831717 1051947 884503 1136262 994762 1145844
17013A145844l7567j62325J0242L2855J52299j77833J25302K8556j40541M41641
$$ 1145844 1108277 945952 956194 989049 1141348 963515 1088817 1117373 976832 1418473
17003A418473j07979q216Q9573k37225K83987l55363M6594J16782j04848O2967
$$ 1418473 1310494 1302278 1391851 1154626 1438613 1083250 1129844 1246626 1141778 1204745
16993A204745k18421K03684K05076j00382k67881M29276j70659j17878R611L349
$$ 1204745 986324 1190008 1395084 1294702 1026821 1456097 1285438 1167560 1177171 1180520
16983A180520j19386J27302J14683l3673Q3822j17787L05618P853L7933l2262
$$ 1180520 1061134 1188436 1303119 1269446 1353268 1235481 1541099 1548952 1586885 1554623
16973A554623j47566J17073j74807M10837k85112K61281m27089M10171j04354
$$ 1554623 1407057 1524130 1349323 1760160 1475048 1736329 1309240 1719411 1615057
16964A615057j54548K48525L29099j98856k57420M48633j11548l47348K5087J96416
$$ 1615057 1460509 1709034 2038133 1839277 1581857 2030490 1918942 1571594 1596681 1793097
16954A793097k88170J34328L50699O2798r3442j05075J57555K1500j17452j13427
$$ 1793097 1504927 1639255 1989954 2052752 1959310 1854235 2011790 2033290 1915838 1802411
16944A802411j4541K65750K27044l52267P3431j9921K38560J34602j39449k97739
$$ 1802411 1787870 2053620 2280664 1928397 2001828 1981907 2220467 2355069 2215620 1917881
16934A917881M47162k26751J39143l09375K64022J32563M79120k12835j96840
$$ 1917881 2365043 2138292 2277435 1968060 2232082 2364645 2843765 2630930 2434090
16925B434090J56538j04104N9946l75027J32395L47325K14280j49092j07184j04740
$$ 2434090 2590628 2486524 2546470 2171443 2303838 2651163 2865443 2716351 2609167 2504427
16915B504427M47453j77917J27161j52422L1245J36202k10687l0088M54801l22540
$$ 2504427 2951880 2773963 2901124 2748702 2779947 2916149 2705462 2675374 3130175 2807635
16905B807635M77721l43419M66281J6318j53027n8282L39747k5799j2142l2313
$$ 2807635 3285356 2941937 3408218 3424536 3271509 3213227 3552974 3527175 3515033 3482720
16895C482720J96207k16208j4802k2455J29830L84186q0995j2681Q040J44206
$$ 3482720 3678927 3462719 3447917 3425462 3555292 3939478 3858483 3845802 3853842 3998048
16885C998048p4979J96846K3182j75793M13833k43867K61223j7173L63072M9860
$$ 3998048 3923069 4119915 4143097 3967304 4381137 4137270 4398493 4381320 4744392 4794252
16875D794252m88664K11864L33949L7583r2395P1540k44262O92930n059o1129
$$ 4794252 4305588 4517452 4851401 4888984 4796589 4868129 4623867 5316797 5311738 5250609
16865E250609N62734j19803o2448K423K39773J17559J73863n18571N63793R9127
$$ 5250609 5813343 5693540 5631092 5633515 5873288 5990847 6164710 5646139 6209932 6309059
16855F309059j02028J71737L16353j31165K87823L09392j13986J63942j21162
$$ 6309059 6207031 6378768 6695121 6563956 6851779 7161171 7047185 7211127 7089965
16846G089965M50849l5122K33164R3698K29242K6604L17139j3300r503J42073
$$ 7089965 7540814 7505692 7738856 7832554 8061796 8088400 8405539 8392239 8382736 8524809
16836H524809K59838N31581J33789j45624L16938L26620M03894q8672L43422k24769
$$ 8524809 8784647 9316228 9450017 9304393 9621331 9947951 10351845 10263173 10606595 10381826
16826A0381826L59005M33543K81542L00443L20069J8663L57881r5107P72930K69219
$$ 10381826 10740831 11174374 11455916 11756359 12076428 12095091 12452972 12357865 13130795 13400014
16816A3400014J89815L84736o6646L85120N03657J34681N83976L30113K86958
$$ 13400014 13589829 13974565 13907919 14293039 14796696 14931377 15515353 15845466 16132424
16807A6132424O44986N88631N31317K62915M06899M76549K92841O07328M25076
$$ 16132424 16777410 17366041 17897358 18160273 18567172 19043721 19336562 19943890 20368966
16798B0368966P94518N09114M46007Q84362M45530P49909K01840Q81643J059300
$$ 20368966 21163484 21672598 22118605 23002967 23448497 24198406 24400246 25281889 26341189
16789B6341189P08207M87052Q24528Q99472J098646O90512Q36384Q69096J295268
$$ 26341189 27049396 27536448 28360976 29260448 30359094 31049606 31885990 32755086 34050354
16780C4050354M89258J491513J067777Q72435J349067J309805R37590J147228
$$ 34050354 34539612 36031125 37098902 37971337 39320404 40630209 41567799 42715027
16772D2715027J002105K088730J134149K227821J034379J506613J372710J394821
$$ 42715027 43717132 45805862 46940011 49167832 50202211 51708824 53081534 54476355
16764E4476355J922321J534455J793043J432578K284305J709685J895235J749680
$$ 54476355 56398676 57933131 59726174 61158752 63443057 65152742 67047977 68797657
16756F8797657J907223J872722J745170J808706J773475J969074J617454J519509
$$ 68797657 70704880 72577602 74322772 76131478 77904953 79874027 81491481 83010990
16748H3010990J898572J591996J122787J575087J160812J097674Q74209J249128
$$ 83010990 84909562 86501558 87624345 89199432 90360244 91457918 92332127 93581255
16740I3581255N65116O69552K23642O55588q7278N21042m87417l18520m36650
$$ 93581255 94146371 94815923 95039565 95695153 95607875 96128917 95641500 95322980 94886330
16731I4886330n81354q33974j128670j016542j047805j157734j490860j553629
$$ 94886330 94304976 93471002 92342332 91325790 90277985 89120251 87629391 86075762
16723H6075762j559167j397771j949261j192492j671820k050491j412339k106870
$$ 86075762 84516595 83118824 81169563 79977071 78305251 76254760 74842421 72735551
16715G2735551k034172j497594j771979j778612j906929j482437j836311j541146
$$ 72735551 70701379 69203785 67431806 65653194 63746265 62263828 60427517 58886371
16707E8886371j782642j097145j633925j601269j697530j070793j678360j452889
$$ 58886371 57103729 56006584 54372659 52771390 51073860 50003067 48324707 46871818
16699D6871818r28218j024777j619647j401929j076738q02232j157890j020417
$$ 46871818 45943600 44918823 43299176 41897247 40820509 40018277 38860387 37839970
16691C7839970r05777j292085m66698j352623p97163p35843p90643r20082q95887
$$ 37839970 36934193 35642108 35175410 33822787 33025624 32289781 31499138 30579056 29683169
16682B9683169p57771m82540q34687o07877n56218n88782p42541n53755k57646
$$ 29683169 28925398 28442858 27608171 27000294 26444076 25855294 25112753 24558998 24301352
16673B4301352j081040k0713q36565m81553m94663j98703p43244n04483k48720
$$ 24301352 23220312 23199599 22363034 21881481 21386818 21188115 20444871 19940388 19691668
16664A9691668m08300n60112l89878j64251m66186m19521k34281l12750l47071
$$ 19691668 19283368 18723256 18333378 18169127 17702941 17283420 17049139 16736389 16389318
16655A6389318l20828n34948j70059J27717j035255K53080r69549J90594q9959
$$ 16389318 16068490 15533542 15363483 15491200 14455945 14709025 13739476 13930070 13840111
16646A3840111m2528n27789j35471p5182k82798j91146m76621r5593k11076m46961
$$ 13840111 13797583 13269794 13134323 13059141 12776343 12585197 12108576 12012983 11801907 11354946
16636A1354946P1982l72639j68382l00180L32550l27948k55144l25394l65248
$$ 11354946 11426928 11054289 10885907 10585727 10918277 10590329 10335185 10009791 9644543
16627I644543K36068m2216n43236J02281j2113l4473j17253n75258J54880N8786
$$ 9644543 9880611 9838395 9295159 9397440 9385327 9350854 9233601 8658343 8813223 8872009
16617H872009k63226k62128J3287J06910n62780J31867l7969m49855K63766m01262
$$ 8872009 8608783 8346655 8359942 8466852 7904072 8035939 7997970 7548115 7811881 7410619
16607G410619l78500L08613j84022L537q9488J90362p0719m76978J35460J4334
$$ 7410619 7032119 7340732 7156710 7160247 7070759 7261121 7190402 6713424 6848884 6863218
16597F863218l6813l26241m8656m0823k80051M9535L26711j11839l94540j21111
$$ 6863218 6826405 6500164 6451508 6410685 6130634 6180169 6506880 6395041 6000501 5879390
16587E879390l3951J31417j31781p1310k66913J86704k3404l64764J40957l523
$$ 5879390 5845439 5976856 5845075 5773765 5506852 5693556 5670152 5305388 5446345 5442822
16577E442822k4760L4623l18538L08390k9663m95681K41921r7277j99971m8403
$$ 5442822 5418062 5452685 5134147 5442537 5412874 4917193 5159114 5061837 4861866 4813463
16567D813463L61740l32274k29335J53270l09045N2535R7482j58592r7868K16164
$$ 4813463 5175203 4842929 4613594 4766864 4457819 4510354 4607836 4449244 4351376 4567540
16557D567540j23801k99022P5795n1010M20776n91484K00486n6820k65901k8871
$$ 4567540 4443739 4144717 4220512 4169502 4590278 3998794 4199280 4142460 3876559 3847688
16547C847688J28080r825J22184l79536L10517n4531J46740l87772J28613J79607
$$ 3847688 3975768 3965943 4088127 3708591 4019108 3964577 4111317 3723545 3852158 4031765
16537D031765j90419o5805k66228M7254j82690J92377l53391L83209p8548J61804
$$ 4031765 3841346 3775541 3509313 3556567 3373877 3566254 3212863 3596072 3517524 3679328
16527C679328j64143P5091j56191L06222l66231n6764J25461k90530K81128P29
$$ 3679328 3515185 3590276 3434085 3740307 3374076 3317312 3442773 3152243 3433371 3434100
16517C434100l36336J9086L38957j64949N9103j99321J84005o2329n2074j28967
$$ 3434100 3097764 3116850 3455807 3290858 3349961 3150640 3334645 3272316 3220242 3091275
16507C091275J64327m1197k21647J97034P1281k85000K16334k05393j4676k9071
$$ 3091275 3255602 3214405 2992758 3189792 3261073 2976073 3192407 2987014 2972338 2943267
16497B943267J26487j60895L04316n46713O0649K58207j83631j14092M9238O4132
$$ 2943267 3069754 2908859 3213175 2666462 2727111 2985318 2801687 2687595 2736833 2800965
16487B800965j16022O7389J3328j13219j86057K48613J2628j875p0961J12122
$$ 2800965 2684943 2752332 2765660 2652441 2466384 2714997 2727625 2725750 2654789 2766911
16477B766911j75946j56128P4301j65241K22960M9773M83835o80537o7794K03842
$$ 2766911 2590965 2434837 2509138 2343897 2566857 2616630 3100465 2419928 2352134 2555976
16467B555976J55213j72575K03279o26773O63105k56071j2834j84263K61623K24863
$$ 2555976 2711189 2538614 2741893 2115120 2778225 2522154 2509320 2325057 2586680 2811543
16457B811543m46507K21868m60901L7706M5049L37968m25337M2204J29187J85507
$$ 2811543 2365036 2586904 2126003 2163709 2208758 2546726 2121389 2163593 2292780 2478287
16447B478287k02154L08317k48070k79111J86205l33359J89240J83384M8933k44294
$$ 2478287 2276133 2584450 2336380 2057269 2243474 1910115 2099355 2282739 2331672 2087378
16437B087378M37161L2638k32400o8704j1048l2478K8064J2677k00461M4943J43095
$$ 2087378 2524539 2557177 2324777 2256073 2245025 2212547 2240611 2253288 2052827 2097770 2240865
16426B240865K51658l04656J50536j38370j23242L47974n0581k52947O062K38547
$$ 2240865 2492523 2187867 2338403 2200033 2076791 2424765 2374184 2121237 2127299 2365846
16416B365846j94704p2476J80689k85703L17803j75242M117l96538M07803J67808
$$ 2365846 2171142 2098666 2279355 1993652 2311455 2136213 2140330 1743792 2151595 2319403
16406B319403j59688K4416p8115K8536L5665p8447k60059j9194L98840N065l47914
$$ 2319403 2159715 2184131 2106016 2134552 2170217 2091770 1831711 1812517 2211357 2216422 1868508
16395A868508l24080K91562J54418K5763l86663R7737R7752L0844J20780R398
$$ 1868508 1544428 1835990 1990408 2016171 1629508 1727245 1824997 1855841 1976621 1986019
16385A986019J82207o04528N78865r2059l66710M02269n0629k49008J81482r2681
$$ 1986019 2168226 1563698 2142563 2050504 1683794 2086063 2035434 1786426 1967908 1875227
16375A875227k42728K35446K67536l71990J99553n3729M92294m32582Q185J47749
$$ 1875227 1632499 1867945 2135481 1763491 1963044 1909315 2401609 1969027 1977212 2124961
16365B124961q830m36972L6836j36591J45436L2243Q18L9979j15194L64774m4086
$$ 2124961 2116131 1679159 1715995 1579404 1724840 1757083 1757901 1797880 1682686 2047460 2003374
16354B003374j62863m4688J10968j7176l205J81829n31378j11J35464J73213j70931
$$ 2003374 1840511 1795823 1906791 1889615 1886410 2068239 1536861 1536750 1672214 1845427 1674496
16343A674496j45763K64589j92869J94195Q9908k52707N63424n02558L51325m79951
$$ 1674496 1528733 1793322 1600453 1794648 1884556 1631849 2195273 1692715 2044040 1564089
16333A564089M74917k69879k79401k75089M27573o819Q6060n40558L35947K55865
$$ 1564089 2039006 1769127 1489726 1214637 1642210 1635391 1721451 1180893 1516840 1772705
16323A772705k1505l5844J78297l62392Q9311l30485N61252m99991K87404j66626
$$ 1772705 1751200 1715356 1893653 1531261 1620572 1290087 1851339 1351348 1638752 1472126
16313A472126J36276K00873j71782j8266J37936j78770J63242j18179p1738L5453
$$ 1472126 1608402 1809275 1637493 1619227 1757163 1578393 1741635 1623456 1551718 1587171
16303A587171P8307n2810J60406k78592K06393j07720O4044k4415j5016m14924
$$ 1587171 1665478 1612668 1773074 1494482 1700875 1593155 1657199 1632784 1617768 1202844
16293A202844K40931M40777l55654P1090l90755p656J98680K35784K6469m45086
$$ 1202844 1443775 1884552 1528898 1599988 1209233 1201577 1400257 1636041 1662510 1217424
16283A217424L6063K01250J65289o4344j43723J76961j33106J86488k18799J4648
$$ 1217424 1253487 1454737 1620026 1555682 1411959 1588920 1455814 1642302 1423503 1438151
16273A438151J83261k29324J88952j93526j48499m0278L29980N7242k75966j37895
$$ 1438151 1621412 1392088 1581040 1387514 1239015 1198737 1528717 1585959 1309993 1172098
16263A172098J43427J68880K23797n41748J32899M2035l8266J76995r2647J34555
$$ 1172098 1315525 1484405 1708202 1166454 1299353 1341388 1303122 1480117 1387470 1522025
16253A522025k4481l11772M66611n1811k92699k82894J71566R4073K64204j27000
$$ 1522025 1497544 1185772 1652383 1600572 1307873 1024979 1196545 1290618 1554822 1427822
16243A427822m04070L63133k24089j7777k16732N15974J35604m16964o4287J83468
$$ 1427822 1023752 1386885 1162796 1145019 928287 1444261 1579865 1162901 1098614 1282082
16233A282082j44078J25999Q0069j67344j08452o9850J89975q2823q7527j03852
$$ 1282082 1138004 1264003 1344072 1176728 1068276 998426 1188401 1105578 1018051 914199
16223I14199K50094j2386M4160k10333L1398L57098k48889l81905Q6725O79832
$$ 914199 1164293 1151907 1196067 985734 1017132 1374230 1125341 743436 830161 1509993
16213A509993l79239l98360J84961p7562K68186J5350M50020m35732l25361J30211
$$ 1509993 1130754 732394 917355 839793 1107979 1123329 1573349 1137617 812256 942467
16203I42467m8985k06447J55359J25023K59269L820E72057L29141K50723k17688
$$ 942467 893482 687035 842394 967417 1226686 1230506 572057 901198 1151921 934233
16193I34233p2817l01315J08339K50833j1014R3964p813J98360k38332o6752L7730
$$ 934233 861416 560101 668440 919273 908259 1002223 994410 1192770 954438 887686 925416
16182I25416l87115K34474n8893K62564K9822P2697J4620l97456K0569j71959
$$ 925416 538301 772775 713882 976446 1006268 1078965 1093585 696129 716698 544739
16172E44739K16177J7447p9432J69394j11349k77271P5664M0359j2598J58429
$$ 544739 760916 778363 698931 868325 756976 479705 555369 595728 583130 741559
16162G41559j49721B04018N09956Q0068p2841J24942k98054J31182k4699n6264
$$ 741559 591838 204018 713974 794042 721201 846143 548089 679271 654572 598308
16152E98308P9023J77065J26749m66288J13724m6137J26244J32232K9728j53322
$$ 598308 677331 854396 981145 514857 628581 582444 708688 840920 870648 717326
16142G17326M71595m82937j04330J70589l17433Q6488J03841j48004B45202J53790
$$ 717326 1188921 705984 601654 772243 454810 541298 645139 497135 245202 398992
16132C98992K05733M70360D19662A11899O92042r8262j36989l4092P6807C02377
$$ 398992 604725 1075085 419662 111899 803941 705679 568690 534598 611405 302377
16121D42600P1120n965J6411k7232J50073k4350O574q6533j01407R9492k7367
$$ 442600 513720 507755 524166 496934 647007 622657 629231 542698 441291 540783 513416
16110E13416J70772K9765n2439B28247l1370L77624k19649P851j31851L61581
$$ 513416 684188 713953 661514 228247 196877 574501 354852 362703 230852 592433
16100E92433A49940L63624K6443A63148K50937K59214J37J15870j48514l01202
$$ 592433 149940 513564 540007 163148 414085 673299 673436 789306 640792 339590
16090C39590a7294F16892B01423L63566j39763r9349A32702L14351G246L88380
$$ 339590 -17294 616892 201423 564989 425226 325877 132702 447053 7246 395626
16080C95626j20173K51429j7512j56773m2638J31140j78465j16593M64218k48728
$$ 395626 275453 526882 509370 352597 309959 441099 262634 146041 610259 361531
16070C61531K9151J05201B40223L21333B63973j24422J85860r3467J35366j31234
$$ 361531 390682 495883 240223 561556 263973 139551 325411 231944 367310 236076
16060B36076P3075K11719A48281L809L54963k4570q6002j93193J148Q3381p37
$$ 236076 309151 520870 148281 152090 507053 482483 396481 203288 204436 287817 287080
16049B87080A14168d4855B39036J20739J26344o1575G1545L0162K33580A3876
$$ 287080 114168 -44855 239036 359775 486119 424544 71545 101707 335287 13876
16038B98731d416B74749j10858J34763K75316j96911A67969J90542J01564j71220
$$ 298731 -4416 274749 163891 298654 573970 377059 167969 358511 460075 288855
16028B88855f5076C48053E9319L25513O6871o9025A74836L0218o1625K19177A18675
$$ 288855 -65076 348053 59319 384832 451703 382678 174836 205054 143429 362606 118675
16016A73074L17103B3468J77314P729a79266I0014R2252l3353M1878d1267B8480
$$ 173074 490177 23468 200782 208511 -179266 90014 182266 148913 190791 -41267 28480
16004H7823R1788O0459n6681C8633L23262o9835r1702K77597k03995M9929j15110
$$ 87823 179611 240070 183389 38633 361895 292060 200358 477955 273960 323889 208779
15993B08779O3424K06094a39349C33420L39658K07707K5674j00601K961J09079
$$ 208779 272203 478297 -139349 333420 673078 880785 906459 805858 808819 917898
15983I17898k80981n154B98556J33565f8887A27030L71958B41446N8076j1504
$$ 917898 636917 631763 298556 432121 -68887 127030 498988 241446 299522 288018
15973B88018j38704L4495m6313B667d3299B30004M5861l1387g7689B75044C2910
$$ 288018 149314 183809 137496 2667 -43299 230004 275865 244478 -77689 275044 32910
15961B64715i9360B17064i0345B03765L3282c4307n0138A21675J49865A09024
$$ 264715 -99360 217064 -90345 203765 237047 -34307 -84445 121675 271540 109024
15950A56656G0242b30903A64705F0828J31177b1273j62011L2087C65567B0590
$$ 156656 70242 -230903 164705 60828 192005 -21273 -183284 -151197 365567 20590
15939d9520A89600n2436j0495K27276h8221A88376m6518b01737A34291i6691B21238
$$ -49520 189600 137164 126669 353945 -88221 188376 141858 -201737 134291 -96691 221238
15927a65245A39632J9667d2198q7122D07561e9191A08097N3668J08950I9187l9224
$$ -165245 139632 159299 -42198 -129320 407561 -59191 108097 161765 270715 99187 59963
15916E9963d9602A17239J29273r0505d4745B52281a19489H4482b58850a23542
$$ 59963 -49602 117239 246512 156007 -44745 252281 -119489 84482 -258850 -123542
15905A12072k217J00509a0606A2572d5501B32725E5990g6281G2505J25668C3474
$$ 112072 109855 210364 -10606 12572 -45501 232725 55990 -76281 72505 198173 33474
15893I2353K2609J63877M9771j18206F0544e8908j37241B17311i737H8571N6471
$$ 92353 114962 278839 328610 210404 60544 -58908 -196149 217311 -9737 88571 145042
15882A45042K43981C1660P4574d8090A36306F3596a610j41444B21533i6147k32652
$$ 145042 389023 31660 106234 -48090 136306 63596 -1610 -143054 221533 -96147 -328799
15871c28799c9564a2702A26257m0587J61995O7162b16824C7629K98077I6015J61345
$$ -328799 -39564 -12702 126257 85670 247665 314827 -216824 37629 335706 96015 257360
15860B57360F6112J23693F5590B44J62896e664K177j3772H7621O1103O0709a8335
$$ 257360 66112 189805 65590 244 163140 -5664 -3487 -17259 87621 148724 209433 -18335
15847A64609J41925b5001o1994A70933n1741a7014r4055j01615f9181R73K686
$$ 164609 306534 -25001 -86995 170933 119192 -17014 -111069 -212684 -69181 -68208 -65522
15836f5522D9421J1078O5446b8683B1988g0734B36360b8478B58107b13482J03794
$$ -65522 49421 60499 125945 -28683 21988 -70734 236360 -28478 258107 -213482 -109688
15825a09688B32459L6756j06160B0560J36291A0662a05543H8500b0697j27662
$$ -109688 232459 269215 163055 20560 156851 10662 -105543 88500 -20697 -148359
15815a48359M1587b7713l9494j42307f3241k09702P6564I2905J4140K575a79911
$$ -148359 -106772 -27713 -67207 -209514 -63241 -272943 -196379 92905 107045 109620 -179911
15803B9185J03851B1257M7479b0972C709N7118g217j16972b2790B08971J32426
$$ 29185 133036 21257 68736 -20972 3709 60827 -7217 -124189 -22790 208971 341397
15792C41397i5417M4314m4949j0310C5760i9633A57356a30403N984A21286J34224
$$ 341397 -95417 -51103 -96052 -106362 35760 -99633 157356 -130403 -124419 121286 255510
15781B55510g2436j62300r4159k1703H6219a06041a2448n2994a0667o4208j88366
$$ 255510 -72436 -234736 -328895 -350598 86219 -106041 -12448 -65442 -10667 -74875 -263241
15770b63241o6451b7906j73161I552a39708C01185g9464B60287f2948b5311e966
$$ -263241 -329692 -27906 -201067 9552 -139708 301185 -79464 260287 -62948 -25311 -5966
15758E3837J12729n5164Q606A7672a37127A05492b17601I9029R8240b86315A34401
$$ 53837 166566 111402 120008 17672 -137127 105492 -217601 99029 197269 -286315 134401
15746b0911A74268J10802J27209c60245J79002M1121A19560b01597J8443M4707
$$ -20911 174268 285070 412279 -360245 -181243 -140122 119560 -201597 -183154 -138447
15736a38447D9926e5741E03J74872q7250c3756A6074J21826b91606B96846D9512
$$ -138447 49926 -55741 503 175375 88125 -33756 16074 137900 -291606 296846 49512
15724b26582A75188c40m2859j05589D388L23819a60099j00650j06431F5069R7803
$$ -226582 175188 -340 -43199 -148788 4388 328207 -160099 -260749 -367180 65069 162872
15713A62872a09212B78605a32753j11927D591K58992c02546O9072A21886b1597
$$ 162872 -109212 278605 -132753 -244680 4591 263583 -302546 -233474 121886 -21597
15702E9705j3594R6461a68353j23323F5515h2750A84733a29102j23537G9479J7979
$$ 59705 46111 142572 -168353 -291676 65515 -82750 184733 -129102 -252639 79479 97458
15691I7458a24541A7347M0142k3388J9129c00646g0125j66864J06492C52676a81316
$$ 97458 -124541 17347 57489 34101 53230 -300646 -70125 -236989 -130497 352676 -181316
15679A30200f9657H3083a76237f3189k8029d1441j84886H8301b4482C04861b15277
$$ 130200 -69657 83083 -176237 -63189 -91218 -41441 -226327 88301 -24482 304861 -215277
15667A31831J29524b55383A04015l0801a60741H9927A9382b39600a176o5125p9235
$$ 131831 261355 -255383 104015 73214 -160741 89927 19382 -239600 -1176 -66301 -145536
15656a45536A22696A3686d0300A78846M7306a72618F1774a04333d4981j07385
$$ -145536 122696 13686 -40300 178846 226152 -172618 61774 -104333 -44981 -152366
15646a52366N0151e0537A03779f5663C1985L33750b62650f969A05163K21447h8648
$$ -152366 -102215 -50537 103779 -65663 31985 365735 -262650 -6969 105163 326610 -88648
15634B00892g1448j09817E2249b19519k0417E8031J04622c98852A07816b38342
$$ 200892 -71448 -181265 52249 -219519 -239936 58031 162653 -398852 107816 -238342
15623c05529c4786A95611a28777A84533a57798e9593H2893h6234j04032Q1169
$$ -305529 -34786 195611 -128777 184533 -157798 -59593 82893 -86234 -190266 -109097
15613a09097a4367D8643k3036a96861E0575i3611B4611M8532J40777A215M46683
$$ -109097 -14367 48643 25607 -196861 50575 -93611 24611 73143 213920 1215 447898
15602D47898a53527C2817d17346J69519D2654J36390F0574c14225a17558B42987
$$ 447898 -153527 32817 -417346 -247827 42654 179044 60574 -314225 -117558 242987
15591A23291c6764j39152N7356C9155L19616a58550I2895a51129f4959j87184
$$ 123291 -36764 -175916 -118560 39155 358771 -158550 92895 -151129 -64959 -252143
15581b52143A6886J00898A6174d8359I6336D4570J47227b843j09875m3065B00986
$$ -252143 16886 117784 16174 -48359 96336 44570 191797 -2843 -112718 -155783 200986
15569b60235E6458K006c2217n0210j6639A13016k0075L4760a61802B06650q9042
$$ -260235 56458 58464 -32217 -82427 -99066 113016 92941 127701 -161802 206650 117608
15558A17608M67455b69565G8150d2895n378A44786O9570a94209E26605A39379
$$ 117608 585063 -269565 78150 -42895 -48273 144786 214356 -194209 526605 139379
15547F179J30251Q860l6714A0627J89457P4595C5595G572K00496L8733H7669L2804
$$ 6179 136430 145290 108576 10627 200084 274679 35595 7572 208068 246801 87669 120473
15535A20473R586m6766P5366j2293k0681a11744K8710o2718c4924D21080A54238
$$ 120473 130059 83293 158659 146366 125685 -111744 -83034 -145752 -34924 421080 154238
15523A45816a54200D61096G8739J34308J16679i2717a3497k89739e8106A12634
$$ 145816 -154200 461096 78739 213047 329726 -92717 -13497 -303236 -58106 112634
15512C55866G6824C6193a37885C601J05024D8935K3009a07619e1105H9264k9544
$$ 355866 76824 36193 -137885 3601 108625 48935 71944 -107619 -51105 89264 59720
15501E9720i8643M40M4321j55703B18576F8972e2329A7734M2452i9388A2762O2996
$$ 59720 -98643 -98203 -53882 -209585 218576 68972 -52329 17734 60186 -99388 12762 75758
15489G5758h5946J3840A64623b94044C3930L5400J78805a85214a2255p6177A99679
$$ 75758 -85946 -72106 164623 -294044 33930 69330 248135 -185214 -12255 -88432 199679
15477A44402J60338m7535C6128M95342a23899m7701A48539b01580F5820A865d86191
$$ 144402 304740 257205 36128 531470 -123899 -171600 148539 -201580 65820 1865 -486191
15465e1543q698j70670k2175q0894C35171A26429a60920A67054M346c15691a01306
$$ -51543 -60241 -230911 -253086 -333980 335171 126429 -160920 167054 171400 -315691 -101306
15453a39962C27430m4713a93050B16638C890J18066M9746L1894B469N96146k10717
$$ -139962 327430 282717 -193050 216638 3890 121956 171702 203596 2469 598615 387898
15442C87898A90072R6366K71804g7202B45110c0376B52715C3745J60885q7428
$$ 387898 190072 286438 558242 -77202 245110 -30376 252715 33745 194630 107202
15432A07202a34203B68371d5072j29519C27329m9072E9313i2645H6148f6911B5162
$$ 107202 -134203 268371 -45072 -174591 327329 278257 59313 -92645 86148 -66911 25162
15420B29343D4943K9422N3511a47092k7363C8458M5023a62445j31157g5629c0652
$$ 229343 44943 74365 127876 -147092 -174455 38458 83481 -162445 -293602 -75629 -30652
15408a76598A14434a03021l31065C67287a15397d2285A19524a1111C47533a49277
$$ -176598 114434 -103021 -434086 367287 -115397 -42285 119524 -11111 347533 -149277
15397A10426j0478a58173N156B16007c81767H2654b32220I4748b03282a3370o6221
$$ 110426 99948 -158173 -153017 216007 -381767 82654 -232220 94748 -203282 -13370 -79591
15386g9591A52871J10091j27970a45954G2664B2727J128j1670b170o9807B19408
$$ -79591 152871 262962 134992 -145954 72664 22727 23855 12185 -2170 -71977 219408
15374D05324e2320C7444d0907e799A80504Q0427H0631b09546I9767g486A73002
$$ 405324 -52320 37444 -40907 -5799 180504 260931 80631 -209546 99767 -7486 173002
15362C4991N1347h8416j0657a7886B75867D9127J95643H5090O1327R8264j2163
$$ 34991 86338 -88416 -99073 -17886 275867 49127 244770 85090 146417 244681 232518
15351B32518i5716A09672Q6883a77981C9877e6542K7715G0358K5103L75130A90138
$$ 232518 -95716 109672 196555 -177981 39877 -56542 -28827 70358 95461 470591 190138
15339A06993N4761G4732d3966A44795a25348d321I8392b75808A15673J54715a60023
$$ 106993 161754 74732 -43966 144795 -125348 -4321 98392 -275808 115673 270388 -160023
15327B25059K91602D4516b74166D32915j94816b8177A4551K08476E5655J16458
$$ 225059 516661 44516 -274166 432915 238099 -28177 14551 223027 55655 172113
15317A72113B3117K12310K63721d0335A82723a68946A01750e7051l03849A4393
$$ 172113 23117 235427 499148 -40335 182723 -168946 101750 -57051 -360900 14393
15306G0754K69911j03388d9971A12691p342a31163A18874K9033b37444A33869
$$ 70754 340665 237277 -49971 112691 105349 -131163 118874 147907 -237444 133869
15295A35341f4247F090f4724F3833O6934m2651J86293C8839b7245m19163d3525
$$ 135341 -64247 6090 -64724 63833 130767 88116 274409 38839 -27245 -446408 -43525
15283a37809o9904A92178g816A85371J30601D0919J89796A0729a55407A58247
$$ -137809 -207713 192178 -7816 185371 315972 40919 230715 10729 -155407 158247
15272b5142n828A53427J04867a0612A1340h2544p2403F4999a0633k48962G8972
$$ -25142 -30970 153427 258294 -10612 11340 -82544 -154947 64999 -10633 -259595 78972
15260a91982B86865C6161O6661b03166B98348F8343K00628J45975f5444J3520
$$ -191982 286865 36161 102822 -203166 298348 68343 268971 414946 -65444 -51924
15250e1924a2698D8370c90500h2222l4186e2879B76177a62706M3765A76791d1930
$$ -51924 -12698 48370 -390500 -82222 -116408 -52879 276177 -162706 -118941 176791 -41930
15238c04019A32166D4162L4879j6115b40093A345L07890R2122A1982L0907R8351
$$ -304019 132166 44162 79041 62926 -240093 1345 309235 401357 11982 42889 141240
15227A41240J41172A7269a07095k27415B19940b64866P7380j05394A91062H8153
$$ 141240 282412 17269 -107095 -334510 219940 -264866 -187486 -292880 191062 88153
15216G9571a16442B84834n2653B2461Q3258J86296r570b00726P3920C6003a2430
$$ 79571 -116442 284834 232181 22461 105719 292015 282445 -200726 -126806 36003 -12430
15204I0326Q5272a26901a121A5488K0513M14324A3502L76466B1450a88313J646
$$ 90326 175598 -126901 -1121 15488 36001 450325 13502 389968 21450 -188313 -186667
15193a86667B4925P4911b29205I0534b18095j83531B00734a01120B98612F1740
$$ -186667 24925 99836 -229205 90534 -218095 -401626 200734 -101120 298612 61740
15182c61680G7822J8435K05553b2074A98822K0803b15263B42288M2812k4708p3039
$$ -361680 77822 96257 301810 -22074 198822 219625 -215263 242288 285100 260392 187353
15171A87353a59532b982A55697c91215C22633N2403a14760A04016c8054k14915
$$ 187353 -159532 -2982 155697 -391215 322633 375036 -114760 104016 -38054 -252969
15161b52969f1168n4243A05513J18119j09512M7800O7189C596J41993P4770H6532
$$ -252969 -61168 -115411 105513 223632 114120 161920 229109 3596 145589 220359 86532
15149a38389B18766L1373f6701A05079a54640D3153K99411A33305K4741Q6336
$$ -138389 218766 250139 -66701 105079 -154640 43153 342564 133305 158046 244382
15139B44382a51845B38565H359J3484a60048C24360j08939a30444c7462m9499
$$ 244382 -151845 238565 8359 21843 -160048 324360 215421 -130444 -37462 -86961
15129h6961j99356b3194m4610D217L01340r4584a2319H3847C9628n20R636J40360
$$ -86961 -286317 -23194 -67804 4217 305557 210973 -12319 83847 39628 39108 48744 189104
15117A89104n1956K99739a03768A51315E3074a54097C59932A16840K23633j57720
$$ 189104 137148 436887 -103768 151315 53074 -154097 359932 116840 340473 182753
15107A82753k9593J87774o7368b74344B12272b148k149C92061c8337B70605h3888
$$ 182753 153160 340934 273566 -274344 212272 -2148 -4297 392061 -38337 270605 -83888
15095B7925Q1083n0875A6515f2724E4834N13071A3651J56625H1458P5098K75423
$$ 27925 109008 58133 16515 -62724 54834 567905 13651 170276 81458 156556 431979
15084D31979A59583E461J02965K75330j89609J92183m7940A31610O2267D7597
$$ 431979 159583 5461 108426 383756 194147 386330 338390 131610 193877 47597
15073A00104h6922J6867A75362O5260a00971A48344a74228B18881j4655c0491
$$ 100104 -86922 -70055 175362 240622 -100971 148344 -174228 218881 204226 -30491
15062E5834K72182a8662B51893f7774H0055M12752j85987j37538O2419J01474
$$ 55834 328016 -18662 251893 -67774 80055 492807 306820 169282 231701 333175
15052C33175c7345A30878j8136j9776K95473F3593N5182B9007L90406k03107J24641
$$ 333175 -37345 130878 112742 92966 388439 63593 118775 29007 419413 216306 340947
15041C40947J17732m4316j79714B2885J02705K80112j79074l9732J6684k2305
$$ 340947 458679 414363 234649 22885 125590 405702 226628 186896 203580 181275
15031A81275K730M53169A25589J25711J53589j32997r4937M09062j92136J16652
$$ 181275 184005 637174 125589 251300 404889 271892 176955 586017 393881 510533
15021E10533B47053G0331L70423R91r6785K25834E0785L30352O63q4326f2891
$$ 510533 247053 70331 440754 441745 344960 570794 50785 381137 381800 297474 -62891
15009A12726a20804B65237M49720A46319L14778j73181A01064J40535k7833I8353
$$ 112726 -120804 265237 714957 146319 461097 287916 101064 241599 213766 98353
14998D9006N05310A17323q864M98773m7902p8261Q7770E2795K57124K10830k28324
$$ 49006 554316 117323 108459 607232 559330 481069 568839 52795 309919 520749 292425
14987B92425A43526J90353J66961k00352J1147P6776N8007j72263k2220L96359
$$ 292425 143526 333879 500840 300488 311635 388411 446418 274155 251935 648294
14977F48294N482O313l03202J04622A16662N27067C04454J4105J2262J77631k25842
$$ 648294 653776 660089 356887 461509 116662 643729 304454 318559 330821 508452 282610
14966B82610K06224k27992Q351K21753L5110k21526j17162J92140D7438J90882
$$ 282610 488834 260842 269193 490946 526056 304530 187368 379508 47438 238320
14956B38320K25451d2286B44248L0519r5457o0226M00306B05029M15160L7355
$$ 238320 463771 -42286 244248 274767 179310 119084 519390 205029 620189 657544
14946F57544k71071Q4090k22443L58775j85117r9899A29639J84612J37831B25414
$$ 657544 386473 470563 248120 606895 421778 321879 129639 314251 452082 225414
14935E75004k55141J16533Q8800j41405L81053j6222N1483m5179q9228L4886N50405
$$ 575004 319863 436396 525196 383791 764844 748622 800105 754926 665698 700584 1250989
14924A250989j55844L6938m42686M49351j3110j96135K50182O888O223k38690
$$ 1250989 1095145 1132083 689397 1138748 1125638 929503 1179685 1186573 1192796 954106
14914I54106O2769j09328k44747k40580k01799Q3846M61681B91234K74156k43446
$$ 954106 1016875 907547 662800 422220 220421 304267 765948 291234 565390 321944
14904C21944J02867R716A62703K49823A88163K74832m0426k0930J24498B31256
$$ 321944 424811 434527 162703 412526 188163 462995 422569 401639 526137 231256
14893B93782J29027k8096o8702J96340q6193j20062I2604K78647N3016j56589
$$ 293782 422809 394713 326011 522351 436158 316096 92604 371251 424267 267678
14883B67678K90817j50583J29898O5589P0426k19889j67615K69582k13877N33109
$$ 267678 558495 407912 537810 603399 673825 453936 286321 555903 342026 875135
14873H75135C40691L52232B69745K73731q3944L21146C29081K22040B22105N00134
$$ 875135 340691 692923 269745 543476 459532 780678 329081 551121 222105 722239
14863G22239k19009j06283K19783p0392o1472j96075L8692K17817k50957C3926
$$ 722239 503230 396947 616730 546338 484866 288791 327483 545300 294343 33926
14852B98686j25929M18547a0845B93461K85394k41050M1434L83853l62545J80648
$$ 298686 172757 591304 -10845 293461 578855 337805 379239 763092 400547 581195
14842E81195p6337J36752N65617n90634J68938j12742j47769K99250C10266J08444
$$ 581195 504858 641610 1207227 616593 785531 672789 525020 824270 310266 418710
14832D18710N9183A18080K05709K37487B42930J10380M88101B15086o1921l5393
$$ 418710 477893 118080 323789 561276 242930 353310 841411 215086 153165 117772
14822A17772N69843j70584Q9097k08364L88592j29138r0156J07872k13859P7827
$$ 117772 687615 517031 606128 397764 786356 657218 567062 674934 461075 538902
14812E38902l3711p566k0146K3666K25434k12224j00029M11736P6104C93939N01385
$$ 538902 505191 497625 477479 501145 726579 514355 414326 826062 902166 393939 895324
14801H95324j08698N1639l80229L72670j35264B38283K23621r1169p0463L69096
$$ 895324 786626 838265 458036 830706 695442 238283 461904 370735 300272 669368
14791F69368j77979n4413J03731Q8369M0951C06641M28370N7732C54639Q096J16662
$$ 669368 491389 436976 540707 629076 670027 306641 735011 792743 354639 362735 479397
14780D79397P3641k3348n3463A90258M41936k58731M66615B69224L13081j5609
$$ 479397 553038 529690 476227 190258 632194 373463 840078 269224 582305 566696
14770E66696p7066J82828p4872J47891n8379l27208J53260K94868k49562J025
$$ 566696 489630 672458 597586 745477 687098 359890 513150 808018 558456 559481
14760E59481j4031j89050L69546k92020J74161L548N7458j55261n3227j71807
$$ 559481 545450 356400 725946 433926 608087 611635 669093 513832 460605 288798
14750B88798J71272L40210l85659O01461q562C07970K07457J49955k42174K6991
$$ 288798 460070 800280 414621 1016082 1007520 307970 515427 665382 423208 450199
14740D50199q3266K66320R2125K04698k50569J9433J97838o589J78222D77571
$$ 450199 366933 633253 725378 930076 679507 698940 896778 890189 1068411 477571
14729E93540J66764m7861J09540k71748N51429n1263J06271k89196K46002j99298
$$ 593540 760304 712443 821983 550235 1101664 1050401 1156672 867476 1113478 914180
14719I14180K11907J47461l72285P9672j32048j66175K91563r9436J5722R1515
$$ 914180 1126087 1273548 901263 980935 848887 682712 974275 874839 890561 982076
14709I82076k02345J8028J56964j2233j99533K92971k64213L53023j82988L85210
$$ 982076 779731 797759 954723 942490 742957 1035928 771715 1124738 941750 1326960
14699A326960o4166q2225K49581m37377L84478l10212j30379K64436k14428J56974
$$ 1326960 1262794 1180569 1430150 992773 1377251 1067039 936660 1201096 986668 1143642
14689A143642j86498M7149m9332o5160J35538K0537j85686q9283K89615j95540
$$ 1143642 957144 1004293 954961 889801 1025339 1045876 860190 770907 1060522 864982
14679H64982K51921m03347K0605K01796j60696M18940m05965j57818K57861L68938
$$ 864982 1116903 713556 734161 935957 775261 1194201 788236 630418 888279 1257217
14669A257217l77408O3957J8325r3369j3146L86755k7566n16041M59658k5448
$$ 1257217 879809 943766 962091 868722 855576 1242331 1214765 698724 1158382 1132934
14659A132934l73927K5777N32867k89056E14081M61563J68739K91437n61563K68440
$$ 1132934 759007 784784 1317651 1028595 514081 975644 1144383 1435820 874257 1142697
14649A142697r4941J97728o6423J77521j34854J41048k88672O024K05130n68389
$$ 1142697 1047756 1245484 1179061 1356582 1221728 1362776 1074104 1080128 1285258 716869
14639G16869K54978L10597o8980k14078K38896o9095o5411J09915j11691M64817
$$ 716869 971847 1282444 1213464 999386 1238282 1169187 1103776 1213691 1102000 1566817
14629A566817k01335Q8306m17142k2820L76238q3110k4104N788M12632l81045
$$ 1566817 1365482 1453788 1036646 1013826 1390064 1306954 1282850 1288638 1701270 1320225
14619A320225j00905K51431l46910L01571j75701J28179O7755M23108n35610o4989
$$ 1320225 1219320 1470751 1123841 1425412 1249711 1377890 1445645 1868753 1333143 1268154
14609A268154k03813L28650J17826J03358l24849L70994k62933q2754L32800j16336
$$ 1268154 1064341 1392991 1510817 1614175 1289326 1660320 1397387 1314633 1647433 1531097
14599A531097k46522M5903m0648K2848J02679K61902j52209J20355J61334r7476
$$ 1531097 1284575 1330478 1289830 1312678 1415357 1677259 1525050 1645405 1806739 1709263
14589A709263k59688l4310K90649k21393L77654k88888K17850k08134K56574K74596
$$ 1709263 1449575 1415265 1705914 1484521 1862175 1573287 1791137 1583003 1839577 2114173
14579B114173j97691j7836N7916K7206j5647M249j88361J84454k08417k5160L12384
$$ 2114173 1916482 1898646 1956562 1983768 1968121 1972370 1784009 1968463 1760046 1734886 2047270
14568B047270L87977m33452K87053m17319K05692J32751r724M78060L74153q54902
$$ 2047270 2435247 2001795 2288848 1871529 2077221 2209972 2200248 2678308 3052461 2197559
14558B197559M65499K14342L38659J88500N46164J3956N28789N20825Q21821J944567
$$ 2197559 2663058 2877400 3216059 3404559 3950723 3964679 4493468 5014293 5836114 7780681
14548G780681M341279P544947J3142753r34234j4637488q134786l669829j753185
$$ 7780681 12121960 19666907 32809660 31875426 17237938 9103152 5433323 3680138
14540C680138j050910j52374k07310l59723K45623k70402L53291j49499m6460
$$ 3680138 2629228 2476854 2269544 1909821 2155444 1885042 2238333 2088834 2042374
14531B042374j56181J70749j03953J18213J33519Q9043j56155P2454J68469j58478
$$ 2042374 1886193 2056942 1952989 2071202 2204721 2293764 2137609 2210063 2378532 2220054
14521B220054J80218l07385K32152J27647j36007M09469j95557k68180J96629
$$ 2220054 2400272 2092887 2325039 2452686 2316679 2726148 2530591 2262411 2459040
14512B459040Q0350J68168j37994j02098K46849J41103k00156J69253O8529J03550
$$ 2459040 2539390 2707558 2569564 2467466 2714315 2855418 2655262 2824515 2893044 2996594
14502B996594k39029L52425l74737J15350L20515k54429K61019j32165O9478K25053
$$ 2996594 2757565 3109990 2735253 2850603 3171118 2916689 3177708 3045543 3115021 3340074
14492C340074P5720k71423J91593J18039l10118M24703j16852k36828o6077M38958
$$ 3340074 3415794 3144371 3335964 3454003 3143885 3568588 3451736 3214908 3148831 3587789
14482C587789j44843N3706J700K88922k02482M51252j31274m0410l01741L06423
$$ 3587789 3442946 3496652 3498352 3787274 3584792 4036044 3904770 3864360 3562619 3869042
14472C869042P4190K82109j30070j29757K25538J27822j4504J56312O3574o49625
$$ 3869042 3943232 4225341 4095271 3965514 4191052 4318874 4304370 4460682 4524256 3874631
14462C874631M94757r0896K24923j97414L09408J38136K05101p3032l20742M34338
$$ 3874631 4369388 4278492 4503415 4306001 4615409 4753545 4958646 4885614 4564872 4999210
14452D999210j02697L1236n0407j4247M42990O3085q834r717m0205J18632k21825
$$ 4999210 4896513 4927749 4877342 4863095 5306085 5369170 5360336 5350619 5310414 5429046 5207221
14441E207221L98073l9301Q5524L01087l02091N07035N292J31780J7037j82539
$$ 5207221 5605294 5565993 5651517 5952604 5650513 6157548 6162840 6294620 6311657 6129118
14431F129118L40818j64123K97669k4893k0229L78507O2467K8372k05859O03411
$$ 6129118 6469936 6305813 6603482 6578589 6558360 6936867 6999334 7027706 6821847 7425258
14421G425258N769K42457K77632q437j09039K72567N465p2111L14330m8943K52530
$$ 7425258 7431027 7673484 7951116 7942679 7833640 8106207 8111672 8039561 8353891 8304948 8557478
14410H557478L09241j87279R3564M32555j9079K01444N45856k21262J60932L410
$$ 8557478 8866719 8679440 8773004 9205559 9186480 9387924 9933780 9712518 9873450 9876860
14400I876860J82241L24023P4854J99038J20617j1057L00664L98000j16324L9180
$$ 9876860 10059101 10383124 10457978 10657016 10777633 10766576 11067240 11465240 11348916 11388096
14390A1388096L58557L87093q709L213L49383J87126N43243L3302p9701O16742
$$ 11388096 11746653 12133746 12125037 12128250 12477633 12664759 13208002 13241304 13161603 13778345
14380A3778345L16782R6040N88679J01307K48926J67147K50152L62078O51605
$$ 13778345 14095127 14191167 14779846 14881153 15130079 15297226 15547378 15909456 16561061
14371A6561061k03321N38517k28984R70815J83266N69821N27341o7385L95594
$$ 16561061 16357740 16896257 16667273 17638088 17821354 18391175 18918516 18851131 19246725
14362A9246725N16360N01944K63492L31442P50500M31207L85315M86900K52792
$$ 19246725 19763085 20265029 20528521 20859963 21610463 22041670 22426985 22913885 23166677
14353B3166677R92492M09881Q15653M23841M80192P77487P60317Q53156P23391
$$ 23166677 24159169 24569050 25384703 25808544 26288736 27066223 27826540 28679696 29403087
14344B9403087J073625N60063O24027N02112J741576N80056N16719J316809P78833
$$ 29403087 30476712 31036775 31660802 32162914 33904490 34484546 35001265 36318074 37096907
14335C7096907J200115J321941J113260J207527J381037J087038J762386J269824
$$ 37096907 38297022 39618963 40732223 41939750 43320787 44407825 46170211 47440035
14327D7440035J097761K077564J349862K064310J740627J557522K283379K197502
$$ 47440035 48537796 50615360 51965222 54029532 55770159 57327681 59611060 61808562
14319F1808562K014814K343038K435323K567700K673748L012235K711744L355443
$$ 61808562 63823376 66166414 68601737 71169437 73843185 76855420 79567164 82922607
14311H2922607L189366L510611L852921L520728M106635M595668M443593M906339
$$ 82922607 86111973 89622584 93475505 96996233 101102868 105698536 110142129 115048468
14303A15048468M703979N222092N565499O169622O366286O257180P203813P238924
$$ 115048468 119752447 124974539 130540038 136709660 143075946 149333126 156536939 163775863
14295A63775863P786578Q535205Q660150R457578R688426J0241559J0937317J1059039
$$ 163775863 171562441 180097646 188757796 198215374 207903800 218145359 229082676 240141715
14287B40141715J2032508J2524623J2971277J2963988J3502367J3673656J4077190
$$ 240141715 252174223 264698846 277670123 290634111 304136478 317810134 331887324
14280C31887324J4471293J4301395J3999364J3505788J2964659J1586925J0153974
$$ 331887324 346358617 360660012 374659376 388165164 401129823 412716748 422870722
14273D22870722Q208579M401083L130023J887474K33446k308655k940404l544490
$$ 422870722 431079301 435480384 438610407 440497881 440731327 438422672 435482268 431937778
14265D31937778o100191q551379j0400746j2142158j3394197j3941402j4757724
$$ 431937778 425837587 417286208 406885462 394743304 381349107 367407705 352649981
14258C52649981j4912875j4774955j4854328j4565148j4225338j3727637j3533174
$$ 352649981 337737106 322962151 308107823 293542675 279317337 265589700 252056526
14251B52056526j2145388j2304913j1129693j0677214j0178143r735951r011620
$$ 252056526 239911138 227606225 216476532 205799318 195621175 185885224 176873604
14244A76873604q249774q127182p703327p460617o626687o326383n512036n748405
$$ 176873604 168623830 160496648 152793321 145332704 138706017 132379634 126867598 121119193
14236A21119193n068162n407350n116676m029931m400513l508163l591325l635409
$$ 121119193 116051031 110643681 105527005 101497074 97096561 93588398 89997073 86361664
14228H6361664l666250l346219k373695l165992k756846k545664k764157k116418
$$ 86361664 82695414 79349195 76975500 73809508 71052662 68506998 65742841 63626423
14220F3626423k197109j964624k258223j733378j918718j381390j706987j231853
$$ 63626423 61429314 59464690 57206467 55473089 53554371 52172981 50465994 49234141
14212D9234141j857819j359742j356826j418048j218173q71179j284123j307312
$$ 49234141 47376322 46016580 44659754 43241706 42023533 41152354 39868231 38560919
14204C8560919j119847r08831p62201j202874p83992j119092j018654n69882r86136
$$ 38560919 37441072 36532241 35770040 34567166 33783174 32664082 31645428 31075546 30089410
14195C0089410q13727m74477n21705q24502n91009q54335l69983q75989o24820
$$ 30089410 29275683 28801206 28279501 27454999 26863990 26009655 25639672 24763683 24138863
14186B4138863k93482q05114l44900o91003n33883k49700l00073m24032o78250
$$ 24138863 23845381 23040267 22695367 22004364 21470481 21220781 20920708 20496676 19818426
14177A9818426n54035J15469k75685o49968l85745m96120n43225J60644k37443
$$ 19818426 19264391 19379860 19104175 18454207 18068462 17572342 17029117 17189761 16952318
14168A6952318n92919k60502k90329m77606j87112m73765l3943l65590m35808
$$ 16952318 16359399 16098897 15808568 15330962 15143850 14670085 14636142 14270552 13834744
14159A3834744j96287k32988l80520L18689o27754J18212n15203n2524m02181
$$ 13834744 13638457 13405469 13024949 13343638 12715884 12834096 12318893 12266369 11864188
14150A1864188m78009K93055j19316j1913n56041l35401N2610l0419k98958l58361
$$ 11864188 11386179 11679234 11559918 11548005 10991964 10656563 10709173 10678754 10379796 10021435
14140A0021435o3691l07310Q4077j35085o26074J44375o1981J53526o03546M14038
$$ 10021435 9957744 9650434 9734511 9599426 8973352 9117727 9055746 9209272 8605726 9019764
14130I019764n21894K30143p97841J43068Q5145l34739J16344l50935L53030k52624
$$ 9019764 8497870 8728013 7930172 8073240 8158385 7823646 7939990 7589055 7942085 7689461
14120G689461n58175K96993k78023J50629J8795l19146j83295K57863o25258L37339
$$ 7689461 7131286 7428279 7150256 7300885 7319680 7000534 6817239 7075102 6449844 6787183
14110F787183L46499m45041j25715m60214M26478k98642j95184J28244l00694
$$ 6787183 7133682 6688641 6562926 6102712 6529190 6230548 6035364 6163608 5862914
14101E862914K64537l37110M1934l15965L74438l36330J53773m39380l17181M67574
$$ 5862914 6127451 5790341 5832275 5516310 5890748 5554418 5708191 5268811 4951630 5419204
14091E419204l18998M5455R1492n98473L34372J61628k38903m427k79151L04064
$$ 5419204 5100206 5145661 5237153 4638680 4973052 5134680 4895777 4891350 4612199 4916263
14081D916263k17826J95321k71871j17196k1975l74803L00805J4330j29161k56224
$$ 4916263 4698437 4893758 4621887 4504691 4482716 4107913 4408718 4423048 4293887 4037663
14071D037663J28070J12442k00111k28587J71155N9324k26471J38862K36359o57486
$$ 4037663 4165733 4278175 4078064 3849477 4020632 4079956 3853485 3992347 4228706 3571220
14061C571220M56142j91469K69773l93501J73636q06649O62830k99774J43492
$$ 3571220 4027362 3835893 4105666 3712165 3885801 3079152 3741982 3442208 3585700
14052C585700q36m1945k82994M25632n36762J30727M5999j13769o6480j31053
$$ 3585700 3584864 3542919 3259925 3685557 3148795 3279522 3325521 3211752 3145272 3014219
14042C014219K09655l62364L61872J79080l71215J53029J67587k68293J30129
$$ 3014219 3223874 2861510 3223382 3402462 3031247 3184276 3351863 3083570 3213699
14033C213699R0433j64185k52565J88672k07823l6130o6341k84310l2899M6880
$$ 3213699 3304132 3139947 2887382 3076054 2868231 2832101 2765760 2481450 2448551 2495431
14023B495431K24090J2823n1307J04154l71375L19284j52493j32504P6822k85670
$$ 2495431 2719521 2732344 2681037 2785191 2413816 2733100 2580607 2448103 2524925 2239255
14013B239255L57197k21897j90172q0777N01308k70694j32769J70511k21894Q4830
$$ 2239255 2596452 2374555 2184383 2103606 2604914 2334220 2201451 2371962 2150068 2234898
14003B234898j36823L68333n75473L90679J61891m23919J78213K02143k13211
$$ 2234898 2098075 2466408 1890935 2281614 2443505 2019586 2197799 2399942 2186731
13994B186731J73721j96529K63108K39466O31389J223715K319560O083226J2939199
$$ 2186731 2360452 2163923 2427031 2666497 3297886 4521601 6841161 12924387 25863586
13985B5863586R265712j0225544j0049552n443635k878565j454292q09333k38973
$$ 25863586 35129298 24903754 14854202 9410567 6532002 5077710 4268377 4029404
13977D029404q25522j44608q1422o0651o4086j16712J16664n74064J11382j640
$$ 4029404 3203882 3059274 2977852 2917201 2853115 2736403 2853067 2279003 2390385 2388745
13967B388745l07491K20334J34144K0013j95998j01454J53993l1650m29336l8858
$$ 2388745 2081254 2301588 2435732 2455745 2259747 2158293 2312286 2280636 1851300 1812442
13957A812442n9579K19910o7603J9366j9646O0623j99776K6614m55j39669P8509
$$ 1812442 1752863 1972773 1905170 1924536 1904890 1965513 1765737 1792351 1791896 1652227 1730736
13946A730736K23248l10336K14786j34662J11495l1913l74189J62871Q6952o2914
$$ 1730736 1953984 1643648 1858434 1723772 1835267 1803354 1429165 1592036 1678988 1616074
13936A616074N2726K01635J36991n76848J18870N6040l2245p9686K46820l52304
$$ 1616074 1668800 1870435 2007426 1430578 1549448 1605488 1573243 1493557 1740377 1388073
13926A388073P5615k28873N25451m06631K54832N374j39880k55277L59716j49788
$$ 1388073 1463688 1234815 1760266 1353635 1608467 1613841 1473961 1218684 1578400 1428612
13916A428612m9904J72255L17635m38050p4559K7347J58150k90453P8740O3501
$$ 1428612 1378708 1550963 1868598 1430548 1355989 1383336 1541486 1251033 1329773 1393274
13906A393274l19124M4088M01028n07001M07890N7747k54492P6577p7266L31009
$$ 1393274 1074150 1118238 1519266 1012265 1420155 1477902 1223410 1299987 1222721 1553730
13896A553730m07194L27992O392j01423j19366j05909K10938m62608M25415j71216
$$ 1553730 1146536 1474528 1480920 1379497 1260131 1154222 1365160 902552 1327967 1156751
13886A156751k61440M98291n02116K69290R8394j51506n4948J9593J37733M3516
$$ 1156751 895311 1393602 891486 1160776 1259170 1107664 1052716 1072309 1210042 1253558
13876A253558k8536j50977j65747P6662J19124O0709l5943j07965L46913j90187
$$ 1253558 1225022 1074045 908298 984960 1104084 1164793 1128850 1020885 1367798 1177611
13866A177611r3040J83994m68404o7404M62380J23477k82073k7413k22854L17012
$$ 1177611 1084571 1268565 800161 732757 1195137 1318614 1036541 1009128 786274 1103286
13856A103286k00781L69546l40761J08248j32842K10529M4227l33288J57780r1527
$$ 1103286 902505 1272051 931290 1039538 906696 1117225 1161452 828164 985944 894417
13846H94417J98129O456j66296k3769m20662M94815K23485J22844n20487J68574
$$ 894417 1092546 1099002 932706 908937 488275 983090 1206575 1329419 808932 977506
13836I77506k62791L21425j54694J68471m40534K90524L24223n42600K0482O7508
$$ 977506 714715 1036140 881446 1049917 609383 899907 1224130 681530 702012 769520
13826G69520q5564L7059J31291j08007K78774K06442l70499m2497k8588k49481
$$ 769520 683956 721015 852306 744299 1023073 1229515 859016 816519 787931 538450
13816E38450K67250J54536K9458k77805J42594k5407j73300q8799L61828m0008
$$ 538450 805700 960236 989694 711889 854483 829076 655776 566977 928805 888797
13806H88797p0264J33807k06725J95022J76519q7756k63470K52109k48520o9447
$$ 888797 818533 952340 745615 940637 1117156 1029400 765930 1018039 769519 700072
13796G00072Q0863l03442J89673J26196L65619q0553l39165q03J78612k67294
$$ 700072 780935 477493 667166 793362 1158981 1078428 739263 738460 917072 649778
13786F49778n5426p4641K46553K74473m27567J50020L08919l12115j83673K0842
$$ 649778 594352 519711 766264 1040737 613170 763190 1072109 759994 576321 597163
13776E97163J75358r7040J16380l04382K44162j66509j23082L42727K83732m49967
$$ 597163 772521 675481 791861 487479 731641 565132 442050 784777 1068509 618542
13766F18542j53788j87524N93399l07472j39886O4143K46534j82387J13676j64638
$$ 618542 464754 277230 870629 563157 423271 487414 733948 551561 665237 500599
13756E00599K28537J0706l6261l04686L00414l08815J31247J48684C03564L19097
$$ 500599 729136 739842 703581 398895 699309 390494 521741 670425 303564 622661
13746F22661j30914L67447k51573J14241k9175F1248K77978K52046K22585J01816
$$ 622661 491747 859194 607621 721862 692687 61248 339226 591272 813857 915673
13736I15673l29674L54817k68175j71333n1650k2401J18761j53928q8828K06790
$$ 915673 585999 940816 672641 501308 449658 427257 546018 392090 303262 510052
13726E10052j66360J00048J26937O5411L0547j55J71810k45358k4108j93956J61063
$$ 510052 343692 443740 570677 636088 666635 666480 838290 592932 568824 374868 535931
13715E35931K8608A67701K21855j6873N67003B96137K77914o0841J14561m779
$$ 535931 564539 167701 389556 372683 939686 296137 574051 513210 627771 622992
13705F22992B94329J81597Q5961j96301J20685J25317j07552B49106J50453K51913
$$ 622992 294329 475926 561887 365586 486271 611588 504036 249106 399559 651472
13695F51472k35749j26301J91359j20263K39354J70567k69664o7190J20985k28691
$$ 651472 415723 289422 480781 360518 599872 770439 500775 433585 554570 325879
13685C25879m1181J30220j87914L70744k30194M5207r835J40257J23745K7472
$$ 325879 284698 414918 227004 597748 367554 412761 402926 543183 666928 694400
13675F94400j83912A81429M81971k37239p0719E7850J74892J57791K09813B83578
$$ 694400 510488 181429 663400 426161 355442 57850 232742 390533 600346 283578
13664E57272o5071J6215L2820O8494q9817j95143M8100Q637j6188J48454J83216
$$ 557272 492201 508416 541236 609730 519913 324770 372870 381507 365319 513773 696989
13653F96989k84678J35469p9393J39223J3969k27060j04844J41540N1829R9874
$$ 696989 412311 547780 468387 607610 621579 394519 289675 431215 483044 582918
13643E82918R2186l06324j67253m8435O25064j79244q3101j63055r5677N6226
$$ 582918 675104 368780 201527 153092 778156 598912 515811 352756 257079 313305
13633C13305J89582A61194J14086J93666p8090O0335k16751K55396m3399j23763
$$ 313305 502887 161194 275280 468946 390856 451191 234440 489836 446437 322674
13623C22674j40623J96159J40455B22581l7403J20925N5998l0158p0032L1131
$$ 322674 182051 378210 518665 222581 185178 306103 362101 331943 261911 293042
13613B93042J45351E8602L82070N2198l7093r7309j78091J70419l754J43916o8597
$$ 293042 438393 58602 440672 492870 455777 358468 180377 350796 347042 490958 422361
13602D22361O0318k01407K41855j29218N0037J71020q6232k36032r7433K6527
$$ 422361 482679 281272 523127 393909 443946 614966 528734 292702 195269 221796
13592B21796l531j3435L49982k13465j39101M91272B68798K19230k8954k6899
$$ 221796 218265 204830 554812 341347 202246 693518 268798 488028 459074 432175
13582D32175A33389J9290M33611B07807K38454j20057K17139j82239M3467A30101
$$ 432175 133389 152679 586290 207807 446261 326204 543343 361104 404571 130101
13571B54811j8409K33600L7177B42775N2072n0486P579A12988A9932J78525J77297
$$ 254811 236402 470002 507179 242775 294847 244361 251940 112988 19932 198457 375754
13560C75754E3871N09696j62140j53646M4431Q1959A44947J27616r9141J29726
$$ 375754 53871 563567 401427 247781 292212 374171 144947 272563 173422 303148
13550C03148N4463B1654L07740J01130A44185J79095G16M8868M39198A55126J8936
$$ 303148 357611 21654 329394 430524 144185 323280 716 49584 488782 155126 174062
13539A74062o9107K37719d8449C231K59270M9125n5669B9190M72244j74073M1402
$$ 174062 104955 342674 -48449 3231 262501 311626 255957 29190 501434 327361 368763
13528C68763o0306M7752J7141j69739k5765K12596q0796q1706k2658J15162k1973
$$ 368763 308457 356209 373350 203611 177846 390442 309646 227940 205282 320444 298471
13517B98471p3961M3584o1132J34157j53603K07228q7778k4589a70103E5028J08955
$$ 298471 224510 268094 206962 341119 187516 394744 306966 282377 -170103 55028 163983
13506A63983J95272j10931L73909B87298C6394M85411A83629J21682r1951J46419
$$ 163983 359255 248324 622233 287298 36394 521805 183629 305311 213360 359779
13496C59779L372G6453M9276J67714j29431L22384j82102l4900j0300A3255M3523
$$ 359779 363151 76453 125729 293443 164012 486396 304294 269394 259094 13255 56778
13485E6778K73014m4912J57553C7361R3708R3201J64814A12702J17440K03823
$$ 56778 329792 284880 442433 37361 131069 224270 389084 112702 230142 433965
13475D33965P3690A74442P7292l1810J07478k5249J0293l6826q1965J62297o2098
$$ 433965 507655 174442 251734 219924 327402 302153 312446 275620 193655 355952 293854
13464B93854a48593A11045K23171j52213K85368A851L45131Q1856j31940n2259
$$ 293854 -148593 111045 334216 182003 467371 1851 346982 428838 296898 244639
13454B44639g9172B66843R3128D1493K63735M9279d680G6284o75K20917J04835
$$ 244639 -79172 266843 359971 41493 305228 354507 -4680 76284 75609 296526 401361
13443D01361F9337d9056B59441A00373N20672j95355C8942j7610J65108k5974
$$ 401361 69337 -49056 259441 100373 621045 425690 38942 21332 186440 160466
13433A60466l5566o0544J49194g3612B4151O85520l24677j80309K87353F8369
$$ 160466 124900 64356 213550 -73612 24151 709671 384994 204685 492038 68369
13422b6484A29815J10810a60461b749C83542B6759m122L4031J17329m4236M11040
$$ -26484 129815 240625 -160461 -2749 383542 26759 22637 56668 173997 129761 540801
13411E40801A95386l4809K92033A50665E7235K89801A38513L05213j69471g4977
$$ 540801 195386 160577 452610 150665 57235 347036 138513 443726 274255 -74977
13400D02844A81015i5407A30799f1142C27859G1220J35053J8170m4708E2147M46397
$$ 402844 181015 -95407 130799 -61142 327859 71220 206273 224443 179735 52147 498544
13389D98544F4666k8519f3245A67634F3956p808K51661N5204A15862J6165a00240
$$ 498544 64666 36147 -63245 167634 63956 56148 307809 363013 115862 132027 -100240
13377c22A59662o0994J508J33445b39887A62189J21765g4595B50206A6267K26320
$$ -322 159662 98668 100176 233621 -239887 162189 283954 -74595 250206 16267 242587
13366B42587R3680n8504g0143C17420E9488L65166d8563I6047K6886J84300N273
$$ 242587 336267 277763 -70143 317420 59488 424654 -48563 96047 122933 307233 312506
13355C12506d5514l6007A11473d862H147M03076B5470L03612l2304I626K93616
$$ 312506 -45514 -81521 111473 -4862 8147 411223 25470 329082 296778 9626 303242
13344C03242J76267j46071h7525B31826B5474L43047j69183K76875B28985A5873
$$ 303242 479509 333438 -87525 231826 25474 368521 199338 476213 228985 15873
13333A06303B243d3187C58001F4577N62547F3746K95337g506A72249E1789b71867
$$ 106303 2243 -43187 358001 64577 627124 63746 359083 -7506 172249 51789 -271867
13321F8568a4557D17298A30274K42686A73741l9445a72889A42723J70457j15330
$$ 68568 -14557 417298 130274 372960 173741 134296 -172889 142723 313180 197850
13311A97850C471K12664I6874B3890a94110B3510K74330j22587o2412J56706h6907
$$ 197850 3471 216135 96874 23890 -194110 23510 297840 175253 112841 269547 -86907
13299D82056C1535a10819k9280j10365G1587R4908J87180A52732L8672a93188
$$ 482056 31535 -110819 -140099 -250464 71587 166495 353675 152732 191404 -193188
13288A68237o4683J02434J21152a83907L5455A8752g7166Q598G3060J23228D293
$$ 168237 103554 205988 327140 -183907 -148452 18752 -77166 -68568 73060 196288 4293
13276A1079m972J21895J1667b25402l0874j0753P7611A88992O3116B785M07143
$$ 11079 6107 128002 139669 -225402 -256276 -267029 -189418 188992 252108 2785 409928
13265D09928F8417L75600a61512A28684B0184d0139A01917a29968C15474j15109
$$ 409928 68417 444017 -161512 128684 20184 -40139 101917 -129968 315474 200365
13255B00365a49271A78197D0755Q6750j5557a09801B87667g9734H4333O628D0122
$$ 200365 -149271 178197 40755 127505 111948 -109801 287667 -79734 84333 90961 40122
13243B70023C9967e7115C91564A31660J19442h3238C0638R1289B9346P4226b6264
$$ 270023 39967 -57115 391564 131660 251102 -83238 30638 121927 29346 103572 -26264
13231H8073M0446D0926J63496J3717c9352p5613A90965o669G1629b1608k02985
$$ 88073 128519 40926 204422 218139 -39352 -114965 190965 184296 71629 -21608 -224593
13220b24593A22903J56412f2247a4325A16391K81863b15970A65185b9441B879
$$ -224593 122903 279315 -62247 -14325 116391 398254 -215970 165185 -29441 2879
13209e0030j26530g0552o8990A58052a8475j84034N3212B93885H2912L5037L1414
$$ -50030 -176560 -70552 -139542 158052 -18475 -202509 -149297 293885 82912 117949 149363
13198A49363i0478H7451J7077a36005k00584A69522B9430L35595a99792A84208
$$ 149363 -90478 87451 104528 -136005 -336589 169522 29430 365025 -199792 184208
13187C1751b4436C28241B8513L2912J43586I874L1130J73573o6952a6094p9948
$$ 31751 -24436 328241 28513 61425 205011 9874 41004 214577 147625 -16094 -96042
13176i6042A05682i0862d2388j41302C23369J5023p0163C3868K17245A02925P1834
$$ -96042 105682 -90862 -42388 -183690 323369 338392 268229 33868 251113 102925 174759
13165A74759q1955N0101M4809a50185o7195e1160C39495A44397B0287a12538l2798
$$ 174759 92804 142905 187714 -150185 -217380 -51160 339495 144397 20287 -112538 -145336
13154a45336C4275K719f4936H7391J68890r4734J5954a0510j5104A68941K6977
$$ -145336 34275 36994 -64936 87391 256281 161547 177501 -10510 -25614 168941 195918
13143A95918f9346n6297A35707J0276N2918m8839m4657a22866A81106N0391m0739
$$ 195918 -69346 -125643 135707 145983 198901 150062 105405 -122866 181106 231497 190758
13132A90758A264b04304j50957f7708A18374m6499J44508b39117f1003m3009A2513
$$ 190758 1264 -204304 -355261 -67708 118374 71875 216383 -239117 -61003 -104012 12513
13120B50764L324A9566L6899J54181a52377C59729a23062N6951j72817C58883
$$ 250764 254088 19566 56465 210646 -152377 359729 -123062 -66111 -238928 358883
13109A51351R9740b38384e5443G6655Q0173a25895p9546m2671D7932N9737k4631
$$ 151351 251091 -238384 -55443 76655 156828 -125895 -205441 -248112 47932 107669 83038
13098H3038C0094M0066k1263b197B12686c29419D1337a68598B82283b4949C39347
$$ 83038 30094 70160 48897 -2197 212686 -329419 41337 -168598 282283 -24949 339347
13086c3586n7915C60969A75649k7548N0623B6562h3087A63858a24489l4721a439
$$ -33586 -91501 360969 175649 148101 198724 26562 -83087 163858 -124489 -159210 -1439
13074d1012J2204B22893b16785L9646F1478j8951a77298A84291L21787C3191P1914
$$ -41012 -28808 222893 -216785 -177139 61478 42527 -177298 184291 506078 33191 105105
13063A05105a20920M113A65273Q3119i1987A64715G2528Q3252N6395b41520a03345
$$ 105105 -120920 -116807 165273 248392 -91987 164715 72528 155780 212175 -241520 -103345
13051a44974A95215b3078p1222E19365h7684B65354a17021b078C6932a36439B10852
$$ -144974 195215 -23078 -94300 519365 -87684 265354 -117021 -2078 36932 -136439 210852
13039A17973a00378C34760c2532A61613O7469a71052O7540A24581J62629a78216
$$ 117973 -100378 334760 -32532 161613 229082 -171052 -103512 124581 287210 -178216
13028D87456A99112J05266F571N1664a93070B15889j02317m8729J33329F0879
$$ 487456 199112 304378 6571 58235 -193070 215889 113572 64843 198172 60879
13017a09069C49219a55621C51L76429j9974E2649a61503A27078D2290K42017a03231
$$ -109069 349219 -155621 351 376780 356806 52649 -161503 127078 42290 284307 -103231
13005C50729g0888j63302K8951B36790b23269e9519j07475B47702l8754P1137
$$ 350729 -70888 -234190 -205239 236790 -223269 -59519 -166994 247702 208948 280085
12995B80085j02083K01637a14549p0908E5508e3453A71437l0507d1564E6498f5013
$$ 280085 178002 379639 -114549 -185457 55508 -53453 171437 140930 -41564 56498 -65013
12983a32345A90301o5865E1007k420c9377c552G3583j3629f7113M512A39603J28097
$$ -132345 190301 124436 51007 48587 -39377 -3552 73583 59954 -67113 -62601 139603 267700
12971B67700j02254f6946A74607c9195A71611n5657a230k77898e6543q6047G0739
$$ 267700 165446 -66946 174607 -39195 171611 115954 -1230 -279128 -56543 -142590 70739
12959b4472o9824d4183E3946J11775O124b12074B74498K2737o8694j08650C1836
$$ -24472 -94296 -44183 53946 165721 171845 -212074 274498 297235 228541 119891 31836
12947A0150J00580f3067o428D58277A19898N1190O6585e8181M760n9390F8506
$$ 10150 110730 -63067 -69495 458277 119898 171088 237673 -58181 -53421 -112811 68506
12935C43402j42097d9636F2349c1104p9603j1176A00727D0993q260e1148B80641
$$ 343402 201305 -49636 62349 -31104 -110707 -121883 100727 40993 32733 -51148 280641
12923B19240g1839H5917l8417c0774k08152A48757G1611a88493A61517a56318
$$ 219240 -71839 85917 47500 -30774 -238926 148757 71611 -188493 161517 -156318
12912I0864h1215n7696C15491j28024k008H9981k5599L159J35786P3951A37671
$$ 90864 -81215 -138911 315491 187467 185459 89981 64382 67541 203327 277278 137671
12900A5568a42120M1792d5611B07419h5873c851B10967b59934J22418B055J07770
$$ 15568 -142120 -100328 -45611 207419 -85873 -3851 210967 -259934 -137516 2055 109825
12889A09825L866C2395L7111b15018A12589A0689b17550G9458i398A59988a61155
$$ 109825 113691 32395 69506 -215018 112589 10689 -217550 79458 -9398 159988 -161155
12877h5392B8667O0252k2533K27774a04173A48698m1126a51126c8400a696j66076
$$ -85392 28667 88919 66386 294160 -104173 148698 107572 -151126 -38400 -1696 -167772
12866a67772A635e9913A04501b1408B04418a64705D41350j23703I4092p02K6509
$$ -167772 1635 -59913 104501 -21408 204418 -164705 441350 317647 94092 93390 119899
12855A19899a50740A37310E4515J0147b43290f2908G1070A2307c82460J27516
$$ 119899 -150740 137310 54515 64662 -243290 -62908 71070 12307 -382460 -254944
12845b54944F4538A9389b84296j41416k1238a8156B60196b36482a17361j17420
$$ -254944 64538 19389 -284296 -425712 -446950 -18156 260196 -236482 -117361 -234781
12835b34781A88987a62405A48890g7786p8908n572I3163A3434L6371L82908A13931
$$ -234781 188987 -162405 148890 -77786 -156694 -162266 93163 13434 49805 432713 113931
12823A6287i4905r8367h0801r2072B56517B764N7070O2380D977K35M5803Q373
$$ 16287 -94905 -193272 -80801 -172873 256517 2764 59834 122214 4977 5212 51015 59388
12811E9388a21633l1743A205a28201B00638q4764A9179c6252j90100F6429M52161
$$ 59388 -121633 -153376 1205 -128201 200638 115874 19179 -36252 -226352 66429 518590
12800E18590b05473A21053i658D80980a09245C1286J53695a4199A12549b28656
$$ 518590 -205473 121053 -9658 480980 -109245 31286 184981 -14199 112549 -228656
12789b62331d4233n7627A06510b143A07845b07992Q6857G8611J63887c68589D6221
$$ -262331 -44233 -101860 106510 -2143 107845 -207992 -121135 78611 242498 -368589 46221
12777b61518k7473f4107k5784j32988O4262J2769O3068A66051J13155p164p6795
$$ -261518 -288991 -64107 -89891 -222879 -158617 -145848 -82780 166051 279206 272042 195247
12766A95247D2192A2168c6514A92003a85640n3185D2867a6918B70431e7134k54746
$$ 195247 42192 12168 -36514 192003 -185640 -238825 42867 -16918 270431 -57134 -311880
12755c11880m9007A13715g7228A23750F1233a51272j26739A17092M0642K3568
$$ -311880 -360887 113715 -77228 123750 61233 -151272 -278011 117092 157734 181302
12745A81302A2097a47369A08301l1877A746M84378g6386A41068J10470j00626
$$ 181302 12097 -147369 108301 76424 1746 486124 -76386 141068 251538 150912
12735A50912n846a8598k7680J5578a305k7534C5063C977g9034A30539c55059D7196
$$ 150912 145066 -18598 -46278 -30700 -1305 -28839 35063 3977 -79034 130539 -355059 47196
12722e040B01956a97226A67657p0127c7870A16561e3511B17402e8745B32107r3707
$$ -5040 201956 -197226 167657 97530 -37870 116561 -53511 217402 -58745 232107 138400
12711A38400p33I014J22524D7682K5166k4855K1031A1143J21158J98367K746A61732
$$ 138400 137667 9014 131538 47682 72848 47993 69024 11143 132301 330668 333414 161732
12698A13124k519Q719e3140E3872O3753a43318r0820H2568b02057c8230B84526
$$ 113124 110605 119324 -53140 53872 117625 -143318 -234138 82568 -202057 -38230 284526
12686F3784k9877h3295B83830H2996K40580A4230K98628A10265J21657F4946R4747
$$ 63784 33907 -83295 283830 82996 323576 14230 312858 110265 231922 64946 159693
12675A59693a33051A88992h7600r9817M8358C47980B7321a38356j29518B7525
$$ 159693 -133051 188992 -87600 -187417 -139059 347980 27321 -138356 -267874 27525
12664B11673j6483E4939c8023A14594J19349j11552c2478A90534H3116C0736b06402
$$ 211673 195190 54939 -38023 114594 233943 122391 -32478 190534 83116 30736 -206402
12652A19644a18527f557I9756c99774E8753K78520E2423C949b38047B11374O0549
$$ 119644 -118527 -6557 99756 -399774 58753 337273 52423 3949 -238047 211374 271923
12641B71923a53804A9405c29249Q3708b9030B22243q6976l1404J69177m7649d04992
$$ 271923 -153804 19405 -329249 -245541 -29030 222243 135267 103863 273040 225391 -404992
12629a19183K4677j11170j05361h8393K4915F5823j1028J93904c668F6605b064
$$ -119183 -94506 -205676 -311037 -88393 -63478 65823 54795 248699 -3668 66605 -2064
12617g8189j02510B08049h8309C22483a97719B8635c38843G3822O6037l8468b74942
$$ -78189 -180699 208049 -88309 322483 -197719 28635 -338843 73822 139859 101391 -274942
12605B8506k816a99143i0605B40051e1240l4666A87558a84281k4048H6452c29137
$$ 28506 25690 -199143 -90605 240051 -51240 -85906 187558 -184281 -208329 86452 -329137
12593g5974A0874g6665C25679d9871j31721l60353B10005J98494A01245K18509
$$ -75974 10874 -76665 325679 -49871 -181592 -541945 210005 408499 101245 319754
12583C19754G2106b9553I5113J9900J77147A18539h7817b8653A08615Q1979l8
$$ 319754 72106 -29553 95113 115013 292160 118539 -87817 -28653 108615 190594 190556
12572A90556J1308a60762B1408L8886b25093F2522R741A5323i95A40901p253a96991
$$ 190556 201864 -160762 21408 60294 -225093 62522 72263 15323 -995 140901 133648 -196991
12559a07470H2565C1130Q065c76118a15363J448A34074l0362g7016G1702c6157
$$ -107470 82565 31130 39195 -376118 -115363 -113915 134074 103712 -77016 71702 -36157
12547a7150A0567c66932a19703j58444B45294a03954L137m1154A3743K2853P765
$$ -17150 10567 -366932 -119703 -278147 245294 -103954 -100817 -141971 13743 36596 44361
12536D4361O3051a55176A39818c12546l4941B37741k3816k6452f4040a5316B61743
$$ 44361 107412 -155176 139818 -312546 -347487 237741 213925 187473 -64040 -15316 261743
12524F6488d0625A36584C7725a9830r3145b8877j05200J2583K2900B80298a86496
$$ 66488 -40625 136584 37725 -19830 -112975 -28877 -134077 -121494 -98594 280298 -186496
12512a41578I5390l9049R1856a46118f1777k62717B35548q0436J00727D0793h7200
$$ -141578 95390 56341 148197 -146118 -61777 -324494 235548 155112 255839 40793 -87200
12500b14357a061A14638C8437i8225j01353A82867b63456A46618l0645a34877
$$ -214357 -1061 114638 38437 -98225 -199578 182867 -263456 146618 115973 -134877
12489a85072P5174j22371C21894m2416b52553G4308K52491D8748K11832f2946
$$ -185072 -109898 -232269 321894 279478 -252553 74308 326799 48748 260580 -62946
12478D9869i6844o7616n2739A21895B5358M05627A62190b4144E6573d0932A21568
$$ 49869 -96844 -164460 -217199 121895 25358 430985 162190 -24144 56573 -40932 121568
12466c34894g5563c4534k438j01392O5443A67765a75800j63164C3518c58j58879
$$ -334894 -75563 -34534 -36972 -138364 -72921 167765 -175800 -338964 33518 -358 -159237
12455a59237K942d6389n8327a9180G4962J23594g2368j06370k4106F514a42477
$$ -159237 -156295 -46389 -104716 -19180 74962 198556 -72368 -178738 -202844 6514 -142477
12443a42870A05906b27079A20703C949a20707J8046k09630b7892j44991B79292
$$ -142870 105906 -227079 120703 3949 -120707 -102661 -312291 -27892 -172883 279292
12432A16820c28459f2543H1866c67590B30295a51481C09412b86276a21497k40847
$$ 116820 -328459 -62543 81866 -367590 230295 -151481 309412 -286276 -121497 -362344
12422c62344J42796C5619a75195Q953j18461g2523b1345l73668C63283a4859A0740
$$ -362344 -219548 35619 -175195 -166242 -284703 -72523 -21345 -395013 363283 -14859 10740
12410a42747A46150o1268b21008c9952r3638B19256a44560A02530O8275D9820
$$ -142747 146150 84882 -221008 -39952 -133590 219256 -144560 102530 170805 49820
12399d2020C13217E0301L7462B2919K23326h1597A59140i5157A57595a47667c5141
$$ -42020 313217 50301 87763 22919 246245 -81597 159140 -95157 157595 -147667 -35141
12387A76738a00548J9126A18052g1694B38583J10760F6097P6212J915n2574m0569
$$ 176738 -100548 -81422 118052 -71694 238583 349343 66097 142309 144224 91650 51081
12376E1081K06058c3843B02591a82312A31180O2557c25230H2803A6107b37525
$$ 51081 257139 -33843 202591 -182312 131180 193737 -325230 82803 16107 -237525
12365a86347B10586a59110A8328i0230C13359j55083o8221f3812C6236a96744
$$ -186347 210586 -159110 18328 -90230 313359 158276 90055 -63812 36236 -196744
12354I5350k2415a66069b0691l24368J21326A14157a3242j56410c9423C10820
$$ 95350 72935 -166069 -20691 -345059 -223733 114157 -13242 -169652 -39423 310820
12343A00190L3774a23504D7363a00920A67022a28601e3808H7366G095L7359h4477
$$ 100190 133964 -123504 47363 -100920 167022 -128601 -53808 87366 7095 44454 -84477
12331A87111c22434a48333B50626a17074B10815A9785Q4618B5383J39663i3466
$$ 187111 -322434 -148333 250626 -117074 210815 19785 104403 25383 165046 -93466
12320A76741J62536a60905A47840K6229g8184B73040J18224a93069A16359l148
$$ 176741 339277 -160905 147840 174069 -78184 273040 391264 -193069 116359 113211
12310A13211J41044d6480j91443B4728K27322a15954k04899a22244E8665J11988
$$ 113211 254255 -46480 -237923 24728 252050 -115954 -320853 -122244 58665 170653
12300A70653K564H1049a47596M7196k37633B6986J00830a49306C79023A43776
$$ 170653 173217 81049 -147596 -100400 -338033 26986 127816 -149306 379023 143776
12289b01387c7669o9902a911B4128a24960K6820L9782B7783e4357B62994n3011
$$ -201387 -37669 -107571 -1911 24128 -124960 -98140 -58358 27783 -54357 262994 209983
12278B09983o449F2244A060b87098p6207c2555A09045K47452b02292A52783c0174
$$ 209983 203534 62244 1060 -287098 -363305 -32555 109045 356497 -202292 152783 -30174
12266B64166P4373c59H4281c4317k19911B91291c9658A24445h3358o5289A5096
$$ 264166 338539 -359 84281 -34317 -254228 291291 -39658 124445 -83358 -148647 15096
12254a7420r7106j78408A66711n4317b4817A66966F9266L7788J97821f827E7174
$$ -17420 -114526 -292934 166711 112394 -24817 166966 69266 107054 304875 -6827 57174
12242A79735b43669C65050j11103j18118b13013B22959e2188m4249J7172c6304
$$ 179735 -243669 365050 253947 135829 -213013 222959 -52188 -96437 -79265 -36304
12231D2699Q1055d7720A359J62863c8076r1593B40430l8239a09782B4807a36024
$$ 42699 123754 -47720 1359 164222 -38076 -129669 240430 202191 -109782 24807 -136024
12219B87390A33538b4652n5162A88219P3262A4348J57842c6916Q172k423p4396
$$ 287390 133538 -24652 -79814 188219 261481 14348 172190 -36916 -28744 -31167 -105563
12208a05563d0528m1256j02718P0897k29454B05254O0740g4240D24658a135H4485
$$ -105563 -40528 -81784 -184502 -113605 -343059 205254 265994 -74240 424658 -1135 84485
12196A96481i1921F5326j1602N9793a79431N9738b557A67061k171L3528N5227
$$ 196481 -91921 65326 53724 113517 -179431 -119693 -2557 167061 164890 198418 253645
12185B53645a56745A6550M6273J00290J02637a81067B56555Q8208j48555L9100
$$ 253645 -156745 16550 62823 163113 265750 -181067 256555 344763 196208 235308
12175B35308F0352K76290b9538C3185J97448j2851R4486l8880l0423k1010o3030
$$ 235308 60352 336642 -29538 33185 230633 217782 312268 273388 242965 221955 158925
12164A58925e1300j35164j42606C2451d1354q1720K8278A88137k1544a7311m7041
$$ 158925 -51300 -186464 -329070 32451 -41354 -123074 -94796 188137 166593 -17311 -64352
12153f4352B302c8465B21212j06833O0215E8211g6885l9099K5341A18520b1508
$$ -64352 2302 -38465 221212 114379 174594 58211 -76885 -115984 -90643 118520 -21508
12141g4767j557F5441a31327k82501A38794m2579P9022o2623d7698F7172P6520
$$ -74767 -76324 65441 -131327 -413828 138794 96215 175237 112614 -47698 67172 143692
12130A43692K78538j4298A66948J44648A52535a51483m3112h6336D9195M71287
$$ 143692 422230 407932 166948 311596 152535 -151483 -194595 -86336 49195 520482
12120E20482H29J82136j7629J48136A50110l2354m3783P7873J37228A6310M4654
$$ 520482 829 182965 165336 313472 150110 117756 73973 151846 289074 16310 60964
12109F0964h7463c611j70766A12603N6669b85649L7420a0413B16029J06999b72593
$$ 60964 -87463 -3611 -174377 112603 169272 -285649 -248229 -10413 216029 323028 -272593
12097A35975L73389B13370A2870J57491a20380B36194g356k5665j42603A34377
$$ 135975 509364 213370 12870 170361 -120380 236194 -7356 -33021 -175624 134377
12086a48601C20705i551o2508l41041C10377a71029L1909B93698B3319J49046
$$ -148601 320705 -9551 -72059 -413100 310377 -171029 -139120 293698 23319 172365
12076A72365D2422b88129a16607M2253j45813A65893b11100f5037B27958c2891
$$ 172365 42422 -288129 -116607 -74354 -220167 165893 -211100 -65037 227958 -32891
12065C72584E8552J70536J19236D1874d5483q5647k25262A3366L29195j57123
$$ 372584 58552 229088 348324 41874 -45483 -131130 -356392 13366 342561 185438
12055A85438f2876j07486o3134q2841B78281a45758A6798O9017j3632J50430b82170
$$ 185438 -62876 -170362 -233496 -316337 278281 -145758 16798 85815 72183 222613 -282170
12043c03877c5164H660a351j05166c231k5110C1528a82603N7066a7274j46607
$$ -303877 -35164 8660 -1351 -106517 -3231 -28341 31528 -182603 -125537 -17274 -163881
12032a63881G9630A0622e3461l769p1236d6135E9698K02699a11277B20490a68217
$$ -163881 79630 10622 -53461 -57230 -128466 -46135 59698 262397 -111277 220490 -168217
12020d0174B4985b84286H0438L99152a58388A36078C693d6037j3086A86238H2004
$$ -40174 24985 -284286 80438 479590 -158388 136078 3693 -46037 -59123 186238 82004
12008C1197a02490j50124r9612Q8384A29094e4472A89149b3096j07112k5772l9883
$$ 31197 -102490 -252614 -352226 -263842 129094 -54472 189149 -23096 -130208 -155980 -195863
11997a95863A16388j2393J66401P1665A43877b6350j23558D07705a32079j53388
$$ -195863 116388 103995 270396 342061 143877 -26350 -149908 407705 -132079 -285467
11987b85467A33065Q5085b36431A43525L2242L9883a57495K4568A8525J39665
$$ -285467 133065 218150 -236431 143525 175767 215650 -157495 -132927 18525 158190
11977A58190B5868H081f2501k50729P27A8636K73767G5452J89206e0364E0075
$$ 158190 25868 8081 -62501 -313230 -312503 18636 292403 75452 264658 -50364 50075
11965E56573a16804E496N7224i6885g143k184n7656F0885O1896a62197r7350J29561
$$ 556573 -116804 5496 62720 -96885 -7143 -9327 -66983 60885 122781 -162197 -259547 -129986
11953a29986d8898j78490C7979a803H3827g2028F1247P1120b86318J39468b5889
$$ -129986 -48898 -227388 37979 -1803 83827 -72028 61247 132367 -286318 -146850 -25889
11941g5942j06604D3187j0144a29908A84505d3446B19318a75598I3266b36894
$$ -75942 -182546 43187 33043 -129908 184505 -43446 219318 -175598 93266 -236894
11930A82900j9937a95192A8858Q8797a17215L6635G4392d4166k3840A50667L9493
$$ 182900 162963 -195192 18858 107655 -117215 -80580 74392 -44166 -68006 150667 190160
11919A90160a62612n5424A59510e5643l5602R424a3792F788J0577b43375B34670
$$ 190160 -162612 -218036 159510 -55643 -91245 -81821 -13792 6788 17365 -243375 234670
11907a24049q9802A35288F7378a89696A14054a03808M2654A33325K8466O0508
$$ -124049 -213851 135288 67378 -189696 114054 -103808 -61154 133325 161791 222299
11897B22299c35934J26256j03602B19808b76759A22879M8267b53306N9573Q6828
$$ 222299 -335934 -209678 -313280 219808 -276759 122879 171146 -253306 -193733 -106905
11887a06905J1113a8050A30543b74317c9864G6699c10943d6230l39328B25215
$$ -106905 -95792 -18050 130543 -274317 -39864 76699 -310943 -46230 -385558 225215
11876D1884J74654B0718O126a19126p1330A15376K61145a36450L1475l2482m3037
$$ 41884 216538 20718 26844 -119126 -190456 115376 376521 -136450 -104975 -137457 -180494
11865a80494f7234k3927E5853d38491a91408R3759D1116a18378N0167A85157J1221
$$ -180494 -67234 -91161 55853 -438491 -191408 -97649 41116 -118378 -68211 185157 196378
11854A96378o1454J73536P3739A6869i5482B70208b3774A20418h9592l52999g4608
$$ 196378 134924 308460 382199 16869 -95482 270208 -23774 120418 -89592 -442591 -74608
11842a51520c9962l12825Q1222K8017B7904c4442p2041j96073I3740b31952n3972
$$ -151520 -39962 -352787 -271565 -243548 27904 -34442 -106483 -302556 93740 -231952 -285924
11831b85924H2537A1347a21777B8031c3561G0991R010a75995k7278c1760e696
$$ -285924 82537 11347 -121777 28031 -33561 70991 80001 -175995 -203273 -31760 -5696
11819b34780f7667k13486A46616J85812F0109b00829A45988n5372b98304A39617
$$ -234780 -67667 -281153 146616 332428 60109 -200829 145988 90616 -298304 139617
11808I4891p235a88632E0165a79677D28485I0160i2878A5085e3155j58001B72975
$$ 94891 87656 -188632 50165 -179677 428485 90160 -92878 15085 -53155 -211156 272975
11796c27974f2618E2070f2921j18961A35035A9730b93589g0914E4983d05472a71290
$$ -327974 -62618 52070 -62921 -181882 135035 19730 -293589 -70914 54983 -405472 -171290
11784A03608k4618B0691b11236E624a08398j06451J8236A71739g4278l42517B329
$$ 103608 78990 20691 -211236 5624 -108398 -214849 -196613 171739 -74278 -416795 2329
11772a01818B1082c15409a48116A6129K64453c27897B771d50884J47372A01604
$$ -101818 21082 -315409 -148116 16129 280582 -327897 2771 -450884 -303512 101604
11761b988j7000D6665H460N3391k1966N9189e903H988J66787G7461J54145a01688
$$ -2988 -19988 46665 8460 61851 39885 99074 -5903 8988 175775 77461 231606 -101688
11748C3241J10627i4855b9808k58022C37589j41727G2225K6956J42937o6702g9320
$$ 33241 143868 -94855 -29808 -287830 337589 195862 72225 99181 242118 175416 -79320
11736E1966K234j6557J67653m8840K14215A11349a10959A90173G6982g4641p194
$$ 51966 54200 37643 205296 156456 370671 111349 -110959 190173 76982 -74641 -81835
11725h1835B6391a75292M9284h914j0284A06530a85346l656j7313C0456c17522
$$ -81835 26391 -175292 -126008 -8914 -19198 106530 -185346 -189002 -206315 30456 -317522
11713b35498Q5669k9029A23908L52674k21209J28682A59149D3478O4520N7516
$$ -235498 -149829 -178858 123908 476582 255373 384055 159149 43478 107998 165514
11703A65514A098P5376Q3287a93107N6023A14735K25224a51649b4450m1956A22847
$$ 165514 1098 76474 159761 -193107 -137084 114735 339959 -151649 -24450 -66406 122847
11691B44627E132h245A34610d3800l45629A92833J3216a8230C7077c09798a36515
$$ 244627 5132 -8245 134610 -43800 -389429 192833 206049 -18230 37077 -309798 -136515
11679B65197i2512A25842l5451O7700J3647l3588a28904J7367N498a0331q5709
$$ 265197 -92512 125842 90391 158091 171738 138150 -128904 -111537 -106039 -10331 -96040
11668i6040C068J78046a21768F6587K24846j01754a96774c397j04069D0337a95760
$$ -96040 3068 181114 -121768 66587 291433 189679 -196774 -3397 -107466 40337 -195760
11656B40543D9235h3893K0201A86164L16923a46764k2667j45778A8075a74513
$$ 240543 49235 -83893 -63692 186164 503087 -146764 -169431 -315209 18075 -174513
11645C04711f2214k7927k31377a8553A69432P0643r0619a28260G4918a70374E7813
$$ 304711 -62214 -90141 -321518 -18553 169432 240075 149456 -128260 74918 -170374 57813
11633b11639A54738J32942E8437J05096A0793J947J68272N790K5150I596R0288
$$ -211639 154738 287680 58437 163533 10793 12740 181012 186802 211952 9596 99884
11622I9884f0494C8963a49931B58208Q4446a80573g7618B94282a73565f8065j52452
$$ 99884 -60494 38963 -149931 258208 342654 -180573 -77618 294282 -173565 -68065 -220517
11611b20517A61497p1956k6922A0732b20424a8462C45714r3110b064I8787h0237
$$ -220517 161497 89541 62619 10732 -220424 -18462 345714 252604 -2064 98787 -80237
11599B0882b22765e1706r1709K7799E5886E478J87553a60625A61144l7436a68729
$$ 20882 -222765 -51706 -143415 -115616 55886 5478 193031 -160625 161144 123708 -168729
11587a55752B7130K65067i6250B42997J30907a64735j09311i9443j19003a03956
$$ -155752 27130 292197 -96250 242997 373904 -164735 -274046 -99443 -218446 -103956
11576A1234a23815D5712e7708B84076m945C9007a95989f2262k0504k21620b8850
$$ 11234 -123815 45712 -57708 284076 279131 39007 -195989 -62262 -82766 -304386 -28850
11564a8814B35780a9696j84758A93453m8524g7294B05286a04457A78358c5066
$$ -18814 235780 -19696 -204454 193453 144929 -77294 205286 -104457 178358 -35066
11553a68434E6310J42867a10447B49229e5962b1642B18969D1959f08j25793e0904
$$ -168434 56310 199177 -110447 249229 -55962 -21642 218969 41959 -608 -126401 -50904
11541A28004Q5893G0126a91983B20933o0765m1202a10718a1841A19022g7355B2905
$$ 128004 213897 70126 -191983 220933 160168 118966 -110718 -11841 119022 -77355 22905
11529B14609b34788A20270b79951C57672A49518a50041f6718H837b25768K1455
$$ 214609 -234788 120270 -279951 357672 149518 -150041 -66718 8837 -225768 -204313
11519b04313A17051n2786J18400O1294a31222e1071k3269k9733E694R2456b27310
$$ -204313 117051 64265 182665 243959 -131222 -51071 -74340 -104073 5694 98150 -227310
11507B30646a70274j1205B43615j5120J26228A32989e6702A41041O4490C6108
$$ 230646 -170274 -181479 243615 228495 354723 132989 -56702 141041 205531 36108
11496c6163D5264K6708c2825B31612k0953a02741d2931j45151B36815a00348A52261
$$ -36163 45264 71972 -32825 231612 210659 -102741 -42931 -188082 236815 -100348 152261
11484B518g0569A22795O9973d4339A19407a06346d905A67437R7650j25053b23140
$$ 2518 -70569 122795 192768 -44339 119407 -106346 -4905 167437 265087 140034 -223140
11472b14818F1187K29146k2951j07075g0961A077K64458b84999A8432J26928d22314
$$ -214818 61187 290333 267382 160307 -70961 1077 265535 -284999 18432 145360 -422314
11460a24727o6509b5231l3836I1342J7058I231K16940h3686B15678a74598F254
$$ -124727 -191236 -25231 -59067 91342 108400 9231 226171 -83686 215678 -174598 6254
11448B31958l9190O3664A15755a33224p0702b2817A90950b736A63013b86368C97068
$$ 231958 192768 256432 115755 -133224 -203926 -22817 190950 -2736 163013 -286368 397068
11436C8966a39562f7982B06295e114C4587N3307a92847d4412m039q5928E2017
$$ 38966 -139562 -67982 206295 -5114 34587 87894 -192847 -44412 -48451 -134379 52017
11424C10000i7567k99646B01412b42606G7877B582L6828I892c88901h5320C40240
$$ 310000 -97567 -397213 201412 -242606 77877 2582 39410 9892 -388901 -85320 340240
11412C42125F2240R7379a50399L4127A94066L9639C8457J05792K05776A59004
$$ 342125 62240 159619 -150399 -116272 194066 233705 38457 144249 350025 159004
11401A09158b82468B11145G1925c1562H2622c3690l3157C10515A03280a1291q2191
$$ 109158 -282468 211145 71925 -31562 82622 -33690 -66847 310515 103280 -11291 -93482
11390i3482d6545A6433E91J71696k662c05282d1131k03941G365K3234R3309a96795
$$ -93482 -46545 16433 591 172287 169625 -305282 -41131 -245072 7365 30599 123908 -196795
11377a46062p7790i7636r7593A72775m6025K66199f5644k14782B90936g9745j90792
$$ -146062 -223852 -97636 -195229 172775 126750 392949 -65644 -280426 290936 -79745 -270537
11366b70537j43694f213l18300G2241b21967B40396j0347l4078b5246D7501b27043
$$ -270537 -414231 -6213 -324513 72241 -221967 240396 230049 195971 -25246 47501 -227043
11354a55961H6949d7158k2375B48898q2666g8173j69875C46816q4020a38748k27458
$$ -155961 86949 -47158 -69533 248898 166232 -78173 -248048 346816 262796 -138748 -366206
11343c66206A28264a7451m12440B00951B0631a36269h182l16253B15478i5722
$$ -366206 128264 -17451 -429891 200951 20631 -136269 -8182 -324435 215478 -95722
11332a64435K4602C1879a17785A09081E2234a78102P4923j75538a9324j48111
$$ -164435 -139833 31879 -117785 109081 52234 -178102 -103179 -278717 -19324 -167435
11322a67435D14217j29065a33775L0658N0249G1544F123h1997F8286j1995Q1027
$$ -167435 414217 285152 -133775 -103117 -52868 71544 6123 -81997 68286 56291 137318
11311A37318O999c81044D9457d6694B13006a77931B47483a41642A07208i8316
$$ 137318 144317 -381044 49457 -46694 213006 -177931 247483 -141642 107208 -98316
11300b0313k7458E8505d193q732j04333A74805e1896A2276f1514k48775F6708
$$ -20313 -47771 58505 -4193 -12925 -117258 174805 -51896 12276 -61514 -310289 66708
11288a3512B060a22463a6984C8499b41182g184p6408H0491E328a155m0815F9683
$$ -13512 2060 -122463 -16984 38499 -241182 -7184 -83592 80491 5328 -1155 -41970 69683
11275a23457A55738e3901B6194b41069B5289q912n949J68617a8928j51355d011
$$ -123457 155738 -53901 26194 -241069 25289 16377 10428 179045 -18928 -170283 -4011
11263A50069b09941F1905B6938a09297A57893Q1514a46404H449M7432L0980d9873
$$ 150069 -209941 61905 26938 -109297 157893 239407 -146404 8449 55881 86861 -49873
11251A2635a16371B96664e6977A72763a77210h4017A52075c64725J40379B13908
$$ 12635 -116371 296664 -56977 172763 -177210 -84017 152075 -364725 -224346 213908
11240i9129I483J3185J69985a65651L3977p0987j8667A90408b87119C2423O1946
$$ -99129 9483 22668 192653 -165651 -131674 -202661 -221328 190408 -287119 32423 94369
11229I4369a50731k3299I355L0762O9700D9117J0645J7718f2096B26900e3499
$$ 94369 -150731 -174030 9355 40117 109817 49117 59762 77480 -62096 226900 -53499
11217b2856k30574L3203j95799b03858j32456b7296m9146q9210j13076A92230
$$ -22856 -253430 -220227 -416026 -203858 -336314 -27296 -76442 -165652 -278728 192230
11206A93004c85251J25150a29645I7596a10269F6108k106b05235h713B0339a00390
$$ 193004 -385251 -260101 -129645 97596 -110269 66108 64002 -205235 -8713 20339 -100390
11194B63079h7839J9923B16351c44128N3415m4367h4804J7532L0251j40071Q199
$$ 263079 -87839 -67916 216351 -344128 -290713 -335080 -84804 -67272 -37021 -177092 -168893
11183a68893n4063B21352f6839D9106a70117b0107A1686a59668l3869k0629D2838
$$ -168893 -222956 221352 -66839 49106 -170117 -20107 11686 -159668 -193537 -214166 42838
11171A01955J98721I9033b83025h5608C0883a19275A33132b41609n7603J48360
$$ 101955 300676 99033 -283025 -85608 30883 -119275 133132 -241609 -299212 -150852
11161a50852h234l8534A58416a76245A57230a43333A04268f2200k85000a54002
$$ -150852 -8234 -46768 158416 -176245 157230 -143333 104268 -62200 -347200 -154002
11150a14703L8355K7990l22185f4206F0360j9389b9710A9346i4413A6350a00635
$$ -114703 -76348 -48358 -370543 -64206 60360 40971 -29710 19346 -94413 16350 -100635
11138A59658n7197a33231m6148c8903J054o8993b9649B0103c0440o2668A42600
$$ 159658 102461 -133231 -179379 -38903 -37849 -106842 -29649 20103 -30440 -93108 142600
11126H2919J64775j6891e0688c00o7671l7810A39120O3371e5478j26172c0165
$$ 82919 247694 230803 -50688 -300 -67971 -105781 139120 202491 -55478 -181650 -30165
11114A0017d27814A29915a69343b5364B5968e4792G9871K13198b59299A34432
$$ 10017 -427814 129915 -169343 -25364 25968 -54792 79871 293069 -259299 134432
11103B99646r0146a16986A96834b8904k84661B62954j0256E9981b2196n5852F3890
$$ 299646 209500 -116986 196834 -28904 -313565 262954 252698 59981 -22196 -78048 63890
11091E9091J1413a8882l30988A36085L06391A6688J2165L40291F2780K77146A02651
$$ 59091 70504 -18882 -349870 136085 442476 16688 28853 369144 62780 339926 102651
11079A47269d927A35462J14160R1269A0873J04190K81500j53713P4711q1823j17136
$$ 147269 -4927 135462 249622 340891 10873 115063 396563 242850 317561 235738 118602
11068A18602d0647j74476h0939c4017j746B32732e5106I5185M66242B40139P4308
$$ 118602 -40647 -215123 -80939 -34017 -35763 232732 -55106 95185 561427 240139 314447
11057C14447b5021A15191J20567J64768J03029B07428M659H0258A4437L01011
$$ 314447 -25021 115191 235758 400526 503555 207428 212087 80258 14437 315448
11047C15448J97877j07577J15074O7542B05847J43199J31547J48721A48969K45797
$$ 315448 513325 405748 520822 588364 205847 349046 480593 629314 148969 394766
11037C94766J569j21550j32220K02036K8728K83522k52432M42027B91042K3424
$$ 394766 396335 274785 142565 344601 373329 656851 404419 846446 291042 314466
11027C14466K90268r3672A21109N81665C05237Q2844A63021M6971J31380p6724
$$ 314466 604734 511062 121109 702774 305237 388081 163021 209992 341372 264648
11017B64648P3833j8067M47366B25853K80683j94021R4123N7600K21341B57970
$$ 264648 338481 320414 767780 225853 506536 312515 406638 464238 685579 257970
11006C16147J84777C0872L57229O4165K32620A76284J62133J51872p5146j15846
$$ 316147 500924 30872 388101 452266 684886 176284 338417 490289 415143 299297
10996B99297p216k9557J07347m7381K99034m3901G1501N67197B33923K83449J85187
$$ 299297 292081 262524 369871 322490 621524 577623 71501 638698 233923 517372 702559
10985G02559C17061L0497L11941d6768C22152J47060j7799L48456j82581L78786
$$ 702559 317061 347558 659499 -46768 322152 469212 451413 799869 617288 996074
10975I96074l06955j30414K98797L33786k38112J38799L56213J06555P8379L7599
$$ 996074 689119 558705 857502 1191288 953176 1091975 1448188 1554743 1633122 1670721
10965A670721k65869P6600j44270J44081m33857J806k15967L23267j98676j68758
$$ 1670721 1404852 1481452 1337182 1481263 1047406 1049212 833245 1156512 957836 789078
10955G89078K54634J35527k09664K97669k37809J02263l84319j42837K2517k39031
$$ 789078 1043712 1179239 969575 1267244 1029435 1131698 747379 604542 627059 388028
10945C88028J15317m9381j18133K6134f0554B73766Q3871j00726l2293e3643G6625
$$ 388028 503345 453964 335831 361965 -60554 273766 357637 256911 224618 -53643 76625
10933a07763M9353F7207L1806b23991C95310A46595n5608b52510A49014i0621
$$ -107763 -58410 67207 99013 -223991 395310 146595 90987 -252510 149014 -90621
10922e5493r3940P232l5635F0876c81747I9717J58485E2081Q7273a18266k70180
$$ -55493 -149433 -142201 -177836 60876 -381747 99717 258202 52081 139354 -118266 -388446
10911c88446A98421f7553l21675i2400D3825a5146H0381K64796C5153b77811A27418
$$ -388446 198421 -67553 -389228 -92400 43825 -15146 80381 345177 35153 -277811 127418
10899A955J59130E4944a03190d8366k624C88028a53199C4126e2528k27522J24931
$$ 1955 161085 54944 -103190 -48366 -50990 388028 -153199 34126 -52528 -280050 -155119
10888a55119J4922H2704l1875R375K06100a89414b5951E7826a68452C2768a58674
$$ -155119 -140197 82704 50829 60204 266304 -189414 -25951 57826 -168452 32768 -158674
10876a58529F0010b28004d8339A17306f8344j22357B76659E4136M9558H09J97038
$$ -158529 60010 -228004 -48339 117306 -68344 -190701 276659 54136 103694 809 197847
10865A97847q3707O38a4701n9842A63958a05837F0774a7592l40670E4265a24937
$$ 197847 114140 114778 -14701 -74543 163958 -105837 60774 -17592 -358262 54265 -124937
10853f8264j49256C8003h3218j43151a07965j66018J33997A48082L25936E3700
$$ -68264 -217520 38003 -83218 -226369 -107965 -273983 -139986 148082 474018 53700
10842C6740c47655B15954b18077B41937A8500J03798B6978g1518n473j02803F2660
$$ 36740 -347655 215954 -218077 241937 18500 122298 26978 -71518 -76991 -179794 62660
10830A11255a02832K9732B03217C6696b14503A57029a3197A72643L4774d3423
$$ 111255 -102832 -73100 203217 36696 -214503 157029 -13197 172643 207417 -43423
10819c46441e7378j24076L8146e4149b807B22160M01E5470R2407J34059a7578
$$ -346441 -57378 -181454 -143308 -54149 -2807 222160 222561 55470 147877 281936 -17578
10807a80448F7804J49939a83240n5649k6238A72694q2258L19129c5520C08523
$$ -180448 67804 217743 -183240 -238889 -265127 172694 90436 409565 -35520 308523
10796a41504k4417A1582b94624M9194P0956L023H8634b13636J1042I856f6361
$$ -141504 -165921 11582 -294624 -245430 -174474 -171451 88634 -213636 -202594 9856 -66361
10784a89131M1743a1789j62862l2929F5956L7072b40960K5846c3157r8416M2508
$$ -189131 -147388 -11789 -174651 -207580 65956 103028 -240960 -215114 -33157 -131573 -89065
10773h9065B95883E4385a0115B9469K19382J24803a09833B0381c4359I245J15671
$$ -89065 295883 54385 -10115 29469 248851 373654 -109833 20381 -34359 9245 124916
10762A24916e0951k60103B93978b25038k8786J05312o8281d7657o8570l4296A58394
$$ 124916 -50951 -311054 293978 -225038 -253824 -148512 -216793 -47657 -116227 -150523 158394
10750b9244j94716D8574L15791A36723K15218e7987A08039m8853b34553D41541
$$ -29244 -223960 48574 364365 136723 351941 -57987 108039 59186 -234553 441541
10739A05574C3336R051N2429f7861I2110l394j9182e675k1476j783G3621M826
$$ 105574 33336 42387 94816 -67861 92110 88716 69534 -5675 -27151 -28934 73621 78447
10727G8447m220c6291j60430N3115K1873p3547B11343a95621L3692d1597j58295
$$ 78447 74227 -36291 -196721 -143606 -121733 -195280 211343 -195621 -161929 -41597 -199892
10716a99892B44705a78810G3522J17354b94184f4597n201n57228a02751J9988
$$ -199892 244705 -178810 73522 190876 -294184 -64597 -69798 -627026 -102751 -82763
10706h2763c0385m26248A6188d6963E0915b54816A97346r7477k2059b20655j49666
$$ -82763 -30385 -456633 16188 -46963 50915 -254816 197346 99869 77810 -220655 -370321
10695c70321B5613N7336c5378r4606a6630I3230b838B23868A03595a10804k21822
$$ -370321 25613 82949 -35378 -129984 -16630 93230 -2838 223868 103595 -110804 -332626
10684c32626e4768A82284a02045B311c9836A53284J6728a40701B22625c04178
$$ -332626 -54768 182284 -102045 2311 -39836 153284 170012 -140701 222625 -304178
10673f178j7400p4192k00630c7932L560j85867R6961D1820h5217B8770f8082B33833
$$ -6178 -23578 -97770 -298400 -37932 -34372 -220239 -123278 41820 -85217 28770 -68082 233833
10660b05058k99192I8194K26489e05952B03643E2347h0696k49117D4813M6905
$$ -205058 -504250 98194 324683 -505952 203643 52347 -80696 -329813 44813 91718
10650I1718b26637r8403A6907a34924K1408D4249R1943d3175A98490G7005A9825
$$ 91718 -226637 -325040 16907 -134924 -113516 44249 136192 -43175 198490 77005 19825
10638B6080b82352R7248J4315d4535A33835a81065B7061a50799G4241a72735N7192
$$ 26080 -282352 -185104 -170789 -44535 133835 -181065 27061 -150799 74241 -172735 -115543
10627a15543l7686e4803D5583J14368b52351c121C84081A24136d06354d7223B93362
$$ -115543 -153229 -54803 45583 159951 -252351 -3121 384081 124136 -406354 -47223 293362
10615g6984D233b60781B265L37438B303J93369D4010K3347L2929J86037j32501
$$ -76984 4233 -260781 2265 339703 2303 195672 44010 67357 100286 286323 153822
10604A53822h3865A47814c9322k58614a35394c331l59513d7192C1564a33589A61882
$$ 153822 -83865 147814 -39322 -297936 -135394 -3331 -362844 -47192 31564 -133589 161882
10592c46059B08004b08456R1412j17481B13900E0754a7620m32692e8175D1867
$$ -346059 208004 -208456 -117044 -234525 213900 50754 -17620 -450312 -58175 41867
10581b5157j71554R2843B4195b3934j97689C38080i4148p8921C4077i4401A11533
$$ -25157 -196711 -103868 24195 -23934 -221623 338080 -94148 -173069 34077 -94401 111533
10569e5880q5368G538K58989c33429f6007k7112A7131a09897k94206a02392A13958
$$ -55880 -141248 7538 266527 -333429 -66007 -93119 17131 -109897 -404103 -102392 113958
10557B2249a71707C86255A8302c55460B8329a30311j19261A38224J67943b4754
$$ 22249 -171707 386255 18302 -355460 28329 -130311 -249572 138224 306167 -24754
10546a18010G2419d1013j25260C4179J43311a22179J3174k8563d8124B2790a19182
$$ -118010 72419 -41013 -166273 34179 177490 -122179 -109005 -137568 -48124 22790 -119182
10534i6579o0580B35601a11137A28938b11144B2529J52345P7220K9911j08079
$$ -96579 -157159 235601 -111137 128938 -211144 22529 174874 252094 282005 173926
10524A73926c30065i7637j30558C51325d5873j45647N6269e56k26516B12309I3106
$$ 173926 -330065 -97637 -228195 351325 -45873 -191520 -135251 -556 -227072 212309 93106
10512a87528f5182A33128J29783c24679G8666K7460g8377B2304i1270F8578A6749
$$ -187528 -65182 133128 262911 -324679 78666 106126 -78377 22304 -91270 68578 16749
10500e7245K8004n3017H0735J7147c45049A42111a50062m7824L3936B5674F105
$$ -57245 -29241 -82258 80735 97882 -345049 142111 -150062 -197886 -163950 25674 6105
10488b41672D81K47053J41587a48539A32524b3178k0397I5419l8572K75717j56868
$$ -241672 481 247534 389121 -148539 132524 -23178 -43575 95419 56847 332564 175696
10477A75696M2188d5508B2306J04677o2037K97752A24304O3010J73639j03292
$$ 175696 217884 -45508 22306 126983 64946 362698 124304 187314 360953 257661
10467B57661a86314A10996O67D4355L3097b47866F9509B785i721J21m160r454
$$ 257661 -186314 110996 111663 44355 77452 -247866 69509 2785 -9721 -9600 -13760 -23214
10455b3214B42475j06424C8990c23468A05393J0833a13178i890j13001d4601I703
$$ -23214 242475 136051 38990 -323468 105393 116226 -113178 -9890 -122891 -44601 9703
10443B14269j0784B7065b21568A13141Q912k5443M1999n3826J26545L6339a18004
$$ 214269 203485 27065 -221568 113141 122053 96610 138609 84783 211328 247667 -118004
10431b40497a04276C1506c02051C14980a15828d737k08664g195B37011c34k9334
$$ -240497 -104276 31506 -302051 314980 -115828 -4737 -213401 -7195 237011 -334 -29668
10420b9668j53421B8754J63599a35316b2932A8760b00855h0107l0285a1292r5879
$$ -29668 -183089 28754 192353 -135316 -22932 18760 -200855 -80107 -110392 -11292 -107171
10409a07171j22026N3624L4137A11113O3656b51471R8933b9937j95890A19525
$$ -107171 -229197 -175573 -141436 111113 174769 -251471 -152538 -29937 -225827 119525
10398A31934c09897J21815L171K7740q4620c6307J6535A38400B3259i6577C694
$$ 131934 -309897 -188082 -184911 -157171 -241791 -36307 -19772 138400 23259 -96577 3694
10386e7633C8456b56562e5466A54461D3505b69610D52740A80935a54011C15905
$$ -57633 38456 -256562 -55466 154461 43505 -269610 452740 180935 -154011 315905
10375B45493n3367a57286A10677d1101B36036c3566B68229C0673b18471C50881
$$ 245493 192126 -157286 110677 -41101 236036 -33566 268229 30673 -218471 350881
10364A80036C4610K58624L59643B34578n4821d7140C61432a79007f5120B80492
$$ 180036 34610 293234 652877 234578 179757 -47140 361432 -179007 -65120 280492
10353e2747e098l1805C02004j23894J51665m5102K20947j10205A14664J12125
$$ -52747 -5098 -36903 302004 178110 329775 284673 505620 395415 114664 226789
10343B26789a17307a3949j60445C66647j76753b74696I1893J48019a9589q3880
$$ 226789 -117307 -13949 -174394 366647 189894 -274696 91893 239912 -19589 -103469
10333a03469k92966J35693e1729C71L10487f5949d569A8460a3775I0187Q69N8156
$$ -103469 -396435 -260742 -51729 371 310858 -65949 -4569 18460 -13775 90187 91056 149212
10321A49212l85B7938P6000i2665B90882e9438A94717I3310e5827r0367A77046
$$ 149212 148827 27938 103938 -92665 290882 -59438 194717 93310 -55827 -146194 177046
10309A32659n2994j8413a04842l69447f6816n2127B9611B314a34706a3456H1447
$$ 132659 79665 61252 -104842 -474289 -66816 -118943 29611 2314 -134706 -13456 81447
10297A381i2327B32468G6439O5837R6659a20316K6405b4230m1122l5982a6956
$$ 1381 -92327 232468 76439 142276 238935 -120316 -93911 -24230 -65352 -101334 -16956
10285d58657A16399L55647k03593b34201B11383q8180C7106K43104a17592j03560
$$ -458657 116399 472046 268453 -234201 211383 123203 37106 280210 -117592 -221152
10275b21152B1350a04268A95177k3192m6466K80407A06813c9297B17679d069B85696
$$ -221152 21350 -104268 195177 171985 125519 405926 106813 -39297 217679 -4069 285696
10263b95555G8416g2083A85164a40216a155B03838o3800G698a89318h9818A27315
$$ -295555 78416 -72083 185164 -140216 -1155 203838 140038 7698 -189318 -89818 127315
10251D487b39437J02565C27687b8003C01893g3471k97510h6377A32370a53981
$$ 4487 -239437 -136872 327687 -28003 301893 -73471 -370981 -86377 132370 -153981
10240d5936A28790b75105P3779E9139A6943j693b55701n8013a52751q6546I2618
$$ -45936 128790 -275105 -201326 59139 16943 15250 -255701 -313714 -152751 -239297 92618
10228f0341A02665c7219j86679e3291j08642C7613a12135k6441I6995a5882D7413
$$ -60341 102665 -37219 -223898 -53291 -161933 37613 -112135 -138576 96995 -15882 47413
10216A00223i4234k20214J03635N8092E6288g2511j1291k36471J28023a960j54891
$$ 100223 -94234 -314448 -210813 -152721 56288 -72511 -83802 -320273 -192250 -1960 -156851
10205a56851C17626b10474F8986c04389F3543c4961r6119K3952k1153l291K0017
$$ -156851 317626 -210474 68986 -304389 63543 -34961 -131080 -107128 -128281 -131572 -111555
10194a11555K9581F1786a70368E7928a5081C362c38263J34466H4459b9763j05512
$$ -111555 -81974 61786 -170368 57928 -15081 3362 -338263 -203797 84459 -29763 -135275
10183a35275a7739B82066b5965q3840I9199a89144I8661b23902l9890A8457a54934
$$ -135275 -17739 282066 -25965 -109805 99199 -189144 98661 -223902 -263792 18457 -154934
10171A45525a70403D43888A33757C4482b40901c6470E1921d7526k55202H5135
$$ 145525 -170403 443888 133757 34482 -240901 -36470 51921 -47526 -302728 85135
10160c0502B0508K87677E542a24640D8586L438j6154K5304e5131A07402J2342
$$ -30502 20508 308185 5542 -124640 48586 52024 35870 61174 -55131 107402 119744
10149A19744a49899j3828g6754A32984b08416J8779q6106B10256c15010B0647
$$ 119744 -149899 -163727 -76754 132984 -208416 -189637 -275743 210256 -315010 20647
10138B51728a18590j9699H2676C3960a44090E2310h7307F6687a1196l45481H8465
$$ 251728 -118590 -138289 82676 33960 -144090 52310 -87307 66687 -11196 -356677 88465
10126A35763b17063Q7696A4074a19443H5401R4559p9005a70545N3886j0608B7475
$$ 135763 -217063 -129367 14074 -119443 85401 179960 100955 -170545 -116659 -127267 27475
10114a36076k9326k52268E2300P6748a66163B28929a70087B83147r1120b24383
$$ -136076 -165402 -417670 52300 129048 -166163 228929 -170087 283147 192027 -224383
10103B31667a29272B84437d2214A54757b27611H8718b97204P291G4145R1767b8253
$$ 231667 -129272 284437 -42214 154757 -227611 88718 -297204 -289913 74145 165912 -28253
10091a32745B51625f033k18729A37797C2590a04533E0337h5660A60570C919J65403
$$ -132745 251625 -6033 -224762 137797 32590 -104533 50337 -85660 160570 3919 169322
10080A69322O8583a3300l4528D7608a19208q1000F782R0271l2519h2483l41061
$$ 169322 237905 -13300 -47828 47608 -119208 -200208 6782 97053 64534 -82483 -423544
10069d23544a76017C3933e2625k83834A01050B8633a29770e0546c970q291H2944
$$ -423544 -176017 33933 -52625 -336459 101050 28633 -129770 -50546 -3970 -12261 82944
10057B44204D6305a30963L2456B08358d8815q6571j59415b9634e884n05805A38461
$$ 244204 46305 -130963 -98507 208358 -48815 -135386 -294801 -29634 -5884 -511689 138461
10045b00844r1818B28842k844a37068f5951k0603K4105K6555B95039c96308a00131
$$ -200844 -292662 228842 225998 -137068 -65951 -86554 -62449 -35894 295039 -396308 -100131
10033B8857J34566M8285b67970k53875e6755n0628h480n4580A16555M4970D7063
$$ 28857 163423 211708 -267970 -521845 -56755 -107383 -8480 -63060 116555 161525 47063
10021c90972A636c12430f919k29837e3581j79183A94355h0823D4230b80781b4402
$$ -390972 1636 -312430 -6919 -236756 -53581 -232764 194355 -80823 44230 -280781 -24402
10009A88601b83103A2317b36238L9548e89j55535B6913a74275a1385j20390o4115
$$ 188601 -283103 12317 -236238 -196690 -589 -156124 26913 -174275 -11385 -131775 -195890
9998a95890I913b50990I7843L1014d13831F5704a82624J9125f8232j69542A84526
$$ -195890 9913 -250990 97843 128857 -413831 65704 -182624 -163499 -68232 -237774 184526
9986c3563j56914l222C5033d51705J16177g6049n6867E6137K9038b5781j25323
$$ -33563 -190477 -193699 35033 -451705 -335528 -76049 -132916 56137 85175 -25781 -151104
9975a51104d1170I0831g8861B26410m9q3079a51852B77271d14408a36843B59085
$$ -151104 -41170 90831 -78861 226410 226361 143282 -151852 277271 -414408 -136843 259085
9963e8920B4058i466E411O7964c4073j06157B38990c36812a52621o1355c3852
$$ -58920 24058 -9466 5411 73375 -34073 -140230 238990 -336812 -152621 -213976 -33852
9951c11804J21846A04746a05356A64526G673O5153a26021e4317A18539D1136b80279
$$ -311804 -189958 104746 -105356 164526 7673 72826 -126021 -54317 118539 41136 -280279
9939A53666b25420j3857A02053b19965N86B92816e2998j37603j11361a7883k4228
$$ 153666 -225420 -239277 102053 -219965 -219379 292816 -52998 -190601 -301962 -17883 -42111
9928d2111o4858A97860B8590a43846j04838d6033m1490H7149a27538A44342g6370
$$ -42111 -106969 197860 28590 -143846 -248684 -46033 -87523 87149 -127538 144342 -76370
9916a61458j7877P6883A72955l721H2247G81N7973A588d33915A52497a94385A51409
$$ -161458 -179335 -102452 172955 169234 82247 781 58754 1588 -433915 152497 -194385 151409
9903b7183j17785K0403A34409a95952k8261g0448j521j27279A3948O0168J07404
$$ -27183 -144968 -124565 134409 -195952 -224213 -70448 -71969 -199248 13948 74116 181520
9892A81520b2539k08943A00276J96170A9523K50524c8314A11903D4779g9986j966
$$ 181520 -22539 -231482 100276 296446 19523 270047 -38314 111903 44779 -79986 -81952
9881h1952F5217a96458g4368j07997b254j09403j52864k9113J42827d076k72303
$$ -81952 65217 -196458 -74368 -182365 -2254 -111657 -264521 -293634 -150807 -4076 -276379
9870b76379d5113G3123f3762A29204C6277j2478P1946m7558d7487j31236N9844
$$ -276379 -45113 73123 -63762 129204 36277 23799 95745 48187 -47487 -178723 -118879
9859a18879j21390C8675i345j4471A81696a43502N1723l17291K03537c8649A84330
$$ -118879 -240269 38675 -9345 -23816 181696 -143502 -91779 -409070 -205533 -38649 184330
9847B00415b86860A27621C0000P668a19632D8285a19869n4810g1876B36053i4728
$$ 200415 -286860 127621 30000 37668 -119632 48285 -119869 -174679 -71876 236053 -94728
9835A05858a26354H3253a13540B19223b9995D6896a24327j61569c4469A41122
$$ 105858 -126354 83253 -113540 219223 -29995 46896 -124327 -285896 -34469 141122
9824b09752A8319a68429b2575q5836g379j1487j13608k44428J49865L956A61541
$$ -209752 18319 -168429 -22575 -108411 -7379 -18866 -132474 -376902 -227037 -223081 161541
9812B33671c12412a28732I2721a71315r3501A14324a95896j2918B79344j18894
$$ 233671 -312412 -128732 92721 -171315 -264816 114324 -195896 -208814 279344 160450
9802A60450m4408b34383E4114e0122n7719A20684c33807a42575c1616j59335i1597
$$ 160450 116042 -234383 54114 -50122 -107841 120684 -333807 -142575 -31616 -190951 -91597
9790a16774l24554g6163j87131Q1598b1263k31763A63801e5593I9902A6522K31823
$$ -116774 -441328 -76163 -263294 -181696 -21263 -253026 163801 -55593 99902 16522 248345
9779B48345a64017n8158o5621e3140A16971b06836B60378d6310k73764e5371G6500
$$ 248345 -164017 -222175 -287796 -53140 116971 -206836 260378 -46310 -320074 -55371 76500
9767B30746b09791l4647e018l77998I9130i5081F121d17953J38558J17757c9983
$$ 230746 -209791 -244438 -5018 -383016 99130 -95081 6121 -417953 -279395 -161638 -39983
9755g8757A18450k2474e05564a11055c050k00342l36357B96220p7783i2757j18619
$$ -78757 118450 95976 -505564 -111055 -3050 -203392 -539749 296220 218437 -92757 -211376
9744b11376r7434J32079F8795f282o8928o676r4233A94798b63282i0463j5025
$$ -211376 -308810 -176731 68795 -6282 -75210 -81886 -176119 194798 -263282 -90463 -105488
9733a05488C2198b1754A11598d1997A76677a7493l43890B42155b11304F5086e8042
$$ -105488 32198 -21754 111598 -41997 176677 -17493 -361383 242155 -211304 65086 -58042
9721b34798k01024f8214F2242A6946h577j57227j02708J29856j16608i919j78318
$$ -234798 -435822 -68214 62242 16946 -8577 -165804 -268512 -138656 -255264 -9919 -188237
9710a88237P2810A00915m9568a01747B30891g2478J1669B15694N9384a90231J6568
$$ -188237 -115427 100915 51347 -101747 230891 -72478 -60809 215694 275078 -190231 -173663
9699a73663A93110a67168k46368g9721D2289b16211a02773B9568E427J27117d81429
$$ -173663 193110 -167168 -413536 -79721 42289 -216211 -102773 29568 5427 132544 -481429
9687b56816F010d3386e997j13277j90231D124a12455F3365b38881A27877c38294
$$ -256816 6010 -43386 -5997 -119274 -309505 4124 -112455 63365 -238881 127877 -338294
9675B08234E2632b73625G325N9168K421i3572F4748a74329o1829f9373K2485l63786
$$ 208234 52632 -273625 7325 66493 68914 -93572 64748 -174329 -236158 -69373 -46888 -410674
9663d10674i852D3366J27258b45548r0312B56828N0083j00828e89305A1100M670
$$ -410674 -9852 43366 170624 -245548 -335860 256828 306911 206083 -589305 11100 15770
9652A5770O1489j4538c0504H299a21787n7152b8143A83457c82684J87142j63458
$$ 15770 77259 62721 -30504 8299 -121787 -178939 -28143 183457 -382684 -195542 -359000
9641c59000F087J36817f8027K2186j79375C3247c04607A90340a17464E8926b0315
$$ -359000 6087 142904 -68027 -45841 -225216 33247 -304607 190340 -117464 58926 -20315
9629D15339B9356a65468P1620F1509e939j69739p3353M2534E8731d09890Q0657
$$ 415339 29356 -165468 -93848 61509 -5939 -175678 -249031 -206497 58731 -409890 -329233
9618c29233c4610E5196a55446H6649c38592a09201i685A03959a59555K7030B56744
$$ -329233 -34610 55196 -155446 86649 -338592 -109201 -9685 103959 -159555 -132525 256744
9606I9602O4180B1404b5977A03879e1929A371e30461a11826j6631l9224L8257
$$ 99602 163782 21404 -25977 103879 -51929 1371 -530461 -111826 -128457 -167681 -129424
9595a29424D9290J2236b15165R2080B2129a37222D5888b30007H6496b85814F7661
$$ -129424 49290 61526 -215165 -123085 22129 -137222 45888 -230007 86496 -285814 67661
9583a8495j20160j6277J8856B51578q4054e2816A95731b65433f0656o0072A84504
$$ -18495 -138655 -154932 -136076 251578 167524 -52816 195731 -265433 -60656 -120728 184504
9571a26446A59938a12303B28902H3516c10432M2559C76337a65299d5766l5913
$$ -126446 159938 -112303 228902 83516 -310432 -267873 376337 -165299 -45766 -81679
9561h1679I309d865o5487A37112a11561M5480A33801b12722J03373A28668i6185
$$ -81679 9309 -4865 -70352 137112 -111561 -66081 133801 -212722 -109349 128668 -96185
9549C0191c41025e4067A38986h9724j40630J13203l35336A19014K7136R2660G7715
$$ 30191 -341025 -54067 138986 -89724 -230354 -117151 -452487 119014 146150 238810 77715
9537a91230N506B6742b35586C42086a30835A9671a39974l1741c7059m2177k34781
$$ -191230 -185724 26742 -235586 342086 -130835 19671 -139974 -171715 -37059 -79236 -314017
9526c14017f5544j39542B1367c59692a2366j55453r0733C30501E0137b02713K1072
$$ -314017 -65544 -205086 21367 -359692 -12366 -167819 -258552 330501 50137 -202713 -181641
9515a81641l6746c6967M489l66896c5384j14295H6920c05878a21980l87838A1503
$$ -181641 -218387 -36967 -32478 -399374 -35384 -149679 86920 -305878 -121980 -509818 11503
9503c8741B8971a70021P8657K4563J0759j19117I5213a91921E1862b40892l305
$$ -38741 28971 -170021 -91364 -66801 -56042 -175159 95213 -191921 51862 -240892 -244197
9492b44197A55950a01903L5386j96499P9555M8748C33535A2535b71870a21502
$$ -244197 155950 -101903 -66517 -263016 -183461 -134713 333535 12535 -271870 -121502
9481a42275M3327r6736o0437d0235j13585A8306d2570B55580f1971j6884A52194
$$ -142275 -98948 -195684 -256121 -40235 -153820 18306 -42570 255580 -61971 -78855 152194
9469G1477a36128G6530b88709G187b22564b8730j02502j8439k1863N7890A11830
$$ 71477 -136128 76530 -288709 7187 -222564 -28730 -131232 -149671 -171534 -113644 111830
9457G2191h4908j50110E0048b70561A10696e1472D2876k441C865a55763I4657
$$ 72191 -84908 -235018 50048 -270561 110696 -51472 42876 40435 3865 -155763 94657
9445B05904B1394K19150e2167Q209a2376p5630n405j0598L8264k16062A91404
$$ 205904 21394 240544 -52167 -43958 -12376 -88006 -93411 -104009 -65745 -281807 191404
9433h8942I161a92266M4906C07738A29483O6417b92191O6984e7662G8676a95351
$$ -88942 9161 -192266 -147360 307738 129483 195900 -292191 -225207 -57662 78676 -195351
9421a94242A56777d2155j60641k5157B14933q9343J1655g4539E1267b00164c1785
$$ -194242 156777 -42155 -202796 -227953 214933 125590 137245 -74539 51267 -200164 -31785
9409a58019e3023A45188e2930k85836J08618R7860p8080A88736b47317e3138A4990
$$ -158019 -53023 145188 -52930 -338766 -230148 -132288 -210368 188736 -247317 -53138 14990
9397a5974C5809f3919o8279o3666B43266A3605h4891k27177a40647A99228c28723
$$ -15974 35809 -63919 -132198 -195864 243266 13605 -84891 -312068 -140647 199228 -328723
9385b59893L9782L2314k39805A2254a83972B8100c3797j00968i010G2331q764
$$ -259893 -220111 -187797 -427602 12254 -183972 28100 -33797 -134765 -9010 72331 63567
9374F3567a61061A38694L14084C3267K247d2007l0117d498m3590J6227r1694n7006
$$ 63567 -161061 138694 452778 33267 35514 -42007 -72124 -4498 -48088 -31861 -123555 -180561
9362a80561A56041n7077b45710B24678b24573A12150f677k81396D3794i143D4835
$$ -180561 156041 98964 -245710 224678 -224573 112150 -6677 -288073 43794 -9143 44835
9350i1115L0266R519o525n2581a044I4868b37424A21864g9371l75293Q8405C00038
$$ -91115 -60849 -51330 -57855 -110436 -1044 94868 -237424 121864 -79371 -454664 -366259 300038
9337A91472a43421f8946a187I7041e4222F809J0313a38091I6769a36810j71909
$$ 191472 -143421 -68946 -1187 97041 -54222 6809 17122 -138091 96769 -136810 -308719
9326c08719g3609j5852C05831A10380a52870k05475b1448L251j50964B16862b62103
$$ -308719 -73609 -89461 305831 110380 -152870 -358345 -21448 -18197 -169161 216862 -262103
9314h0846j54264M5962j19341a53272B71452L091j19117A8255J56283a70419p6878
$$ -80846 -235110 -189148 -308489 -153272 271452 274543 155426 18255 174538 -170419 -247297
9303b47297d7327E0248a109n575r4027k5051f0140l3813k12897R2118a05647C66783
$$ -247297 -47327 50248 -1109 -6684 -100711 -125762 -60140 -93953 -306850 -214732 -105647 366783
9290a51561A28058k4529m319i7915c7802C5102d5282K754j59480A64255h2496
$$ -151561 128058 103529 99210 -97915 -37802 35102 -45282 -42528 -202008 164255 -82496
9278b11999j18992F1757J97212K6381b5845q7571E9416a2063p5859j32268a3337
$$ -211999 -330991 61757 258969 285350 -25845 -113416 59416 -12063 -87922 -220190 -13337
9266b37557e2081A34109a22517I4665c15854F9978g6805L645G0028a50897f8548
$$ -237557 -52081 134109 -122517 94665 -315854 69978 -76805 -73160 70028 -150897 -68548
9254D9164b60033F0002a98186A48951a21092A74915h1673j6876n3006L421j25189
$$ 49164 -260033 60002 -198186 148951 -121092 174915 -81673 -98549 -151555 -148134 -273323
9243b73323A6476J06666a71265c1050B4720i9654B7122a65833k7750j35123J51642
$$ -273323 16476 123142 -171265 -31050 24720 -99654 27122 -165833 -193583 -328706 -177064
9232a77064o5402n201K7825F6776a84579A89904O6514c29459K6045A2246J12300
$$ -177064 -242466 -247667 -219842 66776 -184579 189904 256418 -329459 -303414 12246 124546
9221A24546f1901B7949b57738J1717Q7581B44413d83703J46894j33517a53539
$$ 124546 -61901 27949 -257738 -246021 -158440 244413 -483703 -336809 -470326 -153539
9210A59847e5416B11919i599o9774L960k19318h3615I2720Q2191O6071a29983
$$ 159847 -55416 211919 -9599 -79373 -75413 -294731 -83615 92720 174911 240982 -129983
9198A11322a13635B37707G4476a81400A13578D8641i8538m08893a56495I779a3643
$$ 111322 -113635 237707 74476 -181400 113578 48641 -98538 -507431 -156495 9779 -13643
9186A33955k2070b2298m8111l22418a77186J7420j54944b8962A68891C331h6477
$$ 133955 111885 -22298 -70409 -392827 -177186 -159766 -314710 -28962 168891 3331 -86477
9174b03786B08156b56702a24865C9628a50894c0396r4201G5420b5018I9739f4703
$$ -203786 208156 -256702 -124865 39628 -150894 -30396 -124597 75420 -25018 99739 -64703
9162f6693K8411M351j48760A35093i4936q290C7487d8391j51260b7750q478G8116
$$ -66693 -38282 -33931 -182691 135093 -94936 -103226 37487 -48391 -199651 -27750 -36228 78116
9149a9625E2779J47974a14693C4666K9419a73278j8593o4889F6048a07422A79858
$$ -19625 52779 200753 -114693 34666 64085 -173278 -191871 -256760 66048 -107422 179858
9137b03600A20295a48387B1509a08204N570r1866J2154P4495q2893g2124J1730
$$ -203600 120295 -148387 21509 -108204 -102634 -194500 -182346 -107851 -190744 -72124 -60394
9126f0394k45115a12250M1383m2724F3703a54009k82679b2425j10745j4586e9420
$$ -60394 -305509 -112250 -70867 -113591 63703 -154009 -436688 -22425 -133170 -147756 -59420
9114c2574j63313f9745A5924a60788k5219E6490J17697c4362B31423B4642b33004
$$ -32574 -195887 -69745 15924 -160788 -186007 56490 174187 -34362 231423 24642 -233004
9102c93562a47049a2412H5315b24743e0576j24409n9025f0730F3495K82111a17186
$$ -393562 -147049 -12412 85315 -224743 -50576 -174985 -234010 -60730 63495 345606 -117186
9090b16691c2695E5735a70684b5176P635A81826e7377k07849K0026i5698m7111
$$ -216691 -32695 55735 -170684 -25176 -17541 181826 -57377 -265226 -245200 -95698 -142809
9079a42809f5722d540F8372f4109C8499a43042I4025b89162g0067k57951h3946
$$ -142809 -65722 -4540 68372 -64109 38499 -143042 94025 -289162 -70067 -328018 -83946
9067a46511A77625A5028h9784c1831k54360G4638h5498m8422c9761o1168F2284
$$ -146511 177625 15028 -89784 -31831 -286191 74638 -85498 -133920 -39761 -100929 62284
9055A56382b4169H8989h4384j68917A47847b4788j85208l8392H753L38139a00859
$$ 156382 -24169 88989 -84384 -253301 147847 -24788 -209996 -248388 8753 346892 -100859
9043i0524j83721J29033A5679O4934K8698b20622A34594a03635l5957M7274j3352
$$ -90524 -274245 -145212 15679 80613 109311 -220622 134594 -103635 -139592 -92318 -105670
9032a05670j16395A15843h7266j40316A68275d8349b2114B8529J75514e1403m8648
$$ -105670 -222065 115843 -87266 -227582 168275 -48349 -22114 28529 204043 -51403 -100051
9021a00051j55373j47988Q3373a522k47946G935e4792A06523a85268N8872r4067
$$ -100051 -255424 -403412 -320039 -1522 -249468 7935 -54792 106523 -185268 -126396 -220463
9010b20463f1613j9422j07823f6024j58916B1793n768g0141c3517I054c13500
$$ -220463 -61613 -81035 -188858 -66024 -224940 21793 16025 -70141 -33517 9054 -313500
8998A49220O8758F2009a00301k24037B1505J74308e5184m6070d2296l27156h5192
$$ 149220 217978 62009 -100301 -324338 21505 195813 -55184 -101254 -42296 -369452 -85192
8986C9079R3606J39083a62554A40437E1267Q3251i6087a3913j12967j6990j56669
$$ 39079 132685 271768 -162554 140437 51267 134518 -96087 -13913 -126880 -143870 -300539
8975c00539h6341k79868B47807a0329B22475E8905M4638L38a57358l175A43009
$$ -300539 -86341 -366209 247807 -10329 222475 58905 103543 103881 -157358 -160533 143009
8963a05771A80933c35014a51305p2996h9205k24876a30226f4479k4448A08026
$$ -105771 180933 -335014 -151305 -224301 -89205 -314081 -130226 -64479 -88927 108026
8952a34039k06505b4983j03773C87064o3156B5400R6229G396J91987j6803a29074
$$ -134039 -340544 -24983 -128756 387064 323908 25400 121629 7396 199383 182580 -129074
8940b21645A0064f7158o95j52847B8564F873L76081a409j07875c8426j66887A21883
$$ -221645 10064 -67158 -67853 -220700 28564 6873 382954 -1409 -109284 -38426 -205313 121883
8927b68982c7158B07671C0813b324F5229j155K132C2518N84762M14191C03286
$$ -268982 -37158 207671 30813 -2324 65229 64074 66206 32518 617280 1031471 303286
8915b12282b3911l02075A69199a44611k0212j36867O5223g9885q3607K1791j62979
$$ -212282 -23911 -325986 169199 -144611 -164823 -301690 -236467 -79885 -163492 -141701 -304680
8904c04680a02868G936c57658g5439q0706B19684E9014I832a64830e6319j57412
$$ -304680 -102868 7936 -357658 -75439 -156145 219684 59014 9832 -164830 -56319 -213731
8893b13731B52876q3199a54741B7388K14813a58435A39679a21252C31798C9625
$$ -213731 252876 169677 -154741 27388 242201 -158435 139679 -121252 331798 39625
8882h0476k95047n8976A5066h8704j65051H6745j1801b94805A97485g3944r150
$$ -80476 -375523 -434499 15066 -88704 -253755 86745 74944 -294805 197485 -73944 -83094
8871h3094p8665N2577E8943b87297g8934D5660J45375F7789a46822B40802m9728
$$ -83094 -161759 -109182 58943 -287297 -78934 45660 191035 67789 -146822 240802 191074
8860A91074a11578N3805B49150a26086a8394m34081d0592k75269b6570J1771D18938
$$ 191074 -111578 -57773 249150 -126086 -18394 -452475 -40592 -315861 -26570 -14799 418938
$$ [...]
##END NTUPLES=NMR SPECTRUM
##END=
