##TITLE=NES1004_878015019_9232700_nB64FBqrWS
##JCAMPDX= 6.0         $$ Bruker NMR JCAMP-DX V2.0
##DATA TYPE= NMR SPECTRUM
##DATA CLASS= NTUPLES
##ORIGIN= BRUKER
##OWNER= Administrator
$$ 1.72 TOPSPIN		Version 2.1
$$ 2015-07-01 20:28:32.352 -0700  Administrator@X
$$ Compression mode = diff/dup
##.OBSERVE FREQUENCY= 400.02188249412
##.OBSERVE NUCLEUS= ^1H
##.ACQUISITION MODE= SIMULTANEOUS (DQD)
##.ACQUISITION SCHEME= undefined
##.AVERAGES= 64
##.DIGITISER RES= 22
##SPECTROMETER/DATA SYSTEM= spect
##.PULSE SEQUENCE= noesygpps1d.comp
##.SOLVENT NAME= COFFEE_meoh
##.SHIFT REFERENCE= INTERNAL, COFFEE_meoh, 1, 14.96282
##AUDIT TRAIL= $$ (NUMBER, WHEN, WHO, WHERE, PROCESS, VERSION, WHAT)
$$ ##TITLE= Audit trail, TOPSPIN		Version 2.1
$$ ##JCAMPDX= 5.01
$$ ##ORIGIN= Bruker BioSpin GmbH
$$ ##OWNER= Administrator
$$ $$ E:\/data/COFFEE/nmr/NES1004_878015019_9232700_nB64FBqrWS/22/pdata/1/auditp.txt
$$ ##AUDIT TRAIL=  $$ (NUMBER, WHEN, WHO, WHERE, PROCESS, VERSION, WHAT)
(   1,<2015-07-01 20:28:27.117 -0700>,<Administrator>,<X>,<go>,<TOPSPIN 2.1>,
      <created by zg
	started at 2015-07-01 20:16:57.461 -0700,
	POWCHK enabled, PULCHK disabled,
       configuration hash MD5:
       21 0F 79 D6 B3 7B B4 F6 88 20 88 DB 03 48 BD 9F
       data hash MD5: 64K
       3E 4A BD 91 69 3F 72 04 42 30 11 32 4E C0 CA 11>)
(   2,<2015-07-01 20:28:30.289 -0700>,<Administrator>,<X>,<proc1d>,<TOPSPIN 2.1>,
      <Start of raw data processing
       efp LB = 0.3 FT_mod = 6 PKNL = 1 PHC0 = 0 PHC1 = 0 SI = 128K 
       data hash MD5: 128K
       7C D1 79 6D 8F 62 5B AB 85 09 D6 66 F2 FE 58 C4>)
(   3,<2015-07-01 20:28:31.149 -0700>,<Administrator>,<X>,<proc1d>,<TOPSPIN 2.1>,
      <pk PHC0 = -81.2439 PHC1 = 0 
       data hash MD5: 128K
       79 07 15 80 46 8E 2F 0C 90 7E 33 20 4F 57 BF 28>)
(   4,<2015-07-01 20:28:31.524 -0700>,<Administrator>,<X>,<proc1d>,<TOPSPIN 2.1>,
      <abs ABSG = 1 
       data hash MD5: 128K
       49 D9 1E 85 0D DF C8 6C F5 D3 7C 15 92 6A 83 05>)
(   5,<2015-07-01 20:28:31.617 -0700>,<Administrator>,<X>,<proc1d>,<TOPSPIN 2.1>,
      <abs ABSG = 2 
       data hash MD5: 128K
       C7 9E 12 F9 CE D7 4C 1C 79 AF B8 FD 35 5D 12 A5>)
(   6,<2015-07-01 20:28:31.695 -0700>,<Administrator>,<X>,<proc1d>,<TOPSPIN 2.1>,
      <abs ABSG = 3 
       data hash MD5: 128K
       42 DA A8 0D 15 7B 96 C0 1D F6 B5 2E 36 9D 57 4D>)
(   7,<2015-07-01 20:28:31.789 -0700>,<Administrator>,<X>,<proc1d>,<TOPSPIN 2.1>,
      <abs ABSG = 4 
       data hash MD5: 128K
       2F 4C FF 4C DB FE 7D FA 0D BC E2 B2 21 4D F7 63>)
(   8,<2015-07-01 20:28:31.883 -0700>,<Administrator>,<X>,<proc1d>,<TOPSPIN 2.1>,
      <abs ABSG = 5 
       data hash MD5: 128K
       A4 C5 E1 1E 7C 7C F3 35 C3 AB 36 9D 21 CE E3 C3>)
$$ ##END=
$$ 
$$ $$ hash MD5
$$ $$ 92 24 56 36 33 1A 6D 2C 07 D2 A6 5D CF A1 69 44
##$RELAX= 
##$RELAX= 
##$RELAX= 
##$RELAX= 
##$RELAX= 
##$RELAX= 
##$RELAX= 
##$RELAX= 
$$ Bruker specific parameters
$$ --------------------------
##$DU= <E:\>
##$EXPNO= 22
$$ [...]
##$TP07= 0
##$TPNAME0= <>
##$TPNAME1= <>
##$TPNAME2= <>
##$TPNAME3= <>
##$TPNAME4= <>
##$TPNAME5= <>
##$TPNAME6= <>
##$TPNAME7= <>
##$TPOAL= (0..7)
0.5 0.5 0.5 0.5 0.5 0.5 0.5 0.5
##$TPOFFS= (0..7)
0 0 0 0 0 0 0 0
##$TUNHIN= 0
##$TUNHOUT= 0
##$TUNXOUT= 0
##$USERA1= <user>
##$USERA2= <user>
##$USERA3= <user>
##$USERA4= <user>
##$USERA5= <user>
##$V9= 5
##$VALIST= <valist>
##$VCLIST= <CCCCCCCCCCCCCCC>
##$VD= 0
##$VDLIST= <DDDDDDDDDDDDDDD>
##$VPLIST= <PPPPPPPPPPPPPPP>
##$VTLIST= <TTTTTTTTTTTTTTT>
##$WBST= 2048
##$WBSW= 25
##$XGAIN= (0..3)
0 0 0 0
##$XL= 0
##$YL= 0
##$YMAX_a= 6255750
##$YMIN_a= -12522805
##$ZGOPTNS= <>
##$ZL1= 120
##$ZL2= 120
##$ZL3= 120
##$ZL4= 120
##$ABSF1= 14.96282
##$ABSF2= -5.595362
##$ABSG= 5
##$ABSL= 3
##$ALPHA= 0
##$AQORDER= 0
##$ASSFAC= 0
##$ASSFACI= 0
##$ASSFACX= 0
##$ASSWID= 0
##$AUNMP= <proc_prof1d_extract.lims>
##$AXLEFT= 0
##$AXNAME= <>
##$AXNUC= <1H>
##$AXRIGHT= 0
##$AXTYPE= 0
##$AXUNIT= <>
##$AZFE= 0.1
##$AZFW= 0.1
##$BCFW= 0
##$BC_mod= 0
##$BYTORDP= 0
##$COROFFS= 0
##$CY= 15
##$DATMOD= 1
##$DC= 0
##$DFILT= <>
##$DTYPP= 0
##$F1P= 0
##$F2P= 0
##$FCOR= 0.5
##$FTSIZE= 131072
##$FT_mod= 6
##$GAMMA= 0
##$GB= 0
##$INTBC= 1
##$INTSCL= 1
##$ISEN= 128
##$LB= 0.3
##$LEV0= 0
##$LPBIN= 0
##$MAXI= 10000
##$MC2= 0
##$MEAN= 0
##$ME_mod= 0
##$MI= 0
##$NCOEF= 0
##$NC_proc= -2
##$NLEV= 6
##$NOISF1= 0
##$NOISF2= 0
##$NSP= 0
##$NTH_PI= 0
##$NZP= 0
##$OFFSET= 14.96282
##$PC= 1
##$PHC0= -81.2439
##$PHC1= 0
##$PH_mod= 1
##$PKNL= yes
##$PPARMOD= 0
##$PPDIAG= 0
##$PPIPTYP= 0
##$PPMPNUM= 2147483647
##$PPRESOL= 1
##$PSCAL= 4
##$PSIGN= 0
##$PYNMP= <proc.py>
##$REVERSE= no
##$SF= 400.020008908342
##$SI= 131072
##$SIGF1= 0
##$SIGF2= 0
##$SINO= 400
##$SIOLD= 131072
##$SPECTYP= <>
##$SREGLST= <1H.CDCl3>
##$SSB= 0
##$STSI= 131072
##$STSR= 0
##$SW_p= 8223.68421052631
##$SYMM= 0
##$S_DEV= 0
##$TDeff= 65536
##$TDoff= 0
##$TI= <>
##$TILT= no
##$TM1= 0
##$TM2= 0
##$TOPLEV= 0
##$USERP1= <user>
##$USERP2= <user>
##$USERP3= <user>
##$USERP4= <user>
##$USERP5= <user>
##$WDW= 1
##$XDIM= 131072
##$YMAX_p= 361795134
##$YMIN_p= -11861
##$CURPLOT= <Network HP LaserJet P1505>
##$CURPRIN= <$Network HP LaserJet P1505>
##$DFORMAT= <normdp>
##$LAYOUT= <+/1D_H.xwp>
##$LFORMAT= <normlp>
##$PFORMAT= <normpl>
##$SURQMSG= 1
$$ End of Bruker specific parameters
$$ ---------------------------------
##NTUPLES= NMR SPECTRUM
##VAR_NAME=  FREQUENCY,     SPECTRUM/REAL,   SPECTRUM/IMAG
##SYMBOL=    X,             R,               I
##VAR_TYPE=  INDEPENDENT,   DEPENDENT,       DEPENDENT
##VAR_FORM=  AFFN,          ASDF,            ASDF
##VAR_DIM=   131072,        131072,          131072
##UNITS=     HZ,            ARBITRARY UNITS, ARBITRARY UNITS
##FACTOR=    0.0627417313425164, 1,          1
##FIRST=     8223.62146879497, 887,          -43761
##LAST=      0,             3489,            -43819
##MIN=       0,             -11861,          0
##MAX=       8223.62146879497, 361795134,    0
$$ Real data points
##PAGE= N=1
##DATA TABLE= (X++(R..R)), XYDATA
$$ [...]
$$ plain form
63473 257490 260124 263136 266318 269524 272520 274732 275566 275132 274372 274228 274829 275642 276239 276639 277010 277405 277946
63456 277946 279113 281570 285633 291105 297735 305662 315095 325632 336367 346945 358140 371019 385738
63443 385738 401578 417856 434109 449413 462338 471952 478454 482485 484264 483805 481603 478579 475485
63430 475485 472682 470311 468305 466331 464035 461249 457684 452712 445934 437791 429131 420183 410421 399434
63416 399434 387432 374871 362128 349797 338810 329843 322795 317116 312476 308880 306216 304073 302038
63403 302038 300102 298650 298021 298157 298810 300091 302460 305984 310052 314259 319219 325852 333980 342498 351027
63388 351027 360562 372102 385404 399647 414683 430789 447477 463350 477096 488098 496161 501238
63376 501238 503534 503454 501362 497686 493134 488416 483844 479666 476608 475379 475562 475684 474689 472802 470632
$$ packed form
63473B57490K634L012L182L206K996K212Q34m34p60j44O01Q13N97M00L71L95N41
63456B77946J167K457M063N472O630P927R433J0537J0735J0578J1195J2879J4719
63443C85738J5840J6278J6253J5304J2925R614O502M031J779m59k202l024l094
63430D75485k803k371k006j974k296k786l565m972o778q143q660q948r762j0987
63416C99434j2002j2561j2743j2331j0987q967p048n679m640l596k664k143k035
63403C02038j936j452o29J36O53J281K369L524M068M207M960O633Q128Q518Q529
63388C51027R535J1540J3302J4243J5036J6106J6688J5873J3746J1002Q063N077
63376E01238K296q0k092l676m552m718m572m178l058j229J83J22r95j887k170
$$ plain form
63361 470632 467971 463980 458262 451256 443735 436293 429241 422650 416480 410801 405789 401433 397466 393742
63347 393742 390405 387446 384390 380731 376411 371538 365918 359363 352276 345382 338882 332359 325552 318739
63333 318739 312301 306339 300916 296178 291993 287844 283429 279138 275653 273230 271561 270170 268788 267535
63319 267535 266944 267518 269034 270539 271339 271835 273017 275262 277952 280171 281430 281730 281309 280450 279336 278002
63303 278002 276494 274968 273438 271619 269344 267049 265437 264579 263747 262236 260072 257773 255750 254128 252896
63288 252896 251998 251405 251238 251634 252423 253201 253915 255044 256895 258933 260183 260194 259364 258349 257484 256752 255997
63271 255997 255072 253934 252700 251510 250340 249133 248132 247897 248747 250286 251685 252643 253945 256767 261285
63256 261285 266286 270455 273786 277306 281571 286169 290781 295924 302081 308721 314943 320860 327638 336232
$$ packed form
63361D70632k661l991n718p006p521p442p052o591o170n679n012m356l967l724
63347C93742l337k959l056l659m320m873n620o555p087o894o500o523o807o813
63333C18739o438n962n423m738m185m149m415m291l485k423j669j391j382j253
63319B67535n91N74J516J505Q00M96J182K245K690K219J259L00m21q59j114j334
63303B78002j508j526j530j819k275k295j612q58q32j511k164k299k023j622j232
63288B52896q98n93j67L96P89P78P14J129J851K038J250J1q30j015q65p32p55
63271B55997r25j138j234j190j170j207j001k35Q50J539J399R58J302K822M518
63256B61285N001M169L331L520M265M598M612N143O157O640O222N917O778Q594
$$ plain form
63242 336232 346648 358456 371327 385005 399227 413963 429400 445581 462361 479726 497648
63231 497648 515554 532491 548123 563122 578218 593200 607328 620511 633640 647753 663141
63220 663141 679296 695508 711435 727055 742036 755322 765631 772343 775559 775269 770937 762155 749309
63207 749309 733275 714762 694291 672550 650340 628287 606916 586832 568486 551899 536993
63196 536993 524089 513689 505838 500180 496698 495927 498239 503198 509910 517862 527180 538113 550418
63183 550418 563405 576549 589975 604160 619134 634220 648655 662302 675564 688809 702127
63172 702127 715457 728617 741207 752747 762875 771195 777008 779545 778550 774409 767692 758704 747431
63159 747431 733606 716817 696946 674728 651724 629510 608864 589683 571531 554206 537945
$$ packed form
63242C36232J0416J1808J2871J3678J4222J4736J5437J6181J6780J7365J7922
63231D97648J7906J6937J5632J4999J5096J4982J4128J3183J3129J4113J5388
63220F63141J6155J6212J5927J5620J4981J3286J0309O712L216k90m332q782j2846
63207G49309j6034j8513k0471k1741k2210k2053k1371k0084j8346j6587j4906
63196E36993j2904j0400p851n658l482p71K312M959O712P952R318J0933J2305
63183E50418J2987J3144J3426J4185J4974J5086J4435J3647J3262J3245J3318
63172G02127J3330J3160J2590J1540J0128Q320N813K537r95m141o717q988j1273
63159G47431j3825j6789j9871k2218k3004k2214k0646j9181j8152j7325j6261
$$ plain form
63148 537945 523202 510217 498768 488378 478734 469838 461864 455038 449575 445491 442434 439847 437365
63135 437365 434942 432645 430500 428592 427087 426015 425090 423874 422167 420283 418860 418276 418230 418080 417636 417382
63119 417382 417823 418928 420401 422183 424339 426772 429483 432908 437423 442524 447040 450269 452505 454433
63105 454433 456465 458700 460992 462794 463358 462464 460776 459340 458885 459642 461398 463579 465646 467640 470020
63090 470020 472784 475185 476689 477847 479739 482748 486316 489834 493369 497399 502173 507499 513110 519045
63076 519045 525521 532354 538785 544171 548771 553475 558844 564948 572132 581186 592335 604616 616863
63063 616863 629064 642334 657792 675968 697001 720797 746974 775088 804981 836609 869654
63052 869654 903646 938382 973865 1009919 1046295 1083086 1120594 1158652 1196520 1233525 1269551
$$ packed form
63148E37945j4743j2985j1449j0390r644q896p974o826n463m084l057k587k482
63135D37365k423k297k145j908j505j072r25j216j707j884j423n84m6j50m44k54
63119D17382M41J105J473J782K156K433K711L425M515N101M516L229K236J928
63105D54433K032K235K292J802N64q94j688j436m55P57J756K181K067J994K380
63090D70020K764K401J504J158J892L009L568L518L535M030M774N326N611N935
63076E19045O476O833O431N386M600M704N369O104P184R054J1149J2281J2247
63063F16863J2201J3270J5458J8176K1033K3796K6177K8114K9893L1628L3045
63052H69654L3992L4736L5483L6054L6376L6791L7508L8058L7868L7005L6026
$$ plain form
63041 1269551 1304868 1339820 1374798 1410139 1445813 1481307 1515882 1548874 1579684 1607569 1631344
63030 1631344 1649121 1658604 1658117 1647552 1628176 1601503 1568418 1529248 1484312 1434473 1381401 1327287
63018 1327287 1274043 1222800 1174379 1129903 1090484 1056400 1027181 1002558 982816 968155 958282
63007 958282 952818 951562 954147 960020 969134 982100 999114 1019039 1040123 1061447 1083211 1105799
62995 1105799 1129084 1152637 1176146 1199491 1222716 1245889 1268747 1290505 1310271 1327618 1342380
62984 1342380 1353913 1360977 1362521 1358274 1348359 1332553 1310223 1280916 1244873 1203068 1156932 1108022
62972 1108022 1057783 1007438 957995 910149 864127 819785 777068 736432 698651 664228 633079
62961 633079 604855 579327 556393 535896 517683 501752 487963 475597 463579 451361 439383
$$ packed form
63041A269551L5317L4952L4978L5341L5674L5494L4575L2992L0810K7885K3775
63030A631344J7777R483m87j0565j9376k6673l3085l9170m4936m9839n3072n4114
63018A327287n3244n1243m8421m4476l9419l4084k9219k4623j9742j4661r873
63007I58282n464j256K585N873R114J2966J7014J9925K1084K1324K1764K2588
62995A105799K3285K3553K3509K3345K3225K3173K2858K1758J9766J7347J4762
62984A342380J1533P064J544m247r915j5806k2330k9307l6043m1805m6136m8910
62972A108022n0239n0345m9443m7846m6022m4342m2717m0636l7781l4423l1149
62961F33079k8224k5528k2934k0497j8213j5931j3789j2366j2018j2218j1978
$$ plain form
62950 439383 428441 418776 409981 401619 393602 386115 379444 373835 369167 364796 360102 355276 351234 348612
62936 348612 347043 345555 343480 340896 338354 336266 334390 331901 328240 323914 320166 317708 316050 314174
62922 314174 311561 308354 304945 301756 299233 297562 296442 295396 294293 293348 292678 292145 291571 290858 289916 288803
62906 288803 287974 288065 289218 290791 291872 292024 291403 290290 288709 286599 284193 281988 280272 278851 277374
62891 277374 275824 274469 273442 272653 272118 272005 272192 272110 271297 269972 268818 268340 268600 269384 270362 271235 271927
62874 271927 272604 273312 273836 274174 274950 276870 279769 282573 284351 285146 285679 286461 287372 287986 288179 288407 289291
62857 289291 290854 292339 293027 293124 293474 294440 295501 296079 296331 296793 297562 298281 298806 299480 300586 301864 302751
62840 302751 302975 302748 302437 302218 302084 301959 301789 301591 301592 302135 303233 304363 305046 305667 307278 310385 314297 317957
$$ packed form
62950D39383j0942r665q795q362q017p487o671n609m668m371m694m826m042k622
62936C48612j569j488k075k584k542k088j876k489l661m326l748k458j658j876
62922C14174k613l207l409l189k523j671j120j046j103r45o70n33n74p13r42j113
62906B88803q29R1J153J573J081J52o21j113j581k110k406k205j716j421j477
62891B77374j550j355j027p89n35j13J87q2q13j325j154m78K60P84R78Q73O92
62874B71927O77P08N24L38P76J920K899K804J778P95N33P82R11O14J93K28Q84
62857B89291J563J485O88R7L50R66J061N78K52M62P69P19N25O74J106J278Q87
62840C02751K24k27l11k19j34j25j70j98JN43J098J130O83O21J611L107L912L660
$$ plain form
62822 317957 321124 324287 327716 331157 334406 337642 341108 344937 349335 354379 359485 363656 366683 369691
62808 369691 374024 379887 386521 393450 400994 409615 419350 429975 441382 453691 467289 482734 500315
62795 500315 519739 540698 563757 590164 620604 654666 691879 732800 778516 829331 884542
62784 884542 943400 1005678 1071121 1138750 1206996 1274268 1339205 1400508 1456688 1505938 1546302
62773 1546302 1576181 1594757 1601891 1597745 1582711 1557541 1523097 1480068 1429482 1373486 1314814 1255080
62761 1255080 1194241 1132257 1070644 1011611 956094 903543 853521 806497 763014 722999 686238
62750 686238 652782 622514 594915 569654 546856 526445 507810 490566 474990 461205 448549
62739 448549 436533 425868 417605 411499 406181 400911 396244 392856 390560 388835 387624 387150 387371 388043
$$ packed form
62822C17957L167L163L429L441L249L236L466L829M398N044N106M171L027L008
62808C69691M333N863O634O929P544Q621R735J0625J1407J2309J3598J5445J7581
62795E00315J9424K0959K3059K6407L0440L4062L7213M0921M5716N0815N5211
62784H84542N8858O2278O5443O7629O8246O7272O4937O1303N6180M9250M0364
62773A546302K9879J8576P134m146j5034k5170l4444m3029n0586n5996n8672n9734
62761A255080o0839o1984o1613n9033n5517n2551n0022m7024m3483m0015l6761
62750F86238l3456l0268k7599k5261k2798k0411j8635j7244j5576j3785j2656
62739D48549j2016j0665q263o106n318n270m667l388k296j725j211m74K21O72
$$ plain form
62725 388043 389090 390648 392963 396403 401301 407651 415227 424096 434715 447386 461978 478322 496451
62712 496451 516312 537744 561087 587367 617388 650923 687242 726227 768405 814031 862658
62701 862658 913649 966467 1020206 1073158 1123261 1168907 1209130 1243101 1269705 1287764 1296577 1296127
62689 1296127 1286756 1268769 1242474 1208582 1168447 1123860 1076576 1027885 978423 928442 878453
62678 878453 829583 783139 739821 699581 662202 627669 595944 566759 539885 515405 493517
62667 493517 474241 457454 442890 429877 417419 404970 393013 382505 373763 366183 359005 351996
62655 351996 345367 339323 333867 328890 324278 319945 315795 311691 307600 303799 300761 298623 296914 295004
62641 295004 292694 290184 287625 285018 282472 280163 278040 275976 274274 273612 274237 275494 276488 277014 277575
$$ packed form
62725C88043J047J558K315L440M898O350P576Q869J0619J2671J4592J6344J8129
62712D96451J9861K1432K3343K6280L0021L3535L6319L8985M2178M5626M8627
62701H62658N0991N2818N3739N2952N0103M5646M0223L3971K6604J8059Q813m50
62689A296127r371j7987k6295l3892m0135m4587m7284m8691m9462m9981m9989
62678H78453m8870m6444m3318m0240l7379l4533l1725k9185k6874k4480k1888
62667D93517j9276j6787j4564j3013j2458j2449j1957j0508q742p580p178p009
62655C51996o629o044n456m977m612m333m150m104m091l801l038k138j709j910
62641B95004k310k510k559k607k546k309k123k064j702o62O25J257R94N26N61
$$ plain form
62626 277575 278612 280108 281906 284045 286569 289263 291832 294279 296911 299988 303576 307746 312725 318721
62612 318721 325707 333529 342151 351697 362334 374288 387891 403463 421210 441398 464526 490973
62600 490973 520407 551804 584212 617294 650996 684916 718106 749306 777223 800797 819399
62589 819399 832634 839891 840456 834303 822425 806017 785648 761725 735428 708348 681121 653160
62577 653160 624114 595050 567636 542537 519231 497256 476953 458795 442522 427389 413052
62566 413052 399783 387826 376890 366438 356271 346643 337964 330558 324516 319468 314515 308813 302390
62553 302390 296146 290892 286564 282624 278966 276058 274233 273125 271999 270492 268979 268204 268550 269699 271061
62538 271061 272497 274417 277145 280503 284198 288353 293374 299478 306701 315264 325567 337778 351709
$$ packed form
62626B77575J037J496J798K139K524K694K569K447K632L077L588M170M979N996
62612C18721O986P822Q622R546J0637J1954J3603J5572J7747K0188K3128K6447
62600D90973K9434L1397L2408L3082L3702L3920L3190L1200K7917K3574J8602
62589H19399J3235P257N65o153j1878j6408k0369k3923k6297k7080k7227k7961
62577F53160k9046k9064k7414k5099k3306k1975k0303j8158j6273j5133j4337
62566D13052j3269j1957j0936j0452j0167r628q679p406o042n048m953n702o423
62553C02390o244n254m328l940l658k908j825j108j126j507j513p75L46J149J362
62538B71061J436J920K728L358L695M155N021O104P223Q563J0303J2211J3931
$$ plain form
62525 351709 367140 384079 402692 423178 445694 470185 496249 523348 551150 579558 608384
62514 608384 637047 664506 689371 710347 726809 738824 746396 748929 745781 737137 723916 707020
62502 707020 687203 665484 642928 619881 596072 571671 547667 524868 503151 482185 462422
62491 462422 444784 429602 416434 404854 394916 386750 380073 374210 368523 362807 357337 352418 347866
62478 347866 343154 338171 333455 329456 325974 322726 320134 318990 319440 320847 322707 325142 328316 331832
62464 331832 335096 338049 341215 345106 349852 355386 361628 368319 374874 380714 385679 389859 392987 394456
62450 394456 394114 392604 390479 387350 382579 376567 370456 364563 358125 350966 344301 339084 334364 328529
62436 328529 321765 316004 312361 309804 306759 303180 300431 299668 300941 303478 306283 308611 310373 312158
$$ packed form
62525C51709J5431J6939J8613K0486K2516K4491K6064K7099K7802K8408K8826
62514F08384K8663K7459K4865K0976J6462J2015P572K533l148q644j3221j6896
62502G07020j9817k1719k2556k3047k3809k4401k4004k2799k1717k0966j9763
62491D62422j7638j5182j3168j1580r938q166o677n863n687n716n470m919m552
62478C47866m712m983m716l999l482l248k592j144M50J407J860K435L174L516
62464C31832L264K953L166L891M746N534O242O691O555N840M965M180L128J469
62450C94456l42j510k125l129m771o012o111n893o438p159o665n217m720n835
62436C28529o764n761l643k557l045l579k749p63J273K537K805K328J762J785
$$ plain form
62422 312158 314699 318334 323014 328578 334807 341370 347948 354399 360761 367276 374426 382727 392284 402606
62408 402606 412916 422517 430987 438411 445517 453077 460837 467313 471080 472203 472072 471982 472114 471737 469947
62393 469947 466206 460713 454573 449345 446104 444931 445383 447233 450521 455062 460425 466568 474239 484421
62379 484421 497434 512838 530224 549828 572332 598238 627492 659498 693344 728189 763559
62368 763559 799082 833849 866359 895391 920657 942290 960014 973379 982749 989321 993852 995702
62356 995702 993419 986036 973662 957150 937528 915599 891786 866292 839482 812058 784833 758505
62344 758505 733636 710568 689220 669164 650163 632525 616821 603265 591404 580293 568986
62333 568986 557085 544982 533571 523721 516028 510774 507684 505766 503915 501913 500547 500632 502183 504587
$$ packed form
62422C12158K541L635M680N564O229O563O578O451O362O515P150Q301R557J0322
62408D02606J0310R601Q470P424P106P560P760O476L767J123j31r0J32l77j790
62393D69947l741n493o140n228l241j173M52J850L288M541N363O143P671J0182
62379D84421J3013J5404J7386J9604K2504K5906K9254L2006L3846L4845L5370
62368G63559L5523L4767L2510K9032K5266K1633J7724J3365R370O572M531J850
62356I95702k283p383j2374j6512j9622k1929k3813k5494k6810k7424k7225k6328
62344G58505k4869k3068k1348k0056j9001j7638j5704j3556j1861j1111j1307
62333E68986j1901j2103j1411r850p693n254l090j918j851k002j366Q5J551K404
$$ plain form
62319 504587 507155 509332 510888 512266 514294 517141 519848 521313 521435 520901 520156 519088 517473 515146 511874
62304 511874 507617 502883 498331 494088 489918 485984 482886 480903 479725 479012 478786 479209 480407 482499 485296
62289 485296 487982 489745 490901 492792 496322 501126 506453 512249 518996 527027 536473 547422 559667 572840
62275 572840 587363 604770 626267 651221 677905 705533 734623 765333 796407 826183 853835
62264 853835 879042 901032 918768 931912 940956 946378 948174 946389 941635 934724 925860 914452 899816
62251 899816 882056 862292 842103 822757 804819 788314 773137 759377 747358 737377 729386 723026
62239 723026 718030 714536 712836 712871 714103 715888 717838 719856 722019 724488 727356 730517 733801 737269 741239
62224 741239 745889 751025 756391 762055 768280 775077 782119 789121 796140 803417 810988 818526 825512 831622
$$ packed form
62319E04587K568K177J556J378K028K847K707J465J22n34p45j068j615k327l272
62304E11874m257m734m552m243m170l934l098j983j178p13k26M23J198K092K797
62289D85296K686J763J156J891L530M804N327N796O747Q031R446J0949J2245J3173
62275E72840J4523J7407K1497K4954K6684K7628K9090L0710L1074K9776K7652
62264H53835K5207K1990J7736J3144R044N422J796j785m754o911q864j1408j4636
62251H99816j7760j9764k0189j9346j7938j6505j5177j3760j2019r981p991o360
62239G23026m996l494j700L5J232J785J950K018K163K469K868L161L284L468L970
62224G41239M650N136N366N664O225O797P042P002P019P277P571P538O986O110
$$ plain form
62210 831622 837076 842601 848919 856213 864205 872692 881783 891554 901727 911938 922158 932570 943198
62197 943198 953971 965166 977331 990543 1004020 1016735 1028333 1039318 1050520 1062609 1075905
62186 1075905 1090332 1105557 1121484 1138602 1157543 1178309 1200253 1222937 1246656 1271865 1298248
62175 1298248 1324495 1348904 1370141 1387707 1401932 1413467 1422703 1429830 1435436 1440502 1445385 1449165
62163 1449165 1450680 1450065 1448603 1446985 1444493 1440335 1435112 1430286 1426601 1423850 1422067 1421985 1423990 1427386 1431258
62148 1431258 1435575 1440750 1446386 1451305 1454914 1457848 1460899 1463834 1465807 1466660 1467217 1468258 1469662 1470812
62134 1470812 1471541 1472353 1473710 1475344 1476446 1476572 1476264 1476609 1478160 1480439 1482585 1484227 1485517 1486502 1486847 1486251
62118 1486251 1484821 1482941 1480949 1479027 1477204 1475339 1473288 1471171 1469329 1467956 1466901 1465922 1464954 1464000 1463006
$$ packed form
62210H31622N454N525O318P294P992Q487R091R771J0173J0211J0220J0412J0628
62197I43198J0773J1195J2165J3212J3477J2715J1598J0985J1202J2089J3296
62186A075905J4427J5225J5927J7118J8941K0766K1944K2684K3719K5209K6383
62175A298248K6247K4409K1237J7566J4225J1535R236P127N606N066M883L780
62163A449165J515o15j462j618k492m158n223m826l685k751j783q2K005L396L872
62148A431258M317N175N636M919L609K934L051K935J973Q53N57J041J404J150
62134A470812P29Q12J357J634J102J26l08L45J551K279K146J642J290R85L45n96
62118A486251j430j880j992j922j823j865k051k117j842j373j055r79r68r54r94
$$ plain form
62103 1463006 1462013 1461325 1461274 1461869 1462804 1463796 1464824 1466101 1467860 1470102 1472511 1474718 1476715 1478850 1481355 1484052
62087 1484052 1486650 1489121 1491633 1494254 1496922 1499648 1502577 1505928 1509890 1514379 1518816 1522387 1524629 1525486
62073 1525486 1524643 1521209 1514386 1504154 1490988 1475320 1457728 1439248 1420701 1401824 1381727 1360170
62061 1360170 1337730 1314749 1290969 1266340 1241404 1216524 1191544 1166735 1143338 1122434 1103685
62050 1103685 1085890 1068513 1052021 1036948 1023340 1011043 999843 989263 978783 968457 958902
62039 958902 950575 943376 936923 930767 924326 917160 909575 902462 896220 890127 883103 874865 866044 857321
62025 857321 848808 840224 831474 822974 815496 809598 805127 801329 797473 793299 788930 784630 780690 777268
62011 777268 774106 770632 766563 762214 757998 753811 749206 744011 738378 732319 725695 718737 712103 706090
$$ packed form
62103A463006r93o88n1N95R35R92J028J277J759K242K409K207J997K135K505K697
62087A484052K598K471K512K621K668K726K929L351L962M489M437L571K242Q57
62073A525486q43l434o823j0232j3166j5668j7592j8480j8547j8877k0097k1557
62061A360170k2440k2981k3780k4629k4936k4880k4980k4809k3397k0904j8749
62050A103685j7795j7377j6492j5073j3608j2297j1200j0580j0480j0326r555
62039I58902q327p199o453o156o441p166p585p113o242o093p024q238q821q723
62025H57321q513q584q750q500p478n898m471l798l856m174m369m300l940l422
62011G77268l162l474m069m349m216m187m605n195n633o059o624o958o634o013
$$ plain form
61997 706090 700165 693654 686768 680469 675313 670818 666100 660830 655336 650061 645240 641009 637462 634534
61983 634534 632074 630145 629019 628778 629095 629605 630353 631670 633681 636229 639272 643069 647739 652798 657427
61968 657427 661324 665239 670479 677771 686583 695615 704039 712262 721451 732414 744994 758545 772817
61955 772817 788309 805787 825568 847323 870497 894814 920299 946949 974560 1002973 1032401
61944 1032401 1063418 1096615 1132170 1169660 1208332 1247763 1288244 1330312 1373890 1418296 1463317
61933 1463317 1509939 1559619 1613059 1670257 1731728 1799025 1873804 1956842 2048436 2149460 2261509
61922 2261509 2385986 2523436 2673865 2837441 3014775 3206670 3413614 3635228 3869979
61913 3869979 4115470 4369037 4627814 4887866 5143260 5386223 5608230 5800857 5955925
$$ packed form
61997G06090n925o511o886o299n156m495m718n270n494n275m821m231l547k928
61983F34534k460j929j126k41L17N10P48J317K011K548L043L797M670N059M629
61968F57427L897L915N240P292Q812R032Q424Q223R189J0963J2580J3551J4272
61955G72817J5492J7478J9781K1755K3174K4317K5485K6650K7611K8413K9428
61944A032401L1017L3197L5555L7490L8672L9431M0481M2068M3578M4406M5021
61933A463317M6622M9680N3440N7198O1471O7297P4779Q3038R1594J01024J12049
61922B261509J24477J37450J50429J63576J77334J91895K06944K21614K34751
61913C869979K45491K53567K58777K60052K55394K42963K22007J92627J55068
$$ plain form
61904 5955925 6065848 6124949 6130903 6084832 5990089 5851299 5674434 5466970 5237101 4992544
61894 4992544 4740038 4485416 4233484 3987740 3750718 3524764 3312135 3114221 2931017
61885 2931017 2761683 2605432 2461713 2329812 2208730 2097557 1995807 1903317 1819889 1744989
61875 1744989 1677771 1617405 1563350 1515156 1472106 1433328 1398442 1367840 1342079 1321147 1304464
61864 1304464 1291407 1281541 1274477 1269897 1267787 1268336 1271435 1276416 1282421 1288916 1295711 1302511 1308586 1313063
61850 1313063 1315644 1316971 1318020 1319041 1319307 1318132 1315959 1314162 1313897 1315467 1318720 1323486 1329392 1335702
61836 1335702 1341775 1347551 1353219 1358500 1362583 1364851 1365437 1365067 1364579 1364619 1365476 1367033 1369039 1371602 1375325
61821 1375325 1380849 1388511 1398636 1411867 1428692 1448737 1471170 1496076 1524839 1558668 1597146 1638953
$$ packed form
61904E955925J09923N9101N954m6071r4743j38790j76865k07464k29869k44557
61894D992544k52506k54622k51932k45744k37022k25954k12629j97914j83204
61885B931017j69334j56251j43719j31901j21082j11173j01750r2490q3428p4900
61875A744989o7218o0366n4055m8194m3050l8778l4886l0602k5761k0932j6683
61864A304464j3057r866p064m580k110N49L099M981O005O495O795O800O075M477
61850A313063K581J327J049J021K66j175k173j797k65J570L253M766N906O310
61836A335702O073N776N668N281M083K268N86l70m88M0Q57J557K006K563L723
61821A375325N524P662J0125J3231J6825K0045K2433K4906K8763L3829L8478M1807
$$ plain form
61809 1638953 1683936 1733572 1789135 1850141 1915268 1984391 2059011 2140783 2230333 2327648 2433047
61798 2433047 2547441 2671992 2807919 2956437 3118621 3295478 3488439 3699643 3931368
61789 3931368 4185136 4461633 4761506 5085879 5435900 5811838 6212646 6635916 7077639
61780 7077639 7531774 7990154 8442747 8877677 9280942 9636716 9929011 10144059 10272029
61771 10272029 10307540 10249657 10101940 9872297 9572155 9215096 8815414 8386917 7942082 7491710
61761 7491710 7044920 6609044 6189322 5789014 5410212 5054623 4723460 4416815 4133607
61752 4133607 3872290 3631427 3409585 3205201 3016905 2843840 2685276 2539917 2405880
61743 2405880 2281556 2166383 2060621 1964333 1876634 1795914 1720790 1650747 1585914 1526325 1471513
$$ packed form
61809A638953M4983M9636N5563O1006O5127O9123P4620Q1772Q9550R7315J05399
61798B433047J14394J24551J35927J48518J62184J76857J92961K11204K31725
61789C931368K53768K76497K99873L24373L50021L75938M00808M23270M41723
61780G077639M54135M58380M52593M34930M03265L55774K92295K15048J27970
61771A0272029L5511n7883j47717k29643l00142l57059l99682m28497m44835m50372
61761G491710m46790m35876m19722m00308l78802l55589l31163l06645k83208
61752D133607k61317k40863k21842k04384j88296j73065j58564j45359j34037
61743B405880j24324j15173j05762r6288q7699q0720p5124p0043o4833n9589n4812
$$ plain form
61732 1471513 1420708 1373274 1328915 1287595 1249290 1213767 1180597 1149477 1120460 1093709 1069004
61721 1069004 1045744 1023489 1002260 982191 963046 944378 926058 908390 891607 875467 859441
61710 859441 843285 827341 812225 798216 785021 772242 759999 748812 738821 729416 719906 710306
61698 710306 701156 692666 684516 676496 668825 661580 654182 645917 636893 628120 620515 614030 607756 600757
61684 600757 592834 584637 577092 570538 564385 557681 550007 541757 533653 526234 519756 514206 509227 504328
61670 504328 499379 494660 490195 485450 480163 475213 471955 470647 470176 469473 468546 467720 466632 464713 462261
61655 462261 460169 458662 457137 455345 453857 453011 452090 450142 447210 444149 441498 439110 436801 434797 433432
61640 433432 432781 432695 432933 433174 433135 432801 432406 432117 431838 431297 430236 428647 426993 426072 426355 427457 428498 428954
$$ packed form
61732A471513n0805m7434m4359m1320l8305l5523l3170l1120k9017k6751k4705
61721A069004k3260k2255k1229k0069j9145j8668j8320j7668j6783j6140j6026
61710H59441j6156j5944j5116j4009j3195j2779j2243j1187r991r405r510r600
61698G10306r150q490q150q020p671p245p398q265r024q773p605o485o274o999
61684F00757p923q197p545o554o153o704p674q250q104p419o478n550m979m899
61670E04328m949m719m465m745n287m950l258j308m71p03r27q26j088j919k452
61655D62261k092j507j525j792j488q46r21j948k932l061k651k388k309k004j365
61640D33432o51q6K38K41l9l34l95k89k79n41j061j589j654r21K83J102J041M56
$$ plain form
61622 428954 428894 428494 427679 426315 424426 422109 419503 416914 414696 412897 411338 410069 409416 409428 409713 409972
61606 409972 410271 410493 410077 408759 407174 406098 405343 404082 402166 400421 399555 399427 399592 399994 400800 402002
61590 402002 403585 405730 408458 411289 413673 415648 417826 420820 424959 430351 436899 444289 452291 461097
61576 461097 471089 482255 494082 506088 518266 530903 544173 558061 572623 588140 604879 622715
61564 622715 641057 659230 676907 694089 710742 726701 741898 756419 770206 782979 794651
61553 794651 805649 816563 827639 838817 850068 861341 872362 882851 892959 903102 913251
61542 913251 922690 930579 936567 940804 943600 945251 945977 945883 945002 943459 941495 939308 936973 934507 931902
61527 931902 929166 926591 924913 924916 926801 930214 934942 941253 949451 959532 971553 986064 1003708 1024555
$$ packed form
61622D28954o0m00q15j364j889k317k606k589k218j799j559j269o53J2K85K59
61606D09972K99K22m16j318j585j076p55j261j916j745q66j28J65M02Q06J202
61590D02002J583K145K728K831K384J975K178K994M139N392O548P390Q002Q806
61576D61097R992J1166J1827J2006J2178J2637J3270J3888J4562J5517J6739J7836
61564F22715J8342J8173J7677J7182J6653J5959J5197J4521J3787J2773J1672
61553G94651J0998J0914J1076J1178J1251J1273J1021J0489J0108J0143J0149
61542I13251R439P889N988M237K796J651P26r4q81j543j964k187k335k466k605
61527I31902k736k575j678LJ885L413M728O311Q198J0081J2021J4511J7644K0847
$$ plain form
61513 1024555 1048167 1074381 1103703 1136903 1174380 1216007 1261513 1311062 1365579 1426493 1494954
61502 1494954 1571170 1654483 1744056 1839493 1940865 2048208 2160948 2277725 2396712 2515899
61492 2515899 2632897 2744608 2847573 2938801 3016083 3077459 3120940 3145296 3151008 3140039 3114710
61481 3114710 3077039 3029024 2972956 2911155 2845541 2777583 2708472 2639212 2570636 2503527 2438701
61470 2438701 2376888 2318474 2263423 2211581 2163200 2119097 2080114 2046510 2018167 1995303 1978419
61459 1978419 1967371 1961074 1958643 1960347 1966764 1977258 1990210 2004776 2021531 2041041 2062550 2084730
61447 2084730 2107291 2131152 2157215 2185536 2215710 2247507 2280909 2315832 2352066 2389336 2427224
61436 2427224 2464953 2501323 2534948 2564700 2590080 2611173 2628264 2641541 2651147 2657347 2660513 2661040
$$ packed form
61513A024555K3612K6214K9322L3200L7477M1627M5506M9549N4517O0914O8461
61502A494954P6216Q3313Q9573R5437J01372J07343J12740J16777J18987J19187
61492B515899J16998J11711J02965R1228P7282O1376M3481K4356N712j0969k5329
61481C114710l7671m8015n6068o1801o5614o7958o9111o9260o8576o7109o4826
61470B438701o1813n8414n5051n1842m8381m4103l8983l3604k8343k2864j6884
61459A978419j1048o297k431J704O417J0494J2952J4566J6755J9510K1509K2180
61447B084730K2561K3861K6063K8321L0174L1797L3402L4923L6234L7270L7888
61436B427224L7729L6370L3625K9752K5380K1093J7091J3277R606O200L166N27
$$ plain form
61424 2661040 2659338 2655745 2650286 2642620 2632575 2620844 2608983 2598422 2589365 2580680 2570830 2558756 2543959
61411 2543959 2526154 2505325 2482103 2457743 2433556 2410557 2389566 2371127 2355066 2340572 2327153
61400 2327153 2315193 2305160 2296631 2288733 2281352 2275156 2270427 2266685 2263703 2262269 2263503 2268007 2276083
61387 2276083 2288366 2305693 2328622 2357564 2393230 2436494 2487928 2547886 2616981 2696005 2785223
61376 2785223 2883917 2990731 3104473 3224658 3351223 3483378 3618520 3752407 3880474 3998706
61366 3998706 4103312 4190317 4256268 4299235 4318829 4315511 4290399 4245505 4183375 4106261 4015916
61355 4015916 3914121 3802967 3684605 3561183 3435087 3308742 3183956 3061755 2942964
61346 2942964 2828605 2719581 2616345 2519115 2428229 2344105 2267070 2197354 2135051 2079990 2031846
$$ packed form
61424B661040j702l593n459p666j0045j1731j1861j0561r057q685r850j2074j4797
61411B543959j7805k0829k3222k4360k4187k2999k0991j8439j6061j4494j3419
61400B327153j1960j0033q529p898p381o196m729l742k982j434J234M504Q076
61387B276083J2283J7327K2929K8942L5666M3264N1434N9958O9095P9024Q9218
61376B785223R8694J06814J13742J20185J26565J32155J35142J33887J28067J18232
61366C998706J04606Q7005O5951M2967J9594l318k5112m4894o2130p7114r0345
61355D015916j01795j11154j18362j23422j26096j26345j24786j22201j18791
61346B942964j14359j09024j03236r7230r0886q4124p7035o9716o2303n5061m8144
$$ plain form
61335 2031846 1990540 1956316 1929320 1909291 1895739 1888183 1886081 1888804 1895961 1907678 1924367 1946119
61323 1946119 1972229 2001002 2030013 2056837 2079811 2098178 2111693 2120420 2124909 2126174 2125309 2123299
61311 2123299 2121184 2119913 2119792 2120494 2121897 2124482 2128487 2133064 2136981 2140062 2143250 2147152 2151079 2153807
61297 2153807 2154822 2154390 2152701 2149501 2144557 2138034 2130140 2120589 2108739 2094267 2077511 2059056 2039221
61284 2039221 2018241 1996883 1976533 1958489 1943305 1930872 1920860 1912715 1905309 1896936 1885956 1871516
61272 1871516 1853714 1833188 1810646 1786781 1762532 1739159 1717778 1698790 1682029 1667553 1656025
61261 1656025 1648126 1643821 1642574 1644210 1649218 1658133 1670858 1686766 1705341 1726643 1751334 1780389
61249 1780389 1814757 1855125 1901788 1954619 2013111 2076595 2144479 2216063 2289878 2363283 2432918
$$ packed form
61335B031846m1306l4224k6996k0029j3552p556k102K723P157J1717J6689K1752
61323A946119K6110K8773K9011K6824K2974J8367J3515Q727M489J265q65k010
61311B123299k115j271j21P02J403K585M005M577L917L081L188L902L927K728
61297B153807J015m32j689l200m944o523p894r551j1850j4472j6756j8455j9835
61284B039221k0980k1358k0350j8044j5184j2433j0012q145p406q373j0980j4440
61272A871516j7802k0526k2542k3865k4249k3373k1381j8988j6761j4476j1528
61261A656025p899m305j247J636N008Q915J2725J5908J8575K1302K4691K9055
61249A780389L4368M0368M6663N2831N8492O3484O7884P1584P3815P3405O9635
$$ plain form
61238 2432918 2495546 2548362 2588873 2615223 2626951 2624928 2610148 2582797 2542896 2491538 2430876
61227 2430876 2362957 2289330 2212016 2134160 2059034 1988594 1923476 1864117 1811135 1764499 1723040
61216 1723040 1685153 1649730 1616181 1584084 1553313 1524205 1496922 1470600 1443640 1414949 1384605
61205 1384605 1353287 1321697 1290859 1262396 1237704 1216722 1197980 1180051 1162694 1146400 1131153
61194 1131153 1116044 1100182 1083662 1067469 1052506 1038889 1026149 1013849 1001875 990305 979262
61183 979262 968912 959432 950856 943050 935876 929300 923325 917930 913209 909583 907791 908607 912447 919177
61169 919177 928327 939487 952344 966150 979181 988962 993198 990621 981244 966178 947280 926615
61157 926615 905839 885866 866933 848855 831312 814222 798002 783273 770192 758180 746377
$$ packed form
61238B432918O2628N2816M0511K6350J1728k023j4780k7351l9901n1358o0662
61227B430876o7919p3627p7314p7856p5126p0440o5118n9359n2982m6636m1459
61216A723040l7887l5423l3549l2097l0771k9108k7283k6322k6960k8691l0344
61205A384605l1318l1590l0838k8463k4692k0982j8742j7929j7357j6294j5247
61194A131153j5109j5862j6520j6193j4963j3617j2740j2300j1974j1570j1043
61183I79262j0350r480q576p806p174o576n975n395m721l626j792Q16L840O730
61169I19177R150J1160J2857J3806J3031R781M236k577r377j5066j8898k0665
61157I26615k0776j9973j8933j8078j7543j7090j6220j4729j3081j2012j1803
$$ plain form
61146 746377 734218 721533 708439 695388 683094 671969 661595 651032 639783 628334 617668
61135 617668 608375 600313 593033 586327 580337 575268 571243 568500 567480 568519 571582 576504 583251 591505
61121 591505 600013 606921 610914 611705 609320 603575 594679 583798 572326 560796 549087 537432 526493
61108 526493 516496 507081 498145 490052 482719 475230 466994 458785 451944 446700 441930 436503 430280 423708
61094 423708 416994 410054 403039 396568 391416 388039 386260 385319 384342 382964 381595 381051 381893 384042 386960
61079 386960 390114 393265 396407 399560 402734 406048 409756 414099 419200 425078 431658 438653 445568 452023
61065 452023 458099 464285 470923 477704 483782 488518 492130 495477 499172 503001 506275 508519 509624 509580 508484
61050 508484 506800 505139 503589 501634 498929 495818 492775 489678 486097 482091 478264 475105 472729 471216
$$ packed form
61146G46377j2159j2685j3094j3051j2294j1125j0374j0563j1249j1449j0666
61135F17668r293q062p280o706n990n069m025k743j020J039L063M922O747Q254
61121E91505Q508O908L993P91k385n745q896j0881j1472j1530j1709j1655j0939
61108E26493r997r415q936q093p333p489q236q209o841n244m770n427o223o572
61094D23708o714o940p015o471n152l377j779r41r77j378j369n44Q42K149K918
61079C86960L154L151L142L153L174L314L708M343N101N878O580O995O915O455
61065D52023O076O186O638O781O078M736L612L347L695L829L274K244J105m4j096
61050E08484j684j661j550j955k705l111l043l097l581m006l827l159k376j513
$$ plain form
61036 471216 470686 470908 471406 472248 474403 478899 485763 494034 502722 511596 521135 531950 544175 557285
61022 557285 570617 584191 598989 616407 637606 663376 694267 730676 773265 823908 886312
61011 886312 965337 1064932 1185196 1319192 1451636 1562366 1634704 1663511 1656863 1631043 1604015
61000 1604015 1591151 1601949 1636118 1681576 1718214 1726558 1695898 1627334 1531466 1423131 1315848
60989 1315848 1218226 1133492 1061451 1000775 950218 908876 875991 850492 830696 814687 801130
60978 801130 789569 779843 771430 763461 755158 746120 736313 725898 714945 703198 690262 676128 661448
60965 661448 647168 633894 621634 610074 599018 588564 578859 569766 560895 551997 543138 534380 525463
60952 525463 515999 505887 495441 485293 476349 469562 465360 463377 462973 463924 466346 470164 475061 480793
$$ packed form
61036D71216n30K22M98Q42K155M496O864Q271Q688Q874R539J0815J2225J3110
61022E57285J3332J3574J4798J7418K1199K5770L0891L6409M2589N0643O2404
61011H86312P9025R9595J20264J33996J32444J10730P2338K8807o648k5820k7028
61000A604015j2864J0798L4169M5458L6638Q344l0660o8564r5868j08335j07283
60989A315848r7622q4734p2041o0676n0557m1342l2885k5499j9796j6009j3557
60978H01130j1561r726q413p969q303r038r807j0415j0953j1747j2936j4134j4680
60965F61448j4280j3274j2260j1560j1056j0454r705r093q871q898q859q758q917
60952E25463r464j0112j0446j0148q944o787m202j983m04R51K422L818M897N732
$$ plain form
60938 480793 487118 493542 499655 505665 512021 518456 523927 527627 529559 530153 529935 529647 529902 530352 529896 528145
60922 528145 526055 524564 523198 520785 517134 513252 510055 507608 505593 503848 502239 500416 497940 494578
60908 494578 490488 486090 481523 476175 469164 460549 451621 443696 436988 430931 425059 419060 412583 405803
60894 405803 399806 395571 392717 390002 386857 383716 381035 378909 377616 377591 378715 380468 382938 386861 392450
60879 392450 399027 406125 414116 423371 433556 444258 455572 467464 479101 489464 498194 505340 510741
60866 510741 514271 516376 517827 519277 521461 525278 530855 536702 540563 541162 538754 534243 528442 522140
60852 522140 516163 511014 506700 502894 499019 494342 488453 481696 474771 467912 460803 453239 445475 437932
60838 437932 431017 425281 421240 418793 417106 415311 413138 410820 408694 407087 406267 406119 405927 404775 402298
$$ packed form
60938D80793O325O424O113O010O356O435N471L700J932N94k18k88K55M50m56j751
60922E28145k090j491j366k413l651l882l197k447k015j745j609j823k476l362
60908D94578m090m398m567n348p011q615q928p925o708o057n872n999o477o780
60894D05803n997m235k854k715l145l141k681k126j293k5J124J753K470L923N589
60879C92450O577P098P991R255J0185J0702J1314J1892J1637J0363Q730P146N401
60866E10741L530K105J451J450K184L817N577N847L861N99k408m511n801o302
60852E22140n977n149m314l806l875m677n889o757o925o859p109p564p764p543
60838D37932o915n736m041k447j687j795k173k318k126j607q20j48j92j152k477
$$ plain form
60823 402298 399050 396114 394336 393785 393805 393541 392516 390891 389307 388479 388711 389729 391003 392239 393481 394759
60807 394759 395937 396962 397983 399024 399822 400253 400780 402098 404390 407210 410086 412969 416016 419148 422009
60792 422009 424330 426224 428053 429935 431496 432325 432687 433435 435016 436862 438047 438353 438293 438197 437764 436666
60776 436666 435240 434280 434196 434557 434501 433594 432253 431326 431303 432014 432982 433809 434186 433932 433265 432846 433256 434468 435985
60757 435985 437334 438272 438638 438318 437301 435590 433108 429829 425896 421489 416731 411847 407174 402798 398353
60742 398353 393536 388643 384380 381264 379505 379240 380426 382596 385162 388003 391399 395360 399459 403411
60728 403411 407466 411949 416577 420460 422742 423230 422376 420611 417738 413200 407054 400305 394012 388355 382952
60713 382952 377747 372990 368517 363790 358752 354057 350220 347014 343967 341023 338373 335958 333502 330946
$$ packed form
60823D02298l248k936j778n51K0k64j025j625j584q28K32J018J274J236J242J278
60807C94759J178J025J021J041P98M31N27J318K292K820K876K883L047L132K861
60792D22009K321J894J829J882J561Q29L62P48J581J846J185L06o0r6m33j098
60776D36666j426r60q4L61n6r07j341r27k3P11R68Q27L77k54o67m19M10J212J517
60757D35985J349R38L66l20j017j711k482l279l933m407m758m884m673m376m445
60742C98353m817m893m263l116j759k65J186K170K566K841L396L961M099L952
60728D03411M055M483M628L883K282M88q54j765k873m538o146o749o293n657n403
60713C82952n205m757m473m727n038m695l837l206l047k944k650k415k456k556
$$ plain form
60699 330946 328573 326767 325783 325654 326187 327058 327917 328445 328537 328571 329241 330774 332511 333672 334367 335411 337224
60682 337224 339519 342000 344668 347323 349519 351338 353616 356939 360879 364644 368030 371316 374674 378250
60668 378250 382484 387680 393414 398974 404333 410161 416804 423866 431020 438777 447964 458469 468882 477654
60654 477654 484548 490655 496820 502379 505871 506796 506011 504371 501720 497627 492490 487314 482709 478698 475230
60639 475230 472295 469660 467043 464579 462602 460998 459197 456930 454570 452621 451146 449789 448092 445747
60625 445747 442837 439957 437874 436905 436730 436833 437004 437374 438139 439281 440537 441637 442602 443650 444734 445415
60609 445415 445370 444813 444121 443227 441804 439944 438259 437216 436684 436243 435671 435046 434534 434237 434176 434353 434792 435394
60591 435394 435807 435742 435486 435698 436440 436821 436050 434507 433277 432895 433122 433662 434349 434709 434221 433143 432399 432475
$$ packed form
60699C30946k373j806r84j29N33Q71Q59N28R2L4O70J533J737J161O95J044J813
60682C37224K295K481K668K655K196J819K278L323L940L765L386L286L358L576
60668C78250M234N196N734N560N359N828O643P062P154P757R187J0505J0413Q772
60654D77654O894O107O165N559L492R25p85j640k651m093n137n176m605m011l468
60639D75230k935k635k617k464j977j604j801k267k360j949j475j357j697k345
60625D45747k910k880k083r69j75J03J71L70P65J142J256J100R65J048J084O81
60609D45415m5n57o92q94j423j860j685j043n32m41n72o25n12k97o1J77M39O02
60591D35394M13o5k56K12P42L81p71j543j230l82K27N40O87L60m88j078p44P6
$$ plain form
60573 432475 433123 434285 436392 439303 441812 442992 443439 444392 445941 446972 446733 445712 444974 445229 446597 448682
60557 448682 450786 452510 454337 457231 461625 467205 473705 481373 490439 500628 511585 523539 537212
60544 537212 553178 571511 591907 613969 637508 662675 689521 717187 743682 766706 784528
60533 784528 795960 799889 795598 783801 766958 748131 729342 711011 692812 674928 658449 644621
60521 644621 633834 625468 618713 613312 609379 606787 605248 604983 606844 611433 618457 627323 638254 652314
60507 652314 670239 691655 715532 741033 767425 793338 816605 835110 847675 854138 854916 850863
60495 850863 843424 834495 825822 818577 813592 811810 814227 821465 833711 851161 874257 903326 938344
60482 938344 979426 1027368 1083341 1148086 1221889 1305407 1399933 1506247 1623030 1746222 1869426
$$ packed form
60573D32475O48J162K107K911K509J180M47R53J549J031k39j021p38K55J368K085
60557D48682K104J724J827K894M394N580O500P668R066J0189J0957J1954J3673
60544E37212J5966J8333K0396K2062K3539K5167K6846K7666K6495K3024J7822
60533G84528J1432L929m291j1797j6843j8827j8789j8331j8199j7884j6479j3828
60521F44621j0787q366o755n401l933k592j539k65J861M589P024Q866J0931J4060
60507F52314J7925K1416K3877K5501K6392K5913K3267J8505J2565O463P78m053
60495H50863p439q929q673p245m985j782K417P238J2246J7450K3096K9069L5018
60482I38344M1082M7942N5973O4745P3803Q3518R4526J06314J16783J23192J23204
$$ plain form
60471 1869426 1984596 2082878 2155899 2197226 2203248 2173375 2110069 2018865 1907705 1785344 1659503
60460 1659503 1535790 1417756 1307581 1206639 1115583 1034206 961699 897316 840785 791931
60450 791931 750102 714187 683201 656577 633875 614466 597635 582854 569830 558415 548511 539962
60438 539962 532470 525764 519825 514788 510504 506511 502576 499035 496252 493905 491240 488071 485132 483228
60424 483228 482344 481848 481341 480904 480666 480590 480808 481689 483330 485255 486947 488382 489724 490768 491219 491437 492353
60407 492353 494559 497993 502575 508538 515823 523744 531762 540147 549205 558192 565805 571742 577080 582876
60393 582876 588961 594378 598567 601749 604426 606908 609326 611856 614791 618239 621685 624121 625072 625409 626654
60378 626654 629315 632324 634362 635278 635949 637090 638696 640394 641877 643010 643883 644868 646409 648740 651951
$$ packed form
60471A869426J15170R8282P3021M1327O022k9873o3306r1204j11160j22361j25841
60460A659503j23713j18034j10175j00942r1056q1377p2507o4383n6531m8854
60450G91931m1829l5915l0986k6624k2702j9409j6831j4781j3024j1415r904q549
60438E39962p492o706n939n037m284l993l935l541k783k347k665l169k939j904
60424D83228q84m96n07m37k38p6K18Q81J641J925J692J435J342J044M51K18R16
60407D92353K206L434M582N963P285P921Q018Q385R058Q987P613N937N338N796
60393E82876O085N417M189L182K677K482K418K530K935L448L446K436R51L37J245
60378F26654K661L009K038R16O71J141J606J698J483J133Q73R85J541K331L211
$$ plain form
60363 651951 656176 661498 667725 674451 681288 687865 693760 698704 702747 705920 707801 707843 706192 703811 701677
60348 701677 700051 698638 697090 695190 692843 690214 687671 685282 682452 678355 672705 665900 658572 651368
60334 651368 645070 640307 636839 633525 629449 624844 620508 616479 611866 606041 599394 592707 586263 579961
60320 579961 573939 568551 563877 559682 555838 552430 549520 547132 545407 544343 543422 541937 539836 537816
60306 537816 536479 535771 535427 535450 535822 536091 535705 534622 533240 531864 530544 529348 528483 528131 528331 528927 529523
60289 529523 529734 529773 530544 532745 535910 538778 540621 541804 542950 544073 544886 545620 547020 549429 552252 554563
60273 554563 556134 557576 559489 561771 564029 566458 569882 574875 581213 588292 595718 603245 610545 617528
60259 617528 624643 632349 640337 647717 654039 659710 665383 671336 677638 684596 692735 702430 713677 726105
$$ packed form
60363F51951M225N322O227O726O837O577N895M944M043L173J881M2j651k381k134
60348G01677j626j413j548j900k347k629k543k389k830m097n650o805p328p204
60334F51368o298m763l468l314m076m605m336m029m613n825o647o687o444o302
60320E79961o022n388m674m195l844l408k910k388j725j064r21j485k101k020
60306E37816j337p08l44K3L72K69l86j083j382j376j320j196q65l52K00N96N96
60289E29523K11L9P71K201L165K868J843J183J146J123Q13P34J400K409K823K311
60273E54563J571J442J913K282K258K429L424M993O338P079P426P527P300O983
60259F17528P115P706P988P380O322N671N673N953O302O958Q139R695J1247J2428
$$ plain form
60245 726105 739176 752615 766758 782372 800037 819822 841507 864933 890185 917741 948495
60234 948495 983254 1022038 1064199 1109417 1158308 1211819 1270349 1333746 1401843 1474384 1550494
60223 1550494 1628732 1707867 1787252 1866212 1943330 2016658 2084578 2146190 2200840 2247537 2285162
60212 2285162 2313185 2331916 2341896 2343310 2336253 2321446 2300321 2274376 2244840 2213053 2180698 2149342
60200 2149342 2119996 2093546 2071395 2055240 2046211 2044622 2050677 2065069 2088736 2122242 2165641 2218753
60188 2218753 2281281 2352591 2431530 2516543 2605856 2697327 2788137 2874919 2954575 3024959 3084539
60177 3084539 3131503 3163760 3180109 3180942 3167353 3139883 3098674 3044598 2979544 2905719 2825482 2741989
60165 2741989 2659089 2579939 2506183 2438900 2379730 2330329 2291190 2262064 2243549 2237343 2244573 2264544
$$ packed form
60245G26105J3071J3439J4143J5614J7665J9785K1685K3426K5252K7556L0754
60234I48495L4759L8784M2161M5218M8891N3511N8530O3397O8097P2541P6110
60223A550494P8238P9135P9385P8960P7118P3328O7920O1612N4650M6697L7625
60212B285162K8023J8731R980J414p057j4807k1125k5945k9536l1787l2355l1356
60200B149342k9346k6450k2151j6155r029j589O055J4392K3667L3506M3399N3112
60188B218753O2528P1310P8939Q5013Q9313R1471R0810Q6782P9656P0384N9580
60177C084539M6964L2257J6349Q33j3589k7470m1209n4076o5054p3825q0237q3493
60165B741989q2900p9150p3756o7283n9170m9401l9139k9126j8515o206P230J9971
$$ plain form
60153 2264544 2295531 2336233 2385788 2442614 2503800 2565727 2624973 2678717 2724740 2761406 2787722
60142 2787722 2803438 2809073 2805651 2794242 2775703 2750944 2721327 2688740 2655325 2623218 2594380 2570507
60130 2570507 2553143 2543881 2544317 2555632 2578397 2612992 2660073 2720371 2794195 2881600 2983133 3100032
60118 3100032 3233431 3383434 3549043 3728794 3921229 4124827 4337637 4556922 4779081
60109 4779081 4999988 5215583 5422164 5616126 5793577 5950466 6083197 6189103 6266408 6314015
60099 6314015 6331473 6319061 6277651 6208418 6112799 5992864 5851658 5693041 5521104 5339736
60089 5339736 5152646 4963720 4777329 4598184 4430488 4276853 4138167 4014854 3908222
60080 3908222 3820162 3751572 3701697 3669259 3653552 3653929 3668709 3695382 3731669 3775731 3825468 3878424
$$ packed form
60153B264544L0987M0702M9555N6826O1186O1927N9246N3744M6023L6666K6316
60142B787722J5716N635l422j1409j8539k4759k9617l2587l3415l2107k8838k3873
60130B570507j7364r262M36J1315K2765L4595M7081O0298P3824Q7405J01533J16899
60118C100032J33399J50003J65609J79751J92435K03598K12810K19285K22159
60109D779081K20907K15595K06581J93962J77451J56889J32731J05906P7305M7607
60099F314015J7458j2412m1410o9233r5619j19935j41206j58617j71937j81368
60089E339736j87090j88926j86391j79145j67696j53635j38686j23313j06632
60080C908222q8060o8590m9875l2438j5707L77J4780K6673L6287M4062M9737N2956
$$ plain form
60068 3878424 3932429 3985612 4035565 4079277 4114231 4139042 4152666 4153705 4141208 4115793 4079211
60057 4079211 4032822 3976928 3911489 3836916 3754106 3664190 3568540 3468926 3367620 3267378 3171060
60046 3171060 3080935 2998289 2923836 2858402 2802995 2758414 2725102 2703451 2693986 2697205 2713400 2742611
60034 2742611 2784561 2838635 2903976 2979597 3064272 3156378 3253839 3354014 3453505 3548330 3634647
60023 3634647 3709400 3770353 3815853 3844732 3856185 3849504 3824248 3780948 3721328 3647455 3561012
60012 3561012 3463958 3359626 3252447 3146486 3044612 2948923 2861200 2782749 2714361 2656729
60002 2656729 2610525 2575827 2551931 2538109 2534410 2541512 2559995 2589988 2631471 2684749 2750618 2829972
59990 2829972 2923113 3029405 3147490 3275290 3409349 3544536 3675254 3797153 3907426 4003749
$$ packed form
60068C878424N4005N3183M9953M3712L4954K4811J3624J039j2497k5415l6582
60057D079211m6389n5894o5439p4573q2810q9916r5650r9614j01306j00242r6318
60046C171060r0125q2646p4453o5434n5407m4581l3312k1651r465L219J6195K9211
60034B742611M1950N4074O5341P5621Q4675R2106R7461J00175R9491R4825Q6317
60023C634647P4753O0953M5500K8879J1453o681k5256m3300n9620p3873q6443
60012C561012r7054j04332j07179j05961j01874r5689q7723p8451o8388n7632
60002B656729m6204l4698k3896j3822l699P102J8483K9993M1483N3278O5869P9354
59990B829972R3141J06292J18085J27800J34059J35187J30718J21899J10273R6323
$$ plain form
59980 4003749 4083856 4146198 4190103 4214761 4218768 4201316 4163452 4107498 4035520 3948973 3849825
59969 3849825 3741512 3628672 3516108 3407862 3306834 3215010 3133902 3064697 3008107 2964514
59959 2964514 2934329 2917931 2915185 2925484 2948401 2983814 3031087 3088544 3154153 3226340 3303703
59948 3303703 3384222 3465271 3544324 3619287 3688344 3749924 3802833 3846257 3879810 3903785 3919076
59937 3919076 3926577 3926888 3920946 3910655 3898549 3887148 3879006 3877090 3884472 3903724 3936925 3985929 4052095
59924 4052095 4135949 4237755 4358330 4498653 4658589 4836483 5029941 5236400 5452724 5674759
59914 5674759 5897491 6115243 6321572 6509408 6671658 6801782 6894188 6944893 6952307 6917261
59904 6917261 6842336 6731493 6590307 6425811 6245407 6055720 5862376 5670443 5484621 5308896
$$ packed form
59980D003749Q0107O2342M3905K4658M007j7452l7864n5954p1978q6547r9148
59969C849825j08313j12840j12564j08246j01028r1824q1108o9205n6590m3593
59959B964514l0185j6398k746J0299K2917L5413M7273N7457O5609P2187P7363
59948C303703Q0519Q1049P9053P4963O9057O1580N2909M3424L3553K3975J5291
59937C919076P501L11n942j0291j2106j1401q142j916P382J9252L3201M9004O6166
59924D052095Q3854J01806J20575J40323J59936J77894J93458K06459K16324K22035
59914E674759K22732K17752K06329J87836J62250J30124R2406N0705P414l5046
59904F917261p4925j10843j41186j64496j80404j89687j93344j91933j85822j75725
$$ plain form
59894 5308896 5146046 4997630 4864661 4748492 4650903 4573236 4515703 4477760 4458863 4458563 4476319
59883 4476319 4511813 4565195 4636227 4723145 4822852 4932097 5047781 5166074 5282017 5390294
59873 5390294 5485972 5564553 5622249 5656731 5667165 5653282 5614909 5552579 5467841 5362560 5238608
59862 5238608 5098800 4947481 4789355 4627955 4465809 4305697 4150892 4004146 3866999
59853 3866999 3740144 3623930 3518422 3423321 3338107 3262194 3194935 3135489 3082579 3034528 2989958
59842 2989958 2948665 2911441 2878716 2849664 2822781 2796901 2771297 2745301 2718488 2691031 2663302
59831 2663302 2635189 2606312 2576950 2548371 2522111 2499109 2479494 2462984 2449520 2439517 2433340
59820 2433340 2430591 2430409 2432616 2437942 2446814 2458586 2472495 2488591 2506830 2525800 2543485 2559075
$$ packed form
59894E308896j62850j48416j32969j16169r7589p7667n7533l7943j8897l00J7756
59883D476319L5494N3382P1032Q6918R9707J09245J15684J18293J15943J08277
59873E390294R5678P8581N7696L4482J0434j3883l8373o2330q4738j05281j23952
59862E238608j39808j51319j58126j61400j62146j60112j54805j46746j37147
59853C866999j26855j16214j05508r5101q5214p5913o7259n9446n2910m8051m4570
59842B989958m1293l7224l2725k9052k6883k5880k5604k5996k6813k7457k7729
59831B663302k8113k8877k9362k8579k6260k3002j9615j6510j3464j0003o177
59820B433340k749j82K207N326Q872J1772J3909J6096J8239J8970J7685J5590
$$ plain form
59808 2559075 2572863 2584395 2592002 2594566 2592780 2588237 2582166 2575669 2570346 2567762 2568719 2573787 2584339
59795 2584339 2602405 2629661 2667143 2715992 2777969 2855225 2949907 3064063 3199637 3358401 3541857
59784 3541857 3750899 3984870 4240084 4508265 4775454 5022275 5226500 5367733 5432458 5417243
59774 5417243 5329004 5182504 4996130 4787655 4571716 4359407 4158828 3975414 3812045 3669510
59764 3669510 3547265 3444136 3358837 3290317 3237616 3199351 3173584 3158532 3153271 3157500 3170776
59753 3170776 3192325 3221598 3258617 3303576 3356284 3416240 3483235 3557736 3640703 3733087 3835665
59742 3835665 3949266 4074965 4213927 4367182 4535729 4720808 4923855 5146317 5389741
59733 5389741 5655853 5946014 6260405 6597944 6956884 7334717 7727023 8126824 8525666
$$ packed form
59808B559075J3788J1532P607K564j786m543o071o497n323k584R57N068J0552
59795B584339J8066K7256L7482M8849O1977P7256R4682J14156J35574J58764J83456
59784C541857K09042K33971K55214K68181K67189K46821K04225J41233O4725j5215
59774E417243q8239j46500j86374k08475k15939k12309k00579j83414j63369j42535
59764C669510j22245j03129q5299o8520n2701l8265k5767j5052n261M229J3276
59753C170776K1549K9273L7019M4959N2708N9956O6995P4501Q2967R2384J02578
59742C835665J13601J25699J38962J53255J68547J85079K03047K22462K43424
59733E389741K66112K90161L14391L37539L58940L77833L92306L99801L98842
$$ plain form
59724 8525666 8915281 9288043 9636616 9954595 10238336 10488166 10707737 10902482 11078649
59715 11078649 11242987 11402341 11562893 11729375 11904493 12088629 12280060 12475678 12671715
59706 12671715 12863913 13047492 13217649 13370574 13503999 13616621 13707232 13774912 13820272 13846200
59696 13846200 13857085 13857403 13851322 13843419 13839221 13844795 13866078 13908757 13978351 14079836 14216993 14392219
59684 14392219 14606932 14862045 15157971 15494183 15868514 16276543 16711339 17163696 17622598
59675 17622598 18075569 18508677 18906265 19251012 19525197 19713235 19804103 19792193 19676895 19462529
59665 19462529 19158801 18780265 18344078 17867778 17368680 16863801 16368138 15891515 15436240
59656 15436240 14996798 14560991 14112228 13633767 13114249 12551725 11953780 11334380 10709885
$$ packed form
59724H525666L89615L72762L48573L17979K83741K49830K19571J94745J76167
59715A1078649J64338J59354J60552J66482J75118J84136J91431J95618J96037
59706A2671715J92198J83579J70157J52925J33425J12622R0611O7680M5360K5928
59696A3846200J0885L18o081p903m198N574K1283M2679O9594J01485J37157J75226
59684A4392219K14713K55113K95926L36212L74331M08029M34796M52357M58902
59675A7622598M52971M33108L97588L44747K74185J88038R0868j1910j15298k14366
59665A9462529l03728l78536m36187m76300m99098n04879m95663m76623m55275
59656A5436240m39442m35807m48763m78461n19518n62524n97945o19400o24495
$$ plain form
59647 10709885 10095805 9504517 8944139 8418812 7929976 7477563 7060661 6677831 6327271
59638 6327271 6006749 5713630 5445369 5200151 4976840 4774158 4590169 4422825 4270837
59629 4270837 4133692 4010825 3901088 3803182 3716262 3639784 3572823 3513887 3461537 3414926 3373494
59618 3373494 3336267 3301787 3268749 3236466 3204465 3171861 3137476 3100634 3061541 3020708 2978187
59607 2978187 2933635 2887080 2839320 2791475 2744366 2698418 2653989 2611593 2571874 2535442 2502648
59596 2502648 2473389 2447242 2423917 2403491 2386142 2371807 2360315 2351723 2346198 2343661 2343841 2346684
59584 2346684 2352389 2360952 2371980 2385104 2400389 2418150 2438508 2461241 2485947 2512284 2540253 2570408
59572 2570408 2603709 2641044 2682936 2729683 2781522 2838558 2900763 2968226 3041338 3120631 3206532
$$ packed form
59647A0709885o14080n91288n60378n25327m88836m52413m16902l82830l50560
59638F327271l20522k93119k68261k45218k23311k02682j83989j67344j51988
59629D270837j37145j22867j09737r7906q6920p6478o6961n8936n2350m6611m1432
59618C373494l7227l4480l3038l2283l2001l2604l4385l6842l9093m0833m2521
59607B978187m4552m6555m7760m7845m7109m5948m4429m2396l9719l6432l2794
59596B502648k9259k6147k3325k0426j7349j4335j1492q592n525k537J80K843
59584B346684N705Q563J1028J3124J5285J7761K0358K2733K4706K6337K7969L0155
59572B570408L3301L7335M1892M6747N1839N7036O2205O7463P3112P9293Q5901
$$ plain form
59561 3206532 3299272 3398795 3504691 3616534 3734366 3858500 3988530 4122866 4259763 4398622
59551 4398622 4539633 4681700 4820728 4950085 5063033 5155367 5226478 5278338 5313479 5333645
59541 5333645 5339747 5332272 5311423 5277267 5230254 5171486 5102340 5024209 4939091 4850063 4760408 4672260
59529 4672260 4586684 4505178 4430432 4365441 4312459 4273210 4249603 4243614 4256694 4289796 4343936
59518 4343936 4420263 4519470 4641412 4785316 4949904 5132808 5329690 5534058 5738134 5933964
59508 5933964 6113800 6269814 6394212 6480328 6523880 6523219 6478772 6392730 6269210 6114043 5933936
59497 5933936 5735798 5526698 5313819 5103858 4902363 4713577 4540575 4385267 4248526
59488 4248526 4130762 4032496 3954307 3896385 3858336 3839302 3838059 3853069 3882737 3925655 3980445
$$ packed form
59561C206532R2740R9523J05896J11843J17832J24134J30030J34336J36897J38859
59551D398622J41011J42067J39028J29357J12948R2334P1111N1860L5141K0166
59541E333645O102p475k0849l4156m7013n8768o9146p8131q5118q9028q9655q8148
59529D672260q5576q1506p4746o4991n2982l9249k3607n989J3080L3102N4140
59518D343936P6327R9207J21942J43904J64588J82904J96882K04368K04076J95830
59508E933964J79836J56014J24398Q6116M3552o61m4447q6042j23520j55167j80107
59497E933936j98138k09100k12879k09961k01495j88786j73002j55308j36741
59488D248526j17764r8266p8189n7922l8049j9034j243J5010K9668M2918N4790
$$ plain form
59477 3980445 4045341 4118040 4195931 4276259 4355964 4431520 4499121 4555202 4596895 4622033 4628770
59466 4628770 4615383 4580743 4525095 4450206 4358551 4252419 4133839 4005078 3868888 3728245
59456 3728245 3585965 3444420 3305352 3169935 3039205 2914380 2796499 2685820 2581903
59447 2581903 2484405 2393505 2309433 2231946 2160583 2095183 2035756 1982017 1933582 1890590 1853540
59436 1853540 1822281 1795690 1772808 1753928 1740052 1731419 1727138 1726215 1728426 1734208 1744269 1759224
59424 1759224 1778556 1799314 1816548 1826177 1827645 1823556 1817048 1810123 1804141 1800765 1801854 1808774 1821886
59411 1821886 1840141 1860785 1879984 1894533 1903411 1908039 1911354 1916477 1925518 1939017 1956570 1978052
59399 1978052 2004029 2035047 2071093 2112134 2158769 2211749 2271006 2335646 2404988 2479355 2559824
$$ packed form
59477C980445O4896P2699P7891Q0328P9705P5556O7601N6081M1693K5138O737
59466D628770j3387l4640n5648p4889r1655j06132j18580j28761j36190j40643
59456C728245j42280j41545j39068j35417j30730j24825j17881j10679j03917
59447B581903r7498r0900q4072p7487p1363o5400n9427n3739m8435m2992l7050
59436A853540l1259k6591k2882j8880j3876q633m281r23K211N782J0061J4955
59424A759224J9332K0758J7234R629J468m089o508o925n982l376J089O920J3112
59411A821886J8255K0644J9199J4549Q878M628L315N123R041J3499J7553K1482
59399A978052K5977L1018L6046M1041M6635N2980N9257O4640O9342P4367Q0469
$$ plain form
59388 2559824 2647422 2742688 2845807 2957019 3076766 3205420 3343153 3490578 3649602 3823197
59378 3823197 4014031 4223614 4453058 4704256 4979747 5281525 5610285 5965621 6346174
59369 6346174 6749189 7170026 7602158 8037657 8468013 8885233 9282696 9655247 9998841
59360 9998841 10310446 10588201 10831153 11038550 11209416 11342613 11436795 11489949 11499130 11460957
59350 11460957 11372515 11231915 11038413 10792459 10495991 10152875 9769209 9353194 8914514
59341 8914514 8463491 8010284 7564122 7132607 6721360 6334177 5973417 5640199 5334498
59332 5334498 5055358 4801227 4570244 4360555 4170684 3999639 3846484 3709823 3587887
59323 3587887 3479127 3382522 3297180 3221739 3154304 3093099 3037138 2986188 2939915 2897202 2856537
$$ packed form
59388B559824Q7598R5266J03119J11212J19747J28654J37733J47425J59024J73595
59378C823197J90834K09583K29444K51198K75491L01778L28760L55336L80553
59369F346174M03015M20837M32132M35499M30356M17220L97463L72551L43594
59360I998841L11605K77755K42952K07397J70866J33197R4182N3154R181l8173
59350A1460957q8442j40600j93502k45954k96468l43116l83666m16015m38680
59341H914514m51023m53207m46162m31515m11247l87183l60760l33218l05701
59332E334498k79140k54131k30983k09689j89871j71045j53155j36661j21936
59323C587887j08760r6605q5342p5441o7435o1205n5961n0950m6273m2713m0665
$$ plain form
59312 2856537 2817049 2778892 2742587 2708324 2676027 2645611 2616882 2589499 2563483 2539498 2518211
59301 2518211 2499567 2483184 2469310 2458765 2451992 2448790 2449127 2453576 2462641 2476146 2493783 2515884
59289 2515884 2543150 2575726 2613003 2654242 2698883 2746060 2794252 2841717 2887139 2929527 2967535
59278 2967535 2999197 3022564 3036436 3040392 3034380 3018573 2993561 2960210 2919273 2871437 2817854 2760254
59266 2760254 2700297 2639094 2577520 2516554 2456920 2398728 2341992 2287262 2235193 2185583 2137466
59255 2137466 2090311 2044765 2002144 1963593 1929807 1901135 1877601 1858925 1844648 1834239 1827300
59244 1827300 1823963 1824894 1830512 1840312 1853448 1869926 1890662 1916286 1946456 1980603 2018857 2061956
59232 2061956 2110642 2165558 2227414 2296911 2374664 2461450 2558394 2666761 2787757 2922697 3073040
$$ packed form
59312B856537l9488l8157l6305l4263l2297l0416k8729k7383k6016k3985k1287
59301B518211j8644j6383j3874j0545o773l202L37M449R065J3505J7637K2101
59289B515884K7266L2576L7277M1239M4641M7177M8192M7465M5422M2388L8008
59278B967535L1662K3367J3872L956o012j5807k5012l3351m0937m7836n3583n7600
59266B760254n9957o1203o1574o0966n9634n8192n6736n4730n2069m9610m8117
59255B137466m7155m5546m2621l8551l3786k8672k3534j8676j4277j0409o939
59244A827300l337R31N618R800J3136J6478K0736K5624L0170L4147L8254M3099
59232B061956M8686N4916O1856O9497P7753Q6786R6944J08367J20996J34940J50343
$$ plain form
59221 3073040 3240029 3424469 3626928 3847816 4086962 4343252 4614623 4897905 5188170
59212 5188170 5478450 5760340 6024875 6262997 6465949 6625983 6736759 6793257 6792102 6732857
59202 6732857 6618886 6456408 6252745 6015730 5754284 5478267 5196956 4917600 4645390
59193 4645390 4384313 4137612 3907531 3694995 3499811 3321324 3158972 3012331 2880849
59184 2880849 2763725 2659979 2568412 2487550 2416025 2353186 2298993 2253233 2215082 2183555 2157837
59173 2157837 2136890 2119198 2103427 2089165 2076586 2065578 2055540 2045749 2035506 2024121 2011254
59162 2011254 1997124 1982012 1965855 1948787 1931704 1915417 1899388 1882191 1863395 1844155 1825624
59151 1825624 1807519 1788698 1768523 1747047 1724374 1700623 1676408 1652764 1630435 1609516 1589764
$$ packed form
59221C073040J66989J84440K02459K20888K39146K56290K71371K83282K90265
59212E188170K90280K81890K64535K38122K02952J60034J10776N6498j155n9245
59202F732857j13971j62478k03663k37015k61446k76017k81311k79356k72210
59193D645390k61077k46701k30081k12536j95184j78487j62352j46641j31482
59184B880849j17124j03746r1567q0862p1525o2839n4193m5760l8151l1527k5718
59173B157837k0947j7692j5771j4262j2579j1008j0038r791j0243j1385j2867
59162B011254j4130j5112j6157j7068j7083j6287j6029j7197j8796j9240j8531
59151A825624j8105j8821k0175k1476k2673k3751k4215k3644k2329k0919j9752
$$ plain form
59140 1589764 1571018 1553327 1536873 1521749 1507707 1494244 1481131 1468669 1457258 1446965 1437812
59129 1437812 1430256 1424878 1421643 1420053 1420142 1422769 1428465 1436421 1445270 1454811 1466303 1480854 1498057 1516652
59115 1516652 1536069 1556636 1578394 1600467 1621899 1642562 1662836 1682683 1701488 1718691 1734260
59104 1734260 1748668 1762713 1777258 1792830 1809512 1827485 1847569 1870893 1898067 1928979 1963372
59093 1963372 2001208 2042412 2086659 2133617 2183052 2234390 2286302 2336973 2384813 2428800 2468172
59082 2468172 2501903 2528505 2546380 2554335 2551759 2538438 2514567 2481065 2439522 2391415 2337543 2278528
59070 2278528 2215683 2150856 2085466 2020197 1955699 1892995 1832939 1775727 1721305 1669937 1621970
59059 1621970 1577308 1535529 1496519 1460641 1428360 1399864 1375056 1353717 1335664 1320813 1309033
$$ packed form
59140A589764j8746j7691j6454j5124j4042j3463j3113j2462j1411j0293r153
59129A437812p556n378l235j590Q9K627N696P956Q849R541J1492J4551J7203J8595
59115A516652J9417K0567K1758K2073K1432K0663K0274J9847J8805J7203J5569
59104A734260J4408J4045J4545J5572J6682J7973K0084K3324K7174L0912L4393
59093A963372L7836M1204M4247M6958M9435N1338N1912N0671M7840M3987L9372
59082B468172L3731K6602J7875P955k576j3321k3871l3502m1543m8107n3872n9015
59070B278528o2845o4827o5390o5269o4498o2704o0056n7212n4422n1368m7967
59059A621970m4662m1779l9010l5878l2281k8496k4808k1339j8053j4851j1780
$$ plain form
59048 1309033 1299900 1292765 1287073 1282307 1277448 1270943 1261633 1249597 1235619 1220004 1202523 1183568 1164673
59035 1164673 1147358 1131784 1117102 1102967 1090058 1078954 1069125 1059581 1050209 1041851 1035044 1029271
59023 1029271 1023690 1018137 1013043 1008732 1005300 1003006 1002137 1002417 1002968 1003154 1003205 1003857 1005610 1008492 1012325 1016968
59007 1016968 1022432 1028945 1036864 1046445 1057704 1070587 1085124 1101310 1118874 1137293 1156009 1174608
58995 1174608 1192852 1210595 1227646 1243686 1258324 1271215 1282173 1291259 1298775 1304999 1309851 1313069
58983 1313069 1314855 1316017 1317189 1318122 1318245 1317728 1317423 1317786 1318472 1319170 1320279 1322423 1325730 1329969 1335113 1341444
58967 1341444 1349363 1359372 1371952 1387067 1403983 1421874 1440412 1459468 1478510 1496809 1514137
58956 1514137 1530805 1547008 1562518 1577009 1590391 1602813 1614670 1626605 1639111 1652003 1664610
$$ packed form
59048A309033r133p135n692m766m859o505r310j2036j3978j5615j7481j8955j8895
59035A164673j7315j5574j4682j4135j2909j1104r829r544r372q358o807n773
59023A029271n581n553n094m311l432k294q69K80N51J86N1O52J753K882L833M643
59007A016968N464O513P919R581J1259J2883J4537J6186J7564J8419J8716J8599
58995A174608J8244J7743J7051J6040J4638J2891J0958R086P516O224M852L218
58983A313069J786J162J172R33J23n17l05L63O86O98J109K144L307M239N144O331
58967A341444P919J0009J2580J5115J6916J7891J8538J9056J9042J8299J7328
58956A514137J6668J6203J5510J4491J3382J2422J1857J1935J2506J2892J2607
$$ plain form
58945 1664610 1676667 1688753 1701719 1715928 1731322 1748043 1766686 1787991 1812567 1840941 1873580
58934 1873580 1910634 1951700 1996053 2043078 2092298 2142954 2193910 2244287 2294171 2344529 2396527
58923 2396527 2451220 2509792 2573564 2643466 2719725 2802232 2891051 2986438 3088647 3197933 3314539
58912 3314539 3438425 3569235 3706823 3851748 4005022 4167506 4339728 4522096 4714954
58903 4714954 4918608 5133579 5360646 5600049 5850517 6109384 6373738 6641247 6910024
58894 6910024 7178247 7444080 7705436 7959298 8201395 8426856 8631189 8810587 8961608
58885 8961608 9081064 9166363 9215789 9228431 9204034 9143084 9046970 8917952 8758874 8572854
58875 8572854 8363183 8133456 7887731 7630400 7365685 7097095 6827285 6558445 6292817
$$ packed form
58945A664610J2057J2086J2966J4209J5394J6721J8643K1305K4576K8374L2639
58934A873580L7054M1066M4353M7025M9220N0656N0956N0377M9884N0358N1998
58923B396527N4693N8572O3772O9902P6259Q2507Q8819R5387J02209J09286J16606
58912C314539J23886J30810J37588J44925J53274J62484J72222J82368J92858
58903D714954K03654K14971K27067K39403K50468K58867K64354K67509K68777
58894F910024K68223K65833K61356K53862K42097K25461K04333J79398J51021
58885H961608J19456Q5299M9426J2642k4397o0950r6114j29018j59078j86020
58875H572854k09671k29727k45725k57331k64715k68590k69810k68840k65628
$$ plain form
58866 6292817 6032822 5780688 5538036 5305827 5084607 4874692 4676178 4489011 4313111
58857 4313111 4148397 3994689 3851769 3719506 3597738 3485936 3383183 3288672 3202152 3123773
58847 3123773 3053596 2991276 2936084 2887078 2843432 2804829 2771471 2743536 2720675 2702193 2687626
58836 2687626 2676905 2670003 2666721 2666952 2671006 2679551 2693246 2712381 2736707 2765594 2798557 2835766
58824 2835766 2877988 2925913 2979559 3038465 3102456 3172045 3247925 3330165 3418219 3511881 3612054
58813 3612054 3720283 3837645 3964395 4100727 4247502 4406014 4577225 4761406 4958359
58804 4958359 5167813 5389787 5624697 5872846 6133370 6403695 6680288 6959995 7240357
58795 7240357 7518527 7790071 8049023 8289088 8504737 8691250 8844151 8959116 9032742 9063349
$$ packed form
58866F292817k59995k52134k42652k32209k21220k09915j98514j87167j75900
58857D313111j64714j53708j42920j32263j21768j11802j02753r4511q6520p8379
58847C123773p0177o2320n5192m9006m3646l8603l3358k7935k2861j8482j4567
58836B687626j0721o902l282K31M054Q545J3695J9135K4326K8887L2963L7209
58824B835766M2222M7925N3646N8906O3991O9589P5880Q2240Q8054R3662J00173
58813C612054J08229J17362J26750J36332J46775J58512J71211J84181J96953
58804D958359K09454K21974K34910K48149K60524K70325K76593K79707K80362
58795G240357K78170K71544K58952K40065K15649J86513J52901J14965P3626L0607
$$ plain form
58785 9063349 9050902 8996464 8902109 8771228 8608105 8416676 8199834 7960215 7701304 7427384
58775 7427384 7142622 6850702 6555376 6260846 5971351 5690495 5421018 5164863 4923092
58766 4923092 4695746 4482085 4281269 4093027 3917656 3755352 3605575 3467118 3338666
58757 3338666 3219191 3108069 3005241 2911274 2826815 2751774 2685262 2626342 2574412 2528761 2488310
58746 2488310 2452189 2420240 2392525 2368503 2346969 2326564 2306126 2284902 2262814 2240346 2217912
58735 2217912 2195604 2173669 2152500 2131552 2108849 2082436 2052198 2019574 1985803 1951264 1916261
58724 1916261 1881228 1845907 1809238 1770528 1730116 1688555 1645787 1601516 1555901 1509519 1463170
58713 1463170 1418057 1375652 1336772 1301118 1268112 1237957 1211453 1188986 1170067 1153762 1139292
$$ packed form
58785I063349j2447n4438r4355j30881j63123j91429k16842k39619k58911k73920
58775G427384k84762k91920k95326k94530k89495k80856k69477k56155k41771
58766D923092k27346k13661k00816j88242j75371j62304j49777j38457j28452
58757C338666j19475j11122j02828r3967q4459p5041o6512n8920n1930m5651m0451
58746B488310l6121l1949k7715k4022k1534k0405k0438k1224k2088k2468k2434
58735B217912k2308k1935k1169k0948k2703k6413l0238l2624l3771l4539l5003
58724A916261l5033l5321l6669l8710m0412m1561m2768m4271m5615m6382m6349
58713A463170m5113m2405l8880l5654l3006l0155k6504k2467j8919j6305j4470
$$ plain form
58702 1139292 1126248 1114289 1102453 1088904 1071915 1051345 1028720 1005672 982777 960142 938384
58691 938384 918345 900287 884071 869943 858387 849303 842049 836459 833269 833281 836448 841998 849199
58678 849199 857834 868125 880419 894937 911749 930975 952896 977777 1005608 1035976 1067888 1099398
58666 1099398 1127496 1148723 1160245 1160647 1150157 1130353 1103521 1071948 1037605 1002341 967967 935901
58654 935901 906796 880730 857665 837608 820440 805843 793420 782917 774380 768112 764297 762699
58642 762699 762925 764955 768980 774680 781162 787928 795415 804129 813635 822995 831964 841082 850649 860297
58628 860297 869738 879376 889883 901573 914525 929051 945576 964090 984036 1004939 1027087 1051475
58616 1051475 1079049 1110078 1144289 1181493 1221870 1265656 1312854 1363380 1417328 1474968 1536723
$$ packed form
58702A139292j3044j1959j1836j3549j6989k0570k2625k3048k2895k2635k1758
58691I38384k0039j8058j6216j4128j1556r084p254n590l190J2L167N550P201
58678H49199Q635J0291J2294J4518J6812J9226K1921K4881K7831L0368L1912L1510
58666A099398K8098K1227J1522M02j0490j9804k6832l1573l4343l5264l4374l2066
58654I35901k9105k6066k3065k0057j7168j4597j2423j0503q537o268l815j598
58642G62699K26K030M025N700O482O766P487Q714R506R360Q969R118R567R648
58628H60297R441R638J0507J1690J2952J4526J6525J8514J9946K0903K2148K4388
58616A051475K7574L1029L4211L7204M0377M3786M7198N0526N3948N7640O1755
$$ plain form
58605 1536723 1603195 1674866 1751520 1832135 1915610 2001320 2088661 2176259 2261939 2343272 2417849
58594 2417849 2483303 2537664 2579723 2608747 2623929 2624590 2610904 2584039 2545626 2497616 2442625 2383702
58582 2383702 2323318 2262831 2203153 2145592 2091686 2042387 1997717 1957185 1920390 1887275 1857846
58571 1857846 1831702 1807967 1785901 1765460 1746922 1730036 1713956 1697977 1681752 1664578 1645028
58560 1645028 1621854 1595083 1565945 1535938 1506256 1477745 1450755 1424866 1398970 1371644 1341427
58549 1341427 1307204 1268896 1227763 1185596 1143553 1102082 1061832 1024014 989644 958886 931415
58538 931415 907021 885501 866243 848395 831371 814949 799107 784098 770506 758692 748190
58527 748190 738074 727945 718108 708756 699579 690510 682307 675807 670894 666749 663036 660253 658932 659029
$$ packed form
58605A536723O6472P1671P6654Q0615Q3475Q5710Q7341Q7598Q5680Q1333P4577
58594B417849O5454N4361M2059K9024J5182O61j3686k6865l8413m8010n4991n8923
58582B383702o0384o0487n9678n7561n3906m9299m4670m0532l6795l3115k9429
58571A857846k6144k3735k2066k0441j8538j6886j6080j5979j6225j7174j9550
58560A645028k3174k6771k9138l0007k9682k8511k6990k5889k5896k7326l0217
58549A341427l4223l8308m1133m2167m2043m1471m0250l7818l4370l0758k7471
58538I31415k4394k1520j9258j7848j7024j6422j5842j5009j3592j1814j0502
58527G48190j0116j0129r837r352r177r069q203o500m913m145l713k783j321R7
$$ plain form
58513 659029 660232 662383 665322 668720 672422 676714 681848 687485 692962 698134 703553 709712 716413 723104
58499 723104 729655 736475 743885 751734 759821 768373 777696 787425 796650 804925 812657 820161 826741 831222
58485 831222 833167 833053 831380 828193 823408 816985 808680 798229 786015 773067 760138 747249 734315
58472 734315 721727 709958 699085 689077 680090 672023 664210 656165 648336 641472 635450 629415 623072
58459 623072 617204 612723 609701 607518 605596 603778 602267 601431 601530 602470 603888 605566 607736 610944 615583
58444 615583 621512 628142 635065 642507 650870 659753 667871 674174 678662 681794 683509 683356 681380 678315
58430 678315 674933 671542 668040 664160 659776 655334 651768 649658 648648 648069 647822 648131 648748 649207 649712 650983
58414 650983 653159 655637 658129 661083 664769 668677 672250 675614 679108 682625 685866 688878 691887 694899
$$ packed form
58513F59029J203K151K939L398L702M292N134N637N477N172N419O159O701O691
58499G23104O551O820P410P849Q087Q552R323R729R225Q275P732P504O580M481
58485H31222J945j14j673l187m785o423q305j0451j2214j2948j2929j2889j2934
58472G34315j2588j1769j0873j0008q987q067p813q045p829o864o022o035o343
58459F23072n868m481l022k183j922j818j511q36R9R40J418J678K170L208M639
58444F15583N929O630O923P442Q363Q883Q118O303M488L132J715j53j976l065
58430F78315l382l391l502l880m384m442l566k110j010n79k47L09O17M59N05J271
58414F50983K176K478K492K954L686L908L573L364L494L517L241L012L009L012
$$ plain form
58400 694899 697860 700840 703717 706034 707619 709016 710865 713163 715626 718451 722054 726244 730302 733961
58386 733961 737730 742143 747058 751803 755723 758490 760345 762187 765143 769756 775668 782168 788883 795838
58372 795838 802992 809976 816372 822262 828383 835494 843531 851639 859230 866770 875170 884620 894487 904194
58358 904194 913637 922673 930916 938387 945880 954114 962822 971198 979031 986816 994832 1002782 1010516 1018500
58344 1018500 1027201 1036441 1045689 1054704 1063528 1072191 1080960 1090619 1101878 1114452 1127304 1139897 1152776
58331 1152776 1166740 1181899 1197762 1213847 1229826 1245383 1260418 1275382 1291109 1308197 1326547
58320 1326547 1345470 1364186 1382348 1400129 1417769 1435160 1452049 1468480 1484725 1500900 1517107
58309 1517107 1533871 1551797 1570712 1589720 1608288 1626687 1645169 1663553 1682177 1702497 1725890
$$ packed form
58400F94899K961K980K877K317J585J397J849K298K463K825L603M190M058L659
58386G33961L769M413M915M745L920K767J855J842K956M613N912O500O715O955
58372G95838P154O984O396N890O121P111Q037Q108P591P540Q400R450R867R707
58358I04194R443R036Q243P471P493Q234Q708Q376P833P785Q016P950P734P984
58344A018500Q701R240R248R015Q824Q663Q769R659J1259J2574J2852J2593J2879
58331A152776J3964J5159J5863J6085J5979J5557J5035J4964J5727J7088J8350
58320A326547J8923J8716J8162J7781J7640J7391J6889J6431J6245J6175J6207
58309A517107J6764J7926J8915J9008J8568J8399J8482J8384J8624K0320K3393
$$ plain form
58298 1725890 1752174 1780052 1808725 1838390 1869375 1901600 1934803 1968645 2002610 2036455 2070831
58287 2070831 2106962 2145630 2186908 2230781 2277455 2327035 2379447 2434816 2493433 2555243 2619678
58276 2619678 2686035 2753668 2821788 2889337 2955073 3017627 3075768 3129131 3178596 3225638 3271478
58265 3271478 3317164 3363978 3413095 3465002 3519836 3578115 3640581 3707501 3778709 3854134 3933805
58254 3933805 4017699 4106220 4200376 4300655 4406212 4516194 4631507 4754123 4884884 5023156
58244 5023156 5168479 5321154 5481283 5648793 5824796 6011414 6209603 6418278 6636263
58235 6636263 6864127 7103578 7356061 7622697 7904787 8203724 8520940 8858341 9218189
58226 9218189 9602467 10013118 10452951 10925277 11432553 11976613 12560442 13188554 13865606
$$ packed form
58298A725890K6284K7878K8673K9665L0985L2225L3203L3842L3965L3845L4376
58287B070831L6131L8668M1278M3873M6674M9580N2412N5369N8617O1810O4435
58276B619678O6357O7633O8120O7549O5736O2554N8141N3363M9465M7042M5840
58265C271478M5686M6814M9117N1907N4834N8279O2466O6920P1208P5425P9671
58254C933805Q3894Q8521R4156J00279J05557J09982J15313J22616J30761J38272
58244E023156J45323J52675J60129J67510J76003J86618J98189K08675K17985
58235F636263K27864K39451K52483K66636K82090K98937L17216L37401L59848
58226I218189L84278M10651M39833M72326N07276N44060N83829O28112O77052
$$ plain form
58217 13865606 14596376 15387729 16249104 17190612 18222303 19356115 20607041 21991768 23528378
58208 23528378 25239154 27152930 29304541 31734964 34494963 37648291 41269308 45436813
58200 45436813 50230800 55737741 62065854 69364586 77834798 87721134 99297735 112867177
58192 112867177 128771980 147393307 169110839 194200155 222624589 253695703 285709214
58185 285709214 315837992 340555356 356560525 361795134 356026723 340742864 318507833
58178 318507833 292163444 264208260 236493864 210199798 185965453 164060986 144529577
58171 144529577 127284455 112169199 98992942 87550366 77635045 69050002 61614575
58164 61614575 55167112 49565727 44688256 40430426 36702712 33428276 30542277 27990439
$$ packed form
58217A3865606P30770P91353Q61375R41508J031691J133812J250926J384727J536610
58208B3528378J710776J913776K151611K430423K759999L153328L621017M167505
58200D5436813M793987N506941O328113P298732Q470212R886336J1576601J3569442
58192A12867177J5904803J8621327K1717532K5089316K8424434L1071114L2013511
58185B85709214L0128778K4717364J6005169N234609n768411j5283859k2235031
58178C18507833k6344389k7955184k7714396k6294066k4234345k1904467j9531409
58171A44529577j7245122j5115256j3176257j1442576r915321q585043p435427
58164F1614575o447463n601385m877471m257830l727714l274436k885999k551838
$$ plain form
58156 27990439 25726558 23711059 21910911 20298714 18850593 17545197 16364408 15293506
58148 15293506 14319881 13432204 12621029 11879029 11199762 10576584 10003096 9473979 8984919
58139 8984919 8532105 8112151 7722100 7359194 7020881 6705150 6410422 6135095 5877569
58130 5877569 5636676 5411466 5200534 5002166 4815242 4639343 4473793 4317212 4168318
58121 4168318 4026640 3892164 3764680 3643700 3528667 3419039 3314487 3215084 3120934 3031644
58111 3031644 2946626 2865847 2789611 2717546 2648608 2582349 2519459 2460657 2405660 2353729 2304639
58100 2304639 2258572 2215508 2175284 2137844 2102807 2069091 2035546 2001712 1967381 1931716 1893706
58089 1893706 1853521 1812691 1772682 1733861 1696010 1659134 1623290 1588114 1553201 1518733 1485242
$$ packed form
58156B7990439k263881k015499j800148j612197j448121j305396j180789j070902
58148A5293506r73625q87677q11175p42000o79267o23178n73488n29117m89060
58139H984919m52814m19954l90051l62906l38313l15731k94728k75327k57526
58130E877569k40893k25210k10932j98368j86924j75899j65550j56581j48894
58121D168318j41678j34476j27484j20980j15033j09628j04552r9403r4150q9290
58111C031644q5018q0779p6236p2065o8938o6259o2890n8802n4997n1931m9090
58100B304639m6067m3064m0224l7440l5037l3716l3545l3834l4331l5665l8010
58089A893706m0185m0830m0009l8821l7851l6876l5844l5176l4913l4468l3491
$$ plain form
58078 1485242 1452902 1421641 1391827 1364151 1338618 1314225 1289973 1265853 1242553 1220626 1200295
58067 1200295 1181565 1163956 1146473 1128555 1110961 1095033 1081211 1068846 1057310 1046418 1035721
58056 1035721 1024412 1012327 1000196 988412 976274 963089 949406 936458 924860 914514 905318
58045 905318 897189 889637 882087 874535 867279 860224 853044 845842 838977 832403 825896 819834 814919 811022
58031 811022 807094 802464 797639 793549 790450 787818 784955 781476 777532 773751 770745 768582 766927 765579
58017 765579 764539 763639 762651 761803 761747 762882 765001 767610 770208 772328 773844 775373 777983 782303 788188
58002 788188 795097 802316 808852 813824 817240 819907 822353 824287 825308 825675 826096 827158 829188 832248 835991
57987 835991 839858 843709 847913 852671 857698 862851 868508 874874 881306 886877 891355 895027 897692 898319
$$ packed form
58078A485242l2340l1261k9814k7676k5533k4393k4252k4120k3300k1927k0331
58067A200295j8730j7609j7483j7918j7594j5928j3822j2365j1536j0892j0697
58056A035721j1309j2085j2131j1784j2138j3185j3683j2948j1598j0346r196
58045I05318q129p552p550p552p256p055p180p202o865o574o507o062m915l897
58031H11022l928m630m825m090l099k632k863l479l944l781l006k163j655j348
58017G65579j040r00r88q48n6J135K119K609K598K120J516J529K610M320N885
58002G88188O909P219O536M972L416K667K446J934J021L67M21J062K030L060L743
57987H35991L867L851M204M758N027N153N657O366O432N571M478L672K665O27
$$ plain form
57973 898319 895760 889477 879601 866628 851183 833930 815675 797445 780232 764491 750172 737414
57961 737414 726944 719452 714824 712376 711798 713450 717652 723982 731420 739041 746506 753976 761674 769481
57947 769481 776772 782553 785755 785710 782506 776762 768915 758928 746956 733966 721139 708772 696481
57934 696481 684559 674433 667354 663188 660914 659849 659803 660356 660739 660423 659320 657281 653722 647878 639315
57919 639315 628333 616138 604452 594493 586195 578625 571185 564238 558596 554754 552705 552312 553602 556681
57905 556681 561412 567272 573571 579773 585441 589972 592767 593762 593498 592386 590198 586534 581562 575923 570075
57890 570075 564121 558197 552571 547334 542321 537437 532788 528460 524506 521300 519610 520079 522703 526999
57876 526999 532579 539425 547557 556561 565622 574108 582056 589880 597537 604199 608874 611157 611230 609361 605724
$$ packed form
57973H98319k559o283r876j2973j5445j7253j8255j8230j7213j5741j4319j2758
57961G37414j0470p492m628k448n78J652M202O330P438P621P465P470P698P807
57947G69481P291N781L202m5l204n744p847r987j1972j2990j2827j2367j2291
57934F96481j1922j0126p079m166k274j065m6N53L83l16j103k039l559n844q563
57919F39315j0982j2195j1686r959q298p570p440o947n642l842k049l93J290L079
57905E56681M731N860O299O202N668M531K795R95k64j112k188l664m972n639n848
57890E70075n954n924n626n237n013m884m649m328l954l206j690M69K624M296
57876E26999N580O846Q132R004R061Q486P948P824P657O662M675K283P3j869l637
$$ plain form
57861 605724 600601 594385 587357 579660 571498 563153 554844 546768 539226 532469 526562 521693 518523 517709
57847 517709 518996 521237 523609 526491 530877 537165 544757 552540 559479 565045 569594 574225 579781 585934
57833 585934 591636 596499 601194 606133 610068 610455 605257 594296 579034 561412 542996 524940 508324
57820 508324 494191 483093 474747 468399 463582 460322 458601 458035 458409 460155 463863 469442 476302 484304
57806 484304 494002 505835 519579 534832 551562 569887 589685 610709 632588 654237 673688 689189
57794 689189 700384 707960 712373 713516 711502 706940 700268 691380 680129 666684 651218 633827 615110
57781 615110 596317 578452 561562 545296 529836 515746 503147 491575 480700 470746 462096 454800
57769 454800 448626 443403 439190 436126 434190 433115 432513 432106 431769 431480 431381 431823 433023 434705 436416 438309
$$ packed form
57861F05724n123o216p028p697q162q345q309q076p542o757n907m869l170q14
57847E17709J287K241K372K882M386O288P592P783O939N566M549M631N556O153
57833E85934N702M863M695M939L935L87n198j0961j5262j7622j8416j8056j6616
57820E08324j4133j1098q346o348m817l260j721n66L74J746L708N579O860Q002
57806D84304R698J1833J3744J5253J6730J8325J9798K1024K1879K1649J9451J5501
57794F89189J1195P576M413J143k014m562o672q888j1251j3445j5466j7391j8717
57781F15110j8793j7865j6890j6266j5460j4090j2599j1572j0875r954q650p296
57769D54800o174n223m213l064j936j075o02m07l37k89r9M42J200J682J711J893
$$ plain form
57753 438309 441236 445819 451741 458171 464627 471110 477653 484151 490531 496748 502706 508472 514447 520943
57739 520943 527635 533762 538917 543365 547535 551552 555365 559115 563147 567702 572701 577849 583010 588460
57725 588460 594644 601637 609053 616613 624558 633231 642456 651627 660383 668886 677554 686881 697480 709864
57711 709864 723991 739288 755344 772405 791016 811254 832510 853992 875382 896990 919355
57700 919355 942806 967499 993839 1022647 1054777 1090710 1130666 1174998 1224242 1278792 1338693
57689 1338693 1403786 1473969 1549385 1630453 1717653 1811039 1909921 2013090 2119334 2227739 2337603
57678 2337603 2448109 2557922 2665205 2768528 2868255 2967076 3069303 3180173 3305693 3450984
57668 3450984 3615062 3784445 3931726 4023049 4031337 3947397 3782401 3561284 3312194 3058385
$$ packed form
57753D38309K927M583N922O430O456O483O543O498O380O217N958N766N975O496
57739E20943O692O127N155M448M170M017L813L750M032M555M999N148N161N450
57725E88460O184O993P416P560P945Q673R225R171Q756Q503Q668R327J0599J2384
57711G09864J4127J5297J6056J7061J8611K0238K1256K1482K1390K1608K2365
57700I19355K3451K4693K6340K8808L2130L5933L9956M4332M9244N4550N9901
57689A338693O5093P0183P5416Q1068Q7200R3386R8882J03169J06244J08405J09864
57678B337603J10506J09813J07283J03323R9727R8821J02227J10870J25520J45291
57668C450984J64078J69383J47281R1323Q288q3940j64996k21117k49090k53809
$$ plain form
57658 3058385 2815603 2593168 2395486 2222929 2073230 1943549 1831754 1736134 1654781 1585834
57648 1585834 1527993 1480325 1441736 1410986 1387067 1369221 1356688 1348805 1345262 1345987 1350831 1359641
57636 1359641 1372534 1389776 1411423 1437411 1468014 1503811 1545033 1591228 1641695 1696022 1754007
57625 1754007 1815329 1879643 1946807 2016609 2088164 2159782 2229435 2295120 2354660 2405589 2445628
57614 2445628 2473291 2487799 2488475 2474661 2446391 2404941 2352466 2291234 2223378 2151148 2076855 2002298
57602 2002298 1928361 1855375 1783826 1714565 1648348 1585435 1525840 1469946 1418573 1372244 1330514
57591 1330514 1292222 1256367 1222612 1191067 1161986 1135659 1112179 1091054 1071344 1052457 1034576
57580 1034576 1018118 1003039 989088 976484 965900 957727 951657 946960 942881 938914 935097 932044 930336
$$ packed form
57658C058385k42782k22435j97682j72557j49699j29681j11795r5620q1353o8947
57648A585834n7841m7668l8589l0750k3919j7846j2533p883l543P25M844Q810
57636A359641J2893J7242K1647K5988L0603L5797M1222M6195N0467N4327N7985
57625A754007O1322O4314O7164O9802P1555P1618O9653O5685N9540N0929M0039
57614B445628K7663J4508O76j3814k8270m1450n2475o1232o7856p2230p4293p4557
57602B002298p3937p2986p1549o9261o6217o2913n9595n5894n1373m6329m1730
57591A330514l8292l5855l3755l1545k9081k6327k3480k1125j9710j8887j7881
57580A034576j6458j5079j3951j2604j0584q173o070m697m079l967l817l053j708
$$ plain form
57567 930336 929827 929874 930242 931351 933509 936376 939465 942874 947167 952615 958840 965208 971551 978511 987119
57552 987119 997857 1010190 1023222 1036734 1051214 1066987 1083907 1102115 1122477 1145796 1171894
57541 1171894 1200029 1230036 1262512 1297887 1335797 1375582 1417052 1460513 1506224 1554205 1604623
57530 1604623 1658049 1714918 1774677 1835726 1896461 1956127 2014336 2069852 2120326 2163295 2197060
57519 2197060 2220568 2233003 2233908 2223484 2202526 2172260 2134342 2090600 2042480 1991036 1937594 1883981
57507 1883981 1831777 1781767 1734519 1690881 1651217 1614611 1579782 1546723 1516632 1490303 1467518
57496 1467518 1448109 1432493 1420640 1411422 1403797 1398109 1395368 1395625 1397919 1401754 1407733 1416516 1427794
57483 1427794 1440728 1455070 1471522 1491091 1514329 1541128 1571054 1603792 1639289 1677612 1718893
$$ packed form
57567I30336n09M7L68J109K158K867L089L409M293N448O225O368O343O960Q608
57552I87119J0738J2333J3032J3512J4480J5773J6920J8208K0362K3319K6098
57541A171894K8135L0007L2476L5375L7910L9785M1470M3461M5711M7981N0418
57530A604623N3426N6869N9759O1049O0735N9666N8209N5516N0474M2969L3765
57519B197060K3508J2435R05j0424k0958l0266l7918m3742m8120n1444n3442n3613
57507A883981n2204n0010m7248m3638l9664l6606l4829l3059l0091k6329k2785
57496A467518j9409j5616j1853r218p625n688k741K57K294L835N979Q783J1278
57483A427794J2934J4342J6452J9569K3238K6799K9926L2738L5497L8323M1281
$$ plain form
57472 1718893 1763462 1811725 1863608 1918244 1974503 2031726 2089678 2147851 2205107 2259963 2310774
57461 2310774 2355584 2392267 2419137 2435315 2440431 2434376 2417599 2391336 2357079 2315884 2268498 2216097
57449 2216097 2160532 2103763 2047240 1991841 1938192 1886939 1838838 1794552 1754244 1717429 1683483
57438 1683483 1652308 1624262 1599420 1577224 1557022 1538695 1522521 1508594 1496664 1486412 1477653
57427 1477653 1470307 1464425 1460222 1457781 1456588 1455606 1454101 1452363 1451365 1451626 1452605 1453383 1453830 1454761 1456908 1460066
57411 1460066 1463520 1467092 1471301 1476483 1482147 1487428 1492001 1496370 1501425 1507840 1515657 1524199 1532536 1540278
57397 1540278 1547891 1556097 1565060 1574354 1583578 1592721 1601929 1611236 1620646 1630350 1640694 1651950 1664059
57384 1664059 1676549 1688729 1700158 1710945 1721547 1732320 1743370 1754727 1766462 1778575 1790906
$$ packed form
57472A718893M4569M8263N1883N4636N6259N7223N7952N8173N7256N4856N0811
57461B310774M4810L6683K6870J6178N116o055j6777k6263l4257m1195m7386n2401
57449B216097n5565n6769n6523n5399n3649n1253m8101m4286m0308l6815l3946
57438A683483l1175k8046k4842k2196k0202j8327j6174j3927j1930j0252q759
57427A477653p346n882m203k441j193r82j505j738r98K61R79P78M47R31K147L158
57411A460066L454L572M209N182N664N281M573M369N055O415P817Q542Q337P742
57397A540278P613Q206Q963R294R224R143R208R307R410R704J0344J1256J2109
57384A664059J2490J2180J1429J0787J0602J0773J1050J1357J1735J2113J2331
$$ plain form
57373 1790906 1803211 1815251 1826810 1837763 1848202 1858514 1869274 1880951 1893528 1906427 1918986
57362 1918986 1931076 1943051 1955082 1966908 1978396 1989926 2001841 2013896 2025771 2037834 2050760
57351 2050760 2064423 2077917 2090771 2103537 2116905 2130845 2145014 2159502 2174564 2189902 2204826
57340 2204826 2219134 2233406 2248350 2264138 2280435 2296815 2313038 2329127 2345310 2361839 2378802
57329 2378802 2396099 2413650 2431615 2450405 2470365 2491380 2512830 2534112 2555161 2576405 2598287
57318 2598287 2620995 2644554 2668908 2693981 2719898 2747000 2775299 2803998 2832090 2859489 2887035
57307 2887035 2915237 2943645 2971771 2999984 3028897 3058309 3087446 3116023 3144382 3172625 3200227
57296 3200227 3226522 3251013 3273079 3291955 3307264 3319294 3328620 3335787 3341459 3346422 3351146 3355615
$$ packed form
57373A790906J2305J2040J1559J0953J0439J0312J0760J1677J2577J2899J2559
57362A918986J2090J1975J2031J1826J1488J1530J1915J2055J1875J2063J2926
57351B050760J3663J3494J2854J2766J3368J3940J4169J4488J5062J5338J4924
57340B204826J4308J4272J4944J5788J6297J6380J6223J6089J6183J6529J6963
57329B378802J7297J7551J7965J8790J9960K1015K1450K1282K1049K1244K1882
57318B598287K2708K3559K4354K5073K5917K7102K8299K8699K8092K7399K7546
57307B887035K8202K8408K8126K8213K8913K9412K9137K8577K8359K8243K7602
57296C200227K6295K4491K2066J8876J5309J2030R326P167N672M963M724M469
$$ plain form
57284 3355615 3359822 3364185 3369126 3374511 3379919 3385541 3392446 3401805 3413948 3428262 3443889 3460382 3477737
57271 3477737 3496000 3514973 3534275 3553534 3572557 3591457 3610673 3630771 3652151 3674968 3699254
57260 3699254 3724860 3751280 3777903 3804615 3831929 3860234 3889168 3918011 3946533 3975087 4003943
57249 4003943 4032975 4062054 4091391 4121339 4152051 4183405 4215038 4246435 4277244 4307609 4338042
57238 4338042 4368939 4400400 4432450 4465081 4497915 4530200 4561311 4590946 4618557 4642857 4662350
57227 4662350 4676402 4685643 4691502 4695760 4700494 4707845 4719294 4734939 4753572 4773443 4793079 4811688
57215 4811688 4829136 4845636 4861299 4875906 4889217 4901544 4913837 4927009 4941170 4955704 4970039
57204 4970039 4984178 4998476 5013159 5028138 5043030 5057185 5069858 5080630 5089624 5097211 5103587 5108834
$$ packed form
57284C355615M207M363M941N385N408N622O905R359J2143J4314J5627J6493J7355
57271C477737J8263J8973J9302J9259J9023J8900J9216K0098K1380K2817K4286
57260C699254K5606K6420K6623K6712K7314K8305K8934K8843K8522K8554K8856
57249D003943K9032K9079K9337K9948L0712L1354L1633L1397L0809L0365L0433
57238D338042L0897L1461L2050L2631L2834L2285L1111K9635K7611K4300J9493
57227D662350J4052R241N859M258M734P351J1449J5645J8633J9871J9636J8609
57215D811688J7448J6500J5663J4607J3311J2327J2293J3172J4161J4534J4335
57204D970039J4139J4298J4683J4979J4892J4155J2673J0772Q994P587O376N247
$$ plain form
57192 5108834 5113217 5117123 5120657 5123493 5125297 5126248 5127107 5128709 5131251 5134066 5136234 5137491 5138404 5139619 5141213
57177 5141213 5142935 5144693 5146362 5147316 5146753 5144546 5141392 5137943 5134117 5129418 5123689 5117352 5111034 5105070
57163 5105070 5099262 5093040 5085961 5077993 5069205 5059389 5048311 5036333 5024321 5012846 5001796 4990928
57151 4990928 4980396 4970459 4960984 4951602 4942229 4933200 4924947 4917675 4911129 4904371 4895923 4884374 4868720
57138 4868720 4847828 4819719 4781790 4731975 4669818 4596916 4517012 4435678 4359132 4292321 4237438
57127 4237438 4193846 4159221 4130971 4107240 4087217 4070834 4058154 4048929 4042588 4038485 4036164 4035529
57115 4035529 4036956 4041304 4049832 4064091 4085809 4116710 4158327 4211956 4278806 4360312 4458449 4576020
57103 4576020 4716860 4885843 5088749 5332166 5623629 5971893 6387019 6879988 7461838
$$ packed form
57192E108834M383L906L534K836J804R51Q59J602K542K815K168J257R13J215J594
57177E141213J722J758J669R54n63k207l154l449l826m699n729o337o318n964
57163E105070n808o222p079p968q788r816j1078j1978j2012j1475j1050j0868
57151D990928j0532r937r475r382r373r029q253p272o546o758q448j1549j5654
57138D868720k0892k8109l7929m9815o2157p2902p9904q1334p6546o6811n4883
57127D237438m3592l4625k8250k3731k0023j6383j2680r225o341m103k321o35
57115D035529J427M348Q528J4259K1718L0901M1617N3629O6850Q1506R8137J17571
57103D576020J40840J68983K02906K43417K91463L48264M15126M92969N81850
$$ plain form
57094 7461838 8142492 8929577 9827509 10837124 11955761 13177304 14491743 15884373 17335078
57085 17335078 18817870 20300624 21745324 23109578 24349379 25422082 26288729 26916064
57077 26916064 27279177 27364585 27172381 26716424 26022557 25125247 24063006 22873617 21590968
57068 21590968 20244705 18861900 17468606 16089841 14748382 13463524 12250458 11120029
57060 11120029 10078696 9128809 8269303 7496447 6804366 6185767 5633121 5139792 4700105
57051 4700105 4308525 3959174 3646357 3365326 3112345 2884312 2678501 2492439 2323613
57042 2323613 2169356 2027233 1895485 1772939 1658694 1552112 1452877 1360644 1274740 1194521
57032 1194521 1119850 1050780 986853 927182 871214 818983 770619 726047 685147 647702 613109
$$ packed form
57094G461838O80654P87085Q97932J009615J118637J221543J314439J392630J450705
57085A7335078J482792J482754J444700J364254J239801J072703Q66647O27335
57077B6916064L63113Q5408j92204m55957o93867q97310j062241j189389j282649
57068B1590968j346263j382805j393294j378765j341459j284858j213066j130429
57060A1120029j041333r49887q59506p72856o92081o18599n52646m93329m39687
57051D700105l91580l49351l12817k81031k52981k28033k05811j86062j68826
57042B323613j54257j42123j31748j22546j14245j06582r9235r2233q5904q0219
57032A194521p4671o9070o3927n9671n5968n2231m8364m4572m0900l7445l4593
$$ plain form
57021 613109 580676 550275 522165 496068 471154 447208 425048 405221 386914 368934 351301
57010 351301 334967 320143 305821 291087 276105 261495 247353 233318 219243 205281 191520
56999 191520 177957 164870 152859 142360 133276 125284 118417 113157 109893 108552 108982 111506 116765
56986 116765 125010 135846 148638 162697 177018 190345 201853 211414 218906 223705 225324 224254 221655
56973 221655 218399 214833 211186 207616 203982 200281 197294 196175 197313 200182 204347 209905 216701 223965
56959 223965 231342 239646 249813 261353 272499 281688 288216 291501 290715 285595 277180 267149 256548
56946 256548 245517 234174 223359 214291 207654 203197 200225 198428 198155 199973 204115 210463 218999 230002
56932 230002 243637 259386 275941 291648 304939 314371 318613 316803 309156 297078 282472 266794
$$ packed form
57021F13109l2433l0401k8110k6097k4914k3946k2160j9827j8307j7980j7633
57010C51301j6334j4824j4322j4734j4982j4610j4142j4035j4075j3962j3761
56999A91520j3563j3087j2011j0499r084p992o867n260l264j341M30K524N259
56986A16765Q245J0836J2792J4059J4321J3327J1508R561P492M799J619j070k599
56973B21655l256l566l647l570l634l701k987j119J138K869M165N558O796P264
56959B23965P377Q304J0167J1540J1146R189O528L285p86n120q415j0031j0601
56946B56548j1031j1343j0815r068o637m457k972j797k73J818M142O348Q536J1003
56932B30002J3635J5749J6555J5707J3291R432M242j810p647j2078j4606j5678
$$ plain form
56920 266794 250724 234560 218733 203895 190617 179117 169273 160895 153978 148656 144850 142003 139354
56907 139354 136538 133831 131677 130021 128286 126097 123868 122510 122574 123842 125739 127909 130309 132930 135729
56892 135729 138817 142520 147215 153164 160463 168972 178292 187917 197375 206027 212865 216856 217594 215402
56878 215402 210819 204353 196874 189728 184028 179940 177029 175196 175009 177157 181922 189102 198230 208902
56864 208902 221235 236089 254518 276824 302156 328871 354987 378265 396347 407294 410268 405802
56852 405802 395572 381810 366616 351483 337285 324564 313785 305449 300164 298544 300861 306882
56840 306882 316293 329304 346569 368583 395495 427534 464915 506711 549831 589545 621193 641436
56828 641436 648338 641234 621237 591718 557486 522782 489832 459248 431516 407744 388996 375372
$$ packed form
56920B66794j6070j6164j5827j4838j3278j1500r844q378o917n322l806k847k649
56907A39354k816k707k154j656j735k189k229j358O4J268J897K170K400K621K799
56892A35729L088L703M695N949P299Q509R320R625R458Q652O838L991P38k192
56878B15402m583o466p479p146n700m088k911j833j87K148M765P180R128J0672
56864B08902J2333J4854J8429K2306K5332K6715K6116K3278J8082J0947K974m466
56852D05802j0230j3762j5194j5133j4198j2721j0779q336n285j620K317O021
56840C06882R411J3011J7265K2014K6912L2039L7381M1796M3120L9714L1648K0243
56828F41436O902p104j9997k9519l4232l4704l2950l0584k7732k3772j8748j3624
$$ plain form
56816 375372 366071 360297 357920 359350 365053 375259 390037 409493 433722 462186 492869 522072
56804 522072 545383 559187 561663 552888 534449 508863 478899 447063 415480 385943 359680 337044
56792 337044 317642 300943 286766 275323 267040 262382 261653 264795 271367 280728 292266 305554 320173
56779 320173 335049 347888 355743 356764 351322 341127 327459 310814 292051 272927 255022 238633
56767 238633 223223 208608 195260 183666 173935 165951 159485 154036 148907 143635 138225 132984 128243
56754 128243 124280 121289 119284 118052 117220 116415 115382 114030 112419 110731 109290 108440 108243 108259 107872 106989
56738 106989 106236 106322 107257 108349 108967 109139 109377 110000 110781 111300 111517 111814 112458 113260 113887 114280 114549 114637 114460
56719 114460 114237 114236 114205 113541 112195 110973 110680 111265 112079 112628 112739 112328 111580 111247 112165 114275 116466 117656
$$ packed form
56816C75372r301n774k377J430N703J0206J4778J9456K4229K8464L0683K9203
56804E22072K3311J3804K476q775j8439k5586k9964l1836l1583k9537k6263k2636
56792C37044j9402j6699j4177j1443q283m658p29L142O572R361J1538J3288J4619
56779C20173J4876J2839P855J021n442j0195j3668j6645j8763j9124j7905j6389
56767B38633j5410j4615j3348j1594r731p984o466n449n129n272n410n241m741
56754A28243l963k991k005j232q32q05j033j352j611j688j441q50j97J6l87q83
56738A06989p53Q6R35J092O18J72K38O23P81N19K17K97O44Q02O27L93K69Q8j77
56719A14460k23jl1o64j346j222k93N85Q14N49J11m11p48l33R18K110K191J190
$$ plain form
56701 117656 117909 118304 119790 122267 124732 126200 126446 125980 125499 125472 126062 127165 128478 129661 130558 131160 131451
56684 131451 131489 131598 132108 132822 133101 132732 132382 132874 134245 135845 137202 138383 139568 140720 141743 142689 143650
56667 143650 144611 145470 146029 146003 145227 143897 142377 140784 139008 137179 135808 135158 134710 133571 131419 128821
56651 128821 126584 125059 124203 124024 124560 125425 125781 125054 123557 122155 121413 121310 121632 122243 122969 123567 123975
56634 123975 124315 124536 124359 123776 123324 123553 124390 125271 125817 126143 126542 127053 127311 126830 125532 124011 123039 122725
56616 122725 122488 121972 121612 122031 123206 124573 125737 126712 127707 129033 131024 133596 136021 137588 138411 139233
56600 139233 140487 141957 143253 144208 144809 145153 145539 146223 147120 148015 148910 149771 150156 149714 148987 148956 149708 150291
56582 150291 150148 149912 150375 151335 152094 152609 153448 154867 156573 158309 160085 161897 163682 165621 168110 171359
$$ packed form
56701A17656K53L95J486K477K465J468K46m66m81k7N90J103J313J183Q97O02K91
56684A31451L8J09N10P14K79l69l50M92J371J600J357J181J185J152J023R46R61
56667A43650R61Q59N59k6p76j330j520j593j776j829j371o50m48j139k152k598
56651A28821k237j525q56j79N36Q65L56p27j497j402p42j03L22O11P26N98M08
56634A23975L40K21j77n83m52K29Q37Q81N46L26L99N11K58m81j298j521r72l14
56616A22725k37n16l60M19J175J367J164R75R95J326J991K572K425J567Q23Q22
56600A39233J254J470J296R55O01L44L86O84Q97Q95Q95Q61L85m42p27l1P52N83
56582A50291j43k36M63R60P59N15Q39J419J706J736J776J812J785J939K489L249
$$ plain form
56566 171359 175257 179540 183859 187851 191520 195488 200439 206249 212015 216946 220972 224474 227780 231003
56552 231003 233986 236278 237450 237653 237640 238060 238876 239556 239629 238868 237136 234314 230315 225060 218561 211252
56536 211252 204097 198028 193179 188871 184411 179785 175461 171818 169009 167283 167004 168084 169590 170243 169412
56521 169412 167543 165591 164185 163361 162888 162544 162096 161238 159788 157901 155945 154133 152358 150421 148289
56506 148289 146043 143724 141488 139830 139288 139723 140197 139833 138691 137593 137195 137538 138363 139413 140291 140440
56490 140440 139595 138168 136961 136512 136794 137459 138229 139097 140224 141636 143091 144331 145454 146861 148744 150765
56474 150765 152328 153134 153441 153808 154647 155972 157598 159570 162151 165265 168189 170182 171314 172303 173543
56459 173543 174719 175461 175903 176354 176822 177172 177530 178141 178978 179710 180017 179800 179257 178865 179058 179766 180430 180632
$$ packed form
56566A71359L898M283M319L992L669L968M951N810N766M931M026L502L306L223
56552B31003K983K292J172K03j3M20Q16O80P3p61j732k822l999n255o499p309
56536B11252p155o069m849m308m460m626m324l643k809j726k79J080J506O53q31
56521A69412j869j952j406q24m73l44m48q58j450j887j956j812j775j937k132
56506A48289k246k319k236j658n42M35M74l64j142j098l98L43Q25J050Q78J49
56490A40440q45j427j207m49K82O65P70Q68J127J412J455J240J123J407J883K021
56474A50765J563Q06L07L67Q39J325J626J972K581L114K924J993J132R89J240
56459A73543J176P42M42M51M68L50L58O11Q37P32L07k17n43l92J93P08O64K02
$$ plain form
56441 180632 180494 180328 180197 179986 179593 178872 177751 176590 175970 175735 174807 172535 169777 167935 167211 166664 165783
56424 165783 165011 164620 164100 163099 162232 162369 163622 165534 167872 170579 173216 175017 175661 175692 176156 177842
56408 177842 180721 184007 186972 189735 192981 196825 200420 202936 204490 205710 206734 207162 206778 205790 204408
56393 204408 202701 200932 199594 198941 198702 198385 197717 196758 195793 195191 195185 195722 196595 197636 198706 199619 200364 201298
56375 201298 202831 204849 206710 207880 208409 208753 209335 210334 211666 213028 214170 215247 216798 219134 221815
56360 221815 223902 224846 225094 225704 227263 229233 230536 230867 231212 232846 235896 239169 241447 242662 243739
56345 243739 245513 248047 250905 253754 256570 259410 262198 264842 267373 269767 271684 272683 272863 273083 274271
56330 274271 276624 279679 283026 286617 290432 294266 298034 301987 306412 311269 316262 321115 325645 329708
$$ packed form
56441A80632j38j66j31k11l93p21j121j161o20k35r28k272k758j842p24n47q81
56424A65783p72l91n20j001q67J37J253J912K338K707K637J801O44L1M64J686
56408A77842K879L286K965K763L246L844L595K516J554J220J024M28l84r88j382
56393B04408j707j769j338o53k39l17o68r59r65o02oN37Q73J041J070R13P45R34
56375B01298J533K018J861J170N29L44N82R99J332J362J142J077J551K336K681
56360B21815K087R44K48O10J559J970J303L31L45J634L050L273K278J215J077
56345B43739J774K534K858K849K816K840K788K644K531K394J917R99J80K20J188
56330B74271K353L055L347L591L815L834L768L953M425M857M993M853M530M063
$$ plain form
56316 329708 333276 336429 339141 341178 342395 343059 343646 344358 345012 345428 345753 346361 347479 348939 350254 351025
56300 351025 351377 351997 353644 356604 360629 365220 369887 374293 378502 383068 388606 395144 402105 409032 416122
56285 416122 423870 432421 441531 450998 460791 470792 480830 491217 502944 517024 533678 552449
56273 552449 573087 596037 621874 650611 681926 716146 754588 798683 848840 904427 964742
56262 964742 1029731 1099720 1174855 1255056 1340318 1430549 1525004 1622043 1719535 1815360 1907608
56251 1907608 1994612 2074958 2147263 2209790 2260556 2298177 2322584 2334655 2335251 2324871 2304221 2274672
56239 2274672 2237854 2194869 2146038 2091333 2031002 1965865 1897167 1826123 1753529 1679822 1605447
56228 1605447 1531115 1457728 1386208 1317416 1252019 1190297 1132139 1077414 1026371 979610 937608
$$ packed form
56316C29708L568L153K712K037J217O64N87P12O54M16L25O08J118J460J315P71
56300C51025L52O20J647K960M025M591M667M406M209M566N538O538O961O927P090
56285D16122P748Q551R110R467R793J0001J0038J0387J1727J4080J6654J8771
56273E52449K0638K2950K5837K8737L1315L4220L8442M4095N0157N5587O0315
56262I64742O4989O9989P5135Q0201Q5262R0231R4455R7039R7492R5825R2248
56251A907608Q7004Q0346P2305O2527N0766L7621K4407J2071N96j0380k0650k9549
56239B274672l6818m2985m8831n4705o0331o5137o8698p1044p2594p3707p4375
56228A605447p4332p3387p1520o8792o5397o1722n8158n4725n1043m6761m2002
$$ plain form
56217 937608 900134 866148 834371 804156 775786 749869 726574 705577 686572 669489 654271
56206 654271 640795 629017 618822 609719 601122 593101 586411 581493 577824 574583 571618 569403 568271
56193 568271 568155 568862 570174 571758 573413 575388 578125 581735 586006 590848 596410 602803 610026 618093 627016
56178 627016 636730 647288 658932 671709 685270 699399 714431 730589 747230 763422 779112 794976
56166 794976 811193 827238 842967 859030 875929 893505 911766 931480 953549 978530 1007330
56155 1007330 1041708 1083462 1133663 1193316 1264312 1349151 1450377 1571070 1715254 1886434
56145 1886434 2085156 2307865 2547072 2791515 3026968 3239572 3420672 3569490 3691995
56136 3691995 3797821 3897051 3996673 4097018 4190651 4265555 4311036 4322693 4303975 4264088 4213658
$$ packed form
56217I37608l7474l3986l1777l0215k8370k5917k3295k0997j9005j7083j5218
56206F54271j3476j1778j0195r103q597q021o690m918l669l241k965k215j132
56193E68271j16P07J312J584J655J975K737L610M271M842N562O393P223Q067Q923
56178F27016R714J0558J1644J2777J3561J4129J5032J6158J6641J6192J5690J5864
56166G94976J6217J6045J5729J6063J6899J7576J8261J9714K2069K4981K8800
56155A007330L4378M1754N0201N9653P0996Q4839J01226J20693J44184J71180
56145A886434J98722K22709K39207K44443K35453K12604J81100J48818J22505
56136C691995J05826R9230R9622J00345R3633P4904M5481J1657j8718l9887n0430
$$ plain form
56125 4213658 4160294 4105858 4045902 3970872 3869162 3731840 3557018 3350884 3124944 2892134
56115 2892134 2664277 2450866 2258199 2089075 1943599 1820525 1718066 1634110 1566334 1512365
56105 1512365 1469885 1436812 1411520 1392733 1379224 1369840 1363760 1360236 1358002 1355418 1351486 1346286 1340200
56092 1340200 1333155 1325047 1316465 1308413 1301464 1295543 1290379 1285800 1281811 1278772 1277322 1277735 1279539 1282213
56078 1282213 1286085 1291982 1300084 1309646 1319946 1330982 1343082 1356258 1370273 1385026 1400582 1416877
56066 1416877 1433576 1450214 1466478 1482509 1498905 1516284 1534790 1554171 1574289 1595326 1617447
56055 1617447 1640556 1664465 1689128 1714598 1740884 1767963 1795789 1824259 1853317 1883131 1914011
56044 1914011 1946111 1979399 2013980 2050206 2088316 2128215 2169746 2212923 2257675 2303752 2351255
$$ packed form
56125D213658n3364n4436n9956p5030j01710j37322j74822k06134k25940k32810
56115B892134k27857k13411j92667j69124j45476j23074j02459q3956o7776n3969
56105A512365m2480l3073k5292j8787j3509r384o080l524k234k584l932n200o086
56092A340200p045q108q582q052o949n921n164m579l989l039j450M13J804K674
56078A282213L872N897Q102R562J0300J1036J2100J3176J4015J4753J5556J6295
56066A416877J6699J6638J6264J6031J6396J7379J8506J9381K0118K1037K2121
56055A617447K3109K3909K4663K5470K6286K7079K7826K8470K9058K9814L0880
56044A914011L2100L3288L4581L6226L8110L9899M1531M3177M4752M6077M7503
$$ plain form
56033 2351255 2401011 2453787 2509184 2565974 2623663 2683044 2744859 2808613 2873372 2939303 3007561
56022 3007561 3078724 3152147 3226969 3303115 3381152 3461741 3545501 3632863 3723695 3817456 3913944
56011 3913944 4013539 4116673 4223658 4335297 4452860 4576983 4707185 4843016 4985141 5134693
56001 5134693 5292194 5457839 5632271 5816169 6009531 6212324 6425579 6650890 6889116
55992 6889116 7140533 7406075 7687372 7985696 8301979 8637833 8995435 9376277 9781061
55983 9781061 10211080 10668909 11157702 11680771 12241920 12845265 13494812 14195324 14953650
55974 14953650 15778115 16676901 17658589 18734514 19919178 21228534 22679972 24294760
55966 24294760 26099288 28124156 30404832 32985045 35919438 39274492 43131239 47590239
$$ packed form
56033B351255M9756N2776N5397N6790N7689N9381O1815O3754O4759O5931O8258
56022C007561P1163P3423P4822P6146P8037Q0589Q3760Q7362R0832R3761R6488
56011C913944R9595J03134J06985J11639J17563J24123J30202J35831J42125J49552
56001E134693J57501J65645J74432J83898J93362K02793K13255K25311K38226
55992F889116K51417K65542K81297K98324L16283L35854L57602L80842M04784
55983I781061M30019M57829M88793N23069N61149O03345O49547P00512P58326
55974A4953650Q24465Q98786R81688J075925J184664J309356J451438J614788
55966B4294760J804528K024868K280676K580213K934393L355054L856747M459000
$$ plain form
55958 47590239 52774523 58829684 65924797 74253480 84031289 95494815 108913145 124605733
55950 124605733 142941721 164298876 188962897 216925012 247546894 279191660 309099475
55943 309099475 333787804 349960804 355525617 350190872 335382656 313619164 287718236
55936 287718236 260171783 232832512 206882145 182961577 161342168 142068095 125053697
55929 125053697 110144667 97153212 85876557 76109405 67655670 60336639 53992983
55922 53992983 48484073 43688219 39502349 35839099 32623372 29790835 27287189 25066523
55914 25066523 23089778 21324337 19743242 18323202 17043308 15885631 14835812 13881974
55906 13881974 13013395 12220464 11494999 10829830 10218528 9655911 9138021 8660890 8219757
$$ packed form
55958D7590239N184284O055161P095113Q328683R777809J1463526J3418330J5692588
55950A24605733J8335988K1357155K4664021K7962115L0621882L1644766K9907815
55943C09099475K4688329J6173000N564813n334745j4808216k1763492k5900928
55936B87718236k7546453k7339271k5950367k3920568k1619409j9274073j7014398
55929A25053697j4909030j2991455j1276655r767152q453735p319031o343656
55922E3992983n508910m795854m185870l663250l215727k832537k503646k220666
55914B5066523j976745j765441j581095j420040j279894j157677j049819r53838
55906A3881974q68579p92931p25465o65169o11302n62617n17890m77131m41133
$$ plain form
55897 8219757 7809966 7428093 7071805 6739214 6428866 6139771 5870817 5620411 5386982
55888 5386982 5169408 4966600 4777059 4599155 4431390 4272186 4119974 3973877 3833918
55879 3833918 3700304 3572917 3451607 3336311 3226617 3121819 3021719 2926762 2837096 2752104
55869 2752104 2671156 2594071 2520477 2449511 2380782 2314948 2252657 2193452 2136393 2081316 2028778
55858 2028778 1979171 1932569 1889171 1849223 1812621 1779019 1748006 1718741 1689872 1660517 1631110
55847 1631110 1602707 1575728 1549961 1525548 1503199 1483384 1465892 1450179 1435702 1421958 1408644
55836 1408644 1395730 1382996 1369571 1354339 1336716 1316664 1294089 1268853 1241451 1213184 1185434
55825 1185434 1158921 1133673 1109355 1085518 1061717 1037658 1013343 989256 966398 945806 927780
$$ packed form
55897H219757m09791l81873l56288l32591l10348k89095k68954k50406k33429
55888E386982k17574k02808j89541j77904j67765j59204j52212j46097j39959
55879C833918j33614j27387j21310j15296j09694j04798j00100r4957q9666q4992
55869B752104q0948p7085p3594p0966o8729o5834o2291n9205n7059n5077n2538
55858B028778m9607m6602m3398l9948l6602l3602l1013k9265k8869k9355k9407
55847A631110k8403k6979k5767k4413k2349j9815j7492j5713j4477j3744j3314
55836A408644j2914j2734j3425j5232j7623k0052k2575k5236k7402k8267k7750
55825A185434k6513k5248k4318k3837k3801k4059k4315k4087k2858k0592j8026
$$ plain form
55814 927780 911716 896818 882835 870040 858821 849475 842061 836243 831552 827951 825711 824577 823658
55801 823658 822514 821730 821878 822514 822812 822602 821723 818721 811335 798465 780903 760104 737131 712997
55787 712997 689167 667118 647760 631507 618465 608225 599863 592490 585646 579077 572502 565832 559270
55774 559270 552912 546373 538989 530315 520429 509922 499556 489728 480319 471229 462805 455330 448233 440386
55760 440386 431219 421160 410974 401202 392262 384546 378187 372997 368662 364600 359756 353331 345949 339409
55746 339409 334845 331539 327873 322972 317128 311177 306023 302346 300142 298608 296851 294575 291844 288583
55732 288583 284776 280876 277436 274412 271304 267916 264579 261635 259068 256569 253673 249959 245484 241022
55718 241022 237528 235347 234165 233535 233065 232261 230743 228755 227001 225865 225136 224627 224676 225755 227802 230178
$$ packed form
55814I27780j6064j4898j3983j2795j1219r346p414n818m691l601k240j134r19
55801H23658j144p84J48O36K98k10q79l002p386j2870j7562k0799k2973k4134
55787G12997k3830k2049j9358j6253j3042j0240q362p373o844o569o575o670o562
55774E59270o358o539p384q674r886j0507j0366r828r409r090q424p475p097p847
55760D40386r167j0059j0186r772q940p716o359n190m335m062m844o425p382o540
55746C39409m564l306l666m901n844n951n154l677k204j534j757k276k731l261
55732B88583l807l900l440l024l108l388l337k944k567k499k896l714m475m462
55718B41022l494k181j182o30m70q04j518j988j754j136p29n09M9J079K047K376
$$ plain form
55702 230178 232181 233548 234633 236193 238803 242280 245816 248754 251197 253833 257334 261884 267013 271754
55688 271754 275186 277043 277727 277708 277061 275600 273204 269859 265588 260553 255051 249267 243190 236991 231233
55673 231233 226415 222387 218543 214561 210711 207452 204965 203080 201425 199708 198082 197300 198141 200635 204053
55658 204053 207707 211542 215856 220792 226264 231986 237282 241165 243058 243364 242958 242184 240704 238315 235441
55643 235441 232661 230021 227074 223470 219405 215589 212764 211128 210143 209051 207529 205670 203365 200082
55629 200082 195355 189239 182158 174621 167255 160715 155195 150191 145114 140048 135538 131705 127988 123866
55615 123866 119571 115886 113388 112007 111265 110765 110392 110052 109422 108133 106204 104064 102055 100122 98121
55600 98121 96233 94885 94371 94649 95319 95681 95099 93581 91818 90380 89144 87817 86698 86388 86912 87772
$$ packed form
55702B30178K003J367J085J560K610L477L536K938K443K636L501M550N129M741
55688B71754L432J857O84j9o47j461k396l345m271n035n502n784o077o199n758
55673B31233m818m028l844l982l850l259k487j885j655j717j626p82Q41K494L418
55658B04053L654L835M314M936N472N722N296L883J893L06m06p74j480k389k874
55643B35441k780k640k947l604m065l816k825j636r85j092j522j859k305l283
55629B00082m727o116p081p537p366o540n520n004n077n066m510l833l717m122
55615A23866m295l685k498j381p42n00l73l40o30j289j929k140k009j933k001
55600I8121j888j348n14K78O70L62n82j518j763j438j236j327j119l10N24Q60
$$ plain form
55584 87772 88872 90739 93629 96988 100133 103074 106305 110091 114338 118986 124108 129653 135229 140059
55570 140059 143071 143273 140394 135141 128727 122142 115881 110127 105013 100752 97576 95399 93612 91526
55556 91526 89137 87082 85668 84309 82243 79478 76624 74057 71745 69732 68157 66718 64670 61664
55542 61664 58303 55612 54131 53726 54073 54995 56339 57813 59141 60322 61574 62964 64188 64870 65051 65188
55526 65188 65629 66292 66983 67831 69174 71139 73531 76107 78726 81300 83780 86244 88805 91441 94050
55511 94050 96644 99283 101791 103701 104549 104176 102748 100610 98088 95286 92002 87986 83319 78456 73850
55496 73850 69634 65691 61961 58589 55780 53467 51210 48613 45944 44086 43631 44102 44284 43346 41470
55481 41470 39448 37940 37092 36587 35903 34692 33067 31507 30541 30512 31410 32629 33082 32010 29802 27698
$$ packed form
55584H7772J100J867K890L359L145K941L231L786M247M648N122N545N576M830
55570A40059L012K02k879n253o414o585o261n754n114m261l176k177j787k086
55556I1526k389k055j414j359k066k765k854k567k312k013j575j439k048l006
55542F1664l361k691j481m05L47R22J344J474J328J181J252J390J224O82J81J37
55526F5188M41O63O91Q48J343J965K392K576K619K574K480K464K561K636K609
55511I4050K594K639K508J910Q48l73j428k138k522k802l284m016m667m863m606
55496G3850m216l943l730l372k809k313k257k597k669j858m55M71J82r38j876
55481D1470k022j508q48n05o84j211j625j560r66k9Q98J219M53j072k208k104
$$ plain form
55465 27698 26611 26517 27013 27959 29331 30878 32295 33498 34412 34751 34386 33746 33456 33641 33950 34129 34191 34077
55447 34077 33547 32525 31239 30009 29091 28689 28757 28824 28397 27586 26943 26627 26221 25495 24856 24699 24785 24672 24401
55428 24401 24254 24109 23615 22923 22645 23018 23592 23887 23891 23759 23495 23261 23655 25150 27312 28907 28924 27413 25349
55409 25349 23778 23076 22935 22991 23327 24229 25521 26502 26700 26447 26444 26910 27458 27759 28003 28596 29599 30633 31267
55390 31267 31386 31181 30868 30504 30091 29703 29356 28834 27947 26999 26678 27210 27851 27532 25936 23626 21239 18959
55372 18959 16866 15395 15075 15918 17262 18220 18254 17443 16288 15315 14782 14759 15282 16236 17185 17635 17549 17379 17460
55353 17460 17598 17443 17022 16678 16621 16819 17202 17666 17899 17575 16871 16538 17214 18766 20493 21862 22806 23372
55335 23372 23426 22907 22152 21629 21362 20877 19886 18816 18444 19016 19965 20493 20298 19676 19006 18306 17297 15887
$$ packed form
55465B7698j087r4M96R46J372J547J417J203R14L39l65o40k90J85L09J79O2j14
55447C4077n30j022j286j230r18m02O8O7m27q11o43l16m06p26o39j57Q6j13k71
55428B4401j47j45m94o92k78L73N74K95Mj32k64k34L94J495K162J595J7j511k064
55409B5349j571p02j41N6L36R02J292R81J98k53lM66N48L01K44N93J003J034O34
55390C1267J19k05l13l64m13l88l47n22q87r48l21N32O41l19j596k310k387k280
55372A8959k093j471l20Q43J344R58L4q11j155r73n33k3N23R54R49M50q6j70Q1
55353A7460J38j55m21l44n7J98L83M64K33l24p04l33O76J552J727J369R44N66
55335B3372N4n19p55n23k67m85r91j070l72N72R49N28j95o22o70p00j009j410
$$ plain form
55317 15887 14456 13549 13320 13444 13576 13717 13976 14281 14543 14982 15912 17246 18514 19374 19811 19870 19561 19092
55299 19092 18844 18911 18956 18694 18274 18039 18149 18639 19552 20759 21840 22408 22424 22019 21304 20566 20349 20880 21584
55280 21584 21585 20643 19231 17834 16547 15334 14218 13128 11955 10853 10173 10033 10267 10794 11604 12274 12034
55263 12034 10633 8731 7159 6103 5435 5453 6648 8860 11214 13014 14263 15169 15643 15576 15291 15298 15735
55246 15735 16366 17070 17952 18934 19646 19917 20115 20677 21479 21973 21856 21249 20269 18910 17447 16459 16155 16086 15915
55227 15915 16084 17162 18750 19735 19590 18781 17814 16600 15081 13823 13429 13727 14048 14086 13989 13826 13486 13057
55209 13057 12859 13069 13650 14598 15866 17063 17655 17556 17184 16933 16935 17312 18138 19033 19316 18881 18456 18646 19207
55190 19207 19721 20527 22169 24097 24861 23867 22226 21362 21285 20866 19499 17765 16464 15697 15200 15081 15638
$$ packed form
55317A5887j431r07k29J24J32J41K59L05K62M39R30J334J268Q60M37N9l09m69
55299A9092k48O7M5k62m20k35J10M90R13J207J081N68J6m05p15p38k17N31P04
55280B1584Jr42j412j397j287j213j116j090j173j102o80j40K34N27Q10O70k40
55263A2034j401j902j572j056o68J8J195K212K354J800J249R06M74o7k85PM37
55246A5735O31P04Q82R82P12K71J98N62Q02M94j17o07r80j359j463r88l04o9j71
55227A5915J69J078J588R85j45q09r67j214j519j258l94K98L21L8r7j63l40m29
55209A3057j98K10N81R48J268J197N92r9l72k51KL77Q26Q95K83m35m25J90N61
55190A9207N14Q06J642J928P64r94j641q64p7m19j367j734j301p67m97j19N57
$$ plain form
55173 15638 16681 17562 17974 18309 19038 19980 20457 20045 19007 18020 17625 17902 18456 18707 18293 17315 16141 15027
55155 15027 14041 13263 12903 13121 13857 14854 15778 16299 16253 15852 15592 15814 16435 17175 17906 18624 19194 19377 19116
55136 19116 18579 17904 17109 16315 15893 16198 17241 18676 20091 21295 22369 23485 24615 25525 26166 26985 28502
55119 28502 30566 32391 33588 34824 37137 40793 45117 49226 52395 53876 53095 50375 46924 43700 40627
55104 40627 37338 34332 32691 32662 33153 32872 31547 29806 28290 27295 27010 27535 28614 29729 30597 31312 31928
55087 31928 32210 32026 31757 32008 32927 34122 35174 35959 36383 36226 35510 34815 34747 35020 34474 32254 28872 25850
55069 25850 24346 24301 24833 25200 25251 25195 25281 25746 26818 28498 30406 32020 33115 33842 34375 34720 35028 35851
55051 35851 37700 40315 42692 43992 44263 44113 43913 43579 43047 42573 42418 42472 42460 42475 43078 44709 47114 49556
$$ packed form
55173A5638J043Q81M12L35P29R42M77m12j038r87l95K77N54K51m14r78j174j114
55155A5027r86p78l60K18P36R97R24N21m6m01k60K22O21P40P31P18N70J83k61
55136A9116n37o75p95p94m22L05J043J435J415J204J074J116J130R10O41Q19J517
55119B8502K064J825J197J236K313L656M324M109L169J481p81k720l451l224l073
55104D0627l289l006j641k9M91k81j325j741j516r95k85N25J079J115Q68P15O16
55087C1928K82j84k69K51R19J195J052P85M24j57p16o95o8K73n46k220l382l022
55069B5850j504m5N32L67N1n6Q6M65J072J680J908J614J095P27N33L45L08Q23
55051C5851J849K615K377J300K71j50k00l34n32m74j55N4j2J5O03J631K405K442
$$ plain form
55033 49556 51626 53676 56262 59339 62307 64823 67163 69566 71558 72361 71873 70864 70131 69836 69754 69841
55017 69841 70221 70761 71000 70503 69173 67205 64905 62566 60345 58160 55738 52914 49896 47212 45292
55002 45292 44084 43178 42360 41904 42105 42677 42932 42610 42126 41845 41547 41035 40923 42126 44513 46744 47701 47641
54984 47641 47604 48112 48899 49639 50421 51558 53387 56202 59909 63705 66549 68120 69054 70229 72160 75108
54968 75108 79255 84504 90558 97433 105517 114823 124698 134770 145855 159289 175556 194050 213961
54955 213961 234591 254756 272592 286288 294685 297152 293505 284405 271410 256251 240158 223852
54943 223852 207734 191844 176113 160949 147265 135655 125902 117550 110489 104624 99500 94808 90916
54930 90916 88309 86719 85438 84283 83683 83950 85111 87372 91029 95871 101384 107727 115904 126729 140177
$$ packed form
55033D9556K070K050K586L077K968K516K340K403J992Q03m88j009p33k95q2Q7
55017F9841L80N40K39m97j330j968k300k339k221k185k422k824l018k684j920
55002D5292j208r06q18m56K01N72K55l22m84k81k98n12j12J203K387K231R57o0
54984D7641l7N08P87P40P82J137J829K815L707L796K844J571R34J175J931K948
54968G5108M147N249O054O875Q084R306R875J0072J1085J3434J6267J8494J9911
54955B13961K0630K0165J7836J3696Q397K467l647r100j2995j5159j6093j6306
54943B23852j6118j5890j5731j5164j3684j1610r753q352p061n865n124m692l892
54930I0916k607j590j281j155o00K67J161K261L657M842N513O343Q177J0825J3448
$$ plain form
54915 140177 155916 173762 193144 212671 230776 246480 259013 267107 269415 265620 256657 243842
54903 243842 228266 211034 193484 176764 161354 147207 134244 122532 112049 102535 93772 85999
54891 85999 79802 75362 71961 68589 65083 62261 60793 60378 60271 60163 60028 59453 57930 55860 54533 54760
54875 54760 55991 57118 57797 58496 59477 60260 60144 58862 56651 53994 51488 49717 48952 48955 49162 49049 48289
54858 48289 46767 44648 42398 40525 39187 38153 37123 35971 34674 33253 31866 30823 30305 30172 30186
54843 30186 30340 30803 31565 32359 32960 33440 34078 35111 36576 38303 39978 41302 42110 42398 42289 42000 41725
54826 41725 41465 41066 40579 40482 41393 43612 46934 50775 54400 57349 59908 62955 66978 71448 75569 79496
54810 79496 84315 90863 99144 108892 120098 132749 146755 162472 180625 201092 222087 241115
$$ packed form
54915A40177J5739J7846J9382J9527J8105J5704J2533Q094K308l795q963j2815
54903B43842j5576j7232j7550j6720j5410j4147j2963j1712j0483r514q763p773
54891H5999o197m440l401l372l506k822j468m15j07j08j35n75j523k070j327K27
54875E4760J231J127O79O99R81P83j16j282k211k657k506j771p65LK07j13p60
54858D8289j522k119k250j873j338j034j030j152j297j421j387j043n18j33J4
54843C0186J54M63P62P94O01M80O38J033J465J727J675J324Q08K88j09k89k75
54826D1725k60l99m87r7R11K219L322L841L625K949K559L047M023M470M121L927
54810G9496M819O548Q281R748J1206J2651J4006J5717J8153K0467K0995J9028
$$ plain form
54798 241115 256513 267631 273928 274761 270079 260704 247809 232564 216297 200381 185683 172485
54786 172485 161054 151817 144669 138582 132435 126199 120991 117907 116924 116876 116418 115078 113541 112911 113647
54771 113647 115316 117291 119497 122354 126274 131461 138102 146470 156754 168948 182997 198977 216958
54758 216958 236619 257004 276750 294574 309489 320588 327029 328659 326638 323022 319439 316247 313056
54745 313056 309761 306688 303816 300208 294397 285252 272531 256912 239680 222159 205115 188647 172704
54732 172704 157648 144105 132317 121938 112542 104068 96654 90286 84909 80646 77535 75170 72940
54719 72940 70622 68370 66222 64068 62217 61394 61820 62666 62832 62057 60955 60202 60084 60630 61656 62683
54703 62683 63193 63067 62569 61980 61473 61237 61351 61578 61662 61828 62594 64007 65434 66220 66258 65796 65074 64350 64002
$$ packed form
54798B41115J5398J1118O297Q33m682r375j2895j5245j6267j5916j4698j3198
54786A72485j1431r237p148o087o147o236n208l084r83m8m58j340j537o30P36
54771A13647J669J975K206K857L920N187O641Q368J0284J2194J4049J5980J7981
54758B16958J9661K0385J9746J7824J4915J1099O441J630k021l616l583l192l191
54745C13056l295l073k872l608n811r145j2721j5619j7232j7521j7044j6468j5943
54732A72704j5056j3543j1788j0379r396q474p414o368n377m263l111k365k230
54719G2940k318k252k148k154j851q23M26Q46J66p75j102p53j18N46J026J027
54703F2683N10j26m98n89n07k36J14K27Q4J66P66J413J427P86L8m62p22p24l48
$$ plain form
54684 64002 64311 65238 66563 68119 69843 71803 74248 77350 80785 83871 86286 88375 90529 92550 93937
54669 93937 94569 94789 94965 95261 95722 96271 96755 97254 98226 99955 101957 103343 103821 104012 104761 106518 109487
54652 109487 113870 119606 126130 132796 139506 146717 154904 164246 174734 186352 199201 213688 230597
54639 230597 250703 274252 300908 330088 360909 391560 419050 439992 451845 453557 445507 429289
54627 429289 407364 382287 355839 328910 302161 276520 252964 232103 214127 198916 186014
54616 186014 174786 164889 156442 149479 143382 137224 130668 124188 118362 113202 108312 103498 99038 95362
54602 95362 92627 90665 89354 88843 89131 89491 88792 86707 84260 82762 82392 82246 81603 80572 79579 78814 78350
54585 78350 78227 78172 77651 76584 75661 75577 76169 76610 76337 75480 74492 73603 72633 71226 69346 67589 66817 67359
$$ packed form
54684F4002L09R27J325J556J724J960K445L102L435L086K415K089K154K021J387
54669I3937O32K20J76K96M61N49M84M99R72J729K002J386M78J91P49J757K969
54652A09487M383N736O524O666O710P211Q187R342J0488J1618J2849J4487J6909
54639B30597K0106K3549K6656K9180L0821L0651K7490K0942J1853J712q050j6218
54627D29289k1925k5077k6448k6929k6749k5641k3556k0861j7976j5211j2902
54616A86014j1228r897q447o963o097o158o556o480n826n160m890m814m460l676
54602I5362k735j962j311n11K88L60o99k085k447j498l70j46o43j031r93p65m64
54585G8350j23n5n21j067r23q4N92M41k73q57r88q89r70j407j880j757p72N42
$$ plain form
54567 67359 68706 69989 70559 70122 68798 67292 66521 66681 66930 66356 65021 63642 62571 61635 60851 60670 61426
54550 61426 62959 64929 67136 69463 71783 74010 76044 77672 78805 79764 80995 82547 84220 86255 89381
54535 89381 93995 99724 106002 112747 120207 128526 137796 148331 160467 174135 188781 203523 217246
54522 217246 228766 237198 242050 242806 238828 230186 218406 205777 193718 182123 170375 158617 147810
54509 147810 138801 131601 125473 119580 113623 108007 103374 99886 97026 94115 90938 87843 85400 84052
54495 84052 83839 84259 84545 84324 83963 84034 84497 84668 84018 82715 81264 79918 78689 77747 77452 77914 78760 79461
54477 79461 79827 80101 80578 81226 81659 81526 80842 79859 78662 77101 75216 73508 72575 72568 73181 74043 74830 75126
54459 75126 74620 73581 72794 72771 73247 73606 73618 73564 73858 74794 76422 78366 79858 80356 80068 79648 79402 79134 78723
$$ packed form
54567F7359J347J283N70m37j324j506p71J60K49n74j335j379j071r36p84j81P56
54550F1426J533J970K207K327K320K227K034J628J133R59J231J552J673K035L126
54535H9381M614N729O278O745P460Q319R270J0535J2136J3668J4646J4742J3723
54522B17246J1520Q432M852P56l978q642j1780j2629j2059j1595j1748j1758j0807
54509A47810r009p200o128n893n957n616m633l488k860k911l177l095k443j348
54495H4052k13M20K86k21l61P1M63J71o50j303j451j346j229r42k95M62Q46P01
54477G9461L66K74M77O48M33j33o84r83j197j561j885j708r33pO13Q62P87K96
54459G5126n06j039p87k3M76L59J2n4K94R36J628J944J492M98k88m20k46k68m11
$$ plain form
54440 78723 78422 78413 78485 78349 77989 77445 76513 75117 73843 73604 74619 75965 76375 75406 73731 72376 71799 71681
54422 71681 71505 71210 71190 71687 72391 72822 72973 73307 74149 75365 76759 78460 80712 83508 86745 90512 94812
54405 94812 99071 102434 104678 106475 108549 110856 112811 114032 114560 114587 114293 113827 113140 111957 110181 108198
54389 108198 106390 104519 102026 98911 95861 93429 91546 89929 88518 87311 86207 85260 84689 84369 83713
54374 83713 82406 80838 79359 77522 74751 71514 69069 68054 67959 68049 68081 67898 67131 65885 65168 65872 67559
54357 67559 68966 69718 70797 73163 76527 79942 83108 86473 90143 93385 95421 96269 96480 96339 95726 94573
54341 94573 93102 91568 90075 88679 87421 86154 84611 82660 80345 77659 74534 71141 67906 65082
54327 65082 62573 60269 58292 56695 55277 53900 52732 51898 51160 50273 49339 48457 47341 45856 44746 45103
$$ packed form
54440G8723l01rP2j36l60n44r32j396j274k39J015J346M10r69j675j355n77j18
54422G1681j76k95k0M97P04M31J51L34Q42J216J394J701K252K796L237L767M300
54405I4812M259L363K244J797K074K307J955J221N28K7k94m66o87j183j776j983
54389A08198j808j871k493l115l050k432j883j617j411j207j104r47n71l20o56
54374H3713j307j568j479j837k771l237k445j015r5R0L2j83p67j246p17P04J687
54357F7559J407P52J079K366L364L415L166L365L670L242K036Q48K11j41o13j153
54341I4573j471j534j493j396j258j267j543j951k315k686l125l393l235k824
54327F5082k509k304j977j597j418j377j168q34p38q87r34q82j116j485j110L57
$$ plain form
54311 45103 47001 49146 50101 49495 47954 46324 45165 44606 44342 43948 43370 42990 43107 43653 44458 45475 46549
54294 46549 47267 47363 47088 46966 47268 47852 48323 48270 47596 46770 46500 46976 47718 48363 49248 50811 52674 53818 53688
54275 53688 52707 51736 51335 51584 52282 53105 53685 53720 53075 51922 50829 50603 51735 54010 56668 58923 60326
54258 60326 60906 61174 61752 62734 63548 63697 63452 63512 64126 64985 65847 66768 67709 68425 68925 69575 70509 71297 71440
54239 71440 70848 69594 67602 65002 62517 60996 60613 60844 61110 61105 60645 59715 58667 57959 57528 56833 55614
54222 55614 54224 53008 51751 50116 48306 46878 46025 45438 44851 44365 44190 44371 44845 45502 46155 46642 47078
54205 47078 47744 48634 49360 49649 49716 49969 50509 51123 51664 52192 52783 53320 53462 52768 51012 48536 46117 44344
54187 44344 43277 42892 43498 45228 47265 48211 47422 45585 43774 42322 40895 39325 37896 36943 36521 36455
$$ packed form
54311D5103J898K145R55o06j541j630j159n59k64l94n78l80J17N46Q05J017J074
54294D6549P18R6k75j22L02N84M71n3o74q26k70M76P42O45Q85J563J863J144j30
54275E3688r81r71m01K49O98Q23N80L5o45j153j093k26J132K275K658K255J403
54258F0326N80K68N78R82Q14J49k45O0O14Q59Q62R21R41P16N00O50R34P88J43
54239G1440n92j254j992k600k485j521l83K31K66nm60r30j048p08m31o95j219
54222E5614j390j216j257j635j810j428q53n87n87m86j75J81M74O57O53M87M36
54205D7078O66Q90P26K89O7K53N40O14N41N28N91N37J42o94j756k476k419j773
54187D4344j067l85O06J730K037R46p89j837j811j452j427j570j429r53m22o6
$$ plain form
54171 36455 36459 36227 35679 35140 35026 35297 35457 35189 34785 34801 35390 36123 36390 35886 34772 33537 32741 32745 33496 34491
54151 34491 35045 34793 34054 33605 33952 34821 35453 35387 34820 34215 33748 33266 32720 32452 33001 34662 37166 39754
54133 39754 41634 42509 42703 42721 42754 42697 42564 42571 42743 42733 42313 41820 41796 42240 42562 42370 41926 41722 41925 42460 43371
54112 43371 44725 46256 47410 47789 47409 46606 45845 45502 45576 45682 45483 45058 44683 44448 44431 45056 46790 49399
54094 49399 51901 53399 53682 52957 51449 49464 47490 45878 44695 44118 44680 46697 49535 51904 52980
54079 52980 53023 52880 53093 53591 54066 54499 55237 56552 58219 59695 60664 61184 61287 60822 59908 59214 59407 60469
54061 60469 61836 63067 64074 64887 65638 66731 68516 70691 72480 73607 74709 76485 78753 80825 82651
54046 82651 85067 88812 93656 98688 103237 107287 111126 114904 118524 121733 124248 125962 127143 128247
$$ packed form
54171C6455Mk32n48n39j14K71J60k68m04J6N89P33K67n04j114j235p96MP51R95
54151C4491N54k52p39m49L47Q69O32o6n67o05m67m82n46k68N49J661K504K588
54133C9754J880Q75J94J8L3n7j33PJ72j0m20m93k4M44L22j92m44k04K03N35R11
54112D3371J354J531J154L79l80q03p61l43P4J06j99m25l75k35j7O25J734K609
54094D9399K502J498K83p25j508j985j974j612j183n77N62K017K838K369J076
54079E2980M3j43K13M98M75M33P38J315J667J476R69N20J03m65r14o94J93J062
54061F0469J367J231J007Q13P51J093J785K175J789J127J102J776K268K072J826
54046H2651K416L745M844N032M549M050L839L778L620L209K515J714J181J104
$$ plain form
54032 128247 129415 130280 130461 130100 129680 129414 129081 128444 127498 126282 124708 122747 120549 118275 115980 113691
54016 113691 111293 108285 104075 98832 93702 89804 87191 85100 82972 80797 78675 76621 74838 73624
54002 73624 72854 71966 70681 69367 68444 67800 67099 66444 66239 66455 66452 65659 64178 62568 61223 60203 59581 59613
53984 59613 60433 61737 63046 64258 65708 67586 69430 70352 69738 67728 65142 63005 61959 61917 62287 62554
53968 62554 62634 62701 62895 63305 64036 65099 66295 67374 68224 68804 69040 68977 68944 69399 70632 72684 75430 78609
53950 78609 81931 85265 88587 91719 94455 97097 100440 104839 109594 113795 117555 121935 127728 134862
53936 134862 142922 151701 161172 171409 182609 194706 206824 217632 226436 233545 239371 243708 246177
53923 246177 246980 246733 245801 244175 241871 239140 236294 233520 230792 227924 224768 221414 217996 214456 210744
$$ packed form
54032A28247J168Q65J81l61m20k66l33o37r46j216j574j961k198k274k295k289
54016A13691k398l008m210n243n130l898k613k091k128k175k122k054j783j214
54002G3624p70q88j285j314r23o44p01o55k05K16lp93j481j610j345j020o22L2
53984E9613Q20J304J309J212J450J878J844R22o14k010k586k137j046m2L70K67
53968F2554Q0O7J94M10P31J063J196J079Q50N80K36o3l3M55J233K052K746L179
53950G8609L322L334L322L132K736K642L343M399M755M201L760M380N793P134
53936A34862Q060Q779R471J0237J1200J2097J2118J0808Q804P109N826M337K469
53923B46177Q03k47r32j626k304k731k846k774k728k868l156l354l418l540l712
$$ plain form
53908 210744 207129 203855 200502 196320 191335 186492 182404 178525 173988 168692 163034 157090 150774 144496
53894 144496 138911 134145 129887 126120 123103 120644 118080 115106 112034 109090 106014 102661 99508 97125
53880 97125 95408 93742 91824 90011 88823 88263 87765 86759 85162 83244 81175 79041 77233 76302 76145
53865 76145 75904 75065 74268 74355 74980 74969 73966 72876 72494 72544 72388 72067 72131 72897 74286 76049 77813 79208
53847 79208 80292 81501 82866 83703 83492 82712 82256 82275 82142 81429 80321 79132 77963 76948 76346 76221 76365
53830 76365 76659 77227 78104 79074 80045 81322 83219 85485 87325 88060 87713 87017 86878 87799 89652 91915 94058
53813 94058 95910 97935 101101 106049 112157 117809 121923 124993 128231 131963 135453 138114 140136 141717
53799 141717 142459 142027 140934 140062 139607 139089 138291 137622 137424 137387 136901 135691 133853 131512 128752 125815 123073
$$ packed form
53908B10744l615l274l353m182m985m843m088l879m537n296n658n944o316o278
53894A44496n585m766m258l767l017k459k564k974l072k944l076l353l153k383
53880I7125j717j666j918j813j188n60m98j006j597j918k069k134j808r31j57
53865G6145k41q39p97Q7O25j1j003j090l82N0j56l21O4P66J389J763J764J395
53847G9208J084J209J365Q37k11p80m56J9j33p13j108j189j169j015o02j25J44
53830G6365K94N68Q77R70R71J277J897K266J840P35l47o96j39R21J853K263K143
53813I4058J852K025L166M948O108N652M114L070L238L732L490K661K022J581
53799A41717P42m32j093q72m55n18p98o69j98l7m86j210j838k341k760k937k742
$$ plain form
53782 123073 120691 118496 116240 113845 111289 108386 104910 100968 97057 93608 90574 87605 84585 81792
53768 81792 79497 77637 75946 74348 73014 72113 71610 71289 70910 70333 69598 68869 68271 67770 67307 66956 66817
53751 66817 66707 66132 64800 63103 61862 61467 61443 61018 60024 58970 58291 57873 57370 56637 55633 54235 52575
53734 52575 51354 51267 52088 52809 52849 52743 53387 54888 56488 57451 57734 57866 58409 59478 60646 61319 61320 61004 60807
53715 60807 60892 61283 62000 62766 62935 62162 61021 60516 60987 61829 62291 62204 61911 61831 62177 62838 63492 64091 65203
53696 65203 67491 70852 74460 77744 80832 83868 86413 88015 88984 90063 91439 92578 93058 93134 93318 93694
53680 93694 93918 93803 93684 94079 95059 96170 97047 97857 98866 99778 99995 99530 99114 99212 99450 99337 99081 99208 99754
53661 99754 100356 100929 101628 102299 102584 102592 102856 103508 104041 104106 104113 104695 105919 107330 108544 109464 110032 110137 109816 109399
$$ packed form
53782A23073k382k195k256k395k556k903l476l942l911l449l034k969l020k793
53768H1792k295j860j691j598j334r01n03l21l79n77p35p29n98n01m63l51j39
53751F6817j10n75j332j697j241l95k4m25r94j054o79m18n03p33j004j398j660
53734E2575j221q7Q21P21M0j06O44J501J600R63K83J32N43J069J168O73Jl16j97
53715F0807Q5L91P17P66J69p73j141n05M71Q42M62q7k93q0L46O61O54N99J112
53696F5203K288L361L608L284L088L036K545J602R69J079J376J139M80P6J84L76
53680I3694K24j15j19L95R80J111Q77Q10J009R12K17m65m16R8K38j13k56J27N46
53661I9754O02N73O99O71K85QK64O52N33O5PN82J224J411J214R20N68J05l21m17
$$ plain form
53641 109399 109336 109815 110494 110620 109602 107514 104974 102577 100563 99040 98246 98498 99892 102113 104453 106139
53625 106139 106848 106923 106899 106888 106631 106125 105825 106126 106894 107673 108168 108398 108546 108791 109201 109716 110303 111140 112464
53606 112464 114292 116490 119032 121903 124760 127125 129027 131051 133533 136075 138104 139581 140783 141689
53592 141689 142088 142193 142656 143868 145537 147070 148196 149102 150139 151439 152759 153701 154143 154400 154836 155417
53576 155417 155816 155879 155768 155595 155173 154301 153190 152366 152128 152203 152096 151691 151349 151393 151706 151982 152185 152538 153136
53557 153136 153767 154064 153690 152512 150912 149841 150133 151656 153488 155019 156489 158256 159933 160687 160241 159219
53541 159219 158520 158585 159255 160113 160899 161658 162514 163413 164193 164923 165948 167527 169562 171763 173948 176138 178471
53524 178471 181016 183562 185741 187598 189849 193123 197090 200901 204455 208508 213386 218340 222623 226537
$$ packed form
53641A09399o3M79O79J26j018k088k540k397k014j523p94K52J394K221K340J686
53625A06139P09P5k4j1k57n06l00L01P68P79M95K30J48K45M10N15N87Q37J324
53606A12464J828K198K542K871K857K365J902K024K482K542K029J477J202R06
53592A41689L99J05M63J212J669J533J126R06J037J300J320R42M42K57M36N81
53576A55417L99O3j11j73m22q72j111q24k38P5j07m05l42M4L13K76K03L53N98
53557A53136O31K97l74j178j600j071K92J523J832J531J470J767J677P54m46j022
53541A59219o99O5O70Q58P86P59Q56Q99P80P30J025J579K035K201K185K190K333
53524A78471K545K546K179J857K251L274L967L811L554M053M878M954M283L914
$$ plain form
53510 226537 230900 236035 241880 248578 256188 264144 271811 279429 287803 297161 306996 316984 327308 338052
53496 338052 348962 360038 371806 384717 398644 413112 427631 441742 455163 468083 480994
53485 480994 494102 507176 519994 532583 545010 557359 569969 583258 597157 611136 624886
53474 624886 638597 652382 665883 678704 690914 702898 714957 727207 739595 751789 763300
53463 763300 773901 783820 793433 802961 812419 821580 829926 836964 842625 847030 849889 850609 849110 846090
53449 846090 842264 837782 832598 826996 821365 815781 810077 804129 797819 790963 783443 775201 766007 755616
53435 755616 744300 732811 721592 710393 698872 687079 675096 662748 650251 638718 629307 621966
53423 621966 615556 609197 603081 598016 594553 592584 591470 590501 589417 588475 588022 588281 589624 592598 597255
$$ packed form
53510B26537M363N135N845O698P610P956P667P618Q374R358R835R988J0324J0744
53496C38052J0910J1076J1768J2911J3927J4468J4519J4111J3421J2920J2911
53485D80994J3108J3074J2818J2589J2427J2349J2610J3289J3899J3979J3750
53474F24886J3711J3785J3501J2821J2210J1984J2059J2250J2388J2194J1511
53463G63300J0601R919R613R528R458R161Q346P038N661M405K859P20j499l020
53449H46090l826m482n184n602n631n584n704n948o310o856p520q242r194j0391
53435G55616j1316j1489j1219j1199j1521j1793j1983j2348j2497j1533r411p341
53423F21966o410o359o116n065l463j969j114r69j084r42m53K59J343K974M657
$$ plain form
53408 597255 602841 608583 614538 621186 628444 635731 642943 650740 659749 669949 680976 692625 704897
53395 704897 717865 731638 746290 761770 778052 795341 813864 833540 854143 875764 898755
53384 898755 923207 948784 975098 1001964 1029306 1057134 1085690 1115260 1145716 1176530 1207295
53373 1207295 1237981 1268627 1299087 1329189 1358869 1387977 1416121 1442765 1467378 1489596 1509545
53362 1509545 1527944 1545486 1562050 1576970 1590155 1602359 1614008 1624228 1631554 1635348 1636003 1633856
53350 1633856 1628536 1619515 1606828 1590908 1571952 1549850 1524827 1497858 1470170 1442325 1414019 1384923
53338 1384923 1355547 1326953 1299678 1273314 1247353 1222044 1197979 1174994 1151983 1127925 1102732
53327 1102732 1076937 1050933 1024858 998951 973568 948919 925191 902901 882645 864354 847325
$$ packed form
53408E97255N586N742N955O648P258P287P212P797R009J0200J1027J1649J2272
53395G04897J2968J3773J4652J5480J6282J7289J8523J9676K0603K1621K2991
53384H98755K4452K5577K6314K6866K7342K7828K8556K9570L0456L0814L0765
53373A207295L0686L0646L0460L0102K9680K9108K8144K6644K4613K2218J9949
53362A509545J8399J7542J6564J4920J3185J2204J1649J0220P326L794O55k147
53350A633856n320r021j2687j5920j8956k2102k5023k6969k7688k7845k8306k9096
53338A384923k9376k8594k7275k6364k5961k5309k4065k2985k3011k4058k5193
53327A102732k5795k6004k6075k5907k5383k4649k3728k2290k0256j8291j7029
$$ plain form
53316 847325 831263 816836 804765 794740 785783 777402 769651 762253 754486 746053 737363 728689 719793
53303 719793 710717 702230 694918 688403 682046 676022 670959 666858 663121 659522 656494 654464 653442 653232
53289 653232 653568 654084 654750 656290 659600 664725 670897 677613 685094 693643 703156 713433 724399 735869
53275 735869 747616 759811 772803 786232 799048 810836 822520 835205 848755 862010 874042
53264 874042 884628 893826 901808 909057 916093 922880 928824 933353 936147 936907 935398 931908 927244 921983
53250 921983 915840 907941 897660 885097 870873 855675 840044 824366 808736 792718 775642 757478
53238 757478 739198 721865 705501 689453 673793 659481 646878 634886 622190 608753 595369
53227 595369 582145 568339 553547 538215 522918 507899 493552 480582 469269 459017 449074 439450
$$ packed form
53316H47325j6062j4427j2071j0025q957q381p751p398p767q433q690q674q896
53303G19793r076q487p312o515o357o024n063m101l737l599l028k030j022k10
53289F53232L36N16O66J540L310N125O172O716P481Q549R513J0277J0966J1470
53275G35869J1747J2195J2992J3429J2816J1788J1684J2685J3550J3255J2032
53264H74042J0586R198P982P249P036O787N944M529K794P60j509l490m664n261
53250I21983o143p899j0281j2563j4224j5198j5631j5678j5630j6018j7076j8164
53238G57478j8280j7333j6364j6048j5660j4312j2603j1992j2696j3437j3384
53227E95369j3224j3806j4792j5332j5297j5019j4347j2970j1313j0252r943r624
$$ plain form
53215 439450 430758 423361 417015 411271 406001 401468 397915 395012 391795 387332 381418 374422 366636 358181
53201 358181 349418 340813 332226 322967 312865 302747 293479 285058 277202 270225 264437 259026 252624 245112
53187 245112 237928 232265 227743 223283 218528 213740 208900 203778 198613 193924 189678 185359 180914 176955
53173 176955 173836 171164 168501 166035 164162 162810 161626 160532 159701 159150 158718 158335 157974 157497 156929 156734
53157 156734 157315 158246 158481 157545 156131 155299 155316 155613 155655 155484 155385 155422 155514 155795 156576 157884 159249 160087 160161 159529
53137 159529 158233 156361 154300 152519 151066 149650 148339 147699 147933 148281 147717 146027 143842 141813 140195
53122 140195 139015 138149 137275 136251 135552 135894 137358 139208 140539 140755 139565 137096 134101 131480 129446
53107 129446 127568 125678 124100 122865 121452 119735 118512 118483 119162 119414 118750 117487 115920 114061 112132
$$ packed form
53215D39450q692p397o346n744n270m533l553k903l217m463n914o996p786q455
53201C58181q763q605q587r259j0102j0118r268q421p856o977n788n411o402p512
53187B45112p184n663m522m460m755m788m840n122n165m689m246m319m445l959
53173A76955l119k672k663k466j873j352j184j094q31n51m32l83l61m77n68j95
53157A56734N81R31K35r36j414q32J7K97M2j71r9L7R2K81P81J308J365Q38P4o32
53137A59529j296j872k061j781j453j416j311o40K34L48n64j690k185k029j618
53122A40195j180q66q74j024o99L42J464J850J331K16j190k469k995k621k034
53107A29446j878j890j578j235j413j717j223k9O79K52o64j263j567j859j929
$$ plain form
53092 112132 110624 109706 109019 108145 106946 105411 103570 101657 100012 98713 97582 96558 95769 95182 94487 93472
53076 93472 92231 90915 89535 88143 86973 86234 85918 85974 86490 87526 88879 90192 91248 92139 93190 94802
53060 94802 97234 100410 103932 107369 110526 113443 116198 118723 120746 121879 121855 120763 119021 117045 114986
53045 114986 112832 110664 108649 106702 104398 101435 98152 95318 93316 91760 90060 88078 86031 84034
53031 84034 82197 80989 80924 81789 82613 82605 81780 80571 79269 78073 77289 77025 76991 76910 76924 77246 77635 77622 77139 76556
53011 76556 76171 75986 75938 76061 76395 76936 77583 77946 77461 76077 74662 74305 75185 76468 77306 77587 77703 77988
52993 77988 78558 79436 80623 82071 83587 84726 84941 84121 82883 82064 81972 82315 82699 82859 82526 81563 80276
52976 80276 79228 78682 78497 78607 79176 80208 81372 82385 83266 84085 84750 85226 85684 86276 86970 87724 88566 89368
$$ packed form
53092A12132j508r18o87q74j199j535j841j913j645j299j131j024p89n87o95j015
53076I3472j241j316j380j392j170p39l16N6N16J036J353J313J056Q91J051J612
53060I4802K432L176L522L437L157K917K755K525K023J133k4j092j742j976k059
53045A14986k154k168k015j947k304k963l283k834k002j556j700j982k047j997
53031H4034j837j208o5Q65Q24qq25j209j302j196p84k64l4q1J4L22L89j3m83n83
53011G6556l85j85m8J23L34N41O47L63m85j384j415l57Q80J283Q38K81J16K85
52993G7988N70Q78J187J448J516J139K15q20j238q19r2L43L84J60l33r63j287
52976H0276j048n46j85J10N69J032J164J013Q81Q19O65M76M58N92O94P54Q42Q02
$$ plain form
52958 89368 89824 89844 89758 89936 90379 90904 91491 92186 92849 93247 93372 93433 93524 93511 93341 93332 93933 95099 96089 96191 95740
52937 95740 96018 97857 100608 102861 103955 104275 104271 103808 102690 101247 100123 99786 100425 101966 103990 105931
52921 105931 107593 109221 110979 112680 114194 115725 117398 118929 120008 120748 121501 122489 123934 126191 129375
52906 129375 132971 136169 138532 140117 141195 142083 143029 143846 143903 142821 141105 139651 138702 137668 135934 133507
52890 133507 130836 128360 126369 124968 124016 123215 122407 121652 120982 120207 119108 117778 116628 115967 115575 114857
52874 114857 113510 111962 110973 110922 111690 113068 114881 116765 118372 119945 122227 125483 129024 131928 133854
52859 133854 134822 134669 133281 131065 128623 126140 123599 121413 120179 119759 119218 117827 115713 113415 111207
52844 111207 109090 107115 105421 104083 103098 102455 102140 102117 102261 102241 101603 100115 97992 95630 93266 91009
$$ packed form
52958H9368M56K0q6J78M43N25N87O95O63L98J25O1R1j3j70rO01J166R90J02m51
52937I5740K78J839K751K253J094L20mm63j118j443j124l37O39J541K024J941
52921A05931J662J628J758J701J514J531J673J531J079P40P53R88J445K257L184
52906A29375L596L198K363J585J078Q88R46Q17N7j082j716j454r49j034j734k427
52890A33507k671k476j991j401r52q01q08p55o70p75j099j330j150o61l92p18
52874A14857j347j548r89n1P68J378J813J884J607J573K282L256L541K904J926
52859A33854R68j53j388k216k442k483k541k186j234m20n41j391k114k298k208
52844A11207k117j975j694j338r85o43l15k3J44k0o38j488k123k362k364k257
$$ plain form
52828 91009 89030 87442 86139 85040 84359 84308 84646 84848 84738 84693 85194 86358 87785 88744 88724 88011 87529 87832
52810 87832 88548 89050 89237 89222 88794 87905 87331 87905 89217 90016 89887 89604 89678 89602 88923 88125 87879 88150 88679 89724
52790 89724 91614 94006 96253 98264 100378 102631 104658 106156 107051 107345 107204 107007 106973 106957 106806 106551 105991
52773 105991 104608 102326 99861 97756 95516 92365 88469 84703 81537 78972 77286 76893 77421 77820 77548
52758 77548 76949 76417 75850 75091 74217 73182 71831 70440 69677 69811 70623 72176 74828 78145 80690 81547 81391
52741 81391 81347 81376 80607 78818 76690 74793 73155 71768 70712 69712 68311 66694 65711 65786 66309 66444 66141
52724 66141 65986 66291 66698 66615 65817 64677 63885 63882 64490 65165 65597 65875 66123 66233 66052 65614 65037 64448 64073 64194
52704 64194 64841 65705 66516 67362 68427 69577 70463 70921 71080 71088 70911 70453 69733 68938 68356 68196 68420 68849 69515
$$ packed form
52828I1009j979j588j303j099o81n1L38K02j10m5N01J164J427R59k0p13m82L03
52810H7832P16N02J87j5m28q89n74N74J312P99j29k83P4p6o79p98k46K71N29J045
52790H9724J890K392K247K011K114K253K027J498Q95K94j41j97l4j6j51k55n60
52773A05991j383k282k465k105k240l151l896l766l166k565j686l93N28L99k72
52758G7548n99n32n67p59q74j035j351j391p63J34Q12J553K652L317K545Q57j56
52741H1391m4K9p69j789k128j897j638j387j056j000j401j617r83P5N23J35l03
52724F6141j55L05M07q3p98j140p92lO08O75M32K78K48J10j81m38n77n89l75J21
52704F4194O47Q64Q11Q46J065J150Q86M58J59Qj77m58p20p95n82j60K24M29O66
$$ plain form
52685 69515 70714 72480 74118 74592 73468 71355 69416 68604 69200 70759 72401 73463 73996 74465 75011 75338
52669 75338 75458 76026 77545 79532 81000 81651 82134 83107 84534 85984 87143 87793 87722 87063 86476 86594 87321
52652 87321 88034 88416 88756 89332 89869 89863 89333 88960 89426 90758 92441 94095 95829 97867 100014 101791 103025
52635 103025 104056 105271 106746 108395 110134 111617 112168 111390 109760 108177 106963 105726 104240 102960 102466
52620 102466 102799 103627 104701 105746 106145 105315 103491 101758 101070 101389 101833 101590 100601 99535 99183 99792 100855
52603 100855 101529 101362 100637 100055 100004 100141 99775 98777 97943 98189 99388 100442 100619 100383 100567 101140 101396 101145
52585 101145 100943 101086 101125 100682 100179 100248 100839 101468 102053 102934 104168 105330 106057 106383 106519 106648 106936 107417 107854
52566 107854 108044 108254 108880 109711 110090 109949 110123 111312 113204 115009 116344 117155 117240 116549 115710 115460 115577 115087
$$ packed form
52685F9515J199J766J638M74j124k113j939q12N96J559J642J062N33M69N46L27
52669G5338J20N68J519J987J468O51M83R73J427J450J159O50p1o59n87J18P27
52652H7321P13L82L40N76N37on30l73M66J332J683J654J734K038K147J777J234
52635A03025J031J215J475J649J739J483N51p78j630j583j214j237j486j280m94
52620A02466L33Q28J074J045L99q30j824j733o88L19M44k43r89j066l52O09J063
52603A00855O74j67p25n82n1J37l66r98q34K46J199J054J77k36J84N73K56k51
52585A01145k02J43L9m43n03O9N91O29N85Q81J234J162P27L26J36J29K88M81M37
52566A07854J90K10O26Q31L79j41J74J189J892J805J335Q11Q5o91q39k50J17m90
$$ plain form
52548 115087 113640 112052 111201 110992 110749 110155 109343 108440 107603 107287 107917 109224 110338 110645 110301 109854 109601
52531 109601 109407 108976 108214 107458 107317 108116 109456 110526 110874 110668 110198 109433 108229 106722 105247 104002 102996
52514 102996 102235 101656 100975 99907 98605 97572 96980 96296 94885 92835 90941 89887 89661 89848 90197 90742
52498 90742 91470 92118 92383 92240 92007 92110 92731 93626 94285 94356 93958 93601 93754 94459 95342 95978 96239 96303 96354 96350 96110
52477 96110 95578 94920 94346 93947 93711 93605 93587 93552 93340 92819 92035 91338 91218 91864 92923 93906 94780 95882 97275
52458 97275 98549 99425 100125 100832 101205 100929 100469 100640 101464 102132 102171 102050 102358 102986 103457 103559 103196 102102 100347
52439 100347 98840 98549 99256 99799 99611 99370 99819 100646 101063 101063 101376 102254 102922 102465 100895 99117 98082 98155
52421 98155 99085 100287 101104 101123 100443 99648 99411 100005 101113 102102 102559 102632 102792 103253 103728 103886 103911 104335 105282
$$ packed form
52548A15087j447j588q51k09k43n94q12r03q37l16O30J307J114L07l44m47k53
52531A09601j94m31p62p56j41P99J340J070L48k06m70p65j204j507j475j245j006
52514A02996p61n79o81j068j302j033n92o84j411k050j894j054k26J87L49N45
52498I0742P28O48K65j43k33J03O21Q95O59P1l98l57J53P05Q83O36K61O4N1mk40
52477I6110n32o58n74l99k36j06j8l5k12n21p84o97j20O46J059R83Q74J102J393
52458I7275J274Q76P00P07L73k76m60J71Q24O68L9j21L08O28M71J02l63j094j755
52439A00347j507k91P07N43j88k41M49Q27M17%L13Q78O68m57j570j778j035P3
52421I8155R30J202Q17J9o80p95k37N94J108R89M57P3J60M61M75J58K5M24R47
$$ plain form
52402 105282 106280 106985 107803 109349 111449 113104 113536 112920 112038 111546 111707 112426 113241 113556 113256 112959 113341 114301
52384 114301 115128 115388 115280 115120 114885 114423 113841 113479 113630 114405 115680 117080 118182 118951 119855 121343 123230
52367 123230 124808 125583 125822 126292 127528 129396 131342 132951 134239 135462 136780 138152 139428 140428 140992
52352 140992 141095 140954 140909 141179 141727 142356 142916 143481 144359 145854 147960 150358 152771 155212 157786 160417 162950
52335 162950 165465 168243 171483 175213 179475 184311 189525 194705 199628 204512 209727 215376 221330 227613
52321 227613 234616 242794 252151 262109 271997 281734 291914 303233 315925 329778 344386 359230 373838
52308 373838 388176 402623 417248 431381 444470 457108 470489 484749 498610 510954 522078
52297 522078 532925 543574 553156 561031 567439 573021 578087 582380 585313 586496 586208 585157 583599 581005
$$ packed form
52402A05282R98P05Q18J546K100J655M32o16q82m92J61P19Q15L15l00k97L82R60
52384A14301Q27K60j08j60k35m62n82l62J51P75J275J400J102P69R04J488J887
52367A23230J578P75K39M70J236J868J946J609J288J223J318J372J276J000N64
52352A40992J03j41m5K70N48O29N60N65Q78J495K106K398K413K441K574K631K533
52335A62950K515K778L240L730M262M836N214N180M923M884N215N649N954O283
52321B27613P003Q178R357R958R888R737J0180J1319J2692J3853J4608J4844J4608
52308C73838J4338J4447J4625J4133J3089J2638J3381J4260J3861J2344J1124
52297E22078J0847J0649R582P875O408N582N066M293K933J183k88j051j558k594
$$ plain form
52283 581005 576891 571628 566002 560305 554501 549023 544626 541415 538677 535895 533349 531522 530506 530260
52269 530260 530969 532765 535508 539260 544568 551825 560593 569984 579560 589420 599627 610068 620792 631979
52255 631979 643460 654679 665266 675265 684675 693166 700460 706736 712316 717162 720991 723719 725388
52242 725388 725704 724148 720805 716733 713096 710002 706509 701703 695436 687994 679582 670425 661017 651843
52228 651843 642949 634129 625369 616737 608034 599127 590576 583304 577471 572286 567226 562844 559914 558195
52214 558195 556710 554954 553203 551763 550580 549663 549321 549755 550802 552247 554027 556003 557926 559813 562075
52199 562075 565008 568372 571601 574218 575923 576628 576683 576806 577451 578354 578916 578860 578253 577106 575302 572905 570241
52182 570241 567688 565523 563854 562453 560778 558475 555802 553242 550784 547970 544690 541545 539207 537759
$$ packed form
52283E81005m114n263n626n697n804n478m397l211k738k782k546j827j016k46
52269E30260P09J796K743L752N308P257Q768R391R576R860J0207J0441J0724J1187
52255F31979J1481J1219J0587R999R410Q491P294O276N580M846L829K728J669
52242G25388L16j556l343m072l637l094l493m806o267p442q412r157r408r174
52228F51843q894q820q760q632q703q907q551p272n833n185n060m382k930j719
52214E58195j485j756j751j440j183r17l42M34J047J445J780J976J923J887K262
52199E62075K933L364L229K617J705P05N5J23O45R03N62n6o07j147j804k397k664
52182E70241k553k165j669j401j675k303k673k560k458k814l280l145k338j448
$$ plain form
52168 537759 536835 536141 535500 534615 533192 531385 529808 528923 528445 527500 525409 522316 518973 515952 513197 510385
52152 510385 507515 504922 502843 501272 500168 499492 498969 498136 496799 495257 493918 492860 491837 490529 488783
52137 488783 486852 485429 485081 485520 485877 485925 486601 488891 492580 496648 500691 505301 511103 518013 525573 533526
52121 533526 541936 551086 561398 573095 585835 599012 612467 626490 641075 655680 669956 684225
52109 684225 698936 714025 729109 743976 758531 772577 785984 798808 810916 821878 831554 840345
52097 840345 848297 854374 857365 857413 855912 853931 851456 848219 844413 840195 835111 828534 820453 811482 802328
52082 802328 793504 785259 777493 769955 762747 756399 751227 746913 743076 739931 738003 737355 737654 738940 741827
52067 741827 746694 752958 759435 765396 771198 777862 786035 795379 804993 814381 823808 833666 843776 853467
$$ packed form
52168E37759r24o94o41q85j423j807j577q85m78r45k091l093l343l021k755k812
52152E10385k870k593k079j571j104o76n23q33j337j542j339j058j023j308j746
52137D88783j931j423l48M39L57M8O76K290L689M068M043M610N802O910P560P953
52121E33526Q410R150J0312J1697J2740J3177J3455J4023J4585J4605J4276J4269
52109F84225J4711J5089J5084J4867J4555J4046J3407J2824J2108J0962R676Q791
52097H40345P952O077K991M8j501j981k475l237l806m218n084o577q081q971r154
52082H02328q824q245p766p538p208o348n172m314l837l145j928o48K99J286K887
52067G41827M867O264O477N961N802O664Q173R344R614R388R427R858J0110R691
$$ plain form
52053 853467 862142 869484 875329 879645 882574 884167 884112 882080 878391 873980 869547 864902 859243 851870 842596
52038 842596 831748 820013 808061 795991 783212 769129 753982 738776 724375 710816 697549
52027 697549 684087 670256 656094 641900 628341 616069 605034 594504 584023 573989 564878 556207
52015 556207 546911 536727 526458 516668 506864 496469 485973 476325 467504 458554 448963 439148 429352
$$ packed form
52053H53467Q675P342N845M316K929J593n5k032l689m411m433m645n659p373r274
52038H42596j0848j1735j1952j2070j2779j4083j5147j5206j4401j3559j3267
52027F97549j3462j3831j4162j4194j3559j2272j1035j0530j0481j0034r111q671
52015E56207r296j0184j0269r790r804j0395j0496r648q821q950r591r815r796
$$ [...]
##END NTUPLES=NMR SPECTRUM
##END=
