##TITLE=NES1005_872015076_9232744_htFKc47TFp
##JCAMPDX= 6.0         $$ Bruker NMR JCAMP-DX V2.0
##DATA TYPE= NMR SPECTRUM
##DATA CLASS= NTUPLES
##ORIGIN= BRUKER
##OWNER= Administrator
$$ 1.72 TOPSPIN		Version 2.1
$$ 2015-06-17 19:12:59.222 -0700  Administrator@X
$$ Compression mode = diff/dup
##.OBSERVE FREQUENCY= 400.02188249412
##.OBSERVE NUCLEUS= ^1H
##.ACQUISITION MODE= SIMULTANEOUS (DQD)
##.ACQUISITION SCHEME= undefined
##.AVERAGES= 8
##.DIGITISER RES= 22
##SPECTROMETER/DATA SYSTEM= spect
##.PULSE SEQUENCE= zg30
##.SOLVENT NAME= COFFEE_meoh
##.SHIFT REFERENCE= INTERNAL, COFFEE_meoh, 1, 14.98509
##AUDIT TRAIL= $$ (NUMBER, WHEN, WHO, WHERE, PROCESS, VERSION, WHAT)
$$ ##TITLE= Audit trail, TOPSPIN		Version 2.1
$$ ##JCAMPDX= 5.01
$$ ##ORIGIN= Bruker BioSpin GmbH
$$ ##OWNER= Administrator
$$ $$ E:\/data/COFFEE/nmr/NES1005_872015076_9232744_htFKc47TFp/10/pdata/1/auditp.txt
$$ ##AUDIT TRAIL=  $$ (NUMBER, WHEN, WHO, WHERE, PROCESS, VERSION, WHAT)
(   1,<2015-06-17 19:12:52.066 -0700>,<Administrator>,<X>,<go>,<TOPSPIN 2.1>,
      <created by zg
	started at 2015-06-17 19:11:45.597 -0700,
	POWCHK enabled, PULCHK disabled,
       configuration hash MD5:
       21 0F 79 D6 B3 7B B4 F6 88 20 88 DB 03 48 BD 9F
       data hash MD5: 64K
       AC 40 B8 C6 75 6C DB BE 47 7C 43 E7 C2 DF CA 3A>)
(   2,<2015-06-17 19:12:55.175 -0700>,<Administrator>,<X>,<proc1d>,<TOPSPIN 2.1>,
      <Start of raw data processing
       efp LB = 0 FT_mod = 6 PKNL = 1 PHC0 = 0 PHC1 = 0 SI = 32K 
       data hash MD5: 32K
       13 8D 42 69 A2 06 0E 85 E9 69 2E 87 42 03 FF E5>)
(   3,<2015-06-17 19:12:55.456 -0700>,<Administrator>,<X>,<proc1d>,<TOPSPIN 2.1>,
      <pk PHC0 = 90.16479 PHC1 = 0 
       data hash MD5: 32K
       70 52 73 E2 8C 9C DB 65 E8 33 16 9D B6 64 F9 FE>)
(   4,<2015-06-17 19:12:55.566 -0700>,<Administrator>,<X>,<proc1d>,<TOPSPIN 2.1>,
      <abs ABSG = 1 
       data hash MD5: 32K
       A8 B1 42 E7 B9 94 78 AF BA 03 46 3D FA 7D 7D 14>)
(   5,<2015-06-17 19:12:55.612 -0700>,<Administrator>,<X>,<proc1d>,<TOPSPIN 2.1>,
      <abs ABSG = 2 
       data hash MD5: 32K
       63 91 18 BA 72 40 32 30 30 9A 15 61 D1 7D 35 63>)
(   6,<2015-06-17 19:12:55.675 -0700>,<Administrator>,<X>,<proc1d>,<TOPSPIN 2.1>,
      <abs ABSG = 3 
       data hash MD5: 32K
       E4 05 37 24 68 B7 F7 18 D6 B5 ED 97 AC 3F 7F BC>)
(   7,<2015-06-17 19:12:55.737 -0700>,<Administrator>,<X>,<proc1d>,<TOPSPIN 2.1>,
      <abs ABSG = 4 
       data hash MD5: 32K
       47 2F 07 07 E7 D8 B7 4D 24 37 76 A6 92 54 93 6C>)
(   8,<2015-06-17 19:12:55.800 -0700>,<Administrator>,<X>,<proc1d>,<TOPSPIN 2.1>,
      <abs ABSG = 5 
       data hash MD5: 32K
       FA A7 45 18 FF EC B2 9B 9F E2 56 85 53 5B 51 4D>)
$$ ##END=
$$ 
$$ $$ hash MD5
$$ $$ D7 E9 99 81 B9 22 66 2F 66 24 F0 3F 7F 99 42 C2
##$RELAX= 
##$RELAX= 
##$RELAX= 
##$RELAX= 
##$RELAX= 
##$RELAX= 
##$RELAX= 
$$ Bruker specific parameters
$$ --------------------------
##$DU= <E:\>
##$EXPNO= 10
##$NAME= <NES1005_872015076_9232744_htFKc47TFp>
$$ [...]
150 150 150 150 150 150 150 150
##$TP07= 0
##$TPNAME0= <>
##$TPNAME1= <>
##$TPNAME2= <>
##$TPNAME3= <>
##$TPNAME4= <>
##$TPNAME5= <>
##$TPNAME6= <>
##$TPNAME7= <>
##$TPOAL= (0..7)
0.5 0.5 0.5 0.5 0.5 0.5 0.5 0.5
##$TPOFFS= (0..7)
0 0 0 0 0 0 0 0
##$TUNHIN= 0
##$TUNHOUT= 0
##$TUNXOUT= 0
##$USERA1= <user>
##$USERA2= <user>
##$USERA3= <user>
##$USERA4= <user>
##$USERA5= <user>
##$V9= 5
##$VALIST= <valist>
##$VCLIST= <CCCCCCCCCCCCCCC>
##$VD= 0
##$VDLIST= <DDDDDDDDDDDDDDD>
##$VPLIST= <PPPPPPPPPPPPPPP>
##$VTLIST= <TTTTTTTTTTTTTTT>
##$WBST= 2048
##$WBSW= 25
##$XGAIN= (0..3)
0 0 0 0
##$XL= 0
##$YL= 0
##$YMAX_a= 622708
##$YMIN_a= -522420
##$ZGOPTNS= <>
##$ZL1= 120
##$ZL2= 120
##$ZL3= 120
##$ZL4= 120
##$ABSF1= 14.98509
##$ABSF2= -5.573092
##$ABSG= 5
##$ABSL= 3
##$ALPHA= 0
##$AQORDER= 0
##$ASSFAC= 0
##$ASSFACI= 0
##$ASSFACX= 0
##$ASSWID= 0
##$AUNMP= <proc_prof1d_extract_pilot.lims>
##$AXLEFT= 0
##$AXNAME= <>
##$AXNUC= <1H>
##$AXRIGHT= 0
##$AXTYPE= 0
##$AXUNIT= <>
##$AZFE= 0.1
##$AZFW= 0.1
##$BCFW= 0
##$BC_mod= 0
##$BYTORDP= 0
##$COROFFS= 0
##$CY= 15
##$DATMOD= 1
##$DC= 0
##$DFILT= <>
##$DTYPP= 0
##$F1P= 0
##$F2P= 0
##$FCOR= 0.5
##$FTSIZE= 32768
##$FT_mod= 6
##$GAMMA= 0
##$GB= 0
##$INTBC= 1
##$INTSCL= 1
##$ISEN= 128
##$LB= 0
##$LEV0= 0
##$LPBIN= 0
##$MAXI= 10000
##$MC2= 0
##$MEAN= 0
##$ME_mod= 0
##$MI= 0
##$NCOEF= 0
##$NC_proc= -8
##$NLEV= 6
##$NOISF1= 0
##$NOISF2= 0
##$NSP= 0
##$NTH_PI= 0
##$NZP= 0
##$OFFSET= 14.98509
##$PC= 1
##$PHC0= 90.16479
##$PHC1= 0
##$PH_mod= 1
##$PKNL= yes
##$PPARMOD= 0
##$PPDIAG= 0
##$PPIPTYP= 0
##$PPMPNUM= 2147483647
##$PPRESOL= 1
##$PSCAL= 4
##$PSIGN= 0
##$PYNMP= <proc.py>
##$REVERSE= no
##$SF= 400.02
##$SI= 32768
##$SIGF1= 0
##$SIGF2= 0
##$SINO= 400
##$SIOLD= 32768
##$SPECTYP= <>
##$SREGLST= <1H.CDCl3>
##$SSB= 0
##$STSI= 32768
##$STSR= 0
##$SW_p= 8223.68421052631
##$SYMM= 0
##$S_DEV= 0
##$TDeff= 65536
##$TDoff= 0
##$TI= <>
##$TILT= no
##$TM1= 0
##$TM2= 0
##$TOPLEV= 0
##$USERP1= <user>
##$USERP2= <user>
##$USERP3= <user>
##$USERP4= <user>
##$USERP5= <user>
##$WDW= 1
##$XDIM= 32768
##$YMAX_p= 438906154
##$YMIN_p= -658867
##$CURPLOT= <Network HP LaserJet P1505>
##$CURPRIN= <$Network HP LaserJet P1505>
##$DFORMAT= <normdp>
##$LAYOUT= <+/1D_H.xwp>
##$LFORMAT= <normlp>
##$PFORMAT= <normpl>
##$SURQMSG= 1
$$ End of Bruker specific parameters
$$ ---------------------------------
##NTUPLES= NMR SPECTRUM
##VAR_NAME=  FREQUENCY,     SPECTRUM/REAL,   SPECTRUM/IMAG
##SYMBOL=    X,             R,               I
##VAR_TYPE=  INDEPENDENT,   DEPENDENT,       DEPENDENT
##VAR_FORM=  AFFN,          ASDF,            ASDF
##VAR_DIM=   32768,         32768,           32768
##UNITS=     HZ,            ARBITRARY UNITS, ARBITRARY UNITS
##FACTOR=    0.250966925370066, 1,           1
##FIRST=     8223.43324360094, -240679,      -264953
##LAST=      0,             277502,          -159302
##MIN=       0,             -658867,         0
##MAX=       8223.43324360094, 438906154,    0
$$ Real data points
##PAGE= N=1
##DATA TABLE= (X++(R..R)), XYDATA
$$ [...]
23760 59389 -146598 -16952 -114409 -36660 148649 -128722 -319300 -76728 -150503 2406 15258
23749 15258 143799 112230 24244 -7190 112653 -79282 -51897 -119217 -439820 -26775 -109635
23738 -109635 -216929 -117399 50749 13346 -90673 4939 -52139 315743 -23784 -22101 350464
23726 37864 -76453 -165886 -32297 -11368 -178660 -118843 102241 71411 -101560 89146 -63221
23714 349529 194805 226366 -275208 33463 200607 161236 -99694 -162578 197614 -297573
23703 -49216 49022 135835 -198222 -132672 -27741 82573 -15121 -111602 -156025 -205818 -159920
23692 -159920 15961 269230 167934 -293590 -36752 -303526 -173138 -42664 -178443 -21545
23681 -110514 40345 -232526 194498 -71023 22221 -156107 -159238 -137234 -16731 -59467 86143
23669 -118165 -21287 194268 141450 26921 121655 88897 -45926 -96323 -328573 -372267 48882
23657 -10900 79361 34254 -10646 365580 -37406 15762 -49996 -98236 -2681 95671 160175 -150477
23644 -33764 -63045 8933 -15491 -225123 -31867 23194 207421 77319 -199291 -433208 111022
23632 316691 61261 36606 -139326 274309 -183140 -67141 -347394 -31099 -260709 -334921
23622 -334921 383736 26231 4821 -74192 -12131 13374 -23845 -128953 -46386 -84287 156975
23610 150185 -27209 -381460 -16484 80972 -221911 225061 -209184 265725 45807 -325398
23599 -52781 -158583 -190573 -44686 -70693 38154 27518 -129243 -275293 -393 -17197 18217
23587 334349 -197004 115544 203291 -78746 51556 31613 54989 -85931 160528 127444 266335
23576 266335 423457 244792 -7849 -222374 -176140 266983 60654 130209 335442 21640 195207
23565 195207 72811 412668 -80011 337754 -132259 152269 182966 304732 -4528 -144557
23555 -144557 235243 -149409 -1094 121799 -112718 47673 -303445 110840 -64239 17593
23544 -351772 -69027 36104 -22579 -160983 -129370 -215743 -175088 11294 -65674 -88304 281715
23532 -36633 112303 -202138 -28056 -388684 129513 -308798 -42788 -43548 14219 28450 219295
23521 219295 -84389 82916 -150036 86848 -120824 -210900 50486 271742 163031 151265 115288
23510 115288 -147943 -249149 -16747 56165 -16529 -270122 346852 458526 155357 153551
23500 153551 -52125 103510 -318864 207674 -51961 82812 -415143 4201 14729 -219467 -130069
23489 -130069 -25302 183322 -35919 159495 -169999 -63557 -218603 72324 115886 -249646
23478 -266375 35091 -77754 -241103 -2049 299858 7156 62244 -4453 -261622 -84192 217672
23466 89768 -160247 -207954 -302673 -109938 361294 -8069 161059 -147467 -62569 -319950 74592
23454 -45397 7086 60958 126021 59343 -84034 -231109 27085 -10370 -506996 217648 -89847
23442 -60946 -193369 -285796 153158 13887 -188164 -15923 -155078 212365 -321242 -149472
23431 -84426 62718 -196850 52595 -241435 223710 -203804 -149707 -57068 69735 -378325 39915
23419 151700 -8258 39037 -228994 -18449 -81653 127647 30948 176499 -81576 -81906 -60811
23408 -60811 -104823 95951 121814 -47919 41210 -4342 59587 -465813 -249716 -94575 -346496
23397 -346496 -255060 239087 -251544 -82577 -22844 -174746 -85198 260223 -133591 191157
23386 164613 -43291 -499 -100838 -202394 76720 -163679 134580 -97204 -143481 -202656 -23409
23374 195962 82895 -162736 -193842 59145 140374 195967 -81421 -130714 169268 70714 -21350
23362 25690 -131086 102833 170719 33414 204396 -325641 -227466 235426 -105068 229689
23351 110775 -25823 -215181 -325661 -182755 -58108 -87412 235324 -161722 -92626 -359940
23341 -359940 167360 209825 168339 -130403 -85316 -165423 -243415 171998 -206854 108172
23330 -20817 -151592 69099 108857 -172863 214185 -74546 -372227 210748 363927 -288416
23319 -16881 -90559 4222 -75100 32292 -116476 -2293 7604 -89247 93532 -152349 -68853 35176
23306 160727 216132 140643 -39124 23615 -79493 -77565 292184 -253536 6728 222143 -46743
23294 55873 182855 237936 -36172 -130082 148549 12381 53973 149249 -118162 -90868 -151935
23283 -151935 -43019 -175247 93674 -96214 -111001 57526 -57033 -161431 4110 -157458 5587
23271 228157 -224579 9181 15223 -284243 -136670 -311281 93673 -186949 -366584 -66 -150066
23260 -150066 -112875 79790 -103075 -229371 -115842 -141573 -21044 192635 -69758 327060
23249 76713 114680 -131723 154009 115817 -147086 82738 -40183 -239930 -108899 181999
23238 -39166 -50239 220229 184638 -354127 -168084 -394678 152758 -82556 167787 49400
23227 -24608 -79262 4227 173086 -190097 -91352 19062 206650 75506 -349675 -75555 -143241
23216 -143241 -77585 4159 112285 65591 218568 146549 49671 -5298 -255067 212892 108946
23205 108946 -3013 224221 79856 -145372 42094 -267481 -7083 -9662 -112065 107905 -99272
23193 -185500 -15207 182115 -89703 -226529 -179096 -125366 -240528 239157 32821 197698
23183 197698 209377 347947 -104279 -274524 -311255 -16908 -70555 -103481 -132228 172860 -117805
23171 -200535 -116261 -303089 -38386 255789 -49200 83287 38180 29179 269384 149594 -26960
23159 -262919 -99107 -333723 20803 81667 -222952 -198006 1077 56098 -201695 331129 -7541
23147 161825 99165 -58547 219640 6179 29726 -145981 -109851 -282139 -19968 467491 -224313
23135 -88491 307046 -81159 621053 6279 -170892 -111767 44519 -114186 -55146 -386197 -88707
23123 -37152 126761 203273 -36459 148148 -332890 -118889 -95187 -55877 396419 -99054 183
23111 -58602 -61111 96743 81413 -117881 17483 -90778 73997 122820 23957 31199 -56058 -47613
23099 -47613 -112200 88560 14980 52374 -34658 65022 25808 -186402 -144859 154001 -218587
23087 42300 -200405 272270 -109848 -54750 -49487 -203055 -235236 242803 -214231 -24508 16332
23075 -456556 -40592 164735 18131 46070 -242347 59348 -171837 -154020 -282560 -78866 -41286
23064 -41286 -5725 3039 161699 -348281 521709 362492 8922 -1856 84649 -128720 -180717
23053 -180717 -31765 -211261 61982 331170 168855 -79272 263230 158795 -331725 316004
23042 99640 -271684 -204756 -69894 51250 84500 37050 13876 -244057 -268061 -308726 44690
23030 110392 11955 -261993 -178572 221035 -87607 210935 221246 96158 76885 419457 39068
23018 -268896 13139 -159853 164406 22983 -63820 99760 295313 140349 61529 113502 -12130
23006 -45222 116965 -15895 146951 5329 -159629 -77056 -126259 14195 122435 -106438 -117947
22995 -117947 -36682 -151881 -164487 -65461 -3836 -164797 -3353 33935 43558 342859 182512
22984 182512 -115648 -77022 -183367 168395 -182531 278377 46961 -56766 33676 -73500
22973 -275145 110778 26238 190492 238152 101894 -38866 -10244 -12888 169292 51692 -62166
22961 -253545 -185363 -257846 6034 140896 -185213 35106 -62108 331134 54369 6239 -180715
22949 -159930 180597 91521 -111218 -154861 -188936 28526 13528 51719 -72666 -106969 15485
22937 -142063 -389712 181502 10553 -150106 166630 56274 -212472 -168819 24650 -78114
22926 -14902 114645 -54148 -16377 -6628 145401 -148224 141104 34695 293100 -148362 90917
22914 -213361 120751 279324 -107404 259584 -192890 132514 -135141 -157612 -141848 -42539
22903 174593 46548 57769 121308 -39569 -118654 -160579 -22907 128009 236441 17547 205342
22892 205342 289725 32060 -88052 -18911 163804 -189273 -101381 -192333 -42738 -400969 96997
22880 -93258 -90552 -180242 -377664 -42789 67858 -201541 -38986 109493 32876 -130595 201290
22868 -36834 -149785 105874 -139748 41829 36940 6518 -47337 -18708 -164598 -43152 52016
22856 -118536 -49908 -50742 -65267 -175733 -201350 206687 -24835 9771 -252935 -298729 -65956
22844 -79638 290965 311213 331429 8312 209502 -60267 -216518 24022 -297901 16571 -48622
22832 87713 -162581 -110864 -3356 -165505 -316259 -211551 54274 153229 -40770 75992 258001
22821 258001 220767 -89948 98588 119541 74700 -10790 446675 49661 -160351 73682 205817
22810 205817 -7770 -295806 -83537 -72925 -279855 -92084 108373 -250337 4202 20555 120781
22799 120781 -137961 -113465 -152028 -234812 -85717 130723 -58639 20452 -99980 96507 46908
22787 -21847 69687 -73175 114213 -9203 32338 124018 137405 97296 -348467 140237 -188935
22775 -161429 100984 114792 -223280 102331 -7456 6253 -552883 -225972 -288647 -78673 -351749
22764 -351749 -162808 95149 -499626 108380 -40496 -257956 -113198 -61159 61704 -55952
22753 -95811 -180339 62617 -8163 -113903 -299580 -139650 -121382 107449 137477 -53693 -46188
22742 -46188 -100617 88612 -61690 -32579 191696 -306309 -80446 -373160 -216128 20289 243417
22731 243417 -36337 -431244 -291139 249816 -198266 -148164 -40788 -63798 81967 257315
22721 257315 44243 -32258 -98849 24384 -141272 -164450 309512 -173596 223690 39914 -178981
22709 236873 55402 -46443 -86515 -235142 -292051 -25849 63608 -183739 181020 59938 -125769
22697 213648 -314422 225162 259223 -47826 -217460 -226748 93897 86678 -137740 -206962 -161283
22686 -161283 -244746 -125044 -319790 27021 93850 180328 -56609 189222 158613 -218461 -193186
22675 -193186 -38585 -29233 220225 97421 -66765 -125344 -433871 42407 123889 -93972 -54524
22664 -54524 129063 -96908 -150689 100926 -174413 -219960 136823 50407 46882 -120819 70212
22652 -148192 -88585 -59315 -42251 -56680 263897 -88252 223241 -106788 -196343 -108149 -144946
22641 -144946 -61686 934 -46873 -472696 129587 24307 -9049 -311172 58228 -17977 -11226 -96832
22629 -96832 -123448 -302516 -140739 -194919 -17490 -94279 -416704 -210054 -343504 -253555 38588
22617 94496 45404 112915 -100200 58390 35939 -399688 311068 16316 -186675 -439204 -418834
22606 -418834 18628 258378 89781 206545 120165 135412 -128058 -197933 279323 60275 74531
22595 74531 17439 48279 74266 135385 -195952 7435 134540 -171072 -240026 -5626 -177249
22584 -177249 234302 -162446 -22340 29835 -10176 -143096 -263898 181034 301544 -141710
22573 -349398 65081 85210 -139024 -35261 -273457 -139969 247479 -172354 48170 -177978
22562 9329 -37879 67150 156654 -204838 40557 184070 35626 166993 -420439 -106411 43261
22550 -245743 14951 -134784 -297414 -197020 53567 165459 -23732 -66190 7611 -153568 -85711
22539 -85711 184053 -297173 127381 15716 -27565 -47398 80852 36221 212180 -14090 124984
22527 200676 -234451 -416241 -417578 188326 95568 93403 -12494 -162276 -158437 -41224 -52413
22516 -52413 7075 20967 182391 10912 -209368 -28607 376443 217538 -164085 -141533 -111567
22505 -111567 -103798 103387 87105 -273014 77552 -97867 207921 19172 -153195 -67737 25500
22493 390464 -58831 142034 207395 -168975 -287913 155523 -256341 222162 -247041 162315
22482 -80482 -288173 -223368 -360581 -234272 18429 -149032 -328880 55348 -198229 -104385
22472 -104385 270340 -9477 -246269 -77274 134208 -122500 -169804 -82009 -192041 35323 137561
22461 137561 -174963 3444 157071 -127028 -316041 -136983 -137089 -139161 26564 -513392 133645
22449 100785 -146637 11758 -96805 -207354 109269 -134445 5629 -270092 123950 -153222
22438 175275 -183708 -57146 -147232 -144781 144244 -44129 139041 -78908 -168489 225701 -9074
22426 -79876 -107211 -23289 189836 -257200 175050 -137012 -88968 117042 243590 -45034
22415 55464 -325925 -5630 36481 -127944 -17387 25633 50787 -256622 -86802 -17047 -109056
22404 -109056 -115473 174818 -1507 -288918 37700 71009 -106412 279681 77896 110868 -96261
22392 91611 -46301 -20010 -310166 -138172 -73814 -130276 -117093 223207 126219 287714 -131066
22380 199075 -389247 -647 112023 231905 -64641 -375796 -111144 177975 -6754 162095 -93496
22368 -157589 5425 -51462 134335 162493 94646 -131873 -205094 -184725 19218 -76855 54863
22356 -52432 132278 3406 -144784 -205785 -388280 21373 79260 -93335 -137154 100619 610
22344 94857 -334437 57117 -186043 9608 -95766 -56014 126092 209846 129372 120364 -10419
22332 -139157 -161503 19618 -172509 -106706 -185890 24465 -126730 -383798 -65036 5646 50447
22321 50447 45291 -220379 429426 -108629 -21494 173998 -91614 -34229 -17529 -18042 -180606
22310 -180606 -26025 -257174 -295983 -30315 25228 216971 -34549 -42213 -173464 -185110 58607
22298 207856 -333109 -279255 158008 -146829 -62873 23948 -307213 -103542 -237256 -98708
22287 204485 23900 144659 -127541 -32872 -90835 403289 83856 -163535 22392 265589
22277 265589 -124860 166207 -162052 -174414 112663 121480 -92270 -127159 -67078 146166 307783
22266 307783 102272 -111925 136594 86720 11739 -184983 -14621 92927 -111439 -33673
22255 114987 -239709 -133875 -135304 -22547 -8920 -61017 -427511 -83568 -93696 -110906 -116613
22244 -116613 167873 -180085 320732 47123 70952 42025 219175 -26163 -170368 -150550
22234 -150550 -266111 -256055 4806 -199052 -37090 5028 22424 151839 -24372 -70224 -59971
22223 -59971 291832 -209829 -30306 -74976 279985 -11049 4704 -357347 -95734 -69236 123065
22211 133713 108642 156276 192444 22912 84349 30557 -185711 175997 -101635 -162393 -159930
22200 -159930 -132118 -74700 -219350 -175908 82332 55653 131508 90401 227852 -167964 -204006
22189 -204006 -58785 183295 241858 -269967 -209304 -164766 -134604 -226587 171925 16151 -40816
22177 -156262 39321 -255788 11467 71181 40374 -194148 -395568 -136136 343634 48145
22166 -212914 -239385 -11677 97138 15036 -64709 253597 47544 -12020 201225 38115 -373371
22154 -365036 -228572 -317082 -348953 15468 287476 173234 -257460 -224607 -29327 261021
22143 -106578 377036 285413 -45530 -94149 -242636 84283 36677 -96738 -428081 -57696 -202548
22132 -202548 -223149 242828 -71177 -170148 -394964 -190768 -12478 -138308 -144596 -129758 65247
22120 394351 -157719 297208 -175500 -52200 281052 68370 -103429 -301257 -142052 -303624
22110 -303624 -10841 298253 29075 -35730 -120022 55306 17877 -79939 -65302 -95108 111851
22098 76178 336564 -103768 110731 -259520 -11550 273955 -13401 -13612 134968 -163338 30247
22086 -53162 -140463 -293925 -149277 -127679 -190574 -51700 -190860 -72792 -178368 -68335 -127211
22075 -127211 24904 -28744 70745 392505 87596 -103616 -91938 20011 -125010 224453 -267710
22063 -26542 17324 197393 37324 70984 21516 -355597 -181268 -194064 323922 9754 -97117
22051 -40210 -257657 78673 -167847 91164 -249839 -13120 66139 -241397 -225590 35850 38562
22040 38562 72462 23096 -176748 -92079 163712 -73056 -228463 -138529 56963 -65321 -366952
22029 -366952 307691 155068 71994 107563 -191968 -73469 32258 6790 273603 113507 -226211
22017 124577 -104403 116978 60732 201942 220471 -157363 -19086 -343138 41103 36821 333250
22006 333250 241319 17563 59989 84209 -123419 58141 -298907 -182566 351015 100514
21995 -46095 -176715 97391 49058 192331 2868 -201947 -12092 -199631 -34882 -97291 120676
21983 -83853 -35517 -258197 252993 255295 171802 46888 -305412 -334714 -168699 -91940 99341
21971 -83322 40739 -305399 99493 94349 -47927 -427 -41806 -295454 -140867 -234367 -320250 -220425
21959 -220425 -39562 -109826 -319274 -216779 -35352 -120108 -7646 71596 -129997 -32213 -214090
21948 -214090 -232544 271236 305872 -181395 -166506 -342617 -86079 -12794 139211 190624 224917
21937 224917 26115 -151308 -234427 -123423 -50859 -293549 -570442 -407465 -17260 -27610
21927 -27610 -85615 242933 -204865 -278152 61071 -151462 121114 96629 184406 226425 146087
21916 146087 -70620 -388417 83760 -98578 144855 248852 -13908 -13977 49220 -39804 93153
21904 -25155 -159244 -21199 -370321 -21880 -91278 -377505 -12331 302789 -62262 80505 -348177
21892 -1602 -22460 -258404 189951 217940 -47324 -93456 -68393 309983 51476 -118570 -40866
21880 -149432 101528 -52817 227398 -164622 55871 15431 -40338 -101508 63655 -261 -16550
21869 -16550 -44763 -278376 -257078 255347 69445 18319 -25352 -147214 -89832 -232957 -241718
21858 -241718 -310129 90845 24881 -187824 -153649 -45545 62262 -185718 58954 -62014 -111558
21847 -111558 -142755 -79160 -162955 340544 -36173 -129364 -78000 92042 80925 -79159 75251
21835 121758 34440 32743 172389 100449 -17719 117804 51065 287160 351212 120270 198204
21824 198204 -10871 184841 3068 87232 44635 -134118 -245497 68023 -357371 142427 -244778
21812 28838 40081 -197059 160189 105375 -31829 152601 165743 66541 -186590 260291 23875
21800 -220139 -445601 -75396 -132355 44795 -277313 -29025 -160222 -307558 -227328 341008
21789 43857 -37221 -138092 76743 -55329 -251174 -59300 81769 36148 262114 -59984 366306
21777 -103128 -153931 69991 -13663 -50847 -51108 -315917 -97377 114293 83022 -46262 -64237
21766 -64237 225862 -158400 6894 -70836 133404 29588 19025 153167 -204155 -38104 229972
21754 -231873 87701 -199597 -59572 61537 -53734 -8009 87450 72555 -37591 42385 -194741
21742 88731 -67185 91037 44612 -226430 -41242 -208982 -233169 -18180 127186 114822 206270
21731 206270 9461 24474 -8377 -50618 224165 114285 -121457 -74254 5846 -118711 -92196
21720 -92196 139010 90181 -106108 -67111 -63970 -98003 -34506 -315936 69799 -118940 -32074
21708 29805 426936 -94717 45634 -284502 40021 -271601 175646 162243 42618 -245629 282461
21696 70737 -73548 79300 119238 4877 144243 52798 21599 -147425 -29748 -125577 -80085
21685 -80085 -130441 -224598 10761 -86821 -99811 25166 142013 97284 -92145 -45323 -123303
21674 -123303 116650 -129038 -108484 45200 -184474 -274175 -199713 -319288 -504547 -140204
21663 -67063 -28072 -117870 80488 -128125 107929 -312422 -331802 -115284 159621 4297 -51910
21651 -372909 211816 -13115 -45853 240224 49628 -173729 249183 -330388 -30532 44624
21640 221888 -89861 34942 -393152 -110212 -199426 -227501 71860 -377150 -992 -180710 93515
21628 -104523 -250327 3761 -212979 236310 5196 -231931 -342102 67259 323541 26281 -96902
21616 -288424 388522 -444034 -47301 -178893 -224170 -181749 -56031 -72493 -71603 33447 -69426
21604 137882 84241 -157582 40689 183561 225175 286891 -187117 -41734 11169 -168158 -327819
21593 -327819 -327811 56082 -116074 -124228 37070 -44671 -87496 -112831 -237353 -54555 -337823 -164020
21580 -279905 -85057 -46812 -151612 -38954 5564 77250 -17635 -110857 -49157 29758 -322707
21568 93887 -24292 -277170 149198 -235099 -121851 2846 71960 -8312 -34947 -157187 30988
21556 -47271 -47384 -1559 75159 134387 39039 -333198 -184618 -358456 -154095 -83917 58245
21544 -157937 -28680 -394535 -27481 65693 47868 -160523 1486 -280089 -100544 95767 121253
21533 121253 91406 45448 -318747 -100159 15676 83777 -36408 -71123 69495 220224 -322356
21521 -72278 -107590 -286604 77109 -225570 100640 -356643 90752 -344598 73768 203260
21511 203260 -79180 -222375 -48984 91627 -55586 219481 47236 38291 83130 -204224 64538
21499 -42778 173570 -247032 -13432 317661 78968 -78000 27427 115622 223971 -188037 92092
21487 378009 -191929 137300 -61371 -167510 24330 -169666 -245338 -43313 -129351 -280511
21477 -280511 7728 -161997 -53634 -42532 18234 53666 -136691 -115205 -157675 -162597 133675
21465 -229483 -276891 -214710 -91934 125574 -190141 54651 106939 45618 145412 -33641 -148083
21454 -148083 9094 -18388 -94731 -24686 206553 144230 -100785 -77710 -25830 112366 210236
21443 210236 288266 35501 208225 365241 252586 92265 29659 48891 -92231 47227 -167143
21431 -248844 -204453 99531 34369 94638 50199 246028 -454574 -84651 322738 134840 -388434
21419 46535 10782 -125020 210750 -80273 -503713 -229599 -108634 -109945 -200052 -28535 160904
21407 245435 -23822 -76066 -205317 -58079 -153348 -152344 55710 -287039 412335 227339 -2854
21395 263114 48269 58813 -62422 63353 -143704 -217795 -49900 -450098 56998 28978 -161471
21383 224695 -123890 6053 135946 -42759 -56376 -85667 -377953 -118296 -240788 -43064 -126518
21372 -126518 -3560 72612 9583 140010 -101000 167593 61759 329162 -306411 21992 75929
21361 75929 -227291 70150 -46460 288146 -427483 19786 142323 15503 186970 142898 -205166
21349 -261575 -263224 -51037 162393 -38603 -165956 298737 -334079 -48227 -131409 -429018 -348984
21338 -348984 -59688 -167198 -10726 -541552 -228747 131436 93240 138247 -140079 -264825
21328 -264825 83153 84505 175262 14087 17775 73961 -63936 -8254 18928 -42941 -227264 -115573
21316 -115573 -262269 -55460 -186417 -213071 -358843 -37924 -165659 -171062 265915 -124090
21305 -825 -8804 -357192 37745 95266 -208235 -25059 -29177 -2068 157723 10155 -285021 271592
21292 -201864 -532170 -193515 -244183 122412 156163 -50309 -142750 -165064 -74343 -250960 -269824
21281 -269824 -230218 60853 254690 17 -4237 -159875 113660 -428129 118141 -38610 -227148
21270 -227148 -80578 167372 -34365 25611 -222072 127417 -14673 75632 -91841 222789 114935
21259 114935 -101124 -385714 118075 -273721 137975 -2427 89502 -8422 306101 133917
21248 114939 -160355 -282923 -171674 -206108 -96481 2711 -105911 -284248 -260261 -78489 -570628
21237 -570628 128976 -3177 -88594 42184 -348717 200871 -61527 167771 -45116 -21411 286425
21225 -92885 -338043 -122066 -84185 80723 -278740 136622 -155070 73983 399118 167680
21214 -145322 276558 -289654 -118759 -59153 -4227 -118783 -95204 -108425 -283801 -30997 -166933
21203 -166933 -143163 -314533 239796 -333 -315781 158131 59609 -310779 266712 -22231 -40009
21192 -40009 -109213 105299 57596 235009 -12517 -320143 -88363 43093 97190 7760 -317044
21180 19719 260422 -82909 -163920 191360 4377 -184213 -29786 166699 -111549 -288037 -120750
21168 188042 -128470 -68587 -132797 66196 -53300 -147499 153744 11837 -161980 -327098 -179115
21157 -179115 50138 -490810 14347 2577 -96887 138603 -189425 91081 119086 -345158 88602
21145 -193530 168179 307303 -92386 -80110 118496 -57678 -126205 -16205 -166169 129817
21134 112056 -173346 37421 -248395 280386 -261515 -175477 -93857 193572 -423593 -226660
21124 -226660 -169001 -191955 -222782 -117760 -104673 22218 -177638 -46486 -174350 -382236 24453
21112 -33905 32716 -103537 -372102 -128369 -222503 18489 138618 -112985 60274 -26909 419145
21100 178970 44098 -43072 -143683 -22054 105118 113421 -38870 133561 -126739 81095 -29499
21088 -108958 -33862 -14147 -31595 -115100 202382 -12887 -183440 -98837 145374 77000 -50248
21076 199888 119128 -164677 64983 148652 -59754 -87856 -75112 -82846 201902 172031 100727
21065 100727 -270886 -613944 54416 -38986 -69604 -149264 -11696 -62675 -340924 271106 75059
21053 34369 -134333 -300872 118358 5934 -17330 -149206 -174965 295667 -22886 -25951 -7147
21041 -95052 320408 60446 99219 244354 -24734 26644 -58543 -322977 289522 -15112 91095
21029 -55400 -110293 103799 -190912 -378062 -256071 -223471 138958 -221748 -108650 -190818
21019 -190818 -150952 -402657 5240 193314 -110243 50111 -114101 12302 -199309 74060 106254
21008 106254 -141717 82967 -78859 -87776 -101954 308033 -1678 258631 133564 122408 -20196
20996 -183888 -45516 -68946 269480 -288782 -6551 -190304 56041 -78972 141352 -21584 -119611
20985 -119611 78425 179123 197513 -115032 -41170 -177334 -180852 45952 -127363 25259 18617
20974 18617 -237351 -97838 37568 -67844 95116 -49787 -11367 106998 -147085 -109330 108563
20962 -44030 -39777 115551 238215 -160333 -50662 -84278 22577 -4661 276769 -333745 217039
20950 211249 112597 389617 -166659 17776 -31206 -33253 170615 209287 -78951 82902 -427155
20938 -56292 297118 2343 270020 56698 -166144 -133689 -197786 -245687 -205665 -22958 258103
20926 -18406 25570 -22006 -150654 -126746 -408974 114570 -63837 -43860 325677 73439 -36011
20914 1548 48905 49986 -158417 -180981 -131650 94253 -47506 62089 -126962 128120 177066
20903 177066 -157552 80664 -182536 -13646 -284804 -194808 218455 -142285 100319 198115
20893 198115 -257146 -160115 -92669 -276660 -77408 -249331 -486522 45351 230461 292480
20883 292480 46155 -331848 -332153 418541 -130923 -9807 -45835 70089 236397 -411779 -1588
20871 -94078 20525 -304464 -49422 167470 -177719 -19276 -83574 -140366 -54886 -152719 -223140
20860 -223140 -78629 -184818 -26758 -85246 -308634 -152060 -29189 -242241 8039 -64427 -30133
20848 126221 -213976 -14048 -192140 -24091 -125291 270197 -101075 -123327 107763 -181635
20837 -50809 356881 1293 236900 155389 209081 -339822 -200704 -83307 -324508 -27934 -18119
20826 -18119 -83746 -129010 -13347 223166 255029 -91670 -8253 -88536 -259267 -110848 -73815
20815 -73815 53738 -227887 -169901 -199793 -368566 -35066 -21256 -58694 311039 224263 108613
20803 -86525 70844 -154374 -27889 -270512 23796 -169887 -164040 -130330 -33020 -139453 -56030
20791 -10491 247165 -261841 -407883 51329 57688 -277584 48881 -17765 -69565 -120717 -13676
20779 -218535 166429 -143882 182243 -59916 154655 -241197 -58598 41228 -78846 -19455
20768 -13341 -55317 206340 120621 128522 -219183 -130329 -132551 164590 -50264 323293 -179466
20756 -174283 93548 -245141 -81333 23980 -180332 198246 18169 -51379 178157 -142422
20745 124294 -220935 -158043 9626 -408923 -35540 -80479 59041 6153 -130815 -60157 -202670
20734 -202670 15235 -127588 -178077 187074 -56126 -30561 138931 -280769 219863 -50227
20723 -168454 87566 -370256 -156289 -3692 -269674 88492 24884 -144860 -47319 30941 -11941
20711 -27840 -36286 -144199 -22418 268111 -33837 -141318 54434 -251912 -132423 -189427 -238517
20700 -238517 -48757 -251797 30878 72673 272918 -155174 -359741 -120525 246816 -54470
20689 -105047 48527 123388 33878 220902 363662 -77531 60685 -101947 -164145 10024 -145414
20677 6990 -96699 426883 -282874 198192 -152634 -58623 47417 -47440 4227 55359 140968
20666 140968 -274631 141670 -47922 -83674 -96710 -181679 -6040 77924 -153737 -90840 206248
20654 -33685 -101102 242900 -212372 -117471 -288313 -74107 -78071 -30258 -284804 -375828 -178268
20642 -186606 4244 430926 -312854 -229499 -137879 -10388 -161837 -54646 -224536 -148782 -26688
20630 -364969 -250617 -34302 -379540 -16127 -5769 307405 -201483 62734 -39801 166045 43243
20618 75157 -88897 -260219 -94458 13856 -315332 2733 -188940 106929 -27487 -153813 116452
20606 121552 -134590 -357711 51674 -211739 152945 216087 -56012 87966 -224670 -279837
20596 -279837 -221269 -131103 59242 -285215 165425 264627 133134 -16003 10008 261827 108983
20584 157869 34334 60252 179949 254383 81421 40730 -22284 21634 59561 -133555 -24392
20572 -151319 120312 -115993 -30456 58012 5664 -186795 -194673 306815 194563 59280 -75572
20560 -187479 -152048 49480 108367 1288 -149117 -423210 -193960 49058 -258281 281584 -111319
20548 66856 -50708 -73186 -170874 -390315 141592 -264466 -112645 228228 -235279 -82366
20537 53231 536 98947 -152469 211677 -134068 38898 -168722 -43693 33778 16211 -80533
20525 -304137 -251588 -221883 -102691 -198333 377653 239759 122792 -111791 -14698 3317 -66373
20513 267525 25336 -221311 -323866 -95591 -206544 -219262 -97318 -203412 -95960 80791 -137159
20501 -161038 -102726 -195705 -192249 -143755 126480 -155204 39646 -91047 -175708 -96531 -211755
20490 -211755 117077 -30162 -182477 -230130 -5655 137670 -16694 210696 -198889 -23181 46120
20478 19465 -32915 173065 159202 -312721 30157 -32047 -34474 -249088 -181031 -439072 110350
20466 97781 -237363 19556 -203356 214253 -333485 238278 -133218 -20875 -15030 -117208
20456 -117208 72882 -120439 -109270 -98780 -240237 -40325 269663 55800 -296640 -280272 136989
20444 -156159 -177928 -8256 86783 -127267 -49286 56853 -48732 -95609 27183 6962 -263859
20432 54221 111814 56493 -395399 -170621 -281818 -118602 -258600 116499 -149827 -174962
20422 -174962 -134378 -220713 -369741 -269147 -578645 -39454 78713 -144440 186821 453238
20412 453238 -24799 -125770 68423 -81577 62086 -54534 104964 87911 -74863 -345022 -433969
20401 -433969 -201096 -834 7752 -44253 -226340 -229351 19873 -193151 94554 112337 -166040
20389 113681 276943 99960 -19831 -82651 -77580 28889 301403 -264557 -156692 59133 47301
20378 47301 -230731 73625 -42334 187961 -29818 54666 -153310 -256915 -44800 -10948 102974
20366 13222 -156188 187815 -152167 -106411 -227079 84229 3443 -3574 69753 -21411 169230
20354 73697 -79038 -190323 -285626 130534 -64223 -176646 71011 -235710 -310147 22974 179202
20343 179202 173070 -240555 23951 -210299 -184809 -155001 -9499 185827 -234460 -95639 -140828
20332 -140828 40209 -102487 261028 -21070 -326941 -275199 121730 -347731 -115324 235766
20321 -370265 35476 104227 -223943 63888 -231607 136823 76639 81097 -17415 -39884 -219754
20310 -219754 -29618 240021 60896 71534 -266895 -104100 -294086 -118741 104427 -257074
20299 -170961 229289 -269315 -28738 -199161 -135597 121308 -238618 217968 -312741 145904
20288 -19079 -84453 -37847 196426 -114987 -68609 125364 85890 -181995 73205 -233417 137605
20276 -161802 -254585 129254 -218754 -120872 -341973 -180657 -238441 -15847 -98677 -97761 -230557
20265 -230557 -118579 -57431 -173466 -102692 -371705 146366 83654 -20956 258053 18305
20254 85429 -50011 378106 -175670 55657 -103861 36986 100869 324403 -331952 -217696
20244 -217696 40861 -67809 -139061 -8838 -4416 -279281 -109972 -91591 -116016 -111178 -92929 -101197
20232 -101197 63896 -162741 -400021 117850 -223743 31040 65982 -86529 -188539 102528
20221 126161 -60033 118971 82763 233858 19362 83998 206970 -108750 -282963 229368
20210 -432636 -32461 -571 215748 -123677 -196896 -184397 -147236 -354430 -80729 125229 -206783
20198 -37552 -145319 408127 -79106 66368 16192 348179 3130 93760 27006 -293153 -34742
20186 -4551 80354 -85294 79674 341298 6014 141873 -315906 -33437 -88245 -113418 97716
20174 4521 189955 78024 -83620 184121 125714 -114527 -236475 -39929 84926 160071 69295
20162 199069 111530 -66050 23107 -101970 111295 -294026 -233764 753 314051 -314636 103761
20150 -161339 -78586 150345 323561 -68866 250192 -79220 84681 -123463 113210 132867
20140 132867 69854 154280 120522 16718 152294 -450132 73719 -228334 185472 -53424 -139971
20129 -139971 -154654 67813 -202730 -225165 -122956 -3127 83427 -7177 -66726 135825 -14049
20117 149783 99785 -124819 28677 -150918 -310923 -216421 68530 -318548 15853 -154080
20106 111246 -12237 -110934 55850 -258098 111236 52020 13047 -131569 -170444 124061 -106185
20094 -269521 -122581 120082 -119166 64094 -176037 210733 -76469 -186601 239211 -183644
20083 -167501 -52207 -211616 139704 39977 112265 -290 -133411 -220721 -180520 -219492 -519153
20072 -519153 39267 -68022 -163345 -143928 -110435 -92895 -123086 -160638 -116511 -119964 155983
20060 -372119 -15220 -35151 -54210 -252651 -360318 -33573 -108306 -198818 116469 -245381 137993
20048 -311558 297404 -10705 92796 -142276 84423 -19107 116737 -128998 -29562 93475 -27431
20036 62809 -104962 184628 -73803 -94075 -89034 204841 157860 -65174 185463 -78573 283495
20024 -146130 -161337 -287177 -121346 168086 -256581 -79193 263934 55938 -83144 -148216
20014 -148216 605 -55862 -31173 33223 122234 33890 -240241 -117714 255581 -73013 157765
20002 -3586 42844 60421 -291861 151940 85749 -70619 81690 179719 -57101 154987 366752
19991 366752 212357 15591 133548 177468 362533 -16706 -54088 -31109 -262686 -218653 -409809
19980 -409809 -179081 -32098 -261703 -16803 81415 -30906 119198 86197 -369064 56475 63537
19969 63537 -145744 -68585 232493 198010 70201 -62928 -23528 188352 27226 403961 40092
19957 -22141 169648 -22767 -18585 48717 -344241 -139248 56148 -287465 -182800 85110 -161951
19945 -139094 -435601 14422 -259698 58778 -20084 -89923 -313586 -225124 -93903 179993 -32420
19933 -129148 -1563 89032 159470 -442954 -336977 -108028 -180613 -192128 -145252 110325 71496
19922 71496 80856 -369216 23013 278199 315968 -34137 -36260 21683 -426606 -154632 -343258
19911 -343258 -277520 -240261 -150227 113717 113494 -345430 75101 -23703 323897 5006 -24411
19899 -182982 -224531 -72807 305390 81371 -139525 -60187 -104025 -71111 90323 -100992 188817
19887 -35152 11825 -264804 74326 -249723 -232305 -140777 13811 175036 -995 74791 -94149
19875 -311821 18084 -32436 -268132 -126275 49942 -151825 -14288 -245444 -89275 3219 22919
19864 22919 117919 46403 294187 -198403 -19176 478945 -157578 -305539 175306 -112935
19853 -224689 6231 -69015 -140781 -105760 -59919 -56622 26197 59060 -223000 -211912 -114264 -21683
19840 112266 -82838 -424928 -211329 -283867 -34522 70522 -422734 -7483 169186 -101326 -72747
19829 -72747 -164169 -116307 86272 -13307 -111734 43310 144908 -257071 57342 -197291 -211393
19818 -211393 3419 -234428 -151732 463335 86824 467238 -48415 183975 -117159 -49841 -135571
19807 -135571 32060 -318119 -387897 -248470 -54834 21222 -119761 -86557 60082 -115853 -105686
19796 -105686 -318891 -170216 -425151 125414 -45312 -197410 144835 63684 -61433 188355
19785 -440474 -22077 36628 -112721 -9228 -47625 -88073 -208761 -17886 -19613 -232748 -408229
19774 -408229 -65067 -212367 -190876 83193 -251571 11469 -19546 -218526 -142249 -217339 26809
19762 -111771 -86368 -53452 -9051 99161 -832 107496 -62050 78107 41076 -30420 202471 -254575
19749 -191200 -63899 -152207 35930 330691 -16877 -30792 160350 -58485 89659 -16449 -87607
19738 -87607 -245965 -342841 -117613 214771 199 -8877 238557 62616 -66777 45574 130482
19727 130482 74112 62526 -496465 -31483 -17951 266392 9079 -280358 -416734 -437537 42332
19715 -140719 221195 -51178 -127003 205441 135894 -20517 166369 -83061 -55437 178966 -370708
19703 -81191 -100881 -3593 -205333 180898 19953 248441 120017 26363 -47178 143478 60017
19691 -122626 -186198 -134272 -406 857 -300387 -329561 157669 168062 122089 -119865 -107182 -44123
19678 42288 -347524 -112409 -246519 48842 -361766 184130 -58100 -121576 29082 102440 -354273
19666 -150337 56602 -25340 -155375 -28008 -58160 -92773 80245 99701 -325119 92570 -130062
19654 29388 -244839 -87332 -325760 -5245 50255 -65511 39679 -141022 -141941 -211226 66652 -30682
19641 181910 337648 -242640 -90022 -549856 -40517 -117506 -67430 -178664 -64469 47358 -217058
19629 -203773 53634 -151548 -253719 -26433 125424 -146724 -193825 -452054 -176530 -156149
19619 -156149 -21100 -170800 -311802 -116479 -342539 -75926 47802 -25651 -42519 -213646
19609 -213646 -207902 81023 -80289 96509 -148977 252435 -397975 374952 125213 -76131 39030
19597 64412 -43967 20887 -254760 63354 -251416 277451 -370619 -247946 -250358 128379 -134887
19585 -103735 101223 -265221 95701 -269245 288655 -272906 -105176 -243301 -372661 -216135
19575 -216135 -117144 24094 -129688 3285 113921 233058 200929 -185243 -6011 -199210 71127
19563 -73955 223658 -60775 -301896 -106506 52605 56797 182205 -141701 -54922 -122767 202858
19551 -60620 -71133 -192092 -16183 165386 -123681 -62844 214583 152919 18766 -52117 -122526
19540 -122526 -316101 6634 -154785 -214350 -142238 -323937 148991 -177819 -74328 -383481
19530 -383481 87262 -36142 237695 -126149 -21724 18241 -138025 -312856 -543223 -122187
19519 -159745 -113578 -124194 38160 345259 253197 15280 -16888 91160 117268 -430080 -390986
19508 -390986 -96930 231150 21405 51231 -19707 31735 95396 160029 -97187 284493 261821
19497 261821 -66685 105119 -545270 -532133 -384370 -316292 -33622 -184627 257176 -112973
19486 28726 100214 52156 -148469 -104790 50179 -216421 8802 89591 -27916 45896 46499 62137
19474 62137 -233030 87131 -46929 -139420 107690 59518 96511 -300913 176226 -313547 178147
19462 30692 -70337 12296 -252050 118735 -75533 -287926 -206309 98214 -123832 -547338 -249423
19450 -26866 -104720 -482354 -32478 -17781 228183 -100492 127512 -160198 -60907 -324813
19440 -324813 -270789 -202139 -105748 -252007 -339401 46258 -228869 -125368 -45227 -139326 -268521
19429 -268521 -115982 -72433 -273583 -245935 -339389 145447 -69136 -261023 330607 -172854
19418 13498 -122720 -375162 16469 -138276 -162763 139285 -209066 69581 -253241 -282995
19408 -282995 126202 -39319 68957 -235312 327777 -133846 124951 -16023 184626 -430288
19397 -105182 -133076 27222 -201152 -130136 -17389 -76980 -119673 -314100 -326260 -416263 31668
19385 17385 -117409 -80819 37942 116531 82351 -80467 166442 186136 40511 -41454 57636
19373 -91720 -285057 -154589 -143272 -51733 86298 178480 33856 19637 109140 -22602 -4831
19361 -46311 436757 93677 -21811 -52019 -122834 -474578 -9995 102698 -443071 107964 123020
19350 123020 43359 -157786 -220683 -77063 124146 61904 -319709 -59318 36302 -50586 -213529
19339 -213529 -586627 14263 -13317 174562 -237483 -243151 -82855 -84417 -381372 126258 -50266
19327 -25144 -114271 -272590 4300 29297 -32174 185247 -228011 -142318 -17773 53153 -361645
19315 49892 174405 -166645 44053 398637 -287651 -56985 -83251 -149189 77002 -31456 199356
19303 -197072 -198427 -41309 274591 -74152 -109997 -192619 -107002 108911 -129715 -144331 -60908
19291 -60934 -174346 -195382 -87836 -124965 -238367 36338 -164452 39257 -81329 -88385 -145437
19280 -145437 -36441 -66617 37999 -100622 65532 108302 -301078 -304941 24387 89745 -11100
19268 -93119 -12915 32514 111383 155678 79199 -190737 129035 127772 86713 79714 -73466 -159429
19256 -159429 -166887 -14664 -14110 -122256 -233450 -118556 -189505 111361 61082 -104126 -179780
19245 -179780 -134440 -207881 -10515 112784 -379284 -75961 156235 58105 -8022 -237044 -223770
19234 -223770 -20518 -75788 120213 -219740 -416113 100063 -109230 47651 -24273 -301278
19224 -301278 -53192 -314191 -188865 -22384 -290184 -232745 -147835 42490 -142856 -253173
19214 -253173 19322 53840 -134322 -18108 -79826 266137 -350920 78038 -86870 100367 -29130
19202 10761 -179006 -275326 -282438 101142 -39041 -19839 -148496 200392 -2355 316590 -53615
19190 90957 95438 227770 31907 43096 -13962 -95214 -26143 41217 -107842 -321295 -228935
19179 -228935 -291209 -39006 64292 71522 -2419 162569 54764 -73244 -38338 84614 -297653
19167 -85620 52877 -145550 -17514 177494 -13616 390070 189675 -397129 -210001 78968
19156 19723 111092 60237 -62205 -42154 -86037 -47588 -182471 -328551 74607 -183497 -171044
19145 -171044 -83626 31313 226460 163476 -254922 -116905 -88331 -21495 116384 181298 -129050
19133 -88835 -64813 -47417 -60037 -22113 -175573 -269641 -212624 -92995 -188812 -52765 -84130
19122 -84130 139304 -343966 114703 -62067 -100011 92672 203715 -49147 -270072 35109 206015
19111 206015 84515 -73682 -221969 -147003 -141621 -297707 -110740 177981 56144 -39746 -161137
19100 -161137 -101404 397024 -192834 -383789 316602 81831 3765 -57132 31962 -34181 -178763
19089 -178763 -287190 273715 -123741 113182 3921 49839 176012 -172306 -268885 7148 39828
19078 39828 57635 -154515 -46956 -360038 -61736 -144224 -155621 271676 -185434 -61623 -30769
19066 -64010 -34172 -187277 -82921 59534 -76144 321142 -101113 -26760 103971 -1956 -211441
19055 -211441 -141374 -78791 -119259 24748 -167614 -178989 -41842 -358273 -489768 84831 411741
19044 411741 -13767 -35114 -305168 -197062 -390936 -200363 -37150 21917 -329236 -133703
19033 123614 65205 -155571 -178824 92648 -359196 -40230 -50307 -227323 281869 -142483
19022 283160 203048 -269017 -123129 124390 -144239 79359 148077 -149614 39877 -205604
19011 188532 -95941 140352 -104317 -123885 121674 -111399 123348 -113583 -71825 -245650
19001 -245650 -241536 -124680 3223 127982 -238516 -71868 -51379 -144663 -239105 -299424 -121873
18989 342165 120250 189880 -117113 295794 14755 -422195 -14566 -8857 -85484 -194352 76811
18977 -10464 -11309 -226811 -18541 -36711 -189734 125305 250908 -12851 -173901 142870 127582
18966 127582 410423 -147880 133729 39740 230836 -95238 48203 -40167 -84399 -439904
18956 -439904 -258617 -97468 -117172 236940 177738 -138219 223206 208414 89637 131380 -334688
18944 136042 -322120 -83715 83488 -237977 -57869 -116536 26460 5853 -4003 187164 -141634
18932 281538 427174 -9231 312170 -116800 -257667 -347466 -234576 -173844 -136718 -87661 -66960
18921 -66960 228528 -156548 -88566 -206987 201898 106426 -50392 -6827 -165342 -311017 30129
18909 -203820 -71553 201144 -144385 161114 341420 63255 390656 -6462 438220 -195533
18898 240872 -62913 -182501 -101650 99927 -25437 95942 221801 110252 8701 93832 -145358
18886 60104 -363211 -152593 45521 17186 103173 -300063 134680 -1498 39287 -305196 35409
18874 -10504 -322658 122183 130679 10649 3961 121615 233248 -163158 -343573 -239175 -79784
18862 -142919 9545 -90845 -7896 89188 37211 363462 17265 -212547 -180539 -55825 -115423
18851 -115423 -35866 24626 -211503 92606 165364 -83105 -298809 -128245 -124679 -248486 -62543
18839 -48782 -12270 84476 218536 188785 -113976 -190758 -176901 -149410 57662 69566 79198
18828 79198 -157637 -195109 -59588 -14220 -71940 -83546 336279 -51158 56118 180148 182214
18817 182214 -425704 -365662 -275467 -189831 73218 -131525 222446 62864 -84371 -193100 -65179
18805 61156 -99422 -14252 145690 -156215 -59899 -46179 -322571 -19275 -155519 -146525 -147943
18794 -147943 -160338 -63269 -351305 -238409 -230538 23217 -178159 33179 18445 -134185 -238918
18783 -238918 -63872 203099 177524 179939 -22696 81483 108512 104507 -45108 -78442 -245164
18772 -245164 99216 -126541 -350764 -9214 -132802 115484 -202346 173905 -304541 96957
18761 165673 -155125 46479 -225449 -122300 -166262 -76760 -36703 141770 -239913 -12442
18750 122571 -196748 -50549 133430 8488 -386873 178422 -46782 61395 52188 -172418 -114713
18739 -114713 -132864 128142 -284952 28648 -186887 5555 -34002 106902 -290423 67196 280634
18728 280634 197822 -47109 -317455 -29484 30904 -184103 -28628 -100950 25878 -145111 7001
18716 -303818 38674 73668 -158577 -33344 41228 -43105 -202479 -124037 -28924 -89342 -122510
18705 -122510 106549 -12068 -206558 -114911 59650 -52508 -301852 -57148 -160146 -394546
18695 -394546 -2980 -24946 -18457 71306 -196016 -98475 -20899 39901 -176103 -170344 44500 -151111
18682 -20790 -74401 -22767 -56729 -150111 34668 -305394 158312 286467 -86721 -193899 180041
18670 -113789 155858 55884 83514 315483 -317594 110467 124285 -68569 -185765 -166136
18660 -166136 -147645 114012 -199794 -320887 -202562 188281 -171232 -35866 103587 -3983
18649 -86709 -163032 -95171 121456 -43462 -264687 -108572 -533319 -553074 -118974 -180136 209766
18637 101322 -422502 50654 -88773 -347816 -233093 -108500 -141264 -142845 -34393 -225754 170581
18625 -94968 -140404 -56988 117064 -121105 -46935 -159169 180112 163169 -335425 -252411 189349
18613 -181284 30098 -74663 -135061 69682 -188187 87574 3313 -186722 -1779 62048 -175341
18601 6174 121552 -49054 -464508 -69622 -106719 -198942 -166995 -122201 -172495 -145782 53225
18589 202388 -31633 251886 -35019 -93717 214466 151666 186479 252863 -33534 139550 -172690
18577 241172 -68883 19174 -43804 -299309 68212 -196793 -135180 -79272 -171005 12737 -73710
18565 -427923 -217750 -17000 31449 -88990 -135526 -39009 -125215 -271415 -206934 -239991 21084
18553 77781 -260221 -82533 -188040 -343833 -179728 -187115 135427 -416993 -68886 8557 162716
18542 162716 -140667 2629 407145 -15439 -39147 169770 49168 -333911 168431 -191839
18531 -285878 -184483 308585 -77845 -151571 -274616 -65698 79778 34401 -135993 -165997 62071
18519 156983 68459 -5840 -176324 72285 293969 285895 242483 204889 30686 -559747 -209440
18507 166525 -215042 69125 -176275 -26158 -52817 -155650 -123750 -324474 -31051 48784 -173497
18495 -116572 -182842 73325 -253772 -256425 182814 33582 90038 -153042 5443 -23851 -207812
18484 -207812 -111642 -48610 -245154 -275790 110755 269361 136536 59359 -171550 -31359
18473 32258 -270537 369530 49533 -667 156716 -80347 96263 -160610 72438 44962 -185233
18461 18043 151168 88906 -50500 -266224 6469 -142048 193224 -186766 -120933 79654 -127567
18449 20868 97725 169147 -133972 -9409 123953 -66705 25379 139680 -193840 -313052 -304591
18438 -304591 59944 -88351 -150878 -45993 6012 5743 -77417 19277 -14461 23717 -230985 -308165
18426 -308165 -6454 111949 -456936 -87373 -100887 -230312 18110 -425663 -87932 43049 175244
18415 175244 -185035 199383 -82172 -307790 -122485 138380 49301 -7268 209910 333476
18405 333476 13968 -31265 -197004 -43470 102197 220334 -22742 -243708 32022 -299820
18394 21508 30016 346018 184976 188169 -241669 86779 -168357 136882 16386 -221198 -44443
18382 -159626 144020 -187773 92310 -116846 96604 -114279 -131243 212242 -2437 301464
18371 39336 71655 67279 -168521 132349 412276 142056 -77524 -1251 279778 -79302 -170944
18360 -170944 181929 16612 91611 76327 -348702 -149079 -85319 39483 -119759 -186948 60752
18348 65820 -242338 -117421 -108126 260689 -378068 -249968 95367 -263484 -209287 -151148 280221
18336 102080 -247699 -27748 -51157 -352406 -84117 71885 149266 269029 32523 -31365 14988
18324 150556 29878 -150184 31721 -102754 -134677 167720 402527 -5513 54177 -104664 102583
18312 -18548 73149 -147497 -252640 25077 32921 -121430 279614 79803 -35127 105149 55473
18301 55473 154860 -114861 -41362 309335 350056 43131 -66825 86695 -92985 -280400 -244246
18290 -244246 -135254 -165972 194714 -190353 38917 -210974 -226977 -395675 -94216 -205888
18280 -205888 -201578 40205 23455 -250524 124568 -154547 -314182 69499 145455 14147 -166999
18268 101751 205887 -90190 -95798 -247550 -132687 33854 67362 101887 -43272 -118900 290241
18256 -123328 115134 -488904 292132 -67370 -359463 -414874 -2627 -79218 431726 -220425
18245 -216599 107806 7423 -21556 71908 -136069 -283354 100424 -292288 -129314 -104138
18235 -104138 56367 481801 -60262 6853 286168 -175871 75244 17941 87538 -160955 -181497
18224 -181497 -86630 -66035 131167 -95118 202728 -123859 -126431 37788 52190 -241103 -14045
18212 297159 -5708 112365 -45209 30717 -196363 -106666 196496 129785 -128469 31807 148328
18201 148328 -143041 -151375 -125013 -299538 66502 242613 -156262 122965 -200785 -300127
18191 -300127 39768 -3185 394359 342902 -97493 -37098 102961 116646 45204 44877 -155720
18179 91855 -75034 12642 -245594 -77669 36493 112755 -121920 -68227 83339 -234776 -153344
18168 -153344 -137904 -15204 -275179 -369020 90149 72176 356710 52144 -79975 -196509 -221849
18157 -221849 113568 68144 -110933 109981 -139143 -141010 -121435 -124934 -302244 10997 254478
18146 254478 152767 33339 195174 122112 -28559 217305 -184778 32459 -204354 50501
18135 -320179 178962 -12051 -299020 -156744 -305573 -19665 16843 164443 -175034 -33081
18124 115067 -184767 -164341 -156558 -259415 6982 -226615 -331437 -71526 -102523 87758 265482
18113 265482 -16056 -127950 -46736 82389 -50354 11482 -218595 190371 -39833 -155654 -352865
18102 -352865 19659 46638 43184 50978 -26508 -279765 -120849 69961 39759 145038 -139901
18090 -126380 146192 -77284 -30866 -123271 342340 -239244 -186618 -174958 -211183 257967 10734
18078 18817 17329 14908 182351 -128554 -22174 -133916 314247 -98727 -211491 -3358 -136429
18067 -136429 277857 171353 12390 -37132 27125 -75810 -225096 -154812 187770 -183694
18056 -393291 -135190 45299 -54222 -215442 15546 340310 -86119 -147896 -9820 105955 94342
18045 94342 -95582 106364 -74139 -58735 -194600 -196867 252697 209831 285988 19215 -265956
18033 203548 74860 -15064 -100451 200417 71023 -183317 -220294 -51645 -170593 -131346 -145536
18022 -145536 -18250 -188289 139932 156511 -46596 64499 134171 -12208 -235315 -93495 242588
18010 -105518 89852 -90698 183088 -171695 -233505 24769 -199098 -330612 44751 199092
18000 199092 155733 254523 101226 -15622 146827 -102540 -89130 -115956 -96368 28074 -132608
17988 -15600 248336 118125 103792 31336 8183 -452565 96373 48533 47655 -340083 -76395
17976 147060 240435 -5582 37487 -173579 -113408 -18005 53829 168935 -472445 262569 199904
17965 199904 -69980 47833 -362864 199413 72382 289254 -130371 -204649 195654 -138038
17954 -85389 -108927 114026 46442 -95883 4295 28587 -148246 298958 -80201 116187 154282
17943 154282 -72869 137656 172846 -5617 2392 35728 116086 -114688 -110201 79195 47647 -108420
17930 144641 62097 -323441 -177709 -183413 173846 28154 213830 303360 303438 -4826 -121649
17919 -121649 -63810 -215037 64820 -256993 -156054 24820 -62592 -174538 -182875 283312 -245942
17907 -305218 -826 141662 42960 -66176 15205 -50792 57789 352869 274823 194723 -55563
17895 -111542 201797 259280 277653 -94767 200543 78669 136895 -78102 79514 104768 66156
17884 66156 -63643 -11269 291428 -122437 -28082 73382 -206506 -32007 45703 182364 -64327
17872 -10376 39032 237577 -208832 -175228 -62250 -83540 134650 -270607 -246100 -74505 -201663
17861 -201663 100334 41460 104483 79356 244813 228029 -150481 170516 -67437 168434
17850 155436 141797 472996 55114 -47404 94352 275806 14379 177372 51567 -387403 -92091
17838 -4001 -183997 106905 239126 -342048 -90168 -334283 199602 130780 307807 42932
17827 295738 144168 -91446 -20178 4992 7630 15833 -159691 380133 25836 -19878 69103
17815 -125818 41225 146863 18788 15810 -449861 134158 183274 -281847 41389 116364 73345
17804 73345 -49263 210319 -49950 -134855 285490 93212 116437 35155 99147 134431 -80836
17792 268007 10209 -119096 -124055 10841 329480 203931 -140810 133507 357565 212169
17782 212169 -63155 -38514 -142090 -172090 -385361 6062 -261384 59971 234128 281613 32715
17770 216766 97930 80875 364300 190126 332110 367165 -98598 127616 250949 292333
17760 292333 -164830 -172650 278262 569 27091 173430 15776 -184759 -52876 239925 270590
17749 270590 -191417 28035 334193 26652 -185374 261350 164706 76826 -69988 -256866
17739 -256866 -65094 268557 -98663 112789 45316 122533 159097 66645 -62443 129537 35725
17727 -73026 262603 181353 242856 -130659 214256 289465 185276 305532 9634 395145 141602
17715 390682 -81578 239669 -233098 -267954 -45709 429232 160170 -80279 101186 123320
17705 123320 -10742 61263 -157663 -232333 -361691 -134212 79443 -89512 120864 -166214
17694 198580 4151 -78375 -293228 182596 95337 -86656 -100367 83036 -74737 -71915 311937
17682 389198 -365664 158931 -35478 146334 -104511 54176 55905 -223127 219951 61399
17671 384518 -88849 -177039 -33328 -152357 -5 169674 -7146 74587 26631 -185567 -97808 78657
17658 -20304 -37833 135753 42537 -56726 121999 177564 -216999 316166 269216 -107348 -2939
17646 83470 -6799 362583 1101 93586 210442 309891 286820 -97415 210423 222232 284550
17635 284550 169169 120429 -159761 -37964 318811 50227 175582 118009 54241 -241909
17624 111104 42771 216550 60993 16070 -152269 219193 68437 17012 99685 7118 236341
17613 236341 75417 242085 225152 92344 123889 -192353 234614 70266 -170467 -54790 159101
17601 272853 -283278 71481 282255 186565 299023 -57113 -72519 239868 -47926 -15743 -56760
17590 -56760 160541 268540 -7646 -47763 -27468 210572 202260 285626 164388 -48444 95985
17578 69860 133101 25539 71792 318928 -109263 311367 312153 -916 119458 -131537 313895
17566 116047 23328 -18443 427723 65283 364778 77597 182461 196065 -69361 -36876 260086
17554 240374 309417 258016 154834 313575 433851 152222 229996 95855 289596 94560
17543 172508 167476 89295 80037 387900 69555 433758 298321 392691 -53956 112795 263927
17532 263927 152465 233472 144467 364830 301014 23883 -76935 344059 231971 44135 67266
17521 67266 620679 616948 377769 587708 352549 462018 179578 286515 315167 453408
17511 453408 144729 377626 502445 119392 222933 440182 266108 544017 318412 386915
17501 386915 509785 360046 -36302 220602 281844 248486 -148813 -9620 227214 -13084 211020
17489 179683 82252 367213 445685 234176 -64808 -38232 330316 336211 157932 362224 494517
17478 494517 304013 210054 336075 2283 -64578 175505 310126 482970 262075 185204
17468 185204 240638 174235 312117 185831 42441 -18658 308700 172616 224036 484629
17458 484629 55998 100328 306887 265278 160836 68466 203236 78280 374437 29527 379755
17447 379755 396017 193278 429404 124098 538242 496572 14777 42314 468078 230033
17436 626579 262943 412140 182949 90425 351601 91565 429288 314454 -139990 29506
17425 237245 348730 94185 317996 68423 513232 437936 72654 -6014 347122 89443 527
17413 -143382 312179 513169 104158 234270 401528 381226 136350 298244 37466 6902
17402 227015 178764 405172 82706 233305 304549 300299 369103 274669 236437 240325 195560
17391 195560 -1363 384884 77342 281340 324835 305694 671385 361700 178235 33497 211486
17380 211486 89397 -5689 169029 242895 650704 150615 319858 298441 204248 18453 145777
17369 145777 228759 110824 197596 -42912 219013 170771 162630 6335 548453 172742 159333
17358 159333 340220 566641 134511 112088 96162 60823 279852 455120 86464 2803 328379
17347 328379 331717 109178 566675 185177 227398 178821 65126 46596 278101 511856 138871
17335 -38999 299703 27813 553096 4808 -84984 152059 249570 55416 297100 18674 305361
17324 305361 273584 -2419 279047 224835 240724 138878 277026 -8960 402630 557296 175497
17312 114425 331411 261652 -204936 280609 543113 556968 239628 410923 228926 76678
17301 236423 102609 341693 420872 356723 161978 368406 198856 35478 133398 498277
17291 498277 421696 629165 413751 327392 461319 106776 338238 45118 526182 321013
17281 321013 296700 326267 298120 48275 141047 17 -13543 429879 584455 353536 293930
17270 293930 429768 201727 401004 318398 105694 113401 254415 290026 277756 308438 115264
17258 344895 11995 410961 335387 309660 410258 220757 488495 185053 381191 437324
17248 437324 214220 431425 440090 363029 353980 304721 255405 264297 592619 263666 143040
17237 143040 215087 370207 166053 433201 521217 362691 615231 334872 559154 432264
17227 432264 325824 50014 154166 641502 451596 146993 359490 428901 649438 299233
17216 -50806 474934 40335 442312 369719 261546 222827 436498 527417 413062 542675
17206 542675 390504 10181 311883 547574 269434 172270 475719 630550 410106 438439
17196 438439 607648 515046 641364 638974 357010 522766 479325 530449 428070 308357
17186 308357 425985 495011 734824 413024 451159 302401 577697 727638 505794 299524
17176 299524 342172 355197 416289 390864 415157 546414 558189 427425 443277 443769 503699
17165 503699 774260 351757 260172 339632 465030 173246 465491 466791 648927 236066
17154 306730 537157 371397 503413 405151 115677 610854 400088 531601 295207 214591
17144 214591 451408 615972 305071 647000 284527 501205 528901 127060 680130 699153
17134 699153 580995 471671 570940 529218 457602 826080 688393 693002 404508 538421
17124 538421 367763 523021 708010 572300 489245 512721 413255 909742 810886 411224
17114 411224 632613 337536 659106 316696 447485 614890 572908 585246 712797 476344
17104 476344 501092 746885 689641 657337 843340 427559 710915 492708 744441 478670
17094 478670 303290 596517 478871 525758 713317 524106 738521 1087415 855108 687977
17084 687977 773633 712697 980580 615180 601853 724375 613250 729358 717245 668597
17074 668597 477838 869849 805285 708542 725057 770991 774953 834468 888434 720034 989463
17063 989463 556453 966047 995696 532961 875021 789188 929718 994224 1059994 833792
17053 833792 903208 757023 771828 747208 791731 734065 1192662 913518 934979 913338 917017
17042 917017 1017588 951021 985253 895735 700418 1030148 801149 1011866 876777 711431
17032 711431 832658 1061622 1327522 1017868 1109862 1283857 1016454 1095149 1217558 1140023
17022 1140023 1068340 1228564 1285561 1110402 750477 800612 1259966 1048152 1052949 1360362
17012 1360362 1255217 1318226 1436965 1083341 1338776 1123945 955928 1110269 1160390 1491538
17002 1491538 1292181 1503076 1330135 1471555 1087843 1464847 1417082 1269150 1390000 1379164
16992 1379164 1385146 1317857 1500372 1362605 1680787 1552583 1656047 1411803 1555275 1335503
16982 1335503 1406179 1493068 1454229 1602202 1623791 1520668 1721633 1545247 1706598 1667578
16972 1667578 1583654 1782140 1682568 1873898 1723780 1959475 1817960 1643096 1840422 1720611
16962 1720611 1968738 1754554 1745360 1911638 1948816 1895072 1971391 2160957 1878875 2012041
16952 2012041 1955142 2196188 2011881 1768328 2097395 2030236 1880219 2141949 2429154 2395659
16942 2395659 2255421 2148776 2376715 2040106 1918542 2389456 2009064 2444015 2372268 2143347
16932 2143347 2348573 2523998 2469098 2214084 2736328 2479701 2511136 2531277 2273901 2781878
16922 2781878 2673273 2927310 2819510 2831144 2919176 3099952 2657842 2659071 2689258 3007581
16912 3007581 3324872 3020856 3066611 3243030 3333054 3280766 3250946 3031487 3357788 3335920
16902 3335920 3377961 3341302 3387242 3567350 3652742 3193613 3572135 3561803 3568843 3937763 3758949
16891 3758949 3753733 3854078 3842673 4047961 4269071 4294060 4225718 4063679 4447857 4251468
16881 4251468 4565338 4383790 4284047 4594876 4703728 4810526 4784556 4864997 4962404 5029800
16871 5029800 5169963 4998681 4976625 5063252 5292635 5196160 5222047 5434949 5227038 5833790
16861 5833790 5702138 6117258 6022169 6147755 6293187 6419978 6635718 6559228 6486756 6511580
16851 6511580 6770042 6989239 7197939 6843316 7056858 7829741 7510312 7743902 7815111 8116293
16841 8116293 8307521 8199228 8470505 8401743 8547158 8895513 8814892 9253455 9213202 9566698
16831 9566698 9786333 10253162 10064909 10177885 10430347 10381353 10662825 11079315 11113530 11416482
16821 11416482 11494031 12290625 12205572 12689337 12981437 13138525 13354916 13577149 13923662 14054907
16811 14054907 14453535 15060669 15074729 15398092 16029442 16271848 16506309 17135572 17361003
16802 17361003 17726729 17938258 18459140 18964022 19277928 19960691 20676257 20947682 21385511
16793 21385511 22014389 22675102 23445942 23454668 24592249 25097550 25896713 26337404 27010408
16784 27010408 27884525 28813279 29419461 30543471 31053212 32115935 32914462 33797572 34886261
16775 34886261 35764727 36587711 37798144 39114729 40090891 41239110 42603742 43789839
16767 43789839 45213228 46312514 47704671 49189323 50498477 51976825 53367189 54948323
16759 54948323 57048934 58343236 60438738 61812194 63833719 65163715 66697850 69073696
16751 69073696 70737768 72286706 74421067 76104339 77810403 79537045 81090381 82973588
16743 82973588 84559837 85636102 87741024 88767748 90232145 91643297 92559648 93164298
16735 93164298 94083624 95026719 95488098 95821225 96422876 96304645 96387024 96283210 95808917
16726 95808917 95397693 94314996 93633157 93013608 91829140 90719958 89685328 88036265
16718 88036265 86622721 85242973 83980983 82090231 80160378 78668431 76786882 75360798
16710 75360798 73611001 71816655 69830891 68066036 66639378 64830541 63102709 61920180
16702 61920180 59864719 58138363 56535989 55004424 53464906 52526250 50980136 49542508
16694 49542508 48044044 46891432 45642267 44208551 43280031 41834050 40937954 39692835
16686 39692835 38596884 37689593 36756699 35503853 34938257 33762532 33161926 32088066 31495051
16677 31495051 30669454 29600782 29249625 28283900 27768136 26971139 26364081 25712287 25073753
16668 25073753 24544266 23822428 23454376 22641403 22446327 21724685 21231718 20850367 20463604
16659 20463604 20020494 19518433 19146872 18783904 18715989 17811724 17552018 17342336 16845064
16650 16845064 16586636 16295612 15839844 15447426 15237139 14878955 14943273 14314367 14163462
16641 14163462 13799656 13643336 13356591 13402893 12781057 12856846 12672703 12335756 11886876 12101062
16631 12101062 11472931 11324205 11195597 11002380 10852217 10927113 10539708 10246761 10290243 10499308
16621 10499308 9776419 9947038 9736924 9848551 9207264 8848599 8803957 8670999 8767419 8956947
16611 8956947 8530646 8494515 8318608 8221723 7875240 8252630 7802988 7653787 7634766 7452050
16601 7452050 7288623 7210241 7334624 7337937 6812580 6975253 6812929 6743384 6522738 6726580
16591 6726580 6388268 6499253 6286685 6355851 6714898 6311615 6245996 5870170 5772821 5608978
16581 5608978 5619602 5622241 5554141 5739200 5643993 5456731 5677144 5387190 5165818 5179959
16571 5179959 4909486 5155770 4979348 5248735 4995768 4690863 4698817 4852584 4947625 4511930
16561 4511930 4866719 4478238 4478180 4491441 4348504 4444050 4313674 4285593 4004871 4342701 4141401
16550 4141401 4150975 4325188 4140168 4055529 3815772 3851276 3817211 4130069 3845641 3935879
16540 3935879 3626372 3696641 3864189 3661398 3765401 3760089 3636802 3609368 3455064 3186715
16530 3186715 3566387 3456297 3593512 3183736 3362666 3272676 3483740 3316394 3007450 3168301
16520 3168301 3228684 3319953 2797087 3080723 3340833 3307530 3013301 2968421 3105290 2857218
16510 2857218 2877711 2776931 3112433 2996056 2758530 2701009 2388769 2868639 2606104 2811302
16500 2811302 2630876 2552488 2821471 2719083 2688040 2558533 2771505 2632164 2591519 2369128
16490 2369128 2431497 2674029 2678705 2479819 2373506 2337966 2701592 2286479 2334198 2233727
16480 2233727 2599350 1977541 2351699 2367067 2570418 2656652 2238479 2301000 2347739 2277238
16470 2277238 2112312 2146403 2039812 2191910 1947845 2163594 1826904 2013214 2182878 2115114
16460 2115114 1874291 1931122 2107959 1846964 2102515 1981844 1943424 2242526 1716249 2030408
16450 2030408 1960132 2197259 2001911 1776837 1927631 1785413 1924522 1968706 2116417 2112133
16440 2112133 1683286 2013138 1957152 1785721 1969929 1885973 1739735 2086212 1474289 1859203
16430 1859203 1837458 1386002 1872696 1865781 2084896 1470028 1638075 1440287 1539934 1610944
16420 1610944 1371046 1636299 1636514 1590740 1797543 1612207 1681675 1405489 1515120 1564263
16410 1564263 1611382 1616052 1431920 1308625 1117893 1336360 1834431 1557325 1280813 1195389
16400 1195389 1444643 1416478 1310884 1368728 1481991 1455241 1413070 1221301 1377779 1584860
16390 1584860 1255295 1344326 1257573 1405876 1196634 1651243 1315607 1321373 1609169 1172369
16380 1172369 1030372 1183371 1168094 1213574 1159173 1154769 1281902 1213359 1351892 1215286
16370 1215286 1571004 1037730 975706 1024506 1391506 1316827 1365906 1296030 1271766 1428477
16360 1428477 1166025 1379883 1057601 1281241 1348316 1193685 1613673 1444897 1015222 1423341
16350 1423341 1001154 1199995 938044 1423636 805973 1155052 1257064 1040195 1156954
16341 1156954 1093535 979490 896561 868550 1386498 890039 1114313 1305780 1171513 966556
16331 966556 876370 911880 1369237 1226512 806423 1074702 1073090 885752 641029 726167
16321 726167 774959 1050838 1224801 788965 1027572 992786 1204543 863773 602739 997494
16311 997494 897077 588725 952127 891602 1281690 978413 925742 974534 695488 665758
16301 665758 798319 1184168 1062073 890627 952592 744735 934969 922854 982223 771667
16291 771667 878905 946912 869577 1056135 577644 673354 1010978 1007004 1157533 1288273
16281 1288273 935701 700335 742629 995860 902788 808745 970717 771362 494579 653034
16271 653034 885095 692094 629277 611611 659483 660267 584756 837764 655130 927070 973316
16260 973316 616500 851682 672788 630266 838765 804108 489930 622606 783312 557543
16250 557543 655217 549318 701775 639157 870172 695795 583219 302975 412470 860676
16240 860676 706780 762636 700901 488288 415066 351651 423211 480190 503309 513877 472092
16229 472092 905206 743560 740743 328401 636943 267564 419653 976763 850183 319469
16218 109297 674029 662065 729579 872108 355157 338230 664548 599107 452044 451334 570905
16207 570905 554366 524359 592395 315672 372000 370664 496038 551158 523663 485886 570255
16196 570255 409115 578841 420976 300190 423707 431373 794432 730953 260769 509617
16186 509617 618818 585112 445951 776603 851392 583363 475347 525513 558301 429181
16176 429181 403087 374893 435904 602194 565115 248640 677822 421235 632869 533771
16166 533771 436013 379170 769238 674535 530266 489205 233198 431606 439687 537755 505345
16155 505345 468186 451589 93945 416468 364553 139411 302036 740320 772602 469547
16145 469547 527874 521760 683187 307702 130366 96711 468416 402092 529253 225917
16134 297159 597229 601771 404988 497945 192137 579507 301692 614215 211667 191992
16124 191992 295473 455229 109944 224434 619016 448838 387589 326491 418125 190849
16113 499645 490242 309368 229224 480848 470359 244077 -126896 256456 403975 201101
16102 143371 493857 105517 180710 198698 89772 508564 361955 194970 323632 -148277
16091 166900 225516 128814 293175 81987 530257 214596 229583 62723 109647 73611 312810
16080 312810 568298 -67846 3196 175304 77178 429599 43691 296902 504551 220846
16069 177510 255198 -46817 285493 649594 -66597 292385 69900 299712 362284 427902 119089
16057 -300295 181295 275093 624918 265763 152904 272171 343755 161761 203166 -37457
16046 204671 206229 31404 204083 182316 74598 2240 281492 125725 118316 122568 148491 123052
16034 123052 515590 224923 223765 83475 158349 141402 139596 83563 -198111 391085 158299
16022 223536 -238826 257391 225400 93141 275759 -83953 -242637 133715 85814 248080
16012 248080 15891 487165 48274 48570 353286 14320 -149488 352231 -181210 -96916 67088
16000 283399 -73049 288528 175732 63782 -73054 613335 357980 56917 213697 351535
15990 351535 423692 755286 566118 695663 822782 1044855 383307 395815 332829 476542
15980 476542 237798 288574 228031 289759 297586 269111 -115312 186618 442186 -194256 -112266
15969 -112266 149207 -97574 -144502 134720 337137 4464 -46784 178696 113065 -188923 -99994
15958 -99994 280133 99212 218350 -148979 192295 50650 -184511 -91871 503444 197904
15947 46288 175581 15905 24385 257901 -124787 155628 392387 -263754 -110719 177158
15936 179657 90214 233163 -260053 -29502 -195116 -90596 161495 279448 71498 180203
15926 180203 -196716 169748 112388 115159 353222 139697 -50698 112385 33387 -121276
15915 -40798 -271354 189 -79651 171960 228982 23279 -127427 7989 232536 -266447 263090
15903 -53116 288830 -122474 -60571 -199056 115977 234841 -287236 75809 141631 -277764
15892 271623 334915 165116 -50939 -35969 88286 37127 -124700 241814 81906 179949 18993
15880 -94337 153418 119627 -65863 133402 -325745 81465 -311335 -12727 52430 124954 230748
15869 230748 42211 104836 311236 257668 -156889 108666 -40571 123151 285546 -13984
15858 -111717 -14886 -95282 46000 -137771 422788 8184 255843 31263 69313 -127888 -257526
15847 -257526 34041 -175928 169574 -92299 160332 29426 53209 143211 70912 10415 -81778
15835 156788 3630 -52616 -102506 59633 202254 -270523 249777 -245555 86680 31295 15692
15824 15692 -248345 341094 1618 7919 28570 136790 -82949 102018 -146355 113428 -393375
15812 -20789 -166828 -30252 -154511 -169007 91749 -358563 92658 310210 -22077 -10459 -70832
15801 -70832 170398 -81233 166841 -230153 -70625 -6408 149997 -157433 -65210 -86958 281972
15789 177209 325625 82205 -33599 -145219 47223 -102941 1889 98489 -90761 -40510 -33944
15778 -33944 94437 305648 339854 -319122 164188 34329 284810 -74462 -351667 -94757 65858
15766 -65605 -105910 -178229 22910 -109493 193110 78155 431683 -77654 85782 255381 95383
15754 102346 -69677 -150241 -198816 291182 -157409 -355922 -51201 416305 -94349 266591
15743 777 32977 -73678 55427 -130867 288578 67605 17247 378265 -49155 61917 142423
15732 142423 -182028 12098 -69675 -135254 -41262 17848 -291850 -192577 5890 19640 40525
15721 40525 -29720 21965 232250 -77558 -125908 -73307 151131 -183648 209371 67280 18037
15709 249158 332927 -209372 19750 -183234 -161386 -42034 205075 91055 -250044 301969
15698 -139193 -204252 97579 -199621 -142193 203935 71845 10661 216958 -45885 157845 86248
15687 86248 -22677 -66542 -167627 -223663 -224559 -185293 -208726 -53357 -20679 -93062 -201177 336937
15674 -92592 179291 331256 34721 99197 -61475 22293 117960 -246999 181630 -6679 -11252
15663 -11252 215450 46390 158025 426383 -123997 69296 52934 -145247 -220652 5071 -150939
15651 172137 -208778 -86272 69314 42439 192595 -13988 -30569 -138325 -198380 -61020 321964
15639 -217395 191345 4078 84989 -226845 -105214 319181 -40239 -117750 76671 -164591 -138200
15628 -138200 196824 -340826 8413 -128622 55195 62244 257492 -119366 241878 -23103 -11627
15617 -11627 -309529 -188351 45411 -326437 11497 7600 248824 74108 163549 -116104 132380
15605 100426 230144 -7047 188893 -123536 -153572 107167 11751 -43924 -176399 -37226 -131429
15594 -131429 -30178 273727 -334818 31425 -150079 -39595 -144422 61207 94212 -132286
15583 115039 -167313 282393 -56310 16438 -285015 -164120 -2519 211380 17477 -8012 -99601
15572 -99601 -75445 143301 -105094 51098 -168190 -404773 -84767 -20969 -17859 -109317 290210
15560 176138 144050 -101167 364823 96656 -204829 217628 176261 266498 -16998 223656
15549 -133037 75732 220720 70558 320766 -101727 -134519 -123751 -44995 -180238 46678 39622
15538 39622 175417 4045 -103667 -284639 193286 -143972 18930 -71687 240034 -25340 58495
15526 179627 154258 69350 -54713 -264036 107134 -264603 -29874 110737 49060 135768 -46208
15514 269159 -71480 116894 -15804 -1464 236041 -459073 212220 140357 2453 -207407 -75745
15502 6610 236387 71059 -41538 89259 -95333 -200326 202229 -339870 -200443 -179057 -97064
15491 -97064 -43620 124145 -369080 -293462 -60682 -67033 -136095 50464 -110477 31842 -24590
15479 -106929 315702 235988 80807 27754 243475 104442 -1619 142707 -66459 -105236 -83219
15468 -83219 -40717 -177397 36365 8714 -69336 68597 -44588 -134901 17071 98478 100566 -190450
15455 93546 58675 187448 -194798 -93904 -171989 201496 108195 146567 290637 -68991 239688
15443 670179 440474 266922 597083 290825 147658 206157 91804 -239170 -231520 35198
15432 -57060 -87761 64315 67742 261511 151395 -117784 -271178 -383383 35093 -71926 67015
15420 -139766 -236835 12871 82608 192383 -162771 241401 151267 -168118 -26405 223385
15409 -217812 -182560 -330177 223694 229099 75863 101706 63347 37318 -296570 22656 -169422
15397 -130267 292800 -99680 -37634 -8142 -183648 -324936 211135 79827 -38650 214356 164896
15386 164896 23484 -41179 -26777 52138 153787 -73174 -99503 125833 201992 118293 -9584
15374 -20346 216024 524841 314205 -142101 315412 364156 264970 346823 230875 -186570
15363 241705 -107283 -74559 -43044 536905 197777 210146 62645 407740 111366 -77378
15352 74949 205781 111725 333874 -231636 255072 287656 250245 -141945 -127465 85799 154265
15341 154265 438750 215409 246197 347890 192262 39328 328085 -77564 91989 167784
15331 167784 249228 456634 204325 165468 53370 191921 70928 344011 139532 118381
15321 118381 108311 -2831 105843 -141900 -89423 -174757 -48180 88427 238214 -60723 189480
15309 513953 19996 220287 -30237 -6169 -4191 85193 -58610 -85117 61883 137553 253935
15298 253935 28333 373304 -90734 -125753 -254387 443369 63201 -92502 167274 -113003
15287 47208 70989 -41868 491818 -4975 153517 -123413 278091 262187 -24323 80429 -180739
15275 -45835 -249089 41243 81467 -247114 -104560 -51422 -119585 23992 83029 -66723 121900
15263 404501 -66183 -112712 9425 37063 51257 204924 153117 65713 20374 38661 81018
15252 81018 342053 242658 325362 1046046 1648878 1729182 1714476 1920303 877795 433205
15241 142852 230925 343457 -304533 -115558 100080 121330 272126 -184089 64778 -103026
15230 47084 -212987 76593 236754 103755 150851 275293 309539 -225778 105183 -153153
15219 5775 -134123 -129949 172646 -59076 -105679 230514 133409 272838 -24698 81829 1395
15207 -134039 -299932 153753 26751 -39112 -55672 231015 128216 2861 -34703 124490 218824
15196 218824 -65406 50640 -89752 114060 69216 141918 40688 -25335 378795 125956 -132150
15184 -29313 132511 269779 -135141 71036 -62862 75101 108210 40779 118478 60622 99643
15173 99643 -102902 102633 270772 94455 -132362 233725 134952 179387 -22728 -112735 27494
15161 66411 -68032 192815 95479 213199 172084 -12077 -55893 66028 -5441 162981 247673
15150 247673 119202 -322583 100661 83608 223507 223647 180101 -42956 268348 -176876 176582
15138 -71952 119391 5059 -98815 337832 -362436 84732 540952 -102536 231360 -56109 144070
15126 -59116 278822 339983 47927 -233624 228514 340688 115042 406802 310862 -41076
15115 298046 94638 252558 282158 89921 405125 -143048 355894 26606 97025 478255
15105 478255 210682 25959 413572 222346 379393 212830 90441 164425 -197184 288365
15094 -8156 213479 -33531 217005 440851 88758 211357 497145 -124769 410385 12266
15083 -22284 373798 359623 18043 -230771 382739 415644 151653 72801 -101614 81985 -75276
15071 235247 195245 -7862 15023 439846 159907 -5563 -182762 101354 -66915 207854 -159741
15059 268052 151903 242909 446945 78471 105976 312406 158966 746349 -17321 274950
15048 -23713 245877 293809 193504 363317 317006 -35377 210177 318765 427430 323160
15038 323160 555149 388361 461020 234660 164234 302528 -1658 278638 -9920 221402 360797
15027 360797 576552 400591 382425 329888 349292 293929 266757 75953 462835 143513 591488
15016 591488 -95607 347311 297931 76605 210598 -15697 -31410 196152 214457 33225 18973
15005 18973 172981 172633 255971 488201 202486 417182 594284 113483 452800 466909 530090
14994 530090 52735 734603 308239 232396 255446 258581 330826 260869 505582 544926 219096
14982 313528 171695 194844 372963 399375 537823 327510 263291 485915 512383 332588
14972 332588 154660 3350 484843 761137 396856 478738 677805 320688 262373 420862
14962 420862 300402 338347 75397 638427 435348 211385 57292 618238 320366 294513
14952 294513 636288 266487 323811 399578 273910 582686 19804 442911 78831 272053
14942 272053 369786 335761 291690 317352 699807 344772 396348 647636 376790 495734
14932 495734 605631 647905 741928 601977 979396 596067 839242 590419 703150 735679
14922 735679 1161434 923900 690821 1213308 528889 1128696 1249939 1053716 817965 781290
14912 781290 476226 699843 678019 544542 740973 249460 229484 106094 329379 252414
14902 252414 583922 856077 562274 540754 346089 615799 250300 352094 262061 128414
14891 388295 74845 350580 92062 232516 687038 639939 290779 664912 495038 595702
14881 595702 670940 668456 377650 457033 561343 693026 394059 621859 487863 506249
14871 506249 114428 550185 555938 658798 352992 870673 435778 649436 663008 602101
14861 602101 594672 471632 175373 348456 398747 525849 377705 459168 420361 349116 442210
14850 442210 435099 307476 570988 445720 678757 210349 324121 310273 392021 672873
14840 672873 790447 516112 860884 601585 587737 911302 592914 292088 157138 571283
14830 571283 251757 235808 674418 263622 135011 604114 333528 550899 688588 780880
14820 780880 542018 696787 387278 737702 614146 455465 426920 403634 622314 408024
14810 408024 435389 584824 524664 516071 472724 515810 609334 530153 501002 883579 933104
14799 933104 635367 539788 393673 930413 608791 766514 448811 374518 700509 387157
14789 387157 642303 574457 668526 364251 528814 498950 605300 765205 474818 705340
14779 705340 613482 368890 226872 865375 653360 307139 636735 749366 608093 883182
14769 883182 866121 765249 444565 804473 710106 592405 139355 828508 684731 470194
14759 470194 496929 590815 594953 726066 583026 526922 623498 518484 769653 562004 824848
14748 824848 886983 529348 664252 571553 987534 371504 506772 866486 681655 895172
14738 895172 881176 768770 955696 836914 685281 674778 733759 815528 985538 489863
14727 1135963 891332 1353987 961772 964431 1077147 1171054 1103832 1100952 1119657 978975 1295572
14716 1295572 1148716 708953 846553 964284 662631 1005002 720921 568309 827575
14707 827575 790967 779477 728412 1100507 931315 877039 1095618 1141223 1021348 1445924
14697 1445924 1395532 1018997 1219286 1617267 1357081 1002256 1154257 1010948 664272 832030
14687 832030 668022 811161 732052 830422 990556 1044168 520099 981085 895379 953049
14677 953049 757001 928960 961216 1030071 924497 803839 1100288 1256120 1273847 1161142
14667 1161142 1163303 1005109 1019983 869546 902435 437545 929198 1137977 927734 1227611
14657 1227611 989440 991608 1069413 1425493 1120195 839102 1207612 1213304 1156048 974670
14647 974670 1258134 1136064 1210742 1367864 1571375 1190104 1423821 1145296 1327798 1179728
14637 1179728 1276703 1454223 1026163 1460474 1227421 1078178 1183778 1195842 1231395 1259018
14627 1259018 1365658 1527783 1096780 1134431 1693771 1159891 1348835 1176948 1306751 1176112
14617 1176112 1123028 1113341 1305274 1581946 1265480 1632629 1377280 1507322 1607706 1505764
14607 1505764 1636653 1291733 1403187 1367694 1279494 1530516 1298932 1367736 1684750 2103222
14597 2103222 1718533 1712502 1439009 1838990 1436921 1603605 1568040 1664764 1565284 1871555
14587 1871555 1405549 1816547 1653975 2107555 1774689 1736716 2044696 1497559 2058019 2036098
14577 2036098 1625171 2014936 1865909 1997796 2190587 2245415 2109670 2188562 2335456 2305751
14567 2305751 2348104 2567745 2381864 2311892 2278725 2545185 2343137 2522112 2668500 2672826
14557 2672826 2806006 3084416 3239455 3207840 3524641 4439303 4881334 6333873 8649057
14548 8649057 12752845 21847256 35574263 36106006 23008342 10491021 5112551 2807206
14540 2807206 2088475 2026193 2026460 2094117 2171944 1941669 2043039 2072370 2066149 2212028 1983089
14529 1983089 2048075 1729478 2101792 2320053 2262571 2283035 2399998 2428928 2255214 2553166
14519 2553166 2383193 2683054 2626301 2269111 2695840 2784367 2882260 2632058 2613375 2778572
14509 2778572 2819530 2800800 3083957 2834329 2878342 2464299 2952967 2823971 3265915 2752893
14499 2752893 3158118 3330249 3146345 3299368 3347862 3329630 3165078 3327371 3201784 3274840
14489 3274840 3231949 3365366 3714909 3525665 3485254 3638485 3715563 3294969 3907598 3889595
14479 3889595 3729362 3819325 4061578 3860640 3836887 3961019 3864388 4094144 4021830 3809725
14469 3809725 4275346 4144079 3973359 4285821 4250700 4288325 4838875 4492227 4667504 4772302
14459 4772302 4969012 4902851 4737830 5200141 5108363 4803216 4825028 5036063 4978259 4994371
14449 4994371 5205361 5604948 5470952 5760963 5637394 5755403 5855738 6010288 5709264
14440 5709264 5703024 5814892 5949786 6334077 5890241 6255587 6294375 6635392 6455147 6627825
14430 6627825 6717389 6172195 7012576 6967955 7176425 6934088 7230261 7086568 7721524 7556798
14420 7556798 7759841 7849000 8544590 7872190 8244593 8443614 8409892 8346535 8581120 8758459
14410 8758459 8698719 9094550 9437036 9051183 9383414 9773200 9736505 10040011 9892142 9884280
14400 9884280 10108551 10569746 10719435 10910715 11408543 10961928 11337270 11750404 11610357
14391 11610357 12191630 12088962 12021655 12691864 12789554 12969796 12882008 13469936 13686307 13586354
14381 13586354 14283064 14531300 14818319 14973624 15516143 15772970 15825884 16156241 16385784
14372 16385784 16688223 16927129 17264578 18048823 18130124 18430667 18801373 19380467 19809593
14363 19809593 20308440 20514673 20949851 21483262 22042844 22222551 22799706 23047693 23840508
14354 23840508 24410044 25253180 25691366 26075478 27089416 27541907 28120530 29101345 29673937
14345 29673937 30700554 31151723 31842574 32837073 33621900 34603469 35665922 36696821 37671388
14336 37671388 38877658 40247666 40892877 42377061 43444386 45080636 46388153 48046429
14328 48046429 49396481 51074459 52596072 54615329 56158897 58635162 60278080 62627466
14320 62627466 64585346 67093737 69353461 72138894 75200374 77675550 80889300 83844141
14312 83844141 87650570 91276250 94713636 98980583 103576701 107872316 112353991 117697703
14304 117697703 122478062 128048623 133724579 139910526 146627064 153433710 160592533 168369207
14296 168369207 176346578 185016840 194597704 203740453 213782819 224194339 235296097
14289 235296097 246987821 259201104 271515753 284326441 297872582 311123662 324968040
14282 324968040 338395504 352499384 366295328 379510170 392746655 404740968 415851997
14275 415851997 425918390 433258725 437080440 438484123 438807597 438906154 438150357 435582689
14267 435582689 433175616 428210770 419534721 408448562 396016563 382583036 368134811
14260 368134811 353123791 338333725 323380394 308373067 293783572 279709586 266691539
14253 266691539 254523744 241876073 229892994 218472966 207883495 197644468 187795386
14246 187795386 179029592 170316926 162509092 155209124 147640647 140529972 134172029 128406795
14238 128406795 123374111 117799236 112747848 107915943 103418069 99126180 95097863 91613401
14230 91613401 88381572 84386318 81152327 78318058 75356093 72706280 69987655 67325313
14222 67325313 65276198 62840089 60842143 58833087 57015379 55044278 53184818 51658553
14214 51658553 50239441 48578347 47027162 45615270 44167915 42880675 41726762 40529392
14206 40529392 39789519 38502035 37344616 36208325 35019188 34448031 33623625 32855681 32025573
14197 32025573 31036495 30114773 29592216 28781040 28034164 27385071 27000629 26085143 25615952
14188 25615952 25115385 24433495 23767516 23189400 22827774 22282824 21518187 20820714 20842096
14179 20842096 20153099 20022432 19562049 19172735 18874160 18148010 17939566 17475725 17224692
14170 17224692 16827411 16896339 16362530 15874312 16087189 15482380 15003947 14906711 14608002 14354936
14160 14354936 14179716 13945536 13376510 13084788 12960071 12711145 13009571 12447961 12547928
14151 12547928 12094460 11863715 11541195 11656655 11535751 11083909 10877467 10808949 10422066
14142 10422066 10227116 10450588 10285292 9991854 9774546 9761416 9721370 9622157 9193078 8978291
14132 8978291 8767171 9019190 9042832 8748854 8536036 8449511 8429688 7934384 7779551 8088333
14122 8088333 8082195 8070555 7567208 7561305 7532250 7249041 7179340 6962786 7154709 7253169 6837982
14111 6837982 7018647 6825473 6727669 6887346 6724496 6434577 6320555 6257876 5975609 6202273
14101 6202273 5966128 6141062 5944332 5866691 6023916 5500266 5930038 5725470 5587946 5738942
14091 5738942 5313473 5330413 5111290 5232733 5102526 4949815 5035856 4868308 4891691 4969836
14081 4969836 4832930 4612302 4586233 4699340 4610909 4526515 4607716 4282343 4359821 4547149
14071 4547149 4494871 4341228 4249185 4178462 4307644 4659078 4197149 4013084 4301762 3911056
14061 3911056 4001766 4162848 3901057 3942728 3866464 3641256 3992916 3838250 3564759 3544297
14051 3544297 3942196 3368910 3390850 3234191 3782332 3599952 3395120 3273348 3499722 3194014
14041 3194014 3285678 3230744 3216782 3292448 3244453 3124447 3271871 3055285 3131336 3067074 3290880
14030 3290880 3151091 3268325 2945046 2650293 2683367 2334978 2654249 2607733 2762184 2577651
14020 2577651 2486620 3047270 2860785 2585485 2293271 2512266 2570894 2473779 2308760 2482899
14010 2482899 2288724 2591241 2161163 2361004 2342029 2303900 2511621 2257788 2072456 2621350
14000 2621350 1961212 1990271 2013356 2207889 2061964 2366753 2323582 2252742 2598485 2631746
13990 2631746 3206679 4404060 7305309 13391274 27403250 36913908 28063054 14806028
13982 14806028 8585077 5862027 4980098 4237334 3773245 3491785 3274880 2982430 2794702
13973 2794702 2697323 2544614 2511204 2860053 2409516 2357332 2285805 2555467 2356342 2180571
13963 2180571 2498021 2047646 2268937 1991786 2125208 2044461 2266147 2217758 2108390 2131728
13953 2131728 2515096 2109107 2170895 1785091 1861991 1675210 2038904 1960250 1375044 1710982
13943 1710982 1912026 1877680 1572019 1678616 2046000 1719906 1633713 1796903 1548558 1846119
13933 1846119 1766235 1675582 1428844 1693744 1680828 1837268 1528903 1458621 1519761 1725451
13923 1725451 1607459 1466691 1273001 1763672 1775810 1320350 1430168 1503757 1615879 1230989
13913 1230989 1386266 1247256 1337203 1371611 1626367 1343380 1672293 1388659 1369409 1488980
13903 1488980 1283872 1050692 1396602 1177355 1366339 1131403 1356997 1432315 1309738 1350212
13893 1350212 1330624 1498556 997403 952918 1415215 1027249 1442038 969883 1095205 1135084
13883 1135084 1445718 1068726 1225532 1223527 1227618 1285088 1213602 1253163 1211041 1112640 1103122
13872 1103122 1085543 1198208 1036312 1583287 979497 971290 1199212 1197897 1159575 1183381 1133485
13861 1133485 1154657 1148887 702670 1526828 1060975 1220083 800195 850991 1093780 1109052
13851 1109052 1125153 1101828 1257406 1004482 1016393 1335921 866649 1055488 1123175 1039569
13841 1039569 1153866 882737 1040219 1251757 1216922 954847 777373 920920 980010 1156831
13831 1156831 1043126 1028393 870592 702638 1058432 1214745 1048014 1311429 1096370 861005
13821 861005 884341 941332 900627 958638 637095 1061795 1010149 1040115 857704 811024 1005115
13810 1005115 1055459 935485 687677 1147002 784215 667055 1105723 865638 766931 798842
13800 798842 677311 615757 755701 575512 757997 931830 529077 682589 823476 748180
13790 748180 642386 973583 783809 852333 727634 704599 916397 640799 813477 713031
13780 713031 585491 658541 627163 428190 836758 1023602 857594 482219 1034984 781913
13770 781913 923260 714741 625493 702717 818164 924954 649057 422495 948200 813643
13760 813643 675234 472883 524879 520921 323371 1010515 642075 707516 504517 841172
13750 841172 468922 901263 994957 116519 710982 730978 584454 456101 679505 738340
13740 738340 773905 580597 544959 402662 542313 421247 793007 477409 420839 152584
13729 600406 933261 571806 373242 328385 601663 661061 881783 415330 622402 672424
13719 672424 819531 671899 496770 643582 625668 351868 745158 802950 299052 944496
13709 944496 826111 446017 412131 772173 170907 393447 754793 482949 460221 502679
13699 502679 618538 679132 563941 504768 539420 760046 369505 493701 415672 445794
13689 445794 293874 350488 573818 429122 575872 291991 479996 708495 102047 419831
13679 419831 426771 564168 731599 485706 382516 633575 367758 600669 228439 565369
13669 565369 453102 338814 415949 437792 716831 590697 478382 605306 450872 890719
13659 890719 495670 586599 221207 278608 447466 263912 515866 389168 797530 397363
13648 469732 320955 640161 372829 568409 881981 465910 346429 640140 181001 437414
13638 437414 525480 751090 538969 646101 393388 463439 206894 653554 464817 526322
13628 526322 267388 500269 293583 370113 68266 658925 403415 594356 176687 345617
13618 345617 278342 443829 186245 -68536 317865 474323 355796 686998 654503 350198
13608 350198 266024 336825 479292 324498 280345 514820 587299 561325 278569 709896
13598 709896 246858 254449 135759 301013 318920 432018 266275 375601 189065 501690
13588 501690 255748 214911 362865 720958 337234 467543 348536 435232 -10002 241159
13577 244661 215796 256607 615902 600465 431392 344035 366023 116953 223879 456445
13567 456445 288460 159291 494856 189700 105534 524065 460459 209834 282292 378387
13557 378387 677215 517988 -54211 568460 180827 291744 238130 191317 397566 252370
13547 252370 165664 550681 337133 271259 476304 508475 477760 330187 653997 357041
13537 357041 214856 713254 161152 -32871 270519 310689 378293 -66368 332600 360495
13527 360495 61311 493789 536905 190471 92366 327899 125482 268418 298263 487714
13517 487714 319400 326937 81782 100367 219089 281849 294128 366623 247436 184039 411401
13506 411401 758596 139425 116844 328352 239074 436712 246257 365107 437509 352418
13496 352418 277030 435671 646680 109778 175554 199018 45952 300192 328247 -6728 113013
13484 302608 222382 433102 278888 197860 303306 213413 257835 238407 95068 453916 238341
13473 238341 36999 249807 -78506 108671 304488 117148 249889 335003 212261 251471
13463 251471 78790 102759 239526 -94608 432895 270175 329851 278766 389166 137485
13452 117760 -258469 418291 300055 -31601 566427 265579 91189 -5976 224537 40061
13441 -117178 158933 199853 326997 111096 430317 229672 34697 157321 214719 183259
13431 183259 199890 -219985 185776 -4987 273431 310968 121717 347975 -106023 84792
13420 -131567 2271 140826 278897 218047 180966 496559 87016 434480 8890 253640 192623
13409 192623 155901 132262 3108 78289 -30229 241700 287189 246123 172993 169482 142394 112614
13397 112614 374342 216419 101855 213822 113183 239778 280195 -56386 116210 -43263
13386 328927 -17070 196677 180566 203278 364306 280877 388316 3113 103241 168789 -214990
13374 164157 24831 84129 292731 80490 -19419 140080 311086 81272 188663 162062 115822
13363 115822 181387 246903 233865 334265 53967 226907 42929 41777 -66707 116991 208802
13352 208802 335169 350739 175138 182559 377542 322396 -18578 77378 126939 34892 224240
13341 224240 24037 -59215 137 131185 557976 374230 450972 363937 -30511 277035 -28108
13329 52007 42668 472004 404394 -8735 385014 327949 199707 107923 110705 464747 -37338
13317 93809 124075 182516 421173 159736 300898 -88296 -47505 578185 13629 -93479 -227852
13306 -227852 212348 191997 -17546 221713 177389 -110678 34950 297910 58230 443966
13296 443966 209653 151949 9993 -8712 405989 316232 510249 253492 112858 -9730 34362
13284 -68523 36266 97972 32239 -129052 497799 20534 57035 11981 109479 -76087 140179
13272 79356 119894 91154 224704 144826 338584 192498 320328 83970 37355 -69543 116570
13260 147219 33557 -38452 179942 123949 154037 123238 73302 109401 23550 100101 133068
13249 133068 140456 -147947 167918 221254 273896 155325 357555 -13147 238145 405621
13239 405621 160350 183621 87492 219950 -113048 119874 157305 -50930 278744 387786
13229 387786 205588 131304 132402 61621 571144 216689 -296254 -41164 22603 258752 -386605
13217 -52133 -116732 257064 189717 -51933 358505 355087 359040 -21423 286867 17096 248164
13206 248164 -140326 82484 171226 459982 83590 220632 284930 180269 -29630 -136000
13196 -136000 243155 -88337 157599 -235854 278833 39732 245301 80874 155699 257353
13186 257353 31755 -36025 -183887 51466 141375 102509 264724 233083 219232 -69807 322594
13174 123483 68755 -168714 -83153 278370 67239 34842 -54102 139203 201281 390845 13660
13162 200117 -50840 24543 -108102 -88642 -196433 163927 165580 -19580 -60880 156683 324305
13151 324305 214093 225345 -160412 399006 377756 180164 -34321 176235 -23183 -140431
13141 -140431 -218614 630944 9252 178140 160358 127182 117598 85265 674 -161942 239845
13129 217086 -284399 -76302 35232 -172221 -53895 164499 -42720 119927 -152488 403617
13118 -107508 202139 -97022 -273481 -82690 167689 202500 97067 90681 142426 225585 46265
13106 53995 298832 169177 -20207 170214 -240519 163339 14740 74671 -133679 124774
13095 104402 -245990 67298 -3939 147025 82948 335077 250227 -258229 -25231 -16236 50783
13083 43879 29005 222755 354995 -52911 -32809 168809 395150 377589 -66019 158418 -198216
13071 -35153 38590 -88924 -72254 -133728 126468 140450 60458 397563 -96651 -16802 -91521
13060 -91521 297746 244791 -210176 -25199 307286 -84485 30141 -82864 33370 510071 129608
13048 -87690 -41543 235755 -42138 121644 109912 -58473 249088 121181 67419 190691 -144452
13036 111377 -248576 -41678 -35077 392859 -55552 -42756 166884 76409 145693 27116 215152
13025 215152 11992 -97514 169818 459555 -118285 133044 275012 355157 -682 565632 279296
13013 -90944 36772 425304 -36787 294162 84411 36016 -84151 244323 29302 324569 118183
13001 63970 103777 -57441 14095 -5883 -371331 286924 329930 -73334 -263659 113050 -194098
12989 236694 283978 53557 111668 259852 65840 281334 156184 36412 251621 119840
12978 -199602 75329 121267 -147469 -162836 15815 -168201 -146767 59707 227465 -107549 -19614
12966 251270 313205 4104 -175768 -89630 149020 103346 -74502 -97249 -85690 195168 119494
12955 119494 -67061 -122305 40725 34175 -78168 -117145 -216391 -81216 -109643 -257072 161782
12943 -7544 -20522 253982 84025 87209 -204327 172385 213365 -8988 42754 -159195 171184
12931 -25032 83057 -84665 -132880 -78207 29897 196414 9479 -133011 149423 39596 9529
12919 -139906 11409 -5094 86611 -158971 59203 -201831 -95376 -25349 176567 -80219 -82617
12908 -82617 160187 -98970 347606 -297472 -65008 157618 93186 -41541 -54571 -475570 104947
12896 270146 -126186 214904 484741 -61668 7182 -19476 -148946 -33930 -18496 118120 -197505
12884 181936 256456 131080 78010 -40528 199735 -39630 -15063 176942 6680 -10433 27384
12872 -54721 160224 59309 113364 56990 -114800 111392 -115256 -227160 -11846 292024
12861 10494 -39617 133473 155406 84416 229928 -180969 -381041 80285 81776 278906 154091
12850 154091 -69041 -84913 -274219 96690 16436 348634 -83035 -169375 -33190 -18982 189840
12838 108060 -26000 147307 778 61814 197810 288407 -155589 21104 -22691 236171 168570
12827 168570 -134201 59271 -61036 -81863 -118316 89543 -105114 160863 -262658 -23187 -317267
12816 -317267 267900 324481 -530792 -12711 -14251 -85683 -200191 -105050 127390 -330595 -197547
12805 -197547 -100896 -44184 -181669 -311854 -6065 218193 138680 40079 102178 -288141 12165
12793 -15322 73496 -63360 7571 -86341 -235857 -95687 230825 -112791 119869 133745 154618
12782 154618 383635 -154415 -139754 -236226 90212 -120878 -71640 314350 220022 465428
12772 465428 128454 111849 127714 131753 -4489 203893 257780 -125464 -328174 -2816 78335
12760 62696 130068 205441 -134516 -124539 62577 6578 -119377 69337 83973 212539 239522
12749 239522 97810 -168046 138564 -51347 656 51635 50173 161738 195375 26717 -86197
12737 -56928 -24582 179321 -218841 -16602 193418 147904 115371 61684 81711 -254141 233256
12725 300176 395540 -194942 39651 -117578 -83755 -39384 -168678 135708 229417 165642 234387
12714 234387 279749 257520 304869 85977 177591 54883 55967 4066 282552 -83905 -52989 -198444
12702 -198444 -125194 -272795 52632 -50841 163238 100794 -33380 -76656 60590 193830 154438
12691 154438 -158243 72341 156180 158258 199988 300434 355838 164049 233193 -106312 348331
12679 46786 188888 -172314 275974 -50754 -104074 118843 -93342 -61508 345332 1201 87170
12668 87170 85858 184580 -235868 312631 6223 -283535 131620 -124987 -9146 354724 250159
12657 250159 -359251 16931 209909 -182695 240363 92263 65691 -65051 122744 144251
12647 144251 35658 133154 -121859 -272388 78428 -127832 163638 176569 192247 63377 -184757
12635 13065 -107260 -48821 -160496 44946 58366 -149618 96875 307356 -27640 -194832 178127
12623 216038 -219393 -57929 206399 -262194 -142795 15821 5969 191762 90984 153318 -66527
12611 -272662 -60607 366040 129344 43745 60129 74124 23284 93547 -27749 -117028 129480
12599 23883 154317 28673 -404531 -84637 3485 -180111 27950 -98886 -332434 -22737 42442
12587 -175693 -253747 -9717 -216156 -153891 201 232928 -412360 -222856 -104660 -9991 175442
12575 -78135 79411 223800 -236181 77012 212830 88712 -334540 -51916 -10162 -122573 -321002
12564 -321002 129271 -17481 -294598 70041 33840 -153667 -139899 69241 314382 -124348
12553 86848 -181489 -110202 -220521 243983 222368 -38839 -175118 -6299 -185195 -251457 -47845
12541 -108438 -122587 77916 316011 179769 -192396 -223473 -183222 306351 218080 -214159
12530 23035 -274875 99627 504150 69266 46667 9648 -252368 -269006 -85430 25583 81038
12519 81038 -46684 16537 126150 -183151 213438 351159 -112941 190672 44286 172218
12509 172218 -46269 -78414 73256 116326 245348 -60828 149926 59004 174182 -176424 115488
12497 -248756 303953 56001 198341 -236972 -83005 251479 11718 -24777 25179 196613
12487 196613 63547 -37401 164428 90591 -19288 -155606 56193 22041 -162994 176117 272100
12476 272100 -223945 -441071 -93925 213696 -426895 -367532 200811 311526 158909 179001
12466 179001 -30938 -30779 -19208 -168567 -441147 166173 -227688 34183 -115327 47788 161663
12455 161663 199352 -153472 -107727 -6900 151842 146181 10609 90628 44413 -31584 -44253
12444 -44253 -65790 -35864 142840 129908 -213311 136843 73059 -175393 -345942 30183 -66016
12432 -94831 24126 51823 -366309 -21447 74615 9852 -27613 -6140 132549 -196252 91888
12420 188693 -269203 -89524 139971 53345 140076 -204828 -99131 21188 39633 -3390 150648
12408 -183570 65061 -18286 -205599 -170024 225057 -274992 -182493 -22019 -402 184450 202342
12397 202342 350217 -44196 -47815 147391 -102544 -39895 109728 -113434 -124693 -117935 201773
12385 -80337 -76447 77583 154134 246750 55930 -43864 -25580 291554 -5673 -31693 -136121 -280670
12373 -280670 -102212 -28911 361439 -55918 -112006 -168733 -67813 92070 48725 -11070 -91514
12362 -91514 39597 81545 -234204 -30453 -228473 -116595 -58070 -289988 196169 230105 -86149
12350 86744 -51785 -93681 119483 8688 -72374 -108135 96611 77606 62843 299262 82285
12338 55080 -47132 9979 -111850 -120446 -27489 126921 2787 173122 155532 -51803 -80933 134962
12325 -131017 465599 52758 -3857 130178 36950 19351 170053 236347 -96465 327176 115591
12313 -162742 61653 -211918 -12571 149208 -27772 210723 -18757 -179676 151558 -103373
12302 -69541 -135341 -49250 23419 -2629 -105816 -118954 -201349 64337 -164889 172993 -54382
12290 -94551 -129228 47962 221506 -47423 -368303 5678 -16110 61604 -37189 -123427 -167913
12279 -167913 153988 13603 28129 -25624 178789 303961 -16020 -368402 43377 -185603
12268 -157601 -104227 232476 -84168 62297 122213 203987 119203 39943 46801 23642 -282339
12256 58625 23470 200392 215532 205467 149443 238113 227328 -99849 -15418 419642 303524
12245 303524 136986 184578 168120 -30212 318021 -174166 35012 89854 4127 -313110 -26477
12233 149007 -16947 270087 -287906 156788 -61750 174488 94431 -69047 188947 140961
12223 140961 -47284 245733 17297 30189 172069 140859 -55960 135384 -182559 236814
12212 404416 118130 -28233 133391 190749 -240936 220306 507950 -89388 1102 335419
12202 335419 -31812 -78068 55748 181298 23179 133052 347528 -122725 70407 335952
12192 335952 -73571 -104776 -121613 78847 -121906 -111070 -147387 272580 139744 289708 80364
12180 -160411 186662 -117674 32455 151202 -52400 166697 15410 468010 351976 387070
12170 387070 -36267 373755 329400 14756 31370 88686 189718 -76571 -213695 135716 -160205
12158 198377 297195 -46162 -108882 5681 51576 -89925 438568 -49231 -77202 -105645 179537
12146 140576 -336208 55677 -146169 94110 113567 68599 -75578 -20881 207776 -69671 290082
12134 386183 -53771 -1144 -71668 203364 2009 -93323 -161920 219493 -41782 13946 115578
12123 115578 207329 19692 107208 19671 20148 11188 -67664 286118 74207 -28688 221287 62135
12110 101984 -5144 180554 63199 -85476 69204 66639 -73033 -7019 215139 -26623 213060
12098 -326867 70661 -131873 429781 157627 235695 -116367 -4647 303391 68507 103338 48953
12086 -142111 -25664 -167206 -198493 20276 425260 -173708 44942 -359330 180560 143739
12076 143739 132273 -50623 -96786 64407 86754 91314 328214 7982 286258 177790 346281
12065 346281 83819 384271 1075305 569478 32571 438646 -53319 -98849 -140193 -215872 17341
12053 -359974 145176 -3847 169416 -95600 52501 -11282 24885 86554 -35183 207368 8960
12041 -185879 -165093 173922 215126 -167308 78653 139980 81280 75191 130162 249233 33327
12029 112678 -21197 -79294 -45133 54058 -30164 -40457 -174910 94758 28450 154971 -63549
12017 138392 242787 167287 243719 -109243 215841 -82225 380832 105269 168264 -143196
12006 -82927 -159123 390755 285961 -13899 242044 79693 -174538 -162663 -89160 -15353 -358982
11995 -358982 -13131 -236193 -143243 -53968 -98600 -259460 94883 8749 -306696 -1621 34645
11983 -36224 88268 -7446 -42622 -234376 -249159 -117680 93232 240328 -27758 -89909 -263567
11972 -263567 -60004 -89076 223627 -75656 -47514 -186446 -224187 87778 -361129 -115428 49981
11960 -381714 -109655 -199399 -129856 261779 305364 -449827 -180989 136401 68842 53417
11950 53417 18116 220474 118353 -8954 1497 -72974 -281682 -300290 96998 159491 48037
11938 138049 -150709 -251754 273804 -122853 -21429 -165761 117664 214505 -45003 -155751
11928 -155751 -293488 -108836 136582 307681 75714 214847 -451631 -364022 -77517 226874
11917 399024 99764 112448 327796 -5800 8713 -393897 -154685 56471 -15394 -108346 -74364
11906 -74364 81692 -170312 -75853 54037 48122 -15001 -57548 177300 -186343 89550 212933
11895 212933 8436 148437 -4165 -44891 180962 -247362 69656 24162 -40044 107222 9390
11883 -146236 -206001 -12457 -24808 82863 -13606 -20555 48270 -97356 22104 -341867 12385
11871 74633 208310 335661 -129298 52029 48436 53019 -71752 -387558 -257544 -113728 -169553
11860 -169553 165051 218482 -140125 -297943 -90854 178930 101324 198267 91389 35727 -162866
11848 158498 -191542 7898 -353033 130784 -100683 69213 81046 168872 356957 -78678 -100304
11837 -100304 79554 -151312 153200 -273619 61188 155980 -99785 26120 157457 19595 -68249
11825 74431 197523 -373282 200487 150768 -197709 -51987 -8034 146928 -298460 -192549
11815 -192549 -35086 34480 3078 198656 -27047 45981 66815 -147520 -17079 -58944 -38636
11804 -38636 172874 71953 -22491 226915 404262 -133219 118820 -345807 97432 -39378
11793 -263833 -190869 -173791 -25612 -124003 29044 216510 -81794 -410159 -6300 166819 -301159
11781 -120319 -194555 -127745 -211491 -114851 -134692 -146626 -13269 133361 53221 -213188 -49271
11769 -202552 -96953 -104860 -26276 19909 89528 133615 399560 -151112 193620 -130148 -34586
11757 -151218 -115492 58382 215566 76629 -1354 -237182 -222275 -17988 10460 -3617 -123600
11746 -123600 -135629 -233170 -69615 -99679 -13055 108941 69925 -129276 -16939 -138154 202833
11734 410124 99200 72671 20596 -266010 52204 171594 -132205 -165547 1631 -78388 38973
11722 -208420 4208 84409 -145165 -187861 70399 96196 -138727 -321439 61414 156649 -44955
11710 101817 -90703 211820 285327 4589 -89500 230392 -187079 -1046 122026 290324 66252
11698 -77425 138517 -237270 53613 -227470 77624 151157 -30133 14063 233774 -11138 196896
11686 80194 -308885 -178434 -22470 173038 -52480 187097 -28166 -35009 31771 19039 86735
11675 86735 163157 262569 143271 -32249 182947 87135 117028 -25505 -43359 -27468 -103059
11664 -103059 -73892 -186393 2042 -149500 -111172 -35232 -207070 -186972 -304272 -270763 -196608
11653 -196608 23501 -90135 -91566 204660 -168023 -69914 35411 -190139 223889 -317619 191873
11641 30783 7980 -22870 102637 -257621 -231349 -27505 56613 -144994 -53256 -131449 49203
11629 -43407 141614 -71983 76725 5261 17560 108766 -124836 273977 52478 -113443 148855
11617 -127395 -226600 -69147 58691 313746 -7700 37801 182460 -94138 -185558 -199201 -84845
11605 97573 -67406 -152490 110884 -254652 -292301 235315 -20498 286281 -130408 -19763 -45508
11594 -45508 -14924 425125 -203901 -82857 108014 113386 -389059 186154 419536 213065
11584 213065 118596 245183 49710 -142977 65337 302302 203855 202770 -240861 15760 192662
11573 192662 294632 -11470 226543 -226560 57190 -66559 122310 -190832 -82781 180969
11562 220382 61205 -53457 303461 134254 -62782 -281934 -8450 145138 -138932 -367988
11552 -367988 -78905 150954 128105 -318482 80455 -197944 -58055 493484 101440 -37394
11541 85837 87249 165042 82320 88645 19285 -153117 -210319 112044 -199311 -191349 -174177 161184
11528 260496 -232778 104370 217332 255310 105257 20663 164255 114722 73852 369594
11518 369594 81006 214175 13063 84067 152660 -234299 165600 -139839 123901 175978
11508 175978 -5498 40316 187927 98624 82134 307916 290739 82764 43945 111538 122295
11497 122295 -191666 -53565 137112 -44562 168433 137676 298664 -221698 165095 22405
11486 125123 219705 -113639 1554 194462 -98741 268626 -26394 138997 692298 106916
11475 95065 -114273 79844 36724 170734 -40825 503161 174271 88053 -171842 95813 -11697
11463 19341 -29687 438555 -46157 243694 236930 -63147 -97303 256610 -34564 -94654 -75557
11452 -75557 116668 120444 -54976 51898 12234 148620 88875 129159 263875 174130 71833
11440 279395 133159 48535 49046 135487 120219 299650 18145 122773 -34706 -58600 104582
11428 14681 -107741 -29324 231752 -242140 -76870 161227 12303 -46423 176764 149245 345496
11417 345496 -388831 -125891 78945 58648 -111640 -264735 250520 -101096 -180483 -194573
11407 -194573 52783 -258576 47202 -245183 215858 36579 162799 -76830 79948 -44781 37605
11395 -174210 255568 98786 132207 -54693 95025 -158758 35105 -247562 -250717 -186044 -44074
11383 -150613 -117839 -57701 -98357 -33772 -64508 -35526 -58222 -1601 315332 57132 -8965 -68529
11371 -68529 -121439 418336 122151 229801 -2646 -109266 121743 -412997 -106377 -400559
11361 -400559 -178555 145341 21454 -279168 -151208 -363715 -356313 84347 49667 -133991
11350 -79738 107000 -123864 -76411 -53881 -180553 -20722 -36516 68036 -182077 168361 113544
11339 113544 63038 85594 23022 185185 -125854 359142 27085 177607 -163723 -43751
11328 -253 290383 -147052 166755 -81646 944 -145501 16488 36542 166926 -74155 -32463
11316 336137 -52266 158513 29998 1270 -103184 90396 -276535 77725 64976 -96841 111717
11304 -122040 -35881 81487 -165204 -57277 -64617 -84721 45182 -149475 -278719 -219862 45570
11292 155283 -360785 316472 -104798 -126921 -97001 -26308 -23421 103879 36554 -158792 40166
11280 -587939 51676 -137585 245568 -285732 16388 21715 -30851 -300752 -151603 13872 -44501
11268 -55770 25897 -155867 -98846 92542 267633 36159 -143934 223815 24312 -13535 18106
11256 -372228 -61185 198228 -144421 -375358 18085 -280368 401 -26116 204321 -33481 -211553
11245 -211553 -83570 46056 -55020 -454797 -365593 -234686 -26093 -69734 -76712 -43137 -185858
11234 -185858 25861 172020 -68310 -93681 -443675 14153 -434414 -41000 203373 -33392 -236535
11223 -236535 23905 -343472 59418 38844 25418 -164826 95267 -178358 -245150 -180188 -276068
11212 -276068 108786 -157313 -135267 5102 -280072 -235135 -320100 270065 -79263 -340349 -366435
11201 -366435 86936 -311682 -198567 -71113 77139 -222769 -261607 -191053 -201734 -293 241268
11189 -236394 -114510 -285560 67070 -279070 -29845 -53656 -558 -88274 -216813 -165093 -38591
11177 93413 34815 -95255 -160206 -49531 -114261 -14125 8807 -180289 38990 -84019 -6691 -102229
11165 -102229 48895 75466 155204 44535 -206623 -159143 -122205 -44509 -267355 119970 -140578
11153 -16080 -327771 80339 425098 -168283 -234697 120484 -4002 -135467 -80206 -182923 -399661
11142 -399661 71446 19288 -17842 -28321 -392453 219893 -147323 282093 -82387 -5305 -222382
11131 -222382 161963 -144305 249768 175839 -167842 -159397 -3774 52680 -200668 126300 -19958
11119 87788 184997 -166546 -110743 -262827 38403 -157684 8347 -363146 16229 -22723 -67167
11108 -67167 36255 66314 140990 218685 167510 113857 -8150 353704 243914 12907 -87171
11096 -70286 56225 6889 20311 -13325 205182 373381 -40030 175423 3928 -136508 306341
11084 98108 -95206 303174 49892 -326249 228128 151179 82335 331942 264156 -175566 178664
11072 350516 197664 218014 161742 512539 65603 400031 137088 116950 279136 393793
11062 393793 233070 170344 265035 289575 221523 266259 385582 152411 345570 -22360 381159
11050 208240 702758 687139 388665 336799 346146 687545 262898 195406 570531 366270
11040 366270 279768 466512 168375 499384 731103 421683 405297 635667 565442 719612
11030 719612 341517 600131 401531 340208 450267 742160 520802 327267 26997 296578
11020 296578 327845 617062 370310 415458 533079 334789 269907 582173 342511 380087
11010 380087 226948 541175 268075 644919 540276 203418 247536 420910 577721 472481
11000 472481 423002 857705 437002 698726 569022 341545 440104 542648 363481 729357
10990 729357 105061 742029 419280 615673 295652 891316 554926 538624 457830 1104205
10980 1104205 460619 820700 567923 823152 675821 788884 1151031 1173861 1226953 1307171
10970 1307171 1502055 1468479 1809230 1653609 1648994 1982580 1690149 1816025 1308840 988422
10960 988422 1357708 1378390 1343788 1082773 971427 1172978 755812 1323751 892280 1167464
10950 1167464 983532 1140248 1010461 1052188 656646 654708 743030 521799 471408 448909
10940 448909 432447 192691 -90222 334055 -129661 -52207 348266 -29098 -76099 -107495 14802
10928 360946 -126157 -5405 6598 -139084 195015 -174061 -145344 -143253 122108 -137403 -10905
10916 63180 -147388 -91388 227663 -37576 26886 159215 -31869 101135 -59980 -122407 137048
10904 131705 236315 -201579 248726 -154019 -22819 47273 -119063 26489 -335061 34317
10893 -131056 -90759 -57717 -170972 6197 403114 130136 -147991 -215229 -73063 -112152 -175911
10882 -175911 20831 -8426 -99806 33086 -250638 -52778 108736 415893 -11620 17549 -162956
10870 36585 165902 -108331 -52861 146108 -1568 -34427 228229 -232560 -116650 -125134 -76400
10859 -76400 -173397 -159644 -13230 -87380 143720 208950 26061 -192109 -123045 -103926 -188801
10848 -188801 140976 -211391 -40244 -264912 -40540 -54246 -338048 -130682 -52277 109858
10837 69857 -136055 -128445 -144010 148642 -89290 -276962 -6733 -179765 -35697 -26173 -172184
10826 -172184 56842 212024 402003 -14598 -198178 -83156 383728 -133187 184304 -135835
10815 80416 -16079 252263 -247455 54940 -55982 244316 322981 -37953 -184662 -84972 -274111
10804 -274111 -399621 219887 164924 -47372 262127 164893 -110009 27808 182226 -358323
10793 175261 98117 -328384 272559 -152841 68201 -203459 61447 188216 -15312 71969
10782 -368652 42850 127490 -11543 -122448 60913 39326 -19166 -299366 -3114 -168269 -233035
10771 -233035 221109 291520 -170016 -209285 -158977 -200851 -13259 70370 2365 221054 -218544
10759 -84509 54326 -24400 -222647 198858 -140436 -5789 -212790 122898 -262014 -247947 -109740
10747 -103740 148184 252007 -105817 193049 -92701 -253803 -577497 341606 -125139 -134250
10737 -134250 -33524 18051 -24661 193651 -47065 319340 337173 -117962 60539 88427 -198650
10725 -260037 72479 -276944 -140531 -143888 -386784 -24422 -205000 340085 -105666 -43199
10714 -43904 -37575 -19321 -114293 54991 249804 -284226 21814 -5068 106053 82620 -115479
10702 -183735 28955 -69270 -170644 13899 -228623 31982 -405458 -206260 -40572 -205134
10692 -205134 -156203 164855 142953 -78544 -189836 -279789 -132823 14155 -3726 -230253 -142633
10681 -142633 19373 205977 53565 -175426 -30312 73616 140275 -351520 103233 205513
10671 205513 -282027 6977 -115413 29729 10434 -186292 165438 68709 -44560 -140018 -40751
10659 299095 51939 -179548 188805 39748 -102718 -366088 -130892 -168384 -86674 15374
10648 172274 -339100 -40167 -289839 -61979 -20307 86166 37715 310795 244135 -119246 -19964
10636 -229995 -138224 -178428 -166257 -108326 -305227 -144557 -169748 -5103 -42141 193960 227731
10625 227731 107519 -312321 109493 -78724 121261 -66389 -88833 -99525 -522767 159089
10614 -6786 11209 -138506 69056 -167765 264520 164329 38433 -224725 249370 -18394 -80529
10603 -80529 -66518 182051 60963 -45214 48424 -575 -91060 -117391 -11941 18153 -71651 1860
10590 -39849 -169856 68291 39415 262313 -67391 -137839 -106484 125789 132480 87739 132756
10579 132756 121239 -56333 79073 15339 175089 -45300 235660 -120690 -94013 -73314 24436
10567 -161323 10724 -140651 -171467 -524423 91621 -59415 -53756 -231851 212107 -6885 12836
10555 18754 -4771 107732 -296655 -62701 201092 45839 -20526 -186446 -58221 372019 -170926
10543 315430 208565 23492 -48516 -92767 86707 -52747 21051 -135218 -252523 -157450 -139226
10532 -139226 171393 175148 -93670 -71578 -136457 -620093 -74694 -106637 76527 -145241 -40382
10520 -911 2555 253860 93493 12487 -418401 -95436 76456 53413 122221 52840 -272543 -262122
10508 -262122 200681 312503 -349162 -283367 133724 84612 -121325 122443 108582 -1500
10497 64479 34445 -270211 -109970 -144500 176735 -40231 -60349 187363 -74191 93281 127773
10486 127773 -98550 -257971 245429 128594 88319 225712 -216320 164481 13857 302189
10476 302189 616336 483280 278213 -23050 99762 93209 -148461 20048 -131801 -162405 -233805
10465 -233805 -56946 -339393 48791 -305421 -145536 51403 -3898 -356925 92574 182624 -283416
10453 88491 15082 -204995 -230292 -44128 8503 -32734 -150892 239407 220675 40345 -443691
10441 46129 -22555 325294 -139341 -204110 -181588 -27945 -104903 110745 -89271 335072 -19192
10429 150615 52460 -87429 -256219 -15873 -118163 19205 89928 161244 -157894 -94269 -6454
10417 -47616 -179219 -109985 -90107 199055 -151141 -399769 53663 57950 50989 -14305 28418
10405 -273740 -444311 -18937 331550 -73463 350998 -182544 95694 218331 266306 89564
10394 -378887 -2160 103054 -56257 -202511 145373 -80432 161210 253452 14816 218014 71401
10382 -97550 76465 -12431 -119972 263051 -124527 -38273 42049 119435 171366 -35994 129787
10370 76665 216161 55267 149988 217656 236315 270358 -106638 90330 171164 91172 498773
10359 498773 112907 -50215 250237 74292 -23049 -66032 220295 13619 143477 -291929
10348 204355 12611 304642 401424 300483 76249 363867 97639 232431 102038 495125
10338 495125 209140 64892 307074 125606 3640 91452 298703 -93649 -97787 21824 -27849
10326 28069 -38545 107472 294561 -124582 121866 107057 -193842 145490 390342 172432
10315 422729 254175 -83819 76835 -41573 72188 555826 310504 93860 -79810 88052 245877
10304 245877 8085 118965 3596 209273 12319 2764 -78989 130221 315528 -75971 48624
10292 -75234 -385779 19192 120775 -230860 -69879 191061 153720 304176 -39324 -242900
10282 -242900 8390 118592 -370137 88153 212657 -157688 -336243 -221527 -41494 -35679 33352
10270 72236 25932 39806 -35106 63693 -79869 -31814 -57550 -431718 42470 -130120 219691
10258 -173835 52031 9370 137816 54174 -38872 -274118 532797 94102 -101909 -40005 130097
10246 228613 -104852 -115864 60525 111566 -194486 113337 117444 -355915 55044 -343518 -220009
10235 -220009 -17499 -14110 -78312 69105 -315475 248568 -116472 10910 -1688 -159379 -185088
10224 -185088 -9386 345536 -208822 -265493 -105662 -456060 233880 -280206 -301286 126785
10213 -328835 -151053 -4496 177878 -136660 127470 57498 110685 -50839 -180052 -118974 33923
10201 259930 33417 -80453 -165456 -81304 38346 -159733 17793 -33110 5277 -302660 -163944
10190 -163944 -334957 -150212 -152833 174593 -302534 210790 54182 333033 -440998 349012
10179 122080 194641 -299822 -249327 237525 57631 13209 315199 267583 -283159 -224730 79477
10167 85431 -213469 178004 -72297 -161022 83048 -154742 -25101 -78922 -120667 -278482 -3386
10155 -113628 -166869 -176223 -233053 77856 -146680 38598 -19432 58809 3216 -244893 -177284
10144 -177284 -195772 -147317 72983 -126757 127382 -272385 38136 216726 -172182 252602
10133 -48380 93068 -24473 589 -307806 -258700 -57946 111961 75737 -51638 202209 -296978
10121 -59327 64738 -154706 -112839 -275910 -252223 86810 41058 153018 -59141 -269986 10128
10109 32054 23770 19800 235000 -243216 147904 -98625 108143 83475 223931 -71314 -62472
10098 -62472 -117322 -240027 318954 -2670 69416 -87257 124870 72540 147050 -105652 37267
10086 168759 218567 132453 -148247 -365655 -246203 204285 -341107 124126 -14947 -163047
10076 -163047 -225847 192773 -416508 -86733 58830 -75338 -118149 -67548 31583 -451667 159556
10064 -64332 64748 -7045 21588 552 -97942 118597 -164985 275567 -62017 -3404 -48504 -106592
10052 -106592 -258361 -41130 -235075 -415273 -126326 -13950 36963 -421674 -86630 90749
10041 28600 180074 -66760 -87576 19876 -99549 61723 -96945 -273177 -67291 103010 34339
10029 -299328 105011 17772 123080 -54926 -314758 -394918 51030 -68756 325035 -123492
10018 129728 86291 146532 -142074 121947 -132477 66656 -200945 -91879 -3686 -152001 -270957
10007 -270957 160269 -86344 -15801 -155759 -283396 -214733 -70589 -218364 87881 -165213
9996 -352681 -95288 -83055 35589 -377480 -64662 -614118 -110789 -108425 -134462 198847 110490
9985 110490 11174 -34353 129088 -87921 -57138 55538 -17630 23833 -125378 -267445 -234023
9974 -234023 -107929 259589 -154477 81651 -77205 160647 127837 -90708 -317128 167149
9963 1698 -231230 -142176 -128415 229722 -67315 -285239 -73444 109217 280761 -36031 -228402
9952 -228402 34449 -27597 33014 31205 116234 -125386 -154414 -41255 207780 -55675 -93971
9941 -93971 682 -82942 -124692 -15811 -171015 -141048 -161411 -11725 12067 6454 -68129 -435140
9929 -435140 155638 231014 247808 58313 -66138 -155595 -265139 -76876 85962 74354 -16213
9917 101225 -5082 96002 -83942 45277 32931 196365 -97288 -162070 119959 -362115 -118417
9905 86802 378717 -148048 -8577 -87972 -269121 -75472 50291 -72041 -99846 -25800 -426473
9894 -426473 150365 37495 -41812 96532 387415 -261310 -208840 -22813 2321 -238678 -83019
9882 118103 90538 -410441 318643 153058 52150 126728 -101000 209096 -73587 110653
9871 142744 -190838 -227762 -93928 30086 26726 -143050 -109823 -379323 -263171 265541 62662
9859 -197176 100617 -131988 114402 13253 -19334 -240184 49162 -36319 -220846 -268557 -152511
9848 -152511 -60804 -361126 -230515 102921 -201787 24136 -26405 -129478 -525589 -420157
9838 -420157 173334 -279736 -154345 9996 -91851 -193921 -158569 29825 -82501 78380 -4804
9826 126069 13350 169317 20869 -152870 -366264 -138989 -104422 40791 390488 -60659 -54041
9815 -54041 142132 -20329 -246076 -252849 134893 -119558 101893 -368939 -201071 90932 -41678
9803 -123974 -307782 -57365 -87808 104752 -63074 165300 -46202 -44622 19377 -33750 -119663
9792 -119663 67350 -4413 160321 -153366 80939 -229019 196436 -367041 -270163 103285 -76245
9780 90732 -247705 -207989 -92140 75365 -2256 -133009 -202853 294401 -6576 33562 -294430
9768 10869 -259928 60244 -198964 149756 166973 -169068 -58501 -3221 88613 -409729 -9350
9756 150213 -104061 -365469 56496 -72550 -438264 332801 -173890 -57931 26958 68099 -250935
9744 5133 341845 454991 190220 -59596 28511 145416 -146999 -89442 120007 -196718 -225225
9733 -225225 3591 53741 -349085 -124984 -47898 -98264 -784 -6440 -190545 -55494 208121 -268687
9720 -235679 -362565 -417940 -231256 286030 -279605 -129543 -266954 61938 -18569 31384
9709 52855 -84981 11838 -271073 14554 12020 -155401 -329477 22593 -206026 264230 -76392
9697 -55786 -68616 -19196 213538 45214 -10479 -200937 -27636 -95796 44077 -76628 -36826
9685 -16540 21766 -78428 62086 -81602 -19982 -9459 -385233 -84172 -331507 -62457 -27959 -135010
9673 -135010 -126936 147302 115390 -80555 123170 187637 -441648 91897 -16280 85588 -106943
9661 1066 -35991 -60485 -30838 -125152 254634 -58528 131354 352897 -263344 -326059 70874
9649 -147822 -101827 3757 -38745 -55927 -211477 150033 -176979 -285419 89498 348047 23106
9637 135480 99725 -233366 -268227 -340041 -183762 -62817 -256523 295807 -451502 -312470
9627 -312470 -30746 -191745 -217787 47308 -144408 -41933 -139434 33737 96047 -202147 -19237
9615 -264114 188703 -72829 -48981 68603 136884 119704 -111890 77279 -30244 169973 -117787
9603 -30281 58045 -147286 216881 -238223 -100082 -58363 -210313 23547 138783 -2423 333959
9591 -239849 49549 -308203 -242424 209228 -236092 -362761 110476 -218031 -198489 -355865
9581 -355865 -62365 -114355 -33208 -85485 -60356 119365 -186664 158294 -166088 2425 -167178
9569 -2647 27223 -139701 -97748 71614 -39112 -75163 167680 -262555 -24551 94574 -205123
9557 -153445 8250 127648 -101468 272 240539 -104316 -16900 -190446 -233667 -202261 42751
9545 -212200 -157584 -72589 124029 82200 53034 58646 177758 7138 162919 -219524 -28323
9533 -186691 -86518 -220599 -6304 -116033 -96831 -281446 -338003 -86953 121402 -91749 26167
9521 -201896 210865 -88479 22683 -2736 -59918 364126 -141420 29092 106461 -14486 -288393
9510 -288393 -80062 145683 -176151 -137921 199835 19921 48859 -201243 -298181 121894 111167
9499 111167 -121802 -105754 380097 252409 349017 -28465 40328 -291727 -225459 243503 22788
9487 -103916 126493 96592 -50222 -130725 207918 235325 397186 2274 -30836 -30213 -104553 -140054
9475 -140054 -151544 57141 -231667 199139 78830 -146390 -327600 1599 -217658 -184761 -263493
9464 -263493 -63438 5171 15929 191978 -128157 98013 -195151 -96771 58289 -44364 -242177
9453 -242177 93720 -100975 274958 141002 -107902 -52525 595669 183129 -315932 -7708
9442 -213279 102860 -117042 -274697 -207019 -145616 -98112 43948 -92533 89171 -73370 -124022
9431 -124022 -150074 -48849 -294225 4508 276916 239438 -151696 63609 -346845 -121997 38443
9419 -29563 11128 -434845 99025 3280 149648 65635 -141048 -150878 -46371 -111751 81152 52713
9407 52713 -4414 -141788 68163 -25742 -98478 227590 -366737 406303 -245654 -74068 36431
9395 151299 -93405 -52625 -360462 -628 153343 106985 105080 154560 14758 -54631 -137957 -76645
9383 -76645 30882 -340375 -229139 55460 214146 -35607 15475 -258591 166028 -173212 44637
9371 -361894 -404709 65656 -179403 63740 -105318 -242661 18514 46196 35425 -81594 -4085
9359 38277 51958 -91398 124233 -11091 116342 -56270 28740 -371684 -71612 76251 -125826
9347 -113650 -206069 36970 204122 83940 -133546 91528 -131152 41584 53830 -104118 -51550
9335 -224230 -317131 75346 -234311 -96139 174067 -242597 -259880 -287911 117882 -21737 -262750
9324 -262750 -157956 -196264 -48938 18499 -120982 40061 160305 -215036 52808 -184180 -23207
9312 -41776 265982 156496 -264784 96150 -313641 -165197 -50797 29032 24619 -549577 -215110
9300 -225366 106014 429085 -46851 -62037 -259427 83615 -240768 -205452 -59258 -62854 -49170
9289 -49170 64198 276611 -91778 116595 -420834 74807 -39770 156388 16409 -8630 -219213
9278 -219213 -42021 184489 87551 49016 -51383 76479 52095 -158180 73930 -154504 -228144
9267 -228144 -24906 -234469 -79321 134702 84880 -60099 -22149 -177006 -205091 94675 -234665
9255 -22687 166038 123609 -171772 307748 -42000 -125814 -89251 85799 -170169 -166221 152987
9243 -45015 30294 -285355 257564 -162489 101787 289950 -388098 -228980 -289554 154709
9232 17219 -19864 -186815 98199 -92303 -10588 -7260 -227733 78147 -160153 -51353 -8450 -37078
9220 -37078 -18765 -68726 -346399 17118 271074 5976 -79975 -2932 -9609 -105009 163794 -147952
9207 -149113 90836 -120683 198930 -176442 89826 -256446 -58519 -197709 27578 -35002 2764
9195 -254741 -120418 223825 -171489 -10676 210295 128673 -210572 -185653 45662 -73967 -163565
9184 -163565 120817 -140055 -41614 -61116 -255585 -176627 225599 58572 -21296 -331091 79096
9172 264556 -41589 -61990 -144546 -132692 111266 -77994 70518 17795 -3320 -270984 -57525
9160 217980 -14747 -36319 -77022 481 -266321 -115237 83344 47257 -143841 -15127 -264 -2324
9148 -2324 -292748 -77992 -535 -348630 -351039 -7693 -182971 -461371 23837 -331100 147155 -4693
9135 96347 -120633 -638236 152168 -58069 67640 -349002 -105627 29431 145023 -86544 -319263
9124 -319263 138057 -64993 8377 -530917 -222230 41104 36379 16054 142187 66377 112932
9113 112932 58803 -17271 -63144 -94045 159681 -198958 8775 -100006 8455 204723 -74938
9101 -168928 -366518 -348417 140367 -195474 -257790 77613 -202853 -164135 -91323 -450418 48954
9089 -261554 1266 -142109 -427007 -180463 136888 -121174 38505 -435270 164997 -145919
9078 104099 -219368 12449 402325 -133295 -232322 -214172 -427068 177898 105876 195122 13949
9066 4866 105888 -156265 -127483 52686 -241315 -79278 21518 -95935 -112431 -371013 190077
9054 -41105 26940 -66580 -132462 -159236 12393 178575 132276 161870 -33041 -275639 -206464
9043 -206464 102452 -29604 166408 55194 -192133 121857 -171337 6571 44166 -67506 -196087
9032 -196087 -99663 123547 24469 -23470 -166085 54216 -273675 -119370 -115008 63173 -72983
9020 -52906 34094 -184855 57372 -55582 -65712 -114915 -258878 -26145 -185372 55839 -268579
9008 -189700 -169247 -296470 -144388 -81312 -121077 59069 -381663 28852 -208783 476713 140253
8996 -115609 -220870 -228330 -154001 53943 -104281 129639 31868 -229680 -227790 95941 50938
8985 50938 -346811 15007 -302174 -194269 -193006 159705 15965 -246719 32628 2687 -122018
8973 -207322 14119 -47529 157831 128241 -64666 -213159 47995 -196997 77831 72126 248752
8962 248752 48461 -186517 203223 -171478 -28257 -124406 -23378 -157194 -541687 22713 -149528
8950 -187846 -462996 -10899 -86127 206393 -213444 105415 -149401 -131393 -21733 -23728 -109144
8939 -109144 96289 -71307 32390 44915 125059 -89539 -36566 -48747 64137 44909 -105216
8927 261324 118499 -2393 -135122 -218191 -428629 316485 267875 56480 987417 894871 433867
8915 348385 193482 -259063 -135512 21636 -154706 146891 -10219 -87512 -459947 -458904 158405
8903 -153045 127670 -128313 -251417 -171552 181030 139349 53005 46278 -102417 93706 202607
8892 202607 -100337 -29841 -447473 89462 170130 -18141 62877 -261809 -136207 -48856 -77126
8881 -77126 -91544 259135 -245824 -7411 -21012 -268102 81002 -153718 -20201 121387 -15703
8869 51208 -311586 -33159 38586 -80228 -424917 -229240 447888 -73017 -69884 43139 25646
8858 25646 -208191 -329699 -10865 -50525 -140902 101812 -167965 198499 -85088 278712 -319756
8846 -262392 74853 -176000 -120366 -106122 63055 -160838 67486 -100986 -177347 -276885 -203508
8835 -203508 -228425 -63750 -42798 -40178 -6111 34005 -24199 -266501 20407 17002 -223038 -145616
8823 -145616 -210743 -201113 65714 88464 -123409 -202532 -286165 358507 126738 -88598 -161650
8812 -161650 66792 -121486 -65602 239946 -124736 -3093 226774 -155997 20365 308628 68056
8800 196257 40992 -296947 9542 -64270 108142 -16402 108782 74820 4580 214286 229775
8789 229775 -60551 -93899 -16957 -167615 -239215 -23606 -220214 -283070 -87332 -123280 -93987
8778 -93987 81503 134487 -41497 31836 -34685 87975 -193817 -60220 312429 31666 -175596
8766 -130827 -658867 -363238 55681 102238 -97425 -109614 77166 -411090 -132514 -60545 12581
8754 -47419 141586 -63570 43355 164128 109669 33941 -33365 -111775 -42735 -6712 -518232
8743 -518232 -310172 294282 136585 -291570 -52463 230326 -105758 71941 -224822 169410
8732 259164 71664 219796 -8559 -290533 21942 -189732 -1188 17080 4542 -111144 44953
8720 -40105 -82312 191038 -85770 -229106 -93630 93041 24764 -73735 -308476 -23029 77806
8708 -106640 -334637 24806 -135815 104552 -118771 -124578 -248454 -27738 234629 -180823
8697 49824 16148 -93227 253379 -33381 84709 -11835 -350869 86917 -109838 106654 20936
8685 -303072 -211625 -155549 4277 -159861 409278 -317564 126659 -70206 -108629 -36597 -279317
8674 -279317 -144548 234218 -199831 -135376 159575 41008 48141 7376 195870 -47953 -68026
8663 -68026 -127105 -264278 -124573 -101158 -8485 158807 227333 -77045 -276126 107887 142433
8652 142433 275027 111109 -182272 -262733 -77891 198136 -72841 -76724 25348 -17649 18414
8640 137319 -57342 -224380 -149170 -113045 -199017 -119542 -21222 2402 109988 84996 -233282
8628 -102227 -370416 -32107 -126137 89787 -200147 34246 -25219 -206163 -108165 -51661 -126233
8617 -126233 -100089 -332655 -135018 167131 3813 26102 -132953 126206 -32619 55602 139889
8606 139889 67120 324799 -55443 109175 -185118 135435 -281194 -199630 81046 86570 -215646
8594 24445 296162 -359906 114546 397963 -216493 -194455 -119865 6455 40564 -83772 -113500
8583 -113500 -357807 160414 95773 116533 -69656 -22777 83079 360345 -946 49668 101050
8572 101050 58590 -11620 -108329 -270488 -54110 -258639 -155055 -101505 -387942 -15248 8176
8560 -161085 -96051 -292339 -102679 -121764 162611 88731 -95272 -50945 11810 -50231 -46372
8549 -46372 -97087 -89737 -179040 -43411 -300337 -8653 -50368 17585 170080 -236645 158997
8537 51409 -117550 -59439 -50413 222553 -58075 88852 30534 -68335 -367279 -70884 3420 318377
8525 318377 26652 -221653 -195243 -71293 151365 -36914 -205905 -17909 161620 56156 25330
8513 -77002 -187683 -214461 -193701 -294510 63998 40145 58937 77446 -15474 -249461 -412033
8502 -412033 -49386 35923 -15216 -163930 200311 873 -116388 -530 -238454 -27790 -126425 -23106
8489 -186855 205559 40803 111693 -78412 32753 -251351 -191311 -163618 21989 -39060 -36899
8478 -36899 72846 128199 228658 -156179 -62049 -100744 -127895 -70252 -104310 273979 218423
8467 218423 131122 -43097 -15781 52335 131497 -218588 55245 40688 -246970 -111257 -53452
8455 103846 32285 -81788 -233231 55523 168519 -218899 34033 247232 -58713 -251631 82102
8443 74696 -11639 76163 -16497 263488 -57926 -68576 237465 62757 103362 33059 16341
8431 -64152 359990 -76482 92507 114019 9969 31609 -207815 -1226 -107994 164154 155454 64530
8418 -131496 -211131 -56531 8641 9673 -159992 -183546 -204085 -324001 13273 267003 404879
8407 404879 -287728 -78470 90770 291917 -344901 110519 -15387 -29077 68162 191164 28997
8395 191830 -129369 -6601 -190955 -301380 14557 -265807 -78452 -82607 -9940 250794 35092
8383 15242 -2611 63585 -290824 -49842 203972 -365128 -120607 198959 -38729 36522 139554
8372 139554 -12000 -56851 -117229 -180603 -201938 -212351 -173228 -56642 -274406 -130798 -56830
8360 -129607 -107101 -341770 267215 -164208 -217473 46166 -234895 -145865 -210823 55551 16432
8348 -1146 88706 45446 35414 -144649 -136971 -20046 -169828 196795 198685 -2264 -134174 -436328
8336 -436328 -46253 -25940 392926 -136187 -130227 -193484 -74752 -5682 -171880 -231347 -111645
8324 224605 207897 -205167 69316 41976 -20472 -91361 16025 -13576 -86427 -387725 -117519
8312 -235243 -361986 62337 -88434 2244 -38143 113795 102688 -411167 -165517 423280 -71009
8300 75487 -255361 315335 -16668 182368 -197231 183187 -43150 169339 -153155 8117 -228658
8288 287181 -337287 144973 20553 -144241 116415 90158 -242012 -194520 57665 -113622
8277 236166 72540 -33958 -239286 132010 74327 167382 -174100 -15561 38162 197417 -57215
8265 -203211 11769 -236260 -19273 120367 -343860 -55471 222070 -245697 -395589 -255571
8255 -255571 29909 -110417 324192 220338 326568 -80233 62778 -203567 -108741 -207468 -109497
8244 -109497 -159004 -276049 246021 163010 -218052 -133657 -148731 293957 46305 24607 -97792
8232 132657 -242108 360526 89640 7522 200422 -128718 -32410 -40287 -168428 -72637 -231610
8221 -231610 97568 89478 -17554 229901 -233098 103333 -10208 343 75372 -43953 -66421 -126774
8209 -126774 -247872 150205 -21166 -26741 -120988 -113691 -232706 -261121 -162933 -26384 -3669 -63970
8197 -63970 -112776 -44045 114758 -286717 -4352 -167621 -74697 -126765 -164326 -33602 -5825 41909
8184 232998 12905 -90658 1343 40905 -55272 -178807 -50009 39074 185807 -192552 -194503
8173 -194503 -91627 20281 -234532 14771 125003 -193997 -113389 -122276 -68650 -261181 -26615
8161 40997 100736 -137588 -196889 -4047 56487 163520 -70669 -198956 -3400 114831 -193082
8149 -129883 128746 -80681 -79492 41125 42910 143875 -78928 150918 -96961 59293 60970 -364606
8136 56483 -87258 -339418 23705 -92058 19362 -4646 88430 62357 98698 -65709 264374 44885
8123 -88911 -232068 49426 -184673 -109300 215290 -76278 -151453 153907 266408 -176455 59435
8111 -46948 -362268 169652 -105319 119698 81977 -208963 140278 -38670 229744 -99933
8100 -120978 -200216 20993 28005 15671 -276793 -44237 -58802 -134892 -58551 -93630 196589
8088 55223 194521 -36435 -153016 -277671 -136171 -44936 -380509 84415 -143827 64710 189070
8077 189070 257168 -68785 73146 20682 331425 -89302 38680 20269 -153605 34642 -282757
8065 -158585 43371 -61009 -152968 -29434 -62746 128335 -142259 -136934 -120473 -103203 -219691
8054 -219691 -47137 15884 190439 -28152 97708 -331747 22861 319434 12986 7508 -346744
8042 -6900 -168010 -84011 -418505 138708 -4061 176338 -73475 29192 -231035 13351 -531 -31990
8030 -31990 102808 -31109 -70174 -213731 368148 246931 295898 5346 -243413 210238 -228675
8018 -171674 -341366 101920 -107809 -52650 221395 -45019 -129624 -208994 212961 -117571
8007 -47372 42034 244581 -90744 -183594 209370 -17900 -446975 107523 220891 -99483 -152919
7996 -152919 -390662 -111469 -24140 -333577 -67485 -166130 -77944 102855 -190119 -69898 -265549
7985 -265549 -111915 -178791 -54515 51060 -316597 -11543 -19232 -91907 10743 112778 94789
7974 94789 -18174 -152035 -261148 145409 149710 -108307 6350 -217889 -32605 -45805 288107
7962 -35900 183046 -134359 -100780 -120964 -315680 -114705 30409 152055 100004 -151709 -26867
7950 -322477 592568 -290302 -221985 -69707 68538 120892 118206 149094 -9755 -350302 64748
7938 -93525 251170 -106967 -99309 -317072 15943 -118758 -107480 -104865 -37242 -155471 -93768
7927 -93768 -234800 142766 -59879 247830 73335 401196 45858 -456627 -258036 105186
7916 21080 -70066 -115771 108103 -232978 49268 -243051 40915 -109391 -79558 -204297 113667
7904 -169499 96238 -58649 73996 -24234 168741 300169 -53102 -249594 -210259 -58527 -235371
7893 -235371 -93317 -53697 377853 79617 163734 60183 101519 420277 -128937 -129291 119453
7881 -93378 3391 5187 92855 177086 107961 35066 35432 31697 -140239 -43903 -32095 -81065 -49910
7868 -49910 194745 -160014 65633 -191418 250247 113180 -8411 -87605 -289058 25812 -136892
7856 225094 153692 67381 62390 134435 -112524 -79921 131624 -120772 -114304 143951 -541629
7844 -120859 -19155 198327 70665 -86865 -1219 -112998 263329 -261318 284478 -196533 -75270
7832 -141371 -187330 -225005 -193377 -193745 -172187 326388 74025 138869 94286 123413 383429 117557
7819 -97346 -22093 123175 126596 249806 -549973 86036 147323 -19176 -145505 -144711 -156980 -160533
7807 -160533 92102 -201906 -36632 60323 223156 -203075 216434 -89574 388709 -24022 2217
7795 13065 17969 -254026 63396 -153837 47701 45079 163733 30798 -55308 -129916 -171515 -133770
7783 -133770 -203549 -162632 188988 -210622 -181270 -219229 -214433 -180256 13196 201228 -258269
7771 -156452 -313347 -117668 -197004 70097 -326440 16954 -61264 -68316 -182282 -230812 -73053
7759 -177103 -111350 -15755 -18938 200047 -70676 23622 -22527 -32420 37783 279458 -179999
7747 -107255 -175346 -96603 232274 155316 -67311 -428242 83823 -49922 -259862 -108802 -2489
7735 72366 61142 132295 199808 -383130 141123 -60137 -973 -30334 -54984 -120173 -203266 132143
7722 -80123 -299900 121227 213985 180385 -175106 -9456 341091 -397173 -104703 213010 81383
7710 190946 -334022 79252 -147886 129754 -75804 -16726 -34902 89032 47969 -55036 -141085
7699 -141085 70456 -206177 -367795 -146964 -159506 -163676 38502 -44677 147908 -110269 56470
7687 85236 -61997 281 246974 89602 -180264 -6091 227853 58275 30247 61272 -118963 -110010
7675 -110010 -85538 175510 91412 -304696 35192 -365774 184670 108815 102403 -254942 122029
7663 47543 -197197 20201 -126568 98613 -96561 282749 294722 151090 45838 214077 128330
7652 128330 61540 -506659 -186124 -94310 -226852 -187346 -28853 181064 24544 -167374 120284
7640 -312227 -129115 -84540 -30658 -134486 -250285 174195 117545 37079 -70437 17321 -204425
7628 -167464 -84445 -232123 -472481 -114634 211962 -169444 -263030 -22767 -15811 -234248 -105544
7616 -34763 -75025 -129897 -247714 134307 16518 88269 -163035 -249966 183111 244434 118142
7604 -332968 75125 -65051 31660 -122005 89503 3294 -69591 141117 -333527 -165497 128033
7592 -302706 149749 -18090 -290280 80406 162581 -185412 -29256 -225972 67332 42389 -207714
7580 -30458 122925 -123542 -8382 20976 129989 125448 -280034 -227822 -255088 170381 25475
7568 121938 304660 -95356 53327 -80975 182594 -315145 -334346 -4213 -207874 -252042 -89762
7556 -28868 97471 -53625 -309275 -17869 207568 -224528 18404 -60788 -5444 66794 246512
7545 246512 145624 361743 11480 -316642 -242429 -161559 -236037 -124858 33587 -203730 120707
7533 83593 186270 -20017 13460 332969 -278849 -12735 68635 49261 35994 -194026 8077
7521 -116363 -102327 -84477 -68085 83140 -41969 178837 46109 -229422 -25485 140915 265554
7510 265554 5496 19726 -41444 152214 -6344 -59420 18926 6660 168594 257505 -27660 281604
7497 91434 86436 -181096 -103647 -16468 -123448 -19126 49316 56695 -204359 -282587 -205075 161801
7484 -72024 -216621 -196169 -184289 -89003 136096 72822 133504 7502 334104 68266 63724 149113
7472 149113 126964 47660 -126973 -51471 -109697 169812 182871 -86038 -107428 -86166 -152674
7461 -152674 -81466 -44443 92112 -123836 86725 -140532 -62870 -124066 -280280 -258155 -50489
7449 194383 -96603 20586 149527 -45334 -17338 -64072 167229 319691 -26486 35347 -17235
7437 8068 -153293 272951 75806 -59363 101490 59118 333066 200338 337194 -250695 -13202
7425 -400617 150042 19229 175768 -333142 36193 -330645 139899 -223690 113125 -108814
7414 -74535 -165347 -271212 -200705 -234422 208392 -123242 100687 -49390 -243362 -210893 -224063
7403 -224063 -217262 -197240 -43505 184435 18104 -141142 93194 -236591 -134519 -4170 -121955
7392 -121955 -281113 -199418 -7642 -164896 -90490 -220785 -75429 -30568 -10403 -59906 -38868
7381 -38868 59559 -176841 -484261 -224224 -289368 -278899 -182767 -63935 -302557 88285 -132992
7369 -66946 -89135 181651 -135914 -97362 94799 -58879 -41212 6206 -161054 111616 -97913
7357 -203404 -161469 -36046 -298806 -169310 -76301 -73962 8841 -121855 24249 87727 207938
7346 207938 -170180 -116042 -36264 -273489 -68893 93461 23971 -81479 60476 -110235 46466
7334 -326471 -14187 247712 64281 -70447 5334 -6668 -238254 -49365 -230565 326177 203450
7323 203450 -114315 -99983 -300634 246929 -176250 -121156 -78613 -124457 17686 -16633 -242436
7312 -242436 215058 216177 -15727 -41061 -12452 91696 131164 -38170 37325 -156314 -178910
7301 -178910 160613 -301369 213552 155403 52078 -39490 -230575 -53009 -73187 -99393 304959
7289 21068 68645 -266025 86185 138619 -43200 184746 143698 336711 -101098 -95168 116616
7277 -6985 -297719 85049 69477 410679 -127158 -87775 -84331 60041 433456 197337 -255145
7265 -142427 -24627 -41574 -284027 -22447 76902 16740 88878 2522 -317646 265699 117044
7253 -288414 160054 38541 -22817 357687 -101878 77958 -72512 47019 -238781 -114430 -166220
7242 -166220 31722 -351347 -168301 -270812 306933 26661 326325 -61690 -148403 -176923 90042
7230 -241089 -17776 -131338 -83374 68192 239785 -107517 -96324 -185462 -192864 27528 330399
7219 330399 224539 -88437 99560 -17331 11698 -158314 285190 -127916 87407 131091 102274
7208 102274 266046 -151126 -56569 38000 76078 -77796 -99380 -175527 30143 -109528 -151646
7197 -151646 121445 -250747 -55092 66462 -30243 55202 100481 -120669 47278 -222263 -97427
7185 26125 207852 74293 -94793 47695 -257361 87607 37548 168751 -16927 -107356 -123206
7174 -123206 65076 -197112 -129583 173039 -146144 -168219 25020 -377424 211741 -275102
7163 -54966 -142017 -133527 94357 190803 141683 -113578 74808 245021 -138849 107257 -61175
7151 -189359 87023 405912 -60540 254686 89140 -73207 -220302 369082 152136 -154334
7140 -109319 -80767 -232767 35588 95959 95222 4163 154654 58469 -200270 14444 -34658 -97333
7128 -97333 2909 -78627 86666 -38972 51233 -161449 -140036 -2445 426852 -315496 -166317
7117 -166317 -52525 -100157 189673 -347830 191922 -347 -6803 -230821 -150474 -20763 -38875
7106 -38875 37379 271899 217241 -87784 171950 -240388 303907 -15169 -151697 -113106 -14029
7094 -194819 -116807 202260 -47183 -115784 27523 -96734 -315496 63704 67036 -240360 -210602
7083 -210602 17371 16048 -98772 -192703 -107874 -77617 239593 67986 36754 -71672 150360
7071 137673 -82143 218918 270711 181829 21463 -208908 -273059 -109688 52138 -206049 164094
7059 -187155 177934 -234601 22685 -196021 -30539 -9765 -132878 -154262 151890 70252 365530
7048 365530 43251 -107780 -48667 -179778 126223 -130471 -261715 75084 307735 -45367
7037 -49751 193746 -237606 103484 -36070 -76893 -408351 -222468 23699 105663 -97961 -143395
7026 -143395 -397146 -13397 313757 -281398 32230 -211656 -328 32644 -41584 -184607 199043
7014 -48786 107773 -192703 10894 -89070 162658 -176343 -93173 -414123 185955 -284219
7003 -19117 -13669 -82578 -124726 -225170 155188 194847 4257 -74094 -116375 280093 8183 -86038
6990 -121240 51150 -41177 337009 -116659 25124 -139095 -348402 124417 -16106 -37914 114536
6978 -95289 -43506 67117 212527 -7105 132138 -64033 -115623 2205 -172098 -227451 57776 97699
6966 97699 270137 -177374 38047 48760 136839 119668 -242715 -50120 -180578 -334761 -123311
6954 -7815 176321 -75959 -8938 90915 -74554 84465 77977 94000 -197825 -124134 64495 -145363
6941 -429304 -175152 -209026 -462641 112766 -70922 -448828 -243737 -147217 71873 68489 44358
6930 44358 -147167 -158294 -40225 -127185 -35041 -42156 -137790 111715 -124236 -37880 -20978
6919 -20978 -29697 151524 221616 -86635 82141 -73736 -390332 -106112 -51602 111894 -1804
6907 -189797 -102982 330719 116526 -245240 14230 101475 189479 -215278 -179132 -111542 294633
6895 86581 -59249 85604 131710 -320465 139132 95994 -27796 -51884 -131927 -295778 -137069
6883 -251532 -4031 240539 130702 -173242 111668 21043 -73612 -151948 -253292 145309 142588
6872 142588 137946 -1337 143863 273802 -140660 -155476 -279249 50919 127315 -254843 -444366
6861 -444366 -236148 182836 20284 195909 -192815 111783 -104829 -190593 53925 2622 90560
6850 90560 80116 -138119 -38112 -57808 103089 55974 -180882 -72237 -8086 65585 -25191
6838 -11903 -72468 -182392 -22537 18996 -297643 256080 -285900 34017 -126745 32461 -226088
6826 59072 116786 325028 -80153 -47289 -194980 339081 114609 -210854 -1895 69012 157517
6815 157517 271914 -460364 15633 -133070 8772 -150010 157563 164524 -50536 51981 88868
6804 88868 188672 -32020 183837 -109086 43824 -330850 71080 169187 69750 91935 -7329
6792 -77663 25664 64340 266407 195265 249143 -154810 144481 116008 -338055 22403 -10534
6780 255880 -51587 47180 59851 -193852 -26100 -384457 -196419 1270 -83953 -72983 -425543
6769 -425543 176190 -384873 5564 167295 -191776 100224 -221779 189032 43189 -179262
6758 52307 283940 -235791 -224401 63476 308727 98716 460375 244068 18117 5389 -354763
6746 490967 -13626 -15251 -72257 53623 -145456 -161607 -126185 -120689 63969 -18876 517 107659
6734 107659 148314 -355407 -86119 126200 82703 -266203 81686 117692 295818 63048 33413
6723 33413 23023 -274701 -177944 -48724 275370 29326 -77896 36094 -130320 -23619 -42794
6712 -42794 -132152 -262310 73493 -239029 126737 -185262 69613 39822 122446 -111792 -18947
6700 -218448 -142008 -144470 81748 112654 59041 -32465 53977 -215839 -119146 -119915 -6671 59583
6687 -179441 -27470 125250 -206070 44868 -258331 -23655 -242320 -205766 9015 -203120 -113585
6676 -113585 244798 247719 -203411 23905 -209908 -80318 -115128 197535 -371626 -118273 81951
6664 166715 34173 275149 -54831 144734 59792 -99558 35023 200643 -151832 -181689 267278
6652 -211882 -10734 -26400 -174379 -127780 -166722 104337 38367 -22925 -115255 97158 -14372
6640 -112444 216828 -56182 -21078 147607 -47180 -355707 -64456 82346 -76365 -400148 -392876
6629 -392876 225942 207086 146774 -95816 197432 -45343 233154 -255018 -315380 24156 -137689
6617 -110006 199444 -137864 -127495 -85318 73977 -54362 -173616 -33001 -26695 8074 -196089
6605 39927 -215463 83958 270762 253796 -3391 203169 -289884 54593 -37157 -180471 -165676
6594 -165676 38549 -388075 -36744 -13176 -118134 154803 -194041 -230294 -4235 93616 178838
6583 178838 120086 49877 -112244 4103 -41200 -61379 17998 31810 -57886 126517 -56664
6571 -96676 -298981 -25250 79188 -63730 -9739 117837 -94127 -13799 -8506 -249022 -119410
6559 303411 -37253 175944 -189915 -153903 -259993 -31620 29992 214852 -154920 144042
6548 -40332 239359 135611 104726 -275770 228739 -46285 42329 -118128 92107 -241648 -102613
6536 70478 -54369 -48791 207520 99196 -172780 137925 71917 -114203 137308 -80431 196642
6524 280151 -234469 216320 97751 -6914 -162752 -93674 -371835 -92134 223056 -48722 92006
6512 200495 -218144 -114477 139486 121636 -243677 109966 -223290 -153494 174260 -160151
6501 32518 -317529 -123019 -255685 -32546 -141361 -178912 -169386 -196204 174751 -155001 -199831
6490 -199831 -54693 -63101 -144607 -35673 -167581 216913 315490 273657 -66152 -85992 34144
6478 -101303 -142641 -83194 93717 -336845 -23040 117332 -28172 2238 153943 72509 -168131
6466 -15752 151234 -209932 -108801 112265 534310 -298361 126906 134103 -320636 -255527
6456 -255527 -60049 -39224 -176978 -20066 188686 -174622 -62136 135687 -81181 -123308 -45590
6444 18100 42962 -193959 -36734 145577 124701 -44882 -29976 -232941 -337201 -27967 -3818
6432 -1855 155398 -4123 -5969 57268 -321507 117348 -47530 109832 -56764 -113370 2510 -131523
6419 51611 134506 47661 -219848 -37312 162837 277159 -149529 384994 166299 31 -48982
6407 17600 38048 -185136 -428102 349276 86437 160451 364477 56244 284078 229582 101050
6395 -71374 171146 -189316 -117211 -31649 -90523 205986 -88222 38030 258640 -222433 134140
6383 123490 -72334 -189254 212555 5258 75647 59919 -131363 -340875 -41251 86524 110725
6372 110725 183297 -68297 -121412 -95505 20051 217053 -421270 -255764 -25145 173360 137195
6361 137195 46357 43093 -12059 -81682 -137176 -121814 -95868 194616 -343627 311055 58276
6349 -410412 -500332 -129966 242957 -302973 16582 -160016 86829 81145 43356 -212006 -123112
6338 -123112 -70056 -252631 13888 38989 32462 -196033 165101 36845 112926 42261 -89734
6326 3041 -255751 -211079 -197487 66686 103662 122737 22768 -166191 95383 -115050 159244
6314 -31155 -43519 557900 -22080 -114689 -106480 245893 -66927 72839 -231766 72739 -8791 2927
6301 -163901 326183 216422 108873 96122 169958 245837 212574 -67325 386 -24567 271406
6289 63521 36891 -137775 -46476 19907 26448 -304310 68222 15960 66487 85392 -58709 -41734
6277 -41734 -86492 -250821 -163347 83203 -52519 -70558 -9658 312902 59490 -242450 -52668
6265 -19000 184942 94578 429277 40092 -125399 139666 255345 -61364 -35528 215098 -195146
6253 111135 91909 -53789 231976 38053 278677 204991 -25554 279603 76292 -9496 -22415
6242 -22415 -167299 25079 14894 -331893 -352119 -200182 -346681 -174404 17273 7850 81545
6231 81545 88711 142272 266342 14055 -106718 -25480 -258150 -128433 -50146 36024 79453
6220 79453 -253252 -123655 -43129 110169 -118047 -78509 289761 -280502 44067 185279
6210 185279 -225661 -77762 243734 -41193 -208113 -97957 66798 67210 98787 -31113 215021
6198 -67991 -310626 118130 -112067 173431 -6171 -16937 108176 -22761 71379 70992 53971
6187 53971 -105801 -150501 -18623 348104 140011 122817 -1301 -20205 -197438 -16687 -49994
6176 -49994 -65026 44555 -435951 -264100 -61914 -70347 -36028 133581 -99357 100136 -161745
6164 411200 66393 -175633 227785 -171364 -101773 -223804 -149733 51744 -16258 -83331 158630
6152 12846 41218 -40697 -65624 243193 417736 -23405 54508 43158 -178334 -215190 -382695
6141 -382695 -64407 -18145 1279 -70798 204764 -48935 -138299 180308 -53396 227144 -203257
6129 -368473 89906 -260786 66901 -212873 135475 -19606 -95620 -74026 104228 -185365 -43792
6117 297126 -181294 97743 -43497 28639 -163699 -114293 -7616 -92028 -231909 22178 -76706
6105 23598 127018 -15036 333092 103950 86799 -34186 -126147 94908 367792 -83995 -219212
6094 -219212 -54142 154685 36139 141255 175165 6567 -35006 134255 53620 45291 191852
6083 191852 -117684 37358 83734 152812 34783 55456 25590 250903 52800 158606 -77987
6071 -182493 -150477 -67807 40672 -15073 139671 -128667 -281618 138778 -171677 -188704 274885
6059 -155639 -384018 31109 -50928 372298 -181455 -201514 49457 175650 -98486 -88536 11563
6047 367820 137908 93710 47771 137170 -48651 -22919 250685 45802 332652 59119 -148469
6035 34483 180241 63687 133840 -321266 152872 -79322 -205425 -82595 -28278 53098 46865
6024 46865 -115525 -298036 -148730 209183 -75622 15989 -29341 -209477 -33432 -234271 115698
6012 -241117 -60329 -42418 142163 -76757 -46324 -179906 -65341 35853 -129454 -73440 13522
6000 -131158 -148277 -97068 -25503 -327912 -67964 375331 -44903 -230657 -141961 46349 -21581
5988 310353 34229 2220 242996 -9753 43243 -316274 -2436 154394 -1605 100448 -40489 31525
5975 25995 -73062 92613 -19135 40420 -47751 158237 -298173 -43338 267349 15687 477842
5964 477842 -132117 -117915 406218 -159098 -251710 -337100 -91013 32145 -146186 29227 151259
5953 151259 8527 -177034 -307763 -28173 -48997 60883 -122260 143417 132091 -307219 316660
5941 284734 117727 214006 54901 22718 254970 73020 145169 -52309 28569 -35213 228436
5929 6168 -109113 -42270 208703 274229 -156738 4841 12331 43557 118430 -12163 -26429 -44282
5917 -44282 -73507 376012 39340 -133830 147499 118240 106948 2184 206635 45542 117025
5906 117025 -161469 -259644 -407091 -227920 -15832 264119 -55618 -135525 -426193 78826 -85726
5894 -172110 -76225 68701 -198116 -8227 -160518 236732 12739 -79909 -454352 -26563 -133331
5883 -133331 85843 -86991 146273 -109763 -109211 -15508 95414 -154253 -243548 132780 57024
5871 450334 -96605 -87100 -326501 117241 -85225 -186112 -33639 -74802 4727 -232329 30571
5859 193348 -179856 343101 197691 -68548 73930 309300 94849 56375 -349834 98274 -360413
5847 213524 -33998 206656 -65816 43178 164482 -83942 255375 -76542 51257 -171352 37407
5835 66830 -78173 -79417 136773 38650 -205831 193701 363196 -116642 110837 51749 -100731
5823 62837 -214255 58695 -377265 102255 339522 53270 4060 -319220 -45367 -96906 -1361
5811 227254 45256 25557 152741 -63129 -365740 -109967 162849 29484 -7444 -51969 136017
5799 229302 -238459 -270688 -121350 19467 130282 -10585 -257612 294520 141061 64450
5788 129448 49127 127443 150256 231800 116387 -139688 33901 -120295 297244 207075 13849
5776 18714 -136877 258461 75341 286388 -195854 -168768 181469 112456 314204 104438
5765 -106037 -51657 -261493 -73927 -132322 94288 -283781 37923 -160326 360299 -11267 106537
5753 100313 -165528 -61911 122800 48999 -185953 82660 182464 54260 -245950 218430 -138042
5741 -89100 73331 -60777 229583 310181 125052 -77969 132875 -253409 -123028 -75473 -145407
5730 -145407 29446 209967 -19289 197688 -156206 -142322 132515 -255397 362111 150681
5719 -45620 220717 -26117 267360 48748 -42689 -203613 -117897 109815 -172967 2096 -169186
5707 -201412 123481 96285 115070 4342 -77485 25334 397674 163757 -267078 24535 16987
5696 16987 72703 -162309 -96262 -41515 215486 46600 -52314 152806 -11709 -154224 -278498
5685 -278498 -319486 8247 -67870 -110211 -289946 297707 -127007 -22837 33500 157618 -179300
5673 -29702 -126301 -195361 225761 -58660 -29528 -157489 -249531 -178613 169761 -410846 -5259
5661 -258120 -60403 -119519 -255086 -281796 -306422 -154097 104346 -19138 -27953 177002 -300558
5649 22333 -365629 -55971 -34127 -82630 74473 121102 -37902 -405775 -75348 -27861 -269942
5638 -269942 97861 -74426 6606 221766 268930 -145488 140599 93483 112492 -25667 115808
5626 -72042 113433 -276451 285491 -202650 176497 190319 86297 -184714 43233 -183378
5615 -86188 -44951 237303 50685 -48935 207804 -224868 249694 -93701 -108002 -15524 -122141
5604 -122141 -166078 26230 138916 307973 -37742 230920 -26476 177286 -4260 -866 -193084
5593 -193084 -136760 194948 233462 -201628 15650 68574 -249636 -221068 -266463 -76768 -174019
5582 -174019 -223509 -156094 3468 -30091 256376 315687 352670 -86347 -116243 197767 87504
5570 25554 61754 -54327 -52269 229848 313221 10585 49286 -193825 -179597 117818 178404
5559 178404 128405 -196931 257291 70786 -198840 -100873 205646 241326 30127 -15270 -165624
5548 -165624 -88430 -96976 -185740 62742 -153168 250695 10318 -140087 -82881 -7350 59636
5536 -228563 255455 281319 -21636 -163859 67303 -222167 320092 50944 -55377 -137465 -88585
5525 -88585 -124258 35616 112370 -73858 -22696 159633 114311 -222829 125099 538233 283450
5514 283450 -185427 -265494 -128727 -81226 -121020 232056 28190 -236620 96116 9164 -24357
5502 13578 -109396 81992 1756 -52981 58584 31326 139555 9065 292973 166838 -186595
5490 137498 115488 -132687 -96105 -12385 -108674 -203634 278220 -81481 -34250 78593 -229336
5478 131606 -188017 116559 136748 140033 177265 229475 202502 165672 -81958 76019 149529
5467 149529 119972 430405 266042 -26511 264953 -137678 -217663 -86464 98837 -125268 287950
5455 -60568 87290 26900 16279 85198 31501 249994 44940 21376 -90138 91468 -68879 348352
5442 19111 120176 -185041 134124 -220032 107224 79392 -102110 -260831 46785 80943
5432 80943 -47192 -288579 190226 -77820 56373 -93436 -320963 -19693 45303 -85480 -240373
5421 -240373 -84338 -147574 -2154 105581 155030 -274014 7147 282623 -195074 170271 -58008
5409 -24612 296702 -167096 -229458 200900 -325890 23580 -60986 -203566 -117590 176685 -19277
5397 94120 297532 144711 167503 123733 -70130 86601 -17582 12669 -55639 -126843 258381
5385 -154127 172722 -377584 -264804 382017 -114573 -15357 -399962 -196988 216482 120258
5375 120258 367385 163229 30529 -117817 -176335 5611 184093 298224 -100299 -91595 -14757
5363 -37629 -77013 298633 19054 -35888 -14957 -78777 -208289 60532 167733 -523175 46123
5351 -71445 -338543 -70935 274107 26881 71183 -181049 -117592 -99055 -186707 89298 15484
5339 31677 -198706 157170 -187181 78000 107226 -319395 155888 -20406 206070 -158144
5328 256453 55953 131025 -206539 -493527 -18026 -145118 76231 246910 48793 -144872 317472
5316 -117987 112193 -277181 60988 25711 -144593 -72673 48784 -22389 9648 221832 221353
5305 221353 140062 203195 -206692 -177773 89323 -280203 -238789 134375 85321 96202 -12387
5293 175423 149025 102259 -470 -94134 9872 -315121 18954 -47748 28673 2190 278252 -81192
5280 144076 -192587 -17924 151478 83206 19897 -13283 -59534 -40180 -93004 -7410 -94115
5269 -94115 -42755 108756 -68545 94641 13035 2126 84875 -192606 132153 4059 -145685
5257 16618 38358 -144825 -22657 90300 243348 299796 -105312 95624 -9748 -79110 203583
5245 86317 -250129 -106065 285411 -198250 200976 194484 -34512 -75238 60852 -86473 98843
5233 48034 -62060 133592 -25708 124447 -174757 110496 -97221 28276 119982 96718 -213599
5221 150378 501352 2711 -148811 -120349 -83729 149209 125435 208846 239824 -131440 56235
5209 377895 -70549 164443 -205955 -64979 -114204 -25083 -88349 64643 59784 -239187 -128385
5198 -128385 -22873 -229525 -345311 168635 -324278 89678 216110 -56809 -97220 -36472 -40503
5187 -40503 -234094 -120220 478319 -161533 -13753 -404633 341109 224500 310679 153547
5176 141598 -154128 -242293 -7924 -270048 265640 -24501 12558 -196747 48239 -95337 106371
5164 -101928 -28087 58995 203146 126661 248574 221873 -264649 119258 4639 72582 -292059
5152 -55996 -300266 163126 -334045 114609 -32617 -454016 54916 -87979 170753 139152 31360
5140 18589 -49135 164664 -15869 220266 -197011 4150 39389 -58878 45947 -8871 -46780 20814
5127 -98118 -247013 -392673 10519 -49513 -96275 119402 110444 47631 -61246 258084 -6777
5115 600333 136207 -4378 -59290 -26645 202653 -100861 41733 45495 158437 -172670 199833
5103 157085 229298 -66814 382908 -41374 -435968 -174681 -3779 45980 76801 -82949 -87086
5092 -87086 108657 -124580 -21122 218568 -12286 231311 -58293 210160 117223 213611 8955
5080 -15019 -70574 97430 321226 9153 -329264 199347 -75043 -207983 102202 158707 144694
5069 144694 -182892 -70496 -46547 134199 70388 196184 -327215 119807 34742 -102813
5058 323460 254097 17170 51732 -115754 49047 -113823 40082 -112669 170325 -84323 57977
5046 -151129 94770 -120043 207718 54780 38540 -135781 -120499 -248168 33063 -104791 -51160
5034 69266 -29907 -25749 74145 70797 270263 -82757 -143602 77704 -72454 -96449 104185 63909
5022 63909 153357 -130250 44170 -98872 68813 -31739 -71247 -146203 76751 -180592 92323
5010 97641 -114943 -197397 -81037 -58665 -116564 -171361 -195756 -61391 67207 -115412 -237691
4999 -237691 135442 12395 -20998 21013 -197514 -182289 207813 61856 -22918 -169081 5324
4987 -183797 47802 165459 -26772 142812 -242790 118187 -180029 47140 293335 171007
4977 171007 -62953 62182 167191 -215450 42162 -403436 156180 4386 188450 -25174 -17118
4966 -17118 195623 -209783 -25951 145509 207964 38128 83490 -225780 340863 -10146 17453
4954 35517 121081 -100589 -67629 -182161 -235221 250727 209584 -271958 146221 290593 30987
4942 24710 -101809 -7789 193922 -153877 49353 -67184 -65072 224393 111465 -85077 21358
4930 109713 -337705 24458 -71967 -72184 141018 31501 -167529 -26715 -61673 125174 -31920
4918 181650 -29181 118797 -231905 -73118 432698 102508 113552 95943 -165428 53138 -80333
4906 100789 159279 -209323 3599 169501 -206514 144234 -24099 -332944 -122368 -11285 106714
4894 -484839 -304017 240304 117066 -84424 -50596 210692 214769 180618 -197639 -119877 75605
4882 -10878 -99349 155128 391853 -151874 -82532 -200992 45404 -149981 73126 -77712 -183312
4871 -183312 -115166 -155961 130925 -67056 -449273 153815 -13725 -37718 243752 186902 103804
4860 103804 -57733 -67184 -189323 -75967 -192699 -160337 -199795 -1864 103790 367143 62262
4848 -219057 93545 159062 24222 164855 -21741 26122 242585 -195555 18437 -26845 64527
4836 77389 349141 89182 82439 -94250 132906 -180895 -114038 -175616 -50152 110950 409325
4825 409325 47906 101289 -238381 41985 -115932 -102999 126418 54938 240860 -165357 177217
4813 162847 40142 -87923 88365 -69140 363575 -39006 -156994 49692 -122350 36644 -148371
4801 -120923 -47316 -79338 -146945 -94012 89772 -268637 133041 -105118 21394 -39372 -232005
4790 -232005 -212483 102476 172199 143525 -56850 69988 102480 38181 24911 -159433 -95349
4779 -95349 292184 -202649 16188 -17443 -137716 -4322 184165 -65555 -364038 169827 -296500
4767 -115144 -12657 122052 174359 -13767 18259 177105 360770 -125443 -81204 -200534 143047
4755 163069 22261 50817 21474 -76019 104272 -123059 -123419 -34903 -132095 -60018 319099
4743 209572 -13020 381781 -123668 145832 -22496 -143038 8597 138175 110393 -130089 64876
4731 -112230 -40406 -66740 30377 -243686 -64612 -26563 -132926 262971 37083 211619 -41431
4719 136717 1045 132229 99990 143163 138532 244295 -427913 -16956 -247303 173212 -61230
4707 113466 237033 -99236 -29091 295685 -5176 -68484 -182726 -209258 357410 -50464 -119755
4696 -119755 -27816 -51310 34551 -337559 146073 143273 -77010 20951 -204572 -111898 59408
4684 122315 40519 12197 553729 142520 113617 36635 -131318 -69675 20413 -11176 102534
4672 -125272 260561 66282 -228377 -272956 126508 -148000 -88219 -44726 -12409 263076 60133
4660 42399 21912 -177502 145302 177968 66142 -50000 33045 293374 -136863 141287 317940
4649 317940 -163702 -102283 -73805 209233 -169156 77875 -58961 -186761 66419 -120488 -156340
4638 -156340 335957 -133974 196210 29190 -16161 -154475 -139733 123110 343176 124019
4627 -48357 -144892 73780 58126 161496 -181124 -95530 84789 -89699 -288673 -29715 -215276
4616 -215276 22458 -78357 -254746 -1467 91591 300944 -60440 -134601 -75802 33605 448462
4605 448462 48767 -95515 313766 -280939 83918 -2722 169616 -49488 -130443 3872 114761
4594 114761 20019 131632 35005 142574 155833 -11788 63813 -194222 -83332 58871 -121686
4582 -85462 127561 57450 165097 99026 252416 99192 -224072 259640 75340 53268 27141
4571 27141 511595 -75275 215427 -166082 -143390 90204 -232361 410394 -172825 172362
4560 -73959 48450 -90280 -46869 67842 224137 216735 -58704 -94091 141357 267003 75758
4548 229430 -89017 -1367 74704 -147101 249575 229202 -237935 161348 128007 -50998 -102669
4537 -102669 25976 361632 -99497 -263913 -254888 -139214 259498 -90497 126038 96312 -71189
4525 45177 78660 38686 -213801 -211469 -64538 9932 -65021 -61621 -124776 -357118 88379 -102323
4512 99427 223758 -110549 137760 -163798 105638 170629 -165841 -29103 -309499 35820
4501 173494 -152672 -51336 46090 -2539 -222962 111826 -87349 84232 -157914 -130094 -138106
4490 -138106 103112 -113645 192432 19854 -101245 4952 252487 -60477 233409 -287746
$$ [...]
##END NTUPLES=NMR SPECTRUM
##END=
