##TITLE=NES1005_872015076_9232744_htFKc47TFp
##JCAMPDX= 6.0         $$ Bruker NMR JCAMP-DX V2.0
##DATA TYPE= NMR SPECTRUM
##DATA CLASS= NTUPLES
##ORIGIN= BRUKER
##OWNER= Administrator
$$ 1.72 TOPSPIN		Version 2.1
$$ 2015-06-17 19:26:02.581 -0700  Administrator@X
$$ Compression mode = diff/dup
##.OBSERVE FREQUENCY= 400.02188249412
##.OBSERVE NUCLEUS= ^1H
##.ACQUISITION MODE= SIMULTANEOUS (DQD)
##.ACQUISITION SCHEME= undefined
##.AVERAGES= 64
##.DIGITISER RES= 22
##SPECTROMETER/DATA SYSTEM= spect
##.PULSE SEQUENCE= noesygpps1d.comp
##.SOLVENT NAME= COFFEE_meoh
##.SHIFT REFERENCE= INTERNAL, COFFEE_meoh, 1, 14.96285
##AUDIT TRAIL= $$ (NUMBER, WHEN, WHO, WHERE, PROCESS, VERSION, WHAT)
$$ ##TITLE= Audit trail, TOPSPIN		Version 2.1
$$ ##JCAMPDX= 5.01
$$ ##ORIGIN= Bruker BioSpin GmbH
$$ ##OWNER= Administrator
$$ $$ E:\/data/COFFEE/nmr/NES1005_872015076_9232744_htFKc47TFp/12/pdata/1/auditp.txt
$$ ##AUDIT TRAIL=  $$ (NUMBER, WHEN, WHO, WHERE, PROCESS, VERSION, WHAT)
(   1,<2015-06-17 19:25:57.284 -0700>,<Administrator>,<X>,<go>,<TOPSPIN 2.1>,
      <created by zg
	started at 2015-06-17 19:14:27.534 -0700,
	POWCHK enabled, PULCHK disabled,
       configuration hash MD5:
       21 0F 79 D6 B3 7B B4 F6 88 20 88 DB 03 48 BD 9F
       data hash MD5: 64K
       14 60 7C 17 86 59 8F 86 07 6C 97 3F 18 AD 56 5C>)
(   2,<2015-06-17 19:26:00.534 -0700>,<Administrator>,<X>,<proc1d>,<TOPSPIN 2.1>,
      <Start of raw data processing
       efp LB = 0.3 FT_mod = 6 PKNL = 1 PHC0 = 0 PHC1 = 0 SI = 128K 
       data hash MD5: 128K
       89 BF FD 04 67 90 ED A1 D9 D0 98 F7 53 61 82 96>)
(   3,<2015-06-17 19:26:01.409 -0700>,<Administrator>,<X>,<proc1d>,<TOPSPIN 2.1>,
      <pk PHC0 = -87.48413 PHC1 = 0 
       data hash MD5: 128K
       CD 56 C8 82 65 8F AC 82 93 B5 FC 60 65 E0 8A 45>)
(   4,<2015-06-17 19:26:01.769 -0700>,<Administrator>,<X>,<proc1d>,<TOPSPIN 2.1>,
      <abs ABSG = 1 
       data hash MD5: 128K
       B6 84 F7 80 B4 BA DB 4F 37 1D 93 A7 D9 2D E7 2F>)
(   5,<2015-06-17 19:26:01.878 -0700>,<Administrator>,<X>,<proc1d>,<TOPSPIN 2.1>,
      <abs ABSG = 2 
       data hash MD5: 128K
       25 F2 86 8C 05 F2 9F 74 5E 8A C8 CA 9C B8 D0 36>)
(   6,<2015-06-17 19:26:01.941 -0700>,<Administrator>,<X>,<proc1d>,<TOPSPIN 2.1>,
      <abs ABSG = 3 
       data hash MD5: 128K
       29 A8 A9 B6 BB 58 20 23 67 C9 BC 83 EA 24 D8 E3>)
(   7,<2015-06-17 19:26:02.050 -0700>,<Administrator>,<X>,<proc1d>,<TOPSPIN 2.1>,
      <abs ABSG = 4 
       data hash MD5: 128K
       FA B5 23 94 1F F5 95 1E 21 2B C5 E7 FA AF B9 EB>)
(   8,<2015-06-17 19:26:02.128 -0700>,<Administrator>,<X>,<proc1d>,<TOPSPIN 2.1>,
      <abs ABSG = 5 
       data hash MD5: 128K
       80 27 2A 8F 4E 92 A8 60 F9 E0 F4 E9 21 02 4F A1>)
$$ ##END=
$$ 
$$ $$ hash MD5
$$ $$ 81 3A E3 E1 29 F7 7C A0 CD 23 15 6C 05 71 45 96
##$RELAX= 
##$RELAX= 
##$RELAX= 
##$RELAX= 
##$RELAX= 
##$RELAX= 
##$RELAX= 
##$RELAX= 
$$ Bruker specific parameters
$$ --------------------------
##$DU= <E:\>
##$EXPNO= 12
$$ [...]
##$TP07= 0
##$TPNAME0= <>
##$TPNAME1= <>
##$TPNAME2= <>
##$TPNAME3= <>
##$TPNAME4= <>
##$TPNAME5= <>
##$TPNAME6= <>
##$TPNAME7= <>
##$TPOAL= (0..7)
0.5 0.5 0.5 0.5 0.5 0.5 0.5 0.5
##$TPOFFS= (0..7)
0 0 0 0 0 0 0 0
##$TUNHIN= 0
##$TUNHOUT= 0
##$TUNXOUT= 0
##$USERA1= <user>
##$USERA2= <user>
##$USERA3= <user>
##$USERA4= <user>
##$USERA5= <user>
##$V9= 5
##$VALIST= <valist>
##$VCLIST= <CCCCCCCCCCCCCCC>
##$VD= 0
##$VDLIST= <DDDDDDDDDDDDDDD>
##$VPLIST= <PPPPPPPPPPPPPPP>
##$VTLIST= <TTTTTTTTTTTTTTT>
##$WBST= 2048
##$WBSW= 25
##$XGAIN= (0..3)
0 0 0 0
##$XL= 0
##$YL= 0
##$YMAX_a= 6639010
##$YMIN_a= -12695259
##$ZGOPTNS= <>
##$ZL1= 120
##$ZL2= 120
##$ZL3= 120
##$ZL4= 120
##$ABSF1= 14.96285
##$ABSF2= -5.595332
##$ABSG= 5
##$ABSL= 3
##$ALPHA= 0
##$AQORDER= 0
##$ASSFAC= 0
##$ASSFACI= 0
##$ASSFACX= 0
##$ASSWID= 0
##$AUNMP= <proc_prof1d_extract.lims>
##$AXLEFT= 0
##$AXNAME= <>
##$AXNUC= <1H>
##$AXRIGHT= 0
##$AXTYPE= 0
##$AXUNIT= <>
##$AZFE= 0.1
##$AZFW= 0.1
##$BCFW= 0
##$BC_mod= 0
##$BYTORDP= 0
##$COROFFS= 0
##$CY= 15
##$DATMOD= 1
##$DC= 0
##$DFILT= <>
##$DTYPP= 0
##$F1P= 0
##$F2P= 0
##$FCOR= 0.5
##$FTSIZE= 131072
##$FT_mod= 6
##$GAMMA= 0
##$GB= 0
##$INTBC= 1
##$INTSCL= 1
##$ISEN= 128
##$LB= 0.3
##$LEV0= 0
##$LPBIN= 0
##$MAXI= 10000
##$MC2= 0
##$MEAN= 0
##$ME_mod= 0
##$MI= 0
##$NCOEF= 0
##$NC_proc= -2
##$NLEV= 6
##$NOISF1= 0
##$NOISF2= 0
##$NSP= 0
##$NTH_PI= 0
##$NZP= 0
##$OFFSET= 14.96285
##$PC= 1
##$PHC0= -87.48413
##$PHC1= 0
##$PH_mod= 1
##$PKNL= yes
##$PPARMOD= 0
##$PPDIAG= 0
##$PPIPTYP= 0
##$PPMPNUM= 2147483647
##$PPRESOL= 1
##$PSCAL= 4
##$PSIGN= 0
##$PYNMP= <proc.py>
##$REVERSE= no
##$SF= 400.020008898538
##$SI= 131072
##$SIGF1= 0
##$SIGF2= 0
##$SINO= 400
##$SIOLD= 131072
##$SPECTYP= <>
##$SREGLST= <1H.CDCl3>
##$SSB= 0
##$STSI= 131072
##$STSR= 0
##$SW_p= 8223.68421052631
##$SYMM= 0
##$S_DEV= 0
##$TDeff= 65536
##$TDoff= 0
##$TI= <>
##$TILT= no
##$TM1= 0
##$TM2= 0
##$TOPLEV= 0
##$USERP1= <user>
##$USERP2= <user>
##$USERP3= <user>
##$USERP4= <user>
##$USERP5= <user>
##$WDW= 1
##$XDIM= 131072
##$YMAX_p= 385127821
##$YMIN_p= -10694
##$CURPLOT= <Network HP LaserJet P1505>
##$CURPRIN= <$Network HP LaserJet P1505>
##$DFORMAT= <normdp>
##$LAYOUT= <+/1D_H.xwp>
##$LFORMAT= <normlp>
##$PFORMAT= <normpl>
##$SURQMSG= 1
$$ End of Bruker specific parameters
$$ ---------------------------------
##NTUPLES= NMR SPECTRUM
##VAR_NAME=  FREQUENCY,     SPECTRUM/REAL,   SPECTRUM/IMAG
##SYMBOL=    X,             R,               I
##VAR_TYPE=  INDEPENDENT,   DEPENDENT,       DEPENDENT
##VAR_FORM=  AFFN,          ASDF,            ASDF
##VAR_DIM=   131072,        131072,          131072
##UNITS=     HZ,            ARBITRARY UNITS, ARBITRARY UNITS
##FACTOR=    0.0627417313425164, 1,          1
##FIRST=     8223.62146879497, 2797,         -44613
##LAST=      0,             4722,            -44339
##MIN=       0,             -10694,          0
##MAX=       8223.62146879497, 385127821,    0
$$ Real data points
##PAGE= N=1
##DATA TABLE= (X++(R..R)), XYDATA
$$ [...]
67472 103148 103265 104072 105186 106112 106796 107493 108303 108998 109243 108880 108086 107232 106553 106010 105572 105490 106098 107411
67454 107411 109163 111143 113180 114867 115712 115720 115492 115542 115730 115599 115086 114624 114591 114870 114949 114348 113002 111365
67436 111365 110095 109484 109217 108843 108442 108570 109482 110678 111450 111745 112177 113188 114516 115566 116051 116085 115924
67419 115924 115892 116371 117426 118479 118702 117876 116599 115548 114856 114352 114125 114524 115741 117586 119618 121330
67403 121330 122315 122485 122137 121685 121361 121203 121180 121186 121081 120899 120936 121430 122240 122994 123471 123690 123761 123854 124192 124822 125415
67382 125415 125584 125375 125279 125770 126987 128781 130807 132608 133909 134857 135731 136441 136622 136249 135805 135723 136022 136640
67364 136640 137683 139020 140021 140185 139875 139932 140642 141497 141986 142131 142122 141979 141848 142272 143683 145794 147831 149266
67346 149266 150028 150148 149617 148636 147658 147034 146856 147163 148012 149220 150337 151101 151711 152521 153673 155157 156925
67329 156925 158695 159919 160328 160318 160453 160754 160894 160959 161462 162607 164048 165490 167006 168459 169100 168288 166473
67312 166473 164989 164804 165687 166669 167121 167256 167655 168467 169266 169657 169789 170088 170668 171309 171909 172614 173544 174682
67294 174682 176004 177416 178566 179190 179614 180442 181684 182756 183512 184635 186624 188936 190631 191496 191964 192282
67278 192282 192378 192389 192674 193315 194115 195079 196450 198223 200011 201468 202596 203625 204856 206516 208456 210084
67262 210084 210989 211521 212401 213835 215457 217035 218712 220480 221972 222901 223332 223385 223110 222815 223082 224209 225859
67245 225859 227421 228482 228948 229059 229351 230151 231036 231278 230997 231318 233056 235760 238455 240914 243596 246637
67229 246637 249524 251662 252778 252874 252285 251864 252516 254321 256420 257958 258979 260228 262263 264903 267424
67214 267424 269157 269989 270410 271079 272257 273628 274718 275469 276360 277913 280123 282510 284771 287144 289892
67199 289892 292615 294504 295365 296008 297377 299545 301818 303620 304940 305970 306714 307114 307442 308329 310324 313384
67183 313384 316832 319894 322237 323986 325371 326641 328218 330528 333493 336545 339346 342174 345303 348322
67169 348322 350489 351600 352057 352263 352529 353515 356010 359913 363962 367004 369233 371658 374645 377658 380402
67154 380402 383421 387203 391260 394671 397220 399413 401510 403206 404368 405520 407321 409922 413096 416629
67140 416629 420252 423543 426303 428831 431455 434066 436524 439302 443059 447601 451855 455081 457590 460107
67126 460107 462880 465751 468718 472029 475761 479585 482986 485733 488244 491352 495425 499838 503756 507383
67112 507383 511853 517705 524056 529585 533856 537276 540255 542964 545632 548532 551779 555520 560050 565330
67098 565330 570679 575527 580261 585674 591618 596902 600722 603612 606747 610744 615431 620403 625421 630433
67084 630433 635535 640896 646541 652240 657642 662504 666796 670721 674645 678885 683616 689042 695482 702992
67070 702992 711028 718777 725788 731968 737157 741326 745277 750433 757442 765381 772838 779535 786310 793640
67056 793640 800866 807115 812488 817901 823951 830344 836503 842393 848590 855677 863754 872470 881283 889691
67042 889691 897431 904584 911428 918134 924718 931329 938321 945926 954014 962331 970786 979289 987604 995721
67028 995721 1004220 1013763 1024170 1034427 1043808 1052646 1061796 1071604 1081660 1091370 1100498 1109198 1117805
67015 1117805 1126639 1135877 1145498 1155314 1165006 1174270 1183065 1191729 1200672 1209983 1219570 1229634 1240586
67002 1240586 1252316 1263932 1274577 1284381 1294237 1304720 1315577 1326282 1336735 1347254 1358113 1369373
66990 1369373 1381046 1393146 1405461 1417465 1428664 1439069 1449138 1459171 1468943 1478164 1487214 1497058
66978 1497058 1508255 1520249 1531884 1542568 1552720 1563125 1574054 1585158 1596091 1606968 1618094
66967 1618094 1629351 1640152 1650130 1659631 1669313 1679417 1689764 1700336 1711345 1722600 1733331 1743026
66955 1743026 1752080 1761191 1770310 1778762 1786355 1793851 1802115 1811132 1820145 1828514 1836227 1843707 1851359 1859294
66941 1859294 1867330 1875165 1882542 1889261 1895180 1900404 1905411 1910719 1916378 1922043 1927576 1933238 1939055 1944355
66927 1944355 1948406 1951364 1954125 1957209 1960216 1962560 1964324 1966063 1967985 1969762 1971178 1972549 1974325 1976376
66913 1976376 1977955 1978400 1977729 1976457 1974932 1973079 1970792 1968278 1965818 1963330 1960495 1957214 1953638 1949705
66899 1949705 1945032 1939441 1933338 1927378 1921964 1917175 1912879 1908658 1903901 1898319 1892246 1886135 1879883 1873018
66885 1873018 1865389 1857310 1849104 1840904 1832883 1825268 1818041 1810952 1803787 1796293 1787915 1778179 1767472 1756935
66871 1756935 1747330 1738380 1729364 1719923 1710050 1699834 1689616 1679952 1670908 1661702 1651576 1640755 1630056
66858 1630056 1619785 1609561 1599051 1588254 1577087 1565340 1553214 1541372 1530238 1519531 1508625
66847 1508625 1497146 1485224 1473436 1462499 1452610 1443034 1432738 1421534 1410234 1399570 1389381 1379000
66835 1379000 1368085 1356820 1345631 1334933 1324892 1315164 1305120 1294586 1284115 1274286 1264943 1255436
66823 1255436 1245415 1235097 1224872 1214962 1205406 1196056 1186623 1176970 1167356 1158162 1149346 1140429 1131083
66810 1131083 1121545 1112306 1103506 1094797 1085796 1076510 1067250 1058201 1049255 1040307 1031495 1022990 1014737 1006627
66796 1006627 998814 991492 984337 976567 967782 958461 949456 941161 933364 925663 917757 909526 901160 893160
66782 893160 885917 879259 872631 865722 858739 852007 845551 839129 832594 826106 819998 814419 809047 803218
66768 803218 796503 789152 781840 774983 768498 762242 756372 751029 745836 740129 733716 727126 720961 715307
66754 715307 710030 705339 701549 698318 694664 689962 684571 679201 673972 668505 662730 657153 652273 648030
66740 648030 643918 639485 634707 630004 625804 622038 618252 614332 610780 607889 604976 601018 595914 590567
66726 590567 585715 581323 577218 573643 570811 568398 565884 563077 559972 556433 552378 548068 543869 539900
66712 539900 536098 532420 528765 524957 521073 517496 514371 511289 507822 504059 500267 496334 492051 487734
66698 487734 484050 481228 478880 476520 473885 470774 467083 463083 459333 456175 453537 451214 449097 447145
66684 447145 445403 443997 442784 441067 438131 434169 430265 427262 424890 422196 418577 414228 409775 405771
66670 405771 402456 399845 397952 396884 396586 396565 396074 394666 392401 389516 386144 382490 379076 376511 374992
66655 374992 374107 373149 371637 369631 367548 365670 363875 361897 359719 357518 355276 352746 349894 347187 345227
66640 345227 344154 343512 342697 341465 339990 338503 336969 335146 332898 330335 327693 325243 323293 322065 321438
66625 321438 321021 320541 319921 318897 316950 313982 310796 308435 307105 306165 305114 304077 303236 302283 300780 298783
66609 298783 296806 295285 294254 293440 292490 291169 289496 287677 285909 284317 283058 282243 281651 280746 279216
66594 279216 277401 276009 275426 275418 275476 275213 274422 272969 270870 268461 266273 264632 263474 262592 261918 261433 261036
66577 261036 260778 261048 262087 263304 263563 262362 260346 258442 256856 255285 253743 252581 251850 251126 250045
66562 250045 248633 247054 245345 243488 241586 239918 238810 238280 237718 236314 234049 231934 230865 230562 230116
66547 230116 229281 228574 228279 228070 227559 226552 224796 222237 219620 217996 217374 216668 215333 214241 214340 215136 215313
66530 215313 214440 213270 212523 212130 211702 211120 210469 209727 208684 207063 204759 202085 199626 197706 196182 194941
66514 194941 194278 194437 195031 195364 195201 194855 194583 194290 193785 192980 191838 190422 189008 187905 187138 186525 185989
66497 185989 185537 184983 184059 182863 181943 181789 182344 183033 183210 182657 181765 181148 180979 180849 180404 179796 179236 178437
66479 178437 177074 175606 174968 175301 175526 174539 172475 170503 169627 170023 171275 172808 174052 174580 174319 173557
66463 173557 172658 171791 170925 169994 169003 168066 167374 167080 167111 167077 166519 165322 163840 162544 161596 160847 160114 159318
66445 159318 158429 157518 156872 156783 157145 157519 157702 158001 158759 159772 160388 160128 159078 157809 157039 157203 158116 159107
66427 159107 159586 159456 158917 158072 156935 155701 154738 154280 154253 154402 154514 154517 154421 154128 153377 151996 150207 148481
66409 148481 147099 146039 145313 145098 145441 146112 146876 147615 148041 147654 146289 144450 142803 141546 140538 139790
66393 139790 139453 139433 139328 138710 137373 135533 133957 133534 134369 135563 136203 136278 136242 136080 135433 134446 133743 133505
66375 133505 133160 132140 130522 128834 127648 127435 128351 129967 131511 132518 133036 133168 132806 131894 130589 129054
66359 129054 127385 125887 125124 125418 126396 127179 127054 126094 125256 125633 127257 128746 128559 126587 124180 122666
66343 122666 122262 122409 122576 122569 122502 122767 123739 125289 126726 127393 127187 126515 125934 125779 125887 125675 124767 123459 122330
66324 122330 121558 120986 120633 120576 120474 119842 118774 117756 116801 115559 114341 114124 115213 116677 117528 117734 117645
66307 117645 117182 116256 115330 114820 114389 113531 112466 111801 111581 111390 111122 111039 111243 111665 112298 112882 112657 111184
66289 111184 109180 107784 107151 106589 105978 106018 106947 107967 108422 108746 109651 110932 111783 111972 112038 112408 112843 112854
66271 112854 112266 111278 110221 109405 109004 108864 108503 107527 106105 104898 104386 104390 104394 104165 103787 103284 102652 102264 102708
66252 102708 104005 105348 105889 105504 104644 103810 103412 103657 104251 104589 104547 104641 105023 104922 103696 101946 100780 100296
66234 100296 99672 98585 97615 97210 97099 96965 96914 96952 96658 95811 94896 94606 95144 96169 97110 97372 96667 95371
66216 95371 94201 93457 92928 92666 93200 94685 96329 97168 97126 96933 97172 97795 98408 98694 98548 98049 97321 96469
66198 96469 95708 95450 95959 96940 97798 98364 98989 99855 100659 101112 101305 101347 101046 100260 99193 98102 97059 96295
66180 96295 96350 97413 98772 99396 98978 98126 97656 97988 98990 100083 100619 100494 100267 100433 100780 100820 100594 100546 100679
66161 100679 100386 99281 97788 96673 96192 95937 95418 94600 93876 93660 94114 95204 96764 98365 99318 99170 98194
66144 98194 97083 96154 95222 94226 93482 93078 92570 91648 90776 90729 91721 93327 95002 96251 96598 96013 95316 95559
66126 95559 96862 98197 98463 97458 95777 94087 92675 91469 90291 89121 88164 87568 87194 86823 86556 86770
66110 86770 87645 88893 90036 90774 91024 90759 89997 88945 88009 87511 87365 87190 86853 86737 87236 88123 88729 88698
66092 88698 88204 87515 86788 86319 86346 86436 85711 84090 82691 82461 82892 82834 82222 82098 82989 84073 84200 83178 81727
66073 81727 80571 79859 79328 78793 78468 78731 79524 80247 80448 80396 80641 81277 82005 82704 83433 84038 84299 84453 85014
66054 85014 86039 87066 87774 88211 88374 88118 87630 87419 87608 87754 87539 87218 87154 87357 87730 88267 88714 88514 87576
66035 87576 86731 86910 88033 89163 89653 89693 89681 89519 88723 87069 84934 83039 81961 81840 82386 83004 83076 82504
66017 82504 82064 82822 84937 87366 89097 90309 91777 93487 94612 94786 94608 94671 94802 94602 94244 94336 95286
66000 95286 96985 98830 99929 99742 98723 97963 98051 98649 99212 99571 99636 99151 98119 96984 96056 95183 94320 93825
65982 93825 93817 93763 93275 92849 93195 94163 94892 94778 93789 92120 90135 88444 87451 86883 86189 85250 84313 83439 82514
65963 82514 81608 80833 80052 79202 78711 79041 79936 80688 81055 81394 81963 82598 83036 83069 82491 81408 80471 80253 80490
65944 80490 80544 80500 81078 82444 83876 84710 84907 84498 83280 81487 80067 79764 80338 81080 81738 82458 83195 83702
65926 83702 83958 84242 84845 85898 87213 88101 87676 85757 83293 81538 80882 80718 80369 79832 79583 79928 80623
65909 80623 81148 81274 81221 81180 80857 79879 78582 77943 78554 79981 81313 82024 82114 81756 81149 80563 80203 80087 80132
65890 80132 80255 80302 80129 79904 80020 80487 80694 80063 78773 77530 76793 76511 76474 76561 76661 76662 76548 76322 75839 74948
65870 74948 73788 72773 72237 72257 72771 73622 74477 74949 74971 74871 74922 74959 74626 73942 73296 72901 72511 71882 71219 70899
65850 70899 70939 71120 71509 72330 73337 73931 74061 74377 75108 75461 74757 73625 73226 73659 74045 74019 74078 74356 74160
65831 74160 73183 72299 72512 73693 74948 75731 76088 76272 76759 78242 80927 84004 86414 87974 89250 90505
65815 90505 91418 91794 91905 92004 91937 91420 90401 89041 87642 86608 86270 86643 87500 88581 89522 89742 88875 87302
65797 87302 85888 85078 84561 83877 83004 82223 81749 81739 82412 83774 85261 85999 85606 84613 83910 83786 83759 83403 83076
65778 83076 83429 84316 84678 83765 82116 81015 81142 82052 82877 83192 83139 82934 82444 81368 79804 78439 77875 77913
65760 77913 77857 77499 77251 77176 76568 74955 72987 71696 71218 70941 70688 70931 71781 72523 72473 71763 70945 70209 69408
65741 69408 68607 68176 68331 68840 69277 69475 69611 69878 70193 70404 70695 71396 72272 72436 71390 69858 69088 69400
65723 69400 69975 70127 70172 70794 71968 72900 72895 72001 70897 70354 70759 71893 73020 73295 72331 70591 69206 69121
65705 69121 70237 71535 72166 72277 72606 73489 74541 75184 75220 74928 74834 75289 76084 76576 76377 75777 75316 75150 75131
65686 75131 75231 75461 75482 74800 73390 71773 70466 69632 69240 69215 69458 69978 70935 72197 73059 72883 71964 71264
65668 71264 71291 71727 72182 72663 73142 73250 72766 72020 71524 71498 71897 72561 73098 73039 72396 71766 71651 71912 72186 72505
65648 72505 73146 74011 74490 73955 72346 70348 68949 68570 68666 68496 68210 68664 70103 71638 72275 71927 71050 69840
65630 69840 68353 67021 66393 66414 66458 66099 65511 65127 65196 65697 66497 67516 68766 70177 71443 72274 72795 73329
65612 73329 73750 73551 72723 71997 71848 71780 71165 70367 70316 71160 72049 72263 71931 71531 71253 71055 70930 70824 70520 69853
65592 69853 68915 67932 67024 66230 65653 65480 65814 66508 67154 67332 66895 65985 64838 63767 63194 63347 63803 63765 62984
65573 62984 62097 61802 62051 62374 62661 63145 63825 64370 64597 64661 64785 65082 65591 66212 66634 66562 66041 65418 65035 65055
65553 65055 65378 65596 65334 64849 64946 65965 67170 67569 67067 66305 65637 64890 64030 63383 63068 62768 62252 61745 61655
65534 61655 62198 63329 64724 65852 66405 66638 66962 67277 67205 66917 67165 68372 70153 71888 73314 74380 75007
65517 75007 75239 75264 75042 74290 73028 71757 70864 70213 69594 69213 69387 70045 70906 71916 73127 74343 75223 75620
65499 75620 75516 74749 73219 71323 69798 68998 68555 67904 66994 66274 66038 65989 65646 65073 64914 65580 66682 67547
65481 67547 68052 68555 69122 69335 68960 68315 67770 67253 66493 65500 64535 63801 63341 63092 62899 62656 62566 63004 64032
65462 64032 65265 66367 67406 68522 69547 70210 70512 70627 70623 70531 70450 70304 69714 68500 67180 66542 66693 66942
65444 66942 66724 66313 66399 67202 68273 69121 69700 70175 70453 70270 69755 69511 69921 70632 71025 70994 70926 71041 71241 71492
65424 71492 71844 72047 71728 71100 70885 71292 71654 71467 71174 71398 71859 71746 70881 69828 69054 68657 68834 69825 71259
65405 71259 72191 72127 71593 71440 71899 72539 72873 72783 72564 72701 73436 74491 75414 76158 77045 78135 79080 79741 80528
65386 80528 81841 83568 85437 87556 90136 92910 95328 97343 99547 102491 106246 110645 115479 120284
65372 120284 124435 127878 131424 135815 140597 144492 146885 148416 149912 151251 151733 151169 150003 148449 146144
65357 146144 142780 138644 134342 130270 126546 123160 119994 116930 114121 111926 110391 109067 107602 106281
65343 106281 105699 106051 107059 108402 109911 111455 112989 114622 116255 117232 116808 115045 112869 111106 109823
65328 109823 108762 108006 107845 108220 108682 108882 108826 108702 108696 109022 109922 111513 113702 116322 119266 122437 125628
65311 125628 128522 130839 132453 133377 133639 133194 131958 129888 127040 123577 119757 115869 112100 108472 104951
65296 104951 101627 98753 96544 94941 93600 92163 90546 88953 87599 86507 85587 84819 84258 83873 83546
65281 83546 83133 82463 81365 79907 78599 78080 78500 79342 79895 79766 78988 77915 77139 77186 78030 79041 79572 79453
65263 79453 78819 77747 76315 74772 73327 71882 70281 68711 67508 66730 66223 66062 66440 67119 67441 67081
65247 67081 66474 66294 66746 67552 68330 68731 68407 67240 65623 64257 63615 63710 64382 65623 67459 69628 71581
65230 71581 72877 73524 73798 73889 73868 73910 74215 74620 74626 74019 73211 72735 72620 72559 72479 72580 72999 73804 75142 76866
65210 76866 78142 78081 76879 75758 75565 76012 76542 77268 78516 79940 80837 81117 81343 81870 82583 83453 84718
65193 84718 86383 88097 89763 91816 94570 97642 100409 102812 105346 108310 111356 113799 115221 115751 115849
65178 115849 115826 115574 114842 113700 112487 111268 109645 107280 104375 101396 98526 95643 92701 89823 87099
65163 87099 84547 82214 80132 78286 76897 76466 77148 78221 78726 78616 78652 79136 79410 78936 78181 77913 78137
65146 78137 78326 78332 78333 78148 77359 76105 75021 74292 73424 72152 70939 70308 70133 70009 69948 70254 70895 71365 71135
65127 71135 70121 68744 67608 66998 66749 66722 67165 68184 69065 68867 67781 67150 67855 69339 70615 71487 72197
65110 72197 72585 72463 72406 73239 74887 76571 78062 79914 82447 85311 88183 91175 94325 97374 100318 103555
65094 103555 107194 110814 114212 117819 121869 125692 128392 129874 130613 130721 129902 128293 126634 125417 124246
65079 124246 122297 119223 115483 111914 109107 107082 105482 104026 102716 101561 100253 98297 95503 92220
65065 92220 89078 86511 84519 82812 81143 79531 78191 77300 76872 76785 76827 76766 76468 75983 75489 75156 75018 74912
65047 74912 74553 73882 73294 73232 73426 72953 71336 69289 67994 67887 68519 69316 69912 70009 69598 69223 69358 69554 69014
65028 69014 68023 67880 69065 70468 71004 71124 71845 72946 73260 72525 71838 72127 73058 73755 73967 74048 74217 74321
65010 74321 74184 73835 73354 72651 71557 70181 69106 68988 69847 70972 71713 72166 72858 73995 75355 76751 78181
64993 78181 79536 80556 81145 81464 81654 81668 81356 80583 79373 78166 77776 78675 80348 81703 82124 81785 80981
64976 80981 79724 78175 76965 76638 76942 76981 76023 74021 71513 69238 67740 67131 67185 67674 68487 69378 69847
64959 69847 69548 68753 68184 68311 68954 69624 70149 70809 71891 73260 74506 75438 76253 77212 78302 79304 80018
64942 80018 80346 80320 80177 80194 80285 79984 79039 77802 76696 75547 73892 71847 70070 68852 67862 67023 67009 68352
64924 68352 70396 71743 71665 70664 69725 69423 69756 70342 70560 69889 68459 67145 66815 67456 68238 68415 67989 67455
64906 67455 67144 66988 66808 66596 66471 66476 66505 66385 66018 65479 64979 64626 64249 63568 62571 61629 61200 61514 62505 63893
64886 63893 65318 66567 67716 68869 69789 70086 69808 69424 69026 68027 66097 64067 63286 64144 65694 66725
64870 66725 66729 65873 64578 63397 62894 63328 64530 66145 67755 68817 68935 68321 67617 67090 66355 65124 63771
64853 63771 62861 62492 62492 62920 63827 64681 64695 63805 62914 63008 64314 66326 68284 69463 69421 68331 66936 65933
64835 65933 65459 65279 65344 65880 66964 68261 69320 70018 70645 71548 72735 73821 74367 74292 73962 73812 73914 73926
64817 73926 73482 72596 71668 71145 71159 71398 71304 70497 69113 67612 66237 64802 63187 61829 61361 61741 62125 61786
64799 61786 60908 60294 60490 61366 62414 63216 63754 64418 65525 66792 67498 67449 67397 68158 69528 70552 70695 70224
64781 70224 69555 68844 68330 68395 68937 69149 68385 67007 65993 65869 66381 67120 68104 69612 71545 73132 73411 72089
64763 72089 69867 67766 66269 65284 64696 64452 64229 63643 62953 63003 64146 65640 66404 66009 64751 63247 62287
64746 62287 62508 63627 64416 64091 63421 63790 65352 66903 67521 67529 67696 68252 69040 70035 71271 72565 73698 74600
64728 74600 75105 74818 73600 71985 70788 70383 70627 71357 72607 74263 75826 76685 76618 75936 75155 74595 74312
64711 74312 74344 74762 75414 75815 75572 74826 73985 73115 71927 70431 69082 68122 67145 65711 64145 63279 63452 64226
64693 64226 65123 66216 67701 69196 69931 69652 68990 68743 68991 69176 68907 68355 67873 67547 67311 67257 67569 68287
64675 68287 69301 70453 71458 71905 71665 71189 71099 71504 72010 72309 72447 72496 72416 72348 72656 73433 74243 74552 74207
64656 74207 73325 72053 70660 69587 69012 68501 67513 66167 65148 64898 65282 66082 67355 69033 70555 71311
64640 71311 71398 71550 72258 73246 73976 74468 75353 77170 79787 82526 84715 86116 87007 87920 89163 90551 91684
64623 91684 92465 93072 93432 93159 92301 91726 92294 93769 95055 95420 95019 94275 93401 92716 92790 93763 94853 95013
64605 95013 94003 92493 91256 90586 90447 90795 91606 92747 93958 95018 95973 97106 98550 99976 100890 101247
64589 101247 101461 101786 102064 102262 102795 103964 105356 106187 106093 105349 104521 104166 104528 105146 105050 103867 102531 102312
64571 102312 103269 104280 104597 104689 105320 106351 106884 106281 104777 103257 102603 103067 104130 105095 105825 106640 107647
64554 107647 108599 109522 110868 112743 114385 114872 114126 112846 111636 110557 109468 108427 107632 107121 106612 105672
64538 105672 104146 102356 100697 99105 97287 95463 94378 94285 94363 93498 91412 88698 86051 83852 82235
64523 82235 81071 80008 78929 78231 78239 78507 78208 77157 75947 75100 74644 74611 75343 77005 79141 81008 82138
64506 82138 82465 82202 81768 81518 81388 81006 80260 79398 78490 77261 75703 74444 74069 74380 74741 74890 74961 74899 74498
64487 74498 73999 74132 75297 77043 78559 79429 79715 79530 78876 77921 77163 77129 77866 78926 79964 81191 82925
64470 82925 84769 85739 85475 84853 84947 85749 86500 87031 87921 89337 90588 91219 91764 92820 93990 94583 94932 96070
64452 96070 98150 100121 101240 102065 103499 105515 107437 108987 110345 111442 112008 112298 113033 114390 115648
64437 115648 116149 116148 116310 116751 117067 117118 117263 117840 118833 120123 121796 124028 126868 130164 133547 136466 138515
64420 138515 139818 140930 142251 143733 145184 146632 148159 149579 150530 150834 150564 149795 148534 146964 145550
64405 145550 144709 144330 143738 142216 139600 136342 132931 129342 125178 120374 115576 111746 109444 108557 108623 109261
64389 109261 110291 111564 112794 113606 113841 113802 114009 114620 115163 115016 114071 112788 111656 110855 110435 110511 111002 111393
64371 111393 111151 110396 109855 110011 110616 111260 112140 113801 116209 118665 120761 122857 125265 127419 128508 128692
64355 128692 129026 130203 131993 133971 136133 138509 140822 143010 145603 148986 152583 155426 157385 159227
64341 159227 161542 164225 167091 170335 174122 178223 182443 187079 192678 199618 208230 218991 232117 247112
64327 247112 263109 279659 296926 315298 335224 357333 382143 409426 438248 467761 497551
64316 497551 526860 553891 576402 592906 602771 605315 599560 585305 564007 538062 509346 478799
64304 478799 447276 416184 387019 360521 336534 314632 294760 277305 262624 250469 239934
64293 239934 230107 220821 212690 206351 201746 198111 194591 190879 187395 184782 183124 181742 179932 177755
64279 177755 175768 174086 172133 169396 165955 162139 158093 153967 150141 146877 144007 141271 138751 136647
64265 136647 134873 133218 131731 130617 129957 129880 130731 132652 135161 137553 139531 140972 141389 140354 138437
64250 138437 136979 136725 137244 137828 138396 139283 140750 142976 145997 149279 151867 153466 155015 157602 161071
64235 161071 164177 165952 166425 166108 165337 164276 163170 162323 161897 161839 161996 162319 162910 163784 164657 165210 165606 166452
64217 166452 168178 170820 174537 179848 186935 195028 202988 210425 217897 226184 235765 246869 259503 273372
64203 273372 288194 304253 322364 343148 366576 392232 419751 448914 479553 511370 543582
64192 543582 574566 602068 623946 638724 645558 644059 634357 617210 593900 566029 535341 503404
64180 503404 471240 439404 408510 379517 353290 330004 309221 290543 273938 259408 246606
64169 246606 235084 224873 216508 210308 205728 201597 196976 191709 186266 181255 177039 173595 170647 168070
64155 168070 166206 165550 166054 166941 167362 167053 166252 165189 163915 162551 161443 160975 161225 161786 162018 161646 161100
64138 161100 161008 161320 161272 160315 158711 157003 155309 153517 151874 150901 150788 151276 152083 153130 154355 155588 156597
64121 156597 157095 156872 156194 155896 156662 158247 159774 160783 161615 162796 164406 166225 168150 170295 172797 175658
64105 175658 178760 182099 185970 190694 196068 201474 206712 212270 218355 224169 228857 232770 236884 241161
64091 241161 244616 247095 249844 253749 257957 261006 262762 264507 267545 272396 278954 286643 294565 302219
64077 302219 310083 318968 328853 338867 348340 357190 365161 371321 374708 375148 373114 369082 363380 356499
64063 356499 349129 341694 334078 325980 317504 309262 301864 295490 290100 285939 283532 283131 284344 286435
64049 286435 288834 291341 294008 296923 300008 302986 305599 307840 309757 311152 311727 311546 310980 310138 308715
64034 308715 306534 303901 301268 298875 296901 295633 295255 295683 296702 297978 298925 299157 299279 300546 303307
64019 303307 306399 308758 311080 315063 321299 328788 336400 343933 351681 359794 368365 377535 387194 397051
64005 397051 407189 418121 430130 442962 456374 470479 485350 500763 516616 533215 550837
63994 550837 569470 589350 611272 635866 662829 691467 721811 754582 790046 827512 866253
63983 866253 906569 949659 996682 1048316 1105120 1167929 1237719 1315388 1402049 1499516 1610205
63972 1610205 1736479 1880436 2044465 2231803 2446398 2692580 2975010 3298205 3665248
63963 3665248 4076839 4531982 5029252 5566681 6140524 6745055 7373742 8019660 8674089
63954 8674089 9325124 9958169 10557513 11107449 11593145 12001967 12324551 12554483 12687238
63945 12687238 12719772 12650806 12480976 12212924 11851954 11406701 10888844 10312197 9691991 9044093
63935 9044093 8383466 7722726 7072242 6441220 5837863 5268495 4737390 4247814 3802593
63926 3802593 3403273 3049245 2738096 2466487 2230498 2025837 1848549 1695490 1563753
63917 1563753 1449901 1350252 1261825 1182683 1111516 1047350 989528 937461 890308 847160 807485
63906 807485 770988 737093 705005 674317 645111 617336 590557 564513 539487 515806 493309
63895 493309 471715 451256 432460 415413 399632 384679 370481 357038 344261 332298 321638
63884 321638 312554 304633 297151 289828 282920 276616 270692 264875 259293 254356 250250 246700 243263 239765
63870 239765 236420 233487 230892 228308 225662 223346 221686 220331 218621 216585 215150 215037 215769 216221 215921
63855 215921 215359 215038 214787 214167 213063 211524 209401 206592 203460 200603 198166 195702 192744 189282 185649
63840 185649 182161 178948 175949 173021 170148 167560 165474 163728 161845 159510 156820 154073 151500 149264
63826 149264 147477 146073 144827 143591 142338 140936 139178 137183 135514 134595 134172 133661 132892 132178 131659 131002
63810 131002 129854 128353 126982 126081 125642 125495 125590 126071 127063 128301 129123 129084 128586 128557 129392 130433 130709 129916
63792 129916 128415 126546 124427 122403 121139 120952 121330 121459 121136 120838 120891 120924 120312 118947 117316 115935 114988
63775 114988 114489 114430 114635 114701 114374 113896 113790 114306 115179 115873 115942 115287 114265 113501 113347 113530 113497 113102 112732 112798
63755 112798 113367 114275 115304 116100 116322 116092 116072 116774 117920 118764 119000 119122 119874 121537 123750 125893 127605
63738 127605 129058 130757 133059 135941 139208 142741 146404 149937 153135 155996 158531 160519 161750 162380
63724 162380 162795 163156 163368 163406 163364 163187 162749 162246 162147 162621 163314 163903 164523 165408 166405 167153 167564 167770 167715 167134
63704 167134 165858 163896 161327 158440 155869 154170 153235 152475 151617 150933 150589 150253 149575 148675 147883 147291 146872
63687 146872 146750 146952 147203 147365 147867 149165 150959 152612 154287 156881 160617 164389 166915 168035 168413 168430
63671 168430 168002 167222 166477 165943 165386 164521 163232 161527 159590 157820 156450 155222 153753 152118 150717 149742
63655 149742 149283 149793 151764 154889 158151 160921 163397 165841 168059 169958 172085 175160 179501 185209 192387
63640 192387 200729 209395 217840 226414 235645 245353 255087 265121 276232 288713 302192 316254 330461
63627 330461 343862 355350 364711 372583 379162 383580 384927 383430 380261 376610 373226 370479 368325 366357
63613 366357 364199 361901 359830 358230 356870 354927 351349 345652 338393 330526 322363 313643 304616 296409
63599 296409 290025 285445 282050 279516 277912 277308 277689 278978 280811 282577 284051 285739 288290 291831 296153
63584 296153 301026 305906 309839 312447 314664 317733 321625 325343 328721 332936 339012 346705 355292 364584
63570 364584 374566 384687 394391 403898 413638 423041 430715 435803 438409 438636 436036 430483 423011 415243
63556 415243 408216 402194 397311 393875 392041 391587 391975 392322 391396 388220 382841 376218 369198 361916 354301
63541 354301 346635 339242 331953 324445 316950 310065 303852 297688 291164 284692 278898 273715 268420 262473
63527 262473 256027 249652 243767 238304 232866 227277 222018 217963 215524 214229 213245 212078 210566 208519
63513 208519 205861 203057 200923 199832 199464 199431 199791 200647 201590 201962 201576 200832 200111 199512 199252 199936 202058
63496 202058 205384 209162 212919 216810 221204 226202 231584 236945 241722 245390 247940 250013 252245 254506
63482 254506 256078 256612 256593 256733 257217 257789 258409 259471 261337 263917 266856 270020 273639 277984 283015 288348
63466 288348 293459 297891 301372 303912 305785 307318 308650 309762 310729 311819 313345 315553 318644 322721
63452 322721 327600 332869 338302 344073 350487 357704 365863 375243 386024 398147 411698 427170 444886
63439 444886 464274 484245 504239 524259 543732 561008 574490 583905 589996 593189 593161 589752 583792
63426 583792 576695 569424 562152 554891 548152 542631 538365 534525 530171 524830 518115 509302 497957 484833
63412 484833 471413 458454 445546 432316 419443 408101 398803 391207 384736 379037 374118 370368 368199
63399 368199 367400 367160 367034 367532 369432 372940 378053 385269 395106 406993 419445 431492 443367 455628
63385 455628 468210 480637 492690 504402 515647 526152 535940 545523 555462 565694 575303 583096
63373 583096 588537 591963 593730 593459 590501 585055 578377 571798 565892 560595 555735 551241 547155 543661
63359 543661 540860 538310 534930 529629 522095 512973 503338 493930 484766 475441 465926 456959 449459 443627
63345 443627 438873 434546 430460 426679 423164 419745 416235 412461 408342 403940 399205 393726 387135 379783
63331 379783 372616 366220 360354 354638 349295 344908 341765 339862 339288 340063 341631 343114 344261 345872 348999
63316 348999 353866 359722 365607 371031 375933 380209 383391 384733 383604 379934 374414 368154 361924 355704
63302 355704 349084 341996 334811 327787 320854 314099 308083 303302 299596 296419 293508 290885 288408 285797
63288 285797 283084 280609 278503 276578 274800 273508 272963 272907 272745 272112 271232 270736 270954 271263 270526 268483 266339
63271 266339 265405 265529 265619 265497 266193 268329 271266 274235 277349 280910 284504 287534 290083 292520 294742 296572
63255 296572 298478 301149 304646 308659 313283 318715 324536 330186 336036 343017 351205 359746 368328 377732
63241 377732 388544 400245 412123 424419 437929 453034 469695 488000 508036 529399 551384
63230 551384 573605 596057 618766 641704 664887 688120 710812 732498 753522 774789 796833
63219 796833 819464 842338 865484 889185 913624 938818 964608 990431 1015116 1037045 1054617
63208 1054617 1066676 1072621 1072151 1064982 1050957 1030527 1004924 975668 944021 911069 878099 846433
63196 846433 816809 789243 763647 740337 719834 702453 688323 677611 670395 666356 664852 665363
63184 665363 667739 672003 678103 685938 695429 706397 718444 731173 744525 758738 773822 789188
63172 789188 803990 817859 831195 844670 858527 872382 885584 897634 908328 917599 925256 930868
63160 930868 933971 934468 932668 928755 922379 913053 900888 886642 871065 854628 837958 822008 807362
63147 807362 793749 780807 769153 760094 754241 750944 749182 748408 748295 748255 747816 747154 746670 746107 744514
63132 744514 741055 735471 727849 718511 708314 698571 690215 683152 676650 670285 664266 658936 654287 650129
63118 650129 646599 644249 643466 643929 644868 645908 647407 649764 652683 655434 657749 660080 662920 666182 669328
63103 669328 671826 673407 674133 674393 674642 675009 675349 675723 676554 678051 679730 680782 680944 680754 680976 681908 683255
63086 683255 684578 685773 687105 688726 690312 691382 692024 693054 695316 698967 703511 708380 713371 718687
63072 718687 724683 731389 738258 744627 750621 757305 765709 775944 787556 800446 814966 831243 848995
63059 848995 868118 889022 912126 937292 964035 992169 1022083 1054393 1089424 1127017 1166781
63048 1166781 1208511 1252207 1297579 1343690 1389354 1433880 1477263 1519684 1561035 1600938 1639006
63037 1639006 1675118 1709700 1743755 1778259 1813387 1848431 1882470 1914755 1944416 1970270 1991289
63026 1991289 2006894 2016377 2018245 2010628 1992377 1963531 1924900 1877735 1823768 1764938 1702685 1637787
63014 1637787 1571233 1504997 1441539 1382521 1328280 1278593 1233698 1194451 1161544 1134718 1112833
63003 1112833 1094856 1080804 1071543 1067635 1068586 1073357 1081249 1091984 1105241 1120637 1138063 1157442
62991 1157442 1178020 1198497 1218120 1237206 1256229 1274852 1292324 1308441 1323486 1337347 1349273
62980 1349273 1358479 1364429 1366451 1363561 1354918 1340172 1319346 1292721 1260957 1224911 1185144 1141933
62968 1141933 1095916 1048362 1000550 953210 906858 862358 820696 782281 746777 713619 682511
62957 682511 653504 626830 602661 580917 561290 543552 527710 513837 501875 491621 482661 474293
62945 474293 465835 457207 448968 441604 435069 429180 424031 419615 415431 410987 406544 402766 399701 396649
62931 396649 393129 389428 386000 382707 379013 374761 370511 367107 364922 363419 361471 358313 354234 350204
62917 350204 346892 344227 341808 339408 337027 334812 333052 331951 331239 330240 328582 326663 325228 324657 324858
62902 324858 325682 327011 328475 329418 329409 328636 327616 326579 325363 323885 322458 321454 320835 320249 319549 318913 318472
62885 318472 318092 317665 317285 317044 316921 317079 317949 319644 321550 322878 323510 323948 324525 325150 325833 326963 328844
62868 328844 331264 333674 335619 336895 337594 338122 338950 340138 341229 341726 341497 340630 339116 336957 334485 332296
62852 332296 330771 329729 328581 326857 324577 322150 319962 318184 316886 316040 315243 313826 311628 309477 308486
62837 308486 308876 309967 311270 312996 315282 317529 319008 319826 320805 322461 324519 326392 327811 328900 329898
62822 329898 330963 332110 333221 334184 335148 336588 339067 342816 347520 352553 357456 362207 366980 371788 376491
62807 376491 381131 386054 391680 398289 406022 414887 424663 434987 445710 457101 469595 483432 498685
62794 498685 515589 534639 556269 580507 607120 636140 668107 703688 743195 786671 834407
62783 834407 887008 944840 1007631 1074747 1145544 1219265 1294906 1371485 1448239 1524140 1597299
62772 1597299 1665189 1725377 1775885 1815185 1842409 1857503 1860707 1851829 1830418 1796642 1751625 1696943
62760 1696943 1634282 1565634 1493203 1418820 1343679 1268786 1195306 1124309 1056455 992070 931290
62749 931290 874139 820808 771822 727495 687268 650165 615980 585313 558271 533936 511518
62738 511518 491269 473611 457995 443440 429800 417694 407380 398508 390883 384708 379975 376251
62726 376251 373222 370927 369336 368221 367621 367970 369513 371945 374960 378863 384315 391577 400254 409758 419863
62711 419863 430808 443004 456762 472289 489837 509690 532065 557171 585343 616799 651228
62700 651228 687923 726519 767292 810509 855764 902180 948924 995087 1039300 1079952 1115809
62689 1115809 1146087 1170025 1186754 1195594 1196157 1188208 1171775 1147431 1116266 1079600 1038873 995587
62677 995587 950963 905711 860417 815997 773398 732935 694445 658051 624350 593746 566077
62666 566077 540971 518173 497370 478166 460466 444540 430452 417691 405619 394075 383257
62655 383257 373214 363749 354736 346293 338586 331606 325197 319306 314130 309850 306157 302375 298286 294618
62641 294618 292270 291135 290189 288736 287038 285584 284318 282967 281699 280966 280805 280665 279903 278280 276126
62626 276126 274218 273334 273681 274822 276339 278366 281278 284992 288899 292476 295739 299081 302870 307222 312011
62611 312011 317103 322625 328969 336434 344982 354537 365446 378413 393905 411783 431616 453272 477131
62598 477131 503753 533417 565995 601194 638815 678599 719776 760880 800305 837130 871250
62587 871250 902450 929420 950039 962828 967922 966359 958665 944636 924486 899572 871620 841627
62575 841627 809866 776583 742154 706821 671014 635961 603301 573798 546910 521879 498772
62564 498772 478084 459684 442795 426935 412431 399875 389362 380348 372077 364034 356143 348672
62552 348672 341948 336109 331090 326759 322969 319455 315815 311784 307565 303775 300908 298904 297475 296769
62538 296769 297374 299468 302279 304772 306726 308774 311494 314904 318922 323848 330115 337786 346652 356748
62524 356748 368519 382404 398329 415749 434270 454177 476180 500587 527018 555096 585026
62513 585026 617044 650442 683684 715529 745618 773885 799849 822622 841199 854569 861918 863029
62501 863029 858244 847925 832272 811768 787389 760128 730695 699915 668982 638843 609682 581433
62489 581433 554542 529756 507425 487485 469930 454720 441403 429416 418757 409755 402104 394791
62477 394791 387176 379648 372906 367155 362422 359164 357851 358076 358736 359169 359658 360657 362014 363329 364786
62462 364786 367130 370843 375721 381370 387760 395032 402907 410685 417881 424697 431739 439308 446931 453521
62448 453521 458069 460375 461129 461133 460393 458098 453472 446530 438054 429075 420418 412391 404693 396769 388487
62433 388487 380393 373202 367147 362036 357841 354959 353786 354160 355357 356630 357761 359065 360883 363254
62419 363254 366110 369621 374066 379380 385186 391326 398076 405662 413834 422118 430328 438566 446839 454925
62405 454925 462599 469848 476861 483871 490912 497699 503851 509321 514390 519128 523061 525630 526854 527331
62391 527331 527675 528157 528883 530045 531945 534806 538587 543031 548071 554218 562281 572576 584678 598125
62377 598125 613114 630173 649351 670159 692273 715965 741790 770081 800702 832989 865944
62366 865944 898721 930985 962602 992977 1020915 1045192 1065075 1080359 1091182 1097841 1100476 1098819
62354 1098819 1092461 1081511 1066817 1049375 1029627 1007417 982523 955146 926001 896061 866189
62343 866189 836939 808700 781953 757244 734894 714816 696703 680329 665691 652856 641703
62332 641703 631811 622759 614567 607668 602280 597946 593929 590001 586636 584481 583835 584589 586315 588410 590448
62317 590448 592570 595347 599125 603608 608166 612380 616163 619532 622478 625065 627536 630278 633674 637936
62303 637936 642998 648531 654075 659296 664262 669489 675464 682018 688323 693659 697975 701514 704167 705642
62289 705642 706158 706517 707368 708737 710386 712289 714596 717449 721142 726263 733420 742874 754574 768394
62275 768394 784063 800984 818506 836606 856216 878653 904652 933949 965773 999511 1034659
62264 1034659 1070215 1104555 1136221 1164604 1189583 1210749 1227442 1239437 1247017 1250255 1248757 1242460
62252 1242460 1232254 1219330 1204042 1185838 1164315 1140036 1114279 1088283 1062882 1038651 1016082
62241 1016082 995490 976909 960269 945712 933543 923750 915781 909016 903352 899078 896272 894685 894191
62228 894191 894947 896976 899986 903745 908269 913359 918263 922215 925153 927535 929563 930963 931502 931335 930702
62213 930702 929613 928082 926539 925738 926193 927829 930308 933636 938246 944404 951749 959647 967906 976817 986527
62198 986527 996774 1007364 1018557 1030699 1043753 1057458 1071740 1086634 1101943 1117309 1132569
62187 1132569 1147702 1162507 1176681 1190343 1204231 1219244 1235857 1254016 1273458 1294043 1315793
62176 1315793 1338602 1362016 1385482 1408808 1431984 1454326 1474178 1489952 1501368 1509256 1514282 1516428
62164 1516428 1515681 1512610 1507909 1501739 1493829 1483954 1472102 1458431 1443392 1427673 1411750 1395605 1379137
62151 1379137 1362656 1346731 1331690 1317621 1304723 1293281 1283230 1274094 1265456 1257251 1249477 1241834
62139 1241834 1233842 1225261 1216329 1207624 1199709 1192812 1186739 1181131 1175795 1170761 1166084 1161751 1157744 1154078
62125 1154078 1150813 1148168 1146576 1146327 1147127 1148368 1150056 1153198 1158778 1166396 1174220 1180365 1184014 1185152
62111 1185152 1183670 1179279 1172356 1164462 1157674 1153206 1150635 1148361 1144758 1138938 1130678 1120024 1107317
62098 1107317 1093483 1079806 1067109 1055290 1043940 1033239 1023884 1016239 1010042 1005154 1002112 1001576 1003437
62085 1003437 1006877 1011207 1016259 1022092 1028771 1036547 1045732 1056155 1067061 1077884 1088811 1100223 1111758
62072 1111758 1122337 1131051 1137591 1141831 1143463 1142238 1138304 1132021 1123581 1112952 1100136 1085387 1069253
62059 1069253 1052351 1034877 1016338 996029 973918 950815 927601 904639 882142 860690 840893
62048 840893 822659 805262 788171 771500 755680 741060 727819 715802 704323 692531 680290
62037 680290 668476 658137 649474 641853 634654 627781 621402 615474 609665 603632 597316 590936 584711 578612
62023 578612 572492 566437 560780 555660 550750 545673 540600 536178 532837 530422 528619 527514 527375 527871 527925
62008 527925 526756 524981 524190 525204 527039 527929 527120 525237 523094 520781 518092 515175 512235 508960 504863
61993 504863 500203 496056 493245 491447 489622 487241 484848 483356 483000 483221 483562 484283 485883 488337 491245
61978 491245 494531 498394 502594 506439 509765 513355 517996 523584 529553 535776 542491 549708 557293 565397
61964 565397 574124 582973 591313 599365 607945 617184 626330 635099 644521 655925 669615 685070 702012
61951 702012 720613 740869 762378 784750 807804 831431 855698 881151 908536 938033 969009
61940 969009 1000716 1033016 1066304 1100978 1137167 1174881 1214111 1254788 1296866 1340571 1386538
61929 1386538 1435665 1488894 1547126 1611258 1682206 1760984 1848810 1946994 2056525 2177840 2311297
61918 2311297 2457891 2619163 2796238 2989169 3197428 3420604 3657998 3907414 4164784
61909 4164784 4425020 4682750 4931702 5163580 5368207 5535338 5656672 5726526 5741424 5700036
61899 5700036 5604034 5458711 5272163 5053528 4811853 4555994 4294387 4034178 3780567 3537146
61889 3537146 3306472 3090097 2888572 2702081 2530981 2375312 2234060 2105526 1988473
61880 1988473 1882469 1787196 1702008 1626165 1558924 1499211 1445758 1397771 1355083 1317428 1284029
61869 1284029 1254124 1227553 1204572 1185409 1170224 1159081 1151723 1147675 1146791 1149277 1154901 1162647 1171594
61856 1171594 1181716 1193333 1206091 1219143 1232089 1245057 1257874 1269908 1280880 1291253 1301493
61845 1301493 1311409 1320610 1329369 1338503 1348442 1358796 1368961 1378927 1389170 1399805 1410064 1418735 1424906
61832 1424906 1428206 1428597 1426351 1422153 1416756 1410344 1402589 1393556 1384189 1375582 1368051 1361357 1355737 1352256
61818 1352256 1352067 1355590 1362510 1372379 1385127 1401169 1421099 1445190 1473172 1504551 1539180 1577465
61806 1577465 1620050 1667379 1719481 1776145 1837324 1903515 1975733 2055070 2142317 2238023 2342889
61795 2342889 2458096 2585302 2726269 2882323 3054219 3242692 3449166 3675726 3924363
61786 3924363 4196560 4493643 4817078 5167933 5546020 5949559 6375303 6818396 7271856
61777 7271856 7726050 8168458 8583866 8955317 9265808 9500123 9646189 9696039 9646695 9500699
61767 9500699 9265888 8954469 8581657 8163981 7717500 7256614 6793750 6339311 5901280
61758 5901280 5484896 5093141 4727791 4390061 4080480 3798494 3542454 3310127 3099341
61749 3099341 2908256 2735117 2578047 2435326 2305733 2188250 2081465 1983767 1894164 1812350
61739 1812350 1737750 1669079 1605238 1546184 1492341 1443487 1398790 1357651 1319833 1284773 1251455
61728 1251455 1219216 1188390 1159951 1134628 1112335 1092187 1073124 1054659 1037001 1020356 1004416
61717 1004416 988779 973575 959233 945820 933051 920782 908957 897064 884256 870217 855594
61706 855594 841407 828248 816143 804877 794288 784345 775057 766306 757951 750166 743464 738139 733884
61693 733884 730283 727488 726054 726244 727814 730351 733379 736184 737976 738285 736931 733693 728274 720529 710410
61678 710410 697938 683617 668688 654444 641330 629158 617992 608286 600292 594024 589756 587827
61666 587827 587856 588882 590444 592887 596360 600140 603235 605003 604869 602055 596196 587859 578055 567541 556937
61651 556937 547040 538460 531099 524394 517975 511808 505910 500277 495048 490503 486920 484425 482750 481142
61637 481142 478858 475867 472754 469913 467287 464948 463303 462403 461617 460449 459266 458788 459170 460051 461149
61622 461149 462336 463359 464006 464383 464629 464496 463651 462227 460647 458960 456784 453915 450686 447720 445535
61607 445535 444350 444043 444356 445257 446933 449357 452126 454914 457722 460470 462740 464411 466190 468900 472395
61592 472395 475769 478647 481734 485969 491606 498298 505709 513753 522406 531514 540859 550439 560675 572197
61578 572197 585279 599589 614642 630376 647191 665570 685915 708574 733781 761547 791658
61567 791658 823618 856492 889066 920335 949633 976143 998692 1016396 1029253 1037707 1041972 1042278
61555 1042278 1039603 1035454 1030822 1025863 1020753 1016390 1013905 1013711 1015244 1017567 1020021 1022385 1024555 1026231
61541 1026231 1027025 1026787 1025643 1023634 1020559 1016295 1011092 1005428 999718 994283 989303 984644 979989 975372
61527 975372 971383 968730 967888 969299 973449 980393 989660 1001085 1015367 1033348 1055148 1080613 1110227
61514 1110227 1144786 1184342 1228297 1276540 1329743 1388419 1452480 1521930 1597254 1678713 1765858
61503 1765858 1858277 1956478 2061496 2173746 2292563 2416564 2544001 2672641 2799644 2921827
61493 2921827 3036218 3140425 3232464 3310351 3372248 3417254 3445888 3459574 3459920 3448835 3428960
61482 3428960 3403267 3374191 3343569 3313199 3284620 3258057 3232189 3205235 3175790 3142435 3103282
61471 3103282 3056629 3001959 2939912 2871542 2798032 2721053 2642923 2566196 2493160 2425635 2365019
61460 2365019 2312308 2267938 2231622 2202631 2180468 2165147 2156526 2153655 2155269 2160920 2171087 2186121
61448 2186121 2205639 2229156 2256781 2288955 2325938 2367962 2415549 2469188 2528601 2592371 2657959
61437 2657959 2721862 2780149 2829392 2867367 2893053 2906390 2908314 2900817 2886616 2868638 2849580 2831418
61425 2831418 2815080 2800816 2789030 2780515 2775895 2775448 2779733 2789660 2805081 2823388 2840073 2850754
61413 2850754 2852501 2843713 2823688 2792713 2752248 2704670 2652847 2599706 2547725 2498500 2452859 2411313
61401 2411313 2374171 2341211 2311665 2284816 2260537 2239150 2220877 2205659 2193493 2184761 2180109 2180064
61389 2180064 2184902 2194935 2210804 2233325 2263115 2300535 2345973 2399933 2462804 2534714 2615655
61378 2615655 2705476 2803574 2908773 3019720 3135334 3254682 3376420 3498396 3617621 3730492
61368 3730492 3833136 3921841 3993424 4045485 4076598 4086343 4075021 4043323 3992386 3924108 3841082
61357 3841082 3746038 3641378 3529199 3411413 3289748 3165894 3041769 2919375 2800232 2685170
61347 2685170 2574869 2470307 2372468 2281869 2198665 2123001 2054965 1994307 1940572 1893479 1852956
61336 1852956 1818894 1791008 1768962 1752495 1741551 1736331 1736979 1743062 1753639 1768094 1786630 1809606
61324 1809606 1836625 1866616 1898569 1931639 1964598 1995737 2023552 2047270 2066710 2082021 2093704
61313 2093704 2102583 2109547 2115436 2121123 2127363 2134429 2142202 2150695 2160176 2170535 2180967 2190672 2199694
61300 2199694 2208533 2217048 2224304 2229683 2233651 2236953 2239360 2239737 2237323 2232405 2225612 2217089 2206752 2194938
61286 2194938 2182263 2168998 2155212 2141589 2129527 2120141 2113548 2109355 2107484 2108009 2110277 2112582 2112830
61273 2112830 2109487 2102032 2090772 2076263 2058813 2038528 2015854 1991946 1968358 1946354 1926510 1908906
61261 1908906 1893654 1881298 1872756 1868799 1869660 1875285 1885898 1902031 1924034 1951869 1985544 2025485
61249 2025485 2072466 2127406 2191292 2264830 2347919 2439565 2538251 2641799 2746489 2846725 2936106
61238 2936106 3008885 3060614 3088290 3090874 3069704 3027921 2969434 2898560 2820058 2738484 2657179
61227 2657179 2578289 2503818 2436167 2377480 2328949 2291043 2264010 2247667 2240627 2239833 2240752 2238229
61215 2238229 2227878 2207497 2177536 2140218 2098051 2052904 2006059 1958687 1912047 1867232 1824942
61204 1824942 1785692 1750138 1718873 1691783 1667951 1646426 1626815 1608765 1591211 1572741 1552774
61193 1552774 1531853 1510603 1488903 1466376 1443299 1420470 1398295 1376504 1354840 1333624 1313401
61182 1313401 1294327 1276262 1259252 1243503 1228919 1215163 1202302 1190916 1181266 1172792 1164913 1157944
61170 1157944 1152611 1148916 1146105 1143582 1140944 1137064 1130167 1119275 1104854 1087543 1066981 1042615 1015159
61157 1015159 986436 958015 930567 904271 879127 854947 831698 809883 790134 772538 756760
61146 756760 742596 729815 717643 705129 692124 679402 667790 657720 649561 643733 640181 638268
61134 638268 637400 637467 638556 640639 643758 648181 654117 661502 670232 680419 692252 705665 720152 734745
61120 734745 748223 759553 768212 774070 777149 777620 775847 772235 767280 761865 757111 753515 750575 747704
61106 747704 745146 743474 742516 741484 739998 738216 736025 732829 728326 722921 717200 711394 705419 699141
61092 699141 692559 686057 680350 675772 671800 667687 663394 659412 655958 652926 650401 648540 647130 645980
61078 645980 645534 646331 648037 649912 652013 655012 658917 663085 667560 673231 680420 688371 696485 705061 714410
61063 714410 724149 733828 743439 752911 761915 770470 778956 787246 794769 801720 809133 817251 824910 831217
61049 831217 836940 843475 851257 859863 868987 878655 889109 901065 915453 932455 951425 972119 995134
61036 995134 1020879 1049134 1080035 1114345 1152236 1193043 1236868 1285148 1338847 1397277 1459444
61025 1459444 1525104 1593678 1663810 1735365 1810506 1891537 1979163 2074192 2179236 2296893 2427734
61014 2427734 2572028 2732124 2911456 3113186 3342454 3608390 3921281 4289306 4721111
61005 4721111 5230017 5832815 6547379 7396574 8412797 9634006 11099718 12858339 14964621
60996 14964621 17429981 20141766 22837293 25193601 26975008 28111644 28662241 28745165
60988 28745165 28529051 28252209 28166483 28393124 28818286 29148221 29083434 28455636 27237468
60979 27237468 25482471 23293761 20831621 18299184 15883601 13701491 11794616 10161169
60971 10161169 8781500 7626544 6663483 5863641 5203985 4662152 4215040 3842923 3531127
60962 3531127 3267111 3039215 2838924 2661480 2503321 2360862 2231828 2115320 2009944
60953 2009944 1913682 1825739 1746437 1674961 1609079 1547310 1489467 1434907 1382379 1332058 1285718
60942 1285718 1244286 1207062 1173870 1145909 1123504 1104839 1088066 1073225 1060924 1050470 1040475
60931 1040475 1030311 1019921 1009150 998241 988108 979169 970637 961779 953016 944934 937000 928204 918355
60918 918355 907854 896683 884487 871250 857222 842541 827617 813437 800840 789724 779435
60907 779435 769676 760632 752510 745195 738073 730163 721055 711859 704367 699021 694511 689743 685187 681718
60893 681718 679088 676466 673773 671573 670071 669055 668487 668466 668910 669808 671397 673551 675476 676644 677582 679022
60877 679022 680633 681247 680137 677571 674436 671759 670113 668929 666832 663288 659483 656927 655645 654538
60863 654538 653189 652389 652966 654805 657004 658463 658405 656884 654793 653047 651898 651267 651224 651645 651797 650828 648355
60846 648355 644117 637600 628697 618239 607185 595751 584090 573228 564233 556844 550069 543947 539534
60833 539534 537189 536042 535230 534592 534030 533374 533149 534320 536808 539291 540967 542566 544939 547610 549567
60818 549567 550814 552180 554024 556000 557964 560248 562982 565722 567909 569456 570815 572557 574753 576692
60804 576692 577499 577149 576587 576608 576987 576974 576303 575291 574214 573060 571830 570631 569410 567859 565699 562895
60788 562895 559539 555597 550896 545383 539446 533838 529144 525335 521984 518841 516012 513659 511756 510079
60774 510079 508288 506115 503724 501757 500707 500360 500143 499839 499575 499341 499105 499230 500071 501188 501734 501727 502133
60757 502133 503484 505274 507137 509700 513539 517939 521505 523603 524436 524132 522671 520555 518604 516960 514961
60742 514961 512209 509135 506343 503880 501433 498832 496079 493200 490305 487556 484916 482131 479152 476315
60728 476315 473916 471711 469101 465738 461830 457865 454160 450692 447235 443550 439447 434802 429731 424796
60714 424796 420777 418034 416181 414502 412592 410509 408526 406979 406173 406106 406300 406257 406100 406411 407380 408477
60698 408477 409214 409864 411089 413047 415325 417663 420260 423209 426136 428738 431373 434565 438064 440990 443061
60683 443061 445147 448299 452638 457563 462616 467487 471472 473801 474725 475631 477646 480541 483312 485450 487208
60668 487208 488886 490396 491527 492271 492858 493622 494798 496232 497388 497935 498249 499093 500743 502688 504218 505050
60652 505050 505306 505128 504486 503267 501325 498454 494448 489248 483048 476262 469477 463455 459058 456822 456378
60637 456378 456424 455619 453620 451120 448846 446803 444579 442080 439616 437346 435025 432392 429610 427138 425244
60622 425244 423741 422218 420388 418149 415471 412468 409614 407562 406501 405919 405248 404595 404424 404700 404855 404681
60606 404681 404718 405554 407197 409375 412024 415055 418004 420375 422178 423705 424938 425573 425494 424849 423778 422505
60590 422505 421602 421626 422418 423201 423506 423617 423983 424671 425625 427013 428878 430746 432054 432853 433705 434974 436666
60573 436666 438927 442077 445957 449753 452910 455858 459360 463374 467147 470278 472985 475300 476857 477826
60559 477826 479315 482137 485733 489045 492055 495588 499836 504112 508146 512650 518310 525089 532978 542650
60545 542650 554816 569487 586486 606162 629010 655020 684084 716717 753747 795578 842333
60534 842333 894353 951540 1012119 1072725 1129849 1180663 1222505 1252429 1267890 1267767 1252641 1224408
60522 1224408 1185706 1139381 1088187 1034921 982532 933592 889650 851405 819430 794304 776018
60511 776018 763721 756221 752487 751839 754265 760678 772272 789371 811253 837288 867841 903800 945637
60498 945637 993087 1045204 1100183 1155309 1207461 1253651 1291022 1316912 1329522 1328651 1315671 1293082
60486 1293082 1264292 1233326 1203978 1179028 1160372 1149699 1148552 1157823 1177705 1208318 1249968 1302543
60474 1302543 1364946 1435325 1511404 1589931 1665702 1731772 1781285 1809405 1813746 1793652 1749877
60463 1749877 1685108 1604042 1512217 1414695 1315856 1219851 1130278 1049086 976250 910844 852322
60452 852322 800693 755912 717495 684643 656438 631982 610701 592622 578177 567516 559948 554154
60440 554154 549010 544220 540141 537150 535347 534717 535142 536137 536973 537381 537838 538753 539589 539254 537256 534045
60424 534045 530316 526487 522870 519749 517103 514695 512674 511725 512341 514332 517303 521281 526496 532717 539241
60409 539241 545508 551565 557949 565237 573661 583059 593290 604668 617810 633068 650312 669201 689253
60396 689253 709563 728981 746913 763614 779333 793438 804835 813150 819133 823962 828429 832724
60384 832724 836614 839687 841677 842715 843312 844016 845052 846175 846866 846762 845938 844685 843131 841302 839464
60369 839464 838018 836970 835882 834541 833384 833104 834040 835988 838232 839648 839314 837393 835048 833154 831526
60354 831526 829845 828823 829564 831977 834620 836256 836872 836853 835851 833046 828334 822674 817060 811383 804577
60339 804577 795973 786360 777430 770268 764647 759825 755477 751515 747528 743050 738233 733609 729155 724135
60325 724135 717998 710987 703724 696594 689790 683621 678426 674205 670505 666685 662429 658128 654637 652423
60311 652423 651106 650178 649952 651255 654184 657861 661675 666246 672756 681709 692765 705487 719639 734767
60297 734767 749844 763397 773810 779687 780340 776037 767602 755816 741365 725310 709201 694484
60285 694484 681869 671335 662622 655632 650495 647392 646432 647589 650633 654972 659636 663721 667078 670520
60271 670520 675185 681629 689559 698269 707175 716011 724802 733764 743099 752823 762927 773749 785918
60258 785918 799715 814612 829697 844564 859516 874865 890296 905091 918790 931375 943001
60247 943001 953961 964981 977170 991374 1007655 1025625 1045194 1066739 1090608 1116752 1145011
60236 1145011 1175545 1208816 1245326 1285604 1330312 1379951 1434402 1493099 1555835 1623050 1694996
60225 1694996 1770881 1849343 1929628 2011664 2094882 2177563 2257720 2334115 2406012 2472427 2532315
60214 2532315 2585227 2631083 2669386 2699435 2721350 2736078 2744062 2744717 2737801 2724812 2708290 2689975
60202 2689975 2670296 2649583 2629094 2610600 2595445 2584292 2577588 2576021 2580597 2592456 2612541 2641286
60190 2641286 2678532 2723686 2776008 2834825 2899539 2969388 3043117 3118858 3194328 3267118 3334909
60179 3334909 3395638 3447557 3489101 3518752 3535186 3537599 3525764 3499835 3460296 3408095 3344528
60168 3344528 3270907 3188661 3099926 3007776 2915644 2826580 2743037 2666992 2599988 2543163 2497354
60157 2497354 2462999 2439926 2427598 2425735 2434310 2452630 2478754 2510197 2544934 2581310 2617230 2649951
60145 2649951 2676783 2695804 2706166 2708165 2702939 2691592 2674412 2651135 2621939 2588075 2551698 2515330
60133 2515330 2481271 2451149 2426024 2407140 2396250 2394757 2402803 2419816 2445953 2482382 2530195 2589818
60121 2589818 2661779 2747304 2847588 2962791 3092264 3235539 3392543 3562864 3745137 3937162
60111 3937162 4136250 4339292 4542673 4742408 4934551 5115552 5282247 5431526 5560123
60102 5560123 5664900 5743348 5793814 5815419 5808060 5772501 5710235 5623104 5513203 5383216 5236653
60091 5236653 5077573 4910036 4737867 4564780 4394460 4230301 4075002 3930538 3798681
60082 3798681 3681427 3580698 3497553 3431941 3383301 3351137 3334887 3333594 3346036 3370987 3406986
60071 3406986 3451834 3502540 3555754 3608245 3657307 3701035 3738028 3766544 3784220 3789037 3780500 3759539
60059 3759539 3727402 3684992 3633014 3572132 3502874 3425884 3342424 3254316 3163388 3071329 2980032
60048 2980032 2891550 2807511 2728980 2657004 2592863 2537591 2491715 2455846 2431169 2418848 2419011 2430724
60036 2430724 2453091 2486130 2530373 2585720 2650875 2724009 2803616 2888269 2975535 3061762 3143373
60025 3143373 3218040 3284279 3340329 3384183 3414644 3431701 3435739 3426805 3404684 3369296 3321050 3261282
60013 3261282 3192326 3116745 3036428 2952885 2868253 2785335 2706602 2633829 2568780 2513396 2468836
60002 2468836 2434913 2411001 2397102 2393752 2401366 2420168 2450368 2491803 2543633 2604884 2675243 2755064
59990 2755064 2844707 2943996 3051901 3166310 3284200 3402309 3517611 3627106 3727610 3816161
59980 3816161 3890578 3949460 3991897 4017466 4026304 4018782 3995125 3955476 3900329 3830881 3749251 3658493
59968 3658493 3562214 3463983 3367104 3274708 3189571 3113667 3048241 2994375 2953133 2925096 2910187
59957 2910187 2908086 2918375 2940257 2972738 3015312 3067795 3129169 3197207 3269625 3344935 3421661
59946 3421661 3497501 3570109 3638318 3701780 3759693 3810674 3853763 3888780 3915834 3935260 3948098
59935 3948098 3955927 3960056 3961375 3961143 3961467 3964932 3974227 3992128 4021263 4063550 4120134 4192077 4280814
59922 4280814 4387690 4513161 4656610 4816815 4992417 5181740 5381927 5588259 5794588
59913 5794588 5994570 6182176 6351011 6493865 6603792 6675690 6706758 6696079 6644729 6556243
59903 6556243 6436134 6290513 6125429 5947335 5763273 5579935 5402629 5235291 5081078
59894 5081078 4942617 4821929 4720513 4639468 4579262 4539498 4519313 4518352 4537318 4577337 4638697
59883 4638697 4720316 4820520 4938021 5071772 5219878 5378888 5543821 5708179 5863835 6001850
59873 6001850 6114228 6195082 6240379 6247571 6216209 6148571 6049095 5923264 5777156 5617185 5449082
59862 5449082 5276976 5103901 4932953 4767382 4609778 4461983 4325765 4202844 4094193
59853 4094193 4000074 3921013 3858128 3812242 3783217 3770456 3773596 3792182 3824853 3869282 3923048
59842 3923048 3984530 4053025 4128101 4208918 4294292 4383129 4473966 4563470 4645703 4713561 4761198
59831 4761198 4785205 4784424 4759731 4714080 4651836 4577586 4495547 4409563 4322556 4235730 4148988 4062365
59819 4062365 3976480 3891480 3806518 3720953 3635699 3552866 3474321 3400981 3333204 3271281 3215415
59808 3215415 3165373 3120164 3078141 3037718 2998211 2959871 2923125 2888028 2854464 2822572 2792942
59797 2792942 2766644 2745052 2729319 2719957 2717315 2722522 2737571 2764395 2804223 2857967 2926815 3012255
59785 3012255 3115787 3238804 3382387 3546907 3731671 3934385 4149996 4369561 4580521
59776 4580521 4768536 4919610 5021891 5067600 5054789 4987511 4874119 4725368 4553395 4370672
59766 4370672 4188229 4014268 3854295 3711910 3589006 3485692 3400916 3333383 3281686 3243939
59756 3243939 3217950 3201962 3195005 3196495 3205697 3221585 3243054 3269328 3300281 3336369 3378194 3426241
59744 3426241 3481008 3543117 3613208 3691925 3780118 3878784 3988702 4110360 4244395 4391892
59734 4391892 4554085 4731991 4926512 5138676 5369606 5620391 5891927 6184345 6496129
59725 6496129 6823783 7162478 7506884 7851395 8189987 8516440 8825012 9111303 9373126
59716 9373126 9611023 9827978 10028472 10217624 10400612 10581976 10764899 10951093 11141143
59707 11141143 11334415 11528491 11719272 11902074 12072553 12226753 12361015 12472461 12559476
59698 12559476 12621626 12659514 12674976 12671087 12651691 12621170 12584717 12548249 12517661 12498467 12496289
59687 12496289 12517038 12565958 12646825 12762454 12915531 13108260 13341345 13613849 13923867 14268763
59677 14268763 14644708 15046309 15466329 15895101 16320023 16726101 17097275 17417504 17671398
59668 17671398 17845092 17927523 17911631 17795222 17581571 17279363 16901603 16463969 15983460 15477352
59658 15477352 14962056 14451863 13957833 13486664 13039540 12611787 12194099 11775032 11343780
59649 11343780 10892722 10419180 9925666 9418507 8906095 8397799 7903167 7430637 6986184
59640 6986184 6572870 6191333 5840665 5519465 5226735 4961832 4723446 4509091 4316093
59631 4316093 4142876 3988825 3853109 3734209 3630435 3540387 3462801 3396359 3339614 3290833
59621 3290833 3248017 3209476 3174395 3142537 3113475 3086409 3060512 3034974 3008805 2981114 2951661
59610 2951661 2920783 2888699 2855159 2819732 2782129 2742339 2700937 2659305 2619163 2581618 2546777
59599 2546777 2514174 2483377 2454268 2427046 2401985 2378976 2357385 2336572 2316460 2297477 2280186
59588 2280186 2265234 2253326 2244778 2239248 2236316 2236187 2239394 2245989 2255507 2267615 2282304 2299503 2319018
59575 2319018 2340817 2364978 2391470 2420510 2453026 2490175 2532376 2579333 2630968 2687696 2749712
59564 2749712 2816723 2888589 2965670 3048245 3136070 3228759 3326283 3428870 3536748 3650099 3768866
59553 3768866 3892467 4020005 4150785 4284241 4419373 4554699 4688638 4818997 4941879
59544 4941879 5051933 5144377 5216481 5266956 5294832 5299753 5283014 5247454 5196197 5131686 5055549
59533 5055549 4968922 4873078 4770170 4663275 4555475 4449132 4346393 4249957 4162854 4087601
59523 4087601 4026076 3979979 3950863 3939809 3947661 3975640 4025187 4097028 4190746 4305345 4439709
59512 4439709 4592107 4759338 4936497 5117402 5295063 5461928 5610149 5732115 5821252 5872749
59502 5872749 5883856 5853789 5783639 5676388 5536706 5370413 5184031 4984672 4779691 4575813
59492 4575813 4378387 4191521 4018689 3862782 3725625 3607859 3509530 3430654 3371195 3330742
59482 3330742 3308444 3303188 3313828 3339411 3379322 3433016 3499405 3576501 3661760 3752655 3846729
59471 3846729 3941129 4032398 4116829 4190817 4250690 4292560 4313051 4310501 4285275 4238720 4171957
59460 4171957 4085938 3982395 3864264 3735078 3598248 3456922 3314078 3172315 3033555 2899131
59450 2899131 2770131 2647575 2532318 2424960 2325832 2234898 2151609 2075040 2004439 1939726
59440 1939726 1881332 1829432 1783509 1742854 1707352 1677347 1652744 1632770 1616881 1605398 1598739
59429 1598739 1596377 1597244 1601042 1608480 1620151 1635857 1655185 1677922 1703238 1728867 1751833 1769987
59417 1769987 1782617 1790005 1793224 1794394 1796320 1801317 1810546 1824546 1843694 1867510 1893809 1919457
59405 1919457 1942403 1962665 1981310 1999130 2016839 2036002 2058720 2086198 2118326 2154986 2197130
59394 2197130 2246034 2301942 2364133 2432188 2506575 2587993 2676756 2772893 2876309 2986565 3102802
59383 3102802 3224150 3350000 3479797 3612927 3749207 3889448 4035432 4189512 4354400
59374 4354400 4533081 4728541 4943407 5179788 5439187 5722124 6027544 6352474 6692239
59365 6692239 7040962 7392017 7738400 8073327 8391104 8687733 8960692 9208199 9428847
59356 9428847 9621807 9786734 9922941 10028689 10101447 10138477 10136782 10092773 10002782 9864199
59346 9864199 9676084 9439053 9155504 8830419 8471536 8088215 7690000 7286095 6885425
59337 6885425 6496259 6125247 5776714 5452743 5153792 4879251 4627640 4396694 4183748
59328 4183748 3986407 3802919 3631944 3472322 3323313 3184846 3057062 2939588 2831528
59319 2831528 2732016 2640408 2556067 2478484 2407681 2343957 2287072 2236127 2190451 2150157 2115512
59308 2115512 2086167 2061340 2040476 2023415 2010227 2001357 1997783 2000533 2010003 2025968 2048118 2076109
59296 2076109 2108869 2144155 2179188 2211893 2241600 2268676 2293818 2318031 2343208 2372060 2406762
59285 2406762 2447566 2493130 2542174 2594415 2649807 2707347 2764928 2820019 2870146 2913016 2946649
59274 2946649 2969522 2980527 2978945 2964645 2938239 2900900 2854074 2799332 2738249 2672290 2602948
59263 2602948 2532020 2461403 2392378 2325319 2260259 2197556 2137818 2081508 2028990 1980782 1937390
59252 1937390 1898847 1864728 1834702 1808931 1787883 1771871 1760754 1753997 1751013 1751550 1755778 1763975
59240 1763975 1776150 1791978 1811053 1833211 1858587 1887337 1919273 1953986 1991477 2032503 2078067
59229 2078067 2128640 2184185 2244849 2311332 2384642 2465900 2556409 2657519 2770303 2895687 3034924
59218 3034924 3189455 3360103 3546690 3748525 3964654 4193095 4429971 4669675 4905647
59209 4905647 5130757 5337287 5517172 5662705 5767321 5826253 5836896 5798700 5712925 5582906
59199 5582906 5414474 5215481 4994349 4759098 4517479 4277034 4044203 3823516 3618001
59190 3618001 3429897 3260390 3109016 2974249 2854876 2750451 2660597 2584530 2521369 2470335
59180 2470335 2430490 2400721 2380178 2368291 2364066 2365688 2371003 2378089 2385149 2390167 2390995 2385644 2372278
59167 2372278 2349280 2315822 2272376 2220385 2161456 2097121 2029187 1959768 1890765 1823671 1759963
59156 1759963 1701172 1648062 1600146 1556630 1517743 1484457 1456914 1433886 1414106 1397409 1384128
59145 1384128 1373982 1366326 1361117 1358882 1359834 1363654 1369973 1378431 1388347 1399053 1410589 1423364 1437101
59132 1437101 1450751 1463571 1475498 1486335 1495459 1502749 1509048 1515066 1520427 1524466 1527556 1530958 1535559
59119 1535559 1541305 1547722 1554497 1561642 1569489 1578537 1589018 1600683 1613143 1626193 1639700 1653513
59107 1653513 1667729 1682708 1698537 1714743 1730793 1746610 1762480 1778899 1796725 1816877 1839462
59096 1839462 1863708 1889339 1917547 1949947 1986921 2027640 2071427 2118275 2168087 2220123 2273340
59085 2273340 2326775 2379541 2430769 2479519 2524313 2562879 2592776 2612313 2620560 2616766 2600431 2571961
59073 2571961 2532698 2484211 2427995 2365913 2300319 2233393 2166512 2100384 2035537 1972634 1912493
59062 1912493 1855858 1803018 1753696 1707474 1664183 1623749 1585955 1550671 1518061 1488118 1460267
59051 1460267 1433978 1409689 1388513 1371049 1357003 1345989 1337970 1332604 1328703 1324794 1319997 1314016
59039 1314016 1306481 1296715 1284246 1269423 1253406 1237540 1222697 1209244 1197450 1187533 1179219 1171668
59027 1171668 1164362 1157946 1153811 1152755 1154221 1156805 1159440 1162240 1166365 1172919 1181820 1191956 1202538
59014 1202538 1213912 1226823 1241443 1257692 1276088 1297488 1322019 1348990 1378060 1409942 1445733
59003 1445733 1485878 1530051 1577831 1629282 1684793 1744273 1806447 1869066 1929857 1987032 2038839
58992 2038839 2083190 2118150 2142537 2155738 2157386 2147803 2128545 2101884 2069743 2033374 1993809 1952169
58980 1952169 1909703 1867839 1827816 1789843 1753024 1716733 1681716 1649242 1619583 1592197 1567136
58969 1567136 1545280 1527248 1512985 1502503 1496175 1494105 1495874 1501002 1508965 1518691 1528810 1538623 1548240
58956 1548240 1557752 1567025 1576242 1585774 1595308 1604115 1612543 1622338 1634946 1650266 1667522 1686534 1707448
58943 1707448 1729926 1753510 1778448 1805485 1835103 1867552 1903381 1943333 1987861 2037232 2092026
58932 2092026 2153122 2221124 2295818 2375775 2458171 2539289 2615695 2685097 2746323 2799125 2844374
58921 2844374 2883983 2920179 2954995 2990601 3029628 3074583 3127134 3188165 3258243 3337728 3426918
58910 3426918 3526666 3638641 3764482 3904761 4059172 4227534 4410172 4607441 4819425 5046102
58900 5046102 5287287 5542083 5808538 6083850 6364772 6647889 6929919 7208036 7479807
58891 7479807 7742663 7993373 8228093 8442885 8634066 8798097 8931375 9030619 9093592 9119314
58881 9119314 9107403 9057538 8969846 8845676 8687736 8499630 8285452 8049585 7796401 7530159
58871 7530159 7255250 6976094 6696246 6417816 6142250 5871480 5607768 5352780 5107647
58862 5107647 4873814 4652862 4445313 4250438 4067543 3896699 3737956 3590690 3454271
58853 3454271 3328725 3214122 3109792 3014719 2928345 2850417 2780382 2717478 2661238 2611424 2567605
58842 2567605 2529238 2496025 2467832 2444301 2424866 2409146 2397216 2389594 2386979 2389775 2397662 2409832
58830 2409832 2425770 2445657 2469973 2498995 2532754 2571158 2614011 2661162 2712665 2768488 2827988
58819 2827988 2889985 2953488 3018190 3084384 3152891 3225002 3301986 3384552 3473223 3569176 3674149
58808 3674149 3789538 3916314 4055831 4209751 4378804 4562469 4760315 4972813 5200199
58799 5200199 5441291 5694227 5957769 6230864 6511169 6794782 7077301 7354355 7621071
58790 7621071 7871773 8100567 8302060 8471655 8605659 8701467 8757735 8774619 8754106 8699893
58780 8699893 8616242 8506123 8369749 8204518 8006745 7774256 7508021 7211894 6891658 6554895
58770 6554895 6210996 5869668 5538604 5222764 4925543 4649519 4395754 4163481 3951255
58761 3951255 3757992 3582539 3423051 3277478 3144345 3022658 2911633 2810911 2720429 2639594
58751 2639594 2567108 2502040 2444382 2394081 2350266 2312151 2279992 2254287 2234543 2219707 2209410
58740 2209410 2203937 2203268 2206948 2214677 2226319 2241582 2260393 2283232 2310080 2338979 2366245 2388105
58728 2388105 2401703 2404992 2396748 2376987 2346811 2307647 2260902 2208152 2150982 2090522 2027488 1962641
58716 1962641 1896915 1831269 1766875 1705321 1648153 1596174 1549548 1508482 1473539 1445432 1424846
58705 1424846 1412319 1407912 1410945 1420041 1433055 1446903 1458067 1463749 1462254 1452165 1432069 1401902
58693 1401902 1363990 1321857 1278148 1234286 1191720 1152523 1118670 1091324 1070836 1057012 1049438
58682 1049438 1047939 1052665 1063428 1079276 1099104 1122442 1149252 1179362 1212588 1249224 1289946 1335537
58670 1335537 1387039 1445693 1512010 1584732 1660439 1733314 1795054 1836471 1850838 1836142 1794242
58659 1794242 1729020 1646097 1552979 1457310 1364467 1277334 1197832 1127477 1066675 1014777 971079
58648 971079 935032 905608 881411 861556 845778 833770 825106 819567 816788 815809 815794 816875 819379
58635 819379 822559 825176 827201 829709 833121 836718 840027 843560 847874 852923 858647 865369 873320 882558
58621 882558 893511 906803 922366 939501 957959 978138 1000186 1023849 1049383 1077657 1109043
58610 1109043 1143113 1179765 1219712 1263534 1311137 1362651 1418998 1480934 1548186 1620038 1696133
58599 1696133 1776091 1858826 1942785 2026498 2108352 2186117 2257080 2318568 2368255 2404438 2426292
58588 2426292 2433720 2426933 2406546 2374052 2331738 2282049 2227390 2170397 2113650 2058853 2006588 1956952
58576 1956952 1910142 1866574 1826892 1791762 1761204 1734310 1710143 1688618 1670000 1653961 1639919
58565 1639919 1627865 1617761 1608353 1597735 1585072 1570706 1554702 1536647 1517060 1497641 1479503
58554 1479503 1462092 1444143 1424578 1401948 1374107 1339431 1297981 1251149 1200811 1149135 1098344
58543 1098344 1049994 1004858 963636 927009 894716 865444 838167 812933 790007 769044 749643
58532 749643 731967 716231 702114 689202 677525 667230 658214 650453 644177 639370 635600 632629 630707
58519 630707 629952 629974 630344 630950 631749 632774 634547 637879 643053 649780 657963 667796 679011 690922 703395
58504 703395 716910 731462 746273 760819 775160 788961 801259 811654 820702 828543 834139 836604
58492 836604 836517 835149 833014 829817 825309 819629 813261 806951 801094 794942 787153 777395 766604 755366
58478 755366 743134 729556 715503 701990 688956 675949 663268 651578 640964 631111 622007 613755
58466 613755 606174 599124 592788 587150 581631 575745 569675 563934 558955 555140 552581 550456 547625 544138
58452 544138 541304 539933 539534 539604 540487 542225 543725 544052 543703 543694 544149 544673 545364 546507 547897 549327 551170
58435 551170 553651 556062 557509 558017 558290 558844 559899 561481 563151 564342 565463 567795 571729 576040 579569
58420 579569 582636 585969 589289 592009 594465 597312 600442 603542 607086 611674 616924 622003 626767 631464
58406 631464 635847 639493 642509 645080 646870 647757 648617 650500 653495 657128 661209 665533 669473 672749 675923
58391 675923 679311 682253 684423 686978 691207 696801 702708 708999 716464 724786 732524 738711 743375 746756
58377 746756 749089 750986 753041 755200 757284 759708 762917 766606 770376 774590 779648 785009 790018 795173
58363 795173 801470 808901 816705 824659 832943 841033 847937 853458 858303 863126 868247 874061 880797 888041
58349 888041 895203 902263 909517 916954 924396 931805 938993 945685 952274 959652 967880 976078 984223 993700
58335 993700 1005188 1017403 1029082 1040910 1054101 1068352 1082792 1097859 1114493 1132285 1150168
58324 1150168 1168326 1187757 1208540 1230103 1252669 1276869 1302316 1327918 1353185 1377968 1401554
58313 1401554 1423278 1443287 1461455 1476452 1487458 1495861 1503649 1510979 1517049 1522451 1528618 1535683 1542997
58300 1542997 1551342 1562560 1577190 1594280 1613227 1634056 1656173 1678703 1701893 1726676 1753121
58289 1753121 1780825 1810360 1842673 1877431 1913570 1951059 1990572 2031968 2074788 2119721 2167899
58278 2167899 2219095 2272068 2326045 2380421 2433883 2485456 2535661 2585111 2633022 2678694 2723131
58267 2723131 2767347 2810580 2852321 2894530 2939329 2986033 3033259 3082490 3136424 3194989 3256286
58256 3256286 3320492 3389444 3463147 3540193 3621126 3708027 3801104 3898873 4001353 4109990 4225004
58245 4225004 4345899 4473939 4610799 4755504 4906155 5063864 5231382 5408727 5594080
58236 5594080 5788229 5994002 6212093 6441745 6684809 6944562 7221067 7512456 7820352
58227 7820352 8149125 8500282 8872853 9269224 9695270 10154657 10648263 11179182 11753025
58218 11753025 12373601 13044120 13772555 14569961 15444035 16400851 17452567 18616714 19908945
58209 19908945 21344942 22949742 24757586 26803981 29128554 31786993 34851450 38400556
58201 38400556 42521058 47319039 52916111 59435252 67009134 75810044 86063035 98036799
58193 98036799 112047133 128470400 147720557 170191051 196198497 225853208 258695352
58186 258695352 293168741 326402271 354754539 374960760 385127821 384960655 375319518
58179 375319518 357682774 333883930 306007638 276175776 246202752 217345008 190318193
58172 190318193 165511651 143183217 123500003 106478438 91959143 79668743 69306276
58165 69306276 60586311 53245032 47047434 41798584 37340028 33536669 30273845 27461424
58157 27461424 25028306 22911258 21054344 19415391 17963307 16668485 15502084 14443456
58149 14443456 13480774 12603774 11801509 11066722 10395935 9784238 9224674 8712791 8246758
58140 8246758 7822732 7434817 7079803 6757238 6464149 6193891 5940770 5702019 5474887
58131 5474887 5255863 5043643 4839425 4643613 4455216 4274785 4104622 3945549 3796300
58122 3796300 3656318 3526160 3404892 3290061 3180681 3077582 2980605 2888189 2799926 2716698
58112 2716698 2638001 2561869 2487835 2417390 2351232 2288601 2229560 2175274 2125529 2078537 2033738
58101 2033738 1992467 1955433 1921815 1891201 1863965 1839185 1814477 1788521 1761716 1733986 1704250
58090 1704250 1672634 1640946 1610216 1579731 1549153 1519475 1491148 1463173 1434871 1406808 1379227
58079 1379227 1351319 1322849 1294919 1268340 1242673 1217484 1193153 1169881 1147267 1125315 1104527
58068 1104527 1084627 1064687 1044855 1026445 1009940 994384 979126 964605 951032 937872 925113
58057 925113 913459 902711 891509 879248 866807 854897 843197 831674 821173 811983 803223 794358
58045 794358 785924 778135 770228 762024 754743 749293 744858 740105 734844 729724 725220 721594 719030 717206
58031 717206 715455 713675 712143 710259 706704 701307 695542 690697 686675 683043 679990 677654 675719 674362
58017 674362 674481 676356 679190 682558 687115 693259 700305 707778 716391 726981 739539 754003 770814
58004 770814 789855 810028 830846 853380 878612 905954 934453 964422 996563 1030386 1064919
57993 1064919 1100464 1138283 1178868 1221694 1266437 1313214 1361588 1410207 1457591 1502727 1544946
57982 1544946 1583744 1618790 1649951 1677615 1703063 1727882 1752501 1775626 1795230 1809378 1815822
57971 1815822 1811791 1795058 1764896 1721734 1666709 1602186 1531884 1459536 1387677 1318171 1253199
57960 1253199 1194835 1144006 1100514 1063713 1032677 1006385 984500 967561 955724 947778 942084 938002
57948 938002 935570 934204 932732 930596 928200 926038 924050 921847 919168 916313 914469 915324 919829 927637
57934 927637 938153 951733 969249 990883 1016052 1044232 1075106 1107919 1141279 1173488 1202527
57923 1202527 1225950 1241478 1247779 1244285 1230475 1206089 1172058 1130713 1084850 1036862 988566 941275
57911 941275 895863 853104 814059 779802 750653 725884 704241 684715 666887 650777 636342
57900 636342 623011 609750 595678 580571 564773 548830 533295 518607 504973 492477 481296
57889 481296 471543 463019 455543 449555 445825 444438 444642 445952 448787 453652 460316 468290 477506 487885
57875 487885 498681 509047 518985 528993 538916 547976 555907 563225 570061 575380 577930 577689 575869 573485
57861 573485 570355 565718 559567 552860 546351 539711 532292 524405 517172 511213 506181 501676 497883 495021
57847 495021 492823 491053 490022 490106 491132 492707 494802 497479 500316 502628 504142 505052 505527 505459 504565 502507
57831 502507 499144 494938 490820 487332 484191 481020 478210 476635 476718 478194 480684 484135 488784 494952 502861
57816 502861 512543 524059 537701 553467 570281 586423 601176 615553 630984 647914 666380 687401
57804 687401 712747 743376 778830 818210 861015 906833 954644 1002533 1047726 1086930 1117083
57793 1117083 1136019 1142409 1135481 1115386 1083765 1043361 996883 946457 893961 841320 790232 741894
57781 741894 696981 655560 617050 580770 546807 516112 489580 467176 448014 431147 416178
57770 416178 403242 392502 383677 376071 369042 362343 356090 350623 346381 343561 341758 340247 338737 337500
57756 337500 336708 336146 335838 336393 338247 341009 344025 347213 350878 355152 360251 366902 375678 385995 396490
57741 396490 406426 416110 425921 435513 444047 450748 455161 457281 457492 456171 453452 449666 445614 441896
57727 441896 438321 434674 431714 430503 430899 431710 432395 433591 435788 438461 440944 443254 445597 447926 450610
57712 450610 454727 460840 468050 475070 481888 489574 498746 509043 519975 531491 543707 556683 570623
57699 570623 585824 602357 620181 639562 661005 684794 711064 740303 773286 810356 851218
57688 851218 895699 944353 998040 1057205 1121851 1192118 1268516 1351537 1441183 1536908 1637944
57677 1637944 1743635 1853495 1966960 2083151 2200843 2318770 2436153 2553223 2670811
57668 2670811 2788210 2900099 2995207 3058889 3078421 3047299 2966116 2840874 2681149 2498932
57658 2498932 2307269 2118142 1940448 1779240 1636322 1511403 1403154 1309937 1230194 1162417
57648 1162417 1104951 1056028 1014213 978809 949722 926808 909342 896109 886067 878956 875262 875549
57636 875549 879817 887479 897895 910790 926193 944266 965392 990239 1019359 1052597 1089158 1128413
57624 1128413 1170536 1216233 1265981 1319737 1377266 1438408 1502746 1569120 1635634 1700161 1760739
57613 1760739 1815488 1862395 1899393 1924713 1937092 1935797 1920689 1892372 1852109 1801438 1741930
57602 1741930 1675371 1603982 1530152 1455890 1382695 1311867 1244574 1181427 1122212 1066399 1013918
57591 1013918 965211 920514 879385 841094 805333 772339 742421 715534 691329 669400 649484
57580 649484 631552 615740 602081 590224 579553 569671 560664 552827 546195 540377 534788 529027 523221
57567 523221 518037 514168 511707 510187 509324 509376 510557 512448 514461 516715 519877 524115 528751 533154 537475
57552 537475 542166 547170 552104 557062 562693 569416 576961 584836 592931 601449 610564 620530 632026 645911
57538 645911 662462 681184 701613 724092 749406 777820 808946 842507 878762 918049 960360
57527 960360 1005636 1053972 1105123 1158097 1211709 1265250 1318147 1369142 1416355 1458106 1493128
57516 1493128 1520025 1537159 1543302 1538102 1521900 1495523 1460373 1418230 1370791 1319609 1266396 1212859
57504 1212859 1160099 1108614 1059013 1012270 969128 929720 893947 861767 832904 806846 783400
57493 783400 762845 745275 730341 717962 708698 702823 699435 697078 695080 693840 694145 696637 701650
57480 701650 708986 717941 727962 739210 752228 767361 784860 805135 828430 854554 883445 915643
57468 915643 951579 990692 1031966 1075118 1120528 1168079 1216847 1265930 1314706 1362032 1405837
57457 1405837 1443758 1473816 1494416 1504459 1503738 1492726 1471714 1440634 1400046 1351858 1298766 1243193
57445 1243193 1186875 1130903 1075781 1021743 969331 919488 872919 829691 789695 753149 720338
57434 720338 691090 664787 640753 618560 598156 579871 564049 550512 538616 527819 517875 508473
57422 508473 499236 490321 482478 476167 470986 466314 462036 458197 454402 450271 446253 443231 441313 439617
57408 439617 437447 435182 433694 433247 433339 433517 433983 435239 437227 439051 439721 439179 438411 438525 439857 441950
57392 441950 444092 445795 447027 448261 450093 452658 455565 458516 461662 465123 468493 471232 473362 475387
57378 475387 477610 479844 481740 483118 484161 485512 487922 491347 494600 496456 497031 497547 498706 499964 500514
57363 500514 500382 500272 500885 502708 505914 509945 513539 515858 517456 519686 523217 527584 532116 536816 542191
57348 542191 548590 555922 563788 571742 579577 587470 595784 604738 614335 624460 634823 644949 654613
57335 654613 664275 674640 685676 696556 706754 716759 727270 738068 748294 757658 766782 776334
57323 776334 786507 797479 809764 823570 838212 852752 867034 881617 896771 912112 927338
57312 927338 942727 958657 975059 991768 1009040 1027213 1046120 1065425 1085539 1107410 1131186
57301 1131186 1155654 1179475 1202511 1225465 1248603 1271565 1294239 1316917 1339375 1360491 1379186
57290 1379186 1395264 1408956 1420140 1428527 1434336 1438207 1440579 1441715 1442250 1443191 1445211 1448281 1452112 1456708
57276 1456708 1462531 1470367 1480884 1493932 1508368 1523062 1538118 1554616 1573118 1593033 1613666 1635263
57264 1635263 1658556 1683744 1710417 1738212 1767038 1796902 1827933 1860402 1894194 1928449 1962340
57253 1962340 1996220 2031464 2069024 2108627 2149547 2191674 2235389 2280735 2327163 2374159 2421787
57242 2421787 2470502 2520567 2571731 2623389 2674948 2726078 2776720 2826949 2876823 2926365 2975717
57231 2975717 3025351 3075991 3128148 3181747 3236346 3291644 3347545 3403798 3459964 3515856 3571607
57220 3571607 3627032 3681238 3733196 3782590 3829798 3875273 3919317 3962298 4004590 4046271 4087214
57209 4087214 4127494 4167419 4207182 4246877 4286888 4327794 4369733 4412177 4454619 4497166 4540230
57198 4540230 4583854 4627591 4670858 4713169 4754182 4793824 4832351 4870084 4907182 4943869 4980734
57187 4980734 5018420 5056910 5095458 5133382 5170787 5208374 5246708 5285822 5325358 5364799 5403614
57176 5403614 5441518 5478716 5515640 5552181 5587306 5619719 5648943 5675536 5700211 5723007 5743412
57165 5743412 5761111 5776331 5789453 5800481 5809012 5814745 5818022 5819831 5821217 5822688 5824227 5825799 5827608
57152 5827608 5829802 5832153 5834225 5835798 5836916 5837513 5837072 5834699 5829625 5821799 5811971 5800921 5788296 5772311
57138 5772311 5750885 5723264 5690587 5655018 5618490 5582149 5546646 5512682 5481328 5453949 5431754
57127 5431754 5415144 5403278 5394362 5386557 5378687 5370095 5360080 5348007 5334213 5320495 5309263 5302283
57115 5302283 5300490 5304778 5316443 5336792 5366931 5408239 5462757 5532928 5621313 5730973 5866022
57104 5866022 6031639 6233866 6479873 6778636 7141500 7582436 8118103 8767457 9550825
57095 9550825 10488900 11602174 12910589 14433017 16186578 18185843 20441573 22958638
57087 22958638 25733352 28750761 31982471 35385756 38904470 42470740 46005061 49413478
57079 49413478 52583684 55384436 57672692 59310208 60186716 60241655 59475091 57943446 55743847
57070 55743847 52995484 49824661 46355621 42705978 38984488 35289176 31704941 28301080
57062 28301080 25129561 22224449 19602698 17266446 15206298 13404587 11838281 10481891
57054 10481891 9310069 8298839 7425533 6669078 6011217 5437238 4935100 4494166 4105070
57045 4105070 3760201 3453501 3179826 2934875 2715454 2519200 2344010 2187913 2049083
57036 2049083 1925554 1815159 1716228 1628155 1550946 1484446 1428400 1382951 1348693 1326442 1317247
57025 1317247 1322403 1343462 1382471 1441047 1516441 1597285 1665596 1706133 1714011 1692081 1642521 1564411
57013 1564411 1459709 1337911 1212350 1093087 984512 887926 803793 731766 670496 618285
57003 618285 573510 534650 500575 470726 444646 421655 401318 383675 368416 354348 340332
56992 340332 326395 313359 301844 292253 285274 281585 281282 284245 290699 300633 312773 324848 334762
56979 334762 341072 342767 339593 332608 323613 313792 303371 292523 281891 272076 263301 255861 250406
56966 250406 247429 246815 248162 251314 256411 263709 273578 286382 301997 319463 337249 353835 367946
56953 367946 378367 383871 383584 377454 366295 351377 334080 315884 298304 282496 269094 258650
56941 258650 251909 249159 249568 251967 256337 263828 275172 289858 307275 327810 351968 378692 405142
56928 405142 427909 444073 451602 449693 439008 421253 398497 372894 346593 321243 297623 276059
56916 276059 256971 240612 226559 214117 203237 194572 188531 184657 181993 179737 177545 175434 173480
56903 173480 171473 168987 165958 163023 161002 160139 160082 160482 161318 162769 165071 168460 173073 179028 186715
56888 186715 196758 209403 224155 240098 256157 270796 282016 288346 289746 287208 281765 274304
56876 274304 265887 257524 249728 242882 237869 235715 236708 240447 246689 255606 267396 282385 301379 325081
56862 325081 353079 384217 417961 454303 491774 526411 553549 570362 576354 572154 558871 538509
56850 538509 514058 488635 464538 443058 424880 410578 400841 396255 396965 402809 413965 431285
56838 431285 455749 487669 526644 572148 623762 680349 738785 793526 837784 865744 874272 863291
56826 863291 835254 794484 746275 695560 645855 599384 557866 522687 494433 472923 457970
56815 457970 449798 448675 454529 467128 486223 511310 541661 576773 616129 657820 697491 729289
56803 729289 748257 752025 740786 716367 681452 639211 593065 546408 502198 462463 428130 399404
56791 399404 376309 358757 346276 338060 333560 332958 336933 345974 360002 378496 400558 424540 447753
56778 447753 467044 480023 485702 483899 474402 457229 433667 406486 378729 352377 328213 306484
56766 306484 287160 269709 253338 237788 223580 211218 200489 190895 182485 175700 170462 166033
56754 166033 161954 158552 156137 154182 151869 149223 147100 146100 145986 146204 146467 146679 146758 146773 146992 147597 148506
56737 148506 149549 150586 151404 151800 151874 151993 152393 153059 153976 155152 156359 157235 157719 158044 158207 157916 157173 156478
56719 156478 156263 156528 157164 158108 159001 159286 159047 159178 160328 162146 163952 165672 167586 169708 172091 175306
56703 175306 179901 185553 191400 197005 202458 207796 212990 218281 223801 228906 232602 234655 235747 236526
56689 236526 237072 237356 237652 238329 239612 241582 244056 246485 248352 249653 250681 251553 252334 253377 254899 256401
56673 256401 257182 257338 257565 257981 257887 256839 255309 254007 253062 252047 250428 247877 244616 241405 238735 236024
56657 236024 232273 227490 222780 218896 215540 212301 209438 207290 205611 204064 202771 201804 200678 199027
56643 199027 197351 196377 195965 195390 194565 194247 194990 196507 198249 200082 202120 204193 205899 207064 207842 208268
56627 208268 207964 206508 204096 201586 199739 198592 197707 196816 195939 195053 194000 192650 190893 188607 186024
56612 186024 183931 183005 183019 183227 183504 184476 186454 188939 191415 193992 196868 199662 201793 203196 204246 205234
56596 205234 206365 208004 210482 213691 217136 220271 222677 224138 224915 225733 227205 229311 231649 233968 236163
56581 236163 237851 238400 237497 235596 233753 232978 233582 235016 236427 237469 238545 240280 242956 246400 250154
56566 250154 253684 256698 259439 262419 265780 269139 272146 274844 277309 279216 280082 279777 278599 276980 275259
56551 275259 273515 271414 268403 264252 259304 254042 248656 243241 238042 233110 227911 221815 214975 208286
56537 208286 202367 197058 192114 187936 185016 182841 180012 175740 170849 166953 164942 164647 165591 167377 169305
56522 169305 170478 170692 170780 171583 172936 174025 174446 174361 173897 172986 171724 170382 169027 167510 165786 163892
56506 163892 161717 159188 156645 154583 153099 151929 150982 150367 150013 149727 149604 149886 150439 150859 151159 151829 153120
56489 153120 154682 156037 157079 158059 159417 161587 164540 167594 170119 172383 175163 178560 181809 184291
56475 184291 186124 187650 188970 190133 191159 191711 191287 190032 188796 188168 187947 187714 187347 186801 186035 185465
56459 185465 185803 187099 188509 189423 190196 191353 192724 193953 195296 197227 199642 202132 204703 207468 209801
56444 209801 210580 209414 207179 205216 204286 204176 203949 202582 199720 195922 192104 188776 185986 183744 182102
56429 182102 180869 179605 178059 176427 175033 173890 172771 171719 171237 171679 172576 173017 172842 172950 174085 175819
56413 175819 177320 178724 180964 184300 187856 190698 192745 194426 196051 197762 199569 201183 202126 202157 201334
56398 201334 199773 197786 196117 195362 195184 194730 193886 193398 193686 194321 194819 195197 195501 195544 195401 195448 195584 195139
56380 195139 193909 192602 191885 191696 191882 192690 194098 195370 195896 195947 196031 196083 195912 195946 196815 198507 200482 202360
56362 202360 204048 205467 206576 207432 208009 208333 208910 210466 213020 215807 218395 221139 224205 226913 228598
56347 228598 229465 230070 230572 231112 232242 234337 237033 239791 242433 244703 246038 246508 247278 249336 252336 255440
56331 255440 258690 262603 266980 271140 275052 279265 283840 288205 292018 295505 299116 303354 308664 314769
56317 314769 320444 324617 327540 330332 333688 337644 342103 346736 350610 352794 353311 352940 352330 351885 352096
56302 352096 353106 354250 354908 355636 357528 360508 363263 365028 366603 369329 373696 379251 385315 391471 397681
56287 397681 404219 411345 419020 427071 435584 444892 455279 466862 479620 493466 508535 525504 545147
56274 545147 567344 591040 615675 642268 672657 707950 748102 792608 841145 893819 951159
56263 951159 1013704 1081407 1153801 1230837 1312873 1399463 1488837 1579022 1668829 1757232 1842407
56252 1842407 1922096 1994504 2058351 2112592 2156685 2190720 2214804 2228741 2232610 2227017 2212401 2188931
56240 2188931 2157562 2120242 2078305 2031465 1979113 1921749 1860348 1795311 1727069 1656926 1586174
56229 1586174 1515044 1443591 1372970 1304621 1238824 1175212 1114234 1056913 1003597 954013 908074
56218 908074 865535 825426 787037 751072 718637 689556 662922 638791 617840 599681 583041
56207 583041 567554 553988 542696 533131 524952 518395 513434 509632 506923 505515 504996 504548 504099 504380
56193 504380 505813 508155 511115 514494 517873 521011 524366 528408 532790 537093 541969 548505 556802 566239
56179 566239 576692 588312 600527 612636 625121 638995 654049 669151 684195 700378 718519
56168 718519 738346 759451 781648 804339 826822 849381 872968 897809 923491 950481 980368
56157 980368 1014500 1053516 1098415 1151053 1213511 1287908 1376905 1483421 1609691 1756959 1925353
56146 1925353 2112573 2312667 2517043 2716768 2903699 3070975 3214683 3335349 3436671
56137 3436671 3522743 3596837 3661194 3715553 3756090 3777997 3779634 3763282 3732501 3690512 3640496
56126 3640496 3584602 3521435 3445759 3351284 3233322 3089837 2922366 2736695 2541299 2344582
56116 2344582 2153959 1976322 1816998 1677926 1558346 1457280 1373995 1306552 1252028 1208405
56106 1208405 1174693 1149348 1130343 1116719 1108245 1103626 1100938 1099729 1100732 1103462 1106062 1107558 1108311
56093 1108311 1108274 1106845 1104459 1102181 1099574 1095110 1088824 1082420 1076718 1071289 1066729 1064748 1065632 1067957 1071206
56078 1071206 1076225 1082693 1088724 1093747 1099445 1107105 1116298 1126728 1138950 1152417 1165251 1176907 1189010
56065 1189010 1202711 1217308 1232163 1247780 1264259 1280771 1297325 1314968 1333714 1352433 1371266
56054 1371266 1391778 1414204 1436990 1459646 1483562 1509346 1535921 1562908 1591287 1621009 1650617
56043 1650617 1680028 1711133 1744866 1780212 1816581 1854317 1892359 1928531 1962809 1997287 2032364
56032 2032364 2066426 2100085 2136999 2179269 2225471 2274425 2327243 2384271 2443622 2504429 2568232
56021 2568232 2635629 2704896 2775287 2848206 2923733 2999600 3075063 3152152 3231799 3312715 3395446
56010 3395446 3483252 3577259 3674968 3775291 3880662 3992446 4108970 4230136 4359169 4497510
56000 4497510 4642803 4794213 4954749 5125952 5305554 5493109 5692494 5905938 6131034
55991 6131034 6366844 6617317 6885369 7169338 7468932 7788833 8132622 8498960 8887669
55982 8887669 9303557 9750364 10227371 10736241 11284699 11879222 12521164 13214797 13971946
55973 13971946 14803897 15716595 16719111 17829074 19064816 20441387 21980636 23716712
55965 23716712 25686862 27928468 30493176 33454567 36896771 40908861 45597089 51087143
55957 51087143 57506286 64982868 73679048 83813516 95650169 109492558 125700652
55950 125700652 144677097 166803054 192367303 221433153 253469917 286807188 318421732
55943 318421732 344549157 361895337 368601126 364400201 350233749 327893543 299817155
55936 299817155 268756651 237241788 207135489 179536165 154942218 133454926 114931601
55929 114931601 99109057 85688672 74363691 64824650 56783047 49994428 44252247
55922 44252247 39373346 35202984 31622761 28538664 25866142 23533743 21490200 19695639
55914 19695639 18110809 16701658 15445916 14325916 13320629 12411539 11589416 10847677
55906 10847677 10174655 9558831 8995678 8482645 8012678 7578701 7179113 6812830 6473942
55897 6473942 6157028 5862767 5592430 5341582 5105009 4883442 4679498 4490894 4313390
55888 4313390 4146854 3992890 3849699 3714616 3588813 3474344 3369156 3269801 3176671 3091894
55878 3091894 3014120 2939601 2866346 2793310 2717693 2637124 2552935 2467968 2382966 2298136 2215864
55867 2215864 2138445 2065141 1994547 1927796 1866376 1809110 1754509 1703853 1658555 1616541 1574731
55856 1574731 1533379 1494709 1458894 1424607 1392059 1362394 1335298 1310032 1287519 1268787 1252605
55845 1252605 1237145 1222600 1209842 1198146 1186768 1177181 1171054 1167410 1164319 1161939 1161238 1161082 1159308
55832 1159308 1155641 1151023 1145074 1136588 1125592 1112721 1097492 1079328 1059243 1038489 1016590 992699
55820 992699 967733 943134 918678 893557 868542 845093 823402 803158 785014 769368 755009
55809 755009 740974 728551 719414 713013 707844 704013 702324 702016 701665 701356 701828 702406 701905 700631 699465
55794 699465 697894 694936 691015 686852 681500 673600 663725 653422 642893 631787 621311 613254 607592
55781 607592 603296 600824 601559 605323 610579 616613 623447 630073 634766 636725 635641 630423 620485 607616
55767 607616 594289 580449 564119 544824 524232 503675 483275 463482 445312 428841 413221
55756 413221 398332 384795 372430 360370 348610 337768 327409 316374 304905 294782 287156 281608
55744 281608 277392 274284 272116 270693 270122 270179 269673 267624 264708 262322 260768 259704 259621 261137 263270 264246
55728 264246 263821 263077 262218 260432 257783 255352 253373 251041 248315 246252 245262 244608 243902 243620 243832 243938
55712 243938 244058 245350 248469 252803 257485 262155 266541 270476 274534 279622 285745 292067 298152 304140
55698 304140 309836 314893 319778 325261 330910 335529 339254 343771 350104 357406 364426 370983 377420 383612
55684 383612 389143 393759 397123 398684 398198 396004 392579 388120 382567 375631 367008 356917 346156 335257
55670 335257 324136 313130 303619 296802 292428 289647 288369 288732 289943 291040 292468 295640 301266 309257
55656 309257 319749 332856 347688 362965 378373 394071 409173 422111 432199 439481 443425 443331
55644 443331 439821 434292 427049 417671 407171 397970 391416 386971 384146 383535 385380 388618 392001 394950
55630 394950 396821 396555 393592 388098 379917 368458 353922 337454 319774 300893 281537 263393 247328
55617 247328 232599 218539 205852 195383 186673 178672 171198 164832 159874 156039 152754 149321 145263
55604 145263 140837 136783 133377 130253 127215 124552 122412 120550 118791 117110 115225 112844 110343 108389
55590 108389 106869 104981 102418 99669 97250 95492 94910 95712 96999 97575 97566 98096 99458 100891 102224 104286
55574 104286 107406 110864 114213 117850 121844 125505 128602 131757 135146 138043 140173 142233 144419 145766
55560 145766 145758 145375 145701 146540 147298 148116 149090 149361 148089 145676 143088 140593 138035 135611 133402 130726 126986
55543 126986 122762 119181 116553 114422 112596 111270 110337 109322 107984 106498 105184 104439 104694 106031 107981
55528 107981 109932 111586 112988 114501 116778 120227 124458 128805 133383 138918 145527 152550 159779 167867
55514 167867 177238 187527 198515 210599 223755 236905 248973 259733 268898 275135 276937 274054
55502 274054 267394 257919 246263 233091 219155 205100 191434 178424 165913 153730 142311 132270
55490 132270 123334 114649 106329 99617 95021 91366 87365 83137 79395 76049 72640 69445 67100 65538
55476 65538 64206 63005 62210 61752 61307 60840 60399 59615 58063 55980 54074 52766 51943 51234 50257 48947 47820
55459 47820 47444 47445 46699 44848 42881 41784 41351 40925 40537 40527 40672 40527 40212 40084 40000 39623 39114 38860 38825 38821
55439 38821 39083 39857 40645 40538 39247 37394 35927 35546 36350 37627 38330 38168 37883 38179 38880 39482 39891 40042
55421 40042 39471 37994 36394 35680 35988 36859 38133 39803 41356 42095 42034 41782 41626 41306 40637 39794 39026 38518
55403 38518 38477 38978 39774 40515 41103 41665 42345 43242 44246 44947 45067 44901 44763 44082 41953 38728 36062 34966
55385 34966 34768 34414 33752 32889 31462 29553 28392 28947 30402 31164 30860 30306 29968 29632 29323 29439 30036 30857
55367 30857 31929 33375 34843 35898 36733 37709 38543 38821 38916 39428 39967 39547 38039 36202 34410 32422 30405
55350 30405 29076 28651 28605 28707 29406 30846 32267 32742 31987 30270 28084 26117 25000 24795 25067 25497 26083
55333 26083 26835 27754 29071 30975 33140 34968 36212 36907 36885 36015 34782 33928 33517 33010 32255 31780 31975
55316 31975 32608 33265 33746 33947 33829 33578 33349 32908 31971 30851 30172 30020 29922 29631 29313 28934 28228 27453 27497
55297 27497 28847 30865 32413 32956 32853 32792 33091 33434 33284 32625 32082 32106 32357 32231 31737 31422 31623 32229 32920
55278 32920 33220 32616 31171 29705 28849 28226 27274 26457 26756 28105 29336 29745 29791 30068 30406 30365 29963 29518
55260 29518 29196 29010 29000 29214 29729 30637 31743 32482 32563 32421 32534 32499 31509 29583 27566 26043 25055 24826 25791
55241 25791 27729 29707 31167 32303 33155 33205 32272 31006 29902 28509 26278 23735 22146 22172 23376 24947
55225 24947 26438 27796 29001 29902 30412 30724 31108 31392 31008 29825 28581 28017 27910 27546 26885 26503 26512 26391
55207 26391 25983 25855 26444 27483 28517 29412 30148 30692 31263 32206 33379 34221 34630 35149 36021 36691 36594 35941
55189 35941 35278 34729 34094 33378 32773 32384 32283 32652 33551 34691 35625 36033 35769 34865 33610 32422 31588 31287
55171 31287 31674 32678 33832 34743 35567 36512 37078 36531 35144 34169 34341 35003 35019 33980 32246 30370 28853
55154 28853 28037 27873 28034 28375 28904 29330 29181 28529 27986 27800 27569 27085 26756 26847 27004 26978 27197 27990 28763 28701
55134 28701 27978 27586 28040 28819 29145 28935 28932 30062 32596 35834 38733 40869 42602 44359 46236 48354 50940
55117 50940 53648 55372 55301 53963 52663 51998 51427 50288 48768 47560 46784 45621 43269 40178 37944 37765
55101 37765 39310 41358 43174 44709 45866 46388 46487 46737 47192 47226 46472 45328 44376 43843 43805 44247 44711 44512
55083 44512 43610 42707 42262 42059 41994 42451 43463 44255 44271 43995 44087 44290 43930 43039 42168 41429 40564 39779 39688 40404
55063 40404 41318 41840 41873 41558 41089 40799 40982 41474 41751 41562 41256 41372 42041 42819 43117 42811 42405 42471 43033 43776
55043 43776 44672 45882 47133 47847 48104 48774 50352 52272 53808 55132 56897 59220 61579 63410 64332 64203
55027 64203 63453 62976 63143 63262 62659 61866 61989 63127 64231 64478 64032 63428 62886 62394 61890 61154 59993 58699
55009 58699 57879 57674 57546 57048 56434 56242 56541 56926 57163 57487 58150 58827 58720 57413 55476 53929 53139 52500
54991 52500 51307 49616 48079 47275 47370 48167 49189 49946 50363 50804 51484 52158 52550 52799 53222 53956 55149 57171
54973 57171 60195 63772 67223 70313 73258 76240 79284 82487 86023 89995 94471 99483 104836 110249
54959 110249 115974 123009 132299 143917 157331 172093 187780 203501 217998 230156 239036 243660
54947 243660 243356 238325 229425 217459 203126 187590 172406 158609 146190 134670 123988 114598
54935 114598 106861 100504 94741 89041 83741 79701 77255 75845 74841 74367 74938 76577 78829 81447 84550
54920 84550 88083 91700 95340 99577 105099 112020 119887 128331 137560 148113 160043 172467 184029
54907 184029 193761 201228 205970 207324 204935 199126 190592 180056 168321 156217 144294 132869 122440
54894 122440 113497 105859 98841 92278 86636 81857 77021 71824 67437 65002 63928 62808 61467 60893
54880 60893 61387 62015 61980 61422 60746 60123 59870 60389 61313 61530 60471 58871 57920 58123 59086 59871 59469 57601
54862 57601 55288 54022 54112 54468 54214 53746 53819 54316 54550 54201 53333 51939 50150 48574 47815 47779 47991 48370
54844 48370 49088 49813 49795 48824 47508 46379 45234 43726 42226 41537 41830 42357 42431 42310 42809 44259 46248
54827 46248 48298 50296 52159 53605 54596 55628 57080 58508 59130 58963 59021 60234 62508 64983 66989 68613
54811 68613 70510 73247 76800 80722 84861 89775 96205 104297 113620 123909 135422 148485 162856
54798 162856 177642 191723 204173 214345 221642 225384 225153 221244 214600 206266 197104 187872 179034
54785 179034 170415 161614 152994 145697 140350 136383 133071 130659 129859 130716 132724 135689 139749 144901 151234
54770 151234 159294 169363 180543 191493 201922 212498 223361 233656 242617 250172 256392 261240
54758 261240 265207 269249 273669 277634 280120 280752 279492 276226 270973 263865 254624 242697 228253 212483
54744 212483 196639 181354 167131 154560 143622 133506 123759 114953 107660 101459 95670 90486 86525
54731 86525 83646 81069 78438 76022 74041 72451 71230 70267 69086 67353 65573 64666 64816 65305 65493 65492
54715 65492 65767 66482 67334 67751 67316 66326 65807 66539 68139 69519 70144 70299 70192 69543 68319 67275 67241 68181
54697 68181 69354 70231 70873 71502 72108 72572 72939 73386 74010 74732 75446 76261 77579 79844 83043 86421 88893
54680 88893 89989 90414 91448 93768 96984 100319 103393 106195 108768 111324 114450 118627 123610 128729 133814
54665 133814 139410 146070 153848 162562 172148 182667 194382 207937 223926 242109 261496 281384
54653 281384 301761 322282 341290 356373 365763 368895 366017 357785 345132 329081 310556 290543
54641 290543 270190 250430 231609 213726 196930 181517 167584 155022 143811 134125 126213 120290
54629 120290 116375 113953 112000 109661 106879 104171 101914 100091 98572 97252 95988 94647 93233 91740
54615 91740 90005 87981 86035 84568 83357 81681 79276 76765 74942 73912 73250 72776 72738 73225 73806 74011
54599 74011 73967 74199 74837 75388 75471 75481 76181 77747 79501 80623 80854 80447 79723 78864 78004 77286 76765 76284 75586
54580 75586 74665 74011 74226 75278 76385 76849 76716 76335 75673 74643 73836 74073 75165 75892 75597 75174 75998 78293
54562 78293 81038 83229 84769 86246 88229 90771 93402 95617 97508 99696 102601 106047 109775 114011
54548 114011 119238 125626 133027 141370 150733 160979 171584 181863 191313 199667 206603 211403 213123
54535 213123 211289 206283 198816 189254 177937 165935 154739 145053 136464 128486 121288 115147 109825
54522 109825 104949 100511 96558 92873 89438 86758 85196 84301 83316 82032 80661 79189 77504 75944 75085
54507 75085 75026 75356 75760 76189 76511 76498 76164 75714 75206 74602 74081 73935 74249 75038 76492 78585 80535 81266 80559
54488 80559 79359 78797 79180 80004 80622 80776 80684 80670 80678 80270 79290 78295 78020 78561 79388 80062 80520 80818 81019 81279
54468 81279 81620 81620 80727 78947 76879 75113 73931 73553 74134 75323 76276 76376 75768 75023 74464 74029 73609 73334
54450 73334 73479 74134 75018 75695 76020 76188 76323 76323 76240 76439 77077 77702 77787 77452 77201 77182 77154 77065 77074 77040 76622 75961
54428 75961 75710 76163 76815 77076 76975 76889 76902 76821 76696 76940 77902 79430 80911 81756 81918 81965 82589 84070 86237
54409 86237 88737 91149 93032 94175 94769 95118 95314 95426 95833 96857 98155 98975 99132 99235 99702 99996 99229
54392 99229 97317 95130 93574 92883 92833 93257 94000 94509 93985 92202 89907 88072 86864 85769 84550 83497
54376 83497 82644 81499 79859 78299 77362 76733 75796 74628 73822 73616 73808 74311 75113 75843 76030 75755 75489 75373
54358 75373 75261 75381 76231 77847 79801 81940 84392 86799 88320 88683 88577 88709 89047 89201 88913 87864 85666
54341 85666 82504 79335 77012 75597 74802 74549 74663 74598 74114 73828 74390 75304 75241 73519 70816 68321 66606
54324 66606 65409 64236 62954 61804 60885 59814 58172 56268 55027 54914 55356 55518 55317 55233 55355 55164 54295
54307 54295 53119 52402 52583 53469 54513 55274 55663 55840 55993 56238 56593 56909 56978 56886 57099 57885 58816 59278 59347
54288 59347 59589 59969 59692 58385 56845 56136 56407 57101 57938 59062 60403 61543 62302 63024 64126 65568 66889
54271 66889 67634 67803 67917 68490 69386 69918 69745 69337 69371 69998 71046 72545 74483 76246 76993 76672 76171 76297
54253 76297 77009 77849 78653 79502 80258 80590 80418 80088 79997 80178 80278 79834 78582 76619 74397 72578 71770 72241
54235 72241 73716 75450 76608 76735 75994 74965 74202 73893 73846 73740 73402 72931 72591 72497 72392 71915 71216 71077
54217 71077 72008 73348 73786 72898 71662 71169 71338 71336 70832 70203 69762 69526 69683 70556 71952 73085 73378 72951
54199 72951 72253 71610 71294 71517 72132 72652 72719 72246 71140 69312 67093 65095 63498 61976 60536 59774 59939
54182 59939 60322 60100 59329 58502 57564 56104 54332 53091 52753 52748 52391 51777 51541 51972 52662 52993 52817 52592 52832
54163 52832 53463 53837 53454 52559 51933 52129 52959 53709 53876 53702 53827 54375 54652 54063 53014 52398 52290 51829 50481
54144 50481 48836 47872 47924 48651 49576 50254 50319 49772 49041 48579 48594 49289 50826 52782 54135 54226 53425 52515 51833
54125 51833 51392 51349 51740 52077 51787 50919 49972 49249 48833 48914 49584 50484 51181 51778 52670 53793 54607 54718 54131
54106 54131 53082 52042 51645 52009 52357 51930 51160 51262 52725 54892 56996 58828 60252 60934 60931 60945 61514 62365
54088 62365 62953 63261 63666 64310 64988 65521 65912 66192 66270 65900 64811 63061 61276 60239 60150 60523 60844 61045
54070 61045 61307 61788 62694 64203 66069 67620 68476 69056 70079 71726 73570 75156 76375 77308 78041 78707
54054 78707 79520 80602 81772 82603 82788 82456 82047 81876 81960 82380 83512 85613 88310 90885 93033 95023 97137
54037 97137 99350 101644 104215 107167 110266 113244 116129 119114 122278 125591 129020 132420 135475 137936
54023 137936 139763 140932 141304 140953 140446 140509 141378 142670 143832 144448 144160 142693 140212 137492 135337 133777
54007 133777 132057 129474 126049 122301 118621 115186 112236 109983 108223 106408 104235 101824 99273 96493
53993 96493 93724 91758 91162 91512 91764 91222 89823 87790 85527 83733 82972 82987 82836 81870 80288 78718 77606
53976 77606 77051 76910 76833 76506 76032 75924 76554 77749 78978 79809 80091 79865 79297 78668 78344 78596 79310 80003 80398
53957 80398 81000 82661 85383 88008 89548 90453 92000 94649 97667 100313 102723 105498 108961 113080 117760
53942 117760 122945 128666 135035 142031 149361 156736 164055 170963 176547 180154 182308 184051 185388 185306 183481
53927 183481 180984 178837 176821 174377 171925 170373 169746 169230 168436 167890 168287 169862 172533 176113 180249
53912 180249 184511 188643 192560 196152 199346 202285 205164 207981 210595 212919 214850 216239 217106 217599 217481
53897 217481 216063 213055 209187 205491 202250 199150 196078 193024 189404 184458 178475 172811 168417 164970
53883 164970 161754 158649 155800 152912 149570 145971 142730 140056 137532 134640 131183 127362 123751 120957
53869 120957 118974 117081 114783 112552 111066 109959 108071 104981 101531 98643 96334 94247 92446 91125
53855 91125 90038 88906 88059 87939 88150 87787 86722 85818 85705 85966 85874 85310 84597 83878 83157 82634 82460 82353
53837 82353 81890 81115 80483 80277 80400 80647 80805 80537 79572 78161 77088 77103 78385 80447 82409 83470 83473 83051
53819 83051 83044 83771 84978 86305 87573 88725 89859 91226 92839 94124 94383 93739 93297 94150 96438 99478
53803 99478 102554 105435 108306 111385 114577 117512 119981 122267 124787 127523 130055 132187 134209 136478
53789 136478 139008 141516 143599 144807 144935 144400 143973 143935 143694 142524 140471 138242 136366 134741 133012 131095
53773 131095 129186 127327 125210 122527 119464 116598 114149 111643 108542 105036 101831 99309 97304 95659
53759 95659 94494 93813 93262 92486 91446 90286 89199 88464 88253 88193 87478 85692 83335 81385 80495 80634 81214
53742 81214 81492 81144 80568 80383 80620 80777 80673 80672 80922 80957 80403 79606 79166 79245 79660 80219 80564 80185 79228 78839
53722 78839 80009 82230 83976 84393 83905 83242 82695 82435 82760 83546 84008 83543 82596 82203 82861 84202 85749
53705 85749 87478 89447 91215 92060 91816 91195 91101 91801 92944 94153 95303 96370 97417 98736 100546 102438
53689 102438 103585 103717 103574 104096 105436 107012 108232 108891 109125 109353 110151 111814 114092 116440 118363 119449
53673 119449 119518 119055 119148 120481 122561 124334 125337 125803 125856 125288 124147 122972 122295 122244 122773 123831 125170
53656 125170 126279 126776 126691 126325 126014 126021 126383 126742 126664 126220 126006 126403 127041 127263 126966 126675 126804 127116 127027 126307
53636 126307 125312 124585 124422 124839 125702 126763 127744 128591 129521 130592 131426 131688 131658 131866 132279 132408 132223 132272 132725
53617 132725 133001 132767 132632 133329 134654 135937 137138 138747 140765 142531 143644 144462 145608 147381 149705
53602 149705 152263 154572 156274 157471 158617 160079 161934 164022 166031 167742 169405 171576 174267 176651
53588 176651 178073 179006 180415 182395 184145 185142 185671 186221 187032 188245 189821 191196 191698 191512 191665 192821
53572 192821 194621 196351 197701 198647 199121 199162 198932 198300 196824 194492 192071 190373 189478 188981 188644 188453 188315
53555 188315 188070 187711 187307 186864 186418 186114 186030 186097 186261 186508 186667 186500 186094 185907 186343 187523 189401 191705
53537 191705 193792 195178 196298 198112 200681 202798 203431 202940 202364 202074 201844 201828 202624 204458 206958 209719
53521 209719 212583 215388 218067 221004 224765 229293 233817 237745 241334 245309 250142 255895 262520 270005
53507 270005 278247 286913 295503 303603 311178 318654 326674 335795 346312 358095 370492 382640 394158
53494 394158 405506 417551 430900 445693 461722 478460 495153 511281 526900 542343 557735
53483 557735 573016 588243 603503 618676 633707 649080 665475 682831 700143 716425 731570
53472 731570 746099 760429 774644 788738 802672 816277 829385 842049 854443 866604 878451
53461 878451 889983 901190 911800 921415 929995 937903 945358 952098 957727 962101 965062 966040 964497 960751
53447 960751 955891 950723 945123 938630 931244 923290 914782 905374 894871 883423 871262 858608 845848
53434 845848 833493 821770 810376 798731 786488 773900 761710 750484 739947 729185 717723
53423 717723 706122 695288 685506 676605 668785 662660 658512 655999 654643 654143 654162 654318 654548 655181 656625
53408 656625 659299 663717 670014 677375 684598 691357 698364 706216 714873 724469 735709 748874 763160
53395 763160 777688 792574 808270 824465 840573 856989 874850 894615 915745 937892 961508
53384 961508 987013 1014060 1042014 1070722 1100426 1131240 1162939 1195119 1227407 1259803 1292892
53373 1292892 1327379 1363216 1399428 1434974 1469463 1502875 1534923 1565146 1593548 1620734 1647254
53362 1647254 1672991 1697294 1719604 1739824 1758131 1774667 1789536 1802947 1814987 1825164 1832421
53351 1832421 1835791 1834986 1830189 1821438 1808337 1790393 1767573 1740650 1711100 1680442 1649453 1618041
53339 1618041 1585901 1553192 1520453 1488089 1456178 1424673 1393645 1363355 1334241 1306711 1280739
53328 1280739 1255720 1230828 1205547 1179846 1154084 1128836 1104579 1081309 1058578 1036133 1014451
53317 1014451 994427 976602 960859 946860 934605 924477 916689 910721 905475 900121 894648 889316
53305 889316 883844 877638 870660 863313 855396 846064 835270 824465 815205 807582 800754 794537 789575 786177
53291 786177 783847 781987 780395 779086 778287 778634 780696 784169 788161 792366 797408 803897 811702 820363 829702
53276 829702 839782 850727 862759 875991 889939 903676 916691 929148 941170 952439 962902
53265 962902 973320 984469 996031 1006815 1016022 1023792 1030544 1036284 1040736 1043814 1045607 1045930 1044199
53252 1044199 1039951 1033450 1025478 1016427 1005847 993140 978532 962989 947217 931085 914027 895716
53240 895716 876290 856284 836421 817234 798763 780784 763357 746888 731632 717366 703556
53229 703556 689650 675304 660642 646249 632577 619420 606319 593322 580848 568874 556952
53218 556952 545150 534255 524760 516246 508175 500762 494560 489582 485347 481528 478002 474450 470392 465645
53204 465645 460411 454949 449308 443274 436381 428180 418695 408451 397929 387217 376377 365814 355952
53191 355952 346789 338068 329646 321401 313129 304834 296880 289458 282224 274867 267708 261186 255045 248705
53177 248705 242240 236231 230650 224656 217747 210505 203876 198193 193224 188698 184424 180255 176383 173380
53163 173380 171476 169961 167757 164543 160972 157789 155157 152942 151225 150193 149702 149280 148560 147505 146177
53148 146177 144565 142810 141371 140641 140437 140132 139356 138322 137417 136732 136217 136020 136306 136766 136623 135289 132940
53131 132940 130394 128435 127273 126598 126063 125591 125198 124653 123653 122309 121200 120762 120817 120883 120809 120860 121265 121904
53113 121904 122439 122630 122508 122272 122012 121604 121042 120768 121291 122425 123271 123181 122425 121656 121116 120695 120385 120164 119730
53094 119730 118967 118465 118861 119715 119809 118760 117597 117383 117909 118183 117693 116564 114870 112569 110051 108079 107021
53077 107021 106599 106516 106908 107987 109582 111275 112723 113645 113770 113166 112479 112399 112906 113398 113610 114029 115188 116899
53059 116899 118554 120024 121812 124263 126924 128835 129294 128373 126891 125967 126259 127390 128284 128187 127190 125765
53043 125765 124159 122526 121283 120810 120915 121042 121034 121248 121862 122515 122838 122964 123225 123571 123626 123234 122667 122309 122317
53024 122317 122531 122635 122398 121956 121841 122613 124360 126608 128731 130453 131902 133246 134325 134811 134681 134401
53008 134401 134477 134946 135427 135626 135602 135650 136121 137321 139259 141439 143153 144153 144842 145717 146885 148214 149633
52991 149633 150995 151935 152297 152568 153455 155008 156516 157297 157282 156793 156170 155796 156053 156945 157959 158622 159033 159592
52973 159592 160425 161376 162428 163686 165031 166215 167321 168655 170099 171084 171430 171729 172524 173466 173843 173680
52957 173680 173746 174491 175555 176420 177040 177574 177892 177703 176987 176034 175146 174492 174115 173917 173710 173419 173134 172879 172513
52938 172513 172036 171852 172460 173882 175536 176706 177067 176776 176160 175362 174263 172838 171493 170855 171134 171907 172645
52921 172645 173256 173890 174476 174738 174676 174675 175063 175734 176346 176797 177436 178787 180960 183344 184987 185396 184876 184065
52903 184065 183352 182871 182741 182928 183016 182518 181458 180346 179486 178625 177393 175809 174124 172387 170457 168403
52887 168403 166657 165648 165383 165449 165399 165084 164618 164091 163437 162588 161690 161149 161466 162944 165349 167870 169619
52870 169619 170353 170537 170708 170946 171095 171123 170959 170260 168710 166450 163856 161039 157955 154925 152530 150929
52854 150929 149655 148231 146625 145003 143423 141932 140588 139213 137438 135289 133390 132240 131505 130422
52840 130422 128809 127322 126672 126833 127081 126740 125830 125047 124988 125377 125215 123776 121303 118582 116106 113917 112066
52823 112066 110798 110231 110148 110237 110317 110263 109893 109135 108223 107559 107361 107558 108068 109008 110463 112094 113252 113668 113777
52804 113777 114084 114350 113876 112663 111778 112260 113983 115943 117403 118331 118869 118995 118843 118894 119521 120567 121590
52787 121590 122401 123135 123945 124833 125715 126437 126754 126535 126014 125694 125900 126512 127167 127613 127809 127855 127904 128045 128140 127893
52767 127893 127203 126288 125272 123855 121767 119485 118043 117949 118647 119184 119072 118319 117090 115768 115008 115190 115927
52750 115927 116520 116735 116759 116657 116428 116455 117208 118490 119593 120186 120424 120158 118981 117287 116381 116913 117978 118449
52732 118449 118558 119284 120720 122054 122924 123785 124895 125938 126889 128430 131043 134141 136525 137456 137175 136679
52716 136679 137077 138768 141080 142992 144264 145499 147089 148674 149763 150350 150649 150720 150716 151082 152035 153131 153701
52699 153701 153504 152665 151303 149660 148349 148042 148884 150476 152229 153573 154109 154004 154023 154759 155952 156900 157273
52682 157273 157118 156364 155061 154046 154488 156458 158543 159255 158421 156869 155228 153547 151763 149962 148203
52667 148203 146503 145012 143879 142982 142053 141039 140081 139189 138273 137488 137164 137338 137726 138316 139586 141816 144455
52650 144455 146626 148204 150031 153052 157474 162729 167907 172099 174703 175701 175547 174631 172972 170641 168195
52635 168195 166383 165472 165160 165126 165295 165487 165175 163874 161617 158859 156053 153411 150949 148528 146005 143555
52619 143555 141761 141109 141376 141748 141589 140955 140318 139981 139872 139809 139800 140077 140845 142053 143430 144807 146255 147824
52601 147824 149234 150011 149950 149318 148596 148169 148201 148609 149099 149461 149897 150816 152138 153075 152927 151995 151345 151552 151970
52582 151970 151483 149860 148094 147298 147458 147532 146752 145498 144668 144439 144183 143567 143155 143468 143941 143451 141837 140235
52564 140235 139699 140003 140182 139784 139110 138448 137731 137017 136742 137199 138094 138919 139562 140177 140583 140266 139051 137484
52546 137484 136313 135764 135526 135241 134797 134218 133583 133105 132975 132999 132606 131372 129451 127328 125319 123464 121772
52529 121772 120266 118871 117575 116680 116592 117248 118049 118509 118745 119142 119791 120450 120881 120968 120678 120174 119830 119829 119875
52510 119875 119638 119378 119653 120411 120843 120332 119154 118066 117516 117490 117727 117765 117156 116059 115349 115626 116325 116355 115520
52491 115520 114654 114304 114027 113302 112531 112547 113460 114552 115208 115473 115682 115941 116060 115776 115049 114286 114150 114830 115572
52472 115572 115396 114282 113268 113215 113917 114612 114955 115089 115069 114777 114320 114066 114184 114433 114439 113958 112916 111542 110502
52453 110502 110475 111407 112462 112888 112661 112149 111572 111078 110998 111487 112093 112193 111753 111226 110777 110191 109560 109395 109795
52434 109795 110107 109787 109163 108890 109076 109439 109988 110893 111863 112341 112320 112314 112430 112090 110926 109435 108366 107851 107521
52415 107521 107166 106934 107097 107915 109476 111346 112577 112479 111274 109705 108199 106828 105883 105867 106808 108058 108987
52398 108987 109549 109993 110348 110455 110295 110053 109986 110328 111158 112198 112942 113219 113494 114352 115785 117181 117961 118026
52380 118026 117678 117400 117698 118854 120640 122455 123886 125043 126236 127460 128351 128657 128537 128415 128605 129127
52364 129127 129793 130488 131407 132967 135334 138075 140457 142135 143310 144171 144547 144335 143937 143825 143871 143651 143352
52347 143352 143754 145119 146721 147808 148617 149989 152304 155140 157743 159484 160141 160232 160802 162400 164451 166099
52331 166099 167404 169087 171371 173831 176330 179176 182244 184844 186831 189076 192367 196406 200377 203886
52317 203886 206903 209378 211590 214336 218063 222164 225836 229305 233425 238313 243240 247843 252699 258607
52303 258607 265933 274703 284695 295319 305906 316200 326181 335588 344368 353540 364647 377977 392038
52290 392038 405186 417262 429311 442331 456654 471928 487122 501074 513651 526065 539422
52279 539422 553325 566470 578351 589636 600978 612123 622334 631193 638837 645688 652068 657879
52267 657879 662706 666356 669136 671363 672894 673511 673587 673822 674405 674863 674706 673767 671984 669440 666708 664599
52251 664599 663333 662418 661535 661105 661664 663134 665132 667708 671336 676328 682737 690646 700026 710298 720620
52236 720620 730872 741954 754663 768440 781675 793263 803520 813539 824015 834928 845997
52225 845997 856920 867244 876468 884413 891224 896895 901093 903560 904296 903189 899845 894185 886860 878655
52211 878655 869620 859258 847487 834915 822135 809245 796222 783342 770936 758995 747297 735800
52199 735800 724730 714329 704687 695747 687417 679688 672650 666291 660330 654438 648617 643197 638428 634254
52185 634254 630499 627043 623758 620486 617222 614121 611263 608557 605995 603785 602028 600388 598254 595213
52171 595213 591292 586853 582386 578324 574850 571813 568870 565796 562731 560123 558361 557348 556527 555396
52157 555396 553868 552042 549827 547142 544354 542066 540414 538907 537054 534817 532393 529971 527931 526772
52143 526772 526398 525789 523919 520936 518002 515968 514574 513056 511155 509295 507969 507191 506552 505695 504665
52128 504665 503816 503433 503482 503691 503732 503355 502549 501673 501230 501383 501842 502260 502570 502841 503152 503792 505216 507467 509976
52109 509976 512426 515544 520377 526832 533687 540216 547114 555428 565219 575828 587030 599168 612363
52096 612363 626364 641228 657436 675085 693503 712052 730860 750377 770529 790764 810715
52085 810715 830271 849039 866313 881765 895818 909117 921837 933600 943838 952076 958173 962515
52073 962515 965839 968612 970644 971371 970371 967543 963148 957859 952428 946908 940422 932147 922350 912034
52059 912034 901746 891350 880967 871377 863174 856030 849205 842492 836298 831022 826698 823135 820182
52046 820182 817980 817104 818115 820691 823494 825347 826441 827988 830830 834835 839587 845045 851325 858234
52032 858234 865367 872426 879177 885302 890594 895243 899664 904011 907989 911159 913305 914444 914632 913851 912020
52017 912020 909024 904735 899140 892453 884971 876742 867456 856846 845056 832424 818923 804124 787840
52004 787840 770507 752708 734514 715632 696104 676452 657066 637807 618381 598868 579568
51993 579568 560528 541631 523185 505996 490608 476669 463338 450152 437211 424607 412071
51982 412071 399237 385932 372085 357687 343045 328759 315197 302221 289658 277808 267149
51971 267149 257834 249830 243285 238268 234274 230538 226791 223261 219947 216448 212556 208475 204387 200290
51957 200290 196406 193173 190634 188278 185676 182849 179909 176957 174509 173252 172895 171980 169492 166176 163611
51942 163611 162344 161629 160690 159454 158180 157023 156014 154975 153473 151309 148942 147057 145874 145294 145370
51927 145370 145975 146242 145211 143109 141265 140636 141019 141721 142286 142326 141426 139712 138062 137263 137238 137365 137263 136962
51909 136962 136605 136288 136051 135796 135341 134636 133768 132736 131537 130540 130418 131542 133639 136092 138320 139892
51893 139892 140714 141272 142328 144186 146468 148669 150575 152163 153598 155485 158593 163049 168177 173397 178844
51878 178844 184844 191268 197912 205153 213710 223934 235784 249354 265041 283129 303547 325909
51866 325909 349480 372927 394262 411153 421597 424625 420544 410364 395049 375537 353314 330333
51854 330333 308093 287122 267443 249132 232281 216970 203596 192758 184484 177971 172435 167719
51842 167719 163778 160182 156692 153815 152088 151170 150310 149373 148700 148230 147564 146714 145979 145188 143922 142515
51826 142515 141918 142353 142896 142690 141920 141227 140804 140534 140486 140725 140916 140636 139967 139442 139524 140308 141485 142407 142541
51807 142541 142042 141701 142042 142705 142958 142574 141883 141182 140476 139722 138992 138387 138037 138196 139130 140794 142706 144164
51789 144164 144637 144108 143105 142300 141952 141851 141796 141851 142044 142079 141724 141302 141437 142271 143252 143792 143838 143617 143119 142201
51769 142201 141106 140390 140183 139899 139049 138088 137886 138438 138714 138045 137069 136805 137302 137870 138397 139538 141490 143326
51751 143326 143984 143408 142370 141563 141326 141864 143130 144525 145251 145040 144306 143530 142821 142106 141428 140906 140540 140224
51733 140224 139872 139438 138901 138319 137833 137558 137491 137560 137675 137677 137266 136204 134686 133459 133337 134469 136125 137311
51715 137311 137605 137376 137314 137823 138792 139715 140044 139561 138550 137564 137040 137113 137644 138287 138656 138722 139019 140170 142100
51696 142100 144041 145537 147222 150284 155209 161165 166662 170582 172603 172861 171456 168346 163623 157731
51682 157731 151328 145013 139259 134488 131021 128916 127991 128014 128778 130010 131414 132811 134101 135066 135483 135439
51666 135439 135283 135155 134833 134247 133862 134212 135242 136462 137713 139341 141508 143625 144747 144445 143200 141945
51650 141945 141278 141045 140658 139809 138795 138103 137802 137544 137064 136432 135790 135146 134480 133786 132805 131104 128756 126758
51632 126758 126205 127021 127979 128140 127845 127949 128485 128685 128177 127569 127673 128640 130107 131791 133550 135082 136036
51615 136036 136401 136460 136357 136044 135673 135749 136669 138231 139711 140380 139985 138934 138075 138089 138963 140130 141158 142136
51597 142136 143296 144480 145276 145593 145823 146339 147086 147806 148535 149609 151167 152840 154094 154777 155227 155848 156757
51580 156757 157839 159016 160375 162124 164391 167037 169641 171866 173857 176081 178664 181050 182510 182831
51566 182831 182427 181921 181768 182056 182396 182125 180953 179338 178028 177215 176438 175216 173518 171678 170202 169646
51550 169646 170231 171472 172480 172859 173019 173487 174227 174903 175527 176486 177957 179535 180439 180028 178311 176085 174398
51533 174398 173591 172936 171419 168870 166146 164231 163328 162794 161776 159904 157518 155361 153928 153080 152278 151197
51517 151197 150050 149272 148999 148981 148997 149188 149808 150742 151492 151715 151543 151281 151033 150846 150927 151389 151912 152039 151737
51498 151737 151345 151041 150769 150616 150751 150897 150422 149177 147811 147028 146951 147427 148420 149724 150754 151213 151659 152816
51480 152816 154485 155721 156017 155844 156037 157076 158982 161440 163882 165842 167343 168769 170391 172302 174612
51465 174612 177159 179122 179522 178345 176590 174972 173076 170175 166336 162208 158120 154017 150102 146819
51451 146819 144158 141596 138892 136391 134290 132131 129491 126805 124993 124387 124562 125151 126235 127750 129050
51436 129050 129500 129254 129028 129205 129443 129092 127749 125536 123143 121440 120709 120309 119514 118590 118526 119691 121321
51419 121321 122477 122900 122641 121481 119286 116565 114094 112145 110482 108891 107248 105276 102841 100436 98842
51404 98842 98262 98159 97973 97591 97102 96588 96263 96472 97338 98599 99862 100793 101201 101271 101712 103213 105658 108158
51386 108158 109921 110762 110835 110382 109887 110004 111008 112531 114003 115154 116071 117061 118469 120291 121936 122801
51370 122801 123058 123348 123718 123539 122640 121765 121535 121581 121173 120104 118474 116233 113576 111251 109710 108399 106651
51353 106651 104873 103957 103853 103624 102838 101863 100871 99570 98134 97379 97699 98627 99826 101601 103956 105963
51337 105963 106827 106937 107140 107464 107356 106877 106748 107251 107821 107853 107395 106922 106783 107040 107514 107894 107933 107628 107222
51318 107222 107146 107960 109863 112018 112791 111292 108432 105960 104627 103857 103028 102217 101530 100513 98784 96806
51302 96806 95482 95170 95420 95633 95671 95900 96770 98312 99965 101041 101408 101582 102082 102931 103884 104895 106211
51285 106211 108158 111005 114752 118886 122512 124999 126437 127364 128188 128998 129666 129919 129427 128071 126095 123876
51269 123876 121617 119362 117115 114855 112652 110889 110068 110115 110210 109673 108763 108191 108060 107874 107540 107688 108822
51252 108822 110684 112751 114902 117192 119276 120567 120950 121017 121540 122847 124718 126672 128291 129411 130173
51237 130173 131006 132436 134675 137246 139222 140045 140008 139713 139279 138556 137960 138371 139936 141602 142387 142684 143663
51220 143663 145596 147483 148417 148601 148720 148887 148737 148217 147625 146863 145282 142556 139424 137171 136418 136623 136641
51203 136641 135538 132989 129350 125545 122606 120968 120277 120003 120065 120637 121561 122384 123022 123979 125692 127871
51187 127871 129712 130675 130931 131086 131600 132414 133081 133271 133085 132845 132681 132499 132247 131988 131724 131400 131073 130830
51169 130830 130542 130011 129436 129330 129838 130491 130865 131102 131479 131773 131523 130733 129891 129395 129367 129949 131269 132999
51151 132999 134344 134747 134477 134377 135129 136819 139034 141272 143314 145238 147067 148483 149057 148714 147862 147066
51135 147066 146696 146836 147338 147951 148560 149258 150128 151077 152034 153143 154495 155804 156698 157222 157689 158067 157980 157453
51117 157453 157086 157219 157344 156791 155704 154852 154600 154564 154318 153956 153783 153870 154195 154935 156279 157970 159363 159946
51099 159946 159692 158927 158102 157716 158158 159365 160734 161656 162171 162903 164292 165979 167091 167113 166393 165791 165877 166534
51081 166534 167310 167991 168672 169280 169371 168609 167317 166289 166095 166721 167804 168922 169690 169861 169475 168779 168027 167530
51063 167530 167764 168959 170512 171295 170814 169773 169227 169472 170021 170420 170703 171202 172182 173562 174817 175360 175212
51046 175212 175065 175470 176261 177041 177884 179109 180655 182241 183954 186140 188742 191226 193177 194582 195635
51031 195635 196705 198404 201096 204361 207467 210349 213503 216880 219624 221183 222057 223087 224514 226137
51017 226137 227898 229872 232016 234340 237050 240190 243472 246747 250260 254042 257489 260173 262768 266547
51003 266547 272026 278654 285819 293520 302049 311489 321781 332865 344599 356868 369976 384636 401283
50990 401283 419517 438435 457448 476692 496759 518185 541201 565913 592667 622158 655071
50979 655071 691620 731554 774645 821003 870867 924071 979770 1036698 1093677 1149882 1204627
50968 1204627 1256990 1305783 1349883 1388470 1420935 1446772 1465697 1477765 1483264 1482609 1476414 1465564
50956 1465564 1451053 1433761 1414433 1393767 1372427 1351114 1330650 1311778 1294591 1278241 1261492
50945 1261492 1243656 1224896 1205658 1185988 1165402 1143208 1118805 1091816 1062209 1030334 996712
50934 996712 961655 925204 887474 848922 810108 771431 733510 697659 665297 636591 610305
50923 610305 585450 562588 542860 526168 511268 497452 485108 474505 465095 456478 449101 443376
50911 443376 438836 434904 431867 430233 429505 428587 427234 426266 426335 427294 428829 430963 433640 436458 439198 442206
50895 442206 445912 450277 455044 460343 466758 474864 484771 496031 507924 520013 532501 546046 561231
50882 561231 578352 597532 618723 641532 665333 689753 715068 742105 771695 803989 838253
50871 838253 873577 910040 948899 991475 1038217 1089275 1145566 1208512 1278868 1356563 1441742
50860 1441742 1535241 1637717 1748825 1867433 1992101 2120994 2251923 2382893 2512155 2637178
50850 2637178 2753912 2857750 2945243 3014638 3065121 3096288 3108410 3102577 3080295 3043257 2993817
50839 2993817 2935414 2872093 2807445 2743996 2683448 2627306 2577132 2534163 2498643 2469451 2444325
50828 2444325 2420474 2395262 2366589 2332934 2293168 2246448 2192304 2130714 2061930 1986281 1904324
50817 1904324 1817209 1726710 1634797 1543215 1453495 1367217 1285996 1211042 1142693 1080478 1023851
50806 1023851 972920 928301 890210 857940 830404 806983 787559 771902 759516 750106 743771 740503
50794 740503 739728 740478 741912 743565 745334 747346 749664 751937 753490 753933 753597 753214 753236 753565 753936 754380 755212
50777 755212 756617 758348 760025 761721 764042 767537 772192 777702 783995 791114 798621 805553 811105 815172
50763 815172 818129 820321 821871 822798 823206 823464 824311 826634 831133 838265 848396 861739 878191 897581
50749 897581 920213 946956 978664 1015715 1058224 1106502 1161069 1222204 1289502 1361798 1437514
50738 1437514 1515128 1593297 1670529 1745003 1814942 1878922 1935496 1982671 2018209 2040406 2048306
50727 2048306 2041496 2020444 1987141 1944736 1896271 1844128 1790652 1738548 1690231 1647223 1610341
50716 1610341 1579910 1555447 1535796 1519972 1507396 1496845 1485916 1472148 1454220 1431450 1402827
50705 1402827 1367566 1326356 1281031 1233030 1182969 1131603 1080188 1029735 980810 934393 892077
50694 892077 854893 822504 794039 769240 748333 731246 717557 707044 699793 695908 695423 698406
50682 698406 704808 714305 726586 741642 759502 779670 801112 822844 844428 865867 887128 907732
50670 907732 926849 943894 959065 973109 986530 999275 1011280 1023002 1035041 1047420 1059557
50659 1059557 1070977 1081761 1092242 1102446 1111993 1120503 1128006 1134988 1142045 1149587 1157887 1167360 1178592
50646 1178592 1191973 1207366 1224208 1241822 1259582 1276945 1293505 1308967 1322884 1334410 1342513
50635 1342513 1346583 1346816 1344029 1339089 1332417 1323849 1312916 1299370 1283580 1266415 1248696 1230830 1213008
50622 1213008 1195622 1179268 1164361 1150969 1139104 1128913 1120399 1113240 1107228 1102809 1100754 1101250 1103636
50609 1103636 1107009 1110608 1113419 1113998 1111202 1104865 1095289 1082253 1065030 1043323 1017698 989076 958256
50596 958256 925981 893041 860127 827875 797172 769004 743815 721361 701403 684232 670233
50585 670233 659314 651063 645156 641120 637956 634595 630822 627345 624915 623723 623668 624726 626744 629274
50571 629274 632038 635463 640368 647138 655488 665160 676553 690409 706988 725743 745834 766729 788262
50558 788262 810283 832452 854350 875655 896272 916380 936322 956264 976052 995623 1015580
50547 1015580 1037051 1060767 1086473 1113454 1141536 1171314 1203523 1238461 1276086 1316452 1359963
50536 1359963 1407286 1459048 1515464 1576159 1640439 1707622 1776946 1847187 1916727 1984125 2048282
50525 2048282 2107872 2160922 2205379 2239965 2264161 2277595 2279936 2271322 2252213 2222605 2182061 2130975
50513 2130975 2071451 2006456 1938333 1868547 1798496 1729812 1663920 1601972 1545363 1495620 1453484
50502 1453484 1418598 1390407 1368954 1354473 1346754 1345475 1350747 1362634 1380256 1402009 1426651 1453472
50490 1453472 1481184 1507210 1528435 1542363 1547323 1542085 1525942 1499143 1462859 1418586 1367747 1311795
50478 1311795 1252415 1191437 1130625 1071447 1014865 961280 910944 864539 823192 787638 757414
50467 757414 731125 707632 686847 669305 655194 644029 635095 627912 622264 618152 615822 615617 617598
50454 617598 621468 626961 634061 642682 652412 662836 673917 685672 697578 708735 718672 727639 736042
50441 736042 743911 751199 758382 766406 776008 787144 799103 811116 822967 835128 848394 863380
50429 863380 880255 898755 918318 938442 959178 981317 1005827 1033034 1062490 1093626 1126258
50418 1126258 1160346 1195525 1231121 1266584 1301688 1336303 1370107 1402479 1432551 1459362 1482105
50407 1482105 1500268 1513518 1521367 1522968 1517329 1503742 1482099 1452892 1417051 1375758 1330254 1281603
50395 1281603 1230598 1177955 1124609 1071779 1020877 973436 930905 894050 862452 834971 811004
50384 811004 791089 776129 766330 761276 760791 765212 774702 788543 805215 823019 840736 857907 874454
50371 874454 889844 902660 911217 914474 912074 903749 889289 869231 845093 818601 790916 762726
50359 762726 734696 707453 681217 655791 630964 606893 584140 563395 545037 528892 514471
50348 514471 501427 489735 479535 471053 464580 460263 457832 456835 457097 458618 460975 463325 465239 467246
50334 467246 470277 474682 479934 485054 489248 492432 495357 499010 503693 508896 514122 519423 524934 530361
50320 530361 535369 540135 545062 550212 555505 561248 567859 575189 582808 591050 601115 613806 628606
50307 628606 644506 661620 681655 706564 736495 768630 797871 819080 829291 828227 817143 797690
50295 797690 772009 743262 715030 689670 667398 647239 628676 612080 597765 585284 573970
50284 573970 563714 554769 547084 540343 534501 529678 525596 521811 518542 516507 515644 514850 513511 512615 513530
50269 513530 516207 519440 522608 526127 530192 534159 537527 540801 544872 550020 555922 562219 568672 575041
50255 575041 581171 587010 592299 596498 599242 600671 601103 600655 599451 597887 596277 594345 591465 587406 582590
50240 582590 577588 572576 567345 561755 556121 551118 547205 544255 541915 540257 539699 540278 541460 542923 545167
50225 545167 549015 554756 562097 570702 580396 591099 603040 616919 633380 652306 673126 695829
50213 695829 721186 749788 781280 814769 849638 885627 922331 958953 994505 1028040 1058713
50202 1058713 1085836 1108953 1127892 1142866 1154533 1163737 1170973 1176123 1178701 1178155 1173797 1164660 1149726
50189 1149726 1128343 1100356 1066043 1026170 982081 935445 887808 840411 794296 750348 709233
50178 709233 671517 637860 608837 584428 563842 545965 529927 515297 502010 490212 480027
50167 480027 471286 463597 456699 450552 445041 439915 435191 431312 428536 426376 424026 421193 418100 414783
50153 414783 410908 406435 401951 398084 394899 392102 389534 387170 384810 382167 379218 376250 373567 371271
50139 371271 369280 367418 365515 363568 361743 360201 358992 358245 358333 359696 362525 366615 371414 376163 380232
50124 380232 383532 386568 390023 394335 399666 405974 412965 420184 427350 434489 441672 448892 456399 464873
50110 464873 474995 486962 500548 515369 530895 546684 563054 581190 602083 625565 650932
50099 650932 678307 708750 743110 781440 823566 869529 919302 972658 1029540 1089928 1153055
50088 1153055 1217249 1280842 1342795 1402159 1457642 1508368 1554742 1597980 1638870 1677252 1712302
50077 1712302 1742755 1766963 1783157 1789710 1785075 1768024 1738505 1698067 1648932 1592810 1531001 1465219
50065 1465219 1397507 1329366 1261742 1196004 1134167 1077807 1027213 981892 941474 905822 874721
50054 874721 847908 825199 806217 790188 776287 764086 753352 743642 734421 725542 717214 709492
50042 709492 702092 694736 687441 680293 673140 665668 657735 649473 641081 632640 624206 616022 608483 601828
50028 601828 595968 590683 585955 582037 579224 577618 577090 577372 578151 579181 580321 581504 582708 583936 585144
50013 585144 586186 586970 587671 588545 589488 590075 590246 590638 591867 593731 595495 596792 597659 597764 596317 593046
49997 593046 588738 584436 580374 576088 571271 566116 560941 555927 551261 547307 544493 543057 542840 543343 544246
49982 544246 545965 549500 555566 564084 574708 587534 603030 621523 643140 668044 696304 727578
49970 727578 761316 797215 835053 874072 912873 949981 984233 1014761 1041116 1063553 1082738
49959 1082738 1098988 1112108 1122003 1128804 1132012 1129981 1120784 1103430 1077914 1044548 1003969 957736
49947 957736 908175 857427 807003 758335 713073 672327 635956 603087 573233 546559 523174
49936 523174 502664 484439 468192 453803 441090 429901 420298 412367 405874 400326 395407 391111 387447
49923 387447 384222 381134 377911 374231 369814 364739 359502 354546 349931 345676 342134 339580 337500 334848
49909 334848 331184 327148 323646 320962 318957 317698 317324 317427 317153 316081 314598 313233 311967 310512 309041
49894 309041 308249 308581 309668 310634 310833 310123 308629 306627 304700 303630 303754 304495 304848 304297 303084 301671
49878 301671 300343 299338 298892 298912 298883 298453 297934 297947 298700 299848 300949 301743 302092 301950 301491 301121 301395 302918
49860 302918 306074 310565 315414 319684 323106 325817 327830 329260 330828 333404 336872 340010 341742 342116
49846 342116 341911 341730 341793 342130 342526 342454 341443 339464 336830 333975 331489 329951 329283 328570 327019 324967 323453
49829 323453 322916 322852 322732 322679 323047 323869 325014 326544 328454 330257 331253 331223 330666 330297 330484 331123 331870 332404
49811 332404 332524 332123 331109 329457 327387 325383 323888 322957 322282 321553 320652 319484 317823 315574 313077 310909
49795 310909 309309 308030 306823 305844 305362 305255 305019 304241 302879 301217 299760 299079 299375 300213 300963 301477 302034
49778 302034 302655 302951 302736 302322 301973 301530 300905 300511 300751 301420 302136 303177 305258 308503 312198 315706 319156
49761 319156 323061 327523 332014 335669 337639 337464 335422 332464 329614 327417 325943 325121 324840 324784 324367 323032
49745 323032 320751 318180 316169 315075 314618 314412 314333 314280 313996 313474 313321 314226 316137 318363 320419 322389 324417
49728 324417 326373 328137 329766 331087 331489 330536 328642 326866 326061 326358 327379 328754 330436 332616 335328
49713 335328 338183 340636 342450 343735 344581 344955 345057 345326 345913 346440 346572 346601 347146 348464 350380 352732 355461
49696 355461 358306 360823 362873 364827 367185 370209 373981 378431 383062 386916 389227 390120 390327 390228 389526
49681 389526 388046 386429 385647 385965 386815 387675 388657 390071 391811 393417 394513 394972 394814 394220 393472 392710 391917
49664 391917 391294 391325 392172 393317 394243 395266 397166 400148 403821 408228 414272 422798 433559 445286 456456
49649 456456 465889 472925 477299 478766 476931 471788 464360 456283 448641 441659 435533 430884 428017 426339
49635 426339 425077 424188 424042 424584 425388 426380 427865 429845 431794 433186 433937 434338 434874 436044 438001 440341
49619 440341 442575 444841 447766 451562 455592 459077 461979 464937 468418 472210 475806 479052 482203 485447
49605 485447 488730 492145 496083 500635 505123 508829 512037 515698 520052 524371 528305 532617 538021 543968
49591 543968 549418 554360 559667 565612 571441 576426 580617 584425 588202 592477 597908 604590 611760 618569
49577 618569 624848 630938 637114 643520 650369 657735 665208 672103 678079 683426 688725 694359 700326 706357
49563 706357 712106 717257 721693 725648 729573 733662 737616 741149 744627 748722 753376 757605 760609 762673
49549 762673 764644 766987 769744 772965 776449 779385 780998 781554 782155 783538 785567 787842 790179 792448 794565
49534 794565 796794 799557 802804 806059 809160 812443 816141 820195 824820 830554 837412 844580 851272 857349
49520 857349 862704 866682 868828 869825 870960 872740 874584 875800 876311 876309 875678 874057 871305 867713 863730 859541
49504 859541 854954 849730 843906 837654 830912 823509 815638 807897 800732 794065 787557 781026 774540 768338
49490 768338 762655 757354 751879 745995 740526 736673 734452 732378 728967 724017 718178 711997 705840 700109
49476 700109 694829 689371 683283 677061 671545 666833 662478 658490 655332 652979 650690 647834 644413 640710
49462 640710 636943 633374 630282 627734 625711 624383 623762 623157 621626 619192 616986 615926 615708 615402 614667
49447 614667 613974 613934 614827 616687 619523 623420 628478 634531 640885 646567 650938 653868 655264 654770 652254
49432 652254 648420 644559 641577 639422 637501 635544 633919 633117 633141 633636 634556 636325 639153 642594 646135
49417 646135 649971 654664 660167 665769 671093 676632 683031 690274 697943 706031 715155 725963 738452 751703
49403 751703 764233 774830 783336 790621 797766 805397 813613 822148 830411 837756 844034 849768 855572 861548
49389 861548 867359 872667 877290 881174 884500 887685 891035 894479 897843 901236 904947 909177 914147 920251
49375 920251 927652 935740 943471 950363 956804 963282 969695 975666 981243 986939 993182 1000052 1007490 1015470
49361 1015470 1023833 1032211 1040280 1048086 1056040 1064597 1073944 1083890 1094009 1103974 1113855 1124023 1134728
49348 1134728 1145785 1156773 1167489 1178069 1188657 1199114 1209140 1218631 1227851 1237273 1247179 1257337
49336 1257337 1267097 1275963 1284083 1292037 1300123 1308075 1315511 1322294 1328285 1333073 1336406 1338793 1341267 1344472
49322 1344472 1348172 1351694 1354626 1357067 1359454 1362229 1365534 1369073 1372297 1374708 1375970 1375953 1374944 1373692
49308 1373692 1372866 1372452 1371906 1370871 1369430 1367718 1365734 1363611 1361651 1359933 1358280 1356777 1355845 1355529 1355195
49293 1355195 1354347 1353313 1352595 1351903 1350575 1348818 1347747 1347992 1348873 1349277 1348941 1348569 1349000 1350553 1352960 1355575
49277 1355575 1357731 1359144 1359977 1360473 1360685 1360657 1360572 1360412 1359644 1357644 1354433 1350716 1346986 1342718 1336568 1327369
49261 1327369 1315022 1300451 1284770 1268496 1251603 1234207 1216821 1199819 1183009 1166145 1149684
49250 1149684 1134543 1121085 1108752 1096771 1084784 1072649 1060153 1047409 1035205 1024424 1015118
49239 1015118 1006619 998500 991008 984421 978446 972592 966902 962031 958561 956361 954581 952304 949246 945834
49225 945834 942550 939373 936128 933162 931222 930582 930776 931357 932435 934153 936115 937878 939724 942358 945904
49210 945904 949760 953483 957320 961694 966541 971357 975698 979449 982839 986376 990648 996055 1002664 1010166
49196 1010166 1017866 1024889 1030786 1035941 1041127 1046665 1052318 1057953 1063839 1070193 1076824 1083460 1090057 1096539
49182 1096539 1102590 1108058 1113338 1119058 1125542 1132869 1141260 1151021 1162136 1174224 1186879 1199821 1212802
49169 1212802 1225736 1238986 1253280 1269151 1286522 1304885 1323838 1343468 1364251 1386534 1410075
49158 1410075 1434219 1458590 1483456 1509232 1535725 1562065 1587292 1610895 1632899 1653660 1673500
49147 1673500 1692308 1709493 1724518 1737465 1748903 1759357 1769143 1778599 1788076 1797614 1806960 1816085
49135 1816085 1825400 1835307 1845722 1856251 1866732 1877382 1888483 1900098 1912216 1925171 1939881 1957447
49123 1957447 1978301 2001705 2026190 2050435 2073714 2095788 2116844 2137359 2157303 2175169 2188325
49112 2188325 2194907 2195211 2190958 2183435 2172820 2159008 2142414 2123845 2104119 2084024 2064268 2045263
49100 2045263 2027231 2010700 1996515 1985175 1976425 1969767 1965053 1962299 1961196 1961250 1962234 1964121 1966688 1969583
49086 1969583 1972708 1976117 1979632 1983104 1987059 1992408 1999197 2006122 2011685 2015542 2018346 2020636 2022366 2023395
49072 2023395 2023824 2023752 2023035 2021401 2018627 2014613 2009487 2003660 1997536 1991166 1984291 1976601 1967730 1957161 1944504
49057 1944504 1929907 1913854 1896625 1878274 1859099 1839678 1820350 1801122 1782263 1764481 1748179
49046 1748179 1732832 1717580 1702304 1687828 1675112 1664498 1655596 1647672 1640206 1633296 1627522 1623360
49034 1623360 1620767 1619439 1619214 1620080 1621968 1624792 1628589 1633436 1639382 1646595 1655297 1665247 1675521 1685192
49020 1685192 1694146 1702919 1711867 1720901 1729956 1739185 1748584 1757848 1766832 1775858 1785366 1795424 1805709
49007 1805709 1815814 1825500 1834904 1844587 1855139 1866504 1877832 1888139 1897009 1904601 1911176 1916834 1921682
48994 1921682 1926078 1930687 1936147 1942451 1948671 1953641 1957150 1960290 1964431 1969994 1976330 1982518 1987936 1992285
48980 1992285 1995532 1997927 1999764 2001064 2001673 2001758 2001839 2002160 2002320 2001852 2001053 2000924 2002198 2004684 2007650 2010665
48964 2010665 2013913 2017830 2022707 2028669 2035774 2044007 2053326 2063909 2076248 2090655 2106645 2123068 2139116
48951 2139116 2155051 2171641 2189004 2206407 2223274 2239912 2256850 2273765 2289634 2303891 2316977
48940 2316977 2329663 2342418 2355676 2370060 2385638 2401236 2415203 2426922 2437033 2446227 2454467 2461619
48928 2461619 2468191 2474990 2482441 2490589 2499468 2509121 2519640 2531612 2546168 2563940 2584148 2605308
48916 2605308 2626799 2649210 2673156 2698391 2724298 2750698 2777840 2805900 2834785 2864259 2894046
48905 2894046 2923986 2954231 2985095 3016592 3048308 3079824 3111005 3141782 3171921 3201230 3229777
48894 3229777 3257731 3285204 3312403 3339681 3367091 3394059 3419867 3444397 3468131 3491483 3514414
48883 3514414 3536706 3558222 3578738 3597778 3614929 3630287 3644321 3657230 3668598 3677842 3684889 3690190
48871 3690190 3694053 3696201 3696101 3693517 3688572 3681494 3672533 3661924 3649589 3635008 3617819 3598531 3578183
48858 3578183 3557213 3535092 3511245 3485904 3459769 3433201 3406108 3378426 3350308 3321972 3293724
48847 3293724 3266111 3239765 3215024 3191834 3169983 3149327 3129875 3111835 3095595 3081496 3069616
48836 3069616 3059790 3051806 3045619 3041519 3040124 3041969 3046965 3054401 3063570 3074264 3086632 3100791 3116654
48823 3116654 3133884 3151904 3170218 3188883 3208387 3228926 3250063 3271274 3292446 3313549 3334143
48812 3334143 3353625 3371714 3388321 3403108 3415570 3425436 3432794 3438100 3442402 3447179 3453392 3460815 3468755
48799 3468755 3477205 3486744 3497525 3509066 3521078 3533903 3548064 3563858 3581439 3600736 3621156 3641956
48787 3641956 3663103 3685387 3709536 3735629 3763370 3792328 3821765 3850904 3879697 3908868 3938816
48776 3938816 3968868 3997921 4025355 4051047 4074897 4096805 4116744 4134495 4149620 4162013 4172080
48765 4172080 4180003 4185261 4187348 4186592 4183665 4178570 4170659 4159458 4144885 4126820 4105153 4080239 4052734
48752 4052734 4022824 3990130 3954473 3916303 3876217 3834377 3790659 3745198 3698677 3652186 3606683
48741 3606683 3562416 3518918 3475741 3433116 3391754 3352333 3315457 3281737 3251261 3223117 3196134
48730 3196134 3170212 3146330 3125102 3105957 3088061 3071579 3057560 3046799 3039213 3034107 3030685 3028305
48718 3028305 3026552 3025227 3024287 3023856 3024161 3025191 3026438 3027309 3027904 3029082 3031521 3034969 3038688 3042444 3046728
48703 3046728 3051994 3057934 3063658 3068494 3072458 3075858 3078635 3080363 3081025 3081402 3082449 3084496 3087422 3091414
48689 3091414 3097105 3105092 3115840 3130058 3148715 3172637 3202635 3240040 3286506 3342984 3409172 3483800
48677 3483800 3564481 3646757 3723999 3788976 3835435 3858328 3853938 3821268 3763190 3685266 3593383
48666 3593383 3492971 3389791 3289690 3196850 3112950 3038456 2973933 2919496 2873727 2834150 2798744
48655 2798744 2766481 2736618 2708258 2680790 2654204 2628652 2603968 2579933 2556797 2535194 2515371
48644 2515371 2496692 2478058 2458861 2439446 2420586 2402547 2384834 2366823 2348489 2330380 2312963
48633 2312963 2296193 2279810 2263886 2248885 2235090 2222151 2209344 2196221 2182902 2169779 2157214
48622 2157214 2145504 2134785 2124840 2115207 2105738 2096878 2089195 2082799 2077464 2073070 2069583 2066740 2064174
48609 2064174 2061818 2059780 2057857 2055674 2053390 2051771 2051292 2051579 2052047 2052706 2053896 2055588 2057541 2060020 2063661
48594 2063661 2068414 2073148 2076704 2079081 2081182 2083581 2085982 2087985 2089961 2092853 2097216 2102734 2108671 2114551
48580 2114551 2120298 2125847 2130848 2134750 2137089 2137724 2136872 2135029 2132825 2130880 2129584 2128814 2127909 2126172 2123580
48565 2123580 2120907 2119011 2118078 2117626 2117086 2116207 2115035 2113789 2112730 2111929 2111108 2109848 2107987 2105695 2103199
48550 2103199 2100596 2097965 2095433 2093059 2090732 2088222 2085318 2081989 2078562 2075593 2073309 2071220 2068578 2065175
48536 2065175 2061403 2057502 2053149 2047939 2041956 2035649 2029354 2023114 2016738 2009844 2002113 1993698 1985254 1977325
48522 1977325 1969840 1962374 1954680 1946759 1938647 1930449 1922380 1914481 1906421 1897996 1889608 1881818 1874463 1866738
48508 1866738 1858252 1849539 1841314 1833664 1826231 1818874 1811712 1804763 1797945 1791474 1785860 1781388 1777725 1774160
$$ [...]
##END NTUPLES=NMR SPECTRUM
##END=
