##TITLE=NES1005_872015076_9232744_htFKc47TFp
##JCAMPDX= 6.0         $$ Bruker NMR JCAMP-DX V2.0
##DATA TYPE= NMR SPECTRUM
##DATA CLASS= NTUPLES
##ORIGIN= BRUKER
##OWNER= Administrator
$$ 1.72 TOPSPIN		Version 2.1
$$ 2015-07-02 04:03:52.492 -0700  Administrator@X
$$ Compression mode = diff/dup
##.OBSERVE FREQUENCY= 400.02188249412
##.OBSERVE NUCLEUS= ^1H
##.ACQUISITION MODE= SIMULTANEOUS (DQD)
##.ACQUISITION SCHEME= undefined
##.AVERAGES= 8
##.DIGITISER RES= 22
##SPECTROMETER/DATA SYSTEM= spect
##.PULSE SEQUENCE= zg30
##.SOLVENT NAME= COFFEE_meoh
##.SHIFT REFERENCE= INTERNAL, COFFEE_meoh, 1, 14.98509
##AUDIT TRAIL= $$ (NUMBER, WHEN, WHO, WHERE, PROCESS, VERSION, WHAT)
$$ ##TITLE= Audit trail, TOPSPIN		Version 2.1
$$ ##JCAMPDX= 5.01
$$ ##ORIGIN= Bruker BioSpin GmbH
$$ ##OWNER= Administrator
$$ $$ E:\/data/COFFEE/nmr/NES1005_872015076_9232744_htFKc47TFp/20/pdata/1/auditp.txt
$$ ##AUDIT TRAIL=  $$ (NUMBER, WHEN, WHO, WHERE, PROCESS, VERSION, WHAT)
(   1,<2015-07-02 04:03:45.227 -0700>,<Administrator>,<X>,<go>,<TOPSPIN 2.1>,
      <created by zg
	started at 2015-07-02 04:02:39.383 -0700,
	POWCHK enabled, PULCHK disabled,
       configuration hash MD5:
       21 0F 79 D6 B3 7B B4 F6 88 20 88 DB 03 48 BD 9F
       data hash MD5: 64K
       74 D2 5A DB C6 5E 48 63 29 EB 1A CC 38 86 74 9C>)
(   2,<2015-07-02 04:03:48.430 -0700>,<Administrator>,<X>,<proc1d>,<TOPSPIN 2.1>,
      <Start of raw data processing
       efp LB = 0 FT_mod = 6 PKNL = 1 PHC0 = 0 PHC1 = 0 SI = 32K 
       data hash MD5: 32K
       09 17 5F 5F 93 73 67 A8 1E 6C E1 96 6D E0 D7 75>)
(   3,<2015-07-02 04:03:48.711 -0700>,<Administrator>,<X>,<proc1d>,<TOPSPIN 2.1>,
      <pk PHC0 = 90.78552 PHC1 = 0 
       data hash MD5: 32K
       27 BD 26 9C 9E 01 F5 D1 74 BC 16 8C 22 6D 40 56>)
(   4,<2015-07-02 04:03:48.820 -0700>,<Administrator>,<X>,<proc1d>,<TOPSPIN 2.1>,
      <abs ABSG = 1 
       data hash MD5: 32K
       FB 12 18 40 0A 06 2F 7B B8 82 F0 72 44 00 DF DB>)
(   5,<2015-07-02 04:03:48.899 -0700>,<Administrator>,<X>,<proc1d>,<TOPSPIN 2.1>,
      <abs ABSG = 2 
       data hash MD5: 32K
       32 05 C4 6C E0 7B B3 6E AB E7 80 17 72 1D 99 28>)
(   6,<2015-07-02 04:03:48.961 -0700>,<Administrator>,<X>,<proc1d>,<TOPSPIN 2.1>,
      <abs ABSG = 3 
       data hash MD5: 32K
       8D 18 CA BF 47 08 6B 4A B4 4C 52 2E 40 B6 46 69>)
(   7,<2015-07-02 04:03:49.024 -0700>,<Administrator>,<X>,<proc1d>,<TOPSPIN 2.1>,
      <abs ABSG = 4 
       data hash MD5: 32K
       9B 5A 33 03 76 95 E5 78 47 AA A9 A9 9B 34 AC 92>)
(   8,<2015-07-02 04:03:49.070 -0700>,<Administrator>,<X>,<proc1d>,<TOPSPIN 2.1>,
      <abs ABSG = 5 
       data hash MD5: 32K
       AC C7 38 5E FF 8D 02 46 33 6F 71 17 75 1A 08 01>)
$$ ##END=
$$ 
$$ $$ hash MD5
$$ $$ 1C C6 B4 0C 0A 91 8F C5 44 2E 8F A8 9B 6D 57 83
##$RELAX= 
##$RELAX= 
##$RELAX= 
##$RELAX= 
##$RELAX= 
##$RELAX= 
##$RELAX= 
$$ Bruker specific parameters
$$ --------------------------
##$DU= <E:\>
##$EXPNO= 20
##$NAME= <NES1005_872015076_9232744_htFKc47TFp>
$$ [...]
##$TP= (0..7)
150 150 150 150 150 150 150 150
##$TP07= 0
##$TPNAME0= <>
##$TPNAME1= <>
##$TPNAME2= <>
##$TPNAME3= <>
##$TPNAME4= <>
##$TPNAME5= <>
##$TPNAME6= <>
##$TPNAME7= <>
##$TPOAL= (0..7)
0.5 0.5 0.5 0.5 0.5 0.5 0.5 0.5
##$TPOFFS= (0..7)
0 0 0 0 0 0 0 0
##$TUNHIN= 0
##$TUNHOUT= 0
##$TUNXOUT= 0
##$USERA1= <user>
##$USERA2= <user>
##$USERA3= <user>
##$USERA4= <user>
##$USERA5= <user>
##$V9= 5
##$VALIST= <valist>
##$VCLIST= <CCCCCCCCCCCCCCC>
##$VD= 0
##$VDLIST= <DDDDDDDDDDDDDDD>
##$VPLIST= <PPPPPPPPPPPPPPP>
##$VTLIST= <TTTTTTTTTTTTTTT>
##$WBST= 2048
##$WBSW= 25
##$XGAIN= (0..3)
0 0 0 0
##$XL= 0
##$YL= 0
##$YMAX_a= 625644
##$YMIN_a= -523251
##$ZGOPTNS= <>
##$ZL1= 120
##$ZL2= 120
##$ZL3= 120
##$ZL4= 120
##$ABSF1= 14.98509
##$ABSF2= -5.573092
##$ABSG= 5
##$ABSL= 3
##$ALPHA= 0
##$AQORDER= 0
##$ASSFAC= 0
##$ASSFACI= 0
##$ASSFACX= 0
##$ASSWID= 0
##$AUNMP= <proc_prof1d_extract_pilot.lims>
##$AXLEFT= 0
##$AXNAME= <>
##$AXNUC= <1H>
##$AXRIGHT= 0
##$AXTYPE= 0
##$AXUNIT= <>
##$AZFE= 0.1
##$AZFW= 0.1
##$BCFW= 0
##$BC_mod= 0
##$BYTORDP= 0
##$COROFFS= 0
##$CY= 15
##$DATMOD= 1
##$DC= 0
##$DFILT= <>
##$DTYPP= 0
##$F1P= 0
##$F2P= 0
##$FCOR= 0.5
##$FTSIZE= 32768
##$FT_mod= 6
##$GAMMA= 0
##$GB= 0
##$INTBC= 1
##$INTSCL= 1
##$ISEN= 128
##$LB= 0
##$LEV0= 0
##$LPBIN= 0
##$MAXI= 10000
##$MC2= 0
##$MEAN= 0
##$ME_mod= 0
##$MI= 0
##$NCOEF= 0
##$NC_proc= -8
##$NLEV= 6
##$NOISF1= 0
##$NOISF2= 0
##$NSP= 0
##$NTH_PI= 0
##$NZP= 0
##$OFFSET= 14.98509
##$PC= 1
##$PHC0= 90.78552
##$PHC1= 0
##$PH_mod= 1
##$PKNL= yes
##$PPARMOD= 0
##$PPDIAG= 0
##$PPIPTYP= 0
##$PPMPNUM= 2147483647
##$PPRESOL= 1
##$PSCAL= 4
##$PSIGN= 0
##$PYNMP= <proc.py>
##$REVERSE= no
##$SF= 400.02
##$SI= 32768
##$SIGF1= 0
##$SIGF2= 0
##$SINO= 400
##$SIOLD= 32768
##$SPECTYP= <>
##$SREGLST= <1H.CDCl3>
##$SSB= 0
##$STSI= 32768
##$STSR= 0
##$SW_p= 8223.68421052631
##$SYMM= 0
##$S_DEV= 0
##$TDeff= 65536
##$TDoff= 0
##$TI= <>
##$TILT= no
##$TM1= 0
##$TM2= 0
##$TOPLEV= 0
##$USERP1= <user>
##$USERP2= <user>
##$USERP3= <user>
##$USERP4= <user>
##$USERP5= <user>
##$WDW= 1
##$XDIM= 32768
##$YMAX_p= 453006734
##$YMIN_p= -685335
##$CURPLOT= <Network HP LaserJet P1505>
##$CURPRIN= <$Network HP LaserJet P1505>
##$DFORMAT= <normdp>
##$LAYOUT= <+/1D_H.xwp>
##$LFORMAT= <normlp>
##$PFORMAT= <normpl>
##$SURQMSG= 1
$$ End of Bruker specific parameters
$$ ---------------------------------
##NTUPLES= NMR SPECTRUM
##VAR_NAME=  FREQUENCY,     SPECTRUM/REAL,   SPECTRUM/IMAG
##SYMBOL=    X,             R,               I
##VAR_TYPE=  INDEPENDENT,   DEPENDENT,       DEPENDENT
##VAR_FORM=  AFFN,          ASDF,            ASDF
##VAR_DIM=   32768,         32768,           32768
##UNITS=     HZ,            ARBITRARY UNITS, ARBITRARY UNITS
##FACTOR=    0.250966925370066, 1,           1
##FIRST=     8223.43324360094, -91251,       9239
##LAST=      0,             -8841,           10937
##MIN=       0,             -685335,         0
##MAX=       8223.43324360094, 453006734,    0
$$ Real data points
##PAGE= N=1
##DATA TABLE= (X++(R..R)), XYDATA
$$ [...]
19462E28985f6100D1667a13639k7219k94265D6597a47276D18401A82717a80118
$$ 528985 -66100 41667 -113639 -140858 -435123 46597 -147276 418401 182717 -180118
19451c26421a23646L5627B9151c11748J47036f8592p71k62172A8746b64304L8613
$$ -326421 -123646 -88019 29151 -311748 -164712 -68592 -69363 -331535 18746 -264304 -225691
19440b25691A55099a37397j74553A8258N2828C3759C558c80034J38831C13368
$$ -225691 155099 -137397 -311950 18258 71086 33759 3558 -380034 -241203 313368
19429C80803a06988j61412B33943b25720j92701b5977A82889R3779b9751p7265
$$ 380803 -106988 -268400 233943 -225720 -418421 -25977 182889 276668 -29751 -107016
19419a07016J7186c5680n61596h4192k7238r7014a0138A53951n3361b19048K1068
$$ -107016 -89830 -35680 -597276 -84192 -111430 -208444 -10138 153951 100590 -219048 -197980
19408a97980C69423g0322p9427M3259l92235b22422q8062a0352k12807B4407N1883
$$ -197980 369423 -70322 -149749 -106490 -498725 -222422 -310484 -10352 -223159 24407 76290
19397G6290L782A2431L6643a22324F6798J1523J02728d4628m64792a33650p3239
$$ 76290 80072 12431 49074 -122324 66798 78321 181049 -44628 -509420 -133650 -206889
19386b06889k14026c8880F7622d1017q3761j696I0372i386B54523C2788R9332
$$ -206889 -420915 -38880 67622 -41017 -124778 -126474 90372 -9386 254523 32788 132120
19375A32120J4438a49330l9388j0498Q0923d1684A8065K12945a61414f7275j36687
$$ 132120 146558 -149330 -188718 -199216 -118293 -41684 18065 231010 -161414 -67275 -203962
19364b03962g5852k19211R6378A56886a53357M7654n7684M2311C2072d2496l20118
$$ -203962 -75852 -295063 -198685 156886 -153357 -105703 -163387 -121076 32072 -42496 -362614
19353c62614F5126L37376b44001i9621B91347A36846a73035B03392O4883a18732
$$ -362614 65126 402502 -244001 -99621 291347 136846 -173035 203392 268275 -118732
19342A74966e7439A69403h8819G0898A8025a26337m4238L0112D2470a83915F8810
$$ 174966 -57439 169403 -88819 70898 18025 -126337 -170575 -140463 42470 -183915 68810
19330c45323P4197B69289B0944a30776l94585B2764a84924h6355c4541k96560
$$ -345323 -271126 269289 20944 -130776 -525361 22764 -184924 -86355 -34541 -331101
19320c31101A41506C7517c73793J13231b3521q0222C757g0363a964j63265c1980
$$ -331101 141506 37517 -373793 -260562 -23521 -103743 3757 -70363 -1964 -165229 -31980
19308a4261j32802a1437m2850j91857D5382K1298a29707A25729c58821a8715H8912
$$ -14261 -147063 -11437 -54287 -246144 45382 66680 -129707 125729 -358821 -18715 88912
19296A1823J49445F5343f4898B448a69555d8069l8580B63789i447j36957A83671
$$ 11823 161268 65343 -64898 2448 -169555 -48069 -86649 263789 -9447 -146404 183671
19284b33212F9222d92828a46989A52637N5688P6130a14204j3565A4560K5928N455
$$ -233212 69222 -492828 -146989 152637 208325 284455 -114204 -127769 14560 40488 45943
19273D5943A5501G552c10320A30362b1548j66878Q7544m5476B4393b37114m7065
$$ 45943 15501 7552 -310320 130362 -21548 -188426 -100882 -146358 24393 -237114 -284179
19262b84179H4031a22694E632P1723B087L8433i444H7043b42065C8014J9581a43645
$$ -284179 84031 -122694 5632 77355 2087 40520 -9444 87043 -242065 38014 57595 -143645
19249A28135k109r10D5164a70420C22710b61250k7947b7219A93762i2034j4749
$$ 128135 126026 125116 45164 -170420 322710 -261250 -289197 -27219 193762 -92034 -106783
19238a06783j00011d4252k35552l06867e442k01977C3108L0473a05949B4576b1465
$$ -106783 -206794 -44252 -279804 -586671 -5442 -207419 33108 63581 -105949 24576 -21465
19226b19076A38987a1757F9962P975P4403G0652a76865g0775j21463h1307p7972
$$ -219076 138987 -11757 69962 77937 152340 70652 -176865 -70775 -192238 -81307 -159279
19215a59279A5613L3745f8856p913C16533b87337C1471b39061D09812b14236A09145
$$ -159279 15613 49358 -68856 -76769 316533 -287337 31471 -239061 409812 -214236 109145
19203C09762a56375j7391M5979F2830b97576g8284j95047J32210E6409i0340n2563
$$ 309762 -156375 -173766 -127787 62830 -297576 -78284 -273331 -141121 56409 -90340 -142903
19192a42903d3705B4713K3772K038i4531m9810k58561A9204a42421c8947a4099
$$ -142903 -43705 24713 48485 50523 -94531 -144341 -402902 19204 -142421 -38947 -14099
19180d3120A81990F547h7847n6200B44306D710J53898b11301F9339h8987B40170
$$ -43120 181990 6547 -87847 -144047 244306 4710 158608 -211301 69339 -88987 240170
19168b27913H7112L5559m3187i7894E2764e66168a78269a5924j56402K7677G4587
$$ -227913 87112 122671 79484 -97894 52764 -566168 -178269 -15924 -172326 -144649 74587
19156a16434a6383J038j43588D8893a91073E8983J530a16823j19298H5502j7843
$$ -116434 -16383 -15345 -158933 48893 -191073 58983 60513 -116823 -236121 85502 67659
19145F7659K1525a64954G3593a68204a7436l28059d5701I0524K46442A57205k7140
$$ 67659 89184 -164954 73593 -168204 -17436 -345495 -45701 90524 336966 157205 130065
19134A30065l9316i8837j64822G9177b25061N147B4355a37650D4672f3947o9963
$$ 130065 90749 -98837 -263659 79177 -225061 -219914 24355 -137650 44672 -63947 -133910
19123a33910I9417a59859G5094c38180a6530C48504a21481o4255a2193A00804
$$ -133910 99417 -159859 75094 -338180 -16530 348504 -121481 -185736 -12193 100804
19112f497l1929j80197g4847B40845B4480J48889d07627b9142n0306a1747J972
$$ -6497 -38426 -218623 -74847 240845 24480 173369 -407627 -29142 -79448 -11747 -9775
19101i775D9499a51001O5618j99400J39847c1130j4222n8200B62394i2304B5605
$$ -9775 49499 -151001 -85383 -284783 -144936 -31130 -45352 -103552 262394 -92304 25605
19089e7959j77619J5541D8883b08726Q1264d3042l27635a06268j32212a4755I5438
$$ -57959 -235578 -220037 48883 -208726 -127462 -43042 -370677 -106268 -238480 -14755 95438
19077B30620A8733K201a45288M7892F2841e7575j842A6950b35594a2275j32995
$$ 230620 18733 20934 -145288 -97396 62841 -57575 -59417 16950 -235594 -12275 -145270
19066a45270A19010g5283n5480k24202B13134f7095j90586A25536b3644D4641
$$ -145270 119010 -75283 -130763 -354965 213134 -67095 -257681 125536 -23644 44641
19055c51309C68982G0402c70057d0853r1382e1115I1092d23399B3744b34801d710
$$ -351309 368982 70402 -370057 -40853 -132235 -51115 91092 -423399 23744 -234801 -4710
19043a64148F1113b52316d8046A21616K1410h5990n2091b3960j96612h9402A87999
$$ -164148 61113 -252316 -48046 121616 143026 -85990 -138081 -23960 -220572 -89402 187999
19031b6455j00813B28495G4097a45434A44980c1165n0968F396J84740a64276D5191
$$ -26455 -127268 228495 74097 -145434 144980 -31165 -82133 6396 191136 -164276 45191
19019e4803j33189Q8441k8090e767q4078L9191A44884K55460b47595F0699O8883
$$ -54803 -187992 -99551 -127641 -5767 -89845 -50654 144884 400344 -247595 60699 129582
19008A29582b17823H7757R1970g7554A06779d2486l149H6131d6373r9058j70520
$$ 129582 -217823 87757 179727 -77554 106779 -42486 -45635 86131 -46373 -145431 -315951
18997c15951J3663L7270A50228b42976J4413N6351A35102o5123P287c4759j06358
$$ -315951 -302288 -265018 150228 -242976 -228563 -172212 135102 69979 77266 -34759 -141117
18986a41117B18378j04535b52506h3481a0794o0160A80121c953l28163d5843j650
$$ -141117 218378 113843 -252506 -83481 -10794 -70954 180121 -3953 -332116 -45843 -47493
18975d7493I3838K3603a31072l30701h4476A12900c22013a1571A39112n8273d3957
$$ -47493 93838 117441 -131072 -461773 -84476 112900 -322013 -11571 139112 80839 -43957
18963c62857a07545e0630l0079k18730L2219a05910A34769g15l04434C9253J6630
$$ -362857 -107545 -50630 -80709 -299439 -267220 -105910 134769 -715 -305149 39253 55883
18952E5883a67104N1446A03921d3706j81581g3263F7036f5641j26747r6335D2549
$$ 55883 -167104 -115658 103921 -43706 -225287 -73263 67036 -65641 -192388 -288723 42549
18940A08885E4221b34046M1806B52156i0215C92679h4450C9493K36989j15784
$$ 108885 54221 -234046 -192240 252156 -90215 392679 -84450 39493 276482 160698
18930A60698a76051A12094g8095A91249p1053a88491B11b42575A48718a66573
$$ 160698 -176051 112094 -78095 191249 120196 -188491 211 -242575 148718 -166573
18919b9649n9775F9259g278j88681A17285N3374c92647a24276n1829j7438b3194
$$ -29649 -89424 69259 -7278 -195959 117285 170659 -392647 -124276 -176105 -193543 -23194
18907A2174i4986A43640K3214p6506m1619i0209j69509B24680H2787J19435D0767
$$ 12174 -94986 143640 166854 90348 48729 -90209 -259718 224680 82787 202222 40767
18895d3997q1541A04387a46991k15124B7982J15753o6571E537c37514M8084A2609
$$ -43997 -125538 104387 -146991 -362115 27982 143735 77164 5537 -337514 -289430 12609
18883A12310c35483h3608A5596d3186D9555K01213o2967F7344g9013B86251b65387
$$ 112310 -335483 -83608 15596 -43186 49555 250768 187801 67344 -79013 286251 -265387
18871a80454M1536K0006A09991A3979b25621m8368a03451B686a72300M8886a6667
$$ -180454 -138918 -118912 109991 13979 -225621 -273989 -103451 2686 -172300 -123414 -16667
18859A01209J60201c88316b985p3681E3609b24098A77629B8046i0762n2620C4151
$$ 101209 261410 -388316 -2985 -76666 53609 -224098 177629 28046 -90762 -143382 34151
18847A50348J19329G9644B8684o661L63468F6722c92244H0714b92344A5370N5254
$$ 150348 269677 79644 28684 22023 385491 66722 -392244 80714 -292344 15370 70624
18836G0624A2253Q6099M0862g1645j26531j3786A58593e8320j12893h4732A19031
$$ 70624 12253 98352 139214 -71645 -198176 -211962 158593 -58320 -171213 -84732 119031
18824a64629q4684a14707l1520A52842c15196A0391f322q3086j61844E3061d2923
$$ -164629 -249313 -114707 -146227 152842 -315196 10391 -6322 -89408 -251252 53061 -42923
18812G0717b14752l09836B63452a13813l4493o1416l763A12357c19132a55953
$$ 70717 -214752 -524588 263452 -113813 -148306 -209722 -213485 112357 -319132 -155953
18801B29876b41399C4327a11035K1244E806e1075K0283k64389A32698a77900f7137
$$ 229876 -241399 34327 -111035 -89791 5806 -51075 -30792 -295181 132698 -177900 -67137
18789b10794A00936c75755a75066Q1214b5903j48119g2594l40366d2909H9613
$$ -210794 100936 -375755 -175066 -93852 -25903 -174022 -72594 -412960 -42909 89613
18778b91794A2175a85461N8731b2557j8153j20813B66933b4989G6006b17539a080
$$ -291794 12175 -185461 -126730 -22557 -40710 -161523 266933 -24989 76006 -217539 -1080
18766a62160j95061B07901a01042A13340a53497o374b0825B57933c09554C05443
$$ -162160 -357221 207901 -101042 113340 -153497 -159871 -20825 257933 -309554 305443
18755a38017f6072j20461j37446P2002H2351b48077r7649A1592N8062a37720M6457
$$ -138017 -66072 -186533 -323979 -251977 82351 -248077 -345726 11592 69654 -137720 -91263
18744i1263l490A74226d1299A03886c40389a44248N7418m6658j12281i4262A11239
$$ -91263 -94753 174226 -41299 103886 -340389 -144248 -86830 -133488 -245769 -94262 111239
18732g8628q8511b2190k64010p3544C2636g4859A9955L29478i7225b4874o7486
$$ -78628 -167139 -22190 -286200 -359744 32636 -74859 19955 349433 -97225 -24874 -92360
18721i2360D02f8972B24230b70436A79411f9034k03186P6076B05476E400b12678
$$ -92360 402 -68972 224230 -270436 179411 -69034 -272220 -196144 205476 5400 -212678
18709b35202n4515E5490a53543B60237h763k782j61740b578G1883J09840K6461
$$ -235202 -289717 55490 -153543 260237 -8763 -11545 -173285 -2578 71883 181723 208184
18698B08184c25117A62511a21187a5728j78519R177A6915a18455j9282b0216j73085
$$ 208184 -325117 162511 -121187 -15728 -194247 -185070 16915 -118455 -137737 -20216 -193301
18687a93301F2870a64497J6182j77895J61137D5183e9459m5284l07485R7969A01873
$$ -193301 62870 -164497 -148315 -326210 -165073 45183 -59459 -104743 -412228 -314259 101873
18675A97028a6289I5545B3418J8708a77575K0015F0352L92983F9880d24382c4214
$$ 197028 -16289 95545 23418 42126 -177575 -157560 60352 453335 69880 -424382 -34214
18663a14431j03015B7214K42424A22584a07808A07988f0905B22867b93015c4310
$$ -114431 -217446 27214 269638 122584 -107808 107988 -60905 222867 -293015 -34310
18652a18830j76164I9638b28160g6602B47717h2572J9103j52984A71092g5205
$$ -118830 -294994 99638 -228160 -76602 247717 -82572 -63469 -216453 171092 -75205
18641A130d48909h6473j43790h975F7053a99235A63463G5234a15747j35236a16431
$$ 1130 -448909 -86473 -230263 -8975 67053 -199235 163463 75234 -115747 -250983 -116431
18629a68911A91832b49690a24836j52034B2236K03108a83308A7019a93440j91226
$$ -168911 191832 -249690 -124836 -276870 22236 225344 -183308 17019 -193440 -384666
18619c84666I8383Q4778A0800L9191B2040M1765e17657d3968B30a72467j37075
$$ -384666 98383 183161 10800 49991 22040 63805 -517657 -43968 230 -172467 -309542
18608c09542A72220g9940B6303a66845f9329a6689B0481c12478e0409j16671A09279
$$ -309542 172220 -79940 26303 -166845 -69329 -16689 20481 -312478 -50409 -167080 109279
18596C33412a0067l14851J2887F940d6320O562J8957k88848B19655G1459b07946
$$ 333412 -10067 -324918 -312031 6940 -46320 -39758 -20801 -309649 219655 71459 -207946
18584e1169C5477b01308G0071c23532J11181I4800C1046J67859c93286G72b62110
$$ -51169 35477 -201308 70071 -323532 -212351 94800 31046 198905 -393286 772 -262110
18572a80291j36292M0386B93711h8771A19349n5040a64136A65249j3966a74690
$$ -180291 -316583 -276197 293711 -88771 119349 64309 -164136 165249 151283 -174690
18561a77419A68356a29111r8376B8933L2059P098A4459g7813H4537a2351l10199
$$ -177419 168356 -129111 -227487 28933 60992 68090 14459 -77813 84537 -12351 -322550
18550c22550E0425b04485j552a02436I3468a8477j90581A917O4782a85721M1621
$$ -322550 50425 -204485 -206037 -102436 93468 -18477 -209058 1917 66699 -185721 -144100
18539a44100B9055Q7215b33151G9997g2885K697r7582e939j19839G7879N0242
$$ -144100 29055 116270 -233151 79997 -72885 -70188 -167770 -5939 -125778 77879 128121
18528A28121m8068a76579j39090A821P6498B9337R6936l0184J6016c93331e7783
$$ 128121 80053 -176579 -315669 1821 78319 29337 126273 96089 112105 -393331 -57783
18516a14409m0918f4640r7611L2056k801o0676g5141A94281c41065R2905C9292
$$ -114409 -155327 -64640 -162251 -130195 -132996 -193672 -75141 194281 -341065 -248160 39292
18504A19915h0822j82912J07812A9121O4660a83226j66530J23488a05621B6394
$$ 119915 -80822 -263734 -155922 19121 83781 -183226 -349756 -226268 -105621 26394
18493E447b63799I6811C5345k88c9859A29754b26524e7938j26752P6668I0051
$$ 5447 -263799 96811 35345 35057 -39859 129754 -226524 -57938 -184690 -108022 90051
18481H7546a54061b4190k16625A6091c45727G0046a05509f426F4423c70418J25953
$$ 87546 -154061 -24190 -240815 16091 -345727 70046 -105509 -6426 64423 -370418 -244465
18470b44465B42181a72504o9527j45864A59995K9852N2960A8243f6391j24726
$$ -244465 242181 -172504 -242031 -387895 159995 189847 242807 18243 -66391 -191117
18460a91117A50744b64373A59179b50016b1542j28591H091O9768b84290J11367
$$ -191117 150744 -264373 159179 -250016 -21542 -150133 8091 77859 -284290 -172923
18450a72923B77292e7940k09861C02472b88225a40824d8621A85396D2522M1574
$$ -172923 277292 -57940 -267801 302472 -288225 -140824 -48621 185396 42522 84096
18440H4096c703C12736J0297j29633i0285m04663F6732b4762A40168a6532A62477
$$ 84096 -3703 312736 323033 193400 -90285 -494948 66732 -24762 140168 -16532 162477
18428b6067n33817C1151j0958a6287B39508a84062m6578B81846j38832b34931
$$ -26067 -559884 31151 20193 -16287 239508 -184062 -230640 281846 143014 -234931
18417D8961J6651b25787A14939M5566a27168l3196j53632C15184h7121A47122
$$ 48961 65612 -225787 114939 160505 -127168 -160364 -313996 315184 -87121 147122
18406a56686O1644A3753b06098a9336k62422e6135F0662K5701a27867C8097J13898
$$ -156686 -95042 13753 -206098 -19336 -281758 -56135 60662 86363 -127867 38097 151995
18395A51995N5761r9301J18606l7277d2988C9180A5347Q1886g4994K4528q6085
$$ 151995 207756 108455 227061 189784 -42988 39180 15347 97233 -74994 -50466 -136551
18384a36551J0204I056f9595n1141f0155o2680b0569i876I9709K04474c387F7239
$$ -136551 -126347 9056 -69595 -120736 -60155 -122835 -20569 -9876 99709 304183 -3387 67239
18371D5886c9396k56122A03539c671r1163A71126E8387A2374J04731J76994A03910
$$ 45886 -39396 -295518 103539 -3671 -94834 171126 58387 12374 117105 294099 103910
18359c19172D04877o0665a48164E29035B02627p3802O656E3677d6379A7135c35344
$$ -319172 404877 344212 -148164 529035 202627 128825 135481 53677 -46379 17135 -335344
18347a06595L2841D07065A06776a13774F9095a31612A68810a80925p9045I5863
$$ -106595 -73754 407065 106776 -113774 69095 -131612 168810 -180925 -259970 95863
18336B4775d5001k64952P0282A24125o493a11149E0120P0402J43621j12532O4992
$$ 24775 -45001 -309953 -239671 124125 117632 -111149 50120 120522 264143 151611 216603
18325B16603c0118B06643H6480a24112A09428c07816q2496a66890l1194A19773
$$ 216603 -30118 206643 86480 -124112 109428 -307816 -390312 -166890 -198084 119773
18314g4527n2928C65956B2657a25481j66802i1361b7848G3538h2617A91372d27542
$$ -74527 -127455 365956 22657 -125481 -292283 -91361 -27848 73538 -82617 191372 -427542
18302A02318g0929j3734E3686e6550p4829f422E6482A8216J14729c27912a32689
$$ 102318 -70929 -84663 53686 -56550 -131379 -6422 56482 18216 132945 -327912 -132689
18290c76319P829A72683J44368A01065b25386a06187M2468j01556j59321C7856
$$ -376319 -368490 172683 317051 101065 -225386 -106187 -63719 -165275 -324596 37856
18279a20755l04714B71806b12388B59175C9923M4626i2527G9825c94090E3910
$$ -120755 -425469 271806 -212388 259175 39923 84549 -92527 79825 -394090 53910
18268E4875L3295c89201a2857k79534A02541a24490O726j36017a21701A3899a26192
$$ 54875 88170 -389201 -12857 -292391 102541 -124490 -117764 -253781 -121701 13899 -126192
18256b7664I2034A2591a40854A04989k7529c89268J6934a72551A44769P6171f4717
$$ -27664 92034 12591 -140854 104989 77460 -389268 -372334 -172551 144769 220940 -64717
18244a87325f9850M033b4601n9374H7011a80718B07610i740K10k20634I8777D3387
$$ -187325 -69850 -65817 -24601 -83975 87011 -180718 207610 -9740 -9530 -230164 98777 43387
18231b533j00655m9448D6271K16426b62179j7525A21304g3299C06663a57659k2708
$$ -2533 -103188 -152636 46271 262697 -262179 -279704 121304 -73299 306663 -157659 -180367
18220a80367N1334L398n8699A28694r845d54859a41031A97402b18156B95912A02977
$$ -180367 -129033 -125635 -184334 128694 118849 -454859 -141031 197402 -218156 295912 102977
18208a35373j18966a15181j04061J8760A4226L15445c73327A42926a81874k9625
$$ -135373 -254339 -115181 -219242 -200482 14226 329671 -373327 142926 -181874 -211499
18198b11499A17290b25349A94469a98167d197F0665b06340B9322b62506b1696
$$ -211499 117290 -225349 194469 -198167 -4197 60665 -206340 29322 -262506 -21696
18187a62138f6641B2319Q9681C2317L89694p2478c5155j27561e5705A86814E3639
$$ -162138 -66641 22319 112000 32317 422011 349533 -35155 -162716 -55705 186814 53639
18175h9219p3396j0663d4816p1084k4748L8118A2713a97584b9655B09834a27599
$$ -89219 -162615 -173278 -44816 -115900 -140648 -102530 12713 -197584 -29655 209834 -127599
18163e0611B1630Q4543m9172g017j35096C4155b0872I947e4341B29544g2510k21852
$$ -50611 21630 106173 57001 -7017 -142113 34155 -20872 9947 -54341 229544 -72510 -294362
18151b94362A30741a24650n8115A67723a4240k61514a00480A59724L45520e484
$$ -294362 130741 -124650 -182765 167723 -14240 -275754 -100480 159724 505244 -5484
18140b88264J28373A29663J1848f1097A87907i8410j42421o1462K483N9061c5569
$$ -288264 -159891 129663 141511 -61097 187907 -98410 -240831 -302293 -299810 -240749 -35569
18128a70181d8283A38388b4625j02697A00808h2830B29295O3486c39956a12491
$$ -170181 -48283 138388 -24625 -127322 100808 -82830 229295 292781 -339956 -112491
18117b3153C16333a46378n3671O6634a6310l331m86349b08817A79751q5232A0124
$$ -23153 316333 -146378 -200049 -133415 -16310 -19641 -505990 -208817 179751 94519 10124
18105f8791j06943d4361E6544a97902Q0853j56902e4202A26515f6575H2832a01975
$$ -68791 -175734 -44361 56544 -197902 -117049 -273951 -54202 126515 -66575 82832 -101975
18093c54505C71873b81362F7550i583l4171d452B9887J27612f9221G2550Q6482
$$ -354505 371873 -281362 67550 -9583 -43754 -4452 29887 157499 -69221 72550 159032
18082A59032J25502j35515D7118a00014B26309h7119J6729C43644a37175B88780
$$ 159032 284534 149019 47118 -100014 226309 -87119 -70390 343644 -137175 288780
18071D3223a27052j87384J41333B60762b35216I4311J9589D760a23474a9286B81188
$$ 43223 -127052 -314436 -173103 260762 -235216 94311 113900 4760 -123474 -19286 281188
18059c5130j9761j8400J2066j71019O2377b631A77590B7419N4225h1151A06352
$$ -35130 -54891 -73291 -61225 -232244 -169867 -2631 177590 27419 81644 -81151 106352
18047a96907f3382D49236B09187a46763J4094a2054k63362N7320d556j62131G2525
$$ -196907 -63382 449236 209187 -146763 -132669 -12054 -275416 -218096 -4556 -166687 72525
18035a88035H2588d1236J8030k54114A37377f4193K7381J022k32869a22291B12494
$$ -188035 82588 -41236 -23206 -277320 137377 -64193 -36812 -35790 -268659 -122291 212494
18023I5505O8666b4644J1820l81123A60262L1151c16275J15189D8707B0475J09692
$$ 95505 164171 -24644 -12824 -393947 160262 191413 -316275 -201086 48707 20475 130167
18012A30167P8682I7299a64109c1209L235F1963f9661r8472a8340k70648N0439
$$ 130167 208849 97299 -164109 -31209 -27974 61963 -69661 -168133 -18340 -288988 -238549
18001b38549A3871M522a45767A56496a60352O914G1488M3427J54290G1760K27177
$$ -238549 13871 18393 -145767 156496 -160352 -153438 71488 114915 269205 71760 298937
17990B98937A24257m9259L5759P8992p2223b4920A21264b12712B75173A3593L79352
$$ 298937 124257 74998 110757 189749 117526 -24920 121264 -212712 275173 13593 392945
17979C92945q2789E6986i7740D1410d6962a1125j30276B72433a08913A40711E153
$$ 392945 310156 56986 -97740 41410 -46962 -11125 -141401 272433 -108913 140711 5153
17967B07418J39956F0365B3747J3181j1176c59629d5593A37114a99767A51878
$$ 207418 347374 60365 23747 36928 25752 -359629 -45593 137114 -199767 151878
17956B09891c06140l275j47082C8450J71953F9886O6068m6287P829a90886Q2486
$$ 209891 -306140 -309415 -456497 38450 210403 69886 135954 89667 97496 -190886 -108400
17945a08400G7356e6802j01673A47483e1412A71783D918c53566A00817J79666
$$ -108400 77356 -56802 -158475 147483 -51412 171783 4918 -353566 100817 280483
17935B80483i6070j08505B72846a0207D1273d6691A44777a1202j05532C42473
$$ 280483 -96070 -204575 272846 -10207 41273 -46691 144777 -11202 -116734 342473
17924i3836A2726K12708D014c35679A72866O0131b00843K3449B06365a29112j27165
$$ -93836 12726 225434 4014 -335679 172866 232997 -200843 -177394 206365 -129112 -256277
17913b56277q4166g4538K1657B34488J93279e1997B37461N5458a46278r4759A79815
$$ -256277 -340443 -74538 -52881 234488 427767 -51997 237461 292919 -146278 -241037 179815
17901f5094G504a75177B22480D4117a72033F3837a709n6513C3179a11279H9065
$$ -65094 7504 -175177 222480 44117 -172033 63837 -1709 -58222 33179 -111279 89065
17889C2740L9794N534J19557j7224p6588f0090a7659A65784J76161a49276k96041
$$ 32740 72534 78068 197625 180401 103813 -60090 -17659 165784 341945 -149276 -445317
17878d45317g4172B5428P0572a71087C76548j21624j08271b9656E7844J82134
$$ -445317 -74172 25428 96000 -171087 376548 254924 146653 -29656 57844 239978
17868B39978o4494q3877b2335j0462A44543a29808o3259A18791C9371O4867J19524
$$ 239978 175484 91607 -22335 -32797 144543 -129808 -193067 118791 39371 104238 223762
17857B23762i161j8588k57348a4487j48137d2733m2035A08929O8798c25652A8219
$$ 223762 -9161 -27749 -285097 -14487 -162624 -42733 -84768 108929 177727 -325652 18219
17845A21785d1524B48227a45369A01847k3429R342c11266F9454a69644A00872
$$ 121785 -41524 248227 -145369 101847 78418 87760 -311266 69454 -169644 100872
17834e7221A25401J36236q4732J2933b33098B7702a71730o4727F7423c6178B13478
$$ -57221 125401 261637 176905 189838 -233098 27702 -171730 -236457 67423 -36178 213478
17822B35262F9842J35290E6330J93113q3725a34147a420A29370L25977j16412
$$ 235262 69842 205132 56330 249443 165718 -134147 -1420 129370 455347 338935
17812C38935F9568M5946L21564B07533E9046c2516A25329a27004j05790j30818
$$ 338935 69568 115514 437078 207533 59046 -32516 125329 -127004 -232794 -363612
17802c63612J63574i6681K0324b3344B60072b43382A16046g262m4580B6365L97167
$$ -363612 -200038 -96681 -76357 -23344 260072 -243382 116046 -7262 -51842 26365 423532
17791D23532j74356a96523D3910a54121A31807E8961a12126A9608b93673C32184
$$ 423532 249176 -196523 43910 -154121 131807 58961 -112126 19608 -293673 332184
17780e5316B29712G1446B5128K11115D1858J83894b41625O2291O1698b5120H5990
$$ -55316 229712 71446 25128 236243 41858 225752 -241625 -179334 -117636 -25120 85990
17768A08946B184O4892j9609Q5653j2728f5908I6706K50962a06393C68547H6649
$$ 108946 2184 67076 47467 133120 120392 -65908 96706 347668 -106393 368547 86649
17756D44700k8198j63333a31295D45177e8025o6730c5511k91042h8193A26412
$$ 444700 416502 253169 -131295 445177 -58025 -124755 -35511 -326553 -88193 126412
17745H5697J65259a65331A06266L99132a18332A70084c20311a05189r9620d7981
$$ 85697 250956 -165331 106266 505398 -118332 170084 -320311 -105189 -204809 -47981
17734A34746A7065c8958B28164b3593B02515m9810a61241j63064B11115B8674
$$ 134746 17065 -38958 228164 -23593 202515 152705 -161241 -324305 211115 28674
17723a46565F2919a10347l9443G1081b26071q1598e4132p3043e8602B72001e2080
$$ -146565 62919 -110347 -149790 71081 -226071 -307669 -54132 -127175 -58602 272001 -52080
17711A5959a50415n9704a8271G7682O652J18835C8367a9885A14151M29151j76235
$$ 15959 -150415 -210119 -18271 77682 84334 203169 38367 -19885 114151 543302 367067
17700C67067A06867C0295c3764A42713J13026n7572q1685d5989D46391E5907J4006
$$ 367067 106867 30295 -33764 142713 255739 198167 116482 -45989 446391 55907 69913
17689F9913K175f6339b140k09368f3972A64373m4976C5850K01882F0726b40417
$$ 69913 72088 -66339 -2140 -211508 -63972 164373 119397 35850 237732 60726 -240417
17677C65325A42210A6771J25831M3084a28422j6633B52984G3673L10717A64135
$$ 365325 142210 16771 142602 185686 -128422 -145055 252984 73673 384390 164135
17666A08973l5924K19997H3673B9527K7727K9339M891L56648a11492k1299F383
$$ 108973 73049 293046 83673 29527 57254 86593 91484 448132 -111492 -132791 6383
17654A16075B5010b44245C957c03932A05140A9554g3229n0519G2260B8087Q4264
$$ 116075 25010 -244245 3957 -303932 105140 19554 -73229 -123748 72260 28087 112351
17643A12351N7814m6520N8149b09342A31980L05958i6572q6407A79310d4064B45876
$$ 112351 170165 123645 181794 -209342 131980 437938 -96572 -182979 179310 -44064 245876
17631d4424K1114j4069A09577i3677C64258A51848h6337A29175Q1516J02642I5403
$$ -44424 -23310 -37379 109577 -93677 364258 151848 -86337 129175 210691 313333 95403
17619C25428J23646j71685N0511o3578L7305j50176g3646A00947J62868G7133
$$ 325428 449074 277389 327900 264322 301627 151451 -73646 100947 263815 77133
17608I0484N2601Q0648B983M42516A09807J00453m3164b3321h363C448O9568J50207
$$ 90484 143085 223733 2983 445499 109807 210260 167096 -23321 -8363 3448 73016 223223
17596B23223N9523n9636b04644B8775n226a64449A53266c2988H5137G78a71017
$$ 223223 282746 223110 -204644 28775 23549 -164449 153266 -32988 85137 778 -171017
17584A71314D7149r875L9351L7450n0909e4880j75770A46721J93629H4147K58992
$$ 171314 47149 37274 76625 114075 63166 -54880 -230650 146721 340350 84147 343139
17573C43139B7909N7885P9059C4521a70797B25925R1317a9446B65203j10487J1368
$$ 343139 27909 85794 164853 34521 -170797 225925 317242 -19446 265203 154716 166084
17562A66084o429a85217C6827K38976j9427n5620F6887K04053B5662L77711H1666
$$ 166084 159655 -185217 36827 275803 256376 200756 66887 270940 25662 403373 81666
17550C10461H4646L31967j68177Q271C7067J69857b0277G267L19152m7936L9596
$$ 310461 84646 416613 248436 256707 37067 206924 -20277 7267 326419 278483 318079
17539C18079j03655E5433K09345Q8975j38740L4263B7986J57116F527a20382C16821
$$ 318079 214424 55433 264778 353753 215013 249276 27986 185102 6527 -120382 316821
17527b4706C75681J57930B38667M8571J24105j92456N67984k74722n5965j41488
$$ -24706 375681 533611 238667 287238 411343 218887 786871 512149 456184 314696
17517C14696K08957A65106N01887B4628a03670A58226J40399J93863B04305K79130
$$ 314696 523653 165106 666993 24628 -103670 158226 298625 492488 204305 483435
17507D83435J19542k25876J5166N5596n1787j10991j0519Q2535g8647C03116A6577
$$ 483435 602977 377101 392267 447863 396076 285085 274566 357101 -78647 303116 16577
17495C30076d7597C65509j090O3164K87277i6688J2560I9911N39634A44221C8915
$$ 330076 -47597 365509 364419 427583 714860 -96688 -84128 99911 639545 144221 38915
17483G5356J1657B0651K06569A567h3725K1653A1855J85098k2149L42215B19169
$$ 75356 87013 20651 227220 1567 -83725 -62072 11855 196953 174804 517019 219169
17471b6856A70638M66571k37051L9985j72075b38333f1947C43204c85949a02877
$$ -26856 170638 637209 400158 440143 268068 -238333 -61947 343204 -385949 -102877
17460b9288C736J77031c1980B66056A30379d8257A64407N6287J01384e9667j0884
$$ -29288 3736 180767 -31980 266056 130379 -48257 164407 220694 322078 -59667 -70551
17449g0551B66790M0516a34548j3200C82683A79150J74092c0284A24674m7956
$$ -70551 266790 307306 -134548 -147748 382683 179150 353242 -30284 124674 76718
17439G6718k4663K73066J3372B9628K38409F1562L08461A12357J83533K6824A29233
$$ 76718 52055 325121 338493 29628 268037 61562 370023 112357 295890 322714 129233
17427D72672j31385K44670a3232C99147j34870J00432p6587A27614Q7466j07070
$$ 472672 341287 585957 -13232 399147 264277 364709 288122 127614 215080 108010
17417A08010J03380o1221l2302M27748k23565p8758N437J77956j14699R3546n7436
$$ 108010 211390 150169 117867 545615 322050 243292 248729 426685 311986 405532 348096
17406C48096l5839k3385r2964D4456R2946J44009k9056j4063L2741I1710K55496
$$ 348096 312257 288872 195908 44456 137402 281411 252355 238292 271033 91710 347206
17395C47206D5577L83442j49461J0262M4180M68a65816D02112A93693K42510E0203
$$ 347206 45577 429019 279558 289820 334000 334468 -165816 402112 193693 436203 50203
17383B61711r0550K84814j82787G0862J22426R6258R167o4557q081m7802j4529
$$ 261711 171161 455975 273188 70862 193288 289546 298713 234156 226075 178273 163744
17372A63744K5915g165A61404J11159N1787r6583J63284j85624a37432B29945
$$ 163744 189659 -7165 161404 272563 324350 227767 391051 205427 -137432 229945
17361C7339K48557J02628A23243K69005c379A66456J16360A00647O0527k9605
$$ 37339 285896 388524 123243 392248 -3379 166456 282816 100647 161174 131569
17351A31569R9629n1053j1106K44723M7563k00009m3044j05442h2665A26693J52744
$$ 131569 231198 180145 169039 413762 461325 261316 218272 112830 -82665 126693 279437
17340B79437q5332m1242f2235C09710K5039j24129I8774J78458J31324J02333
$$ 279437 194105 152863 -62235 309710 334749 210620 98774 277232 408556 510889
17330E10889o5272j90544M93695B84219A01394L21598A83366N3370D2998J15876
$$ 510889 445617 255073 748768 284219 101394 422992 183366 236736 42998 158874
17320A58874J77683p1636C940J86145H5266j0127q134N9129d0670C15841G4637
$$ 158874 336557 264921 3940 190085 85266 75139 67005 126134 -40670 315841 74637
17308D77506k34032I0492M76046D6634L60654J20427f9176A71833R8067R7086
$$ 477506 243474 90492 566538 46634 407288 527715 -69176 171833 269900 366986
17298C66986J31071j56182Q9353B09778L9792k2031K84731G6480L92341J16241
$$ 366986 498057 341875 431228 209778 249570 227539 512270 76480 468821 585062
17288E85062B25858m865N8478a60124L3440A67187P6793n1847O2258p2408K51628
$$ 585062 225858 220993 279471 -160124 -126684 167187 243980 192133 254391 181983 433611
17277D33611H0297M42230C2682J43820J5724J57840q2426K08715B20557K36283
$$ 433611 80297 522527 32682 176502 192226 350066 267640 476355 220557 456840
17267D56840j44061C3475K21681K04527A94616K62959n981q4611A69596J63173
$$ 456840 312779 33475 255156 459683 194616 457575 451594 366983 169596 332769
17257C32769O567D4153K52692o3490K14742j41090E4008M45386D2132M26350A12242
$$ 332769 339336 44153 296845 233355 448097 307007 54008 499394 42132 468482 112242
17245C71804K26154B70644r9057L31754B18473m528o9793K73355a62504E03775
$$ 371804 597958 270644 171587 503341 218473 213945 144152 417507 -162504 503775
17234B83219J48326j49508C2431L85657G5575R2277K34052r4332D8767O06958
$$ 283219 431545 282037 32431 418088 75575 167852 401904 307572 48767 655725
17224F55725B32528L37395k63649L2753j25994O05286B44388A14719J0487L43115
$$ 655725 232528 569923 306274 339027 213033 818319 244388 114719 125206 468321
17214D68321j51831J08771A17988a3084C57277r4964L5607q1448K70187k09613
$$ 468321 316490 425261 117988 -13084 357277 262313 297920 216472 486659 277046
17204B77046J63818J61320N1940A06566M43113M234B51614p6343O64972m09429
$$ 277046 440864 602184 654124 106566 549679 553913 251614 175271 840243 430814
17194D30814l5186j17196A34725K44965p4865l3650J1629M16911l33810k4882
$$ 430814 395628 278432 134725 379690 304825 271175 282804 699715 365905 341023
17184C41023k7115j2567M86378C17703M44319k44676B56516K1719K7863L16595
$$ 341023 313908 301341 787719 317703 762022 517346 256516 278235 306098 622693
17174F22693j29882k18050J30653M4533Q0490J08516k88958A55582J79878J63162
$$ 622693 492811 274761 405414 449947 530437 638953 349995 155582 335460 498622
17164D98622O490n220k18736K2906K76016q9080j07389j51811J52427R594j25407
$$ 498622 505112 499892 281156 304062 580078 490998 383609 231798 384225 393819 268412
17153B68412J24401J78730o4851r569J9742l6518j90271n4737J56381N2105J16985
$$ 268412 392813 571543 506692 497123 516865 480347 290076 235339 391720 443825 560810
17142E60810m3662J28804K3286k84861N60006m30439o1082J58572K98439l46687
$$ 560810 517148 645952 669238 384377 944383 513944 452862 611434 909873 563186
17132E63186A29198K45743Q6525r4561N530p6195J49531j26022q816J67695L8955
$$ 563186 129198 374941 461466 366905 372435 296240 445771 319749 310933 478628 517583
17121E17583m6879r7094N58060k51736K01691k42078B74536L62863o8947L75194
$$ 517583 470704 373610 931670 679934 881625 639547 274536 637399 568452 943646
17111I43646k52984j47218B50998K14227l8837K38805J02815L29103m60818l03465
$$ 943646 690662 543444 250998 465225 426388 665193 768008 1097111 636293 332828
17101C32828M62908n3200k74135J54898J36329j03888Q6036J8473j90354k0423
$$ 332828 795736 742536 468401 623299 759628 655740 741776 760249 569895 549472
17091E49472J41530K37828k0427k59090j59438K51893l3222J96777k05729k32617
$$ 549472 691002 928830 908403 649313 489875 741768 708546 905323 699594 466977
17081D66977L69587l6977k36315L47955k87358J98607k97222Q4507K89364J30978
$$ 466977 836564 799587 563272 911227 623869 822476 525254 609761 899125 1030103
17071A030103l65964j610K47568l9546o4401k1626j8546p1368M7401J77216C36063
$$ 1030103 664139 662529 910097 870551 806150 784524 765978 694610 742011 919227 336063
17059I85964m968K07864k73828k80653L35848j49786o9818L00407k62477J70977
$$ 985964 980996 1188860 915032 634379 970227 820441 750623 1051030 788553 959530
17049I59530D29460N62715j16844J44065l34184J45395j80957R3471M7742P8212
$$ 959530 429460 992175 875331 1019396 685212 830607 649650 743121 790863 869075
17039H69075L73940o0435j82748K8550l2255m0595K36524m17668N28786m62659
$$ 869075 1243015 1182580 999832 1028382 996127 955532 1192056 774388 1303174 840515
17029H40515j60960O02131J45117k19090k47570N5117J99920k92181M4547J06656
$$ 840515 679555 1281686 1426803 1207713 960143 1015260 1215180 922999 967546 1074202
17019A074202K23590l62436J48560M01539m88270M04285m81394L74871q8095p5037
$$ 1074202 1297792 935356 1083916 1485455 997185 1401470 920076 1294947 1206852 1131815
17009A131815K02865Q1844M7912P6934l1188l59158m9278Q711k1147L97883k91286
$$ 1131815 1334680 1416524 1464436 1541370 1510182 1151024 1101746 1110457 1089310 1487193 1195907
16998A195907J71108l16308K96357L08761k15281j6692J13961l64537L7939L85424
$$ 1195907 1367015 1050707 1347064 1655825 1440544 1423852 1537813 1173276 1211215 1596639
16988A596639N220j77951j27546N970K92422l73740M31774m6686l8258J24088
$$ 1596639 1601859 1423908 1296362 1302332 1594754 1221014 1652788 1606102 1567844 1691932
16978A691932J31784j31953k8324l91090M09933k7523L7831K08547l33040K25054
$$ 1691932 1823716 1691763 1663439 1272349 1682282 1654759 1692590 1901137 1568097 1793151
16968A793151m18737L98230j30854O1891j31354K75791R7357k17364L7809R4037
$$ 1793151 1374414 1772644 1641790 1703681 1572327 1848118 1945475 1728111 1765920 1859957
16958A859957j94806K40817n8478P3085L6708j86815P5890q5786P2689L48290
$$ 1859957 1665151 1905968 1847490 1920575 1957283 1770468 1846358 1760572 1833261 2181551
16948B181551j43972J14068q5472o362J33171o7616n7788K80311m54092r2366
$$ 2181551 2037579 2151647 2066175 2059813 2192984 2125368 2067580 2347891 1893799 1801433
16938A801433M98229L13668k65506j84198Q421J37369j6884k64769n8050L10384
$$ 1801433 2299662 2613330 2347824 2163626 2172047 2309416 2292532 2027763 1969713 2280097
16928B280097J56138J96966j76372j6290n3242J09903L68747j74278j81181L11751
$$ 2280097 2436235 2633201 2456829 2440539 2387297 2497200 2865947 2691669 2510488 2822239
16918B822239n20139O50316j59702L42491l18722n5120k12203O38326k09520J0802
$$ 2822239 2302100 2952416 2792714 3135205 2816483 2761363 2549160 3187486 2977966 2988768
16908B988768j02655J94413K65783k86419J87955q9434j23166K36048J50539k11101
$$ 2988768 2886113 3080526 3346309 3059890 3247845 3158411 3035245 3271293 3421832 3210731
16898C210731L27500K4779K4170M33354l23276m8299J18108J25772p8789l51957
$$ 3210731 3538231 3563010 3587180 4020534 3697258 3648959 3767067 3892839 3814050 3462093
16888C462093K84629M35933o05522N18837J00231J03397K4190k16245j5292K66732
$$ 3462093 3746722 4182655 3577133 4095970 4196201 4299598 4323788 4107543 4092251 4358983
16878D358983K24800J16929j13253K56631p7194j9602n6513L64956r0159r1743
$$ 4358983 4583783 4700712 4587459 4844090 4766896 4747294 4690781 5055737 4965578 4873835
16868D873835J77225m650L14572J22708J23004O2187R986l01679M07642L71308
$$ 4873835 5051060 5046410 5360982 5483690 5606694 5668881 5678867 5377188 5784830 6156138
16858F156138l42616n8220J97531L58533n2968j45338L33249L7982K10963o9505
$$ 6156138 5813522 5755302 5952833 6311366 6258398 6113060 6446309 6484291 6695254 6625749
16848F625749M20000J57267L2551J34808M1001J61431j39641K53907L52791J92480
$$ 6625749 7045749 7203016 7235567 7370375 7411376 7572807 7433166 7687073 8039864 8232344
16838H232344o4846L045M44277J28913K37208k52617N77400k43282L35804J20973
$$ 8232344 8167498 8170543 8614820 8743733 8980941 8728324 9305724 9062442 9398246 9519219
16828I519219K32607Q5249N89475o3185J01488N21664j41246J95660J73608J93994
$$ 9519219 9751826 9837075 10426550 10363365 10464853 10986517 10845271 11040931 11214539 11408533
16818A1408533O46903p2591L16126q5118L33639P33905l08890O98617L17238K02470
$$ 11408533 12055436 11982845 12298971 12213853 12547492 13281397 12972507 13671124 13988362 14190832
16808A4190832J64649L73305M88076J81909M44659K15744N73295O7385Q44732
$$ 14190832 14355481 14728786 15216862 15398771 15843430 16059174 16632469 16699854 17544586
16799A7544586J96978K18038O41095N19767J76174Q40950N76447N12027K50665
$$ 17544586 17741564 17959602 18600697 19120464 19296638 20137588 20714035 21226062 21476727
16790B1476727O52911M41J017236M53069J122681P5405O78053J104733L29011
$$ 21476727 22129638 22130079 23147315 23600384 24723065 24798470 25476523 26581256 26910267
16781B6910267R50579K13235J072265P05373P23714J049603R80340O35847J104215
$$ 26910267 27860846 28074081 29146346 29851719 30575433 31625036 32605376 33241223 34345438
16772C4345438J253944N97559J003197J121105R05105J444032R89680J273709
$$ 34345438 35599382 36196941 37200138 38321243 39226348 40670380 41660060 42933769
16764D2933769J232018J530050J189026J465005J036194J730335J474271J680457
$$ 42933769 44165787 45695837 46884863 48349868 49386062 51116397 52590668 54271125
16756E4271125J107502J730771J460533J703916J780932J778341J692277J457345
$$ 54271125 55378627 57109398 58569931 60273847 62054779 63833120 65525397 66982742
16748F6982742J665726J634422J950249J574938J663659J833910J509560J701193
$$ 66982742 68648468 70282890 72233139 73808077 75471736 77305646 78815206 80516399
16740H0516399J781930J170364J703099J218119J175543J156336J161669R38371
$$ 80516399 82298329 83468693 85171792 86389911 87565454 88721790 89883459 90821830
16732I0821830R06408N83503O21128K07667R45566P7902l66819N30693n60610
$$ 90821830 91728238 92311741 92932869 93140536 94086102 94164004 93797185 94327878 93767268
16723I3767268J5299p18356n71230m15981j190766j057064r63930j466564q81345
$$ 93767268 93782567 93064211 92492981 92077000 90886234 89829170 88865240 87398676 86517331
16714H6517331j148301j644540j391665j503823j865062j686848j377172j858308
$$ 86517331 85369030 83724490 82332825 80829002 78963940 77277092 75899920 74041612
16706G4041612j664368j464962j765726j476130j643170j584968j439162j869583
$$ 74041612 72377244 70912282 69146556 67670426 66027256 64442288 63003126 61133543
16698F1133543j617279j576610j470137j324089j101660j646277j704159j081170
$$ 61133543 59516264 57939654 56469517 55145428 54043768 52397491 50693332 49612162
16690D9612162j504858j335224j062429j090747j329921j177058j123433p99450
$$ 49612162 48107304 46772080 45709651 44618904 43288983 42111925 40988492 40189042
16682D0189042j333990r62692j127615n77703j000846q77004j063705o40409p18596
$$ 40189042 38855052 37892360 36764745 36187042 35186196 34309192 33245487 32605078 31886482
16673C1886482j268609m03862r82751p33810n55922m58914j063940k78167m54880
$$ 31886482 30617873 30214011 29231260 28497450 27941528 27482614 26418674 26140507 25685627
16664B5685627p91237o04245m66036l52967o58863n58022m27254k08551q22120
$$ 25685627 24894390 24290145 23824109 23471142 22812279 22254257 21827003 21618452 20796332
16655B0796332j31507o77877m24595o17530r4602m95947o00754q0766l44375j81140
$$ 20796332 20664825 19986948 19562353 18944823 18850221 18354274 17753520 17672754 17328379 17147239
16645A7147239n23524n22677p3262n46726k25633j433l66924j89655m22800j89587
$$ 17147239 16623715 16101038 16027776 15481050 15255417 15253984 14887060 14697405 14274605 14085018
16635A4085018k41068m12964O2803m97990l5127n01255j13425l01988j47695l02018
$$ 14085018 13843950 13430986 13493789 12995799 12960672 12459417 12345992 12044004 11896309 11594291
16625A1594291K33916m99781J4769k75026j45699k07561k90899K83417l83561
$$ 11594291 11828207 11328426 11343195 11068169 10922470 10714909 10424010 10707427 10323866
16616A0323866J17155n59135p2299k56906j30913j3646r7605n84981N1159J24777
$$ 10323866 10441021 9881886 9809587 9552681 9421768 9408122 9310517 8725536 8776695 8901472
16606H901472j26561j12723k52828P809k40765n0877J0393l13547l54968L51434
$$ 8901472 8774911 8662188 8409360 8417169 8176404 8125527 8135920 7822373 7467405 7818839
16596G818839j65260k64568N153l36743J28675o0353K328k83853j84213k94739
$$ 7818839 7653579 7389011 7394164 7057421 7186096 7125743 7128071 6844218 6660005 6365266
16586F365266J57060R7843l61535K4288J00561k55131j69966K66282l60874j86891
$$ 6365266 6522326 6620169 6258634 6282922 6383483 6128352 5958386 6224668 5863794 5676903
16576E676903K66345n46722M55286j10484k53609j2174J62581j58027M3362l45343
$$ 5676903 5943248 5396526 5851812 5741328 5487719 5475545 5638126 5480099 5523461 5178118
16566E178118K76389l64303R5818j61796m9686j95767J76874n9105M8641l52997
$$ 5178118 5454507 5090204 5186022 5024226 4974540 4778773 4955647 4896542 4945183 4592186
16556D592186J26219K69540j6894m32825J73451J5659k67708r2231k53579j06724
$$ 4592186 4718405 4987945 4971051 4538226 4711677 4727336 4459628 4367397 4113818 4007094
16546D007094K02835O8810j39629J1049j51189O9953j57108k9365J40554o1877
$$ 4007094 4209929 4278739 4139110 4150159 3998970 4068923 3911815 3882450 4023004 3961127
16536C961127J11597k13264J04483k30734K64813m64206M21950l70276O9504k34275
$$ 3961127 4072724 3859460 3963943 3733209 3998022 3533816 3955766 3585490 3654994 3420719
16526C420719K55786R8135j44144r5570J4584k95059J48552o3400K42124j73234
$$ 3420719 3676505 3774640 3630496 3534926 3549510 3254451 3403003 3339603 3581727 3408493
16516C408493j02215q6522j244j21290M04998m63903P8302L2822r5121J32370
$$ 3408493 3306278 3219756 3218512 3097222 3502220 3038317 3116619 3149441 3054320 3186690
16506C186690j23868j40659j13387M8886L27686k82973J25899J28561n32451m2482
$$ 3186690 3062822 2922163 2808776 2857662 3185348 2902375 3028274 3156835 2624384 2581902
16496B581902K80409l53361M38426m61596L50028k46935J63083k36912j14880
$$ 2581902 2862311 2508950 2947376 2485780 2835808 2588873 2751956 2515044 2400164
16487B400164J20110K83127k28555P7407k9906K45965l70132J44883j25198J55910
$$ 2400164 2520274 2803401 2574846 2652253 2622347 2868312 2498180 2643063 2517865 2673775
16477B673775l10155j12888N33381l78394L75152j14435n15565L45651j8113q9326
$$ 2673775 2363620 2250732 2784113 2405719 2780871 2666436 2150871 2496522 2478409 2389083
16467B389083L10357l04589L6885j53055Q0126k41140O8072K75236l11865L3829
$$ 2389083 2699440 2394851 2431736 2278681 2358807 2117667 2185739 2460975 2149110 2182939
16457B182939M9573J06238J4479j72114j00978m01792P92402m23809N24374n83552
$$ 2182939 2232512 2338750 2353229 2181115 2080137 1678345 2470747 2046938 2571312 1987760
16447A987760L28614l07940K20451l75460L45834m72941J91378m16693M06024
$$ 1987760 2316374 2008434 2228885 1853425 2199259 1726318 1917696 1501003 1907027
16438A907027P9566j54002Q8905j54462P6728J92767k08370R8802j41154K79206
$$ 1907027 1986593 1832591 1921496 1767034 1843762 2036529 1828159 1926961 1785807 2065013
16428B065013m28403K12376j16195J21525K81737m18032J41666j57076J23111
$$ 2065013 1636610 1848986 1732791 1854316 2136053 1718021 1859687 1702611 1825722
16419A825722m7024J37219k18116o9945J32731j49515j78233J32394K53257P26
$$ 1825722 1778698 1915917 1697801 1627856 1760587 1611072 1432839 1565233 1818490 1819216
16409A819216j96160J01026K24929m54800K11987m82770O53613l16547N5482j28044
$$ 1819216 1623056 1724082 1949011 1494211 1706198 1223428 1877041 1560494 1615976 1487932
16399A487932k08910K42808J09788m9773M2568N4932l2100j00047J64289l7432
$$ 1487932 1279022 1521830 1631618 1581845 1624413 1679345 1647245 1547198 1711487 1674055
16389A674055k95903J58345j64009q7222J14250R4197m3667j78350K62956M0611
$$ 1674055 1378152 1536497 1372488 1285266 1399516 1493713 1450046 1271696 1534652 1575263
16379A575263j74884J01902J27108k29101J91070j54605l51701K02346j69177
$$ 1575263 1400379 1502281 1629389 1400288 1591358 1436753 1085052 1287398 1118221
16370A118221K87831j05116l64219K10221L58931l12274q6616L85601p2180j85796
$$ 1118221 1406052 1300936 936717 1146938 1505869 1193595 1106979 1492580 1420400 1234604
16360A234604p1324R7979J4598j66144L40918k35433k45461N17351n23701L94983
$$ 1234604 1163280 1261259 1275857 1109713 1450631 1215198 969737 1487088 963387 1358370
16350A358370K2158k92583Q8430R7728L32866o98561K56940k9943Q9942q5258
$$ 1358370 1380528 1087945 1176375 1274103 1606969 908408 1165348 1135405 1225347 1140089
16340A140089Q5935p3878J5704j94401J56093Q8098l12049J64336k2584J07069
$$ 1140089 1226024 1152146 1167850 973449 1129542 1217640 905591 1069927 1047343 1154412
16330A154412j62216j46403P6756K97663k45979m8215L83977k85874k15469M25739
$$ 1154412 992196 845793 922549 1220212 974233 926018 1309995 1024121 808652 1234391
16320A234391k02666k33604N25266n69738L06603j03838J72884j41641M646k75528
$$ 1234391 1031725 798121 1323387 753649 1060252 956414 1129298 987657 992303 716775
16310G16775N8385L49386j43315n7870m322n5013J42348k09410K59298n8898k35429
$$ 716775 775160 1124546 981231 923361 919039 864026 1006374 796964 1056262 997364 761935
16299G61935K0501O6525O1395k70188K71595L10080j21764J02m57494L26402k04035
$$ 761935 782436 848961 910356 640168 911763 1221843 1100079 1100181 642687 969089 765054
16288G65054K60859n8308j60079j50063L48830j23578J54313k61897K69410m5432
$$ 765054 1025913 967605 807526 657463 1006293 882715 1037028 775131 1044541 999109
16278I99109O6719j13618p5879K9454l8822J67377N7106q7724k41453k3280J61938
$$ 999109 1065828 952210 876331 905785 866963 1034340 1091446 1003722 762269 738989 900927
16267I00927r5839j62963r6602R2893K5725Q8500L7261J2914J5069l3954r9356
$$ 900927 805088 642125 545523 638416 664141 752641 789902 802816 817885 783931 684575
16256F84575J27428N45230E05581M47656o11l17909K2608J51837k80319J48106
$$ 684575 812003 1357233 505581 953237 952626 634717 657325 809162 528843 676949
16246F76949q4170K43541r8902K05995j40625j04932o0389m6559o76m1653J04427
$$ 676949 592779 836320 737418 943413 802788 697856 637467 590908 590232 548579 653006
16235F53006j70868K1297K97603q3189J09258l74453M31524j13510k90950J64889
$$ 653006 482138 503435 801038 717849 827107 452654 884178 770668 479718 644607
16225F44607J43481j99051K2525o5368n0468J31128M1728K3387j15376K22609
$$ 644607 788088 589037 611562 546194 495726 626854 668582 691969 576593 799202
16215G99202l74948r565M0165r7952K48580k00637J01644k0155r0330L46165k96679
$$ 799202 424254 414689 454854 356902 605482 404845 506489 486334 396004 742169 445490
16204D45490L63616j71700j04822J68007l18847L29570k69227M47121B01580M05277
$$ 445490 809106 637406 532584 700591 381744 711314 442087 889208 201580 606857
16194F06857B29165L56030J97480j18208q9550l7014k56223n2266L90163k09813
$$ 606857 229165 585195 782675 664467 574917 537903 281680 229414 619577 409764
16184D09764J7481J9631p6951J09945j10032J88294J28425j97231J56231Q1592
$$ 409764 427245 446876 369925 479870 369838 558132 686557 489326 645557 727149
16174G27149k37553J09192j09749A23183N78258o3224j2998J72466B42827M24299
$$ 727149 489596 598788 489039 123183 701441 638217 625219 797685 242827 667126
16164F67126k37784l7280Q2057L55075j67391k0498n0857B66497J54030o9290
$$ 667126 429342 392062 474119 829194 661803 641305 590448 266497 420527 351237
16154C51237j1857K31298A09195K34799K28380o1698B40616N94704l90293j16591
$$ 351237 339380 570678 109195 343994 572374 510676 240616 835320 445027 328436
16144C28436M2193K12235K2360A62121J0994J24981J95948J21862k36155A52497
$$ 328436 370629 582864 605224 162121 173115 298096 494044 615906 379751 152497
16133D25703j29734p4536J53787j70607L42279A48114R2112J31969j07836O7550
$$ 425703 295969 221433 375220 204613 546892 148114 240226 372195 264359 331909
16123C31909O6986J32887L6556m3232A12147J13380l9621p0814Q1021J05512l3337
$$ 331909 398895 531782 568338 525106 112147 225527 185906 115092 196113 301625 268288
16112B68288N8815L77988A87286J97308r3610L94346l35444N6342A18993K25470
$$ 268288 327103 705091 187286 384594 290984 685330 349886 406228 118993 344463
16102C44463A54717P2180k3027Q8814A43441L37666B24443m2885M08115A83292
$$ 344463 154717 226897 203870 292684 143441 481107 224443 181558 589673 183292
16091D84609B34205N9069I724J48445E8040L29438B7264J30245j3103K29509j08895
$$ 484609 234205 293274 9724 158169 58040 387478 27264 157509 144406 373915 265020
16080B65020J57137H3404D182J41893K98680k07489n982p6447j5449J58340K38802
$$ 265020 422157 83404 4182 146075 444755 237266 231284 154837 139388 297728 536530
16069E36530k13233M1208L394j26258J20421K85698a22958A73515O9466K42511
$$ 536530 323297 364505 367899 241641 362062 647760 -122958 173515 242981 485492
16059D85492j26190p593K95013B48655K01320k03204a33018C10238j13897b7452
$$ 485492 359302 351709 646722 248655 449975 246771 -133018 310238 196341 -27452
16048A81341a79078B83344N4102j6585j20361k8847J46605K44401A54261D7597
$$ 181341 -179078 283344 337446 320861 200500 171653 318258 562659 154261 47597
16037B57383M92571B6550J95574E6486a36543B6650J70644J17279J11724L3598
$$ 257383 749954 26550 222124 56486 -136543 26650 197294 314573 426297 459895
16027D59895j41194C1237M31655j81881K03860J89053B18369c1822B80321b15440
$$ 459895 318701 31237 462892 281011 484871 673924 218369 -31822 280321 -215440
16016A61221J10382n5414r2473P1565K0401N271J02989K51919A93354r4666L0569
$$ 161221 271603 216189 123716 195281 215682 220953 323942 575861 193354 98688 129257
16005A29257N503Q6381m4719P9865A25667J0718K22727J49506A65510M921q4225
$$ 129257 134760 221141 176422 256287 125667 136385 359112 508618 165510 170431 86206
15994H6206J26601k7978K18166O2572j32820K78285J97091J65570k40000M06569
$$ 86206 212807 184829 402995 465567 332747 611032 808123 973693 733693 1140262
15984A140262m70810j172A29768J20927M6443h2514F2537e5808M720J9634C45613
$$ 1140262 669452 668280 129768 250695 297138 -82514 62537 -55808 -51088 -31454 345613
15972C12558j263A53447o4718R2021a68995A34075i6918J3015c694C2985J15523
$$ 312558 311295 153447 88729 180750 -168995 134075 -96918 -83903 -3694 32985 148508
15961A48508D8637J64045c36650E8876G629J01012L04468a9553I4543P6181p3044
$$ 148508 48637 212682 -336650 58876 7629 108641 413109 -19553 94543 170724 97680
15950I7680R4575q9455J11243I6042J1991Q9356g9121j80008B54111F5818g0621
$$ 97680 192255 102800 214043 96042 108033 197389 -79121 -259129 254111 65818 -70621
15938A88036q6276g5673A80029a37909O1075b9614A8625L21127o3045C6941R7419
$$ 188036 101760 -75673 180029 -137909 -76834 -29614 18625 339752 276707 36941 134360
15927A34360m9018n723J07263P5659a3343C37692f9019k11874a34576j1652B15085
$$ 134360 85342 79619 186882 262541 -13343 337692 -69019 -280893 -134576 -146228 215085
15915a72826F3035a85841B67151h4298q4239Q0468B5470K99757C4377H840b39202
$$ -172826 63035 -185841 267151 -84298 -168537 -88069 25470 325227 34377 8840 -239202
15903A16699i2098C9526i6520A43842n3303B9603M1571J698i4929B654a24928
$$ 116699 -92098 39526 -96520 143842 90539 29603 71174 72872 -94929 2654 -124928
15891d873G8736O6079N6147O9830b35132e4936O820J1352l3727E6882a88782Q5525
$$ -4873 78736 144815 200962 270792 -235132 -54936 -48116 -36764 -70491 56882 -188782 -103257
15879a03257A96959e9289B05715B152J97257J5411a55142A42232J06271i5521
$$ -103257 196959 -59289 205715 2152 199409 214820 -155142 142232 248503 -95521
15868D5796f0654o0815A26446L0558a61568l6404O4667D7164J22752A6024J685
$$ 45796 -60654 -121469 126446 157004 -161568 -197972 -133305 47164 169916 16024 17709
15857A7709f1664D38867b93432P3816B96895q4899a50708d7953D08352A36931
$$ 17709 -61664 438867 -293432 -219616 296895 211996 -150708 -47953 408352 136931
15846C13033R1278D3536J79243i4371o4832A08183k7531Q5112b07188B52567A8525
$$ 313033 404311 43536 222779 -94371 -159203 108183 80652 165764 -207188 252567 18525
15834H1939b16998B48002j23613e2885A59913b2573g796r4074A74944a7697A13085
$$ 81939 -216998 248002 124389 -52885 159913 -22573 -7796 -101870 174944 -17697 113085
15822D382a25904o5578k36162i030r3641M0893A41754b39047i6459A42945a3896
$$ 4382 -125904 -191482 -427644 -9030 -102671 -61778 141754 -239047 -96459 142945 -13896
15810D9461c33315J43510q6084d4812D8664K23315i7203A23629Q9784O737h1895
$$ 49461 -333315 -189805 -275889 -44812 48664 271979 -97203 123629 213413 220150 -81895
15798B65050A04240f5644C96835A32218J20619M6215b46376A2815L41114H8710
$$ 265050 104240 -65644 396835 132218 252837 299052 -246376 12815 353929 88710
15787f1234d401H1784J9228b45141C70276j32810J68805j72912h6677A50620i6433
$$ -61234 -4401 81784 101012 -245141 370276 237466 406271 233359 -86677 150620 -96433
15775E2057a92474A87459H2361J71023a08104j15005C5778e0249B2521b06224
$$ 52057 -192474 187459 82361 253384 -108104 -223109 35778 -50249 22521 -206224
15764B6415K05682Q1659K0244B8976b0027C19949m124J2830a75870B76996C1565
$$ 26415 232097 313756 334000 28976 -20027 319949 315825 328655 -175870 276996 31565
15752B19632r8193C1115a38518n1939C15397H035a17085A65290c1456I8641i7368
$$ 219632 121439 31115 -138518 -190457 315397 8035 -117085 165290 -31456 98641 -97368
15740a09703D6534a58441P1039A71323o8816e1773o412m13070F4305K00104n7780
$$ -109703 46534 -158441 -87402 171323 102507 -51773 -58185 -471255 64305 264409 206629
15729B06629Q4502D2344J64012J18506B5520J01435D981J71698k6810F3715M2505
$$ 206629 291131 42344 206356 324862 25520 126955 4981 176679 149869 63715 106220
15718A06220P7681a28323L3265E3763b82468F7862g0625k36615C00946c22896
$$ 106220 183901 -128323 -95058 53763 -282468 67862 -70625 -307240 300946 -322896
15707C13852E455J65422F220b52751m9562P3509i0502A26431d4418I8562g2821
$$ 313852 5455 170877 6220 -252751 -302313 -228804 -90502 126431 -44418 98562 -72821
15695b81798K0828h0166C82222j84778L30854G24a39689A27325F1608h4815A58971
$$ -281798 -260970 -80166 382222 197444 528298 724 -139689 127325 61608 -84815 158971
15683A89769N8204a62708c6176n8623j00830g7011j1056L1220C3712a12946j51517
$$ 189769 247973 -162708 -36176 -94799 -195629 -77011 -88067 -56847 33712 -112946 -264463
15672b64463a06034d8456D67756c61032a8711j98975d6986F0128b17666n962Q4283
$$ -264463 -106034 -48456 467756 -361032 -18711 -217686 -46986 60128 -217666 -223628 -139345
15661a39345I5599L64272b65965f4361l02109A25756a19161l592A977J37445i461
$$ -139345 95599 459871 -265965 -64361 -366470 125756 -119161 -122753 1977 139422 -9461
15649E5392c09433F6899d1423J7750B27190b34387b0949B04573b66541j15393
$$ 55392 -309433 66899 -41423 -23673 227190 -234387 -20949 204573 -266541 -381934
15639c81934G9671a14157M4752B13531b17520R3370A8692a97996l7281A40562
$$ -381934 79671 -114157 -69405 213531 -217520 -124150 18692 -197996 -235277 140562
15628A13499h9275A38975M8242a99275i4795B22127k6236d0256i380E877a5593
$$ 113499 -89275 138975 187217 -199275 -94795 222127 195891 -40256 -9380 5877 -15593
15616e3245F1488a4964j55936k31122i9832C06966e0881I930b31543B39068d29458
$$ -53245 61488 -14964 -170900 -402022 -99832 306966 -50881 9930 -231543 239068 -429458
15604A40758O9111a50817j4641A69482a35708A40676b19037J0333A2503c8232
$$ 140758 209869 -150817 -165458 169482 -135708 140676 -219037 -208704 12503 -38232
15593d1010C21401f6759j27059h7239A55488b9762A66604m8899A0445b13180J05349
$$ -41010 321401 -66759 -193818 -87239 155488 -29762 166604 117705 10445 -213180 -107831
15582a07831A8343J86389p5584J00425b34471a11865e0514A40319b7367A89021
$$ -107831 18343 204732 129148 229573 -234471 -111865 -50514 140319 -27367 189021
15571A06672b23570C9619g3300k00397G6534J81934J08321a66112L6356C68580
$$ 106672 -223570 39619 -73300 -273697 76534 258468 366789 -166112 -129756 368580
15560B2427h2702A85627a54717l6632f0359j31153K9503K1816F7370J37314b20165
$$ 22427 -82702 185627 -154717 -191349 -60359 -191512 -162009 -140193 67370 204684 -220165
15548H2214O0772C8122P0600K60614q6140A5268N2102J9618h300j48198a4534
$$ 82214 142986 38122 108722 369336 283196 15268 67370 86988 -8300 -156498 -14534
15536B54395b52863a23403G1636c17658C26832i7116E0761c7912B57805j03835
$$ 254395 -252863 -123403 71636 -317658 326832 -97116 50761 -37912 257805 153970
15526A53970k3453K46472d9800A19964A7116a0086A53162b47226B30740a87774
$$ 153970 130517 376989 -49800 119964 17116 -10086 153162 -247226 230740 -187774
15515c3982G0788a27329B19160L9877J2597A30357H849J90716f0876j4144j00876
$$ -33982 70788 -127329 219160 259037 271634 130357 8849 199565 -60876 -75020 -175896
15504a75896c9104I3438f9759k3338j65469M3313e2444j17311A37139a70359N2709
$$ -175896 -39104 93438 -69759 -93097 -258566 -215253 -52444 -169755 137139 -170359 -117650
15493a17650A16005a54352A92387a15809L2750E9270b5956F6656m040R1991O3420
$$ -117650 116005 -154352 192387 -115809 -83059 59270 -25956 66656 62616 154607 218027
15482B18027R9581j20177d4111F6045J43075B1932L92950K4235D3316J65129J4959
$$ 218027 317608 197431 -44111 66045 209120 21932 414882 439117 43316 208445 223404
15471B23404K62023a48494B469K7724L0635K09799a19256i935A75480a05125B49386
$$ 223404 485427 -148494 2469 30193 60828 270627 -119256 -9935 175480 -105125 249386
15459a35852N9460B11267h6891m8219a0955D5722h4071c1261B90512a41916f9593
$$ -135852 -76392 211267 -86891 -135110 -10955 45722 -84071 -31261 290512 -141916 -69593
15447A59512B6440i782A78022J99049M5160L38742B32354j5939J42461a76057
$$ 159512 26440 -9782 178022 377071 422231 760973 232354 216415 358876 -176057
15436H8747l639J05625c76332a23451F1612b6336A23576a8852k1319k22602f4283
$$ 88747 85108 190733 -376332 -123451 61612 -26336 123576 -18852 -40171 -262773 -64283
15424a87832A2494a89663A05924a68729A6865a04170B57277a22032A95912b94587
$$ -187832 12494 -189663 105924 -168729 16865 -104170 257277 -122032 195912 -294587
15413C0928a40577o8081l9754E263a98547m8270Q9689F6718K32462a58558e5058
$$ 30928 -140577 -208658 -248412 5263 -198547 -246817 -157128 66718 299180 -158558 -55058
15401b84197P8310G5175P8454A2470K56816a68563I6013l9794f5204A05158c4638
$$ -284197 -205887 75175 153629 12470 269286 -168563 96013 56219 -65204 105158 -34638
15389B20929f6407a0924C85634G6424a67112e6134J9475j13188E6218j4294K62545
$$ 220929 -66407 -10924 385634 76424 -167112 -56134 -36659 -149847 56218 41924 304469
15378C04469G264P8559K02531l3813K3735A31768E2809J30011B7940b9247A44771
$$ 304469 7264 85823 288354 254541 278276 131768 52809 182820 27940 -29247 144771
15366A16826D5674J4551a13942m0466B26202a25612a8966j97633h5259B15293
$$ 116826 45674 60225 -113942 -154408 226202 -125612 -18966 -216599 -85259 215293
15355a70132B0683J26036l265h6060A36101d5425B77451k5456A9134a8974A68188
$$ -170132 20683 146719 143454 -86060 136101 -45425 277451 251995 19134 -18974 168188
15343A01639K2741A8635J43713d3991B59815p4199P1317K3466A2765Q6388i6646
$$ 101639 124380 18635 162348 -43991 259815 185616 256933 280399 12765 99153 -96646
15331g7879A6171J23894g6953A35834j2816K26739j32591M5886G3428K2545a1595
$$ -77879 16171 140065 -76953 135834 123018 349757 217166 263052 73428 95973 -11595
15319c6785o3020E6998b9285g203A5149J56967b29876Q4837A2726K26812A00673
$$ -36785 -99805 56998 -29285 -7203 15149 172116 -229876 -145039 12726 239538 100673
15307C2825O1021J62684a780G6624b4006A92638a18916C16199p9470P2025B7599
$$ 32825 93846 256530 -1780 76624 -24006 192638 -118916 316199 236729 308754 27599
15295e541E3639K89955e3716r2250b9647I6778j1856b01402E1800L6355C5550
$$ -5541 53639 343594 -53716 -145966 -29647 96778 84922 -201402 51800 88155 35550
15283D2579j81a30675k40551c4601k37336A4573a82402A90414A0229c48983c1482
$$ 42579 42398 -130675 -371226 -34601 -271937 14573 -182402 190414 10229 -348983 -31482
15271G976d5110B00642n1386b83006D8205J01682f3399D6218K01383r8167F5482
$$ 7976 -45110 200642 149256 -283006 48205 149887 -63399 46218 247601 149434 65482
15259a35903A28526a03665B92668a14367A94744p6133M6545K6752L22772p4407
$$ -135903 128526 -103665 292668 -114367 194744 118611 165156 191908 514680 440273
15249D40273N54406J187696j1096p07817Q1395o73782C94750j0684a98073B8614
$$ 440273 994679 2182375 2171279 1463462 1544857 871075 394750 384066 -198073 28614
15238A72712J3833g1985A03156e5664j40112B34028i6537A83348b67730J21304
$$ 172712 186545 -71985 103156 -55664 -195776 234028 -96537 183348 -267730 -146426
15228a46426a9246C41878A35975o5809a14525L1517j05872C20678B6053L28794
$$ -146426 -19246 341878 135975 70166 -114525 -83008 -188880 320678 26053 354847
15218C54847a01731E3339K88156b33364B64909j20672d5766C18342l831F9282
$$ 354847 -101731 53339 341495 -233364 264909 144237 -45766 318342 314511 69282
15207C9813a47473c3707A27725N3804F7517J74082O4989A07066h0414F6514K76727
$$ 39813 -147473 -33707 127725 181529 67517 241599 306588 107066 -80414 66514 343241
15196C43241l9326I4125J69585j31552K29972b41729A75928K86398a63312i452
$$ 343241 303915 94125 263710 132158 362130 -241729 175928 462326 -163312 -9452
15185a30460A19977b42389C96131b37456e7468k2959B16240a44347p2595d3001
$$ -130460 119977 -242389 396131 -237456 -57468 -80427 216240 -144347 -216942 -43001
15174A41400B4068M904Q562L26M5709J64496e6415a6856E5746L1608d2092H9649
$$ 141400 24068 28972 37534 37860 83569 248065 -56415 -16856 55746 87354 -42092 89649
15161A76251e8513A17629c87408F7249a13908n7382G1900a70087B58116a30701
$$ 176251 -58513 117629 -387408 67249 -113908 -171290 71900 -170087 258116 -130701
15150A04509d995B33832A05368J16290a4368B00490g8846b1768D0756J642L29412
$$ 104509 -4995 233832 105368 221658 -14368 200490 -78846 -21768 40756 42398 371810
15139C71810j28458G1393J69908J29008r5123I0861M1854E4809K28379h923k2850
$$ 371810 243352 71393 241301 370309 275186 90861 132715 54809 283188 -8923 -31773
15128c1773B44050C9142O3601K27882A28245m3206K38223G9092L54918A82859
$$ -31773 244050 39142 102743 330625 128245 85039 323262 79092 434010 182859
15117G958J39848R3185a03049B46538F8433J29863J5726b83623G5685a22210A70676
$$ 7958 147806 240991 -103049 246538 68433 198296 214022 -283623 75685 -122210 170676
15105A25998k9638J31699a58193B62566a30230h714j01583A65118L6485q1610
$$ 125998 96360 228059 -158193 262566 -130230 -8714 -110297 165118 201603 119993
15095A19993Q8634o2183M9289J14583a35686A12858K13680j12032P2450Q1985
$$ 119993 208627 146444 195733 310316 -135686 112858 326538 214506 286956 368941
15085C68941c1061r5440a2748B75483I5873J29623O4703A09800h8122E0756j0412
$$ 368941 -31061 -126501 -12748 275483 95873 225496 290199 109800 -88122 50756 40344
15074D0344L44392j81052b47191C980g5576C15285m9791a35768G3695N6900O9253
$$ 40344 384736 203684 -247191 3980 -75576 315285 265494 -135768 73695 130595 199848
15063A99848k1568b18503A85702P4205J92108I8998J05086l8529a7526C65505
$$ 199848 178280 -218503 185702 259907 452015 98998 204084 165555 -17526 365505
15052E36121B34067d2683D16839o0974j17503J78344j80974L932n8713M5670P2387
$$ 536121 234067 -42683 416839 355865 238362 416706 235732 239664 180951 226621 299008
15041B99008k5570P992o4082a4472C02266j2855J12567K4776J4824n5063J36581
$$ 299008 273438 281430 217348 -14472 302266 289411 401978 426754 441578 386515 523096
15030E23096B54359K05431I4400K63013P2255P4968K04722C30319J06616j61851
$$ 523096 254359 459790 94400 357413 429668 504636 709358 330319 436935 275084
15020B75084P2404A60881J00224N7894P2971l5089j06483J68094K60716j31501
$$ 275084 347488 160881 261105 318999 391970 356881 250398 418492 679208 547707
15010E47707B01668o815L003k0759R0872L45160j39770j39235o4625j28151m6947
$$ 547707 201668 194853 197856 177097 267969 613129 473359 334124 269499 141348 94401
14999I4401a40299B53872J89497I3038O11178k15225l5562r8508A49650O8128
$$ 94401 -140299 253872 443369 93038 704216 488991 453429 354921 149650 217778
14989B17778M2371R7838M2645K31084B66553K04136B30005H6706J47176K51458
$$ 217778 260149 357987 400632 631716 266553 470689 230005 86706 233882 485340
14979D85340P0801l2138K19738C00626J57762j65562j8854D1788L08981L61818
$$ 485340 556141 524003 743741 300626 458388 292826 273972 41788 350769 712587
14969G12587j13415k08544J60610k55380J75185B08842J53104J85655B56243R3745
$$ 712587 599172 390628 551238 295858 471043 208842 361946 547601 256243 349988
14959C49988A23398M30660j98125J27592k19897B3898P9897K97997J86774F6393
$$ 349988 123398 554058 355933 483525 263628 23898 103795 401792 588566 66393
14948C72106J52439m200k08636j24705K53217k17043J10835J92428B01498o054
$$ 372106 524545 520345 311709 187004 440221 223178 334013 526441 201498 195444
14938A95444J12900J57335q4451L19521l15281L53081l48727M22407k13288K92663
$$ 195444 308344 465679 381228 700749 385468 738549 389822 812229 598941 891604
14928H91604P5387D52496N34974j53179J04620j70204j64410O2191O38060P5437
$$ 891604 966991 452496 987470 834291 938911 768707 604297 666488 1304548 1379985
14918A379985p4965J40759l52111j22953P8610m24704j70222K0282j22378O4351
$$ 1379985 1305020 1445779 1093668 970715 1049325 624621 454399 474681 352303 416654
14908D16654j05420J96673k12216J07396L7541F0141J57164M5918Q864J52231
$$ 416654 311234 507907 295691 403087 440628 60141 217305 263223 272087 424318
14898D24318J91253A68769N7810G0936L74910j53848P4021K35171j13255J58377
$$ 424318 615571 168769 226579 70936 445846 291998 366019 601190 487935 646312
14888F46312m2030j04766L80013j70107l0694J8514C31399M0667j22247K96134
$$ 646312 604282 499516 879529 709422 678728 697242 331399 372066 249819 545953
14878E45953R3353K48400D35287K10144B49077L36454B0581J71267R8917n8272
$$ 545953 639306 887706 435287 645431 249077 585531 20581 191848 290765 232493
14868B32493L11679j49734o3021p183M963N8090A21569K32150O6837k1437A2264
$$ 232493 544172 394438 331417 324234 329197 387287 121569 353719 420556 399119 12264
14856D45186n0089L0985R0421j58977o3756K17745J97335J4154k58527A82823
$$ 445186 395097 426082 516503 357526 293770 511515 708850 723004 464477 182823
14845E16876j93492L23352k41591L85801l18916j38237Q33625k09827k2562l77402
$$ 516876 323384 646736 405145 790946 472030 333793 1167418 957591 935029 557627
14835E57627R0807C11314J99184j10342K1800L53872k64578j75866K28690J11577
$$ 557627 648434 311314 510498 400156 421956 775828 511250 335384 564074 675651
14825F75651k40470J37921j47041m3574K38229B71438J96914j5156r4131j45619
$$ 675651 435181 573102 426061 382487 620716 271438 468352 453196 359065 213446
14815B13446J46326J80854n2066P7419Q0877k13764p1875A65340L10458L20595
$$ 213446 359772 540626 488560 565979 646856 433092 361217 165340 475798 796393
14805G96393C07605M12608Q0187k42635M62252m02702j18827K14231l6345j58429
$$ 796393 307605 720213 800400 557765 1020017 617315 498488 712719 676374 517945
14795E17945K60462l3393l40723K47115q0226p932P9199j27460O4088j02726J25010
$$ 517945 778407 745014 404291 651406 571180 563248 642447 514987 579075 476349 601359
14784F01359j75226j19142N67681m4829k38469j95917N58384k36820J7758j43451
$$ 601359 426133 306991 874672 829843 591374 395457 953841 717021 734779 591328
14774E91328K62884M718m24969J56885K45363p2134A56638K62128K53902C04071
$$ 591328 854212 858930 433961 590846 836209 764075 156638 418766 672668 304071
14763C89181J9465O1068N461K81336l08288L46887k39118O1897J14163K31726
$$ 389181 408646 469714 475175 756511 448223 795110 555992 617889 732052 963778
14753I63778m51598N4944J7427p0741M96595k86537r5118J38931k42810J49975
$$ 963778 512180 567124 584551 513810 1010405 723868 628750 767681 524871 674846
14743F74846J57552k5950k8669J02048k68618j06299K75493J03352C71118K66648
$$ 674846 832398 806448 777779 879827 611209 504910 780403 883755 371118 637766
14733F37766J49867o5397p2821K14865r5634J47084r0977N03345l92396J63952
$$ 637766 787633 722236 649415 864280 768646 915730 824753 1328098 935702 1099654
14723A099654L2754k66524J36285J31162j46860j37627J73031k97181M1198J17903
$$ 1099654 1132408 865884 1002169 1133331 986471 848844 1021875 724694 765892 883795
14713H83795m35758N03490K6614O2899l04731J20178p2171j16189J42891j14794
$$ 883795 448037 951527 978141 1041040 736309 856487 784316 668127 811018 696224
14703F96224Q2037Q0306o3158K83026M02969l87031K83289J3946j57642q82j29992
$$ 696224 778261 858567 795409 1078435 1481404 1094373 1377662 1391608 1233966 1233084 1103092
14692A103092j04560M3557k0745m68784N37468R3428k18382Q7736l9850L962N5050
$$ 1103092 998532 1042089 1021344 552560 1090028 1183456 965074 1052810 1012960 1016922 1071972
14681A071972j11808J31610P4380j26282k65048J05015k9917j8731K47556j93415
$$ 1071972 960164 1091774 1166154 1039872 774824 879839 849922 831191 1078747 885332
14671H85332M7345L23528l17241J57406J3568j58351k5763q5000L4536K25300
$$ 885332 932677 1256205 938964 1096370 1109938 951587 925824 840824 875360 1100660
14661A100660k55819L43358l38741K52434j34048k66832M88353J7145q3926l37211
$$ 1100660 844841 1188199 849458 1101892 967844 701012 1189365 1206510 1122584 785373
14651G85373M91179j48312k5165q2265J26477J99388k96194k48833N47295j44838
$$ 785373 1276552 1128240 1103075 1020810 1147287 1346675 1050481 801648 1348943 1204105
14641A204105R9228o04381L59457M94275p52745N36572q3982m3487j04661M1422
$$ 1204105 1303333 698952 1058409 1552684 799939 1336511 1252529 1209042 1104381 1145803
14631A145803J38357j97059J9036n7860M70793k46888l879l01296K78099M88984
$$ 1145803 1284160 1087101 1106137 1048277 1519070 1272182 1268303 967007 1245106 1734090
14621A734090n07324j22595J08013J20343l4939Q2389K72052n07757M11904j06097
$$ 1734090 1226766 1104171 1212184 1332527 1297588 1379977 1652029 1144272 1556176 1450079
14611A450079O0341o4866j9795j32722j4747K88623m35210M36755j41277L4718
$$ 1450079 1510420 1445554 1425759 1293037 1278290 1566913 1131703 1568458 1427181 1461899
14601A461899j65018J43991j66322L95135p5161k11843K55321o2211k43276L78983
$$ 1461899 1296881 1440872 1274550 1669685 1594524 1382681 1638002 1575791 1332515 1711498
14591A711498m43114J23561K0632N03534m92854L62335j39164J2285K42119o1751
$$ 1711498 1268384 1391945 1412577 1916111 1423257 1785592 1646428 1658713 1900832 1839081
14581A839081K06731m36811K07070Q5484k70430L59658R9712k89553L2450K95362
$$ 1839081 2045812 1609001 1816071 1901555 1631125 1990783 2090495 1800942 1833392 2128754
14571B128754k12615J77408k63929O23565n43246K36527j10037M46400p1097J3894
$$ 2128754 1916139 2093547 1829618 2453183 1909937 2146464 2036427 2482827 2411730 2425624
14561B425624K63798q3542j28058K84770j77397O04594L5819N62009j13268O57592
$$ 2425624 2689422 2605880 2477822 2762592 2585195 3189789 3225608 3787617 3674349 4331941
14551D331941M95163J247511J968322N327101Q904302J3138580K326203j5844643
$$ 4331941 4827104 6074615 8042937 13370038 22274340 35412920 37739123 21894480
14543B1894480A0085320m635940k067072p24057o19826J05262l12611p2163K17155
$$ 21894480 10085320 5449380 3382308 2658251 2038425 2143687 1831076 1758913 1976068
14534A976068j22528K61717k12506l60939O39872m27711K06254r4512M63036m7223
$$ 1976068 1853540 2115257 1902751 1541812 2181684 1753973 1960227 1865715 2328751 2281528
14524B281528k37137K15914K70913m10063K40911n8249K3127L30331l41302m327
$$ 2281528 2044391 2260305 2531218 2121155 2362066 2303817 2326944 2657275 2315973 2311646
14514B311646J20035o1941L45033j55187J22810l2483K60897j81774p090m68732
$$ 2311646 2431681 2369740 2714773 2559586 2682396 2649913 2910810 2729036 2721946 2253214
14504B253214L55269M59743k25020O6928j2465Q9176J71571k75551J52911K82739
$$ 2253214 2608483 3068226 2843206 2910134 2897669 2986845 3158416 2882865 3035776 3318515
14494C318515j09424j61020n0947L00124l885l70245N29888j07932j14215j87180
$$ 3318515 3209091 3048071 2997124 3297248 3293363 2923118 3453006 3345074 3230859 3043679
14484C043679L68662J4732K93649J01144r2734l7297J01262q142l2696O7304K3171
$$ 3043679 3412341 3427073 3720722 3821866 3729132 3691835 3793097 3784955 3752259 3819563 3842734
14473C842734J11587J31467r7195r8419L27826j4266m1193M53389l65161K61571
$$ 3842734 3954321 4085788 3988593 3890174 4218000 4203734 4162541 4615930 4250769 4512340
14463D512340k98115J69420J1551K27723J39370j03034q1742J50581J8145J93713
$$ 4512340 4214225 4383645 4395196 4622919 4762289 4659255 4577513 4728094 4746239 4939952
14453D939952K671J7251L98029O0198j08470M7533j6705k09204L71130k17733
$$ 4939952 4942623 4959874 5357903 5418101 5309631 5357164 5340459 5131255 5502385 5284652
14443E284652L88267k34824O9865J90951j42242K22351q2413O72071m71021N90872
$$ 5284652 5672919 5438095 5507960 5698911 5556669 5779020 5696607 6368678 5897657 6488529
14433F488529l31740J47321K54742J43936k46501L01767r0671K39081p0684K85919
$$ 6488529 6156789 6304110 6558852 6702788 6456287 6758054 6667383 6906464 6835780 7121699
14423G121699R3811J87524O5194J57245J20277J73336N4170K04065M31989l31756
$$ 7121699 7215510 7403034 7468228 7625473 7745750 7919086 7973256 8177321 8609310 8277554
14413H277554M87102k47336J23475J30309K27525J1056J01069K45046r3076Q2726
$$ 8277554 8764656 8517320 8640795 8771104 8998629 9009685 9110754 9355800 9262724 9345450
14403I345450O96545J8877K32987l96234L78008m0715K14307L00962K97866j62815
$$ 9345450 10041995 10060872 10293859 9897625 10275633 10234918 10449225 10750187 11048053 10885238
14393A0885238J95643K38489K54413L88891j82915L24775L89289K77891J06624
$$ 10885238 11080881 11319370 11573783 11962674 11779759 12104534 12493823 12771714 12878338
14384A2878338Q4912M45777Q5500N54431L09717J27408N8136J84221N09734P7873
$$ 12878338 12963250 13409027 13494527 14048958 14358675 14486083 14544219 14728440 15238174 15316047
14374A5316047K85570O71261L84038P3889M09919L81935J0808M50253N25595N31446
$$ 15316047 15601617 16272878 16656916 16730805 17140724 17522659 17533467 17983720 18509315 19040761
14364A9040761L81630M67267K59314J53624P07970K46865P01484O34513J02678
$$ 19040761 19422391 19889658 20148972 20302596 21010566 21257431 21958915 22593428 22696106
14355B2696106P14017L24579R37703M25834P12847M62158Q22046P44994N58599
$$ 22696106 23410123 23734702 24672405 25098239 25811086 26273244 27095290 27840284 28398883
14346B8398883O55513P11942R18378O46559O78659J014440P90989J161763Q30162
$$ 28398883 29054396 29766338 30684716 31331275 32009934 33024374 33815363 34977126 35807288
14337C5807288J341719O32616J286716J136622R26080J501397J465199J198081
$$ 35807288 37149007 37781623 39068339 40204961 41131041 42632438 44097637 45295718
14329D5295718J511849J505304J428383J560518J715758K061625J640339J874542
$$ 45295718 46807567 48312871 49741254 51301772 53017530 55079155 56719494 58594036
14321E8594036K141405K265992K252593K257123K489641K873569K888411L077412
$$ 58594036 60735441 63001433 65254026 67511149 70000790 72874359 75762770 78840182
14313G8840182K761442L586762L394571L489656M070831M073998M126277M696962
$$ 78840182 81601624 85188386 88582957 92072613 96143444 100217442 104343719 109040681
14305A09040681N211715N291163N521655N882314O201517O852641P157080P104717
$$ 109040681 114252396 119543559 125065214 130947528 137149045 144001686 151158766 158263483
14297A58263483P970283Q537725R495415R265554J0082943J0326872J1271910
$$ 158263483 166233766 174771491 184266906 193532460 203615403 213942275 225214185
14290B25214185J1677124J2623771J2550028J3423499J3804676J4083111J4479003
$$ 225214185 236891309 249515080 262065108 275488607 289293283 303376394 317855397
14283C17855397J5151621J5085902J5083421J4926997J4577954J3721167J2737508
$$ 317855397 333007018 348092920 363176341 378103338 392681292 406402459 419139967
14276D19139967J1895092J0005094P630554L952438L83589r51036q10656j409530
$$ 419139967 431035059 441040153 448670707 452623145 453006734 452055698 451245042 449835512
14268D49835512n293271m061186o684517q716245j0784949j2501981j3847315
$$ 449835512 444542241 440481055 433796538 425080293 414295344 401793363 387946048
14261C87946048j4849249j4649778j5015757j5811384j5295851j5249032j5088704
$$ 387946048 373096799 358447021 343431264 327619880 312324029 297074997 281986293
14254B81986293j3179907j3208899j3244979j2276227j1768946j0836924j0827816
$$ 281986293 268806386 255597487 242352508 230076281 218307335 207470411 196642595
14247A96642595r717353r095580q835232p699290p832534p474494p096452o203854
$$ 196642595 186925242 177829662 168994430 161295140 153462606 145988112 138891660 132687806
14239A32687806n980923n472665n177374m987055m858088m851079l730313m049456
$$ 132687806 126706883 121234218 116056844 111069789 106211701 101360622 97630309 93580853
14231I3580853l527858l728421l576494l092012l189125k651098k921433k769142
$$ 93580853 90052995 86324574 82748080 79656068 76466943 73815845 70894412 68125270
14223F8125270j985888k349150j978783k293013j832994k266150k181133j315035
$$ 68125270 66139382 63790232 61811449 59518436 57685442 55419292 53238159 51923124
14215E1923124j693959j353751j629237j514512j239961j233591j455692j447090
$$ 51923124 50229165 48875414 47246177 45731665 44491704 43258113 41802421 40355331
14207D0355331q66180q68296j218333j160167q11900q70308p92711q60306j156637
$$ 40355331 39489151 38620855 37402522 36242355 35430455 34560147 33767436 32907130 31750493
14198C1750493p10304r19752r17280o64789o49052o79494o96542o94840l55791
$$ 31750493 31040189 30120437 29203157 28538368 27889316 27209822 26513280 25818440 25462649
14189B5462649p69880p26079r9121p43471p74096m25705m10097n99803m17157
$$ 25462649 24692769 23966690 23867569 23124098 22350002 21924297 21514200 20914397 20497240
14180B0497240n18774m17317m41504k87817m09885k6249o34421o32537J67171
$$ 20497240 19978466 19561149 19119645 18831828 18421943 18395694 17761273 17128736 17295907
14171A7295907m56996l70168l74944j48032m69889l65385j41275j71665l28271
$$ 17295907 16838911 16468743 16093799 15945767 15475878 15110493 14969218 14797553 14469282
14162A4469282l47924j57048l73581k98572J04681j64537n34975N6818n63094
$$ 14469282 14121358 13964310 13590729 13292157 13396838 13232301 12697326 12754144 12191050
14153A2191050L682j21853m12433n4245j38410l60704O8508m04028n9917M4120
$$ 12191050 12194732 12072879 11660446 11606201 11467791 11107087 11175595 10771567 10711650 10755770
14143A0755770p01982L41633l53412k62586m6110k73877j06732k1430j03851k23212
$$ 10755770 10053788 10395421 10042009 9779423 9733313 9459436 9352704 9331274 9227423 9004211
14133I004211J27170l52335p2570l50155q3691j37658L08751l55387k4585k91717
$$ 9004211 9131381 8779046 8706476 8356321 8272630 8134972 8443723 8088336 8063751 7772034
14123G772034j36047R3061L3489l53824q8709j11393r5875J53894l75607N7557
$$ 7772034 7635987 7729048 7762537 7408713 7320004 7208611 7112736 7266630 6891023 6948580
14113F948580j20391k7819o8114K62882l62341l51321O5954k71193j41312K56906
$$ 6948580 6828189 6800370 6732256 6995138 6632797 6281476 6347430 6076237 5934925 6191831
14103F191831k32174r3983j30062j25804n247M5303m7406j47473J08936j79038
$$ 6191831 5959657 5865674 5735612 5609808 5604561 5649864 5602458 5454985 5563921 5384883
14093E384883j10333m6889j29140j79483J93322L199q6801q0687j99341K95719
$$ 5384883 5274550 5227661 5098521 4919038 5112360 5115559 5028758 4948071 4748730 5044449
14083E044449J739m59957r5177o6523K36333r1356J27947l24182l8720J1383q520
$$ 5044449 5046188 4586231 4491054 4424531 4660864 4569508 4697455 4373273 4334553 4345936 4337416
14072D337416J74k12227M6065l4539k5300j04034J73839l1569o29673L94515O2802
$$ 4337416 4337590 4125363 4171428 4136889 4111589 4007555 4181394 4149825 3520152 3914667 3977469
14061C977469k91426L58935l68573P0445J41816j63398l7463k73743P0579N2282
$$ 3977469 3686043 4044978 3676405 3746850 3888666 3725268 3687805 3414062 3484641 3536923
14051C536923K70234m38262K09169m9587k41052K9501R2174j56511j3492N0323
$$ 3536923 3807157 3368895 3578064 3528477 3287425 3316926 3409100 3252589 3239097 3289420
14041C289420k91866R6703J0817J21133l95479M27265N3029L2464m02669k5908
$$ 3289420 2997554 3094257 3105074 3226207 2830728 3257993 3311022 3343486 2940817 2914909
14031B914909K11779K2923m98388L77494k40435j54079l13014O05138m42071O2740
$$ 2914909 3126688 3149611 2651223 3028717 2788282 2634203 2321189 2926327 2484256 2546996
14021B546996k10717P1946J70399n2625P1838K96648n32237j56244L82633k55214
$$ 2546996 2336279 2408225 2578624 2525999 2597837 2894485 2362248 2206004 2588637 2333423
14011B333423J52937k11104j78200M77878j54584k83986J04129Q8133k82596P8310
$$ 2333423 2486360 2275256 2097056 2574934 2420350 2136364 2240493 2328626 2046030 2124340
14001B124340J69056k4572k92919L36958m32903O3237P7866j9508N5886K91247
$$ 2124340 2293396 2268824 1975905 2312863 1879960 1943197 2021063 2001555 2057441 2348688
13991B348688L55162J74484J468699L090091O839133J3084311J2198442j3479128
$$ 2348688 2703850 2878334 4347033 7437124 14276257 27360568 39559010 26079882
13983B6079882j1458841n854877k655179j249491o16824o69769l27846m56451
$$ 26079882 14621041 8766164 6110985 4861494 4244670 3574901 3247055 2790604
13975B790604J19724k27656Q9009k81398k9601L5386K02542k06075m24924K12891
$$ 2790604 2910328 2682672 2771681 2490283 2460682 2496068 2698610 2492535 2067611 2280502
13965B280502j0989l55968j6078N29183m95713o9533L05133k58596K88001m18737
$$ 2280502 2269513 1913545 1897467 2426650 1930937 1861404 2166537 1907941 2195942 1777205
13955A777205M43278j93764k27696P6127K3085o3045n1198M5604j51381J55000
$$ 1777205 2220483 2026719 1799023 1875150 1898235 1835190 1783992 1829596 1678215 1833215
13945A833215R3794K31210l58896J69863r0111K5070m76851K01937J36198j89896
$$ 1833215 1927009 2158219 1799323 1969186 1879075 1904145 1427294 1629231 1765429 1575533
13935A575533l5273N1996K61422m48971K42639l23129J9017K17934l12887L18477
$$ 1575533 1540260 1592256 1853678 1404707 1647346 1324217 1343234 1561168 1248281 1566758
13925A566758O6584J25048J17924l93365l92000N42962k24906j8272K46957k99965
$$ 1566758 1633342 1758390 1876314 1482949 1090949 1633911 1409005 1390733 1637690 1337725
13915A337725M94458n98320K66365P2183m81729N79Q7640L66183J78638l56838
$$ 1337725 1832183 1233863 1500228 1572411 1090682 1091261 1178901 1545084 1723722 1366884
13905A366884j30288M76202k92339k39490J38384J42529k12339j13819M22076
$$ 1366884 1236596 1712798 1420459 1180969 1319353 1461882 1249543 1135724 1557800
13896A557800l86110K37899k89807K04373k09613K42974j29900J86497j23592
$$ 1557800 1171690 1409589 1119782 1324155 1114542 1357516 1227616 1414113 1290521
13887A290521K27157k84202K73459l34914j82349J33868k03970L1962L46942j77166
$$ 1290521 1517678 1233476 1506935 1172021 989672 1123540 919570 951532 1298474 1121308
13877A121308l9140L30435m74544K20152J84780q9848N7144N6308o00041M74407
$$ 1121308 1082168 1412603 938059 1158211 1342991 1253143 1310287 1366595 766554 1240961
13867A240961l12220L8352Q0924R2370j92842N5957j15995K37735m6607k63477
$$ 1240961 928741 967093 1048017 1140387 947545 1003502 887507 1125242 1078635 815158
13857H15158L17951j49197Q0087R263J09031l57116K14076N0439l40774j7097
$$ 815158 1133109 983912 1063999 1073262 1182293 825177 1039253 1089692 748918 731821
13847G31821K79230Q138q850l6274K02235k57275J19440j064n9122k02754K99091
$$ 731821 1011051 1019189 1010339 974065 1176300 919025 1038465 1037401 978279 775525 1074616
13836A074616n5500k53815J35297j4183K15745E18195K92966j99621J66194K76299
$$ 1074616 1019116 765301 900598 886415 1102160 518195 811161 611540 777734 1054033
13826A054033l66061Q765K48309j54248k91055N17043j28037J24602j63736J63795
$$ 1054033 687972 696737 945046 790798 499743 1016786 888749 1013351 849615 1013410
13816A013410k89059r519L43027j88015m8188j02744L61649p3956j95916r3992
$$ 1013410 724351 714832 1057859 869844 821656 718912 1080561 1006605 810689 716697
13806G16697K00325K14845k77104j34325O5408k90367M76169l62491J07972R1136
$$ 716697 917022 1131867 854763 720438 785846 495479 971648 609157 717129 808265
13796H08265k63337J17339J89106k72048j82242M69698N1096l71748M44703m90650
$$ 808265 544928 662267 851373 579325 397083 866781 917877 546129 990832 500182
13786E00182L66382l74555J37954r7967J08339p352K51966D12857J90045L78735
$$ 500182 866564 492009 629963 531996 640335 632983 884949 412857 602902 981637
13776I81637r9760M7152B56069N32642k1480k60118J17608K6094j27738L35535
$$ 981637 881877 929029 256069 788711 767231 507113 624721 650815 523077 858612
13766H58612k76690K41197k05695B44880K79900J82027j19199k58602L65288P5451
$$ 858612 581922 823119 617424 244880 524780 706807 587608 329006 694294 769745
13756G69745k10453J02146l08645P9677j30498L50503j41756J68878j02507n405
$$ 769745 559292 661438 352793 432470 301972 652475 510719 679597 577090 571685
13746E71685Q9902m5825p004L2989l2529j59236J12738R6137k386o4011j03922
$$ 571685 661587 615762 608758 641747 609218 449982 562720 658857 656471 592460 488538
13735D88538K43616C40674M09127R9325l01355J79753M3603j01140j87477J82058
$$ 488538 732154 340674 749801 849126 547771 727524 771127 669987 482510 664568
13725F64568q8566o0637R6983l8963j43046P1500M44508l81130M5832B85922K01903
$$ 664568 576002 515365 612348 573385 430339 501839 946347 565217 611049 285922 487825
13714D87825r8339J38978N1599K28696k27942K12668k06935l8609A85518L22439
$$ 487825 389486 528464 580063 808759 580817 793485 586550 547941 185518 507957
13704E07957K08657j72913M9388k51002P2590J14315J06317k85629L19595C21096
$$ 507957 716614 543701 593089 342087 414677 528992 635309 349680 669275 321096
13693D96484q88O3332k9196j12141q0815L47853k89586K57764J29187l32562j03919
$$ 496484 495596 558928 529732 417591 336776 684629 395043 652807 781994 449432 345513
13682C45513K56126k20557J13228D2944M10901O7684K6126B36204K72319K7661
$$ 345513 601639 381082 494310 42944 453845 521529 547655 236204 508523 536184
13672E36184l4573A97718K44527j30025J42653P158J47308j39562k23387A2302
$$ 536184 501611 197718 442245 312220 454873 462031 609339 469777 246390 12302
13661C03668L71039o6107R5172Q538k93464J18092B68410L09793L9880k18135
$$ 303668 674707 608600 703772 712310 418846 536938 268410 578203 618083 399948
13651C99948k7198j39166K71535N2063J1205J5683j94769m9776K11459k08040
$$ 399948 372750 233584 505119 557182 568387 584070 389301 339525 550984 342944
13641C42944M2229A77708M42207j40867J13598j04313l2318m3142Q6428J57152
$$ 342944 385173 177708 619915 479048 592646 488333 456015 412873 499301 656453
13631F56453k35300j4080A02717L03555k3348J1984O960K01963j22998B24692
$$ 656453 421153 407073 102717 406272 382924 394908 401868 603831 480833 224692
13620B70382J07581k0519A19388M83492j76B05152K64914J47167B42358M02381
$$ 270382 377963 357444 119388 602880 602704 205152 470066 617233 242358 644739
13610F44739k72550j39117J69846m3085M3748o7934J81815B45909K10490M3443
$$ 644739 372189 233072 402918 359833 403581 335647 517462 245909 456399 499842
13600D99842j74120k5261F9630N0237M85653K8632k60758n0182G5055K90929A39515
$$ 499842 325722 300461 69630 119867 605520 634152 373394 323212 75055 365984 139515
13588G2475L30662J65398k25537a34844C44771J99379A72317K20945p7440l0852
$$ 72475 403137 568535 342998 -134844 344771 544150 172317 393262 315822 284970
13578B84970R3741A71052L05391b5703F19304J11658B36871K16539A58809J8069
$$ 284970 378711 171052 476443 -25703 619304 730962 236871 453410 158809 176878
13568A76878N9359k0355H2877J76672J11322l9717M560P037K56697A82698K1718
$$ 176878 236237 215882 82877 259549 370871 331154 335714 342751 599448 182698 204416
13557B04416a75128B13281E2086L67938j24357Q4265A60869J76787M1974J3455
$$ 204416 -175128 213281 52086 420024 295667 379932 160869 337656 379630 393085
13547C93085J89220j41266k09811j05600J54163J45089j75662K19132r7870L6970
$$ 393085 582305 441039 231228 125628 279791 424880 249218 468350 370480 407450
13537D07450G6381K67803q687O0804j84519q088J18043j5199j42222p5913L12695
$$ 407450 76381 344184 335497 396301 211782 203694 321737 306538 164316 88403 401098
13526D01098A54193J60806l6925J92585k15639q0353K79217j20852a06391f235
$$ 401098 154193 314999 278074 470659 255020 174667 453884 333032 -106391 -6235
13515h0868C19279I7003l7045L93257q8539H2839L87330A36753J43874A20023
$$ -80868 319279 97003 59958 453215 364676 82839 470169 136753 280627 120023
13504D49996k17985m9927q6853P4709P1400J11780a21690B67647Q2192A37774
$$ 449996 232011 182084 95231 169940 241340 353120 -121690 267647 349839 137774
13493C10204A51899J46463k1659F1619K79282Q8383e1071C94118A75524o9029
$$ 310204 151899 298362 276703 61619 340901 429284 -51071 394118 175524 106495
13483A06495J20019j829R4896A58131J94991A21015K12218c398B68498o9224H5595
$$ 106495 226514 224685 319581 158131 353122 121015 333233 -3398 268498 199274 85595
13471B1964M2349K85677J0428j35806J69406Q685A71835K11653j78533E1484M7869
$$ 21964 64313 349990 360418 224612 394018 402703 171835 383488 204955 51484 99353
13460I9353j1014b9080F7481K16231E3605P9174k3912K00883J3829o4709p8036
$$ 99353 88339 -29080 67481 283712 53605 132779 108867 309750 323579 258870 180834
13449A80834B3267Q7336m3451J26582K01608O477E3787J84835E0877P2686K39867
$$ 180834 23267 110603 67152 193734 395342 401819 53787 238622 50877 123563 363430
13438C63430I6943J30657H5897K86384J9492K6749I1822A3504K90700A52092q478
$$ 363430 96943 227600 85897 372281 391773 418522 91822 13504 304204 152092 143614
13427A43614J42922L33814j59990A96387J65324Q3502j58719K30121k56369I3915
$$ 143614 286536 620350 460360 196387 361711 445213 286494 516615 260246 93915
13416C69782r4385j09386M2209E2614M67585A24276J89365j33673J22648l0996
$$ 369782 275397 166011 208220 52614 520199 124276 313641 179968 302616 271620
13406B71620R9523g5033D2864K711J24255K21610j76318p8763J855g528B16522
$$ 271620 371143 -75033 42864 45575 169830 391440 215122 136359 138214 -7528 216522
13394i1886B03953Q1132B2977K96618j05950a52213K6900I000L67814A63179C8823
$$ -91886 203953 285085 22977 319595 213645 -152213 -125313 9000 376814 163179 38823
13382C71455M7895k6721A68845f0340I9710B2149a4513E23144C9549L8965J2183
$$ 371455 419350 392629 168845 -60340 99710 22149 -14513 523144 39549 78514 90697
13371I0697Q033c9388C7220M3260C50a13507D95243G881K92482J69818A09358
$$ 90697 98730 -39388 37220 80480 350 -113507 495243 7881 300363 470181 109358
13359b0084E3510b8730A60479R5704o5589N1971p8343B1789M32727m5923A59483
$$ -20084 53510 -28730 160479 256183 190594 242565 164222 21789 454516 408593 159483
13347B83195Q2338A64753a01266B72029K07321B04882J73905G0945a63760B15198
$$ 283195 365533 164753 -101266 272029 479350 204882 378787 70945 -163760 215198
13336B01436F3613j0523J61926P1006m4162f9520K631j1043C88286j16247m7076
$$ 201436 63613 53090 215016 286022 241860 -69520 -66889 -77932 388286 272039 224963
13325B24963H6239b0576A25477c7218q8290L3623K2512j07286A8511M215a98512
$$ 224963 86239 -20576 125477 -37218 -125508 -91885 -69373 -176659 18511 22726 -198512
13313e1470B86598p0013j3116b66322B8122c6380A99678J6743J46272j73760g5954
$$ -51470 286598 216585 203469 -266322 28122 -36380 199678 216421 362693 188933 -75954
13301D26172j25334j7978L6041H1824L10624A67720F1014b0900C23928K8114A00625
$$ 426172 300838 282860 318901 81824 392448 167720 61014 -20900 323928 352042 100625
13289B79674A00887L2342a38897A43158O5738B386e7588N133B9936K53899n2345
$$ 279674 100887 133229 -138897 143158 208896 2386 -57588 -52455 29936 283835 231490
13278B31490d6531A72502K26046j82882J40426a69056D2955a87620A20013j9975
$$ 231490 -46531 172502 398548 215666 356092 -169056 42955 -187620 120013 100038
13268A00038K06244L12583B0889K6842Q066K54495G979c43145f4855G3640K23436
$$ 100038 306282 618865 20889 47731 55797 310292 7979 -343145 -64855 73640 297076
13257B97076j3192j35629c896m4386j39879E79975B02267n5234b17880A21065
$$ 297076 283884 148255 -3896 -48282 -188161 579975 202267 147033 -217880 121065
13246F2405a13515A34063b08479A50665N88g3779j0398k4532o0399d1098H8110
$$ 62405 -113515 134063 -208479 150665 151253 -73779 -84177 -108709 -169108 -41098 88110
13234B55500I1770K64916A14248a94672K7378C5732d1667G168J59734b27463A60105
$$ 255500 91770 356686 114248 -194672 -167294 35732 -41667 7168 166902 -227463 160105
13222A92437b10072A12077k2702C1894K59909n3417F0753J74694R3856A25124
$$ 192437 -210072 112077 89375 31894 291803 238386 60753 235447 329303 125124
13211b6282q8065A29939b81439B8884J88850a48664B13027E4805b10556P8766
$$ -26282 -114347 129939 -281439 28884 217734 -148664 213027 54805 -210556 -131790
13201a31790N7918A92279b8393B28146c917k70445D1901L116N36832C2505P4878
$$ -131790 -73872 192279 -28393 228146 -3917 -274362 41901 45017 581849 32505 107383
13190A07383N4812d8394k15380A73288a15294M7098D5568b37658J17401A82014
$$ 107383 162195 -48394 -263774 173288 -115294 -68196 45568 -237658 -120257 182014
13179e9310E3555c44177A14106A3875J33126L8932h954A11499A7996c88267D3765
$$ -59310 53555 -344177 114106 13875 147001 185933 -8954 111499 17996 -388267 43765
13167A24441N0778i9464A51090J0505o0306h1085B73566f7914F3003J22947b34017
$$ 124441 175219 -99464 151090 161595 101289 -81085 273566 -67914 63003 185950 -234017
13155g780k8043m5972b9539B06269r5123J44377r9026k3490K55723F083c7823
$$ -7780 -35823 -81795 -29539 206269 111146 255523 156497 133007 388730 6083 -37823
13143A16013E0505J21176b08205B0996L7808K43766a34442b3187A41550M7003
$$ 116013 50505 171681 -208205 20996 58804 302570 -134442 -23187 141550 188553
13133A88553J35145a02954A2574a03094A03098a13306H7091k387a48458A34556
$$ 188553 323698 -102954 12574 -103094 103098 -113306 87091 84704 -148458 134556
13122h5116A48673b8001D99618B12714q8274J20030b0599B14388D8267J22407
$$ -85116 148673 -28001 499618 212714 124440 244470 -20599 214388 48267 170674
13112A70674A003P0667l0761j8584b12682A26622b1601n0773B02172C1494K91234
$$ 170674 1003 71670 40909 22325 -212682 126622 -21601 -72374 202172 31494 322728
13101C22728r8160L08850I855L03023a70932A53238c5240P816k6932l39302A20267
$$ 322728 224568 533418 9855 312878 -170932 153238 -35240 -27424 -54356 -393658 120267
13089A24367m1426d970A02785a20059A95492H0894M01997A54274a16447K1287
$$ 124367 82941 -4970 102785 -120059 195492 80894 482891 154274 -116447 -95160
13079i5160F6614J96343e2749A17743L4151n1533K42924A43427D1221g3753r6745
$$ -95160 66614 262957 -52749 117743 151894 100361 343285 143427 41221 -73753 -170498
13068a70498e979j6882F8692J1062K6421a15508K8755L6209A73955H2805L5414
$$ -170498 -5979 -22861 68692 79754 106175 -115508 -86753 -50544 173955 82805 118219
13057A18219k4257l6332a27407r0131D03784A21961J92673a48267d1734H7644
$$ 118219 93962 57630 -127407 -217538 403784 121961 314634 -148267 -41734 87644
13046a4295A76373k6499J92181j43332F1980I400J12837m8822O9062Q9725E2464
$$ -14295 176373 149874 342055 198723 61980 9400 122237 73415 142477 232202 52464
13034A43899a14077A6759J5883N5747g3767A02115a7310C93900f9621o3627F8666
$$ 143899 -114077 16759 32642 88389 -73767 102115 -17310 393900 -69621 -133248 68666
13022h4331C72259k2044K3755a81538A50506a422G8467L5779B5881a4628A93189
$$ -84331 372259 350215 373970 -181538 150506 -1422 78467 114246 25881 -14628 193189
13010A11031O5035R917a25472G2846L84689I8629a41145B7679K70321D471O5715
$$ 111031 176066 185983 -125472 72846 457535 98629 -141145 27679 298000 4471 70186
12999G0186c13420J37492b7305C4458O728N1110a41073D251J21763L2092n362
$$ 70186 -313420 -175928 -27305 34458 41186 92296 -141073 4251 126014 158106 152744
12988A52744a70377d5639N187a6891A11955M9287J19075e4212A87176D6176d6763
$$ 152744 -170377 -45639 -40452 -16891 111955 161242 280317 -54212 187176 46176 -46763
12976F6969K05846q8946j9470R0306B591P9344J36737f3511A98299L7052M464
$$ 66969 272815 183869 164399 254705 2591 81935 218672 -63511 198299 235351 239815
12965B39815d56948b6394A44243R8226A16231J20231A7585J97445f3133a52B09094
$$ 239815 -456948 -26394 144243 242469 116231 236462 17585 215030 -63133 -152 209094
12953D01907n9773a48717E0834h1054o6584N1897k79654I6446j3324k3616b18368
$$ 401907 342134 -148717 50834 -81054 -147638 -95741 -375395 96446 83122 59506 -218368
12941C13963I1478b58007c3028A56883c48562P4748N6223R1793A13427b09721
$$ 313963 91478 -258007 -33028 156883 -348562 -273814 -217591 -125798 113427 -209721
12930i2735r6015M4391P1045D26c28067F9614l639A7567a85718K1350l54619c5072
$$ -92735 -188750 -144359 -73314 426 -328067 69614 65975 17567 -185718 -164368 -518987 -35072
12917g0766B13599a7387D25462c68065a6181B3211J9281d2094Q543B19700R0257
$$ -70766 213599 -17387 425462 -368065 -16181 23211 42492 -42094 -33551 219700 309957
12906C09957b43721A43695K9191i0671F1674K06742b64690I4003J84934G081b20124
$$ 309957 -243721 143695 172886 -90671 61674 268416 -264690 94003 278937 7081 -220124
12894G1384K48510D0547L0881O3583f7432j10447c2784j36834A44581J14064l5197
$$ 71384 319894 40547 71428 135011 -67432 -177879 -32784 -169618 144581 258645 223448
12883B23448k0393E3602M15200F437K56505B5494g3695A74092a32941j82464a38424
$$ 223448 203055 53602 468802 6437 262942 25494 -73695 174092 -132941 -315405 -138424
12871C10122b07362a0836j6345j68377m7287H3282P6596K33157A38717n9487Q0106
$$ 310122 -207362 -10836 -27181 -195558 -242845 83282 159878 393035 138717 79230 159336
12860A59336M1311A453b51275A14458l9614a33977j24090c2403j15019F8842d7977
$$ 159336 200647 1453 -251275 114458 74844 -133977 -258067 -32403 -147422 68842 -47977
12848A54154J39799A44109f3269A26116a98930C45164m6374C8716a19558j58233
$$ 154154 293953 144109 -63269 126116 -198930 345164 298790 38716 -119558 -277791
12838b77791A4263J49261b70944D9027J85137J33322a75242L73M8334k85560A89470
$$ -277791 14263 163524 -270944 49027 234164 367486 -175242 -174869 -126535 -412095 189470
12826I9052K09462j50262J76754A45342F139g2735a5605j20244d6618r6262a8493
$$ 99052 308514 158252 335006 145342 6139 -72735 -15605 -135849 -46618 -142880 -18493
12814b6755p1693l6939f2916E17008B58108m9461D7217a98727F3668B4757L07353
$$ -26755 -98448 -135387 -62916 517008 258108 208647 47217 -198727 63668 24757 332110
12803C32110A37984c12756B05154a34132H269J05430n1096P4838J51910c90971
$$ 332110 137984 -312756 205154 -134132 8269 113699 62603 137441 289351 -390971
12792i8503r7870b6192j6790j57533b296r9053k4536b225C8629J75569f8542q9961
$$ -98503 -196373 -26192 -42982 -200515 -2296 -101349 -125885 -2225 38629 214198 -68542 -158503
12780a58503A94843J65395B0813J70931H8026b54489i8765A44603P6033o9038
$$ -158503 194843 360238 20813 191744 88026 -254489 -98765 144603 220636 151598
12770A51598j5601N3153a5890r7665B5257a8197C114a10958k68180c5522A61825
$$ 151598 135997 189150 -15890 -113555 25257 -18197 3114 -110958 -379138 -35522 161825
12758a3487l84613B02850b5309A72697L4388g2028B26078A04608a0879A92319
$$ -13487 -398100 202850 -25309 172697 207085 -72028 226078 104608 -10879 192319
12747a40727C01983h7992j53741A01643e5891o5559E4342a59176A44033K7979
$$ -140727 301983 -87992 -241733 101643 -55891 -121450 54342 -159176 144033 172012
12737A72012e8142C71792f3641A05707l8101g0233k6048j29191B57293c5786j65542
$$ 172012 -58142 371792 -63641 105707 67606 -70233 -96281 -225472 257293 -35786 -201328
12726b01328A23923K22656e8388A40810l825b21594A35478A9318d0070B87608
$$ -201328 123923 346579 -58388 140810 136985 -221594 135478 19318 -40070 287608
12715a33375H1876J74887r0607c5918M482e787j49765A849f8905G5078B1766i9381
$$ -133375 81876 256763 166156 -35918 -31436 -5787 -155552 1849 -68905 75078 21766 -99381
12702a21747a4871A1610a35371B2389a37427j63041B29652a74011n9912N8645
$$ -121747 -14871 11610 -135371 22389 -137427 -300468 229652 -174011 -233923 -175278
12692a75278e0884A83099k9354n6565J67414d0247a0170k10620B16586C3623K08085
$$ -175278 -50884 183099 153745 97180 264594 -40247 -10170 -220790 216586 33623 241708
12681B41708B1400N7167g8036H7391h3612a9328q0750d6470j65665N0377A2646
$$ 241708 21400 78567 -78036 87391 -83612 -19328 -100078 -46470 -212135 -161758 12646
12669D92789k21573b87046H0298J48514G8740R1479q4259M2387R5647K3865a73511
$$ 492789 271216 -287046 80298 228812 78740 170219 85960 128347 223994 247859 -173511
12657g6646G8237d8785j09485A63526B6018J85474g1567F5630d805B32648F6972
$$ -76646 78237 -48785 -158270 163526 26018 211492 -71567 65630 -4805 232648 66972
12645E179g2100a4526j29261j07244F4318b14302A44589a03293C5736J98163l3125
$$ 5179 -72100 -14526 -143787 -251031 64318 -214302 144589 -103293 35736 233899 200774
12634B00774b45461E6960p612R7487Q2051a35464N7001c1445j15405d5311C7711
$$ 200774 -245461 56960 49348 146835 228886 -135464 -78463 -31445 -146850 -45311 37711
12622A41700a37553e1744B45010a98882D4033b7551j00853f3180D38290C9319
$$ 141700 -137553 -51744 245010 -198882 44033 -27551 -128404 -63180 438290 39319
12611b62274F4919a55828j72510Q7757G0292L4649k8931b9544A0662N8624R0807
$$ -262274 64919 -155828 -328338 -240581 70292 104941 76010 -29544 10662 69286 160093
12600A60093b2599B58666a42691O2382p4273d9065C33045A55739b97477F7581
$$ 160093 -22599 258666 -142691 -80309 -154582 -49065 333045 155739 -297477 67581
12589h963j07876B76215m175j20969J2939h5473C85430A78911C738a02613J2469
$$ -8963 -116839 276215 272040 151071 164010 -85473 385430 178911 3738 -102613 -90144
12578i0144l7956A26615l9679B9414J07917j5729b00535a7623C11726c01150h1550
$$ -90144 -128100 126615 86936 29414 137331 121602 -200535 -17623 311726 -301150 -81550
12566a26870C67580p2667a99516A2320L8192J62913c56507d9881A45684a92911
$$ -126870 367580 294913 -199516 12320 50512 213425 -356507 -49881 145684 -192911
12555b92245H1370R3487J162B5117R6436j6906P2467a021A05272j7986b38126
$$ -292245 81370 174857 176019 25117 121553 104647 177114 -1021 105272 87286 -238126
12543g3858K3072G9956o27c100n8403f199F6074B2856a229E7228a75884A69335
$$ -73858 -50786 79956 79329 -3100 -61503 -6199 66074 22856 -1229 57228 -175884 169335
12530b0941l26675a04647A55044a95307f638n5223H799c31066A37845J30680p974
$$ -20941 -347616 -104647 155044 -195307 -6638 -61861 8799 -331066 137845 268525 260551
12519B60551k1167A17328L6024a23764j4442A0073J04619d3962R803k8625E0317
$$ 260551 239384 117328 153352 -123764 -138206 10073 114692 -43962 -34159 -62784 50317
12507A07680c16261B94799a39156B25330h7946B8898J45987a73753A99481f8647
$$ 107680 -316261 294799 -139156 225330 -87946 28898 174885 -173753 199481 -68647
12496e8998F8248R0810e5961A15865j1289J58066E1938d0504l8140k8003B04846
$$ -58998 68248 159058 -55961 115865 104576 262642 51938 -40504 -78644 -106647 204846
12484C3201a05375C7604a20529j41089D6643a40959a7474j54400A33195K3495
$$ 33201 -105375 37604 -120529 -261618 46643 -140959 -17474 -171874 133195 156690
12474A56690A499h6032k85496j4721d9041a1646l38134C391P8442b35040a7469
$$ 156690 1499 -86032 -371528 -386249 -49041 -11646 -349780 3391 81833 -235040 -17469
12462A22174d513k10067K8228a0110c607B09740a17219A4937a33148a3966j49578
$$ 122174 -4513 -214580 -186352 -10110 -3607 209740 -117219 14937 -133148 -13966 -163544
12451a63544b5974H5625a36816B0301J43626C5707g7045A49875g5859A13244O50
$$ -163544 -25974 85625 -136816 20301 163927 35707 -77045 149875 -75859 113244 113894
12440A13894n3969f0376j73371j7383B20411b89715B1424f4266D4678P8858E8436
$$ 113894 59925 -60376 -233747 -251130 220411 -289715 21424 -64266 44678 123536 58436
12428a46717a0255A8576a47419A0144a63197A84157a47770C5407b83362f0794
$$ -146717 -10255 18576 -147419 10144 -163197 184157 -147770 35407 -283362 -60794
12417D42587A92937a00770a9502m9089A73074c9024A16214b7950O135k26618B88202
$$ 442587 192937 -100770 -19502 -68591 173074 -39024 116214 -27950 -21815 -248433 288202
12405C30192H1643a75452N8365A15114g8267j01312H5951A5111a83771A24733
$$ 330192 81643 -175452 -117087 115114 -78267 -179579 85951 15111 -183771 124733
12394h2370B59815a53453m8071F7087J79613B7129R2248c13127a39473O6381I1219
$$ -82370 259815 -153453 -201524 67087 246700 27129 119377 -313127 -139473 -73092 91219
12382d9960B00948c15182F3758b08282B80353n0234A01323b27880A32336a67633
$$ -49960 200948 -315182 63758 -208282 280353 230119 101323 -227880 132336 -167633
12371A1307c12610a24494l7436A07923K13577a02318F6430L046d59141F70L52698
$$ 11307 -312610 -124494 -161930 107923 321500 -102318 66430 69476 -459141 670 353368
12360C53368a93545E1440a38264J5161m16130A67246n8944K10260d8573l00185
$$ 353368 -193545 51440 -138264 -123103 -539233 167246 108302 318562 -48573 -348758
12350c48758A62637l932g3115A5430Q8324b13813e9084k33124A03311b84259A80797
$$ -348758 162637 158705 -73115 15430 103754 -213813 -59084 -292208 103311 -284259 180797
12338I2505L29754c31624A81646g5615B9564b71450A00196D6922A789a86914K2265
$$ 92505 422259 -331624 181646 -75615 29564 -271450 100196 46922 1789 -186914 -164649
12327a64649A80487b24467D992J84039c00911F8371b16552B46985m8857j6767
$$ -164649 180487 -224467 4992 189031 -300911 68371 -216552 246985 198128 181361
12317A81361g6586k5899D31725F9001O1093N2983a70142B79890i8901M7604D14955
$$ 181361 -76586 -102485 431725 69001 130094 183077 -170142 279890 -98901 -51297 414955
12305A09642d3389A25201E4835c7767C815J50831a05108B52071H7607I819b81065
$$ 109642 -43389 125201 54835 -37767 3815 154646 -105108 252071 87607 9819 -281065
12293a93341A54790c57937B10312n3882b5708k1628D09075A83403a0298q7941
$$ -193341 154790 -357937 210312 156430 -25708 -47336 409075 183403 -10298 -98239
12283i8239I5044J69576i1561A74259A631g5706A83663m83J92590A22776c5932
$$ -98239 95044 264620 -91561 174259 1631 -75706 183663 183180 375770 122776 -35932
12271a30394a9387A66444c3814A79913C1808g5576G1126c67088G0302K47592A3399
$$ -130394 -19387 166444 -33814 179913 31808 -75576 71126 -367088 70302 317894 13399
12259B0171a6373C50294A71224c78362B6140b04773B5347f7751B27761l8108l7909
$$ 20171 -16373 350294 171224 -378362 26140 -204773 25347 -67751 227761 189653 151744
12248A51744K54777A58573l6259f871j02511A00830B0997b5968A45501N1182a37370
$$ 151744 406521 158573 122314 -6871 -109382 100830 20997 -25968 145501 196683 -137370
12236h9650A32442D7085a03760A73339b8694B37701E4586J31158b11007h191A48769
$$ -89650 132442 47085 -103760 173339 -28694 237701 54586 185744 -211007 -8191 148769
12224a3414A86328A6636K19933J62288E4307M82531A38447B5305K61866Q3074
$$ -13414 186328 16636 236569 398857 54307 536838 138447 25305 287171 370245
12214C70245a43442A42908M8581j6682M4970J06240j29660R4820q2829b12690
$$ 370245 -143442 142908 191489 174807 219777 326017 196357 291177 208348 -212690
12203c5728A82920E7931K56151A05736b8885A22461k3035L8622J45899j18090
$$ -35728 182920 57931 314082 105736 -28885 122461 99426 138048 283947 165857
12193A65857Q0143K7233F0099L64234J56351a8527m0832F6971H732i9381B13625
$$ 165857 246000 273233 60099 424333 580684 -18527 -59359 66971 8732 -99381 213625
12181B67461D7929J4745d5599p4990H7377d472j52811B19487P0998h9735J3195
$$ 267461 47929 62674 -45599 -120589 87377 -4472 -157283 219487 290485 -89735 -76540
12170g6540A72482H1806J39360g5385C05924j10339l4112d1485C26750j20285
$$ -76540 172482 81806 221166 -75385 305924 195585 161473 -41485 326750 206465
12160B06465k6557L74318a98710A10098A7469O8206l908J5834a10462E4475a02880
$$ 206465 179908 554226 -198710 110098 17469 85675 81767 97601 -110462 54475 -102880
12148E9709f2263B84736b09742b8815l3754N616A86489b52738A11883b8840A88176
$$ 59709 -62263 284736 -209742 -28815 -62569 -56953 186489 -252738 111883 -28840 188176
12136a81731C4762J07253M37383f7340C15653A9500O3531J85932C8689c0969k19494
$$ -181731 34762 142015 579398 -67340 315653 19500 83031 268963 38689 -30969 -250463
12125b50463E9408a53457F8634a87978P1957q804G3356J31900p8714b53375A4267
$$ -250463 59408 -153457 68634 -187978 -116021 -124825 73356 205256 126542 -253375 14267
12113a54032M3946a2180j26055c4319j60B30352J97573a22585L7227A34850b0158
$$ -154032 -110086 -12180 -138235 -34319 -34479 230352 427925 -122585 -85358 134850 -20158
12101b34733I6217j3967f0597K3139A02616C4304a77825A53746J28419c7456A01644
$$ -234733 96217 82250 -60597 -37458 102616 34304 -177825 153746 282165 -37456 101644
12089a68723d7415D0682J98440J62412b2528C29656h3284c3993r7617B59832k9346
$$ -168723 -47415 40682 239122 401534 -22528 329656 -83284 -33993 -131610 259832 230486
12078B30486g2458m9066I1577l3347N8366g6157j27597R7328n2263C72774g2287
$$ 230486 -72458 -121524 91577 58230 116596 -76157 -203754 -106426 -158689 372774 -72287
12066b38853a16363B61293K49419r4859j1589K05299a89886F2319a65420N7378
$$ -238853 -116363 261293 510712 415853 404264 609563 -189886 62319 -165420 -108042
12056a08042C827a8810E3362B1900P7855e2924B23753i943D4981J36333j9249
$$ -108042 3827 -18810 53362 21900 99755 -52924 223753 -9943 44981 181314 162065
12045A62065o6580k1573J3707b77923A6380O7975K61649a14299h159j82121F6887
$$ 162065 95485 73912 87619 -277923 16380 84355 346004 -114299 -8159 -190280 66887
12033B22827c84811A19084P4187j7970d37275C85074e189l4988k1889B69608a40984
$$ 222827 -384811 119084 193271 175301 -437275 385074 -5189 -40177 -62066 269608 -140984
12021E4099b3743A43763a52206I2389J34753b56047A77226Q6999a11836B69328
$$ 54099 -23743 143763 -152206 92389 227142 -256047 177226 264225 -111836 269328
12010I2278b96069R5031F1727l448a60343j6224B77738a06673B10086Q4034g7946
$$ 92278 -296069 -201038 61727 58279 -160343 -176567 277738 -106673 210086 294120 -77946
11998C0015J62767a5743l39281h9584k38476A00613c2981o8391C0865J58478e8232
$$ 30015 192782 -15743 -355024 -89584 -328060 100613 -32981 -101372 30865 189343 -58232
11986F6190R6895a52686j9003L9471B03184d3448H9492J34935A219b06690B9152
$$ 66190 163085 -152686 -171689 -132218 203184 -43448 89492 224427 1219 -206690 29152
11974b11928a1105A26986b18785A11684h6793p902j4818I6859c09523a15480j39409
$$ -211928 -11105 126986 -218785 111684 -86793 -94695 -109513 96859 -309523 -115480 -254889
11963b54889E6002N4387a27601a2335R57n3672n5471c065r194D7700a0789k47304
$$ -254889 56002 110389 -127601 -12335 -11378 -65050 -120521 -3065 -12259 47700 -10789 -258093
11951b58093A52141L3820R8655A272b70858J12601A29824L9036b20003N4156B67290
$$ -258093 152141 185961 284616 1272 -270858 -158257 129824 168860 -220003 -165847 267290
11939B69112c2221J0004A74589d5143D1020J53489f7408a5135o6837A56577K8402
$$ 269112 -32221 -22217 174589 -45143 41020 194509 -67408 -15135 -81972 156577 184979
11928A84979j0626c04030C0662O3263d5362H8965b17461C6022J0063J71042A3070
$$ 184979 174353 -304030 30662 93925 -45362 88965 -217461 36022 46085 217127 13070
11916A22455M7640a1255A49098K8229a82030A1802b10530k51840B49910D2316
$$ 122455 170095 -11255 149098 177327 -182030 11802 -210530 -462370 249910 42316
11905a04120A2851c3740l9819j6285l9020l7748A7281O9738b99795c0622r2978
$$ -104120 12851 -33740 -73559 -89844 -128864 -166612 17281 87019 -299795 -30622 -123600
11894a23600L529B03437r1742K25587h5244j82082c024B02503E1997c64835J68844
$$ -123600 -120071 203437 111695 337282 -85244 -267326 -3024 202503 51997 -364835 -195991
11883a95991j36441E68064g6856I0582a4327A58095b16669H7555a71233G1088
$$ -195991 -332432 568064 -76856 90582 -14327 158095 -216669 87555 -171233 71088
11872A45851a03344A71237a53407C7710h5313a1173A1246f0272j0109A86424g6665
$$ 145851 -103344 171237 -153407 37710 -85313 -11173 11246 -60272 -70381 186424 -76665
11860A8767R626b85203R4529L634c5825k69904F747a86072G8028h2695j18063
$$ 18767 28393 -285203 -190674 -187040 -35825 -305729 6747 -186072 78028 -82695 -200758
11849b00758B41322d4356A34321P6674A2970h1463D6348a81387f6689M528C26089
$$ -200758 241322 -44356 134321 210995 12970 -81463 46348 -181387 -66689 -62161 326089
11837D1856J07360b7918B5674a73038c3067A00799b05917b9125l6270m44393g168
$$ 41856 149216 -27918 25674 -173038 -33067 100799 -205917 -29125 -65395 -509788 -7168
11825b69861A2096a03131A92446e5719C7655a09096e1294H8459a01065n182A48720
$$ -269861 12096 -103131 192446 -55719 37655 -109096 -51294 88459 -101065 -106247 148720
11813b0728B24911A04800c9948m6286B39188F0671b4897p2806G2497L0131d6450
$$ -20728 224911 104800 -39948 -86234 239188 60671 -24897 -97703 72497 102628 -46450
11801G8148a25033a5448m8823A38177a61806G7952O4631B531c47014A8954J54556
$$ 78148 -125033 -15448 -64271 138177 -161806 77952 142583 2531 -347014 18954 173510
11790A73510m7735a24250A36824b43505C6266e232E0473K91630b13443e6415k1432
$$ 173510 125775 -124250 136824 -243505 36266 -5232 50473 342103 -213443 -56415 -77847
11779g7847E9159b22549A5010a05678o631r0137A45897C9063J08599b78791c6167
$$ -77847 59159 -222549 15010 -105678 -112309 -202446 145897 39063 147662 -278791 -36167
11767b54456d5867C6830J896d25457b7950B11401r8046d6710l2037C2046J7404
$$ -254456 -45867 36830 38726 -425457 -27950 211401 113355 -46710 -78747 32046 49450
11756D9450J00118a36737L3052c8152j40440K5165E0717K3095A2955e5486o9831
$$ 49450 149568 -136737 -103685 -38152 -178592 -153427 50717 73812 12955 -55486 -125317
11745a25317A71125A896b29436a4544B69548c6039A75803c48223Q4227G6783e6686
$$ -125317 171125 1896 -229436 -14544 269548 -36039 175803 -348223 -263996 76783 -56686
11733f4701A28957D1082A900e1646a4688j04679n1319D2613f2545i073E1452L8078
$$ -64701 128957 41082 1900 -51646 -14688 -119367 -170686 42613 -62545 -9073 51452 89530
11721H9530c1995n3627j43381D92871H7533a49356q876E6375N336a43230k49335
$$ 89530 -31995 -85622 -229003 492871 87533 -149356 -158232 56375 61711 -143230 -392565
11710c92565F9763a20125k7978H8776J49474I4091a54949A02550L1257d5538B33414
$$ -392565 69763 -120125 -148103 88776 238250 94091 -154949 102550 133807 -45538 233414
11698E2625K68063j06751H4045a68673j25148F1316j1081L05251a81499b6786
$$ 52625 320688 213937 84045 -168673 -293821 61316 50235 355486 -181499 -26786
11687D34250g4061a274H728f4964l8068c0044l33446Q7552H9980K75625c08406
$$ 434250 -74061 -1274 8728 -64964 -103032 -30044 -363490 -275938 89980 365605 -308406
11675B07050J55781H8801b18871g9909B5671a47129A00885b8953G9271a14105
$$ 207050 362831 88801 -218871 -79909 25671 -147129 100885 -28953 79271 -114105
11664b36166r8477J32961o9586M5557F980h4297B54621D0470P3134b16755H7226
$$ -236166 -334643 -201682 -271268 -225711 6980 -84297 254621 40470 113604 -216755 87226
11652B59784c17088J46936e634n1052K7244j79041c8019D1856N4322d05278o4209
$$ 259784 -317088 -170152 -5634 -56686 -29442 -208483 -38019 41856 96178 -405278 -469487
11641d69487i0781A77895e510k09738A74310F4292I096a75146A83099a24340j3665
$$ -469487 -90781 177895 -5510 -215248 174310 64292 9096 -175146 183099 -124340 -138005
11630a38005F8521B2679b390r1140B20273G0527A3820J81374b11515C82518A90742
$$ -138005 68521 22679 -2390 -93530 220273 70527 13820 195194 -211515 382518 190742
11618H5224l9013e0909C42018e7935p1679e280j4371l02843h2619B10066o5668
$$ 85224 46211 -50909 342018 -57935 -129614 -5280 -19651 -322494 -82619 210066 144398
11607A44398c9995A7a04433C1521j3691M47947a9053C69688o7351j40623p4357
$$ 144398 -39995 17 -104433 31521 17830 465777 -19053 369688 302337 161714 87357
11596H7357J65975O4760B0410q392J32677A5537J46327p465b7614B33811c9490
$$ 87357 253332 318092 20410 12018 144695 15537 161864 154399 -27614 233811 -39490
11584C20419j31969G0125l1076J09171a6800C7228b8085j07909j64427a30684
$$ 320419 188450 70125 39049 148220 -16800 37228 -28085 -135994 -300421 -130684
11573B46169K33708f5678k61773b6902l5053D31044F5484k6668a27940A60279
$$ 246169 479877 -65678 -327451 -26902 -61955 431044 65484 38816 -127940 160279
11562f4240a1572B68248n221m5038c4833l12169B59341a48637f6172A22765f3258
$$ -64240 -11572 268248 263027 217989 -34833 -347002 259341 -148637 -66172 122765 -63258
11550A11119a63758B00420a51554j7513C21221a71741B8829a41608N3463j03287
$$ 111119 -163758 200420 -151554 -169067 321221 -171741 28829 -141608 -88145 -191432
11540a91432G0818a38892A09016a76046A0958L81462j79828b72601F3930C1859
$$ -191432 70818 -138892 109016 -176046 10958 392420 212592 -272601 63930 31859
11529B46016a00308o2299O2376C3215i2845C01399j0807J67098g5937o4685e0379
$$ 246016 -100308 -162607 -100231 33215 -92845 301399 290592 457690 -75937 -140622 -50379
11517a70377j8354h9462A75225b14104F7545B5619P1704e8065j76620B38508d1508
$$ -170377 -188731 -89462 175225 -214104 67545 25619 97323 -58065 -234685 238508 -41508
11505B89956f8976B50886g9542B54849o3673j7905d7568G5427b25297A19588C6604
$$ 289956 -68976 250886 -79542 254849 191176 173271 -47568 75427 -225297 119588 36604
11493C5963H888a11609L2976B51443e9423D1097R1286D50J23046a39558A00373
$$ 35963 8888 -111609 -78633 251443 -59423 41097 132383 450 123496 -139558 100373
11481A41793J29506A04541h3184k13111D23752K3765d5297A46745J8015l380g2209
$$ 141793 271299 104541 -83184 -296295 423752 447517 -45297 146745 164760 161380 -72209
11469D06726g9887I6127b42066J14997l75982a03821b2768C66791N3964o5177
$$ 406726 -79887 96127 -242066 -127069 -503051 -103821 -22768 366791 420755 355578
11459C55578A1700a55615A9118J8668K30063a4738A1513P4186g5949A66409D2339
$$ 355578 11700 -155615 19118 37786 267849 -14738 11513 85699 -75949 166409 42339
11447I7895l9556d1725B67977g8542k0936B36068H1221c790j52888I5960l2185
$$ 97895 58339 -41725 267977 -78542 -99478 236068 81221 -3790 -156678 95960 63775
11436F3775b14447E42548a25538a6345A76143D2465L36855j46151e4035p1876
$$ 63775 -214447 542548 -125538 -16345 176143 42465 379320 233169 -54035 -125911
11426a25911r1106C9575J33056h6387l94025F9066f0904B8067M929L1188i8443
$$ -125911 -217017 39575 172631 -86387 -480412 69066 -60904 28067 32996 64184 -98443
11414c83875i2145D9547J09271b7690j00056B24553E8440d9198j54938C03916
$$ -383875 -92145 49547 158818 -27690 -127746 224553 58440 -49198 -204136 303916
11403A57125L4766a17877A58073N8767D625O0988B7485b64188i2459A73440e2935
$$ 157125 191891 -117877 158073 216840 4625 65613 27485 -264188 -92459 173440 -52935
11391d7576j78918b2656o6593A79999q6169a44777K2665A48705b2544A10197K9892
$$ -47576 -226494 -22656 -89249 179999 93830 -144777 -122112 148705 -22544 110197 140089
11380A40089f4119q2217o6161k08089G2799b0829A25216j0782n5344N7297B4786
$$ 140089 -64119 -146336 -212497 -420586 72799 -20829 125216 114434 59090 116387 24786
11368D6519l6a19963a3358A38121L2759a0825A20944h0705B13643b4713A96133
$$ 46519 46483 -119963 -13358 138121 170880 -10825 120944 -80705 213643 -24713 196133
11356b94979J16146A18766h5851r4632F6302J90809a39585O4622b1481p2866B84622
$$ -294979 -178833 118766 -85851 -180483 66302 257111 -139585 -74963 -21481 -94347 284622
11344c91646P4716i9797G8165e7750n8806j75747A30734J25574J12787i7691A21887
$$ -391646 -316930 -99797 78165 -57750 -116556 -292303 130734 256308 369095 -97691 121887
11332a73153k29157A29493c05064O0438j20036B21334c18895a32543B41412b7474
$$ -173153 -402310 129493 -305064 -244626 -364662 221334 -318895 -132543 241412 -27474
11321a47297A00930c1696n5162E6273K40888q8102O1209a26896a3575A91941k1323
$$ -147297 100930 -31696 -86858 56273 297161 209059 270268 -126896 -13575 191941 170618
11310A70618b3169l54199h7890m3062J9721J4306B34091g4678D0518a76172h332
$$ 170618 -23169 -377368 -87890 -130952 -111231 -96925 234091 -74678 40518 -176172 -8332
11298b95317B4865d04194B5735K6707a05878a4830A46874e12554i5983n0819M9041
$$ -295317 24865 -404194 25735 52442 -105878 -14830 146874 -512554 -95983 -146802 -97761
11287i7761A3909g8483A59308M1631a14731A67931b6484k48771a417B0269P0240
$$ -97761 13909 -78483 159308 200939 -114731 167931 -26484 -275255 -1417 20269 90509
11276I0509a97552A3966c7081j76487C2720a39797H0141a80560A61041c21645
$$ 90509 -197552 13966 -37081 -213568 32720 -139797 80141 -180560 161041 -321645
11265C18047a84031G4904b67184A50689a11793N5543B2586b13992D6527a40474
$$ 318047 -184031 74904 -267184 150689 -111793 -56250 22586 -213992 46527 -140474
11254A05106B7418J73580b71820L7520g0414p8732G8727R9141d44838J44516A12385
$$ 105106 27418 200998 -271820 -234300 -70414 -149146 78727 177868 -444838 -300322 112385
11242e0287A78939b9955a1266A8247d42952B04944b19394D86935a45875M4826
$$ -50287 178939 -29955 -11266 18247 -442952 204944 -219394 486935 -145875 -101049
11232a01049C4847b17495a01208q7146E6257k4449f180C7077a62381j60172n6869
$$ -101049 34847 -217495 -101208 -188354 56257 31808 -6180 37077 -162381 -322553 -379422
11221c79422A07720J7963N71b60353I3471c40042b4125q4906p3639g5253B04946
$$ -379422 107720 125683 126254 -260353 93471 -340042 -24125 -109031 -182670 -75253 204946
11209d0465j41550k26060A04867a16761c6296l07125E1213b10323G7907b05471
$$ -40465 -182015 -408075 104867 -116761 -36296 -343421 51213 -210323 77907 -205471
11198a59920j93323h5679f530r852l5088j0888p6597O1452a804j42349j8478G9506
$$ -159920 -353243 -85679 -6530 -16382 -51470 -62358 -138955 -77503 -1804 -144153 -162631 79506
11185A81751g9012M110A31050b33786i7406c5310F4120N0907l1482J35659f8023
$$ 181751 -79012 -74902 131050 -233786 -97406 -35310 64120 115027 83545 219204 -68023
11173B39590d0970q6119e9943r4761E0166a99437J619A80302a32531f4654B92293
$$ 239590 -40970 -127089 -59943 -154704 50166 -199437 -197818 180302 -132531 -64654 292293
11161a1976B50312d26258a29866b1453j34904m998A97101a5257B74357E9872a01032
$$ -11976 250312 -426258 -129866 -21453 -156357 -161355 197101 -15257 274357 59872 -101032
11149A71595a07031I3527a40688B31500c04891b198F5342j9506F595i7748r1822
$$ 171595 -107031 93527 -140688 231500 -304891 -2198 65342 45836 6595 -97748 -189570
11138a89570A10759J91706c4711k0250j24978A30914a33617A01473a37144M4218
$$ -189570 110759 302465 -34711 -54961 -179939 130914 -133617 101473 -137144 -92926
11128i2926O905p0791e2259A46818l9979F307h2964n6756d2851B47149i0616I9877
$$ -92926 -86021 -156812 -52259 146818 106839 6307 -82964 -139720 -42851 247149 -90616 99877
11115A56828d2201E2594J00061J48314a50552A26317J08587D711i5273A33780
$$ 156828 -42201 52594 152655 300969 -150552 126317 234904 4711 -95273 133780
11104A06235a1539B26427g6012K3142j52939B14386a29150j71853d1134j21487
$$ 106235 -11539 226427 -76012 -52870 -205809 214386 -129150 -301003 -41134 -162621
11094a62621A82595L5169a9810n8382D441a14321N1401k6139D33526A14679L19988
$$ -162621 182595 217764 -19810 -78192 4441 -114321 -62920 -89059 433526 114679 434667
11083D34667p8102o6853J64426a70297D75739A95759n8929E1381J35961R0502
$$ 434667 356565 289712 454138 -170297 475739 195759 136830 51381 187342 277844
11073B77844j37434J14326A04890Q6283p6026J31853N192p6605l0770B7557J92537
$$ 277844 140410 254736 104890 191173 115147 247000 252192 175587 144817 27557 220094
11062B20094a25817B86602m6284p3516l3542L21298j57099P2423p2747O0624j14521
$$ 220094 -125817 286602 240318 166802 133260 454558 297459 369882 297135 357759 243238
11051B43238L21733n308j66909J22352j32303m3890J31029j9693J73073J4604
$$ 243238 564971 559663 392754 515106 382803 338913 469942 450249 623322 637926
11041F37926B73339J8122J20294A77120J50210L6574H5166M31688j9414K31260
$$ 637926 273339 291461 411755 177120 327330 363904 85166 516854 497440 728700
11031G28700k71652J25112l0463k53505j8844L03222n7092M938J31809K7918Q2370
$$ 728700 457048 582160 551697 298192 279348 582570 525478 530416 662225 690143 772513
11020G72513C77347L6710K18638A40574K86909B12062N7748R0335e2937B25823
$$ 772513 377347 414057 632695 140574 427483 212062 269810 360145 -52937 225823
11009E03640A28725R8889L42386j35874O1683A54366J75262K14701B13500K79655
$$ 503640 128725 227614 570000 434126 495809 154366 329628 544329 213500 493155
10999D93155j82603N79782D14906E9365N61286k00113c035C54544J01336A30568
$$ 493155 310552 890334 414906 59365 620651 420538 -3035 354544 455880 130568
10988D06122P3969m3306m1571j45474n8270J54532J85886K63897j04995p4748
$$ 406122 480091 436785 395214 249740 191470 346002 531888 795785 690790 616042
10978F16042R3643j95434K21503j0239J54731K64780k40110N18207l93Q1727L15133
$$ 616042 709685 514251 735754 725515 880246 1145026 904916 1423123 1422730 1504457 1819590
10967A819590j49224o3659O45303l90389j10688l93293k36401K35598l53982J19406
$$ 1819590 1670366 1606707 2252010 1861621 1750933 1357640 1121239 1356837 1002855 1122261
10957A122261j90265o8899K73520L69997m86342j90413L40404j94434M60530n62234
$$ 1122261 931996 863097 1136617 1506614 1020272 829859 1170263 975829 1436359 874125
10947H74125N2472K15425m37104B79445N7738J7566A00796L21693b6547B46049
$$ 874125 926597 1142022 704918 279445 337183 354749 100796 422489 -26547 246049
10936F7351K4477M9779e1703j3104C8170M6502r310J5997N9417K35384e9540B34817
$$ 67351 91828 141607 -51703 -64807 38170 84672 75362 91359 150776 386160 -59540 234817
10923a63827E9857a94802N9765c0107D2447K1866j3761a04360j25790B28798a95634
$$ -163827 59857 -194802 -135037 -30107 42447 64313 50552 -104360 -230150 228798 -195634
10911A44827e4829B07112g8418B47180q6568a13177E4091L06662G1018b12747
$$ 144827 -54829 207112 -78418 247180 160612 -113177 54091 360753 71018 -212747
10900C03172A49957e2956o6563l38470F1208b62737d0699j857j21539A07549a49575
$$ 303172 149957 -52956 -119519 -457989 61208 -262737 -40699 -42556 -164095 107549 -149575
10888a99200N1476b648G0469B6986e2961B95009f088q9769k7963M5237C95875
$$ -199200 -147724 -2648 70469 26986 -52961 295009 -6088 -95857 -123820 -78583 395875
10876b34292C3228J20021B4210c4608D9541q780J01452C6958K48463b02005f2041
$$ -234292 33228 153249 24210 -34608 49541 40761 142213 36958 285421 -202005 -62041
10864b18468m498C00774a91995b4628j32983A20629d63686c9977B36485a94271
$$ -218468 -222966 300774 -191995 -24628 -157611 120629 -463686 -39977 236485 -194271
10853A27813a66769m6155B55314b32168I9584K75007A12592D8344a18188I4287
$$ 127813 -166769 -212924 255314 -232168 99584 374591 112592 48344 -118188 94287
10842G9237Q1413b45795E1979k561e8323j70909b7111n7801G1159D653g5122E9690
$$ 79237 160650 -245795 51979 49418 -58323 -229232 -27111 -84912 71159 4653 -75122 59690
10829a03499D7407a84547k9354A38420K2530o8054J57905a18902E6391k1915a31277
$$ -103499 47407 -184547 -213901 138420 160950 92896 250801 -118902 56391 34476 -131277
10817b12804E06293b15372A63120b18174A49059m8846b26423m5207d894C8799
$$ -212804 506293 -215372 163120 -218174 149059 100213 -226423 -271630 -4894 38799
10806B63784h1545o3413H7890d37643E8729J087i8400A66390J78712j67869Q7097
$$ 263784 -81545 -144958 87890 -437643 58729 59816 -98400 166390 345102 177233 264330
10795B64330l3417E3477M3689a65250m555P4326j09543f1246B95986b17218L8105
$$ 264330 230913 53477 97166 -165250 -169805 -95479 -205022 -61246 295986 -217218 -179113
10784a79113l7107B0239c59880d0791j9335c00k29016B01497i6971B15660a55063
$$ -179113 -216220 20239 -359880 -40791 -60126 -300 -229316 201497 -96971 215660 -155063
10772A40037B8907J42187J32014m6478b94589h1010K5958m5611n6040b9256n9141
$$ 140037 28907 171094 303108 256630 -294589 -81010 -55052 -100663 -156703 -29256 -88397
10761h8397q495O925F0927d577B7694a60417a756C24335r2026k7084e7860A07227
$$ -88397 -96892 -89967 60927 -4577 27694 -160417 -1756 324335 232309 205225 -57860 107227
10748d91733B09973c49535a42682A26750J9429b90126b9912r1704c7400A48364
$$ -491733 209973 -349535 -142682 126750 146179 -290126 -29912 -121616 -37400 148364
10737h7378o7722e2012E279J36335m6800a15346l8921d5707k33107J0712K5692
$$ -87378 -155100 -52012 5279 141614 94814 -115346 -154267 -45707 -278814 -268102 -242410
10726b42410B8135f7213A16990J8572j0801j8029f1122l0883M0345K1017l17984
$$ -242410 28135 -67213 116990 135562 124761 106732 -61122 -92005 -51660 -30643 -348627
10715c48627J31332i2173A98921n0066k7144a26923r3093p8373J12220j28664
$$ -348627 -217295 -92173 198921 148855 121711 -126923 -220016 -298389 -186169 -314833
10705c14833j00694A30363b87325f0267J9847J5490r0553A28434c50367a19835
$$ -314833 -415527 130363 -287325 -60267 -40420 -24930 -115483 128434 -350367 -119835
10694E8307K93340b36987H8878b9877k00699f8590H8894a18704A04597m7394a94518
$$ 58307 351647 -236987 88878 -29877 -230576 -68590 88894 -118704 104597 57203 -194518
10682f0118E664a8945k1977r2725m6152Q2491k34154A10828g3004p1172M3864
$$ -60118 5664 -18945 -40922 -133647 -179799 -97308 -331462 110828 -73004 -144176 -100312
10671a00312m6628b4813l05081J57274F6591a09370j72471J34994B85458a05841
$$ -100312 -146940 -24813 -329894 -172620 66591 -109370 -281841 -146847 285458 -105841
10660b35038R5885q4157A85328J12857I0983A8422N4909B4002a09458k5100M3459
$$ -235038 -139153 -223310 185328 298185 90983 18422 73331 24002 -109458 -134558 -91099
10649i1099A43241m3588B2669e9597p4563q6895A05644B1662P5842A1999b9846
$$ -91099 143241 99653 22669 -59597 -134160 -221055 105644 21662 97504 11999 -29846
10637C7320a69773m6784A85068a56787G0456a64446k04304H3525G523b20833b5685
$$ 37320 -169773 -216557 185068 -156787 70456 -164446 -368750 83525 7523 -220833 -25685
10625a34076B88712a39950k58376J46319b4190r5721r8562e1003A95672L6121
$$ -134076 288712 -139950 -398326 -252007 -24190 -119911 -218473 -51003 195672 231793
10615B31793E2712a70416h3027p5831a5383A0601J52657F4212B911J5339d33146
$$ 231793 52712 -170416 -83027 -158858 -15383 10601 163258 64212 2911 18250 -433146
10603g2942A97047C942d26564A47763c7204m094B10421c14837h0420j10688H0445
$$ -72942 197047 3942 -426564 147763 -37204 -41298 210421 -314837 -80420 -191108 80445
10591a47396j00125c3314j96378B23829b6969m2861j8966D22130A7911b02435
$$ -147396 -247521 -33314 -229692 223829 -26969 -69830 -88796 422130 17911 -202435
10580d5857k71144j48629J41320e4874j17013o2346N867j17677A17574e71807
$$ -45857 -317001 -465630 -324310 -54874 -171887 -234233 -228366 -346043 117574 -571807
10569C0620i1826A54126l1563E4611b19728A11131J52107h8435A1417a70288j72239
$$ 30620 -91826 154126 122563 54611 -219728 111131 263238 -88435 11417 -170288 -342527
10558c42527D8773L13825a61435j43785J05667h7222A3112J2053P4551M1956a06436
$$ -342527 48773 362598 -161435 -305220 -199553 -87222 13112 25165 99716 141672 -106436
10546B08393h8316K6561C31540c2271J083o7561r5021B8556a60976B18521p8008
$$ 208393 -88316 -61755 331540 -32271 -31188 -98749 -193770 28556 -160976 218521 140513
10535A40513b2482m38066C5661a74789q5282A05155b61913A42448k6836B8634
$$ 140513 -22482 -460548 35661 -174789 -260071 105155 -261913 142448 115612 28634
10524FP07e9678A25997b29128D5427b38600b9678A6842J63785F5664e46368A73044
$$ 6 713 -59678 125997 -229128 45427 -238600 -29678 16842 180627 65664 -546368 173044
10511e6517A87593a76178b2473f630k01872M1614j01733C05721j11378a9428B68101
$$ -56517 187593 -176178 -22473 -6630 -208502 -166888 -268621 305721 194343 -19428 268101
10499b54419e1777A03260J37211m0870p5188J43249E2788J94648i5031j00210
$$ -254419 -51777 103260 240471 199601 124413 267662 52788 247436 -95031 -195241
10489a95241R6628b1685O955j24018A486K21542a28020E0087a37117B81224G0982
$$ -195241 -98613 -21685 -14730 -138748 1486 223028 -128020 50087 -137117 281224 70982
10477C43945n9726p9058K6825J94645r8592a27541B26593I9685a44439e0359J7766
$$ 343945 284219 205161 231986 426631 328039 -127541 226593 99685 -144439 -50359 -32593
10466c2593A51394C2052h6451a8133A03755d842B11128b76627b2390B1112a66572
$$ -32593 151394 32052 -86451 -18133 103755 -4842 211128 -276627 -22390 21112 -166572
10454a14480j0601b408j80191B44117B1088P5894c4081A47786a28104j55774e9620
$$ -114480 -125081 -2408 -182599 244117 21088 96982 -34081 147786 -128104 -283878 -59620
10442a64768j30698e6401C44240j13162a49668f0786k24268J39801A2016J35006
$$ -164768 -295466 -56401 344240 231078 -149668 -60786 -285054 -145253 12016 147022
10432A47022J5620G9024j8329J25552c0380G7476C4654a34898J4937J8749H4054
$$ 147022 162642 79024 60695 186247 -30380 77476 34654 -134898 -119961 -101212 84054
10420h9818j4231j26891g6749j96361m4896g2222A41532g8789f78B87314m9911
$$ -89818 -104049 -230940 -76749 -273110 -318006 -72222 141532 -78789 -678 287314 237403
10409B37403a81212E42321b91268E7726b01388K9550d9471j9991A48925a22357
$$ 237403 -181212 542321 -291268 57726 -201388 -171838 -49471 -69462 148925 -122357
10398a67278B92145F0495a56955A59383N770J88501c39295G7326l3828b52592
$$ -167278 292145 60495 -156955 159383 165153 353654 -339295 77326 43498 -252592
10387A71503D978N0668c2550B92893O2752a8746D1998f1313j61219e7659I3590
$$ 171503 4978 55646 -32550 292893 355645 -18746 41998 -61313 -222532 -57659 93590
10375H1544g2797D26333a9508B23450P3010j03176K37384I7599B8243d9034B3090
$$ 81544 -72797 426333 -19508 223450 296460 193284 430668 97599 28243 -49034 23090
10363a00451B61220q65n6478J37053A2615J04250g7233B3278b44360B91696c35990
$$ -100451 261220 260355 203877 340930 12615 116865 -77233 23278 -244360 291696 -335990
10351A90124j1253J6094p729L5463L22914A37439K6331J58783A15245L9518J11087
$$ 190124 178871 194965 187236 222699 545613 137439 163770 322553 115245 154763 265850
10340B65850r9074k9913J96909n2026b9519A3433K54684H9641l01a63618l7672
$$ 265850 166776 136863 333772 281746 -29519 13433 268117 89641 89340 -163618 -201290
10329b01290j82157C91947A78662a79477A74189k4699L1624n0271m5151J09814
$$ -201290 -383447 391947 178662 -179477 174189 149490 181114 130843 85692 195506
10319A95506A5124h6719b9422l799E9852A4392a04057B2690b01540A71849H2812
$$ 195506 15124 -86719 -29422 -33221 59852 14392 -104057 22690 -201540 171849 82812
10307b61584f5758B6477J38761i4091B95637a20800K2227E9776d57195a42056
$$ -261584 -65758 26477 165238 -94091 295637 -120800 -98573 59776 -457195 -142056
10296A35283A1756a28247A56042l1802B4595c0428k05004G6290a33229E2470b56927
$$ 135283 11756 -128247 156042 124240 24595 -30428 -235432 76290 -133229 52470 -256927
10284A92540a60666j12057h8579J5981r088j95317A35562c26398R2106B69383
$$ 192540 -160666 -272723 -88579 -72598 -81686 -277003 135562 -326398 -234292 269383
10273a8180n5479D2232a03814A07378a85217C3571n834a2188K418A48831j1181
$$ -18180 -73659 42232 -103814 107378 -185217 33571 27737 -12188 -9770 148831 137650
10262A37650n1996c8137k27261i6387o7890J6644G8824C521L61092F8901Q6410
$$ 137650 85654 -38137 -265398 -96387 -164277 -147633 78824 3521 364613 68901 155311
10251A55311a80552A36803L3051b74796c9883A05262a64161E3901i6226j59863
$$ 155311 -180552 136803 169854 -274796 -39883 105262 -164161 53901 -96226 -256089
10241b56089L8708K3585O8939K4247I4438n531a37166J5379A14731b53247M6589
$$ -256089 -217381 -193796 -124857 -100610 94438 88907 -137166 -121787 114731 -253247 -206658
10230b06658b8255I8606J71539l6618a42749B4641b48833B8352J49679a04466
$$ -206658 -28255 98606 270145 233527 -142749 24641 -248833 28352 178031 -104466
10219B12700l007e9076f960B60807O2635a70333A79287a23652C6186b65032A95226
$$ 212700 209693 -59076 -6960 260807 323442 -170333 179287 -123652 36186 -265032 195226
10207i6687k65823a35205A72541a39384B17327f4671A82633f569j4631H0352N0927
$$ -96687 -362510 -135205 172541 -139384 217327 -64671 182633 -6569 -21200 80352 131279
10196A31279R9474A12087a35117L8771R17l31301J89911A60782p055c65310a72078
$$ 131279 230753 112087 -135117 -96346 -95429 -426730 -236819 160782 153727 -365310 -172078
10184b02216j37981J51054A30697e2256G5707B2289a16158A55571l9018a09744
$$ -202216 -340197 -189143 130697 -52256 75707 22289 -116158 155571 116553 -109744
10173g8189r3027F0284a82973A33544j4596a81295B9975g896r0571B7433e4817
$$ -78189 -171216 60284 -182973 133544 118948 -181295 29975 -7896 -98467 27433 -54817
10161D38559b87570B18713a97452M766b7754A3411J01684f1407k58222Q3388B33287
$$ 438559 -287570 218713 -197452 -192686 -27754 13411 115095 -61407 -319629 -236241 233287
10149a16156A59174R9186b54529g3377g840p1552l5228A87503e3100B25144R5836
$$ -116156 159174 258360 -254529 -73377 -7840 -79392 -114620 187503 -53100 225144 320980
10138C20980e0580I1684a8887h560B73565c5545r0897q5240R2548C8261P7868
$$ 320980 -50580 91684 -18887 -8560 273565 -35545 -126442 -211682 -119134 38261 116129
10127A16129K7086J82098a01578M8162j93175l3566a05213E8159F69h7264j7301
$$ 116129 143215 325313 -101578 -53416 -246591 -280157 -105213 58159 669 -87264 -104565
10116a04565j01310b3204j01378e667k56040M7007C92333c2288m7492k29676J50390
$$ -104565 -205875 -23204 -124582 -5667 -261707 -214700 392333 -32288 -79780 -309456 -159066
10105a59066p5918A82006q7430c69333a19858b1321k35255h0353j3827j23849
$$ -159066 -234984 182006 94576 -369333 -119858 -21321 -256576 -80353 -94180 -218029
10095b18029b4119j06844o3768K9197N6861j79213B12762g4337l7417j19420D4145
$$ -218029 -24119 -130963 -194731 -165534 -108673 -287886 212762 -74337 -111754 -231174 44145
10083D7466g5482q6370D7628j2457a83675F5721b35808d5052D451J06733b33865
$$ 47466 -75482 -161852 47628 35171 -183675 65721 -235808 -45052 4451 111184 -233865
10071b10068a4062n9895A16577a62095m6975A42892a16976Q358A20726c70288
$$ -210068 -14062 -73957 116577 -162095 -209070 142892 -116976 -108618 120726 -370288
10060A10272b97144a26035f740l1591B5466K48378A00210J50669d9789k46233
$$ 110272 -297144 -126035 -6740 -38331 25466 273844 100210 250879 -49789 -296022
10050b96022H6299K22108a18877k44777d921j90257o3308A14492b91504J18410
$$ -296022 86299 308407 -118877 -363654 -4921 -195178 -258486 114492 -291504 -173094
10040a73094g3437I5727O4021A852a59488A86758H8998f2653j16091r9047B631
$$ -173094 -73437 95727 159748 1852 -159488 186758 88998 -62653 -178744 -277791 2631
10028B38775B8896b76684d4964j44951a9347C47985a27704a0909k9724j8479I2245
$$ 238775 28896 -276684 -44964 -189915 -19347 347985 -127704 -10909 -40633 -59112 92245
10016E9596a98716d240r1398A33496J6257b50033O9217g0505D7277b76744J36111
$$ 59596 -198716 -4240 -95638 133496 149753 -250033 -180816 -70505 47277 -276744 -140633
10005a40633n62a1669j81384A24983J1591a07553I53b50576A44676a65045h2466
$$ -140633 -141195 -11669 -193053 124983 136574 -107553 953 -250576 144676 -165045 -82466
9993E6775F044d7405j06060l3219d3814p866m1495A21976c6128D2353a66117G1891
$$ 56775 6044 -47405 -153465 -186684 -43814 -51680 -93175 121976 -36128 42353 -166117 71891
9980A09084i6928M7340j31471j45205O7478a23721M5148j65724f6256k20238J24672
$$ 109084 -96928 -49588 -181059 -326264 -258786 -123721 -78573 -244297 -66256 -286494 -161822
9969a61822O0758A05315C7038R0017a15727C5009J56784j0774F5476P3826J94031
$$ -161822 -101064 105315 37038 127055 -115727 35009 191793 181019 65476 139302 333333
9958C33333a0616k05286D3083J555a48040G0764a47992k14065J52142g9197p3871
$$ 333333 -10616 -215902 43083 44638 -148040 70764 -147992 -362057 -209915 -79197 -153068
9947a53068k28130a40610o0183A44277b16480N1579O7719q2942e638k79054l8724
$$ -153068 -381198 -140610 -200793 144277 -216480 -164901 -97182 -180124 -5638 -284692 -323416
9936c23416o6879a85377A48085d0938H1900J67281A0328g124j65758B827Q1781
$$ -323416 -390295 -185377 148085 -40938 81900 249181 10328 -7124 -172882 2827 84608
9925H4608i4107E857b93036A8501L0449J55666a00713l72503f2195k03868a09707
$$ 84608 -94107 5857 -293036 18501 48950 204616 -100713 -473216 -62195 -266063 -109707
9913G5994g3452m297Q238n0753E9114a38737M8807A09038B7694J23332F6484B3215
$$ 75994 -73452 -77749 -69511 -120264 59114 -138737 -89930 109038 27694 151026 66484 23215
9900d1065H019J74340f3530H4260M6894F4325b91568f2330A47690M9043a68944
$$ -41065 8019 182359 -63530 84260 131154 64325 -291568 -62330 147690 196733 -168944
9888h73B60065a86421H0688B6706J8453K8276a69391I3825c34930H7786h2142
$$ -873 260065 -186421 80688 26706 45159 73435 -169391 93825 -334930 87786 -82142
9876A77632K37339j56479F5279a81106l362F0551a55269A91731E1903M7988a5106
$$ 177632 414971 258492 65279 -181106 -184468 60551 -155269 191731 51903 99891 -15106
9864a81915B13576b17945c4649A51572a61261l2927e3602B19387a43324H6980
$$ -181915 213576 -217945 -34649 151572 -161261 -194188 -53602 219387 -143324 86980
9853c49153P9293g7284k55925B3633c15982G6545M4314b05334i7535j27831b7363
$$ -349153 -269860 -77284 -333209 23633 -315982 76545 120859 -205334 -97535 -225366 -27363
9841c28160c3854n0760j00174a0901r1540m776j62224p0056a68D7998H965a18825
$$ -328160 -33854 -84614 -184788 -10901 -102441 -107217 -269441 -339497 -168 47998 8965 -118825
9828c897j22398a730l20209A96602o8001e9069K8617k1854P861k8883j06316j3734
$$ -3897 -126295 -1730 -321939 196602 128601 -59069 -30452 -52306 -44445 -73328 -179644 -193378
9816a93378c7438l5475J4561m9539A75585J40168f1171B2748b42198a4979j0606
$$ -193378 -37438 -72913 -58352 -107891 175585 315753 -61171 22748 -242198 -14979 -25585
9805b5585l1165G3403i4958f202p2077R410k00138N5247B90602c02575I956a69415
$$ -25585 -56750 73403 -94958 -6202 -78279 -68869 -269007 -213760 290602 -302575 9956 -169415
9792A39598a52785A51777b77440Q6979E2685K57113B4638a91139D0753c55425
$$ 139598 -152785 151777 -277440 -190461 52685 309798 24638 -191139 40753 -355425
9781c1433o9530C3814a62977b2599A01837c3829k50177A64758d6659J8184j9580
$$ -31433 -100963 33814 -162977 -22599 101837 -33829 -284006 164758 -46659 -28475 -48055
9770d8055o2678k973L125A23977l3000L1717a51161a1069l2822G4126a75780L3357
$$ -48055 -110733 -113706 -110581 123977 90977 122694 -151161 -11069 -43891 74126 -175780 -142423
9758a42423G2070c71833J74900g3845j7527k9353j7775M6804k2654k6266A22065
$$ -142423 72070 -371833 -196933 -73845 -91372 -120725 -138500 -91696 -114350 -140616 122065
9746B47704E4273c1222j42875I4744l6101a72765I1950a36425B51471c0534J3283
$$ 247704 54273 -31222 -174097 94744 58643 -172765 91950 -136425 251471 -30534 -17251
9735a7251B8508a27987j69197o0963A17742e585B1498L584a46308O0233A65135
$$ -17251 28508 -127987 -297184 -358147 117742 -5585 21498 25082 -146308 -86075 165135
9723E4159J5416C1622a05711j69925N8933D76194B14615a16874j35612B27822
$$ 54159 69575 31622 -105711 -275636 -216703 476194 214615 -116874 -252486 227822
9712c09422A19250n0443f5565j35153C1618K98975A63937K8580c14174e1710m1885
$$ -309422 119250 68807 -65565 -200718 31618 330593 163937 192517 -314174 -51710 -93595
9701i3595j18930J3172J3828A12055b21603C02864j27189a10355J1448q8578q8865
$$ -93595 -212525 -199353 -185525 112055 -221603 302864 175675 -110355 -98907 -187485 -276350
9690b76350e6042d934l21230N8603B48875d8303m39082b32407P7515n7817R4818
$$ -276350 -56042 -4934 -326164 -267561 248875 -48303 -487385 -232407 -154892 -212709 -117891
9679a17891e4193j49560h0648A78342a30425m9113A14575A8886J3788R9495B7981
$$ -117891 -54193 -203753 -80648 178342 -130425 -179538 114575 18886 32674 132169 27981
9667a84086o6590d0701I5435M6794f1626b487G8615l5932a43280o2756B08591
$$ -184086 -250676 -40701 95435 142229 -61626 -2487 78615 42683 -143280 -206036 208591
9655c9905A27132a68656l0678l322C11700H7203K18549E9485b84094g7865r9143
$$ -39905 127132 -168656 -199334 -202656 311700 87203 305752 59485 -284094 -77865 -177008
9644a77008J2204a8646E8g1604B6045h9264A24400b83141A19776C3648b75445
$$ -177008 -164804 -18646 58 -71604 26045 -89264 124400 -283141 119776 33648 -275445
9632a61547B2396c27039a9487C3628f5212K7078A74218n8531l7498J6144a48149
$$ -161547 22396 -327039 -19487 33628 -65212 -38134 174218 115687 78189 94333 -148149
9620D1775a44358j0107A29394a09475r8237A45608a53590D8369b44236A07630
$$ 41775 -144358 -154465 129394 -109475 -207712 145608 -153590 48369 -244236 107630
9609A77576q7619b81853h2877n2291l1416j46596R2281A49208a09027M9287k9006
$$ 177576 89957 -281853 -82877 -135168 -166584 -313180 -220899 149208 -109027 -59740 -88746
9598h8746A66323l9022J4784a4649A93440o9173a09560H4410J02739J45219A4464
$$ -88746 166323 127301 142085 -14649 193440 124267 -109560 84410 187149 332368 14464
9586C02550a01652A85985a1786G597K28809a13913n3792Q771A03943C6883b8970
$$ 302550 -101652 185985 -11786 7597 236406 -113913 -167705 -158934 103943 36883 -28970
9574A51176D3891b51397c3227k54489R2791b5554j14639e6651A22525b99061P2182
$$ 151176 43891 -251397 -33227 -287716 -194925 -25554 -140193 -56651 122525 -299061 -226879
9563b26879K7489I9625D0191d2733j57733A39288Q6369b52583c3208A37983d30018
$$ -226879 -199390 99625 40191 -42733 -200466 139288 225657 -252583 -33208 137983 -430018
9551c4152l31844a16787o9516o5508J15135d8560A70213a37836C7829b5625c190
$$ -34152 -365996 -116787 -186303 -251811 -136676 -48560 170213 -137836 37829 -25625 -3190
9539b88740J32329d258G0178a51262E5093g8233j36446B06699c09668C9741b35417
$$ -288740 -156411 -4258 70178 -151262 55093 -78233 -214679 206699 -309668 39741 -235417
9527a42793A10089f6354k49913g8710E2281a56304d6695n4483m1438B61575A1166
$$ -142793 110089 -66354 -316267 -78710 52281 -156304 -46695 -101178 -142616 261575 11166
9515d1171C3624j5863L2430N0365b08993e4427o2028A83797J0629a20480e322
$$ -41171 33624 17761 50191 100556 -208993 -54427 -116455 183797 194426 -120480 -5322
9503b05022A92859b64174n5679A87267E7097a47284j68606a07610B08257e4800
$$ -205022 192859 -264174 -319853 187267 57097 -147284 -315890 -107610 208257 -54800
9492g3186k65697B30156A6842a87833o0115L6924l4279B12498a50648F0740b75594
$$ -73186 -338883 230156 16842 -187833 -247948 -211024 -245303 212498 -150648 60740 -275594
9480I5239i108d410l69283J67118d5960F2741a72952b3433l76887A8478g9697
$$ 95239 -9108 -4410 -373693 -206575 -45960 62741 -172952 -23433 -400320 18478 -79697
9468a46593M9046d7300A33209J9552a78059K765C7308P1900g8378j36009N6479
$$ -146593 -97547 -47300 133209 152761 -178059 -175294 37308 109208 -78378 -214387 -157908
9457a57908q4242e5703j47743I6699c14371J5229i2970j15622J2226j44029J08941
$$ -157908 -242150 -55703 -203446 96699 -314371 -299142 -92970 -208592 -196366 -340395 -231454
9446b31454h8084A0982K64498C5456g3059J4865A74756F9120i1443l20732a87963
$$ -231454 -88084 10982 275480 35456 -73059 -58194 174756 69120 -91443 -412175 -187963
9434a18372g631l9349A70160A4337a10013N157k7633a9723k9841B2235b71784
$$ -118372 -7631 -46980 170160 14337 -110013 -104856 -132489 -19723 -49564 22235 -271784
9422a28872K2722C10633b75325K3867R6474n1114d4973k00658I6144a42048A6273
$$ -128872 -106150 310633 -275325 -251458 -154984 -206098 -44973 -245631 96144 -142048 16273
9410D27973b04996B02912a3624j73111e2909j72461M5987O1863k86439h8643A48790
$$ 427973 -204996 202912 -13624 -186735 -52909 -225370 -179383 -117520 -403959 -88643 148790
9398A25591g1972b1998p1784j26779B08370l0120a3999q6262p0610a0495j33499
$$ 125591 -71972 -21998 -93782 -220561 208370 178250 -13999 -100261 -170871 -10495 -143994
9387a43994a0702l49762A17562P8232i6625j7527b6891k09587a2873F1249a73423
$$ -143994 -10702 -360464 117562 195794 -96625 -114152 -26891 -236478 -12873 61249 -173423
9375A78292e48743a95047n5280C7810d10108a29142C784b3999d370j72375j0561
$$ 178292 -548743 -195047 -250327 37810 -410108 -129142 3784 -23999 -4370 -176745 -187306
9364a87306B19467a09330d4788a7986A15190J95784h9644j14876J7365d4609K0901
$$ -187306 219467 -109330 -44788 -17986 115190 310974 -89644 -204520 -187155 -44609 -23708
9353b3708j21495B1739b71237d1249B65833j818A23015Q7002c0094k36722a03495
$$ -23708 -145203 21739 -271237 -41249 265833 264015 123015 210017 -30094 -266816 -103495
9341A59472f1629B14754L7935b15222M1053B6716f3614B3138b9328r6978N2939
$$ 159472 -61629 214754 252689 -215222 -174169 26716 -63614 23138 -29328 -126306 -73367
9330g3367A11760P899a14146H403c04204g6666p5108m0124m5754Q0434A51898
$$ -73367 111760 119659 -114146 8403 -304204 -76666 -151774 -191898 -237652 -157218 151898
9318g0918l57848a44799j6276A20329a88505C4919K6406a0190j30392R074A63531
$$ -70918 -428766 -144799 -161075 120329 -188505 34919 61325 -10190 -140582 -131508 163531
9306f5813A96535i0268G8898i543q4267A29342K915b35454A14859j1595b7617
$$ -65813 196535 -90268 78898 -9543 -93810 129342 132257 -235454 114859 103264 -27617
9294H9754b45423A7516b5816r0207A08722a2756B6219b2412j43619C32310b98878
$$ 89754 -245423 17516 -25816 -116023 108722 -12756 26219 -22412 -166031 332310 -298878
9282a13170l1746n43j79733a51327A71811a06210j66744B81141b53322j4048D463
$$ -113170 -144916 -145459 -325192 -151327 171811 -106210 -272954 281141 -253322 -267370 4463
9270c4023q2656A38134a04770l90713F5151A2873a36699m1499B3032J36915a02946
$$ -34023 -116679 138134 -104770 -495483 65151 12873 -136699 -178198 23032 159947 -102946
9258A33975A1319a08483l5984k9619F948i2800E0682a86589E3114a38958j39438
$$ 133975 11319 -108483 -144467 -174086 6948 -92800 50682 -186589 53114 -138958 -278396
9247b78396Q8842C8842b53183A08464a20676d4195A33221a5893l88205a2187j79979
$$ -278396 -189554 38842 -253183 108464 -120676 -44195 133221 -15893 -404098 -12187 -192166
9236a92166c4098A63596g8784K9283A26906a01863q0920A53616c7517A48998Q1428
$$ -192166 -34098 163596 -78784 -49501 126906 -101863 -182783 153616 -37517 148998 230426
9225B30426c24938N7291f2946r3794E8797h3756c0392k51156G5590D654a28976
$$ 230426 -324938 -267647 -62946 -156740 58797 -83756 -30392 -281548 75590 4654 -128976
9213D6091a43625j38450i5048G4410f0635j14178E4491K2219K799l2856b5967
$$ 46091 -143625 -282075 -95048 74410 -60635 -174813 54491 76710 79509 46653 -25967
9201B28637F4546a67724j0270A24254A6379a66437q037C9621d15842a36075c3562
$$ 228637 64546 -167724 -177994 124254 16379 -166437 -174474 39621 -415842 -136075 -33562
9189i4951k18374f9285D2366J91323g200A96347a25531k25425b1203A04112i2938
$$ -94951 -313325 -69285 42366 233689 -7200 196347 -125531 -350956 -21203 104112 -92938
9177e5090I3759b94612A3494b27330B28041l8873a74908M426d7072H2259j8803
$$ -55090 93759 -294612 13494 -227330 228041 189168 -174908 -170482 -47072 82259 63456
9166F3456K48134e4005E1735b50430N8554h4888c8446A33847M599b33522A30108
$$ 63456 311590 -54005 51735 -250430 -191876 -84888 -38446 133847 138446 -233522 130108
9154e8523j31669K6406O1175l2720L7846c55p9881d102p79n6537h229A18652D2153
$$ -58523 -190192 -163786 -102611 -135331 -97485 -355 -80236 -4102 -4881 -61418 -8229 118652 42153
9140A84821q5129a34378k6093A07376b70826J00484K0115J5834j18773N0182g9725
$$ 184821 99692 -134378 -160471 107376 -270826 -170342 -150227 -134393 -253166 -202984 -79725
9128b5605k29374a26058b5480B58260m5207A9400d2615B11654B6869K84957j36910
$$ -25605 -254979 -126058 -25480 258260 213053 19400 -42615 211654 26869 311826 174916
9117A74916p3401C3549a43843j71924A42259J44376P6052j00798M16B8492J77423
$$ 174916 101515 33549 -143843 -315767 142259 286635 362687 261889 262305 28492 205915
9106B05915a07249A48368b46930d1115j02465B07363b97592A17703a80257B7910
$$ 205915 -107249 148368 -246930 -41115 -143580 207363 -297592 117703 -180257 27910
9095a54952B00220G1068R0335i5999r0135j49618F1885a21052j43439D914a1554
$$ -154952 200220 71068 161403 -95999 -186134 -335752 61885 -121052 -264491 4914 -11554
9083H631c7313A44303d30948H398a47583N0923J5603c3711B51516b67670l5572
$$ 8631 -37313 144303 -430948 8398 -147583 -96660 -81057 -33711 251516 -267670 -303242
9072c03242g6191n3022j93577h4181j28236k41269H2384L6133b41105B8003L25555
$$ -303242 -76191 -129213 -322790 -84181 -212417 -453686 82384 118517 -241105 28003 353558
9061C53558I795M6838a78470O646D2532a19733F1132b09852k9004C0841K02900
$$ 353558 9795 56633 -178470 -171824 42532 -119733 61132 -209852 -238856 30841 233741
9050B33741g0084B65545h9271o0033A2018J30218J35472B5548c62020J79818P6109
$$ 233741 -70084 265545 -89271 -149304 12018 142236 277708 25548 -362020 -182202 -106093
9039a06093j21581E251c62836e558m194m13324K04625F7227f0927j58790O9299
$$ -106093 -227674 5251 -362836 -5558 -9752 -423076 -218451 67227 -60927 -219717 -150418
9028a50418d4074N81I9651a13232l7981f725j7455E7756R1658a75274J7803j43926
$$ -150418 -44074 -43493 99651 -113232 -151213 -6725 -24180 57756 149414 -175274 -157471 -301397
9016c01397a12294e1528k23932E7883c1004A01595a40881L4628r842a7265j4079
$$ -301397 -112294 -51528 -275460 57883 -31004 101595 -140881 -106253 -116095 -17265 -31344
9005c1344l5131j50826d2007k64198I59a46011A54079b83455G8930b09262g0896
$$ -31344 -66475 -217301 -42007 -306205 959 -146011 154079 -283455 78930 -209262 -70896
8993h3732j73532R5548C9845L9877J2610h9571B05422b56745N8788h2889A30145
$$ -83732 -257264 -161716 39845 79722 92332 -89571 205422 -256745 -197957 -82889 130145
8981c4437p5465p3911n7686j7722J3967C1785b13393f9776k29980L3520a26011
$$ -34437 -109902 -183813 -241499 -259221 -245254 31785 -213393 -69776 -299756 -266236 -126011
8969a18665j41274R4008j82129A6253b77469A02640a08564j5892m7891i654A93512
$$ -118665 -259939 -165931 -348060 16253 -277469 102640 -108564 -124456 -172347 -9654 193512
8957a49101j86497I8810a34235e6455j06662L2411K4432F8523b48888J275B85525
$$ -149101 -335598 98810 -134235 -56455 -163117 -130706 -106274 68523 -248888 -247613 285525
8945d2063n2528k3934d9601A48882a07365j23801K9350j35635H9116a98939N3889
$$ -42063 -94591 -118525 -49601 148882 -107365 -231166 -201816 -337451 89116 -198939 -145050
8934a45050A52599b31360m43B50988f1846A37605a82603A04547K7381J6829o2101
$$ -145050 152599 -231360 -231803 250988 -61846 137605 -182603 104547 131928 148757 86656
8923H6656P194g6714k6564C38140K6366O82464B47204j21513C8760b64367J14547
$$ 86656 93850 -76714 -103278 338140 364506 1046970 247204 125691 38760 -264367 -149820
8912a49820A31897l1615b54475M0058G1365C0775J71179e8361C3357a70533A9940
$$ -149820 131897 100282 -254475 -214417 71365 30775 201954 -58361 33357 -170533 19940
8900B11253b03667L4498j12547i7641R267q2538j05864C1752d2730m64193D9060
$$ 211253 -203667 -169169 -281716 -97641 -88374 -170912 -276776 31752 -42730 -506923 49060
8888d6139n05265A8087h5863j609G0377f661r1292P918j55982A30804a97266n5575
$$ -46139 -551404 18087 -85863 -87472 70377 -6661 -97953 -90035 -246017 130804 -197266 -252841
8876b52841C2609g3819q9104A48731a22737c959k15231i1777j69709H290d6242
$$ -252841 32609 -73819 -162923 148731 -122737 -3959 -219190 -91777 -261486 8290 -46242
8864A52640J8822B1666c8802B018a35523B28776A8616a63002j61881D1475R6896
$$ 152640 171462 21666 -38802 2018 -135523 228776 18616 -163002 -324883 41475 138371
8853A38371c15371I4090j3456b81274e612k4920I9924M91539b45117f4412A45933
$$ 138371 -315371 94090 80634 -281274 -5612 -30532 99924 591463 -245117 -64412 145933
$$ [...]
##END NTUPLES=NMR SPECTRUM
##END=
