##TITLE=NES1005_872015076_9232744_htFKc47TFp
##JCAMPDX= 6.0         $$ Bruker NMR JCAMP-DX V2.0
##DATA TYPE= NMR SPECTRUM
##DATA CLASS= NTUPLES
##ORIGIN= BRUKER
##OWNER= Administrator
$$ 1.72 TOPSPIN		Version 2.1
$$ 2015-07-02 04:16:56.664 -0700  Administrator@X
$$ Compression mode = diff/dup
##.OBSERVE FREQUENCY= 400.02188249412
##.OBSERVE NUCLEUS= ^1H
##.ACQUISITION MODE= SIMULTANEOUS (DQD)
##.ACQUISITION SCHEME= undefined
##.AVERAGES= 64
##.DIGITISER RES= 22
##SPECTROMETER/DATA SYSTEM= spect
##.PULSE SEQUENCE= noesygpps1d.comp
##.SOLVENT NAME= COFFEE_meoh
##.SHIFT REFERENCE= INTERNAL, COFFEE_meoh, 1, 14.963
##AUDIT TRAIL= $$ (NUMBER, WHEN, WHO, WHERE, PROCESS, VERSION, WHAT)
$$ ##TITLE= Audit trail, TOPSPIN		Version 2.1
$$ ##JCAMPDX= 5.01
$$ ##ORIGIN= Bruker BioSpin GmbH
$$ ##OWNER= Administrator
$$ $$ E:\/data/COFFEE/nmr/NES1005_872015076_9232744_htFKc47TFp/22/pdata/1/auditp.txt
$$ ##AUDIT TRAIL=  $$ (NUMBER, WHEN, WHO, WHERE, PROCESS, VERSION, WHAT)
(   1,<2015-07-02 04:16:51.180 -0700>,<Administrator>,<X>,<go>,<TOPSPIN 2.1>,
      <created by zg
	started at 2015-07-02 04:05:21.789 -0700,
	POWCHK enabled, PULCHK disabled,
       configuration hash MD5:
       21 0F 79 D6 B3 7B B4 F6 88 20 88 DB 03 48 BD 9F
       data hash MD5: 64K
       05 CB 6B 11 F5 A0 17 C9 9F 7A 7B A0 F1 6C 48 96>)
(   2,<2015-07-02 04:16:54.617 -0700>,<Administrator>,<X>,<proc1d>,<TOPSPIN 2.1>,
      <Start of raw data processing
       efp LB = 0.3 FT_mod = 6 PKNL = 1 PHC0 = 0 PHC1 = 0 SI = 128K 
       data hash MD5: 128K
       E4 3D 1F 7A C6 5F 42 5A DE 16 30 5C 07 90 24 A2>)
(   3,<2015-07-02 04:16:55.477 -0700>,<Administrator>,<X>,<proc1d>,<TOPSPIN 2.1>,
      <pk PHC0 = -86.76453 PHC1 = 0 
       data hash MD5: 128K
       F0 34 4D B4 71 80 D5 FD D1 75 35 50 B0 62 A0 21>)
(   4,<2015-07-02 04:16:55.867 -0700>,<Administrator>,<X>,<proc1d>,<TOPSPIN 2.1>,
      <abs ABSG = 1 
       data hash MD5: 128K
       31 7D 30 2D 8B 48 D1 B3 99 2E DD A6 7C BD 0B AD>)
(   5,<2015-07-02 04:16:55.961 -0700>,<Administrator>,<X>,<proc1d>,<TOPSPIN 2.1>,
      <abs ABSG = 2 
       data hash MD5: 128K
       F2 4C D4 5F 10 C4 50 C6 75 92 32 91 B9 49 6E AC>)
(   6,<2015-07-02 04:16:56.039 -0700>,<Administrator>,<X>,<proc1d>,<TOPSPIN 2.1>,
      <abs ABSG = 3 
       data hash MD5: 128K
       49 C4 C9 4B A2 B8 5D 0D FE D8 1B A3 C2 8D A5 6D>)
(   7,<2015-07-02 04:16:56.133 -0700>,<Administrator>,<X>,<proc1d>,<TOPSPIN 2.1>,
      <abs ABSG = 4 
       data hash MD5: 128K
       88 1B 6F 4F 13 AC 63 6D 61 50 A7 4A FA 75 13 D8>)
(   8,<2015-07-02 04:16:56.211 -0700>,<Administrator>,<X>,<proc1d>,<TOPSPIN 2.1>,
      <abs ABSG = 5 
       data hash MD5: 128K
       F6 E4 91 92 81 A6 CD A2 42 62 9F 05 87 75 0A 10>)
$$ ##END=
$$ 
$$ $$ hash MD5
$$ $$ 17 3B 04 35 97 C7 45 5D 95 EB C3 CB E2 08 A4 7D
##$RELAX= 
##$RELAX= 
##$RELAX= 
##$RELAX= 
##$RELAX= 
##$RELAX= 
##$RELAX= 
##$RELAX= 
$$ Bruker specific parameters
$$ --------------------------
##$DU= <E:\>
##$EXPNO= 22
$$ [...]
150 150 150 150 150 150 150 150
##$TP07= 0
##$TPNAME0= <>
##$TPNAME1= <>
##$TPNAME2= <>
##$TPNAME3= <>
##$TPNAME4= <>
##$TPNAME5= <>
##$TPNAME6= <>
##$TPNAME7= <>
##$TPOAL= (0..7)
0.5 0.5 0.5 0.5 0.5 0.5 0.5 0.5
##$TPOFFS= (0..7)
0 0 0 0 0 0 0 0
##$TUNHIN= 0
##$TUNHOUT= 0
##$TUNXOUT= 0
##$USERA1= <user>
##$USERA2= <user>
##$USERA3= <user>
##$USERA4= <user>
##$USERA5= <user>
##$V9= 5
##$VALIST= <valist>
##$VCLIST= <CCCCCCCCCCCCCCC>
##$VD= 0
##$VDLIST= <DDDDDDDDDDDDDDD>
##$VPLIST= <PPPPPPPPPPPPPPP>
##$VTLIST= <TTTTTTTTTTTTTTT>
##$WBST= 2048
##$WBSW= 25
##$XGAIN= (0..3)
0 0 0 0
##$XL= 0
##$YL= 0
##$YMAX_a= 6454771
##$YMIN_a= -12578865
##$ZGOPTNS= <>
##$ZL1= 120
##$ZL2= 120
##$ZL3= 120
##$ZL4= 120
##$ABSF1= 14.963
##$ABSF2= -5.595181
##$ABSG= 5
##$ABSL= 3
##$ALPHA= 0
##$AQORDER= 0
##$ASSFAC= 0
##$ASSFACI= 0
##$ASSFACX= 0
##$ASSWID= 0
##$AUNMP= <proc_prof1d_extract.lims>
##$AXLEFT= 0
##$AXNAME= <>
##$AXNUC= <1H>
##$AXRIGHT= 0
##$AXTYPE= 0
##$AXUNIT= <>
##$AZFE= 0.1
##$AZFW= 0.1
##$BCFW= 0
##$BC_mod= 0
##$BYTORDP= 0
##$COROFFS= 0
##$CY= 15
##$DATMOD= 1
##$DC= 0
##$DFILT= <>
##$DTYPP= 0
##$F1P= 0
##$F2P= 0
##$FCOR= 0.5
##$FTSIZE= 131072
##$FT_mod= 6
##$GAMMA= 0
##$GB= 0
##$INTBC= 1
##$INTSCL= 1
##$ISEN= 128
##$LB= 0.3
##$LEV0= 0
##$LPBIN= 0
##$MAXI= 10000
##$MC2= 0
##$MEAN= 0
##$ME_mod= 0
##$MI= 0
##$NCOEF= 0
##$NC_proc= -2
##$NLEV= 6
##$NOISF1= 0
##$NOISF2= 0
##$NSP= 0
##$NTH_PI= 0
##$NZP= 0
##$OFFSET= 14.963
##$PC= 1
##$PHC0= -86.76453
##$PHC1= 0
##$PH_mod= 1
##$PKNL= yes
##$PPARMOD= 0
##$PPDIAG= 0
##$PPIPTYP= 0
##$PPMPNUM= 2147483647
##$PPRESOL= 1
##$PSCAL= 4
##$PSIGN= 0
##$PYNMP= <proc.py>
##$REVERSE= no
##$SF= 400.020008835306
##$SI= 131072
##$SIGF1= 0
##$SIGF2= 0
##$SINO= 400
##$SIOLD= 131072
##$SPECTYP= <>
##$SREGLST= <1H.CDCl3>
##$SSB= 0
##$STSI= 131072
##$STSR= 0
##$SW_p= 8223.68421052631
##$SYMM= 0
##$S_DEV= 0
##$TDeff= 65536
##$TDoff= 0
##$TI= <>
##$TILT= no
##$TM1= 0
##$TM2= 0
##$TOPLEV= 0
##$USERP1= <user>
##$USERP2= <user>
##$USERP3= <user>
##$USERP4= <user>
##$USERP5= <user>
##$WDW= 1
##$XDIM= 131072
##$YMAX_p= 409485034
##$YMIN_p= -12542
##$CURPLOT= <Network HP LaserJet P1505>
##$CURPRIN= <$Network HP LaserJet P1505>
##$DFORMAT= <normdp>
##$LAYOUT= <+/1D_H.xwp>
##$LFORMAT= <normlp>
##$PFORMAT= <normpl>
##$SURQMSG= 1
$$ End of Bruker specific parameters
$$ ---------------------------------
##NTUPLES= NMR SPECTRUM
##VAR_NAME=  FREQUENCY,     SPECTRUM/REAL,   SPECTRUM/IMAG
##SYMBOL=    X,             R,               I
##VAR_TYPE=  INDEPENDENT,   DEPENDENT,       DEPENDENT
##VAR_FORM=  AFFN,          ASDF,            ASDF
##VAR_DIM=   131072,        131072,          131072
##UNITS=     HZ,            ARBITRARY UNITS, ARBITRARY UNITS
##FACTOR=    0.0627417313425164, 1,          1
##FIRST=     8223.62146879497, 646,          -39298
##LAST=      0,             1435,            -39159
##MIN=       0,             -12542,          0
##MAX=       8223.62146879497, 409485034,    0
$$ Real data points
##PAGE= N=1
##DATA TABLE= (X++(R..R)), XYDATA
$$ [...]
63386D54784J2567J2865J2910J2334J1444J0665J0154J0001J0131J0075R240P499
63374E84669N151K481k95k735m376n181n461n452n279n061m640l588j963p91j048
63359E46431k444l897n019o262p727q825r298r539r626q955p364n816n247n346
63345D51066n248m945n104n695n737m667l302l086m604p040q943r391q525p153
63331C67626n846m578l217k110j816k249k496j741j95J232J975K268K550K969
63317C54372L574M502N579O077N447M074K775J686K46j739l774n436o807p853
63303C62723q164p700p156p078p096o588n621m699m062l715l741l974l806l002
63289B86321k236k169k405k159j579j424j702j707j308j158j497j766j620j376
$$ y = [454784, 467351, 480216, 493126, 505460, 516904, 527569, 537723, 547724, 557855, 567930, 577170, 584669, 589820, 592301, 592006, 589271, 584895, 579714, 574253, 568801, 563522, 558461, 553821, 550233, 548270, 547479, 546431, 543987, 540090, 535071, 528809, 521082, 512257, 502959, 493420, 483794, 474839, 467475, 461659, 456412, 451066, 445818, 440873, 435769, 430074, 424337, 419670, 416368, 413282, 408678, 401638, 392695, 383304, 374779, 367626, 361780, 357202, 353985, 351875, 350059, 347810, 345314, 343573, 343378, 344610, 346585, 348853, 351403, 354372, 357946, 362448, 368027, 374104, 379551, 383625, 386400, 388086, 388332, 386593, 382819, 377383, 370576, 362723, 354559, 346859, 339703, 332625, 325529, 318941, 313320, 308621, 304559, 300844, 297103, 293129, 289323, 286321, 284085, 281916, 279511, 277352, 275773, 274349, 272647, 270940, 269632, 268474, 266977, 265211, 263591, 262215]
63275B62215j197o66L54J200J238O73J29l6L21J254K402L064L048K963L284L574
63259B83820L220K436K045K426L255M070M671N021N206N438N877O439O984P514
63245C48422Q041Q476Q816R343J0356J1824J3430J4906J6127J7065J7788J8512
63233E03106J9513K0887K2347K3279K3270K2690K2450K2889K3229K2598K1348
63222G47606K0724K1323K2582K3790K4892K5974K6682K6627K5973K5139K4094
63211A015406K2287J9148J4490Q577J968m837j1600j8071k3691k7927l0756l2384
63199I32610l2646l1347k9113k7123k5776k4255k1762j8544j5410j2707j0162
63188F83765p275l722K31L524N170N591O383Q435J0880J2416J2922J3182J3644
$$ y = [262215, 261018, 260352, 260706, 261906, 263144, 263817, 263946, 263910, 264231, 265485, 267887, 270951, 273999, 276962, 280246, 283820, 287040, 289476, 291521, 293947, 297202, 301272, 305943, 310964, 316170, 321608, 327485, 333924, 340908, 348422, 356463, 364939, 373755, 383098, 393454, 405278, 418708, 433614, 449741, 466806, 484594, 503106, 522619, 543506, 565853, 589132, 612402, 635092, 657542, 680431, 703660, 726258, 747606, 768330, 789653, 812235, 836025, 860917, 886891, 913573, 940200, 966173, 991312, 1015406, 1037693, 1056841, 1071331, 1079908, 1081876, 1077039, 1065439, 1047368, 1023677, 995750, 964994, 932610, 899964, 868617, 839504, 812381, 786605, 762350, 740588, 722044, 706634, 693927, 683765, 676490, 672768, 672999, 676523, 681693, 687284, 693667, 702102, 712982, 725398, 738320, 751502, 765146]
63175G65146J4144J4502J4667J4508J4037J3574J3272J2825J2074J1451J1255
63164I11455J0940R785P902N835L559O87k590n630q287j0923j3480j5333j6179
63151H77741j6346j6105j5344j4091j2694j1234r315o878m640l336k736j959o66
63138G62397M49M07r78k963m692o011p327q809j0049j0564j0273r344p896o152
63124F78195m588l655l365l368l207k445r12R35K220K490K126J723J467J363J514
63109F70493J823J872J543J304J419J438J042P76J166J629J247K84j90jn2p10
63093F85083j155o72L66J255J839K183K055J357O22M85R60J605K098K323K236
63078G02640K080K419L547M994N954O053N539M984M999N995P769R553J0739J1556
$$ y = [765146, 779290, 793792, 808459, 822967, 837004, 850578, 863850, 876675, 888749, 900200, 911455, 922395, 932180, 940082, 945917, 949476, 950163, 947573, 941943, 933656, 922733, 909253, 893920, 877741, 861395, 845290, 829946, 815855, 803161, 791927, 782612, 775734, 771094, 767758, 765022, 763063, 762397, 762846, 763253, 762275, 759312, 754620, 748609, 741282, 732473, 722424, 711860, 701587, 692243, 684347, 678195, 673607, 669952, 666587, 663219, 660012, 657567, 656655, 657590, 659810, 662300, 664426, 666149, 667616, 668979, 670493, 672316, 674188, 675731, 677035, 678454, 679892, 680934, 681710, 682876, 684505, 685752, 686036, 685846, 685845, 685793, 685083, 683928, 683256, 683622, 684877, 686716, 688899, 690954, 692311, 692933, 693418, 694378, 695983, 698081, 700404, 702640, 704720, 707139, 710686, 715680, 721634, 727687, 733226, 738210, 743209, 749204, 756973, 766526, 777265, 788821]
63064G88821J2721J4507J6393J7743J8557J9375K0616K2229K4061K6249K8971
63053A010243L1940L4624L6915L9138M1322M3006M3976M4646M5280M5460M4838
63042A461388M3884M3168M2369M0867L8943L7508L6778L6205L5564L5143L4715
63031A886532L3400L0852K7584K3747J8520J1282K654o327j5393k4793l4304m3179
63019A910575n0799n6849o1170o3883o5369o5654o4174o0639n5784n0729m5845
63008A269680m0794l5444l0105k4938j9775j4584r647n136q92L185O853R788J2000
62995A120191J3820J5482J6880J7803J8361J9022K0053K1007K1113K0075J8302
62984A322109J6376J4593J2902J0885P831L338k081p476j2589j7972k3843k9562
$$ y = [788821, 801542, 816049, 832442, 850185, 868742, 888117, 908733, 930962, 955023, 981272, 1010243, 1042183, 1076807, 1113722, 1152860, 1194182, 1237188, 1281164, 1325810, 1371090, 1416550, 1461388, 1505272, 1548440, 1590809, 1631676, 1670619, 1708127, 1744905, 1781110, 1816674, 1851817, 1886532, 1919932, 1950784, 1978368, 2002115, 2020635, 2031917, 2034571, 2028244, 2012851, 1988058, 1953754, 1910575, 1859776, 1802927, 1741757, 1677874, 1612505, 1546851, 1482677, 1422038, 1366254, 1315525, 1269680, 1228886, 1193442, 1163337, 1138399, 1118624, 1104040, 1094393, 1089257, 1088365, 1091550, 1098403, 1108191, 1120191, 1134011, 1149493, 1166373, 1184176, 1202537, 1221559, 1241612, 1262619, 1283732, 1303807, 1322109, 1338485, 1353078, 1365980, 1376865, 1384696, 1388034, 1385953, 1378477, 1365888, 1347916, 1324073, 1294511]
62972A294511l4484l8702m2445m5421m7226m7919m7667m6267m3757m1003l8882
62961H20738l7151l4921l2069k9373k7227k5091k2505j9902j7976j6719j5531
62950E42273j4094j2677j1601j0757r826q842q230q113p877o838n262m181m074
62937D29901m342m337m252m526m897m786m302m057m165m103l596k981k632k568
62923C74357k676k867k959k830k708k868l101k954k488k211k231k099j608j072
62909C39685o87j93M51P05J74p26j282j402j532j884k131j800p70M89J134O54
62893C30885n34j440j603j437j438j492j281q72n01j40K42L80J06j48J93J037
62877C21957J781K097K078J741R90R6l20MP07J322J751K088K309K313K091J685
$$ y = [1294511, 1260027, 1221325, 1178880, 1133459, 1086233, 1038314, 990647, 944380, 900623, 859620, 820738, 783587, 748666, 716597, 687224, 659997, 634906, 612401, 592499, 574523, 557804, 542273, 528179, 515502, 503901, 493144, 483318, 474476, 466246, 458133, 450256, 443418, 438156, 433975, 429901, 425559, 421222, 416970, 412444, 407547, 402761, 398459, 394402, 390237, 386134, 382538, 379557, 376925, 374357, 371681, 368814, 365855, 363025, 360317, 357449, 354348, 351394, 348906, 346695, 344464, 342365, 340757, 339685, 338998, 338805, 339256, 339961, 340135, 339409, 338127, 336725, 335193, 333309, 331178, 329378, 328608, 329097, 330231, 330885, 330351, 328911, 327308, 325871, 324433, 322941, 321660, 320788, 320287, 320147, 320389, 320769, 320875, 320727, 320920, 321957, 323738, 325835, 327913, 329654, 330644, 330740, 330420, 330424, 331131, 332453, 334204, 336292, 338601, 340914, 343005, 344690]
62861C44690J196Q13N85J57q77k278l188l123k595k467k858l007k250q59J29n7
62845C24011j155k136k297j848j354q92j91N58P37K11l05j68M36R50J247J584
62829C19388K009K336K487K430J972J070K53K61J239K635L804M428M449M041L640
62814C56442L593L755L762L619L659L982M383M802N369N988O430O864P775R196
62800D29619J0545J1474J2357J3672J5351J7059J8715K0482K2617K5499K9362
62789F26752L3783L7951M1675M5519M9664N3465N6647O0085O4572O9443P3374
62778A212930P6027P7852P8669P7591P4310O9266O2491N3451M2270L0034J7460
62767A872351M318r315k2217l3306m2990n2240o0794o7316p1229p3395p4777p5199
$$ y = [344690, 345886, 346699, 347284, 347441, 346564, 344286, 341098, 337975, 335380, 332913, 330055, 327048, 324798, 323939, 324068, 324011, 322856, 320720, 318423, 316575, 315221, 314329, 314138, 314696, 315433, 315644, 315339, 315171, 315607, 316557, 317804, 319388, 321397, 323733, 326220, 328650, 330622, 331692, 331945, 332206, 333445, 336080, 339884, 344312, 348761, 352802, 356442, 360035, 363790, 367552, 371171, 374830, 378812, 383195, 387997, 393366, 399354, 405784, 412648, 420423, 429619, 440164, 451638, 463995, 477667, 493018, 510077, 528792, 549274, 571891, 597390, 626752, 660535, 698486, 740161, 785680, 835344, 888809, 945456, 1005541, 1070113, 1139556, 1212930, 1288957, 1366809, 1445478, 1523069, 1597379, 1666645, 1729136, 1782587, 1824857, 1854891, 1872351, 1876669, 1867354, 1845137, 1811831, 1768841, 1716601, 1655807, 1588491, 1517262, 1443867, 1369090, 1293891]
62755A293891p3871p0771o6971o3565o0610n7341n3272m8818m4729m1264l8203
62744F74476l5346l2526k9399k5833k2438k0002j8383j6719j4822j3464j2891
62733D32653j2061j0071p635o150n767n326m108k653j781j554j456r74J61J885
62719C75163L657M849N428N983O948Q112R098R973J1177J3029J5439J8021K0328
62706E07205K2281K4344K7117L0643L4319L7605M0538M3369M5943M7722M8378
62695I09464M8052M6987M5093M1990L7434L1536K4576J6784Q384k28q604j6487
62683A184981k3760l0176l5392l9344m2324m4505m5668m5638m4705m3318m1511
62672G48640l9084l6237l3568l1318k9049k6300k3236k0377j7943j5820j4063
$$ y = [1293891, 1220020, 1149249, 1082278, 1018713, 958103, 900762, 847490, 798672, 753943, 712679, 674476, 639130, 606604, 577205, 551372, 528934, 508932, 490549, 473830, 459008, 445544, 432653, 420592, 410521, 402886, 396736, 390969, 385643, 381535, 378882, 377101, 375547, 374091, 373117, 373278, 375163, 378820, 383669, 389097, 395080, 402028, 410140, 419238, 429211, 440388, 453417, 468856, 486877, 507205, 529486, 553830, 580947, 611590, 645909, 683514, 724052, 767421, 813364, 861086, 909464, 957516, 1004503, 1049596, 1091586, 1129020, 1160556, 1185132, 1201916, 1210300, 1210072, 1201468, 1184981, 1161221, 1131045, 1095653, 1056309, 1013985, 969480, 923812, 878174, 833469, 790151, 748640, 709556, 673319, 639751, 608433, 579384, 553084, 529848, 509471, 491528, 475708, 461645]
62661D61645j2956j2486j2120j1399j0516r974r782r396q513p516o845o321n482
62648C38339m433l772l716l809l635l410l568m038m326m160l703l254k910k578
62634B87027k119j492q51m24k81k93l52n18q17j052r00j75J001K150K700K506
62618B86110K144K379L301M270M753M849M925N200N901P375R590J1891J3662J5041
62604C81391J6550J8292J9968K1585K3527K5962K8578L1071L3439L5721L7715
62593F73799L9118L9720L9371L7930L5362L1740K7132K1546J5071P896L09p220
62581I61774j4040j9636k4013k7522l0365l2375l3344l3358l2735l1759l0574
62570F52053k9288k8012k6725k5161k3069k0659j8542j7009j5602j3769j1787
$$ y = [461645, 448689, 436203, 424083, 412684, 402168, 392194, 382412, 373016, 364503, 356987, 350142, 343821, 338339, 333906, 330134, 326418, 322609, 318974, 315564, 311996, 307958, 303632, 299472, 295769, 292515, 289605, 287027, 284908, 283416, 282565, 282141, 281860, 281567, 281215, 280697, 279880, 278828, 277928, 277753, 278754, 280904, 283604, 286110, 288254, 290633, 293934, 298204, 302957, 307806, 312731, 317931, 323832, 331207, 340797, 352688, 366350, 381391, 397941, 416233, 436201, 457786, 481313, 507275, 535853, 566924, 600363, 636084, 673799, 712917, 752637, 792008, 829938, 865300, 897040, 924172, 945718, 960789, 968685, 968994, 961774, 947734, 928098, 904085, 876563, 846198, 813823, 780479, 747121, 714386, 682627, 652053, 622765, 594753, 568028, 542867, 519798, 499139, 480597, 463588, 447986, 434217, 422430]
62559D22430j0480j0065r910r575r339r411r239q301o994o091n653n210m702m459
62545C13001m374l886k880j892j239n85L87J379J896J870J682J798K509L778N159
62530C18603O191O896P681Q792J0205J1959J4148J6448J8241J9391K0497K2111
62518D81163K4119K6186K8368L0838L3241L4772L4900L3732L1766K9430K6745
62507H15260K3285J8555J2606O164L2n505j0569j5259j9568k3539k7117k9895
62495G44450l1312l1248l0200k8733k6992k4905k2713k0936j9681j8346j6317
62484D73067j3874j1966j1063j0604r821q642p467o370n100l761k868k597k457
62471C76477j938j134m77p6L72J104J993K752L285L716M150M563N007N691O630
$$ y = [422430, 411950, 401885, 391975, 382400, 373061, 363650, 354411, 346110, 339116, 333025, 327372, 322162, 317460, 313001, 308627, 304741, 301861, 299969, 298730, 298145, 298532, 299911, 301807, 303677, 305359, 307157, 309666, 313444, 318603, 324794, 331690, 339371, 348163, 358368, 370327, 384475, 400923, 419164, 438555, 459052, 481163, 505282, 531468, 559836, 590674, 623915, 658687, 693587, 727319, 759085, 788515, 815260, 838545, 857100, 869706, 875870, 875902, 870397, 859828, 844569, 825001, 801462, 774345, 744450, 713138, 681890, 651690, 622957, 595965, 571060, 548347, 527411, 507730, 489384, 473067, 459193, 447227, 436164, 425560, 415739, 407097, 399630, 393260, 388160, 384399, 381531, 378934, 376477, 374539, 373405, 372928, 372852, 373224, 374328, 376321, 379073, 382358, 386074, 390224, 394787, 399794, 405485, 412115]
62456D12115P340P281O664O342O666O892O088M282K282O11q40k338l955n646p212
62441D46572q328q905r244r442q975p518n796m911m901m841m272l621l143k472
62427C60203j509p93m59K71J912L727M704M932N216N739O049O108O416P028P309
62412D16853O958O692P366Q696R397Q671P263O662P310Q022P504O031M967M861
62398E17253M848M137L119K526K276J884J479J570K037K251K062K005K495L419
62384E53361M620O146P917R626J1170J2831J4881J7334K0111K3060K5772K7766
62372G34595K9060L0204L1581L2865L3400L2888L1605L0033K8388K6342K3225
62361A064186J8696J3250P819K923j573n849r737j3100j6213j9394k2494k5071
$$ y = [412115, 419455, 426736, 433400, 439742, 446408, 453300, 459388, 463670, 465952, 466563, 465723, 463385, 459430, 453784, 446572, 438244, 429339, 420095, 410653, 401678, 394160, 388364, 383453, 378552, 373711, 369439, 365818, 362675, 360203, 358694, 357901, 357442, 357713, 359625, 363352, 368056, 372988, 378204, 383943, 389992, 396100, 402516, 409544, 416853, 423811, 430503, 437869, 446565, 455962, 464633, 471896, 478558, 485868, 493890, 501394, 507425, 512392, 517253, 522101, 526238, 529357, 531883, 534159, 536043, 537522, 539092, 541129, 543380, 545442, 547447, 549942, 553361, 557981, 564127, 572044, 581670, 592840, 605671, 620552, 637886, 657997, 681057, 706829, 734595, 763655, 793859, 825440, 858305, 891705, 924593, 956198, 986231, 1014619, 1040961, 1064186, 1082882, 1096132, 1103951, 1106874, 1105301, 1099452, 1089715, 1076615, 1060402, 1041008, 1018514, 993443]
62349I93443k6978k8438k9531k9926k9280k7709k5722k3800k2085k0396j8463
62338G11115j6246j4132j2689j2057j1617j0565q793o933n517m452l472k701k294
62325E99647j944j231l05L53P89J510K516L143L083K880L043L321L398L598M202
62310F28003M553L792K297J422J830K897L875M779N743O299N983N163M699M892
62296F86227N276N249M603L547K526J947J792J627J173P34P77J368K311L626N371
62281G28154P173Q547R708J1396J3787J6136J7900J9576K1918K4727K7144K8861
62269I35027L0394L2097L3632L4482L4478L3542L1403K7937K3459J8424J3072
62258A247947P624K521j839n448q598j1583j4599j7662k0427k2391k3463k4070
$$ y = [993443, 966465, 938027, 908496, 878570, 849290, 821581, 795859, 772059, 749974, 729578, 711115, 694869, 680737, 668048, 655991, 644374, 633809, 625016, 618083, 612566, 608114, 604642, 601941, 599647, 597703, 596472, 596167, 596520, 597309, 598819, 601335, 604478, 607561, 610441, 613484, 616805, 620203, 623801, 628003, 632556, 636348, 638645, 640067, 641897, 644794, 648669, 653448, 659191, 665490, 671473, 676636, 681335, 686227, 691503, 696752, 701355, 704902, 707428, 709375, 711167, 712794, 713967, 714701, 715478, 716846, 719157, 722783, 728154, 735327, 743874, 753582, 764978, 778765, 794901, 812801, 832377, 854295, 879022, 906166, 935027, 965421, 997518, 1031150, 1065632, 1100110, 1133652, 1165055, 1192992, 1216451, 1234875, 1247947, 1255571, 1258092, 1256253, 1250805, 1242207, 1230624, 1216025, 1198363, 1177936, 1155545, 1132082, 1108012]
62246A108012k4463k4340k3351k1588j9300j6573j3751j1582j0311r146p322n328
62234I20957m108l460k311m79J063J802K350L128L606L441L346L898M349L648
62220I41230K081Q57M41K79mj84j35n0J87R80K195L097L433L843M821N949O632
62203I75652P122Q045R298J0203J0670J1421J2801J4087J4438J4120J4100J4665
62191A116622J5128J4971J4571J4490J4621J4578J4529J5002J6019J7081J8007
62180A285619J9230K1054K3125K4803K5729K5796K4896K2926J9999J6484J2852
62169A522513R454O258K998k43k861m509n786p580r876j1877j3258j4529j6032
62156A454672j7322j7826j7547j6738j5515j4065j2808j1938j1246j0618j0190
$$ y = [1108012, 1083549, 1059209, 1035858, 1014270, 994970, 978397, 964646, 953064, 942753, 933607, 926285, 920957, 916849, 913389, 911078, 910599, 911662, 913464, 915814, 918942, 922548, 925989, 929335, 933233, 937582, 941230, 943311, 944168, 944609, 944888, 944884, 944700, 944565, 944515, 944702, 945682, 947877, 950974, 954407, 958250, 963071, 969020, 975652, 982774, 990819, 1000117, 1010320, 1020990, 1032411, 1045212, 1059299, 1073737, 1087857, 1101957, 1116622, 1131750, 1146721, 1161292, 1175782, 1190403, 1204981, 1219510, 1234512, 1250531, 1267612, 1285619, 1304849, 1325903, 1349028, 1373831, 1399560, 1425356, 1450252, 1473178, 1493177, 1509661, 1522513, 1531967, 1538225, 1541223, 1540980, 1538119, 1533610, 1527824, 1520244, 1510368, 1498491, 1485233, 1470704, 1454672, 1437350, 1419524, 1401977, 1385239, 1369724, 1355659, 1342851, 1330913, 1319667, 1309049, 1298859]
62145A298859r809r024p946p410p792q303q113p529p390p766q099q229q378q361
62131A184710p649o246m812l841l210k588j840j005k02M84J270K597M494O284
62117A168446P282P464P011N622K931o06l895o257p721q360p974o570m800l799
62103A148774m624p477j1175j3796j4327j3454j2390j1461j0412r447q896q215
62091A023100o443l701j231K35J208K344L548M525N452O524P482Q084Q676R730
62077A069533J1052J1924J1857J0945R534P824N690K903n06m101p354r939j1610
62064A107752j2151j1866j1856j3144j5567j7978j9594k0632k1593k2439k2750
62053I18182k2359k1575k0848k0262j9431j8025j6418j5362j4939j4372j3228
$$ y = [1298859, 1289050, 1280026, 1272080, 1264670, 1256878, 1248575, 1240462, 1232933, 1225543, 1217777, 1209678, 1201449, 1193071, 1184710, 1177061, 1170815, 1166003, 1162162, 1158952, 1156364, 1154524, 1153519, 1153317, 1153801, 1155071, 1157668, 1162162, 1168446, 1175728, 1183192, 1190203, 1195825, 1198756, 1198150, 1194255, 1187998, 1180277, 1171917, 1163943, 1157373, 1152573, 1148774, 1144150, 1136673, 1125498, 1111702, 1097375, 1083921, 1071531, 1060070, 1049658, 1040211, 1031315, 1023100, 1016657, 1012956, 1011725, 1011960, 1013168, 1015512, 1019060, 1023585, 1029037, 1035561, 1043043, 1051127, 1059803, 1069533, 1080585, 1092509, 1104366, 1115311, 1124845, 1132669, 1138359, 1141262, 1140756, 1136655, 1129301, 1119362, 1107752, 1095601, 1083735, 1071879, 1058735, 1043168, 1025190, 1005596, 984964, 963371, 940932, 918182, 895823, 874248, 853400, 833138, 813707, 795682, 779264, 763902, 748963, 734591, 721363]
62042G21363j2113j1594j1170j0168r044q713q903q495p367o617o793p119o822
62029F06445o182n827n904o357p171p842p533o204m930m504m509m204l591k996
62015E28691k336j512q94o93l79M96J382J418O88M8j42l45r80j785k193j968j502
61998E17994j586k702m360n458n488m955m487m009l249k385j649q10L64J449J897
61983D80566J929K206K770L049K855K752L254M164M881N039M821M758N258O155
61969E34457O858P086P162P423P659P580P480P909Q848R707J0141J0427J1029
61956F43766J2122J3577J5102J6406J7506J8794K0513K2249K3336K3773K4323
61945H51467K5574K7223K8505K9154K9677L0717L2343L4095L5610L7003L8551
$$ y = [721363, 709250, 697656, 686486, 676318, 667274, 658561, 649658, 641163, 633796, 627179, 620386, 613267, 606445, 600263, 594436, 588532, 582175, 575004, 567162, 559629, 553425, 548495, 543991, 539482, 535278, 531687, 528691, 526355, 524843, 523949, 523256, 522877, 523373, 524755, 526173, 526861, 526909, 526767, 526422, 525442, 523657, 521464, 519496, 517994, 516408, 513706, 509346, 503888, 498400, 493445, 488958, 484949, 481700, 479315, 477666, 476856, 477220, 478669, 480566, 482495, 484701, 487471, 490520, 493375, 496127, 499381, 503545, 508426, 513465, 518286, 523044, 528302, 534457, 541315, 548401, 555563, 562986, 570645, 578225, 585705, 593614, 602462, 612169, 622310, 632737, 643766, 655888, 669465, 684567, 700973, 718479, 737273, 757786, 780035, 803371, 827144, 851467, 877041, 904264, 932769, 961923, 991600, 1022317, 1054660, 1088755, 1124365, 1161368, 1199919]
61934A199919M0216M1752M3196M4989M7611N1342N6350O2677P0086P8164Q6716
61923A823018R5939J06260J18148J31879J47084J62710J77940J93081K08877K24974
61913C389910K39697K51471K59673K63804K62587K54406K38174K13278J79299
61904E552299J36500Q6401L1557k4994p9857j29649j72017k06174k32009k49159
61894D712898k57514k58256k53498k44990k33695k20447k06237j91723j77077
61885B669461j62462j48278j34849j22256j10569r9964r0436q1719p3527o5789
61875A579612n8605n2178m6685m2018l7664l3110k8338k3821j9991j6759j3605
61864A206838j0046o149k499M59K908N273P509R194J0307J1319J2448J3297J3462
$$ y = [1199919, 1240135, 1281887, 1325083, 1370072, 1417683, 1469025, 1525375, 1588052, 1658138, 1736302, 1823018, 1918957, 2025217, 2143365, 2275244, 2422328, 2585038, 2762978, 2956059, 3164936, 3389910, 3629607, 3881078, 4140751, 4404555, 4667142, 4921548, 5159722, 5373000, 5552299, 5688799, 5775200, 5806757, 5781763, 5701906, 5572257, 5400240, 5194066, 4962057, 4712898, 4455384, 4197128, 3943630, 3698640, 3464945, 3244498, 3038261, 2846538, 2669461, 2506999, 2358721, 2223872, 2101616, 1991047, 1891083, 1800647, 1718928, 1645401, 1579612, 1521007, 1468829, 1422144, 1380126, 1342462, 1309352, 1281014, 1257193, 1237202, 1220443, 1206838, 1196792, 1190643, 1188144, 1188603, 1191511, 1196784, 1204293, 1213487, 1223794, 1235113, 1247561, 1260858, 1274320]
61851A274320J3026J2293J1446J0729J0369J0125R454Q435P962Q544R528R938
61839A396169R587Q822P677N942L735J457o78k625m378o135q153j0023j0767j0114
61825A380516r078q505p742n622k363O64K762M550O849R808J3240J6898K0350
61812A422327K3304K6141K9510L3363L7046M0449M4270M8988N4248N9527O4871
61801A884044P0637P6978Q3924R1686J00615J10996J22965J36502J51531J68113
61791B997991J86378K06221K27354K49875K74288L00611L27963L55403L82561
61782E508645M08691M31702M48983M58824M60016M50364M26760L86937L30470
61773I311392K58316J72687P7629k1279j18433k09075k88944l54347m03285m36019
$$ y = [1274320, 1287346, 1299639, 1311085, 1321814, 1332183, 1342308, 1351762, 1360197, 1368159, 1376703, 1386231, 1396169, 1405756, 1414578, 1422255, 1428197, 1431932, 1433389, 1432711, 1430086, 1425708, 1419573, 1411420, 1401397, 1390630, 1380516, 1371438, 1362933, 1355191, 1349569, 1347206, 1347870, 1350632, 1355182, 1362031, 1371839, 1385079, 1401977, 1422327, 1445631, 1471772, 1501282, 1534645, 1571691, 1612140, 1656410, 1705398, 1759646, 1819173, 1884044, 1954681, 2031659, 2115583, 2207269, 2307884, 2418880, 2541845, 2678347, 2829878, 2997991, 3184369, 3390590, 3617944, 3867819, 4142107, 4442718, 4770681, 5126084, 5508645, 5917336, 6349038, 6798021, 7256845, 7716861, 8167225, 8593985, 8980922, 9311392, 9569708, 9742395, 9820024, 9798745, 9680312, 9471237, 9182293, 8827946, 8424661, 7988642]
61763G988642m54168m59636m54472m40942m21223l97259l70979l44047l17336
61754D328580k91132k66005k42732k21479k01758j83465j67065j52573j39251
61745B463120j26727j15520j05943r7273q8741q0688p3953o8587o3866n9339n5119
61734A527364n1327m7826m4487m1325l8372l5684l3302l1042k8582k5935k3510
61723A125972k1527j9703j7775j5990j4753j4174j4130j4468j4851j4802j4255
61712I49544j3750j3752j4062j4217j4073j3719j3135j2375j1724j1314j0802
61701H06621r886q815p984p221o039m486l195k525k081j219J59J529K294K294
61687G59446J743P67q78l462o749r978j2361j3552j3739j3520j3515j3681j3230
$$ y = [7988642, 7534474, 7074838, 6620366, 6179424, 5758201, 5360942, 4989963, 4645916, 4328580, 4037448, 3771443, 3528711, 3307232, 3105474, 2922009, 2754944, 2602371, 2463120, 2336393, 2220873, 2114930, 2017657, 1928916, 1848228, 1774275, 1705688, 1641822, 1582483, 1527364, 1476037, 1428211, 1383724, 1342399, 1304027, 1268343, 1235041, 1203999, 1175417, 1149482, 1125972, 1104445, 1084742, 1066967, 1050977, 1036224, 1022050, 1007920, 993452, 978601, 963799, 949544, 935794, 922042, 907980, 893763, 879690, 865971, 852836, 840461, 828737, 817423, 806621, 796735, 787920, 779936, 772715, 766676, 762190, 758995, 756470, 754389, 753170, 753329, 754858, 757152, 759446, 761189, 761956, 761078, 757616, 750867, 740889, 728528, 714976, 701237, 687717, 674202, 660521, 647291]
61674F47291j1564r219p295o058m785l087j570q08l71N38J831K523J838j52k788
61659F06324n379p498r048j0076j0526j0294r532q606p743o922o132n468m939
61646E04161m586m615m978m927l779k134j463k188l031k760j786j300j529j693
61632D63392j331p07j02M71R36J117J141J302J492J345Q61M65K94k8q04j774k436
61615D65634k589k449k363k483k645k528k017j300n67K01R73J461J474J287J381
61600D53470J851K361K638K725K786K925L225L738M383M926N160N098N031N371
61586E05688O327P658Q846R561R896J0215J0865J1944J3203J4306J5406J7244
61574F41159K0220K3554K5941K7087K7959K9332L0806L1549L1420L0744K9417
$$ y = [647291, 635727, 626508, 619213, 613155, 608370, 605283, 603713, 602905, 602534, 603072, 604903, 607426, 609264, 609112, 606324, 600945, 593447, 584399, 574323, 563797, 553503, 543971, 535365, 527622, 520700, 514568, 509100, 504161, 499575, 494960, 489982, 485055, 481276, 479142, 477679, 475491, 472460, 469700, 467914, 466614, 465085, 463392, 462061, 461354, 461252, 461723, 462659, 463776, 464917, 466219, 467711, 469056, 469917, 470382, 470676, 470648, 469844, 468070, 465634, 463045, 460596, 458233, 455750, 453105, 450577, 448560, 447260, 446693, 446894, 447867, 449328, 450802, 452089, 453470, 455321, 457682, 460320, 463045, 465831, 468756, 471981, 475719, 480102, 485028, 490188, 495286, 500317, 505688, 512015, 519673, 528519, 538080, 547976, 558191, 569056, 581000, 594203, 608509, 623915, 641159, 661379, 684933, 710874, 737961, 765920, 795252, 826058, 857607, 889027, 919771, 949188]
61563I49188K6915K3093J8421J3519Q808M617J227j259k910l810m027l650k825
61550A027307j765p50L3O41J168J486J416J087O89jj323k982m210m804n312o012
61534A006668o442o272n897n655n177m135k967k130j153O78L127N457P773J0831
61520I94706J4617J8157K1019K4044K8098L2847L7355M1386M5518N0136N4988
61509A362871N9763O4659P0108P6203Q2671Q9484R7113J05848J15000J23157J29340
61498B376217J33408J35295J34360J29970J22356J12297J00196Q6051P0249N3795
61488C454194L7552K1811O907o150j6196k3013k7444l0289l1496l0769k8712k6832
61476C299563k6309k7281k9580l3595l9835m7903n6549o4621p1423p6289p8547
$$ y = [949188, 976103, 999196, 1017617, 1031136, 1039944, 1044561, 1045788, 1044529, 1041619, 1037809, 1033782, 1030132, 1027307, 1025542, 1024792, 1024825, 1025466, 1026634, 1028120, 1029536, 1030623, 1031312, 1031311, 1029988, 1027006, 1022796, 1017992, 1012680, 1006668, 1000226, 993954, 988057, 982402, 977225, 973090, 970123, 967993, 966840, 967518, 970645, 976102, 983875, 994706, 1009323, 1027480, 1048499, 1072543, 1100641, 1133488, 1170843, 1212229, 1257747, 1307883, 1362871, 1422634, 1487293, 1557401, 1633604, 1716275, 1805759, 1902872, 2008720, 2123720, 2246877, 2376217, 2509625, 2644920, 2779280, 2909250, 3031606, 3143903, 3244099, 3330150, 3400399, 3454194, 3491746, 3513557, 3520464, 3514314, 3498118, 3475105, 3447661, 3417372, 3385876, 3355107, 3326395, 3299563, 3273254, 3245973, 3216393, 3182798, 3142963, 3095060, 3038511, 2973890, 2902467, 2826178, 2747631]
61465B747631p8036p5134p0161o3368n5530m7855m0956l4478k7988k1660j5780
61454B216685j0192m695M95N090R259J3399J7703K2275K7210L2413L7653M3016
61442B410311M8783N4643N9537O2615O3740O2790N9058N1859M1377K8552J4759
61431B958024J855q232j4719j8404k0411k0988j9926j7462j4137j0180n759j367
61419B808294K626O465J0415J3869J5509J3948Q150k077j5301k8822m0363m8980
61407B743733n4165n5307n2848m8848m5107m1382l6693l1565k7564k5051k2951
61396B302252k0496j7835j4952j1429p368l229J355P383J4830K2433K9398L6337
61384B338679M4088N2629O1545P0674P9854Q8736R7212J05336J12592J18040J21381
$$ y = [2747631, 2669595, 2594461, 2524300, 2460932, 2405402, 2357547, 2316591, 2282113, 2254125, 2232465, 2216685, 2206493, 2201798, 2202293, 2207383, 2216642, 2230041, 2247744, 2270019, 2297229, 2329642, 2367295, 2410311, 2459094, 2513737, 2573274, 2635889, 2699629, 2762419, 2821477, 2873336, 2914713, 2943265, 2958024, 2959879, 2951647, 2936928, 2918524, 2898113, 2877125, 2857199, 2839737, 2825600, 2815420, 2809661, 2808294, 2810920, 2817385, 2827800, 2841669, 2857178, 2871126, 2879276, 2877199, 2861898, 2833076, 2792713, 2743733, 2689568, 2634261, 2581413, 2532565, 2487458, 2446076, 2409383, 2377818, 2350254, 2325203, 2302252, 2281756, 2263921, 2248969, 2237540, 2230172, 2226943, 2228298, 2235681, 2250511, 2272944, 2302342, 2338679, 2382767, 2435396, 2496941, 2567615, 2647469, 2736205, 2833417, 2938753, 3051345, 3169385, 3290766]
61373C290766J23127J23377J21177J15514J06261R3818P8362N9928L8821J5812
61363D166963p773l0147m9926o6892q1474r3570j02744j09420j14808j19393j22427
61352C268389j23259j22249j19954j16344j11410j05833j00320r4710q8290q0759
61342B205261p2541o4386n6888n0136m3686l7184l0886k5136j9569j3526p161
61331A784162j262M009R246J4570J9254K2881K5890K8552L0336L0750K9969K8122
61319B026479K4850K0262J5585J2108R970Q584P698P421P704Q421R587J0959J1853
61306B181481J1853J1366J1000J0817J0613J0448J0360R909Q591O424L828J239
61294B287929r17k397l596n322p698r863j1170j1989j2870j3516j3296j2177j0494
$$ y = [3290766, 3413893, 3537270, 3658447, 3773961, 3880222, 3974040, 4052402, 4112330, 4151151, 4166963, 4159190, 4129043, 4079117, 4012225, 3930751, 3837181, 3734437, 3625017, 3510209, 3390816, 3268389, 3145130, 3022881, 2902927, 2786583, 2675173, 2569340, 2469020, 2374310, 2286020, 2205261, 2132720, 2068334, 2011446, 1961310, 1917624, 1880440, 1849554, 1824418, 1804849, 1791323, 1784162, 1782900, 1786909, 1796155, 1810725, 1829979, 1852860, 1878750, 1907302, 1937638, 1968388, 1998357, 2026479, 2051329, 2071591, 2087176, 2099284, 2109254, 2117838, 2125536, 2132957, 2140661, 2149082, 2158669, 2169628, 2181481, 2193334, 2204700, 2215700, 2226517, 2237130, 2247578, 2257938, 2267847, 2276438, 2282862, 2286690, 2287929, 2287012, 2284615, 2281019, 2275697, 2267999, 2258136, 2246966, 2234977, 2222107, 2208591, 2195295, 2183118, 2172624]
61281B172624q238n378k549o39L0m67k293n593r855j4211j8143k1337k3163k3212
61267B037576k2205k1462k1387k1148j9945j7835j5089j1509o824j458L752Q484
61255A890950J3281J8839K5187L1736L8147M4854N2473O0941O9630P8206Q6689
61244B410933R4580J00555J03348J02419R7368Q7258P1233M9687K4442k050k7323
61233C112450m9105o5722p6638q2467q4388q3425q0058p4306o6326n6783m6375
61222B346857l5187k3151j1213j271N223P898O424O1j0827k3488l4274m1412m5581
61209B140059m8053m9303m9364m8435m6555m3479l9362l5218l2016k9697k7503
61198A691074k5260k3811k3980k5435k6862k7171k6305k4914k3629k2765k2381
$$ y = [2172624, 2164386, 2159008, 2156459, 2155820, 2155850, 2155383, 2153090, 2147497, 2137642, 2123431, 2105288, 2083951, 2060788, 2037576, 2015371, 1993909, 1972522, 1951374, 1931429, 1913594, 1898505, 1886996, 1880172, 1878714, 1882466, 1890950, 1904231, 1923070, 1948257, 1979993, 2018140, 2062994, 2115467, 2176408, 2246038, 2324244, 2410933, 2505513, 2606068, 2709416, 2811835, 2909203, 2996461, 3067694, 3117381, 3141823, 3139773, 3112450, 3063345, 2997623, 2920985, 2838518, 2754130, 2670705, 2590647, 2516341, 2450015, 2393232, 2346857, 2311670, 2288519, 2277306, 2276035, 2281258, 2289156, 2295580, 2295641, 2284814, 2261326, 2227052, 2185640, 2140059, 2092006, 2042703, 1993339, 1944904, 1898349, 1854870, 1815508, 1780290, 1748274, 1718577, 1691074, 1665814, 1642003, 1618023, 1592588, 1565726, 1538555, 1512250, 1487336, 1463707, 1440942, 1418561]
61187A418561k2260k1945k1173k0151j9185j8199j6975j5606j4347j3159j1899
61176A223662j0784j0129r665q750p207n425l700k124j137j474l394o619j0937
61163A142317j6092k1065k4513k6219k7207k8053k8092k6806k5041k3901k3246
61152H72082k2151k0418j8698j7413j6450j5714j5230j4702j3619j1904j0067
61141F95716q633p628o686n489m163l160k595j852k70J858L562M464N198O448
61127F76770Q219J0202J2131J3560J3927J3192J1828J0026P541M519J722l60j877
61114G81400k886l121k759k526k619k403j642j086j330j992k571l232m131m882
61100G44220n352o085p252q092q112p863p813p450o432n578n612n870n386m516
$$ y = [1418561, 1396301, 1374356, 1353183, 1333032, 1313847, 1295648, 1278673, 1263067, 1248720, 1235561, 1223662, 1212878, 1202749, 1193084, 1184334, 1177127, 1171702, 1168002, 1165878, 1164741, 1163267, 1159873, 1153254, 1142317, 1126225, 1105160, 1080647, 1054428, 1027221, 999168, 971076, 944270, 919229, 895328, 872082, 849931, 829513, 810815, 793402, 776952, 761238, 746008, 731306, 717687, 705783, 695716, 687083, 679455, 672769, 667280, 663117, 659957, 657362, 655510, 655240, 657098, 660660, 665124, 670322, 676770, 684989, 695191, 707322, 720882, 734809, 748001, 759829, 769855, 777396, 781915, 783637, 783277, 781400, 778514, 775393, 772634, 770108, 767489, 765086, 763444, 762358, 761028, 759036, 756465, 753233, 749102, 744220, 738868, 732783, 725531, 717439, 709327, 701464, 693651, 686201, 679769, 674191, 668579, 662709, 657323, 652807]
61086F52807m198m327m095l443k894k412j548m00O31J616K689L425L616M091N626
61071F51184P475Q256P910P545P728Q106Q521R244J0126J0625J0682J0704J0749
61058G68855J0437R621Q527P425O614O310O114N238L857L343M543O640Q465R962
61044H65951J1511J2933J4185J5977J8561K1029K2872K4941K7701L0161L1948
61033A097770L4724L9564M4596M7626M9652N3154N8107O2471O5628O8459P0833
61022A692584P2195P4134P9185Q7335R6632J06884J19627J34727J50397J66656
61012B780356J85872K10337K42583K87109L47620M23349N12849O20378P52470
61003F362923R09183J086297J284919J507386J742897J973928K202016K438801
$$ y = [652807, 648609, 644282, 640187, 636744, 633850, 631438, 629890, 629490, 630121, 631737, 634426, 637851, 641467, 645558, 651184, 658659, 666915, 674825, 682370, 690098, 698204, 706725, 715969, 726095, 736720, 747402, 758106, 768855, 779292, 788913, 797440, 804865, 811479, 817789, 823903, 829141, 832998, 836341, 840884, 847524, 855989, 865951, 877462, 890395, 904580, 920557, 939118, 960147, 983019, 1007960, 1035661, 1065822, 1097770, 1132494, 1172058, 1216654, 1264280, 1313932, 1367086, 1425193, 1487664, 1553292, 1621751, 1692584, 1764779, 1838913, 1918098, 2005433, 2102065, 2208949, 2328576, 2463303, 2613700, 2780356, 2966228, 3176565, 3419148, 3706257, 4053877, 4477226, 4990075, 5610453, 6362923, 7272106, 8358403, 9643322, 11150708, 12893605, 14867533, 17069549, 19508350]
60995A9508350K639530K660004K337188J653952Q11506J03961k88847l78949k69230
60986B8777465l6784K50677M47723L48868j55032r50154j759552k335721k595276
60977B1992214k597174k440836k202419j932790j668164j427643j213810j024657
60969G484721q61031p22604o05046n04985m22841l58365l07630k66587k33833
60960C201799k08044j86195j66434j49696j36620j25403j14357j04047r5147q6579
60950A829277p7569o9545o4106o0716n7871n4968n1693m7236m1631l6397l2473
60939A235072k8871k4689k0910j8808j7902j7045j6271j6047j5759j4611j3186
60928A030973j2558j2507j2012j0950j0063r699r801j0528j1820j2794j2738j2238
$$ y = [19508350, 22147880, 24807884, 27145072, 28799024, 29610530, 29714491, 29425644, 29046695, 28777465, 28740681, 28991358, 29439081, 29787949, 29632917, 28682763, 26923211, 24587490, 21992214, 19395040, 16954204, 14751785, 12818995, 11150831, 9723188, 8509378, 7484721, 6623690, 5901086, 5296040, 4791055, 4368214, 4009849, 3702219, 3435632, 3201799, 2993755, 2807560, 2641126, 2491430, 2354810, 2229407, 2115050, 2011003, 1915856, 1829277, 1751708, 1682163, 1618057, 1557341, 1499470, 1444502, 1392809, 1345573, 1303942, 1267545, 1235072, 1206201, 1181512, 1160602, 1141794, 1123892, 1106847, 1090576, 1074529, 1058770, 1044159, 1030973, 1018415, 1005908, 993896, 982946, 972883, 963184, 953383, 942855, 931035, 918241, 905503, 893265]
60916H93265j2293j2809j3003j2767j2442j1795j0461r077q626q855q613p705
60904G64819p128p333p467o738n459m375l767l629l957m423m455m029l810m027
60890F94222l885k712j133l02k91j16O54J272J044M29K75N43N15Mm72p23j262
60873F88062k330l309l556l342l315l461l230k479j648j011l77M07J123J438J189
60858F64161L99o99j645k087k099j960j693j157m85j62p08k411n117p995r859
60843F26483j0163r534q893q352p447o172n126m664m466l994k987j512M4J142
60829E54359J538J495J248O46l17j002p52J84J044J615K211K802K917K459J977
60814E72424J984K521L277L757L412K170P14j52k91k1M47Q33O14k39q54o08k13
$$ y = [893265, 880972, 868163, 855160, 842393, 829951, 818156, 807695, 798618, 789992, 781137, 772524, 764819, 757691, 750358, 742891, 736153, 730694, 726319, 722552, 718923, 714966, 710543, 706088, 702059, 698249, 694222, 690337, 687625, 686492, 686190, 685899, 685783, 686437, 687709, 688753, 689182, 689457, 690000, 690515, 690519, 690047, 689324, 688062, 685732, 682423, 678867, 675525, 672210, 668749, 665519, 663040, 661392, 660381, 660004, 660411, 661534, 662972, 664161, 664560, 663861, 662216, 660129, 658030, 656070, 654377, 653220, 652735, 652573, 651865, 649454, 644337, 636342, 626483, 616320, 606786, 597893, 589541, 582094, 575922, 570796, 566132, 561666, 557672, 554685, 553173, 553217, 554359, 555897, 557392, 558640, 559286, 558969, 557967, 557215, 557399, 558443, 560058, 562269, 565071, 567988, 570447, 572424, 574408, 576929, 580206, 583963, 587375, 589545, 590259, 590107, 589816, 589795, 590242, 591075, 591689, 591450, 590596, 589988, 589775]
60797E89775o87j767k459k718l257l983m111l722l689l985l689k878k898m215
60783E45717n547n760n274m842m299l399k692k551k330j462n13j77j00L52Q88
60768E08011Q95N52L98L11j17o65q02m66J74J231K557L307K880J891J382J548
60752E23087J957K391K636K063M45j238j901j880k317l390m217m394m413m549
60738E04280m418l824l141k699k491k608l230m029m278l770l059k742k916l395
60724D57680l907m121l940l804m129m582m437l639k865k553k480k369k278k220
60710D10356j944j314n07K84R62J360J326J076R95J074R77P02P12J235J885K187
60694D21366K182K286K736L317L578L338K976L084L731M330M423M167L830L298
$$ y = [589775, 589088, 587321, 584862, 582144, 578887, 574904, 570793, 567071, 563382, 559397, 555708, 552830, 549932, 545717, 540170, 534410, 529136, 524294, 519995, 516596, 513904, 511353, 509023, 507561, 507048, 506871, 506771, 507123, 508011, 508906, 509458, 509856, 510167, 510050, 509385, 508583, 508117, 508291, 509522, 512079, 515386, 518266, 520157, 521539, 523087, 525044, 527435, 530071, 532134, 532579, 531341, 529440, 527560, 525243, 521853, 517636, 513242, 508829, 504280, 499862, 496038, 492897, 490198, 487707, 485099, 481869, 477840, 473562, 469792, 466733, 463991, 461075, 457680, 453773, 449652, 445712, 441908, 437779, 433197, 428760, 425121, 422256, 419703, 417223, 414854, 412576, 410356, 408412, 407098, 406591, 406875, 407837, 409197, 410523, 411599, 412594, 413668, 414645, 415347, 416059, 417294, 419179, 421366, 423548, 425834, 428570, 431887, 435465, 438803, 441779, 444863, 448594, 452924, 457347, 461514, 465344, 468642]
60680D68642K618K484L383M560M675L544K325J921J980J756J194P08M15J19k14
60665E00110l50q3N42J185J395J051O87R82J883K523K225J219K30m49j145k252
60649E09753l664m801n159m789m192l734l351k908k585k651l064l565l960m098
60635D57232l814l232k915l191l549l197k155j288j262j926k741l297l376k961
60621D18328k376k062k039j828j054J47J299J894J588N10o11r63m59K44N29L83
60605D13530K11M16J162K182K833K685K081J741J829J866J512R69M73l2n05n98
60589D32355j75L09L47Q8P8M64Q19P78N49N85R27J102Q48O54J226K412L233L154
60571D49753K743K681K700K218J534J481K088K535K405K130K032J856J564J684
$$ y = [468642, 471260, 473744, 477127, 481687, 486362, 489906, 492231, 494152, 496132, 497888, 499082, 499790, 500205, 500324, 500110, 499760, 499677, 500219, 501404, 502799, 503850, 504537, 505519, 507402, 509925, 512150, 513369, 513599, 513150, 512005, 509753, 506089, 501288, 496129, 491340, 487148, 483414, 480063, 477155, 474570, 471919, 468855, 465290, 461330, 457232, 453418, 450186, 447271, 444080, 440531, 437334, 435179, 433891, 432629, 430703, 427962, 424665, 421289, 418328, 415952, 413890, 411851, 410023, 408969, 409116, 410415, 412309, 413897, 414407, 413796, 412833, 412374, 412618, 413147, 413530, 413741, 414157, 415319, 417501, 420334, 423019, 425100, 426841, 428670, 430536, 432048, 433017, 433490, 433458, 432953, 432355, 432180, 432489, 432836, 432924, 433002, 433466, 434285, 435063, 435612, 436197, 437124, 438226, 439074, 439728, 440954, 443366, 446599, 449753, 452496, 455177, 457877, 460095, 461629, 463110, 465198, 467733, 470138, 472268, 474300, 476156, 477720, 479404]
60557D79404K445L226L409L216L215L527M014M796O058P689R535J1682J4048J6237
60543E72501J8217K0708K4177K7969L1185L4225L8464M4332N0537N5437N8466
60532I76218N9810N9199N5693M8690L8609K6495J3116j221j5928k9562m0376m7482
60520A143261n1183n2126n0560m6622m1036l4951k9179k3817j8604j3447q534
60509G73202m049J15M345Q845J3379J7762K2464K8191L4712M0801M5629M9643
60497A035039N3349N5728N4747M9411M0609K9834J7847M963p904j9095k7089l1227
60485A256212l1681k8946k3487j5737o282M171J5083K6181L7182M7602N7057O5518
60473A402873P2839P7951P8884P3821O2216M4965K3686o3k4932m9238p0604q6553
$$ y = [479404, 481849, 485075, 488484, 491700, 494915, 498442, 502456, 507252, 513310, 520999, 530534, 542216, 556264, 572501, 590718, 611426, 635603, 663572, 694757, 728982, 767446, 811778, 862315, 917752, 976218, 1036028, 1095227, 1150920, 1199610, 1238219, 1264714, 1277830, 1276609, 1260681, 1231119, 1190743, 1143261, 1092078, 1039952, 989392, 942770, 901734, 866783, 837604, 813787, 795183, 781736, 773202, 769153, 769268, 773613, 782458, 795837, 813599, 836063, 864254, 898966, 939767, 985396, 1035039, 1088388, 1144116, 1198863, 1248274, 1288883, 1318717, 1336564, 1341527, 1333623, 1314528, 1287439, 1256212, 1224531, 1195585, 1172098, 1156361, 1150079, 1154250, 1169333, 1195514, 1232696, 1280298, 1337355, 1402873, 1475712, 1553663, 1632547, 1706368, 1768584, 1813549, 1837235, 1837172, 1812240, 1763002, 1692398, 1605845]
60461A605845r5829r8977r7574r3072q6534p8967p1191o3502n5872m8619m2388
60450G73320l7422l3236k9245k5343k1700j8295j4912j1533q466o130m728m027
60438E58283l426k430j071K00R95J099L65j062k367k585j733j038j581l084m362
60423E36203m662m087k953j449O1J019J310J570K497M004N307N706N183M332L965
60408E58006M681O510Q805J0671J1656J2090J2640J3628J4830J5931J6835J7518
60396G03801J7749J7269J6123J4604J2914J1111R373P902O589N121L632K794K929
60383H31911L373L220K476J935K000K188J934J225L17p14j687k075j624r94j141
60368H42344k062k654k036n59P13J234J306J352J360J154Q75Q43J061J156Q82
$$ y = [1605845, 1510016, 1411039, 1313465, 1220393, 1133859, 1054892, 983701, 920199, 864327, 815708, 773320, 735898, 702662, 673417, 648074, 626374, 608079, 593167, 581634, 573168, 567038, 562310, 558283, 554857, 552427, 551356, 551556, 552551, 553650, 554015, 552953, 550586, 548001, 546268, 545230, 543649, 540565, 536203, 531541, 527454, 524501, 523052, 523113, 524132, 525442, 527012, 529509, 533513, 538820, 544526, 549709, 554041, 558006, 562687, 569197, 578002, 588673, 600329, 612419, 625059, 638687, 653517, 669448, 686283, 703801, 721550, 738819, 754942, 769546, 782460, 793571, 802944, 810846, 817435, 822556, 826188, 828982, 831911, 835284, 838504, 840980, 842915, 844915, 847103, 849037, 850262, 850579, 849865, 848178, 846103, 844479, 843485, 842344, 840282, 837628, 835592, 835033, 835746, 836980, 838286, 839638, 840998, 842152, 843027, 843870, 844931, 846087, 846969]
60353H46969M57K35K05J18p1j76k82q01j961l504n120o820q554r781r929r140
60337G91845q095p085n792m127k745k457l354m787n936o253n681m793m468n032
60323G21240n878o167n791n295n058m956m788m579m352l950l233k254j210l31
60309F63398K02N59J339K997N171P014Q282R559J1301J3140J4417J4860J4285
60296G66524J2198Q439L862m11m349q724j3396j6818j7689j6432j4470j2573j0572
60283F75589q303o013l880j814J23J609K488K917L004K750K465K813M128O005
60269F83881P792R191J0181J0733J0922J1129J1709J2571J3410J4196J5073J5886
60257H26674J6216J5926J5343J4805J4349J3893J3383J2691J1732J0835J0695
$$ y = [846969, 847426, 847661, 847866, 847984, 847913, 847737, 847455, 846654, 844693, 841189, 836069, 829249, 820695, 810914, 800985, 791845, 783750, 776665, 770873, 766746, 764001, 761544, 758190, 753403, 747467, 741214, 735533, 730740, 726272, 721240, 715362, 709195, 703404, 698109, 693051, 688095, 683307, 678728, 674376, 670426, 667193, 664939, 663729, 663398, 663600, 664159, 665498, 668495, 673666, 680680, 688962, 698521, 709822, 722962, 737379, 752239, 766524, 778722, 787161, 791023, 790612, 786263, 777539, 764143, 747325, 729636, 713204, 698734, 686161, 675589, 667286, 661273, 657393, 655579, 655702, 657311, 659799, 662716, 665720, 668470, 670935, 673748, 677876, 683881, 691673, 700864, 711045, 721778, 732700, 743829, 755538, 768109, 781519, 795715, 810788, 826674, 842890, 858816, 874159, 888964, 903313, 917206, 930589, 943280, 955012, 965847, 976542]
60246I76542J1715J3562J5626J7705J9957K2349K4566K6493K8466L0958L4162
60235A222101L7998M2250M6573N0599N4266N8027O2411O7334P2062P5914P8842
60224A868377Q1139Q2822Q3490Q2754Q0459P6554P1111O4607N7805N1152M4446
60213B644716L7295K9689K1902J4068O282j086p488j2622j6450j8872j9769j9321
60201B658344j7918j5707j2631q841m594L39O583J4171K2177K9748L7071M4793
60189B753535N2837O0428O7085P2781P7112P9019P7745P3522O7025N8544M8185
60178C487818L6523K4420J2191n78j4233k8370m2040n4427o5175p4283q1740q7206
60166C112900r0017q9677q6412q0940p3720o4786n4405m3466l2799k2482j2245
$$ y = [976542, 988257, 1001819, 1017445, 1035150, 1055107, 1077456, 1102022, 1128515, 1156981, 1187939, 1222101, 1260099, 1302349, 1348922, 1399521, 1453787, 1511814, 1574225, 1641559, 1713621, 1789535, 1868377, 1949516, 2032338, 2115828, 2198582, 2279041, 2355595, 2426706, 2491313, 2549118, 2600270, 2644716, 2682011, 2711700, 2733602, 2747670, 2753952, 2752866, 2745378, 2732756, 2716306, 2697434, 2677665, 2658344, 2640426, 2624719, 2612088, 2603247, 2598653, 2598992, 2605575, 2619746, 2641923, 2671671, 2708742, 2753535, 2806372, 2866800, 2933885, 3006666, 3083778, 3162797, 3240542, 3314064, 3381089, 3439633, 3487818, 3524341, 3548761, 3560952, 3560374, 3546141, 3517771, 3475731, 3421304, 3356129, 3281846, 3200106, 3112900, 3022883, 2933206, 2846794, 2765854, 2692134, 2627348, 2572943, 2529477, 2496678, 2474196, 2461951]
60155B461951k230P152J5829K3751L0048L3365L3327L0947K7303K2435J6010Q415
60143B708303N67o963j4030k0415k5833l0208l3334l4629l3719l1106k7587k3221
60131B427825j7445j0099j635P521J7210K7210L7354M7935N9408P1723Q4612R8363
60119B849982J13413J29218J44418J58244J70850J82134J91276J97746K01680
60110D338961K02763J99779J91999J80227J65659J48451J28187J05105P9985N3380
60100E794496K5828j634k8141n3746p8619j01774j21646j37718j50591j60485
60090D985970j66708j68678j66665j61271j52988j42471j30509j17422j02950
60081C676308q7067p0388n3588l6914k0505m834R472K2045L2790M1726M8812N3703
$$ y = [2461951, 2459721, 2466873, 2482702, 2506453, 2536501, 2569866, 2603193, 2634140, 2661443, 2683878, 2699888, 2708303, 2708870, 2701907, 2687877, 2667462, 2641629, 2611421, 2578087, 2543458, 2509739, 2478633, 2451046, 2427825, 2410380, 2400281, 2398646, 2406167, 2423377, 2450587, 2487941, 2535876, 2595284, 2667007, 2751619, 2849982, 2963395, 3092613, 3237031, 3395275, 3566125, 3748259, 3939535, 4137281, 4338961, 4541724, 4741503, 4933502, 5113729, 5279388, 5427839, 5556026, 5661131, 5741116, 5794496, 5820324, 5818690, 5790549, 5736803, 5658184, 5556410, 5434764, 5297046, 5146455, 4985970, 4819262, 4650584, 4483919, 4322648, 4169660, 4027189, 3896680, 3779258, 3676308, 3589241, 3518853, 3465265, 3428351, 3407846, 3403012, 3412484, 3434529, 3467319, 3509045, 3557857, 3611560]
60069C611560N5737N4383M9750M2407L2839K1507R135l536j6291k9157m1619n2747
60057C733968o2217p0565p8147q4442q8765r1260r2603r2964r1762q8416q2977
60046B809850p5870o7384n7634m6931l5852k4793j3619k006J0027K2084L3787
60035B551659M4874N5054O4196P2453P9595Q4396Q5557Q3310P9127P3556O5564
60024C339341N4517M1599K8334J4785M49j4014k7373l9526n1075o1666p0369p7267
60012C137735q2995q6738q6680q2715p6952p0938o4067n5413m5503l5269k4664
60001B425801j3484k377Q245J9193L1132M3034N3505O2941P2926Q3798R4206J02962
59989B981882J09967J15244J18206J18263J15311J09368J00365Q8547P4515N8814
$$ y = [3611560, 3667297, 3721680, 3771430, 3813837, 3846676, 3868183, 3877318, 3873782, 3857491, 3828334, 3786715, 3733968, 3671751, 3601186, 3523039, 3438597, 3349832, 3258572, 3165969, 3073005, 2981243, 2892827, 2809850, 2733980, 2666596, 2608962, 2562031, 2526179, 2501386, 2487767, 2485761, 2495788, 2517872, 2551659, 2596533, 2651587, 2715783, 2788236, 2867831, 2952227, 3037784, 3121094, 3200221, 3273777, 3339341, 3393858, 3435457, 3463791, 3478576, 3479025, 3465011, 3437638, 3398112, 3347037, 3285371, 3215002, 3137735, 3054740, 2968002, 2881322, 2798607, 2721655, 2650717, 2586650, 2531237, 2485734, 2450465, 2425801, 2412317, 2409940, 2418185, 2437378, 2468510, 2511544, 2565049, 2627990, 2700916, 2784714, 2878920, 2981882, 3091849, 3207093, 3325299, 3443562, 3558873, 3668241, 3768606, 3857153, 3931668, 3990482]
59979C990482M1871K4394P198r406k5629m1511n6615p0360q2178r1264r6794r8472
59967C491716r6652r1867q4530p5134o4324n2655m0463k8051j5707l569Q417K0319
59955B967500L2042M3186N3059O1064O7197P1863P5110P6366P5193P1894O7121
59944C661595O1237N4445M7158L9763L2358K5115J8554J2937P784K676j614l570
59932C958438k445J260O889J4542K4737L7585N2602O9048Q6354J04325J22944
59921D476279J41818J59981J76446J90684K02169K09694K11705K07322J96595
59912F172693J79788J56882J27916R3435N4544J2899k9209o9136j04545j33911
59902F461356j56473j71999j80531j82306j77938j68720j56394j42205j26327
$$ y = [3990482, 4032353, 4056747, 4063945, 4054539, 4028910, 3987399, 3930784, 3860424, 3778246, 3686982, 3590188, 3491716, 3395064, 3303197, 3218667, 3143533, 3079209, 3026554, 2986091, 2958040, 2942333, 2938764, 2947181, 2967500, 2999542, 3042728, 3095787, 3156851, 3224048, 3295911, 3371021, 3447387, 3522580, 3594474, 3661595, 3722832, 3777277, 3824435, 3864198, 3896556, 3921671, 3940225, 3953162, 3960946, 3963622, 3962008, 3958438, 3955993, 3957253, 3964142, 3978684, 4003421, 4041006, 4093608, 4162656, 4249010, 4353335, 4476279, 4618097, 4778078, 4954524, 5145208, 5347377, 5557071, 5768776, 5976098, 6172693, 6352481, 6509363, 6637279, 6730714, 6785258, 6798157, 6768948, 6699812, 6595267, 6461356, 6304883, 6132884, 5952353, 5770047, 5592109, 5423389, 5266995, 5124790, 4998463]
59893D998463j08517q9139o9105m8919k8370p137J4629L6536N8291P9640J00100
59882D936472J18953J35446J48964J58957J64538J64175J56080J39239J14096
59873F236920Q2338M6310Q683k7957o1757r1745j17260j37621j52625j62917j69335
59862E453034j72242j71830j68577j62855j54503j43442j30386j16265j01263
59853D131671q5096o7970n0455l2694j4678K845J8725L2747M5649N7620O7703
59842D106067P5048Q0012Q3559Q6192Q7716Q7454Q4208P6468O3210M4484K1424
59831D895842l760k7978m8345o3622p4231q0886q3944q4212q3332q2726q2696
59820D180110q3006q3687q4657q5156q4334q2102p8855p4733o9703o4141n8770
$$ y = [4998463, 4889946, 4800807, 4731702, 4682783, 4654413, 4647276, 4661905, 4698441, 4756732, 4836372, 4936472, 5055425, 5190871, 5339835, 5498792, 5663330, 5827505, 5983585, 6122824, 6236920, 6319258, 6365568, 6374251, 6346294, 6284537, 6192792, 6075532, 5937911, 5785286, 5622369, 5453034, 5280792, 5108962, 4940385, 4777530, 4623027, 4479585, 4349199, 4232934, 4131671, 4046575, 3978605, 3928150, 3895456, 3880778, 3883623, 3902348, 3935095, 3980744, 4038364, 4106067, 4181115, 4261127, 4344686, 4430878, 4518594, 4606048, 4690256, 4766724, 4829934, 4874418, 4895842, 4892082, 4864104, 4815759, 4752137, 4677906, 4597020, 4513076, 4428864, 4345532, 4262806, 4180110, 4097104, 4013417, 3928760, 3843604, 3759270, 3677168, 3598313, 3523580, 3453877, 3389736, 3330966]
59809C330966n4174n0660m8313m6800m5519m4280m3447m2866m1305l7654l2352
59798B843596k6747k1267j5025p173K267J2950K4856L8025N2380O8075Q5604J05130
59786C162671J26005J47123J67373J85521K00024K09230K11473K04602J85855
59777D799877J52960J06064M8813j2264o9723j17426j51952j72752j81226j79654
59767D222717j70598j56709j40417j23358j06125q8769p1690n5859m2096l0334
59757C236762j9954j0689k714M115J0597J7332K3942K9648L4450L9249M4846N1304
59745C458888N8358O5931P4070Q2746R2096J02623J14767J28358J42806J57844
59735D478487J73811J91162K09872K29401K49008K67971K85727L01979L16429
$$ y = [3330966, 3276792, 3226132, 3177819, 3131019, 3085500, 3041220, 2997773, 2954907, 2913602, 2875948, 2843596, 2816849, 2795582, 2780557, 2773384, 2775651, 2788601, 2813457, 2851482, 2903862, 2971937, 3057541, 3162671, 3288676, 3435799, 3603172, 3788693, 3988717, 4197947, 4409420, 4614022, 4799877, 4952837, 5058901, 5107714, 5095450, 5025727, 4908301, 4756349, 4583597, 4402371, 4222717, 4052119, 3895410, 3754993, 3631635, 3525510, 3436741, 3365051, 3309192, 3267096, 3236762, 3216808, 3206119, 3203405, 3207520, 3218117, 3235449, 3259391, 3289039, 3323489, 3362738, 3407584, 3458888, 3517246, 3583177, 3657247, 3739993, 3832089, 3934712, 4049479, 4177837, 4320643, 4478487, 4652298, 4843460, 5053332, 5282733, 5531741, 5799712, 6085439, 6387418, 6703847]
59726F703847L28114L35171L35787L29499L17252L00177K78913K54586K29889
59717I413235K08342J92348J82313J77616J77732J82130J89609J98223K05839
59708A1127387K10546K10904K06187J96463J82269J64231J43035J19487R4405
59699A2654914O8647M3465K0583J527j3064k3129k8220k7311j9657n467J4485
59688A2686773L9582O9359J03068J39743J78734K19661K61670L03053L41887L76695
59678A4720225M06165M28432M41185M42405M30591M04258L61963L03219K29260
59669A8167703J42788M7430n2322j51233k44161l26798l95602m47694m81765m98986
59659A5759360n02376m95222m80707m62948m47297m38810m40438m52493m72979
$$ y = [6703847, 7031961, 7367132, 7702919, 8032418, 8349670, 8649847, 8928760, 9183346, 9413235, 9621577, 9813925, 9996238, 10173854, 10351586, 10533716, 10723325, 10921548, 11127387, 11337933, 11548837, 11755024, 11951487, 12133756, 12297987, 12441022, 12560509, 12654914, 12723561, 12767026, 12787609, 12789136, 12776072, 12752943, 12724723, 12697412, 12677755, 12672288, 12686773, 12726355, 12795714, 12898782, 13038525, 13217259, 13436920, 13698590, 14001643, 14343530, 14720225, 15126390, 15554822, 15996007, 16438412, 16869003, 17273261, 17635224, 17938443, 18167703, 18310491, 18357921, 18305599, 18154366, 17910205, 17583407, 17187805, 16740111, 16258346, 15759360, 15256984, 14761762, 14281055, 13818107, 13370810, 12932000, 12491562, 12039069, 11566090]
59650A1566090m97701n20710n35991n39745n31522n13548m89084m60965m30970
59641G045854m00042l68934l38467l09392k82132k56755k33023k10592j89439
59632D457078j70055j52851j37292j22168j06889r2178p9196o8378n9400n1879
59622C416792m5675m0758l7183l5047l4020l3217l1986l0727l0372l1071l1984
59611C034752l2518l3180l4826l7402l9932m1565m2195m2090m1336l9905l7959
59600B611844l5743l3282l0516k7818k5942k5192k4886k3996k2268k0295j8514
59589B323392j6615j4075j0886p449m017o01K721N795Q622J1356J4021J6487J8717
59576B347468K0863K3114K5586K8391L1649L5377L9507M4071M9228N4995O1046
$$ y = [11566090, 11068389, 10547679, 10011688, 9471943, 8940421, 8426873, 7937789, 7476824, 7045854, 6645812, 6276878, 5938411, 5629019, 5346887, 5090132, 4857109, 4646517, 4457078, 4287023, 4134172, 3996880, 3874712, 3767823, 3675645, 3596449, 3528071, 3468671, 3416792, 3371117, 3330359, 3293176, 3258129, 3224109, 3190892, 3158906, 3128179, 3097807, 3066736, 3034752, 3002234, 2969054, 2934228, 2896826, 2856894, 2815329, 2773134, 2731044, 2689708, 2649803, 2611844, 2576101, 2542819, 2512303, 2484485, 2458543, 2433351, 2408465, 2384469, 2362201, 2341906, 2323392, 2306777, 2292702, 2281816, 2274367, 2270350, 2269749, 2272470, 2278265, 2286887, 2298243, 2312264, 2328751, 2347468, 2368331, 2391445, 2417031, 2445422, 2477071, 2512448, 2551955, 2596026, 2645254, 2700249, 2761295]
59565B761295O6903P2342P7573Q2996Q8799R4853J00938J06943J12816J18476
59555C683934J23825J28805J33305J37024J39494J40230J38917J35598J30540
59546D891672J23511J13093R7318P5641N0184K4559J492j8233l4964m9325o2134
59535E212814p4161q5268r4276j00238j03504j05016j04791j01742r4941q4638
59525D264239p1904n7642m2042k4726n351J5764L7619N9282Q0647J02107J23383
59514D481376J42962J59002J70566J77557J79308J73875J59341J35821J05562
59505E885370P0964L3095p441m8859q8353j23701j53890j78174j95510k05305
59495D988196k08025k04614j95846j82733j66913j49888j32099j13375r4032p4932
$$ y = [2761295, 2828198, 2900540, 2978113, 3061109, 3149908, 3244761, 3345699, 3452642, 3565458, 3683934, 3807759, 3936564, 4069869, 4206893, 4346387, 4486617, 4625534, 4761132, 4891672, 5015183, 5128276, 5225594, 5301235, 5351419, 5375978, 5377470, 5359237, 5324273, 5274948, 5212814, 5138653, 5053385, 4959109, 4858871, 4755367, 4650351, 4545560, 4443818, 4348877, 4264239, 4192335, 4134693, 4092651, 4067925, 4062574, 4078338, 4115957, 4175239, 4255886, 4357993, 4481376, 4624338, 4783340, 4953906, 5131463, 5310771, 5484646, 5643987, 5779808, 5885370, 5956334, 5989429, 5981988, 5933129, 5844776, 5721075, 5567185, 5389011, 5193501, 4988196, 4780171, 4575557, 4379711, 4196978, 4030065, 3880177, 3748078, 3634703, 3540671, 3465739]
59485C465739n6578l8754k1151l840J2934K8927M3749N6969O8484P8531Q7078
59474C722088R3451R6751R6418R2327Q4517P3146N8641M1611K2482J367k1437
59463D361362m4766o6789q6148j02742j17029j28748j36947j41274j42482j41453
59453C252984j38395j33465j27520j21465j15267j08409j01069r3986q7273q0278
59443B145857p2867o5864n9903n4517m8902m2995l7204l1580k5977k0718j6355
59432A668975j2808r352n465j156L536Q552J3184J6262J7618J8706K0874K3198
59420A762124K3018J8889J2353O451L136K499L819O487J0065J4294J9187K4501
59408A906823K8915L0420K8013K2873J7586J4396J4258J6995K1750K7393L3062
$$ y = [3465739, 3409161, 3370407, 3349256, 3345416, 3358350, 3387277, 3431026, 3487995, 3556479, 3635010, 3722088, 3815539, 3912290, 4008708, 4101035, 4185552, 4258698, 4317339, 4358950, 4381432, 4382799, 4361362, 4316596, 4249807, 4163659, 4060917, 3943888, 3815140, 3678193, 3536919, 3394437, 3252984, 3114589, 2981124, 2853604, 2732139, 2616872, 2508463, 2407394, 2313408, 2226135, 2145857, 2072990, 2007126, 1947223, 1892706, 1843804, 1800809, 1763605, 1732025, 1706048, 1685330, 1668975, 1656167, 1646815, 1641350, 1640194, 1643730, 1652282, 1665466, 1681728, 1699346, 1718052, 1738926, 1762124, 1785142, 1804031, 1816384, 1822835, 1825971, 1828470, 1832289, 1838776, 1848841, 1863135, 1882322, 1906823, 1935738, 1966158, 1994171, 2017044, 2034630, 2049026, 2063284, 2080279, 2102029, 2129422, 2162484]
59397B162484L8628M4491N0892N7529O3933P0020P6182Q2780Q9714R6547J03033
59386B936233J09275J15343J20930J25713J29873J33957J38392J43518J50093
59377D103327J59244J71704J87397K05900K26884K49833K73636K96782L17808
59368F192515L35384L48200L55141L55496L48990L35856L17175K94782K70443
59359I153982K45089K18894J91864J64001J35027J04246P0768L3797p044n1452
59349A0259172r8607j47673j97837k47572k94193l34696l67027l90302m03961
59340G777304m07480m01134l86705l66951l44348l20372k95867k71755k49288
59331D733404k29522k12718j98328j85613j74140j63662j53753j43847j33699
$$ y = [2162484, 2201112, 2245603, 2296495, 2354024, 2417957, 2487977, 2564159, 2646939, 2736653, 2833200, 2936233, 3045508, 3160851, 3281781, 3407494, 3537367, 3671324, 3809716, 3953234, 4103327, 4262571, 4434275, 4621672, 4827572, 5054456, 5304289, 5577925, 5874707, 6192515, 6527899, 6876099, 7231240, 7586736, 7935726, 8271582, 8588757, 8883539, 9153982, 9399071, 9617965, 9809829, 9973830, 10108857, 10213103, 10283871, 10317668, 10310624, 10259172, 10160565, 10012892, 9815055, 9567483, 9273290, 8938594, 8571567, 8181265, 7777304, 7369824, 6968690, 6581985, 6215034, 5870686, 5550314, 5254447, 4982692, 4733404, 4503882, 4291164, 4092836, 3907223, 3733083, 3569421, 3415668, 3271821, 3138122]
59322C138122j23598j14011j05092r6640q8526q0965p4127o7687o1095n4377m8201
59311B223803m2960l8110l2898k7342k1992j6953j1766o180l95N429J1240J6705
59299B058581K1483K6047L1172L6237L8876L7277L2419K7316K4350K3962K5612
59288B383332K8968L3884L9833M5892N1282N5691N9050O0965O0582N7302N1489
59277B928270M4035L5248K4769J2658j13j2637k4788l6489m6908n5132o1260o5970
59265B741683o9347p0902p0664o9422o7782o5700o3064o0118n7044n3622m9596
59254B044422m5087m0363l5474l0324k4972j9655j4610r964n785k159R74M006
59242A821009P523J1657J5725J8889K1157K3337K6019K9165L2740L6959M1621
$$ y = [3138122, 3014524, 2900513, 2795421, 2698781, 2610255, 2529290, 2455163, 2387476, 2326381, 2272004, 2223803, 2180843, 2142733, 2109835, 2082493, 2060501, 2043548, 2031782, 2025602, 2025207, 2030636, 2041876, 2058581, 2080064, 2106111, 2137283, 2173520, 2212396, 2249673, 2282092, 2309408, 2333758, 2357720, 2383332, 2412300, 2446184, 2486017, 2531909, 2583191, 2638882, 2697932, 2758897, 2819479, 2876781, 2928270, 2972305, 3007553, 3032322, 3044980, 3044867, 3032230, 3007442, 2970953, 2924045, 2868913, 2807653, 2741683, 2672336, 2601434, 2530770, 2461348, 2393566, 2327866, 2264802, 2204684, 2147640, 2094018, 2044422, 1999335, 1958972, 1923498, 1893174, 1868202, 1848547, 1833937, 1823973, 1818188, 1816029, 1817003, 1821009, 1828532, 1840189, 1855914, 1874803, 1895960, 1919297, 1945316, 1974481, 2007221, 2044180, 2085801]
59231B085801M5962M9746N4001N9902O7396P5585Q4205R3936J05412J18586J33114
59220B973646J48649J64696J80635J96054K10733K24130K35066K41885K42872
59211D818366K36673K22628K00648J70926J34052R1404M4874l839n3089j00401
59201E762242j42690j77814k05219k24718k35721k38433k34702k26550k14565
59192C861830j98978j81528j64673j49178j33966j18403j03238q9184p5922o3116
59182B583644n1262m0927l1950k3908j6792j0665n247l05L804O235O036K606l783
59169B417486j1912k0560k9400l8523m7350n4888o0819o5417o8401o8913o6806
59158A884497o3123n9029n4958n0860m6549m1694l6264l1018k6708k2939j8775
$$ y = [2085801, 2131763, 2181509, 2235510, 2295412, 2362808, 2438393, 2522598, 2616534, 2721946, 2840532, 2973646, 3122295, 3286991, 3467626, 3663680, 3874413, 4098543, 4333609, 4575494, 4818366, 5055039, 5277667, 5478315, 5649241, 5783293, 5874697, 5919571, 5915732, 5862643, 5762242, 5619552, 5441738, 5236519, 5011801, 4776080, 4537647, 4302945, 4076395, 3861830, 3662852, 3481324, 3316651, 3167473, 3033507, 2915104, 2811866, 2722682, 2646760, 2583644, 2532382, 2491455, 2459505, 2435597, 2418805, 2408140, 2402893, 2402588, 2406392, 2412627, 2418663, 2421269, 2417486, 2405574, 2385014, 2355614, 2317091, 2269741, 2214853, 2154034, 2088617, 2020216, 1951303, 1884497, 1821374, 1762345, 1707387, 1656527, 1609978, 1568284, 1532020, 1501002, 1474294, 1451355, 1432580]
59147A432580j4456j1138q866o274k740O59L101N418Q475J1403J2864J3156J3586
59134A457768J4285J4133J2708J0896R500Q382P275O447O136N949N358M448L823
59121A567108L937M733N782O621P095P523Q503J0396J2837J4805J5519J5336J5420
59108A695615J6294J7211J7397J7374J8207J9798K0962K1216K1464K2606K4494
59097A912638K6658K9278L2784L6915M0830M3971M6498M9034N1953N4737N6128
59086B381424N5348N2871M9399M4508L7323K8221J8529Q552k636j5092k7204l7619
59074B593624m6592n4580o0801o4421o6082o6981o7128o5819o3232o0306n7408
59063A920274n4284n1084m8266m5673m2698l9373l6395l4068l2000k9819k7483
$$ y = [1432580, 1418124, 1406986, 1398120, 1391846, 1389106, 1389765, 1392866, 1398284, 1406759, 1418162, 1431026, 1444182, 1457768, 1472053, 1486186, 1498894, 1509790, 1519290, 1527672, 1534947, 1541394, 1547530, 1553479, 1558837, 1563285, 1567108, 1571045, 1575778, 1581560, 1588181, 1595276, 1602799, 1611302, 1621698, 1634535, 1649340, 1664859, 1680195, 1695615, 1711909, 1729120, 1746517, 1763891, 1782098, 1801896, 1822858, 1844074, 1865538, 1888144, 1912638, 1939296, 1968574, 2001358, 2038273, 2079103, 2123074, 2169572, 2218606, 2270559, 2325296, 2381424, 2436772, 2489643, 2539042, 2583550, 2620873, 2649094, 2667623, 2676175, 2673539, 2658447, 2631243, 2593624, 2547032, 2492452, 2431651, 2367230, 2301148, 2234167, 2167039, 2101220, 2037988, 1977682, 1920274, 1865990, 1814906, 1766640, 1720967, 1678269, 1638896, 1602501, 1568433, 1536433, 1506614, 1479131]
59052A479131k4857k1659j7963j4286j1190r074q090p947q001q003q411r569j1102
59039A318979j2518j3963j5601j6783j6678j5446j3922j2393j0532q390o568n256
59027A170929l903k087j51J262J925K153K485L280M510N947P611R720J2116J4232
59013A230029J5860J7374J8960K0284K1448K3438K6887L1018L4787L8440M2917
59002A521442M8055N2656N6206N9346O2387O4432O4346O1920N7619N1722M4056
58991B144187L4380K2877J0441j535j1962k0645k7954l4141l9149m2797m4730
58980A988972m4677m3147m1454m0443l9557l7794l5183l2479k9777k6388k2085
58969A595988j7599j3713j0519p649m717j422K218N645Q143R481R913R743R229
$$ y = [1479131, 1454274, 1432615, 1414652, 1400366, 1389176, 1380102, 1372012, 1364065, 1356064, 1348061, 1339650, 1330081, 1318979, 1306461, 1292498, 1276897, 1260114, 1243436, 1227990, 1214068, 1201675, 1191143, 1182753, 1176185, 1170929, 1167026, 1164939, 1164788, 1166050, 1167975, 1170128, 1172613, 1175893, 1180403, 1186350, 1193961, 1203681, 1215797, 1230029, 1245889, 1263263, 1282223, 1302507, 1323955, 1347393, 1374280, 1405298, 1440085, 1478525, 1521442, 1569497, 1622153, 1678359, 1737705, 1800092, 1864524, 1928870, 1990790, 2048409, 2100131, 2144187, 2178567, 2201444, 2211885, 2210350, 2198388, 2177743, 2149789, 2115648, 2076499, 2033702, 1988972, 1944295, 1901148, 1859694, 1819251, 1779694, 1741900, 1706717, 1674238, 1644461, 1618073, 1595988, 1578389, 1564676, 1554157, 1546508, 1541791, 1540369, 1542587, 1548232, 1556375, 1565856, 1575769, 1585512, 1594741]
58956A594741Q738Q538Q578Q806R428J0529J1875J3457J5621J8163J9985K0540
58944A748999K1009K2978K6346K9665L2288L5029L8762M3550M9195N5568O2061
58933B165450O7687P1996P5176P7130P7101P4451O9112O1380N2059M2882L5910
58922B870334L2221L1712L4073L9073M6012N3873O2379P1951Q2519R3248J03834
58911C521229J15073J27695J41341J55259J69353J84020J99331K14830K29857
58902E057988K43835K56539K68080K78279K86056K89991K89523K85146K77659
58893G533096K67874K56691K44357K29494K09901J84492J53742J18354P8871L6823
58883I313695n166m5295q3624j20531j55104j85894k12381k34690k52593k65807
$$ y = [1594741, 1603479, 1612017, 1620595, 1629401, 1638829, 1649358, 1661233, 1674690, 1690311, 1708474, 1728459, 1748999, 1770008, 1792986, 1819332, 1848997, 1881285, 1916314, 1955076, 1998626, 2047821, 2103389, 2165450, 2233137, 2305133, 2380309, 2457439, 2534540, 2608991, 2678103, 2739483, 2791542, 2834424, 2870334, 2902555, 2934267, 2968340, 3007413, 3053425, 3107298, 3169677, 3241628, 3324147, 3417395, 3521229, 3636302, 3763997, 3905338, 4060597, 4229950, 4413970, 4613301, 4828131, 5057988, 5301823, 5558362, 5826442, 6104721, 6390777, 6680768, 6970291, 7255437, 7533096, 7800970, 8057661, 8302018, 8531512, 8741413, 8925905, 9079647, 9198001, 9276872, 9313695, 9308529, 9263234, 9179610, 9059079, 8903975, 8718081, 8505700, 8271010, 8018417, 7752610]
58873G752610k74873k80666k83317k82450k78308k71932k64289k55871k46912
58864E313992k37378k26761k14595k01281j87991j75712j64607j54215j43850
58855C607602j32991j21752j10973j01487r3250q5510p7818p0431o3622n6983
58845B692785m9915m2616l6148l1232k7288k3086j8174j3109q391l870N51M461
58833B443968P776J1397J6153K1574K6489L0660L4852L9551M4521M9523N4492
58822B780956N8936O2118O4137O5925O8021P0177P2489P5921Q1227Q8082R5829
58811C583818J04470J14381J25608J37876J51024J64972J79603J94878K10677
58802D967307K26413K41248K54807K67094K77587K85090K88701K88244K83452
$$ y = [7752610, 7477737, 7197071, 6913754, 6631304, 6352996, 6081064, 5816775, 5560904, 5313992, 5076614, 4849853, 4635258, 4433977, 4245986, 4070274, 3905667, 3751452, 3607602, 3474611, 3352859, 3241886, 3140399, 3047149, 2961639, 2883821, 2813390, 2749768, 2692785, 2642870, 2600254, 2564106, 2532874, 2505586, 2482500, 2464326, 2451217, 2442826, 2438956, 2439507, 2443968, 2451744, 2463141, 2479294, 2500868, 2527357, 2558017, 2592869, 2632420, 2676941, 2726464, 2780956, 2839892, 2902010, 2966147, 3032072, 3100093, 3170270, 3242759, 3318680, 3399907, 3487989, 3583818, 3688288, 3802669, 3928277, 4066153, 4217177, 4382149, 4561752, 4756630, 4967307, 5193720, 5434968, 5689775, 5956869, 6234456, 6519546, 6808247, 7096491, 7379943]
58793G379943K73457K57594K36102K09621J78512J43231J04917O5177K5519j2731
58783H861342m8439q0922j09881j34983j56257j75264j95173k18892k46868k76596
58773G218067l03721l23710l33575l33072l24287l09877k91849k71796k51263
58764D474917k31323k12316j94384j77837j62699j48506j35065j22856j12184
58755B977747j02452r2780q3033p3732o5216n7371m9933m2667l5435k8429k2104
58744B324595j6694j1926p344k689K096O811J0960J4199J6919J9853K2964K5123
58732B404867K4931K1446J4270L816q352k0215l0665l9604m6838n1792n4651n6722
58720B160491n9090o1496o2980o3052o1795n9515n6589n3205m8956m3285l6450
$$ y = [7379943, 7653400, 7910994, 8147096, 8356717, 8535229, 8678460, 8783377, 8848554, 8874073, 8861342, 8812903, 8731981, 8622100, 8487117, 8330860, 8155596, 7960423, 7741531, 7494663, 7218067, 6914346, 6590636, 6257061, 5923989, 5599702, 5289825, 4997976, 4726180, 4474917, 4243594, 4031278, 3836894, 3659057, 3496358, 3347852, 3212787, 3089931, 2977747, 2875295, 2782515, 2699482, 2625750, 2560534, 2503163, 2453230, 2410563, 2375128, 2346699, 2324595, 2307901, 2295975, 2288631, 2285942, 2288038, 2294849, 2305809, 2320008, 2336927, 2356780, 2379744, 2404867, 2429798, 2451244, 2465514, 2469330, 2460978, 2440763, 2410098, 2370494, 2323656, 2271864, 2217213, 2160491, 2101401, 2039905, 1976925, 1913873, 1852078, 1792563, 1735974, 1682769, 1633813, 1590528, 1554078]
58709A554078k9323k2199j4776p398j201L406P138J0089J0757P567N79r015j9969
58696A489733l0785l9506m4876m7179m7184m4988m0589l4736k8299k1547j4867
58685A095177r273n203j551K978Q162J2900J6822K0238K3212K5920K9303L4025
58673A252710L9292M3965M8467N4121O0909O7123P1083P1626O6900N4290L2577
58662A863063L704k7691n6164p7379q9570r3782r2373q7219p9468p0411o1455
58651A131255n3285m5803l8862l2520k6724k1433j6906j3303j0204p252m886l693
58639H56384l266k601j391j30R76K220L532M276M128L555L308L835N157O828Q189
58624H95000R076J0084J1779J3979J6239J8459K0514K1962K2862K4296K7193L1067
$$ y = [1554078, 1524755, 1502556, 1487780, 1480382, 1479181, 1482587, 1489725, 1499814, 1510571, 1518138, 1518717, 1509702, 1489733, 1458948, 1419442, 1374566, 1327387, 1280203, 1235215, 1194626, 1159890, 1131591, 1110044, 1095177, 1085904, 1080701, 1079150, 1082128, 1090290, 1103190, 1120012, 1140250, 1163462, 1189382, 1218685, 1252710, 1292002, 1335967, 1384434, 1438555, 1499464, 1566587, 1637670, 1709296, 1776196, 1830486, 1863063, 1866767, 1839076, 1782912, 1705533, 1615963, 1522181, 1429808, 1342589, 1263121, 1192710, 1131255, 1077970, 1032167, 993305, 960785, 934061, 912628, 895722, 882419, 872215, 864963, 860077, 856384, 853118, 850517, 849126, 848996, 849972, 852192, 855724, 860000, 864128, 867683, 870991, 874826, 879983, 886811, 895000, 904076, 914160, 925939, 939918, 956157, 974616, 995130, 1017092, 1039954, 1064250, 1091443, 1122510]
58612A122510L4845L8332M1908M5400M8497N1833N6325O1631O6612P1060P5575
58601A714528P9859Q2668Q3645Q3664Q2947Q0183P4194O5389N4856M2914K9304
58590B474151J4245j330j6244k9426m0162m8321n4028n7260n8158n7551n6251
58579B069665n3953m9768m4007l8501l4673l2078k9328k5824k2091j8825j6219
58568A704398j4073j2324j1335j1550j2747j4065j5060j6306j8324k0445k1502
58557A536667k1302k0518j9453j8105j7356j8803k3063k9139l5670m1829m6722
58546A244707m9129m8629m6313m3622m0921l7774l4156l0681k7811k5463k3404
58535H36804k1633k0140j8630j6771j4701j3011j1954j1003r602q127p368p167
$$ y = [1122510, 1157355, 1195687, 1237595, 1282995, 1331492, 1383325, 1439650, 1501281, 1567893, 1638953, 1714528, 1794387, 1877055, 1960700, 2044364, 2127311, 2207494, 2281688, 2347077, 2401933, 2444847, 2474151, 2488396, 2487066, 2470822, 2441396, 2401234, 2352913, 2298885, 2241625, 2183467, 2125916, 2069665, 2015712, 1965944, 1921937, 1883436, 1848763, 1816685, 1787357, 1761533, 1739442, 1720617, 1704398, 1690325, 1678001, 1666666, 1655116, 1642369, 1628304, 1613244, 1596938, 1578614, 1558169, 1536667, 1515365, 1494847, 1475394, 1457289, 1439933, 1421130, 1398067, 1368928, 1333258, 1291429, 1244707, 1195578, 1146949, 1100636, 1057014, 1016093, 978319, 944163, 913482, 885671, 860208, 836804, 815171, 795031, 776401, 759630, 744929, 731918, 719964, 708961, 699359, 691232, 683864, 676697]
58523F76697o480m970l479k534j516K8J363J898K499M250O697Q603R878J1291
58509G04225J2744J3328J3004J2791J3230J3798J3948J3678J3009J1847J0325
58498H45927Q505N977K642m15j959k232k460l012l334l419l924m813n349n520
58484H26614o192p599q968r817j0487j1232j1832j2276j2730j2774j1856j0484
58472G00367r773r733r341q330p520p225o778n933n256m855m114l068k578k694
58458F13169k372j317n67o22n01M62J344J172M36M7q4m11o48m45l13p66j230q52
58440F06502J64R48J223J344J430J280R30P02P93J154J531J546J176J070J816
58425F23609K935L415L296L660M890O046O281N943N694N505N055M461M033L817
$$ y = [676697, 670217, 665247, 661768, 659234, 657718, 657746, 659109, 661007, 663506, 667756, 674453, 683056, 692934, 704225, 716969, 730297, 743301, 756092, 769322, 783120, 797068, 810746, 823755, 835602, 845927, 854432, 860409, 863051, 862636, 860677, 858445, 855985, 852973, 849639, 846220, 842296, 837483, 832134, 826614, 820422, 812823, 803855, 794038, 783551, 772319, 760487, 748211, 735481, 722707, 710851, 700367, 690594, 680861, 671520, 663190, 655670, 648445, 641667, 635734, 630478, 625623, 621509, 618441, 615863, 613169, 610797, 609480, 608913, 608291, 607790, 608252, 609596, 610768, 611204, 611251, 611167, 610756, 610108, 609663, 609350, 608584, 607354, 606502, 606666, 607614, 608837, 610181, 611611, 612891, 613821, 614523, 615316, 616470, 618001, 619547, 620723, 621793, 623609, 626544, 629959, 633255, 636915, 641805, 647851, 654132, 660075, 665769, 671274, 676329, 680790, 684823, 688640]
58411F88640L798L985M119L863L350K937K478J682J015J261K165K619K278J925
58397G26115K128K593K926K955K328R97L9N52J725J600q8j519j653j592k361k973
58381G33772j894P31L280M345L566J724M09P92K364L731M597N706O970P369O912
58366G84374O882P713Q396Q498Q862R594R391P850O578O834P659P559O619N681
58352H92490M845M056M004N117O653P743Q457Q958Q829Q092P786Q586R880J0881
58338I96377J1567J1925J1615J1020J1256J2461J3499J3970J4924J6809J8401
58327A143824J8777J8768J9459K0714K2056K3591K5131K5918K5904K5796K5323
58316A395261K3319K0047J7317J5539J3038R285O223N108M546L301K567L553N105
$$ y = [688640, 692438, 696423, 700542, 704405, 707755, 710692, 713170, 714852, 715867, 717128, 719293, 721912, 724190, 726115, 728243, 730836, 733762, 736717, 739045, 740042, 740081, 740633, 742358, 743958, 743870, 742351, 740698, 739106, 736745, 733772, 731878, 732609, 735889, 740234, 743800, 745524, 745933, 746725, 749089, 752820, 757417, 763123, 770093, 777462, 784374, 791256, 798969, 807365, 815863, 824725, 834319, 843710, 851560, 858138, 864972, 872631, 880190, 886809, 892490, 897335, 901391, 905395, 910512, 917165, 924908, 933365, 942323, 951152, 959244, 967030, 975616, 985496, 996377, 1007944, 1019869, 1031484, 1042504, 1053760, 1066221, 1079720, 1093690, 1108614, 1125423, 1143824, 1162601, 1181369, 1200828, 1221542, 1243598, 1267189, 1292320, 1318238, 1344142, 1369938, 1395261, 1418580, 1438627, 1455944, 1471483, 1484521, 1493806, 1500029, 1505137, 1509683, 1512984, 1515551, 1519104, 1524209]
58303A524209N828O569Q661J1467J3741J5773J8158K0046K0659K1013K2311K3943
58291A712378K4816K5214K5746K6077K6212K7348K9916L2542L4447L6819M0321
58280B041836M3458M5173M6784M9446N2051N3615N5181N7233N7712N5234N1781
58269B609504M9660M8048M5305M2394M1089M0923M0803M1728M4912M9075N2471
58258C105912N5746O0147O4839O8651P2525P7511Q2483Q6443R0812R6759J02682
58247C964510J07184J11876J18343J25021J30323J35992J43936J52530J59665
58238E149380J66709J75880J86371J96697K08055K21654K35698K48741K62950
58229G052135K80337K99143L17738L38371L63035L89615M16515M46833M83364
$$ y = [1524209, 1530037, 1536606, 1545267, 1556734, 1570475, 1586248, 1604406, 1624452, 1645111, 1666124, 1688435, 1712378, 1737194, 1762408, 1788154, 1814231, 1840443, 1867791, 1897707, 1930249, 1964696, 2001515, 2041836, 2085294, 2130467, 2177251, 2226697, 2278748, 2332363, 2387544, 2444777, 2502489, 2557723, 2609504, 2659164, 2707212, 2752517, 2794911, 2836000, 2876923, 2917726, 2959454, 3004366, 3053441, 3105912, 3161658, 3221805, 3286644, 3355295, 3427820, 3505331, 3587814, 3674257, 3765069, 3861828, 3964510, 4071694, 4183570, 4301913, 4426934, 4557257, 4693249, 4837185, 4989715, 5149380, 5316089, 5491969, 5678340, 5875037, 6083092, 6304746, 6540444, 6789185, 7052135, 7332472, 7631615, 7949353, 8287724, 8650759, 9040374, 9456889, 9903722, 10387086]
58220A0387086N23873N66243O13555O69029P30937P98046Q74678R64688J066328
58211A7194463J179179J309925J464883J644083J849914K094207K389396K741597
58203C1867647L160943L669424M289571N036685N932883P016942Q328784R896466
58195G9199345J1746938J3908020J6381012J9124078K2064588K5090615K8020879
58188B15535475L0636622L2733230L3964584L3485745K9937478K2269416J0922484
58181D09485034j886095j3347839k1723149k6953412k9897562l1264828l1286360
58174B53125789l0061116k7869646k5124947k2189950j9310974j6641780j4259194
58167I7668182j2176085j0377230q845004p553947o466591n548534m776747m129365
$$ y = [10387086, 10910959, 11477202, 12090757, 12759786, 13490723, 14288769, 15163447, 16128135, 17194463, 18373642, 19683567, 21148450, 22792533, 24642447, 26736654, 29126050, 31867647, 35028590, 38698014, 42987585, 48024270, 53957153, 60974095, 69302879, 79199345, 90946283, 104854303, 121235315, 140359393, 162423981, 187514596, 215535475, 246172097, 278905327, 312869911, 346355656, 376293134, 398562550, 409485034, 407598939, 394251100, 372527951, 345574539, 315676977, 284412149, 253125789, 223064673, 195195027, 170070080, 147880130, 128569156, 111927376, 97668182, 85492097, 75114867, 66269863, 58715916, 52249325, 46700791, 41924044, 37794679]
58159C7794679l581121l113468k718034k386579k106691j868765j668089j498665
58151A8853267j352768j226779j119677j026106r38451q55182p79906p12905o50658
58142A0190835n92652n41307m95661m52045m10574l74497l43850l16130k92482
58133F371637k76468k66861k57869k46682k35158k24122k11784j98159j85678
58124D268856j74813j63627j52010j41999j33738j25284j16429j08804j02347
58115C049805r5475q8580q3536q0069p6193p1880o8620o5962o2167n7750n4661
58104B244912n2539m9503m5910m3514m1553l7738l2777k9723k9064k8340k6729
58093A827522k6043k7046k8432k9696l1520l3188l3103l2041l2405l4104l4645
$$ y = [37794679, 34213558, 31100090, 28382056, 25995477, 23888786, 22020021, 20351932, 18853267, 17500499, 16273720, 15154043, 14127937, 13189486, 12334304, 11554398, 10841493, 10190835, 9598183, 9056876, 8561215, 8109170, 7698596, 7324099, 6980249, 6664119, 6371637, 6095169, 5828308, 5570439, 5323757, 5088599, 4864477, 4652693, 4454534, 4268856, 4094043, 3930416, 3778406, 3636407, 3502669, 3377385, 3260956, 3152152, 3049805, 2954330, 2865750, 2782214, 2702145, 2625952, 2554072, 2485452, 2419490, 2357323, 2299573, 2244912, 2192373, 2142870, 2096960, 2053446, 2011893, 1974155, 1941378, 1911655, 1882591, 1854251, 1827522, 1801479, 1774433, 1746001, 1716305, 1684785, 1651597, 1618494, 1586453, 1554048, 1519944, 1485299]
58082A485299l3527l2955l3714l3948l2656l1190l0475k9766k8891k8747k8949
58071A140481k7786k5256k3310k2531k1356j9230j7670j7338j6820j5210j3491
58060I20483j2465j1737j1372j2155j3485j3510j2098j1253j1764j1970j0756
58049G87918r357r018r095q670q081p759p342o871p091p750p419n786m246l519
58035F85914k592q99M48M93k22j069k274l599l969l305l002l550l519j903K61
58020F57213J745K880M166M860M394L859M575O302Q058R723J1609J3397J4726
58007G47507J6096J8193K0869K3571K6141K8518L0474L2176L4201L6514L8337
57996A052597L9453M0644M2378M4124M5420M6562M7697M8248M7789M6447M4120
$$ y = [1485299, 1451772, 1418817, 1385103, 1351155, 1318499, 1287309, 1256834, 1227068, 1198177, 1169430, 1140481, 1112695, 1087439, 1064129, 1041598, 1020242, 1001012, 983342, 966004, 949184, 933974, 920483, 908018, 896281, 884909, 872754, 859269, 845759, 833661, 822408, 810644, 798674, 787918, 778561, 769543, 760448, 751778, 743697, 735938, 728596, 721725, 714634, 706884, 699465, 693679, 689433, 685914, 683322, 682423, 682871, 683364, 683142, 682073, 679799, 676200, 672231, 668926, 665924, 662374, 658855, 656952, 657213, 658958, 661838, 666004, 670864, 675258, 679117, 683692, 689994, 698052, 707775, 719384, 732781, 747507, 763603, 781796, 802665, 826236, 852377, 880895, 911369, 943545, 977746, 1014260, 1052597, 1092050, 1132694, 1175072, 1219196, 1264616, 1311178, 1358875, 1407123, 1454912, 1501359, 1545479]
57985A545479M0435L5908L1911K9007K6484K3958K2086K0980J9320J5656R481
57974A820705M76j1783k6426m0918n3119o2715o9906p4043p4699p2841o9735o5445
57962A199551n9554n2544m5422l8625l2217k6494k1570j6980j2456q450n284k599
57950H77356k85J036J200J174J692K207K068J808K157K770L118L815N760Q615
57936I14491J1417J4240J7870K2199K6164K9167L1388L2762L2693L0742K6773
57925A189906K0514J1890J769q462j8183k7590l6442m3580m8032m9947n0079m8752
57913H93012m5807m1392l6352l1661k7659k4096k0881j8375j6698j5294j3678
57902F01119j2246j1693j1947j2456j3257j4675j6082j6079j4234j1714r896r130
$$ y = [1545479, 1585914, 1621822, 1653733, 1682740, 1709224, 1733182, 1755268, 1776248, 1795568, 1811224, 1820705, 1821181, 1809398, 1782972, 1742054, 1688935, 1626220, 1556314, 1482271, 1407572, 1334731, 1264996, 1199551, 1139997, 1087453, 1042031, 1003406, 971189, 944695, 923125, 906145, 893689, 885239, 879955, 877356, 877071, 878107, 879307, 880481, 882173, 884380, 886448, 888256, 890413, 893183, 896301, 900116, 905876, 914491, 925908, 940148, 958018, 980217, 1006381, 1035548, 1066936, 1099698, 1132391, 1163133, 1189906, 1210420, 1222310, 1224079, 1215617, 1197434, 1169844, 1133402, 1089822, 1041790, 991843, 941764, 893012, 847205, 805813, 769461, 737800, 710141, 686045, 665164, 646789, 630091, 614797, 601119, 588873, 577180, 565233, 552777, 539520, 524845, 508763, 492684, 478450, 466736, 456840, 447710]
57890D47710r033r029q321o369l817j999j130rK073M286N743O832Q254R686J0499
57875D55376J0939J1586J2198J2085J1150R781Q122O207M441L130J972N69j004
57862E46552k647m600o726q154q431q328q655q919q178o661n424m737l976k884
57848D58232j935j423j099o96j13Q80K368L795M382L978K978J571j89j820k673
57833D68236k799k907l402m026m400m350l758k628j255J01J648L642N696P068
57819D56866P670Q272R676J2060J5039J7896J9820K0421K0179K0063K0690K2120
57807F50772K4354K7590L1842L6633M1148M4658M6826M7649M6919M3702L6858
57796A078951K6354J3738R36j1155k2538l2934m1336m6829m9401m9828m8945m7170
$$ y = [447710, 438677, 429648, 421327, 414958, 411141, 409142, 408012, 408003, 410076, 414362, 420105, 426937, 435191, 444877, 455376, 466315, 477901, 490099, 502184, 513334, 523115, 531237, 537444, 541885, 545015, 546987, 547556, 546552, 543905, 539305, 532579, 524425, 515994, 507666, 499011, 490092, 481914, 475253, 469829, 465092, 461116, 458232, 456297, 454874, 453775, 453079, 452966, 453846, 456214, 460009, 464391, 468369, 471347, 472918, 472729, 470909, 468236, 465437, 462530, 459128, 455102, 450702, 446352, 442594, 439966, 438711, 438812, 440460, 444102, 449798, 456866, 464536, 472808, 482484, 494544, 509583, 527479, 547299, 567720, 587899, 607962, 628652, 650772, 675126, 702716, 734558, 771191, 812339, 856997, 903823, 951472, 998391, 1042093, 1078951, 1105305, 1119043, 1119979, 1108824, 1086286, 1053352, 1012016, 965187, 915786, 865958, 817013, 769843]
57784G69843m4670m1851l9366l7481l5676l3319l0539k7980k5835k3725k1449
57773D07952j9179j6869j4279j1638r574q154o778n243m032l364k796k120j714
57760C02212j603j211n11l50r28j083L0J516K155K332L308N146O685P331P646
57745C32675Q241R069R751R927R387Q438P802P519O546M168J247q85k196l555
57731D08134m939n401m637l379k232j160j81L79N24O97J107J639K329L273M166
57716D00319M620M741M855M914M962N679P466R352J0049R865J0300J1823J3402
57703E02347J4325J5120J6360J7816J9312K1241K3663K5924K7818L0248L4080
57692G48254L8949M3873M8419N2835N7505O2832O9121P6136Q3126Q9574R5519
$$ y = [769843, 725173, 683322, 643956, 606475, 570799, 537480, 506941, 478961, 453126, 429401, 407952, 388773, 371904, 357625, 345987, 336413, 328259, 321481, 316238, 312206, 308842, 306046, 303926, 302212, 300609, 299398, 298887, 298537, 297609, 296526, 296556, 298072, 300227, 302559, 305867, 311013, 317698, 325029, 332675, 340916, 349985, 359736, 369663, 379050, 387488, 395290, 402809, 409355, 413523, 414770, 413885, 411689, 408134, 403195, 397794, 393157, 389778, 387546, 386386, 386205, 386584, 387108, 387805, 388912, 390551, 392880, 396153, 400319, 404939, 409680, 414535, 419449, 424411, 430090, 437556, 446908, 456957, 466822, 477122, 488945, 502347, 516672, 531792, 548152, 565968, 585280, 606521, 630184, 656108, 683926, 714174, 748254, 787203, 831076, 879495, 932330, 989835, 1052667, 1121788, 1197924, 1281050, 1370624, 1466143]
57681A466143J00910J05265J08283J10227J11320J11234J09599J06749J03461
57672B433191J00092R6221R1310Q5678Q0308P4419O2804L7324o311o2689j18741
57661B873606j62215j87812j96520j92009j78883j62040j44957j28442j11995
57652A408733r5983q1617o9491n9258n0497m2962l6283l0184k4847k0338j6006
57641H81267j1206o280k036J496M993Q724J2440J6213K0490K5155K9442L3004
57629A013702L6412M0264M4466M8674N2914N7313O1577O5139O7651O9014O9138
57618A626264O7926O5291O0928N4223M4706L2634J8885M260j0750k5495l8883
57607A899989n0013n8931o6350p2557p6993p8999p8609p6420p3077o9128o5071
$$ y = [1466143, 1567053, 1672318, 1780601, 1890828, 2002148, 2113382, 2222981, 2329730, 2433191, 2533283, 2629504, 2720814, 2806492, 2886800, 2961219, 3024023, 3061347, 3055036, 2992347, 2873606, 2711391, 2523579, 2327059, 2135050, 1956167, 1794127, 1649170, 1520728, 1408733, 1312750, 1231133, 1161642, 1102384, 1051887, 1008925, 972642, 942458, 917611, 897273, 881267, 870061, 863781, 861745, 863241, 868234, 876958, 889398, 905611, 926101, 951256, 980698, 1013702, 1050114, 1090378, 1134844, 1183518, 1236432, 1293745, 1355322, 1420461, 1488112, 1557126, 1626264, 1694190, 1759481, 1820409, 1874632, 1919338, 1951972, 1970857, 1975117, 1964367, 1938872, 1899989, 1849976, 1791045, 1724695, 1652138, 1575145, 1496146, 1417537, 1341117, 1268040, 1198912, 1133841]
57596A133841o1099n7033n2800m8763m5238m1927l8338l4522l0976k7947k5405
57585F69793k3434k2101k1003j9486j7413j5185j3162j1468j0255r575r070q348
57573D89293p586p112o613n513m049l120k929k727k036j294r77r28r30j057j102
57558D41320m15J108K608L380L806M585N704O705P492Q198Q701Q947R352J0337
57544E21828J1716J3070J4411J6047J8098K0540K3352K6299K8897L1128L3684
57533G59070L7102M1063M4965M8652N2049N4618N5931N6366N6558N6384N5122
57522A317880N2333M7973M1835L3648K3610J2348M77j1380k2394l1918l9865m6307
57510A378240n1020n3905n5452n6107n5565n3403n0123m6775m3720m0590l7253
$$ y = [1133841, 1072742, 1015709, 962909, 914146, 868908, 826981, 788643, 754121, 723145, 695198, 669793, 646359, 624258, 603255, 583769, 566356, 551171, 538009, 526541, 516286, 506711, 497641, 489293, 481707, 474595, 467982, 462469, 458420, 455300, 452371, 449644, 447608, 446314, 445337, 444409, 443479, 442422, 441320, 440905, 442013, 444621, 448001, 451807, 456392, 462096, 468801, 476293, 484491, 493192, 502139, 511491, 521828, 533544, 546614, 561025, 577072, 595170, 615710, 639062, 665361, 694258, 725386, 759070, 796172, 837235, 882200, 930852, 982901, 1037519, 1093450, 1149816, 1206374, 1262758, 1317880, 1370213, 1418186, 1460021, 1493669, 1517279, 1529627, 1530104, 1518724, 1496330, 1464412, 1424547, 1378240, 1327220, 1273315, 1217863, 1161756, 1106191, 1052788, 1002665, 955890, 912170, 871580, 834327]
57499H34327l4014l0939k7798k4693k1949j9411j6581j3563j1047r281p733n952
57487F11366l968j815N76K801M175M834N852P896J0476J2992J5723J9090K2652
57474G12650K5647K8234L1301L5195L9232M2526M4805M6462M8128N0150N2099
57463A156429N2868N1527M7990M2633L5557K6742J6638N986m940j6281k7644l7898
57451A349607m6201n2688n7690o0801o1365n9722n7293n5296n3782n1933m8994
57440G43842m4892m0344l6492l3956l2189l0129k7539k5098k3116k0984j8362
57429D10741j6050j4871j4290j3169j1501j0326j0025r902r464r015q700q043
57417B75385o924o030n796n760n494n308n369m970l593k001j329j572j923k101
$$ y = [834327, 800313, 769374, 741576, 716883, 694934, 675523, 658942, 645379, 634332, 625051, 617318, 611366, 607398, 605583, 606159, 608960, 613135, 617969, 623821, 631717, 642193, 655185, 670908, 689998, 712650, 738297, 766531, 797832, 833027, 872259, 914785, 959590, 1006052, 1054180, 1104330, 1156429, 1209297, 1260824, 1308814, 1351447, 1387004, 1413746, 1430384, 1436370, 1431430, 1415149, 1387505, 1349607, 1303406, 1250718, 1193028, 1132227, 1070862, 1011140, 953847, 898551, 844769, 792836, 743842, 698950, 658606, 622114, 588158, 555969, 525840, 498301, 473203, 450087, 429103, 410741, 394691, 379820, 365530, 352361, 340860, 330534, 320509, 310607, 301143, 292128, 283428, 275385, 268461, 262431, 256635, 250875, 245381, 240073, 234704, 229734, 226141, 224140, 222811, 221239, 219316, 217215]
57403B17215k331k373j728p28k93n38o22j92K5n19j277j406r29m88l47j65L81
57386B03685J128J631J614J271J065J214J442J386R95L65n34j601k322k266j760
57371B07313j520j709j836j559j058n84j92j4k77q04j019p07l71n71j093j136
57355A92863k63J048J858J754J282J192J402J137L06k2R78K471K829J728N87P50
57339B11900K002L103L255K699K193K212K570K715K500K461L051L929M456M625
57325B53671M819M922M449L630L442M315N511O212O531O995P562P799P701P774
57311C35333Q321R064R570R784J0107J0899J1988J2755J2918J2933J3336J3909
57299D70917J3935J3157J1927J0477Q715O761M998L333J049k260o004r166j1291
$$ y = [217215, 214884, 212511, 210783, 210055, 209762, 209224, 208602, 208410, 208435, 207916, 206639, 205233, 204304, 203816, 203469, 203304, 203685, 204813, 206444, 208058, 209329, 210394, 211608, 213050, 214436, 215431, 215796, 215262, 213661, 211339, 209073, 207313, 205793, 204084, 202248, 200689, 199631, 199047, 198855, 198841, 198564, 197760, 196741, 196034, 195663, 195092, 193999, 192863, 192600, 193648, 195506, 197260, 198542, 199734, 201136, 202273, 202579, 202557, 203535, 206006, 208835, 210563, 211150, 211900, 213902, 217005, 220260, 222959, 225152, 227364, 229934, 232649, 235149, 237610, 240661, 244590, 249046, 253671, 258490, 263412, 267861, 271491, 274933, 279248, 284759, 290971, 297502, 304497, 312059, 319858, 327559, 335333, 343654, 352718, 362288, 372072, 382179, 393078, 405066, 417821, 430739, 443672, 457008, 470917, 484852, 498009, 509936, 520413, 529128, 535889, 540887, 544220, 545269, 543009, 537005, 527839, 516548]
57286E16548j2621j3631j4642j5659j6313j6236j5515j4554j3447j1961j0147
57275C61822q481p233o132m847l432k062q42PJ85j39k78K70J371K631L758M409
57259C41007M246L489K876K834L100L391L865M525M883M716M602N026N450N089
57245C99099M279M179N152O264O545O084N575N337N205N078N099N309N489N501
57231D74195N579O048O778P277P407P660Q430R318R623R331R067R160R352R514
57217E88739R987J0937J1903J2374J2469J2698J3288J3969J4290J3998J3308J2817
57205G40777J2958J3573J4265J4928J5560J5813J5435J5016J5432J6500J7072
57194I07329J6620J5869J5618J5767J5938J6146J6421J6513J6492J6857J7549
$$ y = [516548, 503927, 490296, 475654, 459995, 443682, 427446, 411931, 397377, 383930, 371969, 361822, 353341, 346108, 339976, 335129, 331697, 329635, 328793, 328800, 328985, 328846, 328568, 328838, 330209, 332840, 336598, 341007, 345253, 348742, 351618, 354452, 357552, 360943, 364808, 369333, 374216, 378932, 383534, 388560, 394010, 399099, 403378, 407557, 412709, 418973, 425518, 431602, 437177, 442514, 447719, 452797, 457896, 463205, 468694, 474195, 479774, 485822, 492600, 499877, 507284, 514944, 523374, 532692, 542315, 551646, 560713, 569873, 579225, 588739, 598726, 609663, 621566, 633940, 646409, 659107, 672395, 686364, 700654, 714652, 727960, 740777, 753735, 767308, 781573, 796501, 812061, 827874, 843309, 858325, 873757, 890257, 907329, 923949, 939818, 955436, 971203, 987141, 1003287, 1019708, 1036221, 1052713, 1069570, 1087119]
57183A087119J7640J6686J5567J5327J5861J6541J7338J8470J9591K0354K1212
57172A281706K2682K4254K5132K5613K6673K8406K9925L0679L0822L0451K9518
57161A585861K8477K8015K8147K8396K8630K8574K6698K1244J2964N649L084O007
57149A831746J2327J9336K5043K8298K8892K7609K5590K3629K2082K1049K0238
57138B085839J9048J7238J5297J3851J2864J1720R956P674N370L543K404J753
57126B206557J299J056J234J670J711R22k76q45N8K516N927R603J3358J7561K2582
57111B284933K8349L4677M1744M9902N9148O9312Q0917R5465J14676J39661J70889
57100C169673K08763K54007L07611L70473M42889N24271O13284P08203Q07076
$$ y = [1087119, 1104759, 1121445, 1137012, 1152339, 1168200, 1184741, 1202079, 1220549, 1240140, 1260494, 1281706, 1304388, 1328642, 1353774, 1379387, 1406060, 1434466, 1464391, 1495070, 1525892, 1556343, 1585861, 1614338, 1642353, 1670500, 1698896, 1727526, 1756100, 1782798, 1804042, 1817006, 1822655, 1825739, 1831746, 1844073, 1863409, 1888452, 1916750, 1945642, 1973251, 1998841, 2022470, 2044552, 2065601, 2085839, 2104887, 2122125, 2137422, 2151273, 2164137, 2175857, 2185813, 2193487, 2198857, 2202400, 2204804, 2206557, 2207856, 2208912, 2210146, 2211816, 2213527, 2214449, 2214173, 2213328, 2213386, 2215902, 2221829, 2231432, 2244790, 2262351, 2284933, 2313282, 2347959, 2389703, 2439605, 2498753, 2568065, 2648982, 2744447, 2859123, 2998784, 3169673, 3378436, 3632443, 3940054, 4310527, 4753416, 5277687, 5890971, 6599174, 7406250]
57091G406250R07768J007960J105098J196231J278027J346889J398467J426715
57083A7073405J423584J380338J290023J150157R64801P44721N04488K57916J5516
57074B4804949k14532m24950o10496p69918r05050j017559j107284j173436j215844
57065A7365880j234456j228871j199561j149325j083015j006209r24271q41859
57057H698313p62300o87328o17760n54258m97081m45602l98724l55971l17685
57048D061604k84096k54677k28679k05988j86980j71583j58849j47711j37661
57039B285380j28567j20044j11602j03186r5003q6922p8610p0213o2074n3778
57029A375381m4303l3368k1796j0373R32J2564K5455M1087N8845P2076O9600M4829
$$ y = [7406250, 8314018, 9321978, 10427076, 11623307, 12901334, 14248223, 15646690, 17073405, 18496989, 19877327, 21167350, 22317507, 23282308, 24027029, 24531517, 24789433, 24804949, 24590417, 24165467, 23554971, 22785053, 21880003, 20862444, 19755160, 18581724, 17365880, 16131424, 14902553, 13702992, 12553667, 11470652, 10464443, 9540172, 8698313, 7936013, 7248685, 6630925, 6076667, 5579586, 5133984, 4735260, 4379289, 4061604, 3777508, 3522831, 3294152, 3088164, 2901184, 2729601, 2570752, 2423041, 2285380, 2156813, 2036769, 1925167, 1821981, 1726978, 1640056, 1561446, 1491233, 1429159, 1375381, 1331078, 1297710, 1275914, 1265541, 1266473, 1279037, 1304492, 1345579, 1404424, 1476500, 1546100, 1590929]
57017A590929L454l9971p3083r2205r9607r8496r1836q2944p4363o6556n8904
57006H16418n1417m4671l8941l4304l0924k8477k6029k3113k0294j8068j6075
56995D84105j4021j2436j1647j0784q871o248l954k135j15K304M572O245P275
56982D34290P532O794N126K698n35m432q136j0640j1822j2350j2695j2672j1936
56969C71222j0418q309n971l847k144o63Q74K544M390O528Q854J1005J2810J4292
56955D01167J4915J3429R129K960l185q013j1260j2939j3040j1989j0705r879
56943C60590r363q422o472l609n04K215M511O801R327J1949J4463J6813J8897
56930D17196K0443K0972J9616J5314P891j057r126j5097j9345k2436k4181k4281
$$ y = [1590929, 1594383, 1554412, 1481329, 1389124, 1289517, 1191021, 1099185, 1016241, 941878, 875322, 816418, 765001, 720330, 681389, 647085, 616161, 587684, 561655, 538542, 518248, 500180, 484105, 470084, 457648, 446001, 435217, 426346, 420098, 416144, 414009, 413894, 416198, 420770, 427015, 434290, 441822, 448616, 453742, 456440, 455905, 451473, 443337, 432697, 420875, 408525, 395830, 383158, 371222, 360804, 352495, 346524, 342677, 340533, 339870, 340744, 343288, 347678, 354206, 363060, 374065, 386875, 401167, 416082, 429511, 438640, 441600, 438415, 430402, 419142, 406203, 393163, 381174, 370469, 360590, 351227, 342805, 336333, 332724, 332220, 334435, 338946, 345747, 355074, 367023, 381486, 398299, 417196, 437639, 458611, 478227, 493541, 501432, 500375, 491249, 476152, 456807, 434371, 410190, 385909]
56918C85909k2967k0660j7758j4966j2972j1470r573p413o183o147n923m604l198
56905B42075k943l334l164k542k350k413j879r07m21l35M55K277M230N638O771
56890B41158P941Q996R924J0992J2054J2507J2034J0653Q163M465L66k947n240
56877C31066p051q188p750n799l766k569j502M06K914N248P415R946J2911J6025
56863C49306J9324K2928K6385K8915L0196L0259K8695K4539J7211P385l062j1929
56851E70152j7803k0648k1383k0861j9249j6350j2242p465k671J809O167J0925
56839D50381J6460K2697K9165L5203M0158M3707M6055M7321M6404M1012K9534
56828H48097J2928n494k2002l4034m0647m2454m1174l8511l5107l0770k5515j9905
$$ y = [385909, 362942, 342282, 324524, 309558, 296586, 285116, 275543, 268130, 261947, 255800, 249877, 245273, 242075, 239132, 235798, 232634, 230092, 227742, 225329, 223450, 222543, 222122, 221787, 222242, 224519, 228749, 234387, 241158, 249099, 258095, 268019, 279011, 291065, 303572, 315606, 326259, 334422, 338887, 339253, 336306, 331066, 324015, 315827, 308077, 302278, 298512, 295943, 294441, 294847, 297761, 303009, 310424, 320370, 333281, 349306, 368630, 391558, 417943, 446858, 477054, 507313, 536008, 560547, 577758, 585143, 582081, 570152, 552349, 531701, 510318, 489457, 470208, 453858, 441616, 434151, 431480, 433289, 439456, 450381, 466841, 489538, 518703, 553906, 594064, 637771, 683826, 731147, 777551, 818563, 848097, 861025, 855531, 833529, 799495, 758848, 716394, 675220, 636709, 601602, 570832, 545317, 525412]
56816E25412j4462r204l857J884Q146J4606K0479K5169K8823L1793L3647L3091
56804F95527K8832K0275P886o552k0272l0884l7479m0309l9845l6855l2694k8525
56792D79105k4284j9372j4140r693o211k693J440N502Q729J1388J4118J6843J8830
56779D79562J9224J7144J1932M036m725j2347j8011k2042k4889k6516k6599k5041
56767C71728k2355j9582j7564j6276j5128j3812j2435j0917q974o829n264m628
56755B17964m330l639k605j774j395j271j163j006q46p83q86j028r73o49k06J98
56739A95608M81N45L39j4l16m95n39m17k53l42o77p89l71K65O87R05R92P11J31
56720A96451Q5J098K322K496J699J093J100J068P20P06J410K320K916L286L540
$$ y = [525412, 510950, 501746, 497889, 499773, 507919, 522525, 543004, 568173, 596996, 628789, 662436, 695527, 724359, 744634, 752520, 745968, 725696, 694812, 657333, 617024, 577179, 540324, 507630, 479105, 454821, 435449, 421309, 411616, 405405, 402712, 404152, 409654, 418383, 429771, 443889, 460732, 479562, 498786, 515930, 527862, 531898, 527173, 514826, 496815, 474773, 449884, 423368, 396769, 371728, 349373, 329791, 312227, 295951, 280823, 267011, 254576, 243659, 234685, 227856, 222592, 217964, 213634, 209995, 207390, 205616, 204221, 202950, 201787, 200781, 199935, 199152, 198266, 197238, 196265, 195616, 195410, 195608, 196089, 196634, 196973, 196959, 196643, 196148, 195609, 195192, 194939, 194597, 193920, 193131, 192760, 193025, 193712, 194617, 195609, 196320, 196451, 196536, 197634, 199956, 202452, 204151, 205244, 206344, 207412, 208132, 208838, 210248, 212568, 215484, 218770, 222310]
56705B22310L560L679M602O200P234O832N534M371L620L054K659K500K313J836
56691B80304J192O10J38j09R9O51J130J485K043K684K709J915J013O37N97N20
56675B97618N15O97P33M28J79K97L81j14j141k306l367m071m072l548l294l701
56659B75234m165l990l401l018k886k648k333k283k501k619k362j736r86n84r18
56644B38804j698k088j632o88K63J141J872K051J535Q49N61O31O75M33k41j265
56628B41203k023j729n42M01L88o9k75m30j058k044k844l169k869j747q0J202
56612B24315J462J105Q42P65P10R27J685K615L151L230L059K593J871J423J677
56597B51430K280K506K112J389P22M52O67Q56L46n58o71L88J447J415P60N47Q05
$$ y = [222310, 225870, 229549, 234151, 240351, 247585, 254417, 259951, 264322, 267942, 270996, 273655, 276155, 278468, 280304, 281496, 282106, 282244, 282135, 282234, 282885, 284015, 285500, 287543, 290227, 292936, 294851, 295864, 296501, 297098, 297618, 298133, 298830, 299563, 299991, 300170, 300467, 300848, 300734, 299593, 297287, 293920, 289849, 285777, 282229, 278935, 275234, 271069, 267079, 263678, 260660, 257774, 255126, 252793, 250510, 248009, 245390, 243028, 241292, 240306, 239722, 238804, 237106, 235018, 233386, 232698, 232961, 234102, 235974, 238025, 239560, 240409, 240970, 241601, 242276, 242709, 242468, 241203, 239180, 237451, 236909, 237310, 237698, 237629, 237354, 236924, 235866, 233822, 230978, 227809, 224940, 223193, 223113, 224315, 225777, 226882, 227724, 228489, 229199, 230126, 231811, 234426, 237577, 240807, 243866, 246459, 248330, 249753, 251430, 253710, 256216, 258328, 259717, 260439, 260891, 261558, 262414, 262760, 262202, 261531, 261919, 263366, 264781, 265541, 266088, 266893]
56580B66893Q97Q59J191J727J809J390J059J052J115J136J180J100Q18P90J442
56565B84458K435L116L433L676L634K838J477K47n76j223j742j922j812j708j714
56550B94617j831k283l194m183m785n013n015m654l995l741m327n010m710l488
56536B38388k362j843j581j322j324j727k193k307j929j143l05P9j36n26p66j091
56520B17912j721k293k392k188k000j709j258j162j823k759l260l346l334l027
56506A85640k188j266p93m82J24N92K08o70j017o02n8L06P35J199J336J206J193
56489A85463J256J085Q54R62J271J398J595K414L613M285M002L127K201J750K297
56474B17573L638M406L437J378l8j56J52J6m87r23j067p72l8P39J151J282J347
$$ y = [266893, 267790, 268649, 269840, 271567, 273376, 274766, 275825, 276877, 277992, 279128, 280308, 281408, 282226, 283016, 284458, 286893, 290009, 293442, 297118, 300752, 303590, 305067, 305314, 304738, 303515, 301773, 299851, 298039, 296331, 294617, 292786, 290503, 287309, 283126, 278341, 273328, 268313, 263659, 259664, 255923, 251596, 246586, 241876, 238388, 236026, 234183, 232602, 231280, 229956, 228229, 226036, 223729, 221800, 220657, 220352, 220431, 220295, 219769, 219003, 217912, 216191, 213898, 211506, 209318, 207318, 205609, 204351, 203189, 201366, 198607, 195347, 192001, 188667, 185640, 183452, 182186, 181393, 180911, 181035, 181627, 181835, 181165, 180148, 179546, 179488, 179794, 180529, 181728, 183064, 184270, 185463, 186719, 187804, 188658, 189620, 190891, 192289, 193884, 196298, 199911, 204196, 208198, 211325, 213526, 215276, 217573, 221211, 225617, 229054, 230432, 230394, 230238, 230390, 230406, 229919, 228996, 227929, 227157, 227119, 227858, 229009, 230291, 231638]
56457B31638J259J097J400K117K170R71l16l35M60P68O78J185J925J424m59k149
56441B43833k629k503k533k678k896l401l826l425k411j827j861j670j037p28
56427B10408r39q20o9M36Q0o24r95r53n29J67L70n28j467p08J434K665K062J364
56409B11354K015K908K470J389J444K719L703L547K698J702O81j17k90J25N73
56394B36921N14k60j472k333k167j272n91m40k97j4j91r73j469r99j04L29K31
56377B25413J05K42O19J068J174O04k31m78k2M22N13P11J280J822K051K161K184
56360B39638J904J581J704J924J436N24L64R93J110L60J90J554L265L732L013
56345B63292K107J319N67K62O19R53P76Q42J940L386L927L596L453L887M236L935
$$ y = [231638, 232897, 233994, 235394, 237511, 239681, 240652, 240336, 240001, 240461, 241229, 241907, 243092, 245017, 246441, 245982, 243833, 241204, 238701, 236168, 233490, 230594, 227193, 223367, 219942, 217531, 215704, 213843, 212173, 211136, 210408, 209469, 208649, 208580, 209016, 209096, 208472, 207477, 206524, 205995, 206162, 206532, 206004, 204537, 203829, 205263, 207928, 209990, 211354, 213369, 216277, 218747, 220136, 221580, 224299, 228002, 231549, 234247, 235949, 236630, 236513, 236223, 236348, 236921, 237435, 237175, 235703, 233370, 231203, 229931, 229340, 228900, 228603, 228589, 228398, 227425, 225956, 224957, 224853, 225182, 225413, 225518, 225760, 226379, 227447, 228621, 229225, 228994, 228516, 228494, 228916, 229429, 230140, 231420, 233242, 235293, 237454, 239638, 241542, 243123, 244827, 246751, 248187, 248711, 249075, 250068, 251178, 251538, 251728, 253282, 256547, 260279, 263292, 265399, 266718, 267285, 267547, 268166, 269119, 269895, 270737, 272677, 276063, 279990, 283586, 287039, 290926, 295162, 299097]
56329B99097L159K502K575L609M936N330M407L225K965L550M137M369M468M525
56315C52854M388L962L250K359J680J581J766J536Q69M93P29J044J016Q69Q25
56300C79221P51P47J158J814K222K602L635M951N312M683M622N964P507P873P402
56285D40464P291P920Q942J0092J1070J1563J2012J3387J5658J7674J9114K1187
56273E96374K4537K7996L0508L2930L6643M1550M6762N2196N7972O3236O7069
56262A077773P0088P3713P8256Q2714Q6112Q8037Q8418Q7475Q5489Q2008P6028
56251A976111O7524N7971M8593L9090K8789J8017P485k675j2272k0494k6971l2601
56239B148567l8354m4069m9204n3821n8080o1658o4486o7032o9096o9595o8383
$$ y = [299097, 302256, 304758, 307333, 310942, 315878, 321208, 325615, 328840, 331805, 335355, 339492, 343861, 348329, 352854, 357242, 361204, 364454, 366813, 368493, 370074, 371840, 373376, 374245, 374738, 375467, 376511, 377527, 378396, 379221, 379972, 380719, 381877, 383691, 385913, 388515, 392150, 397101, 402413, 407096, 411718, 417682, 425189, 433062, 440464, 447755, 455675, 464617, 474709, 485779, 497342, 509354, 522741, 538399, 556073, 575187, 596374, 620911, 648907, 679415, 712345, 748988, 790538, 837300, 889496, 947468, 1010704, 1077773, 1147861, 1221574, 1299830, 1382544, 1468656, 1556693, 1645111, 1732586, 1818075, 1900083, 1976111, 2043635, 2101606, 2150199, 2189289, 2218078, 2236095, 2243580, 2240905, 2228633, 2208139, 2181168, 2148567, 2110213, 2066144, 2016940, 1963119, 1905039, 1843381, 1778895, 1711863, 1642767, 1573172, 1504789]
56228A504789o6940o6256o5394o3287o0525n7999n5101n0926m6154m2142l8962
56217H91103l5857l2843l0396k8164k5419k2304j9512j7266j5468j4134j2940
56206F36800j1255r395q607q946q657o772m765m241m437l658j883k84Q09J706
56192E66415K124J808J534J999K609K756L182M667O384P191P490Q276R352J0075
56178F35862J0794J1980J2994J3310J3802J5245J6683J7035J7046J7835J8753
56167H01339J8662J8133J8319J8771J8564J8584K0424K3762K7058L0214L4514
56156A048344M0474M7835N7057O8883Q2939R8338J15097J33283J51522J67891
56146B011663J81288J90347J92334J85182J69892J49439J26608J04438Q6807P5841
$$ y = [1504789, 1437849, 1371593, 1306199, 1242912, 1182387, 1124388, 1069287, 1018361, 972207, 930065, 891103, 855246, 822403, 792007, 763843, 738424, 716120, 696608, 679342, 663874, 649740, 636800, 625545, 616150, 607543, 598597, 589940, 583168, 578403, 574162, 569725, 566067, 564184, 563900, 564709, 566415, 568539, 570347, 571881, 573880, 576489, 579245, 582427, 587094, 593478, 600669, 608159, 616435, 625787, 635862, 646656, 658636, 671630, 684940, 698742, 713987, 730670, 747705, 764751, 782586, 801339, 820001, 838134, 856453, 875224, 893788, 912372, 932796, 956558, 983616, 1013830, 1048344, 1088818, 1136653, 1193710, 1262593, 1345532, 1443870, 1558967, 1692250, 1843772, 2011663, 2192951, 2383298, 2575632, 2760814, 2930706, 3080145, 3206753, 3311191, 3397998, 3473839]
56136C473839O9557O3935N6145M4312K6689M177j8005l4423m4467n1183n7149
56125C533427o4523p7056r7565j23683j49406j70403j85042j91564j88393j77131
56115B108661j61748j44633j26149j07534r0845p6275o2654n0344m0635l2711
56105A215133k4549j6529j0872p681m926k168j004j633k394k813m004n824o718
56092A124018o617o986p888p802o468n093l903k288r95j195j756o23J622K840
56078A076866L345N159P798Q731P891P815R186J0164J0279J1111J2779J3561J3339
56065A198024J3770J4786J4603J3444J3450J4790J5597J5833J7250J9430K0040
56054A371017J9226J9517K1082K1473K0447K0583K2483K3778K3588K3667K4458
$$ y = [3473839, 3543396, 3607331, 3663476, 3707788, 3734477, 3738654, 3720649, 3686226, 3641759, 3590576, 3533427, 3468904, 3391848, 3294283, 3170600, 3021194, 2850791, 2665749, 2474185, 2285792, 2108661, 1946913, 1802280, 1676131, 1568597, 1477752, 1401477, 1338823, 1288479, 1247844, 1215133, 1190584, 1174055, 1163183, 1155502, 1150576, 1148408, 1147404, 1145771, 1143377, 1140564, 1136560, 1130736, 1124018, 1117401, 1110415, 1102527, 1094725, 1088257, 1083164, 1079261, 1076973, 1075978, 1074783, 1073027, 1072404, 1074026, 1076866, 1080211, 1085370, 1093168, 1101899, 1109790, 1117605, 1126791, 1136955, 1147234, 1158345, 1171124, 1184685, 1198024, 1211794, 1226580, 1241183, 1254627, 1268077, 1282867, 1298464, 1314297, 1331547, 1350977, 1371017, 1390243, 1409760, 1430842, 1452315, 1472762, 1493345, 1515828, 1539606, 1563194, 1586861, 1611319]
56043A611319K4354K3570K4390K6894K8708K9511L1354L4159L5538L5678L7410
56032A942885M0918M3255M3821M5175M7706M8851M8487M9657N2856N4984N5248
56021B473843N6612O0085O2992O4249O5978O8620O9884O9859P1613P5573P8889
56010C218197Q1326Q5773R2022R6362R8502J02373J08845J14432J18420J24195
56000D240447J32165J38717J43703J51370J62279J72122J80231J91039K05311
55991E717384K18462K29614K43502K61238K78213K93434L11589L33737L55769
55982H242942L78202M06888M41741M76039N09573N50466O01236O55854P13807
55973A2976748P83236Q66443R57033J055790J174090J316917J479083J663636
$$ y = [1611319, 1635673, 1659243, 1683633, 1710527, 1739235, 1768746, 1800100, 1834259, 1869797, 1905475, 1942885, 1983803, 2027058, 2070879, 2116054, 2163760, 2212611, 2261098, 2310755, 2363611, 2418595, 2473843, 2530455, 2590540, 2653532, 2717781, 2783759, 2852379, 2922263, 2992122, 3063735, 3139308, 3218197, 3299523, 3385296, 3477318, 3573680, 3672182, 3774555, 3883400, 3997832, 4116252, 4240447, 4372612, 4511329, 4655032, 4806402, 4968681, 5140803, 5321034, 5512073, 5717384, 5935846, 6165460, 6408962, 6670200, 6948413, 7241847, 7553436, 7887173, 8242942, 8621144, 9028032, 9469773, 9945812, 10455385, 11005851, 11607087, 12262941, 12976748, 13759984, 14626427, 15583460, 16639250, 17813340, 19130257, 20609340, 22272976]
55965B2272976J886647K158407K479327K861253L332347L913871M614714N456667
55957D8976209O480083P715829R178613J0894565J2898585J5188362J7710946
55950A29043192K0394354K3136749K5756758K8026276K9739545L0561850K9682976
55943C16341700K5839655J8126177P042878n335412j6412594k4421266k8952153
55936B92228985l0541585l0024228k8183120k5651733k2871013k0091790j7451555
55929A17413961j5042557j2911802j1053713r445036q072962o919034n945317
55922D8023540n116617m417415l834170l340960k915729k552993k248658j988027
55914B1608971j759115j562489j397915j254980j125928j014485r22993q43056
$$ y = [22272976, 24159623, 26318030, 28797357, 31658610, 34990957, 38904828, 43519542, 48976209, 55456292, 63172121, 72350734, 83245299, 96143884, 111332246, 129043192, 149437546, 172574295, 198331053, 226357329, 256096874, 286658724, 316341700, 342181355, 360307532, 367350410, 362014998, 345602404, 321181138, 292228985, 261687400, 231663172, 203480052, 177828319, 154957306, 134865516, 117413961, 102371404, 89459602, 78405889, 68960853, 60887891, 53968857, 48023540, 42906923, 38489508, 34655338, 31314378, 28398649, 25845656, 23596998, 21608971, 19849856, 18287367, 16889452, 15634472, 14508544, 13494059, 12571066, 11728010]
55906A1728010p67319o99057o41872n90655n40501m94740m56546m21755l86824
55897F728741l55260l29666l05686k80027k56583k38689k22857k05712j89867
55888D344394j77591j65761j52218j40192j31545j22444j10642j00304r4730r0623
55878C058344q4502p8806p6842p7371p8513q1401q5692q7142q3973q0235p8795
55867B165072p6630p1092o5198o2123n9837n5748n1721m9798m7690m3085l8121
55856A544029l5220l2599k8131k3647k1419k0175j8425j7816j9452k0776j9809
55845A286560j8575j8723j7899j4347j1042j1019j2294j1648r994r744j0178r742
55833A131355r942j2613j5930j7203j7326j8568k0297k0617k0138k0505k1140
$$ y = [11728010, 10960691, 10261634, 9619762, 9029107, 8488606, 7993866, 7537320, 7115565, 6728741, 6373481, 6043815, 5738129, 5458102, 5201519, 4962830, 4739973, 4534261, 4344394, 4166803, 4001042, 3848824, 3708632, 3577087, 3454643, 3344001, 3243697, 3148967, 3058344, 2973842, 2895036, 2818194, 2740823, 2662310, 2580909, 2495217, 2408075, 2324102, 2243867, 2165072, 2088442, 2017350, 1952152, 1890029, 1830192, 1774444, 1722723, 1672925, 1625235, 1582150, 1544029, 1508809, 1476210, 1448079, 1424432, 1403013, 1382838, 1364413, 1346597, 1327145, 1306369, 1286560, 1267985, 1249262, 1231363, 1217016, 1205974, 1194955, 1182661, 1171013, 1161019, 1151275, 1141097, 1131355, 1121413, 1108800, 1092870, 1075667, 1058341, 1039773, 1019476, 998859, 978721, 958216, 937076]
55822I37076k0737k0116k0493k0911k0223j9530j9904j9884j8052j5806j4777
55811G26643j3822j1426q783p605p087n842m640m412l823j730J64Pj025j092r75
55796F54552k106l445l384k759l017l411l030l461o253r491j0128q190n733l331
55782E86813n02K024L418M682O624P599O046L437J703l78m860j0333j3626j4597
55768E78050j5712j7625j8755j8680j8592j8538j7196j4473j1913j0487r987j0301
55756C95791j1300j1954j1400j0340r743r179q094p519q439r651r388p978o869
55743B73937o203n508n463o592p370o178m166l584m250m165k877j662r83k66K59
55728B14929j84j172j621j619j866k056j671j473k178k670j699l18l49j293j296
$$ y = [937076, 916339, 896223, 875730, 854819, 834596, 815066, 795162, 775278, 757226, 741420, 726643, 712821, 701395, 692612, 685007, 677920, 672078, 667438, 663026, 659203, 657473, 657637, 657644, 656619, 655527, 654552, 652446, 649001, 645617, 642858, 639841, 636430, 633400, 629939, 623686, 614195, 604067, 595877, 590144, 586813, 586311, 588335, 591753, 596435, 603059, 610658, 616704, 620141, 621844, 621466, 616606, 606273, 592647, 578050, 562338, 544713, 525958, 507278, 488686, 470148, 452952, 438479, 426566, 416079, 406092, 395791, 384491, 372537, 361137, 350797, 341054, 331875, 323781, 316262, 307823, 298172, 288784, 280806, 273937, 267734, 262226, 256763, 250171, 242801, 236623, 232457, 228873, 224623, 220458, 217581, 215919, 214936, 214670, 214929, 214745, 213573, 211952, 210333, 208467, 206411, 204740, 203267, 201089, 198419, 196720, 196402, 196053, 194760, 193464]
55713A93464j75R56K209M383O550O955N961N518O060O467O698P698Q954Q810P290
55698B77798O103N778N250M420M476N418N657M706M000M381M771M043K525R44
55684C40270o40k271l716n020o364p340p407p037p127p586p702p548p659p706
55670B55147o985n830m997m120k335J9J974L661N713P545Q270Q811J0866J3966
55656B91705J5844J5740J5089J4785J4006J2124R755P328M377Q32k471n097p297
55643C86720q812q824p435n776m350k661o65Q55J600K034K165J355n00k836n461
55628C47409q414j0967j2287j3028j4564j6657j7602j6823j5596j4871j4093j2684
55616A79823j1109r899q839p701o648n726m869m386m364l914k391j021j516l284
$$ y = [193464, 193289, 194245, 196454, 200837, 207387, 214342, 220303, 225821, 231881, 238348, 245046, 252744, 261698, 270508, 277798, 283901, 289679, 294929, 299349, 303825, 309243, 314900, 319606, 323606, 327987, 332758, 336801, 339326, 340270, 339630, 337359, 333643, 328623, 322259, 314919, 307512, 300475, 293348, 285762, 278060, 270512, 262853, 255147, 248162, 242332, 237335, 233215, 230880, 230899, 232873, 236534, 242247, 249792, 258062, 266873, 277739, 291705, 307549, 323289, 338378, 353163, 367169, 379293, 389048, 396376, 400753, 401585, 399114, 394017, 386720, 377908, 369084, 361649, 355873, 351523, 348862, 348197, 349052, 350652, 352686, 354851, 356206, 355706, 352870, 347409, 338995, 328028, 315741, 302713, 288149, 271492, 253890, 237067, 221471, 206600, 192507, 179823, 168714, 158815, 149976, 142275, 135627, 129901, 125032, 120646, 116282, 112368, 109977, 108956, 107440, 104156]
55602A04156m007l019k025k184k612k411k129k271k192j466q92j036j159n94P6
55587G6235J35l5J87N93P97J052J596K010J998K070K689L413L583L314L240L633
55571A06510M180M364L949L340L292L776L656K238O35L87J206J480P46P5L9n5
55555A39818o81j379j870k504l170l186k578k265k548k752k669k953l681l956
55541A03626l425k831k546j945q41j27k64m18N8N56M69L29P68J349J408J193J290
55524I8649J709K311L429N200O935P914Q345Q900R803J0828J1729J2264J2292
55511B00308J2046J1755J0909Q685N244J740j169l883o768r486j1711j3475j4575
55498A89620j4576j3820j3247j2932j1866r736p678o695o365n876n317n113n041
$$ y = [104156, 100149, 97130, 95105, 92921, 90309, 87898, 85769, 83498, 81306, 79840, 78948, 77912, 76753, 76159, 76235, 76370, 76335, 76522, 77115, 77912, 78964, 80560, 82570, 84568, 86638, 89327, 92740, 96323, 99637, 102877, 106510, 110690, 115054, 119003, 122343, 125635, 129411, 133067, 135305, 135940, 136327, 137533, 139013, 139759, 139834, 139873, 139818, 139137, 137758, 135888, 133384, 130214, 127028, 124450, 122185, 119637, 116885, 114216, 111263, 107582, 103626, 100201, 97370, 94824, 92879, 92038, 91911, 91647, 91229, 91287, 91843, 92312, 92641, 93409, 94758, 96166, 97359, 98649, 100358, 102669, 106098, 111298, 118233, 126147, 134492, 143392, 153195, 164023, 175752, 188016, 200308, 212354, 224109, 235018, 243703, 248947, 250687, 249518, 245635, 238867, 229381, 217670, 204195, 189620, 175044, 161224, 147977, 135045, 123179, 113443, 105765, 99070, 92705, 86829, 81512, 76399, 71358]
55485G1358m625l952l355k831k287j909j796j722j544j397j298j138j115j444
55471D0945j658j073k8L71j76q28r97r31q05m70k44p21j462j272j17O14K75p3
55453C1350M57J195J196O68J64m34j244j703j474j073q26k55P01J005O5j064j107
55436B7621l22K27K91L35M68N37O82R28Q31K67p1K87P53O11P6l16n35n96j15Q44
55416C2803J332P86p4n02r17j813k453j842l68P50J102J104Q69K27n23r08r77
55399B8596r70p24k21o7n83j035p50l11n56j071q65q2L03P9j22j35l43n91l09
55380B0243L31M76ol03K3M27M40L78O64J029R16K28n63r24o99k76k90r71j872
55361A9251k388k309j784j010k29L19O49Q73P66j9j095j411m61J083K294K841
$$ y = [71358, 66733, 62781, 59426, 56595, 54308, 52399, 50603, 48881, 47337, 45940, 44642, 43504, 42389, 40945, 39287, 38214, 38186, 38557, 38381, 37553, 36556, 35625, 34820, 34350, 34106, 33385, 31923, 30651, 30534, 31148, 31423, 31350, 31807, 33002, 34198, 34866, 35030, 34596, 33352, 31649, 30175, 29102, 28276, 28021, 28722, 29727, 29792, 28728, 27621, 27299, 27526, 27817, 28152, 28620, 29157, 29839, 30767, 31598, 31865, 31794, 32081, 32834, 33445, 33521, 33205, 32670, 32074, 31959, 32803, 34135, 34921, 34847, 34345, 33428, 31615, 29162, 27320, 26952, 27702, 28804, 29908, 30777, 31004, 30481, 29573, 28596, 27626, 26902, 26681, 26614, 26031, 24996, 24246, 23935, 23379, 22308, 21443, 21361, 21664, 21743, 21621, 21486, 21143, 20552, 20243, 20574, 21050, 21044, 20741, 20764, 21191, 21631, 22009, 22673, 23702, 24618, 24846, 24283, 23359, 22660, 22384, 22094, 21123, 19251, 16863, 14554, 12770, 11760, 11531, 11850, 12499, 13372, 14138, 14119, 13024, 11613, 11152, 12235, 14529, 17370]
55345A7370K661J663K75n17l08J56J42r0l6J28J32L27R32J301R43N66R92J620
55327B8257J230p1r52q37m69m66m25J13P14N97l34j375j775j405p46k47K01R00
55309B2910J567J504O79rR7O27Q55N69r8r60j509j068J59R34M73n47j020p67k44
55290B4152L58R36J049M60l64r64j476j956j853q99J92O72P07O55K46n90j021
55273B0304n12P6k13p83m98L50N92J70L7L50L84Q7K46R24J176N92q6k26j24k11
55253B2635l75l94l27k10K4J66j12o55r63r33q96r24p21j47O57J524K140J975
55235B2464R71K0LO20Q92N18k7m13o65o78l43RQ0J66N37O14k24j352j506n28M93
55214B1651P28L76o4l40k85O8K66Jl03j01L87O91R58J424J497O10m54m30N36J123
$$ y = [17370, 20031, 21694, 21969, 21452, 21144, 21300, 21442, 21352, 21316, 21444, 21576, 21903, 22835, 24136, 25079, 25645, 26637, 28257, 29487, 29416, 28464, 27627, 27158, 26692, 26267, 26380, 27094, 27691, 27357, 25982, 24207, 22802, 22056, 21809, 22010, 22910, 24477, 25981, 26660, 26651, 26748, 27375, 28230, 28799, 28701, 27741, 26232, 25164, 25323, 26257, 26730, 26183, 25163, 24396, 24152, 24510, 25446, 26495, 26955, 26591, 25627, 24151, 22195, 20342, 19443, 19635, 20307, 21014, 21669, 21915, 21325, 20304, 19792, 19868, 19655, 18872, 18374, 18724, 19316, 19486, 19523, 19873, 20257, 20344, 20590, 21514, 22690, 23282, 23196, 22970, 22846, 22635, 22260, 21866, 21539, 21329, 21353, 21519, 21407, 20752, 19789, 18856, 17960, 17036, 16315, 16168, 16825, 18349, 20489, 22464, 23435, 23455, 23458, 24078, 24970, 25488, 25461, 25048, 24383, 23705, 23362, 23371, 23451, 23617, 24154, 24768, 24544, 23192, 21686, 21158, 21651, 22379, 22755, 22691, 22351, 22066, 22134, 22400, 22401, 22098, 21997, 22384, 23075, 24033, 25457, 26954, 27564, 27110, 26680, 27216, 28339]
55194B8339Q18L01j5m30q42o74p5J02k41l18K3n6q48j459j144k17P29J448J583
55175B7024P75l77o78l4L67j6k90J99P02M58J0J56N83N69K80K28J17o24j574j621
55155B6254m92Q86J509J203M49j93m68n30p16j088j339j175o49l7L77M69M67P85
55137B5712J374J501O98m02q04m94k52l65l32J96J029J943K790L163K821K352
55121D0930K395K372J186q11j894j269p7L34p3p42j482k047j786o43L01R6q52
55104C5938j423j151l94K63L55j78o74l36O05J063O42J53J96K82j27o68q28p82
55086C2936p33k71P56J468R87k71j128j006j83Q50J536J365N38N2M49J002Q01
55069C9148J09k01q6k31p80j119q96m93l56m41m56k74mJ48J56K94P62J220J105
$$ y = [28339, 29157, 29458, 29443, 29013, 28171, 27497, 27422, 27524, 27283, 26965, 26988, 26932, 26084, 24625, 23481, 23264, 23993, 25441, 27024, 27799, 27422, 26744, 26710, 27077, 27061, 26771, 26970, 27672, 28130, 28140, 28296, 28879, 29448, 29728, 29956, 30073, 29449, 27875, 26254, 25762, 26648, 28157, 29360, 29809, 29616, 29148, 28618, 27902, 26814, 25475, 24300, 23651, 23614, 23991, 24460, 24927, 25712, 27086, 28587, 29285, 28883, 28079, 27585, 27333, 26968, 26636, 26832, 27861, 29804, 32594, 35757, 38578, 40930, 43325, 45697, 46883, 46072, 44178, 42909, 42832, 43166, 43093, 42351, 40869, 38822, 37036, 36393, 36694, 36790, 35938, 34515, 33364, 32970, 33233, 33588, 33410, 32736, 32400, 33005, 34068, 34710, 34863, 35059, 35341, 35214, 34546, 33718, 32936, 32203, 31932, 32688, 34156, 35143, 34872, 33744, 32738, 32555, 33405, 34941, 36306, 36844, 36896, 37345, 38347, 39148, 39257, 39056, 38970, 38739, 37959, 36840, 35944, 35451, 35095, 34654, 34198, 33924, 33920, 34068, 34224, 34518, 35280, 36500, 37605]
55050C7605M73RN7K67L45N01Q24R40O90M82N37N21K84L06P99J184J004P18Q05
55031D8351Q48L39k16J3Q16J265J142J052J216J110M00n47j179j310j000m38k4
55014E1838j45p24j273j383r90k19P08J419J530R27l7p62r02p50q66j175q82L11
54996D6625J425J375M52k79o78j318j855j135P20K024J822J050O92K94o27j184
54980D9403m96O07Q07M01O73J692K323K142J931K282K971L721M476M951M833M497
54964H7214M686N516O581P847R630J1720J3423J4393J4753J4489J3450J1789R619
54951B25110O528K225k531o556r539j1885j3524j3977j3512j3042j2756j1970
54939A24571j0471q960p863o716n154l571k348j279k72J27m31j288j415n55P53
$$ y = [37605, 38078, 38087, 38144, 38411, 38756, 39257, 40081, 41021, 41711, 42193, 42730, 43251, 43535, 43841, 44640, 45824, 46828, 47546, 48351, 49199, 49538, 49322, 49335, 50151, 51416, 52558, 53610, 54826, 55936, 56336, 55789, 54610, 53300, 52300, 51862, 51838, 51693, 50969, 49696, 48313, 47323, 47104, 47812, 49231, 50761, 51688, 51651, 50889, 49987, 49237, 48371, 47196, 46314, 46625, 48050, 49425, 49877, 49598, 48920, 47602, 45747, 44612, 45332, 47356, 49178, 50228, 50920, 51214, 50587, 49403, 48907, 49514, 50321, 50722, 51395, 53087, 55410, 57552, 59483, 61765, 64736, 68457, 72933, 77884, 82717, 87214, 91900, 97416, 103997, 111844, 121474, 133194, 146617, 161010, 175763, 190252, 203702, 215491, 225110, 231638, 233863, 231332, 224776, 215237, 203352, 189828, 175851, 162339, 149297, 136541, 124571, 114100, 105140, 97277, 90561, 85407, 81836, 79488, 78209, 77937, 78064, 77633, 76345, 74930, 74375, 75128]
54924G5128J931K714L106L419M146N422O759P626Q158Q945J0243J1607J2318J2007
54910A73529J0752Q752O049K616j318n281q768j1302j2487j2413j1868j1576j1154
54897A15531r671p297n544n330n724n381m391l730l482k795j440k30J90P9k4L7
54881F0798J06r0p11j356j137J44J245Q40o63j624j394q53p29o29j47K14j15q60
54863E3039j482j987k567k933k731k154j649j241p49l66m52q78j003l96O47J343
54847C4441J117J77o19o22j28m1p76j743k014j229J72J413J926J663J029M70K01
54830C5437L22Q74J609K005J815J379J111J035J156J790K922L671L191J963J295
54815F1575J656K305K672L080L888M775N425O219P659R470J0813J1242J1046J0838
$$ y = [75128, 77059, 79773, 82879, 86298, 90444, 95866, 102625, 110251, 118409, 127354, 137597, 149204, 161522, 173529, 184281, 193033, 199082, 201698, 200380, 195099, 186331, 175029, 162542, 150129, 138261, 126685, 115531, 105860, 98563, 93019, 87689, 81965, 76584, 72193, 68463, 64981, 62186, 60746, 60516, 60706, 60785, 60761, 60798, 60904, 60814, 60103, 58747, 57610, 57754, 58999, 59839, 59176, 57552, 56158, 55305, 54576, 53947, 53800, 54014, 53899, 53039, 51557, 49570, 47003, 44070, 41339, 39185, 37536, 36295, 35546, 35180, 34728, 33850, 32847, 32451, 33098, 34441, 35558, 35735, 35116, 34494, 34366, 34325, 33549, 31806, 29792, 28563, 28735, 30148, 32074, 33737, 34766, 35236, 35437, 35759, 36633, 38242, 40247, 42062, 43441, 44552, 45587, 46743, 48533, 51455, 55126, 58317, 60280, 61575, 63231, 65536, 68208, 71288, 75176, 79951, 85376, 91595, 99254, 108724, 119537, 130779, 141825, 152663]
54801A52663J0989J1360J1348J0338Q196N239J854j674n010p791r793j0866j0832
54788A66021r829q514p519o798n884m685l522k532j557n74M00J683L560N569O867
54773A32686P388P889Q753R505R796J0032J0687J1555J2125J2139J1495J0110
54761B54160Q318O791N625M021J393j557l521m121m287n238p477j0574j3558j5527
54747B14448j6175j5795j4818j3524j2186j1069j0138r053p688o322n185m146
54735H8349l125k451k465l021l570l627k955j635j71O98O35J6n01o30n39n04o83
54718F3821r95j167r57m54nJ82J73J27K23O70J459K090J977J199M33J06j6k73
54700F8593o34r25j117j123p42k0O24R24J063J246J375J307J159J077J052J158
$$ y = [152663, 163652, 175012, 186360, 196698, 204894, 210133, 211987, 210313, 205303, 197512, 187719, 176853, 166021, 156192, 147678, 140159, 133361, 127477, 122792, 119270, 116738, 115181, 114607, 115007, 116690, 120250, 125819, 132686, 140074, 147963, 156716, 166221, 176017, 186049, 196736, 208291, 220416, 232555, 244050, 254160, 262478, 269269, 274894, 278915, 280308, 278751, 275230, 271109, 266822, 261584, 254107, 243533, 229975, 214448, 198273, 182478, 167660, 154136, 141950, 130881, 120743, 111690, 104002, 97680, 92495, 88349, 85224, 82773, 80308, 77287, 73717, 70090, 67135, 65500, 65329, 66027, 66662, 66678, 66177, 65547, 65008, 64504, 63821, 62826, 61659, 60702, 60248, 60243, 60425, 60598, 60725, 60948, 61618, 63077, 65167, 67144, 68343, 68776, 68882, 68866, 68593, 67959, 67034, 65917, 64794, 64052, 64032, 64656, 65580, 66643, 67889, 69264, 70571, 71730, 72807, 73859, 75017]
54684G5017J550K034K067J517J028J222J883K350K396K291K224K234K534L387
54670A03734M534N261N127M537M406N358P222R312J1191J3113J5490J8012J9722
54657B27019K0122J9815J9700J9736J8917J6400J2275P248J874l703r350j4531
54645C35522j8413k0493k1003k0600j9750j8556j7083j5500j3905j2326j0898
54634A46995r739q656p285n642m218l364k907k534k286k302k391k153j521r33
54620I1064q17j052j072o29k61p09j780k251j297L57J152M27j113k448l163l301
54604G3107l011k527k001j224l4J044J138K51n62n13K0L07K80K40J30k04l69J15
54586F6187R05J105M59l05n15l41l41o65r59q95l96M58J497K327K416J517O3j052
$$ y = [75017, 76567, 78601, 80668, 82185, 83213, 84435, 86318, 88668, 91064, 93355, 95579, 97813, 100347, 103734, 108268, 113529, 118656, 123193, 127599, 132957, 140179, 149491, 160682, 173795, 189285, 207297, 227019, 247141, 266956, 286656, 306392, 325309, 341709, 353984, 361232, 363106, 359403, 350053, 335522, 317109, 296616, 275613, 255013, 235263, 216707, 199624, 184124, 170219, 157893, 146995, 137256, 128600, 121315, 115673, 111455, 108091, 105184, 102650, 100364, 98062, 95671, 93518, 91997, 91064, 90247, 89195, 88123, 87494, 87233, 86524, 84744, 82493, 81196, 81553, 82705, 83132, 82019, 79571, 76408, 73107, 70096, 67569, 65568, 64344, 64310, 65354, 66492, 66743, 66181, 65668, 65688, 65995, 66275, 66515, 66645, 66441, 66072, 66187, 67092, 68197, 68656, 68351, 67836, 67495, 67154, 66489, 65530, 64635, 64239, 64697, 66194, 68521, 70937, 72454, 72517, 71465]
54568G1465j206n61K10O08O97Q98J506K381L031L137K933K907L085L042K720K762
54552I9615L629M803N463N681O241P409Q527R000R031R145R362R094P710N085
54538A99795J803j281l828o187q587j0455j1057j0535r724r099q498p816p191
54525A07340o544n569m294l116k225j537j164j313j738j957j998k227k472k139
54511F9047j261n42j97K62R02J065N57J83M86Q56O02R3M8K65Jp54j172o74M91
54492G0258J605K074J754J001K70l57r75j295r10j39J47k46n81l89r6l2K17R21
54474G3227J476J288O94K73j13q18j469j419p10K6L76K83j40m31M9J147J755J203
54456G6697J87l82o55j089j181k53J058J382N13m84r72j266j476j103j40M84J57
$$ y = [71465, 70259, 69698, 69908, 70516, 71213, 72111, 73617, 75998, 79029, 82166, 85099, 88006, 91091, 94133, 96853, 99615, 103244, 108047, 113510, 119191, 125432, 132841, 141368, 150368, 159399, 168544, 177906, 187000, 194710, 199795, 201598, 200317, 196489, 190302, 181715, 171260, 160203, 149668, 139944, 130845, 122347, 114531, 107340, 100796, 95227, 90933, 87817, 85592, 84055, 82891, 81578, 79840, 77883, 75885, 73658, 71186, 69047, 67786, 67244, 67047, 67309, 68211, 69276, 69833, 70016, 70502, 71358, 71960, 72053, 72101, 72366, 72367, 71613, 70441, 69767, 70258, 71863, 73937, 75691, 76692, 76962, 76605, 75630, 74335, 73425, 73286, 73433, 73187, 72606, 72217, 72121, 72089, 72306, 73227, 74703, 75991, 76685, 76958, 76845, 76027, 74558, 73139, 72429, 72455, 72831, 73114, 72974, 72543, 72592, 73739, 75494, 76697, 76884, 76502, 75847, 74758, 73577, 73324, 74382, 75764, 76277, 75793, 74821, 73555, 72079, 70976, 70836, 71320, 71477]
54439G1477n00m79L26J102J145N20j26k27J18L37J76K9K47N18L27k73p85q93n61
54420G2478J85J045J410J076O48P48J143J352J598K345L201L234K302J231O00
54405I4596J71m25j060j404j294p50m1L19K3n97j001j087j080j031r08q54q34
54388H2743m13M86J041N18n79j177j087r55j017r49p47p47q47p30o84j191j786
54371G1879j499m94P6q1K3Q24J292O27l56l90M46J084J020P15P01J075J610J887
54353H0439J519O16j91m60l70k30L2N60J073J071L74p59j850k419k268j640r37
54336G4560k92K13K43m38j355j781j741j843k103j829q90k30n80j415j686j165
54320E7668m91k71o03j207j639j583j119n68MO89J215J089M34O7L99Q24O22l3
$$ y = [71477, 70977, 70498, 70824, 71926, 73071, 73591, 73465, 73238, 73356, 73693, 73869, 73898, 74145, 74663, 74990, 74717, 73932, 73039, 72478, 72663, 73708, 75118, 76194, 76842, 77590, 78733, 80085, 81683, 84028, 87229, 90463, 92765, 93996, 94596, 94767, 94342, 93282, 91878, 90584, 89834, 89793, 90112, 90135, 89538, 88537, 87450, 86370, 85339, 84431, 83577, 82743, 82330, 82816, 83857, 84375, 83796, 82619, 81532, 80577, 79560, 78611, 77864, 77117, 76270, 75540, 74856, 73665, 71879, 70380, 69886, 69962, 69881, 69904, 70728, 72020, 72647, 72291, 71901, 72347, 73431, 74451, 75166, 75867, 76942, 78552, 80439, 81958, 82574, 82383, 81923, 81553, 81323, 81355, 81915, 82988, 84059, 84433, 83674, 81824, 79405, 77137, 75497, 74560, 74268, 74481, 74724, 74286, 72931, 71150, 69409, 67566, 65463, 63634, 62744, 62514, 61934, 60519, 58833, 57668, 57177, 56906, 56303, 55096, 53457, 51874, 50755, 50187, 50191, 50880, 52095, 53184, 53618, 53685, 54084, 54908, 55530, 55497]
54302E5497l78r3L67L65k61r73r87j32P71Q35K45k2M09Q57O50q3q09j206j081
54283E3971l37O92J361J417J161Q19L58K8K90R62J219P54K44K23K54k20q21p07
54265F1668L39J773K853L001K100Q20J70L67O89O63O67R65J063O74M02P18R66
54248G9898L74o10j010r31j274k130k544j921p74K6M4o34j494j762j129k95j85
54231F3649o65p64j77L05L6n42n84PO06P37N11K98K23J25r9k39j7M54P23O23M76
54210F5686N40N84L49M2K4K98O29Q94R83O21j96q82q85m56l05o76j202j535j629
54191F2884j441r19l16p8k70n21n27l78l32n02q54j215j300r20k35L04L28j24
54173E3584n61l58N69J457J441O24o1j56k76j022j940k168j660j137r84q60l60
$$ y = [55497, 55119, 55026, 55393, 55758, 55497, 54524, 53537, 53405, 54176, 55011, 55256, 55234, 55643, 56500, 57150, 57067, 56258, 55052, 53971, 53634, 54326, 55687, 57104, 58265, 59084, 59442, 59470, 59760, 60722, 61941, 62695, 62939, 63162, 63416, 63196, 62375, 61668, 62007, 63780, 66633, 69634, 71734, 72554, 72724, 73091, 73780, 74443, 75110, 76075, 77138, 77812, 78214, 78932, 79898, 80272, 79662, 78652, 77721, 76447, 74317, 71773, 69852, 69078, 69104, 69148, 68514, 67020, 65258, 64129, 63834, 63649, 62984, 62220, 62043, 62348, 62384, 61842, 61258, 61265, 61871, 62608, 63119, 63417, 63640, 63765, 63666, 63427, 63410, 63864, 64587, 65210, 65686, 66226, 66810, 67159, 67201, 67225, 67523, 68152, 69046, 70029, 70650, 70454, 69572, 68687, 68231, 67926, 67250, 66048, 64513, 62884, 61443, 60524, 60208, 60130, 59860, 59339, 58812, 58434, 58102, 57600, 56746, 55531, 54231, 53311, 53076, 53380, 53708, 53584, 53023, 52665, 53234, 54691, 56132, 56756, 56695, 56539, 56263, 55241, 53301, 51133, 49473, 48336, 47352, 46492, 46132]
54156D6132M06R71R70M83N5J40M45K67m06p13k00M04K82k95n80n73p32r23o66
54137D5467j93j88o30q08n42l43l19J1O80J021P74N52P37Q56N10J63K90M54j8
54118D8474r04j354j025l14L15P01P84N90L77L87M99M79L82L60K40k85j002j266
54100D7438p60R7O89Q38P92Q05R23J036R74O31J58q7M4J72j55p48q66k18N18N93
54080E2874L11N81J447J866J219K87J88Q46J252R55M77L33L97M33N35P67Q76P92
54062F6436R59J702K500K460J437K33l77m19l28k08P7L48K05k14j73O52J521J545
54044G8356R38O89J170J785K103K465L122L575L363K943L122L858M385M268L749
54029A19891L138K527K109K165K597K867K576J850J053M52J91L14O34P85M49m20
$$ y = [46132, 46538, 47509, 48479, 48962, 49017, 49157, 49602, 49869, 49463, 48750, 48550, 48954, 49236, 48941, 48361, 47788, 47056, 46133, 45467, 45274, 45086, 44456, 43648, 43106, 42763, 42444, 42455, 43135, 44156, 44930, 45482, 46219, 47075, 47585, 47748, 48038, 48492, 48474, 47570, 46216, 45191, 44877, 45192, 45893, 46677, 47267, 47644, 48031, 48530, 49009, 49391, 49751, 49991, 49706, 48704, 47438, 46678, 46775, 47464, 48302, 49094, 49899, 50822, 51858, 52832, 53463, 53621, 53534, 53578, 53750, 53595, 52847, 51981, 51763, 52281, 52874, 53185, 53766, 55213, 57079, 58298, 58585, 58773, 59619, 60871, 61826, 62303, 62636, 63033, 63466, 64001, 64768, 65644, 66436, 67395, 69097, 71597, 74057, 75494, 75727, 75350, 74931, 74603, 74395, 74472, 74820, 75025, 74811, 74638, 75290, 76811, 78356, 79294, 79983, 81153, 82938, 85041, 87506, 90628, 94203, 97566, 100509, 103631, 107489, 111874, 116142, 119891, 123029, 125556, 127665, 129830, 132427, 135294, 137870, 139720, 140773, 141225, 141416, 141730, 142364, 143149, 143598, 143178]
54013A43178j564k480k769k545k360k536k831k938k914k913k824k613k536k654
53999A06701k494j837j357j741k452k335j302n13p14j331j505j255j100j145j133
53984H4487j023j065j380j766j872j467o79K1L21M41O13M78m02j432j289L06J926
53967G6218K130J160L97M43O84M67j7k44r9J37K60K75K64K81L62N43Q54J310J867
53948H7292K442L003L597M233M823N336N918O677P389P640P355O959O776O468
53934A65908N447L868K648K264K016J022m62j412j524j454j492j091j13M47j72
53919A75900j127r46M98J961K577K695K987L555M174M711N007M779L957K829J828
53904B15385J292J253J212M21j127k372k450k006k364l630m583m506m035l970
$$ y = [143178, 141614, 139134, 136365, 133820, 131460, 128924, 126093, 123155, 120241, 117328, 114504, 111891, 109355, 106701, 104207, 102370, 101013, 99272, 96820, 94485, 93183, 92670, 91956, 90625, 89120, 87865, 86765, 85620, 84487, 83464, 82399, 81019, 79253, 77381, 75914, 75235, 75256, 75577, 76018, 76631, 77109, 76707, 75275, 73986, 74292, 76218, 78348, 79508, 79905, 80348, 81032, 81499, 81482, 81238, 81139, 81276, 81536, 81811, 82075, 82356, 82718, 83261, 84115, 85425, 87292, 89734, 92737, 96334, 100567, 105390, 110726, 116644, 123321, 130710, 138350, 145705, 152664, 159440, 165908, 171355, 175223, 177871, 180135, 182151, 183173, 182711, 181299, 179775, 178321, 176829, 175738, 175625, 176072, 175900, 174773, 173827, 174325, 176286, 178863, 181558, 184545, 188100, 192274, 196985, 201992, 206771, 210728, 213557, 215385, 216677, 217930, 219142, 219563, 218436, 216064, 213614, 211608, 209244, 205614, 201031, 196525, 192490, 188520]
53890A88520m182m213m144m276m519m668m777m809m408l491k640k406k615k749
53876A34623k673k538k347k067j876j852j719j357j210j728k643l314l592l792
53862A01915l980l839l225k415j713j169o83k13J81L12Mo21j093j100q10n40k57
53845H0754J55M20J03o32j004n67K08M99J08m15n52l38o6K14N95Q53N92q1m69
53826H0377j81L01L48J11J63M86N13J21j69k3K88N10P93J203J472J532J748K243
53808I1836K554K365K081K180K443K368J988J724J758K050K660L458L827L305
53794A26597K372J893J901J642Q39J60K00O33P40L24k73o88p32l68J38K17m49
53777A35146j463k131k295k388k702l011l066l075l315l535l268k636k284k410
$$ y = [188520, 184338, 180125, 175981, 171705, 167186, 162518, 157741, 152932, 148524, 145033, 142393, 139987, 137372, 134623, 131950, 129412, 127065, 124998, 123122, 121270, 119551, 118194, 116984, 115256, 112613, 109299, 105707, 101915, 97935, 94096, 90871, 88456, 86743, 85574, 84891, 84678, 84859, 85171, 85175, 84554, 83461, 82361, 81551, 81011, 80754, 80909, 81329, 81432, 80800, 79796, 79229, 79437, 79936, 80044, 79629, 79077, 78739, 78673, 78887, 79482, 80335, 80927, 80846, 80377, 80196, 80497, 80845, 80956, 81119, 81605, 82118, 82239, 82070, 82047, 82335, 82845, 83638, 84841, 86313, 87845, 89593, 91836, 94390, 96755, 98836, 101016, 103459, 105827, 107815, 109539, 111297, 113347, 116007, 119465, 123292, 126597, 128969, 130862, 132763, 134405, 135244, 135404, 135604, 136237, 136977, 137301, 137028, 136340, 135608, 135240, 135378, 135595, 135146, 133683, 131552, 129257, 126869, 124167, 121156, 118090, 115015, 111700, 108165, 104897, 102261, 99977, 97567]
53763I7567k455k024j559j588j749j250j27O88N86r4o97r79r60o54k10L0p6l26
53745H4123n61q23j021q34k53J71l6o46j054r87o44l01n3J43L53N26M98K11q9
53726G8723j58j46l60p17q38o48m05j35K78N02k2j056j528q89J64P31P41N16M7
53707G4800o77j120q16j74N3j60j57M59J494K521L115K969K300J876K100K378
53691I0961J951J078O42Q52J089R91Q42Q62Q44P04P54J159J530J409Q51L43L46
53674A07208R67J820K182J582L99l58lJ174K175K198J341M35R8R6j64n67l84N04
53656A20703J141P39k44p77n08J57Q12J195J038M13o3J1J81n3k91N3N00O5j132
53637A23940j926j780j281q84l18M24O31qp55q33m02P6O42J423J991J915J470
$$ y = [97567, 95112, 93088, 91529, 89941, 88192, 86942, 86815, 87503, 88089, 87995, 87298, 86319, 85359, 84705, 84495, 84525, 84449, 84123, 83562, 82739, 81718, 80884, 80631, 80802, 80766, 80120, 79066, 78079, 77435, 77134, 77081, 77224, 77577, 78103, 78601, 78812, 78723, 78565, 78419, 78059, 77342, 76504, 75856, 75451, 75316, 75594, 76096, 76074, 75018, 73490, 72601, 72765, 73496, 74237, 74753, 74800, 74123, 73003, 72187, 72013, 72066, 71906, 71749, 72208, 73702, 76223, 79338, 82307, 84607, 86483, 88583, 90961, 92912, 93990, 94632, 95484, 96573, 97564, 98406, 99268, 100112, 100816, 101570, 102729, 104259, 105668, 106519, 106862, 107208, 108175, 109995, 112177, 113759, 114158, 113800, 113797, 114971, 117146, 119344, 120685, 121120, 121218, 121314, 121150, 120583, 120199, 120703, 121844, 122583, 122339, 121562, 121054, 121211, 122023, 123218, 124256, 124669, 124606, 124617, 124798, 124745, 124454, 124507, 125007, 125072, 123940, 122014, 120234, 118953, 118069, 117751, 118175, 118806, 118798, 118043, 117210, 116808, 116884, 117526, 118949, 120940, 122855, 124325]
53620A24325J205J132R83Q24Q67R56Q38O88P50P37K94j77R9J070J793J723J388
53603A39495J520K000K192J898J541J413J302R99Q35J333K429L363L517L120K860
53588A69817K971L088K926K682K548K281J592P10J78J34K52L76P92J618K268K005
53572A96238Q94k27p98j089j458j522p31M93R64K53p05q67m08j98m57o52n38m82
53554A88710o53o02m3M48M5j160k040j652l23O89O15k2j36N86J466J820J615J115
53536A90478M62r2o8O00J232J217Q14O17N42J03n41o58l5P27J144J421J875K458
53518B02296L092L847M529M646M202L982M589N631O402O958P787Q696Q833P970
53504B83460P073P167Q101Q898R043Q912R011R446J0214J1454J2975J4002J4021
$$ y = [124325, 125530, 126662, 127645, 128469, 129336, 130292, 131130, 131818, 132568, 133305, 133599, 133422, 133521, 134591, 136384, 138107, 139495, 141015, 143015, 145207, 147105, 148646, 150059, 151361, 152360, 153195, 154528, 156957, 160320, 163837, 166957, 169817, 172788, 175876, 178802, 181484, 184032, 186313, 187905, 188615, 188793, 188927, 189179, 189555, 190347, 191965, 194233, 196238, 197132, 196905, 196107, 195018, 193560, 192038, 191307, 191800, 192764, 193017, 192312, 191445, 191037, 190839, 190382, 189730, 189192, 188710, 188057, 187455, 187412, 187860, 187905, 186745, 184705, 183053, 182730, 183419, 184034, 184012, 183876, 184462, 185928, 187748, 189363, 190478, 190940, 190848, 190780, 191380, 192612, 193829, 194643, 195260, 195802, 195905, 195364, 194706, 194671, 195398, 196542, 197963, 199838, 202296, 205388, 209235, 213764, 218410, 222612, 226594, 231183, 236814, 243216, 250174, 257961, 266657, 275490, 283460, 290533, 297700, 305801, 314699, 323742, 332654, 341665, 351111, 361325, 372779, 385754, 399756, 413777]
53491D13777J3571J3580J4025J4033J3377J2973J3602J4884J5911J6327J6218
53480E72278J5652J4874J4511J4896J5582J6077J6616J7514J8254J7989J6733
53469G50976J5236J4006J3099J2625J2546J2261J1281J0184R976J0619J1149J1093
53457H95051J0847J0585R938Q797P535O199M435K383O90n85k088l952n500o494
53443I37841p579r034j0116j0256r995j0076j0453j0911j1715j2841j3432j2903
53431H08530j1977j1717j2067j2256j2144j2151j2225j1958j1456j1188j0967
53420F78424r980p935n510l530k248j487j031o94l34J19P18J514K397L153L817
53405F57393M619N524O184O536P003P850Q877R938J1191J2511J3365J3630J3886
$$ y = [413777, 427348, 440928, 454953, 468986, 482363, 495336, 508938, 523822, 539733, 556060, 572278, 587930, 602804, 617315, 632211, 647793, 663870, 680486, 698000, 716254, 734243, 750976, 766212, 780218, 793317, 805942, 818488, 830749, 842030, 852214, 862190, 872809, 883958, 895051, 905898, 916483, 926421, 935218, 942753, 948952, 953387, 955770, 956460, 955875, 953787, 949835, 944335, 937841, 930262, 921228, 911112, 900856, 890861, 880785, 870332, 859421, 847706, 834865, 821433, 808530, 796553, 784836, 772769, 760513, 748369, 736218, 723993, 712035, 700579, 689391, 678424, 668444, 660509, 654999, 651469, 649221, 647734, 646703, 646009, 645675, 645794, 646512, 648026, 650423, 653576, 657393, 662012, 667536, 673720, 680256, 687259, 695109, 703986, 713924, 725115, 737626, 750991, 764621, 778507]
53392G78507J4457J4902J5015J5560J7235J9581K1680K3349K4798K5760K6029
53381I96873K6290K7327K8736K9557K9887L0734L2365L3993L5045L5688L5969
53370A342464L5572L4615L3708L2999L1993L0494K8869K7217K5292K3431K2539
53359A669193K2654K2479K0990J8640J6397J4327J1926R227O668M129R54l185
53347A814399p981j3035j8135k2920k6728k9105l0221l0709l1093l1466l1701
53336A541305l1812l1933l1934l1443l0334k8948k7554k6083k4674k4013k4510
53325A228067k5484k5900k5664k5423k5283k4674k3454k2137k0829j8920j6321
53314I73978j4077j3058j2659j1477r039o266m494m381n514o829p580q052q955
$$ y = [778507, 792964, 807866, 822881, 838441, 855676, 875257, 896937, 920286, 945084, 970844, 996873, 1023163, 1050490, 1079226, 1108783, 1138670, 1169404, 1201769, 1235762, 1270807, 1306495, 1342464, 1378036, 1412651, 1446359, 1479358, 1511351, 1541845, 1570714, 1597931, 1623223, 1646654, 1669193, 1691847, 1714326, 1735316, 1753956, 1770353, 1784680, 1796606, 1805833, 1812501, 1816630, 1817584, 1814399, 1806418, 1793383, 1775248, 1752328, 1725600, 1696495, 1666274, 1635565, 1604472, 1573006, 1541305, 1509493, 1477560, 1445626, 1414183, 1383849, 1354901, 1327347, 1301264, 1276590, 1252577, 1228067, 1202583, 1176683, 1151019, 1125596, 1100313, 1075639, 1052185, 1030048, 1009219, 990299, 973978, 959901, 946843, 934184, 922707, 913668, 907402, 902908, 898527, 893013, 886184, 878604, 870552, 861597]
53301H61597j0119j0485r633q517q129q101p400n931m563l812l376k943k643k506
53287G73439k143j264j43Q04J589K599M015N588O892P769Q463R329J0466J1670
53273H39073J2747J3677J4436J4851J4700J3941J2757J1529J0712J0437J0280
53262I79140R665Q640P863P668P535O719N105L142J245l96j683k780m224o376
53248A021263q782j0568j1559j2579j4400j6709j8452j9065j9030j9167j9652
53237H51300j9935j9543j8579j7404j6115j4714j3535j3036j3124j3207j3007
53226F79101j2956j3454j4154j4389j4081j3759j3711j3598j2947j1749j0386
53215E33917r187q245p544p067o713o234n384m193l086k598k974l970n034n713
$$ y = [861597, 851478, 840993, 831360, 822843, 814714, 806613, 799213, 793282, 788719, 784907, 781531, 778588, 775945, 773439, 771296, 770032, 769889, 770693, 772282, 774881, 778896, 784484, 791376, 799145, 807608, 816937, 827403, 839073, 851820, 865497, 879933, 894784, 909484, 923425, 936182, 947711, 958423, 968860, 979140, 988805, 997445, 1005308, 1012976, 1020511, 1027230, 1032335, 1035477, 1036722, 1036326, 1034643, 1031863, 1027639, 1021263, 1012481, 1001913, 990354, 977775, 963375, 946666, 928214, 909149, 890119, 870952, 851300, 831365, 811822, 793243, 775839, 759724, 745010, 731475, 718439, 705315, 692108, 679101, 666145, 652691, 638537, 624148, 610067, 596308, 582597, 568999, 556052, 544303, 533917, 524730, 516485, 508941, 501874, 495161, 488927, 483543, 479350, 476264, 473666, 470692, 466722, 461688, 455975]
53201D55975o015o454p527r077j0267j0464j0011r807j0272j0965j1142j0386
53189C43588q795o978n919o242p442q239p936p109o713o915p168p114o902o767
53175B43349o714o628o446o127n660n135m722m491m391m274l979l464k896k507
53161A75915k370k450k761l242l509l188k531k229k434k453j730o68r6j79m37
53146A45638o45j058j766k332k295j755j179q07m21K15Q21P41j88j122j031q0
53130A32736M31k77j388j642j015n96r57j489j365n40M28R89Q76J95m86n67k05
53113A25128k09r07j504j082O6P00J59q91j365r75l22n1k83p40j086j102p93m33
53095A14310l61n72p00m93k17l09p76j114q64k5J020J727J611O32n38j068r08
$$ y = [455975, 449960, 443506, 435979, 426902, 416635, 406171, 396160, 386353, 376081, 365116, 353974, 343588, 334793, 327815, 321896, 315654, 308212, 299973, 292037, 284928, 278215, 271300, 264132, 257018, 250116, 243349, 236635, 230007, 223561, 217434, 211774, 206639, 201917, 197426, 193035, 188761, 184782, 181318, 178422, 175915, 173545, 171095, 168334, 165092, 161583, 158395, 155864, 153635, 151201, 148748, 147018, 146350, 146254, 146075, 145638, 144993, 143935, 142169, 139837, 137542, 135787, 134608, 133801, 133380, 133595, 134416, 135157, 134969, 133847, 132816, 132736, 133167, 132890, 131502, 129860, 128845, 128249, 127292, 125803, 124438, 123898, 124326, 125315, 126191, 126386, 125900, 125333, 125128, 124919, 124012, 122508, 121426, 121492, 122192, 122351, 121460, 120095, 119120, 118798, 118747, 118464, 117724, 116638, 115536, 114743, 114310, 113949, 113377, 112677, 112184, 111967, 111658, 110882, 109768, 108904, 108879, 109899, 111626, 113237, 113869, 113331, 112263, 111355]
53078A11355q61j428j990j568j41J275J760J337O56K67L31O72R82J019P67M01
53062A14834J22J85P80J703K312K101J302N46M2n04j196j643j560j229j061j018
53046A15716p60k92k1k13o15o88j24Q60J683J856J383P17K61J8k30m61l18M30
53028A19202J460K089J944J302O91L07k2l93o95q76r76q01%J251K067J800R10
53011A29260L92M43L96j15n85m70L2M44P40J126J424J244P18M99R53J715K118
52994A40334J831J004P1m55k22O91J787K497K515J876Q80Kl18n3L87O20P50J156
52976A55353J793K059J491N24Q4N00J119J251J141J500K330K708J988O72j83j95
52960A74135J65L78M20M37L42km63q01r87j128j088n95K51Q39P20J91r0PM1j62
$$ y = [111355, 110494, 109066, 107076, 105508, 105367, 106642, 108402, 109739, 110395, 110662, 110993, 111665, 112647, 113666, 114433, 114834, 114956, 115141, 115921, 117624, 119936, 122037, 123339, 123885, 123927, 123423, 122227, 120584, 119024, 117795, 116734, 115716, 114956, 114664, 114643, 114430, 113815, 113127, 113003, 113863, 115546, 117402, 118785, 119502, 119763, 119781, 119551, 119090, 118772, 119202, 120662, 122751, 124695, 125997, 126688, 126995, 126973, 126580, 125885, 125009, 124033, 123232, 123232, 124483, 126550, 128350, 129260, 129652, 130095, 130491, 130376, 129791, 129321, 129353, 129797, 130537, 131663, 133087, 134331, 135049, 135548, 136501, 138216, 140334, 142165, 143169, 143240, 142785, 142563, 143254, 145041, 147538, 150053, 151929, 152809, 152811, 152493, 152440, 152827, 153447, 154197, 155353, 157146, 159205, 160696, 161220, 161304, 161804, 162923, 164174, 165315, 166815, 169145, 171853, 173841, 174513, 174330, 174135, 174300, 174678, 175098, 175535, 175877, 175875, 175412, 174611, 173624, 172496, 171408, 170813, 171064, 171903, 172623, 172814, 172724, 172731, 172772, 172610]
52940A72610j28M44R97Q12J47LO95J402J377R30P57Q15N46j16o02n57j80K37O09
52921A80798Q29P12L08j07l94n17j79R14K260K696J708J53p89r15q49j014j349
52904A84265j760k215k456k199j576r57m75j11o0m74r76j101j092j524k184k168
52888A62937j279m28l21n56n48n05p93j015n63K60N54R0m61n11l6P77J697K301
52870A61600K287J975J891J864J214j36j413k054k362k807l292l424l130k567
52856A49646j881j315j187j415j417q75k98l73j049j680j870j744j445r00j27
52841A32070N44P20K60o48j627k292k488k352k118j913j763j646j462j110o65
52826A13510l59k89l33m22o87j154j521j421q20j9O07P90N16J44J67O71J216J384
$$ y = [172610, 172482, 172926, 173923, 174735, 174882, 174885, 175580, 176982, 178359, 179289, 180046, 180861, 181407, 181291, 180689, 180132, 179952, 180189, 180798, 181627, 182339, 182647, 182540, 182146, 181629, 181450, 182364, 184624, 187320, 189028, 189181, 188392, 187477, 186628, 185614, 184265, 182505, 180290, 177834, 175635, 174059, 173102, 172627, 172516, 172456, 171982, 171006, 169905, 168813, 167289, 165105, 162937, 161658, 161230, 160909, 160353, 159805, 159300, 158507, 157492, 156929, 157189, 157743, 157833, 157372, 156861, 156825, 157602, 159299, 161600, 163887, 165862, 167753, 169617, 170831, 170695, 169282, 167228, 164866, 162059, 158767, 155343, 152213, 149646, 147765, 146450, 145263, 143848, 142431, 141556, 141258, 140885, 139836, 138156, 136286, 134542, 133097, 132197, 132070, 132614, 133334, 133594, 132946, 131319, 129027, 126539, 124187, 122069, 120156, 118393, 116747, 115285, 114175, 113510, 113151, 112862, 112529, 112107, 111420, 110266, 108745, 107324, 106504, 106485, 107092, 107882, 108398, 108542, 108709, 109380, 110596, 111980]
52808A11980J213R21N72K22J30M37Q29R04P10N94O45O82O72P60R01Q56N85L13
52790A23926K33L42N60P07M97r1n95n76k83l05n92m32M11J165R82j0j036j643
52772A23260j853j693j157n87m83p84q55l46K83L85l2m49o03p12r06r58p31n10
52754A11269n78o80l27M62J130J246R32M94J17k4K61Q61J280J182P73L90k1o10
52736A18157j068q62k0P92J047Q29M66R4k22k69P1N63Q51R28J126J602K063K103
52718A28251J770J618K055K753K919K206J080J78l29n75n32j54J89K5m72n61N4
52701A40475P73R80R41J365K267K755K075N68o28o65K77J324J713J322N70J3N0
52684A56175P13J527J753R84l94j559j981j760j298r15p58q26r44q98o91n97q77
$$ y = [111980, 113193, 114114, 114686, 114908, 115038, 115475, 116304, 117208, 117918, 118512, 119157, 119839, 120511, 121271, 122172, 123028, 123613, 123926, 124159, 124501, 125061, 125768, 126265, 126174, 125579, 125003, 124720, 124415, 123823, 123391, 123802, 124967, 125949, 125939, 124903, 123260, 121407, 119714, 118557, 117970, 117487, 116703, 115848, 115502, 115785, 116170, 116138, 115689, 115086, 114374, 113468, 112510, 111779, 111269, 110691, 110011, 109684, 110146, 111276, 112522, 113454, 113948, 114065, 114041, 114302, 115163, 116443, 117625, 118398, 118788, 118767, 118157, 117089, 116227, 116207, 116999, 118046, 118875, 119341, 119435, 119213, 118944, 119015, 119578, 120429, 121357, 122483, 124085, 126148, 128251, 130021, 131639, 133694, 136447, 139366, 141572, 142652, 142830, 142501, 141926, 141394, 141240, 141429, 141454, 140982, 140421, 140475, 141248, 142228, 143169, 144534, 146801, 149556, 151631, 152199, 151571, 150906, 151183, 152507, 154220, 155542, 156112, 156125, 156175, 156888, 158415, 160168, 161152, 160758, 159199, 157218, 155458, 154160, 153245, 152487, 151661, 150717, 149819, 149128, 148531, 147654]
52667A47654j464j989k075j655j109j001j490j987j699n58O08R73N97K76O39J639
52651A37359K765L536L766L670L799M599N733O019M466J459j388k782k858k560
52637A67583k321j912j329j046j205j313j071r64j444k040j913j061l11k54p10
52622A48689j226j547j572j346j122j094j045o65j21J77L17P04J234J240N49k02
52606A42970n32p69j264j571j079m1P30R54J035J238J336J160R79J093J393J519
52590A49151J213N03l08p95o96k25R1j04o99j273j477j235p47k98l8R2K52N13
52572A43920P65P60K86n59j319j551j241q06o22p17q85q62n02R0M95L85p9m50
52554A37108n93p41r76j054q63o00l75k0M52O78N14L24L18M8r24k159k707k215
$$ y = [147654, 146190, 144201, 142126, 140471, 139362, 138361, 136871, 134884, 133185, 132627, 133235, 134208, 134805, 135081, 135720, 137359, 140124, 143660, 147426, 151096, 154895, 159494, 165227, 171246, 175712, 177171, 175783, 173001, 170143, 167583, 165262, 163350, 162021, 160975, 159770, 158457, 157386, 156422, 154978, 152938, 151025, 149964, 149653, 149399, 148689, 147463, 145916, 144344, 142998, 141876, 140782, 139737, 139072, 138951, 139128, 139445, 140149, 141383, 142623, 143172, 142970, 142438, 141669, 140405, 138834, 137755, 137714, 138444, 139398, 140433, 141671, 143007, 144167, 145146, 146239, 147632, 149151, 150364, 150867, 150559, 149764, 149068, 148843, 148934, 148830, 148131, 146858, 145381, 144146, 143399, 143101, 143063, 143155, 143407, 143920, 144685, 145445, 145731, 145172, 143853, 142302, 141061, 140255, 139633, 138916, 138031, 137169, 136667, 136757, 137252, 137637, 137558, 137108, 136515, 135774, 134798, 133744, 132881, 132281, 131906, 131886, 132338, 133016, 133530, 133854, 134172, 134220, 133296, 131137, 128430, 126215]
52536A26215j183k51K87L67L7m34q01j153j665k059j836j014k05J29J48K06L23
52519A17111L13J09k30o30r28q96n47k21k45n77r19j025q64n83l70k41P6P94J603
52500A11730J786R77l11j100q22J95J020Q98p8r96r70o7P89Q39K33l49n13m24
52482A12837l81m76o29p52p95o96l99Q4O09R40R09O03L02K48M19N90N39K29j80
52463A14001n38q78j310j667j511o90K52N82K78L7L28P33N62k36j074j511j625
52446A05733j645j553j182n11L47J238J876J875J135J67l07j56Rl53r38r91l00
52429A04444N21Q35O61M31L38K58R7j30m84j006j461j485j062n94l13L5O79J253
52411A03017J087J13r21j206p09k6L78N02M25K9o63j139q22J59J030J306J318
$$ y = [126215, 125032, 124781, 125068, 125435, 125472, 125038, 124237, 123084, 121419, 119360, 117524, 116510, 116305, 116434, 116582, 116788, 117111, 117424, 117533, 117303, 116673, 115745, 114849, 114302, 114081, 113836, 113259, 112340, 111315, 110451, 109868, 109498, 109257, 109333, 110127, 111730, 113516, 114493, 114182, 113082, 112260, 112455, 113475, 114373, 114295, 113299, 112329, 112262, 113051, 113890, 114123, 113774, 113261, 112837, 112456, 111980, 111351, 110599, 109804, 109108, 108709, 108793, 109402, 110342, 111251, 111854, 112156, 112404, 112823, 113413, 113952, 114181, 114001, 113463, 112585, 111275, 109608, 108097, 107407, 107659, 108241, 108519, 108556, 108884, 109617, 110179, 109943, 108869, 107358, 105733, 104088, 102535, 101353, 100842, 101189, 102427, 104303, 106178, 107313, 107480, 107173, 107017, 107026, 106673, 105735, 104744, 104444, 104965, 105800, 106461, 106892, 107230, 107488, 107585, 107455, 106971, 105965, 104504, 103019, 101957, 101363, 101050, 101085, 101764, 103017, 104104, 104217, 103296, 102090, 101381, 101355, 101733, 102235, 102660, 102689, 102026, 100887, 100065, 100224, 101254, 102560, 103878]
52394A03878J527J717J292L54j60L70J346J628R50J65O0L85M03M8m5L85P26L44
52376A15373n03j025r11n07j12L00P34J054J319J666J817J275K78j40N95J737
52360A22950K249K130K028J953J309J59n09o0Q77J278R89O65P53J005R71O61N58
52343A39966J025J824K311K130J515Q88M09J36K39P43J273J549J832K442L022
52328A61304L011K638K698L329L820L771L554L341K592J194K46Q68K595L856L890
52313B02707L387L306L765M294M635M912N283N678N927O022O204O709P437Q179
52299B78445R016J0133J1219J1612J1178J0579J0312J0166R985J0331J1623J3119
52287D07718J3652J3156J2625J2669J2953J3060J3130J3443J3970J4529J4853
$$ y = [103878, 105405, 107122, 108414, 108768, 108608, 108978, 110324, 111952, 112902, 113067, 113127, 113512, 113915, 113963, 113918, 114303, 115029, 115373, 114870, 113845, 112934, 112427, 112315, 112615, 113349, 114403, 115722, 117388, 119205, 120480, 120758, 120618, 121213, 122950, 125199, 127329, 129357, 131310, 132619, 132778, 132269, 132209, 133086, 134364, 135353, 136018, 136771, 137776, 138747, 139408, 139966, 140991, 142815, 145126, 147256, 148771, 149659, 150068, 150204, 150443, 151186, 152459, 154008, 155840, 158282, 161304, 164315, 166953, 169651, 172980, 176800, 180571, 184125, 187466, 190058, 191252, 191498, 192366, 194961, 198817, 202707, 206094, 209400, 213165, 217459, 222094, 227006, 232289, 237967, 243894, 249916, 256120, 262829, 270266, 278445, 287461, 297594, 308813, 320425, 331603, 342182, 352494, 362660, 372645, 382976, 394599, 407718, 421370, 434526, 447151, 459820, 472773, 485833, 498963, 512406, 526376, 540905, 555758]
52276E55758J4464J3094J1275R914R211Q546P596O770O335N899N139M324L720
52263F62045L064K142J261O28j65j367k338k350j771j548j775j638p55K84Q64
52248F56581J077J229J273J175J391K467M259N978O976P344P717Q600R920J1162
52234G27149J1868J1974J1723J1467J1504J1846J2036J1562J0574R885R938J0178
52222H61704R736Q410O600M568K387L18j408l057n003o901p954q094q176q890
52208H44240j0001j0930j1480j1715j1692j1659j1956j2392j2211j1111r861r351
52196G09881r440r314q657p889p371o984o520n990n461m938m430l909l309k808
52182F22861k890l737m696m874m221l473l102k816k292j842j943k547l147l404
$$ y = [555758, 570222, 583316, 594591, 604505, 613716, 622262, 629858, 636628, 642963, 648862, 654001, 658325, 662045, 665109, 667251, 668512, 669140, 668975, 667608, 665270, 662920, 661149, 659601, 657826, 656188, 655433, 655717, 656581, 657658, 658887, 660160, 661335, 662726, 665193, 669452, 675430, 682406, 689750, 697467, 706067, 715987, 727149, 739017, 750991, 762714, 774181, 785685, 797531, 809567, 821129, 831703, 841588, 851526, 861704, 871440, 879850, 886450, 891018, 893405, 893723, 892315, 889258, 884255, 877354, 869400, 861306, 853130, 844240, 834239, 823309, 811829, 800114, 788422, 776763, 764807, 752415, 740204, 729093, 719232, 709881, 700441, 691127, 682470, 674581, 667210, 660226, 653706, 647716, 642255, 637317, 632887, 628978, 625669, 622861, 619971, 616234, 611538, 606664, 602443, 598970, 595868, 593052, 590760, 588918, 586975, 584428, 581281, 577877]
52168E77877l333l058k658k258j993j870j801j715j598j419j163q90p04o20n40
52153E52257m06l96q12j698k637l121l176l305l766m083l611k337q71K04O40L34
52137E23216o83j959k767k774k384k195k326k350j872r91k53j98p94j391j365
52122D98914q31m98p43j165j185p97m54l73l13k6M30R28J558K423L304L839M126
52105E09137M830O391Q327R667J0095J0307J1042J2222J3298J4150J5124J6319
52093F40909J7360J7949J8187J8256J8134J7810J7549J7559J7636J7331J6515
52082H35195J5603J5065J4831J4310J3096J1468R963Q604P026N300M020L330K479
52069I60290Q67j066k572l718m984o187o808p181q175r618j0236r468q345p946
$$ y = [577877, 574544, 571486, 568828, 566570, 564577, 562707, 560906, 559191, 557593, 556174, 555011, 554121, 553417, 552797, 552257, 551851, 551455, 550643, 548945, 546308, 543187, 540011, 536706, 532940, 528857, 525246, 522909, 522038, 522242, 522882, 523216, 522533, 520574, 517807, 515033, 512649, 510454, 508128, 505778, 503906, 502915, 502662, 502464, 501670, 500279, 498914, 498083, 497585, 496842, 495677, 494492, 493695, 493241, 492868, 492555, 492529, 492959, 493887, 495445, 497868, 501172, 505011, 509137, 513967, 520358, 528685, 538352, 548447, 558754, 569796, 582018, 595316, 609466, 624590, 640909, 658269, 676218, 694405, 712661, 730795, 748605, 766154, 783713, 801349, 818680, 835195, 850798, 865863, 880694, 895004, 908100, 919568, 929531, 938135, 945161, 950461, 954481, 957811, 960290, 961157, 960091, 957519, 953801, 948817, 942630, 935822, 928641, 920466, 910848, 900612, 891144, 882799, 874853]
52055H74853p972p530o610n932n831o000o056n672m536k783j217m74k50J80R55
52040H15125J723K364L001L523L770M002M622N527O303O882P388P619P291O603
52026H85743N927N106L803K372J598J516J345N89m76j549k697l868m742n370o260
52011H83037p632r185j0801j2705j4662j5879j6147j6380j7352j8577j9131j9066
$$ y = [874853, 866881, 859351, 852741, 846809, 840978, 834978, 828922, 823250, 818714, 815931, 814714, 814240, 813990, 814170, 815125, 816848, 819212, 822213, 825736, 829506, 833508, 838130, 843657, 849960, 856842, 864230, 871849, 879140, 885743, 891670, 896776, 900579, 902951, 904549, 906065, 907410, 907999, 907523, 905974, 903277, 899409, 894667, 889297, 883037, 875405, 866220, 855419, 842714, 828052, 812173, 796026, 779646, 762294, 743717, 724586, 705520]
$$ [...]
##END NTUPLES=NMR SPECTRUM
##END=
